##TITLE=Analysis number 321811
Compound Code mo 07878
Project Code adrs
Chemist Name fudan
##JCAMPDX= 6.0         $$ Bruker NMR JCAMP-DX V2.0
##DATA TYPE= NMR SPECTRUM
##DATA CLASS= NTUPLES
##ORIGIN= Bruker BioSpin GmbH
##OWNER= nmr
$$ XWIN-NMR		Version 3.5
$$ Tue Aug 29 14:33:11 2006 GMT Daylight Time (UT+1h)  MAYBRIDGE\nmr@NMR_250MHZ
##.OBSERVE FREQUENCY= 250.131544655141
##.OBSERVE NUCLEUS= ^1H
##.ACQUISITION MODE= SIMULTANEOUS (DQD)
##.ACQUISITION SCHEME= undefined
##.AVERAGES= 16
##.DIGITISER RES= 18
##SPECTROMETER/DATA SYSTEM= dpx250
##.PULSE SEQUENCE= zg30
##.SOLVENT NAME= DMSO
##.SHIFT REFERENCE= (INTERNAL, DMSO, 0, 16.522)
##AUDIT TRAIL= $$ (NUMBER, WHEN, WHO, WHERE, WHAT)
$$ ##TITLE= Audit trail, XWIN-NMR		Version 3.5
$$ ##JCAMPDX= 5.01
$$ ##ORIGIN= Bruker BioSpin GmbH
$$ ##OWNER= nmr
$$ C:\u/data/dgb/nmr/ADRS/1760/pdata/1/auditp.txt
$$ ##AUDIT TRAIL=  $$ (NUMBER, WHEN, WHO, WHERE, WHAT)
(   1,<2006-08-29 14:32:45.33 +100>,<MAYBRIDGE\nmr>,<NMR_250MHZ>,
      <created by zg, POWCHK disabled, PULCHK disabled
       configuration hash MD5:
       E2 DF 36 D8 04 B2 41 60 5A D7 A3 38 5A 4B D0 FE
       data hash MD5: 64K
       25 99 DF 1B AF 01 D3 DB 03 9C 14 79 B7 DD B1 37>)
(   2,<2006-08-29 14:33:00.67 +100>,<MAYBRIDGE\nmr>,<NMR_250MHZ>,
      <Start of raw data processing
       ef LB = 0.3 FT_mod = 6 PKNL = 1 SI = 32K 
       data hash MD5: 32K
       F5 5F 21 2C 00 24 FD CE B9 56 97 B7 C1 99 A9 C3>)
(   3,<2006-08-29 14:33:02.30 +100>,<MAYBRIDGE\nmr>,<NMR_250MHZ>,
      <apk 
       data hash MD5: 32K
       64 BE 2E B6 77 E5 15 04 C6 2B CB 47 F4 CF 41 9F>)
(   4,<2006-08-29 14:33:03.17 +100>,<MAYBRIDGE\nmr>,<NMR_250MHZ>,
      <abs ABSG = 5 
       data hash MD5: 32K
       70 19 F5 A9 D6 CB 84 21 BE C0 E2 00 BC A6 84 49>)
$$ ##END=
$$ 
$$ hash MD5
$$ 61 E0 29 D9 AD CC F1 6F 81 E1 CC A6 EF 26 7C F1
##$RELAX= 
##$RELAX= 
##$RELAX= 
##$RELAX= 
##$RELAX= 
##$RELAX= 
##$RELAX= 
$$ Bruker specific parameters
$$ --------------------------
##$DU= <C:\u>
##$EXPNO= 1760
##$NAME= <ADRS>
##$PROCNO= 1
##$TYPE= <nmr>
##$USER= <dgb>
##$AMP= (0..31)
100 100 100 100 100 100 100 100 100 100 100 100 100 100 100 100 100 100 
100 100 100 100 100 100 100 100 100 100 100 100 100 100 
##$AQSEQ= 0
##$AQ_mod= 3
##$AUNM= <au_zg>
##$AUTOPOS= <26 >
##$BF1= 250.13
##$BF2= 250.13
##$BF3= 250.13
##$BF4= 250.13
##$BF5= 500.13
##$BF6= 500.13
##$BF7= 500.13
##$BF8= 500.13
##$BYTORDA= 1
##$CFDGTYP= 0
##$CFRGTYP= 5
##$CHEMSTR= <none>
##$CNST= (0..31)
1 1 145 1 1 1 1 1 1 1 1 1 1 1 1 1 1 1 1 1 1 1 1 1 1 1 1 1 1 1 1 1 
##$CPDPRG= <>
##$CPDPRG1= <>
##$CPDPRG2= <>
##$CPDPRG3= <>
##$CPDPRG4= <mlev>
##$CPDPRG5= <mlev>
##$CPDPRG6= <mlev>
##$CPDPRG7= <mlev>
##$CPDPRG8= <mlev>
##$CPDPRGB= <>
##$CPDPRGT= <>
##$D= (0..31)
0 1 0 0 0 0 0 0 0 0.06 0 0 0 0 0 0 0.0002 0 0 0 0 0 0 0 0 0 0 0 0 0 0 
0 
##$DATE= 1156858364
##$DBL= (0..7)
120 120 120 120 120 120 120 120 
##$DBP= (0..7)
150 150 150 150 150 150 150 150 
##$DBP07= 0
##$DBPNAM0= <>
##$DBPNAM1= <>
##$DBPNAM2= <>
##$DBPNAM3= <>
$$ [...]
##$SUBNAM7= <"">
##$SUBNAM8= <"">
##$SUBNAM9= <"">
##$SW= 20.6930455092707
##$SWIBOX= (0..15)
0 0 3 0 0 0 0 0 0 0 0 0 0 0 0 0 
##$SW_h= 5175.983436853
##$TD= 65536
##$TD0= 1
##$TE= 296.16
##$TE2= 300
##$TE3= 300
##$TEG= 300
##$TL= (0..7)
0 120 120 120 120 120 120 120 
##$TP= (0..7)
150 150 150 150 150 150 150 150 
##$TP07= 0
##$TPNAME0= <>
##$TPNAME1= <>
##$TPNAME2= <>
##$TPNAME3= <>
##$TPNAME4= <>
##$TPNAME5= <>
##$TPNAME6= <>
##$TPNAME7= <>
##$TPOAL= (0..7)
0.5 0.5 0.5 0.5 0.5 0.5 0.5 0.5 
##$TPOFFS= (0..7)
0 0 0 0 0 0 0 0 
##$TUNHIN= 0
##$TUNHOUT= 0
##$TUNXOUT= 0
##$USERA1= <user>
##$USERA2= <user>
##$USERA3= <user>
##$USERA4= <user>
##$USERA5= <user>
##$V9= 5
##$VALIST= <valist>
##$VCLIST= <CCCCCCCCCCCCCCC>
##$VD= 0
##$VDLIST= <DDDDDDDDDDDDDDD>
##$VPLIST= <PPPPPPPPPPPPPPP>
##$VTLIST= <TTTTTTTTTTTTTTT>
##$WBST= 1024
##$WBSW= 4
##$XGAIN= (0..3)
0 0 0 0 
##$XL= 0
##$YL= 0
##$YMAX_a= 221828
##$YMIN_a= -371262
##$ZGOPTNS= <>
##$ZL1= 120
##$ZL2= 120
##$ZL3= 120
##$ZL4= 120
##$ABSF1= 16.522
##$ABSF2= -4.171173
##$ABSG= 5
##$ABSL= 3
##$ALPHA= 0
##$AQORDER= 0
##$ASSFAC= 0
##$ASSFACI= 0
##$ASSFACX= 0
##$ASSWID= 0
##$AUNMP= <proc_1d>
##$AZFE= 0.1
##$AZFW= 0.1
##$BCFW= 0
##$BC_mod= 0
##$BYTORDP= 0
##$COROFFS= 0
##$CY= 12.5
##$DATMOD= 1
##$DC= 0
##$DFILT= <>
##$DTYPP= 0
##$F1P= 14.0000005364418
##$F2P= -0.99999901652339
##$FCOR= 0.5
##$FTSIZE= 32768
##$FT_mod= 6
##$GAMMA= 0
##$GB= 0
##$INTBC= 1
##$INTSCL= 1
##$ISEN= 128
##$LB= 0.3
##$LEV0= 0
##$LPBIN= 0
##$MAXI= 10000
##$MC2= 0
##$MEAN= 0
##$ME_mod= 0
##$MI= 0
##$NCOEF= 0
##$NC_proc= -5
##$NLEV= 6
##$NOISF1= 0
##$NOISF2= 0
##$NSP= 0
##$NTH_PI= 0
##$NZP= 0
##$OFFSET= 16.522
##$PC= 1
##$PHC0= 136.6059
##$PHC1= 7.870599
##$PH_mod= 1
##$PKNL= yes
##$PPARMOD= 0
##$PSCAL= 4
##$PSIGN= 0
##$REVERSE= no
##$SF= 250.13
##$SI= 32768
##$SIGF1= 0
##$SIGF2= 0
##$SINO= 400
##$SIOLD= 32768
##$SREGLST= <1H.DMSO>
##$SSB= 0
##$STSI= 32768
##$STSR= 0
##$SW_p= 5175.98343685301
##$SYMM= 0
##$S_DEV= 0
##$TDeff= 65536
##$TDoff= 0
##$TI= <Analysis number 999999
Compound Code 99
Book Reference 9
Project Code 9>
##$TILT= no
##$TM1= 0
##$TM2= 0
##$TOPLEV= 0
##$USERP1= <user>
##$USERP2= <user>
##$USERP3= <user>
##$USERP4= <user>
##$USERP5= <user>
##$WDW= 1
##$XDIM= 32768
##$YMAX_p= 530072312
##$YMIN_p= -575961
$$ End of Bruker specific parameters
$$ ---------------------------------
##NTUPLES= NMR SPECTRUM
##VAR_NAME=  FREQUENCY,     SPECTRUM/REAL,   SPECTRUM/IMAG
##SYMBOL=    X,             R,               I
##VAR_TYPE=  INDEPENDENT,   DEPENDENT,       DEPENDENT
##VAR_FORM=  AFFN,          ASDF,            ASDF
##VAR_DIM=   32768,         32768,           32768
##UNITS=     HZ,            ARBITRARY UNITS, ARBITRARY UNITS
##FACTOR=    0.157963299565203, 1,           1
##FIRST=     4132.6476996994, 0,             0
##LAST=      -1043.33573715361, 0,           0
##MIN=       -1043.33573715361, -575961,     0
##MAX=       4132.6476996994, 530072312,     0
$$ Real data points
##PAGE= N=1
##DATA TABLE= (X++(R..R)), XYDATA
$$ [...]
27857A849170N7720o4773j29686j42819J7550L8429k7756O6899k0888p1114L3910
$$ 1849170 1906890 1842117 1712431 1569612 1587162 1625591 1597835 1664734 1643846 1572732 1606642
27846A606642l3468O2217O2771J41380j1380m4459q3836j1692p7251j8632p3834
$$ 1606642 1573174 1635391 1698162 1839542 1828162 1783703 1699867 1688175 1610924 1592292 1518458
27835A518458q5545R660P9434O3157n3874P4004R1156p5438r8489L3515K5492
$$ 1518458 1432913 1442573 1522007 1585164 1531290 1605294 1696450 1621012 1522523 1556038 1581530
27824A581530r377n3115r0772J13197P3548k5141R182l1494j14525M0687L4064
$$ 1581530 1572153 1519038 1428266 1541463 1615011 1589870 1599052 1567558 1453033 1493720 1527784
27813A527784p4416j24600J6441m4938j2262J03755J59546O9556l363j9548j85242
$$ 1527784 1453368 1328768 1345209 1300271 1288009 1391764 1551310 1620866 1617503 1597955 1412713
27802A412713j94703N2590M9659k3988Q0219N9758Q5937O1920n4843r122n4294
$$ 1412713 1218010 1270600 1320259 1296271 1376490 1436248 1522185 1584105 1529262 1520140 1465846
27791A465846n0171n353J9345j16332j02288J36590J40139j7524k05742N503M0310
$$ 1465846 1415675 1410322 1429667 1313335 1211047 1347637 1487776 1470252 1264510 1270013 1310323
27780A310323j21172J01L9893j65002j53965L194J6208J11894J42161P029j18032
$$ 1310323 1189151 1189252 1229145 1064143 910178 913372 929580 1041474 1183635 1190664 1072632
27769A072632p1078J7994l927J01860J65584Q2949l5421j40713m2100q5735K9712
$$ 1072632 1001554 1019548 1015621 1117481 1283065 1366014 1330593 1189880 1147780 1062045 1091757
27758A091757k0837J33887J70725N2790n2215j80184n6980o10N7704J3514j15338
$$ 1091757 1070920 1204807 1375532 1428322 1376107 1195923 1138943 1138333 1196037 1209551 1094213
27747A094213k14474k4089K05396N6966n0266n1335j1926J17081N70j18741j64973
$$ 1094213 879739 855650 1061046 1118012 1067746 1016411 1004485 1121566 1122136 1003395 838422
27736H38422L4206J57898P7340J6621Q00n5729l2741k1388N7316k19j36121j51675
$$ 838422 872628 1030526 1107866 1124487 1125287 1069558 1036817 1015429 1072745 1072526 936405 784730
27724G84730o8720J93939P2222j19640j74228M931K2577L7023j06527O694J3157
$$ 784730 716010 909949 982171 862531 688303 693234 715811 752834 646307 653001 666158
27713F66158J30995o78l6841m4436l5417p1102O8406J26092J42478Q5421Q040
$$ 666158 797153 796475 759634 715198 679781 608679 677085 803177 945655 1031076 1039116
27702A039116r4798R834l4216p5637Q275j28071j40174O5513K81795P9342j98146
$$ 1039116 944318 954152 919936 844299 852574 724503 584329 649842 931637 1010979 812833
27691H12833J96l6339p1990J7535N7932J50846j0327j14053j10460r6275O8390
$$ 812833 813029 776690 704700 722235 780167 931013 920686 806633 696173 599898 668288
27680F68288p1053n9533l3198j64924J46808J53315N302m5410N3830J45792K1795
$$ 668288 597235 537702 504504 339580 486388 639703 645005 599595 653425 799217 821012
27669H21012o4495P5561J7582k7328m3772K0031P5287K1679k06150L2111k740
$$ 821012 756517 832078 849660 822332 778560 798591 873878 895557 689407 721518 718778
27658G18778r4989N192J3534o3350J320J14866O4873M740j01653j44248J82128
$$ 718778 623789 628981 642515 579165 580485 695351 760224 764964 663311 519063 701191
27647G01191O5199q449R2164j00453j8932J02192n2959j10383p6791J6264M1731
$$ 701191 766390 757941 850105 749652 730720 832912 779953 669570 592779 609043 650774
27636F50774O5369n3199m1355m887N0179r966o171q956o3050k0791l0977P1947
$$ 650774 716143 662944 621589 616702 666881 656915 650744 641788 578738 557947 526970 598917
27624E98917l5131n4385r666P5475J39627J0173n6368j15926n7374Q0519O9222
$$ 598917 563786 509401 499735 575210 714837 725010 668642 552716 495342 575861 645083
27613F45083N2107j21411j15745n575k9966N4549R0953r792O6626K4436l6980
$$ 645083 697190 575779 460034 454459 424493 479042 569995 560203 626829 651265 614285
27602F14285m4637k992j1722L2748J40090N2811n4420j3050J17684j10541j81270
$$ 614285 569648 566656 554934 587682 727772 780583 726163 713113 830797 720256 538986
27591E38986m4899J12139o4493L2896k6235q1483K4933J6088J1527j3247j17393
$$ 538986 494087 606226 541733 574629 548394 466911 491844 507932 519459 506212 388819
27580C88819r2439N6993O5343M9659j36134l657P6734M2910r739o6191l1222R855
$$ 388819 296380 353373 418716 468375 332241 328584 405318 448228 438489 372298 341076 350931
27568C50931J50195J190N4758l7527o5911L7587K0867N2462r4923l1046k7758
$$ 350931 501126 502316 557074 519547 453636 491223 512090 564552 469629 438583 410825
27557D10825n8025J79133R6135j38623j22641k2379J07023l1221j06770M9165
$$ 410825 352800 531933 628068 489445 366804 344425 451448 420227 313457 362622
27547C62622J79999N93L7433P833p3016l728j05446j97118L0953P6380m9486M5001
$$ 362622 542621 543214 580647 588480 515464 511736 406290 209172 240125 316505 267019 312020
27535C12020P2584P1523J4351J10116K918j08702l7361J12509j8983J3218j70444
$$ 312020 384604 456127 470478 580594 583512 474810 437449 549958 530975 544193 373749
27524C73749j47225K1258J12517M7038r2266R4005J78604j68387k54422J37036
$$ 373749 226524 247782 360299 407337 315071 409076 587680 419293 164871 301907
27514C01907K08825L7720m704l2631k5331P5065r262q9524p2691J6759J18544
$$ 301907 510732 548452 543748 511117 485786 560851 551589 462065 389374 406133 524677
27503E24677Q1030m0451R3309j5930m4569j8583o2167k6777n0800j70192M2095
$$ 524677 605707 565256 658565 642635 598066 579483 517316 490539 439739 269547 311642
27492C11642r7885N1544L5967M4598q5991Q972J35857P9147j01221q8272L1186
$$ 311642 213757 265301 301268 345866 259875 268847 404704 483851 382630 294358 325544
27481C25544m38M0305j9950n2054j3144q873j8878r4888L3589J74841J13150P8972
$$ 325544 325106 365411 345461 293407 280263 271390 252512 157624 191213 366054 479204 558176
27469E58176k8264r7529o4082r1813r3713j4989m7959K1860K3280J2048n0839
$$ 558176 529912 432383 368301 276488 182775 167786 119827 141687 164967 177015 126176
27458A26176K586J04136J34431L717Q287j01656L0465L4885L9313k6086j08739
$$ 126176 128762 232898 367329 371046 379333 277677 308142 343027 382340 356254 247515
27447B47515o5997M9468P769N3870N7846J74525O5016R066k6886j20304j51095
$$ 247515 181518 230986 238755 292625 350471 524996 590012 599078 572192 451888 300793
27436C00793k1612m6489l7794M0216p7314p5042M2170j9356J03075J21347R2851
$$ 300793 279181 232692 194898 235114 157800 82758 124928 105572 208647 329994 422845
27425D22845J2448N433r1314l3626J31772k9797p0254R2940Q8481j27758j43807
$$ 422845 435293 440726 349412 315786 447558 417761 347507 440447 528928 401170 257363
27414B57363j27501J30932j11539j30137k1117J03952J37176l8580n5332M6552
$$ 257363 129862 260794 149255 19118 -1999 101953 239129 200549 145217 191769
27404A91769O2855M1996J16622J5198N7477n2696p8332k3809L1816K0156l478
$$ 191769 254624 296620 413242 428440 485917 433221 354889 331080 362896 383052 379574
27393C79574j2753n3765M2321j04516j03387M882Q2117J26857L3454k4283J285
$$ 379574 366821 313056 355377 250861 147474 152356 234473 361330 394784 370501 371786
27382C71786j9330J08111K2748n0075j52328o3914l0271J08088Q2044k7511j9873
$$ 371786 352456 460567 483315 433240 280912 216998 186727 294815 376859 349348 329475
27371C29475k4446n7865k5176n3095j70668Q4334P1941n2398o1300m3555J19689
$$ 329475 305029 247164 221988 168893 -1775 82559 154500 102102 40802 -2753 116936
27360A16936N3679j2404J04471j41229J7857J71856J01481k8420k11369j67183
$$ 116936 170615 158211 262682 121453 139310 311166 412647 384227 172858 5675
27350E675l4444J53307J45288M4010j4118l8674j04548O9612J19578n8059R743
$$ 5675 -28769 124538 269826 313836 299718 261044 156496 226108 345686 287627 297370
27339B97370J05329r0513j37950j01710O2735K1439o6895m0222K10268M0254j08732
$$ 297370 402699 312186 174236 72526 135261 156700 89805 49583 259851 300105 191373
27328A91373l6894J13331j1418j06599K6918n3238J7826R5882j00879N6282J34749
$$ 191373 154479 267810 256392 149793 176711 123473 141299 237181 136302 192584 327333
27317C27333K21664m5812j87503q4113p5846j23992M967K5501R3230L9117L6676
$$ 327333 548997 503185 315682 231569 155723 31731 36698 62199 155429 194546 231222
27306B31222j03797k1653M3123J37035J0380j8299p6871r8082J5568Q3016M7085
$$ 231222 127425 105772 148895 285930 296310 278011 201140 103058 118626 201642 248727
27295B48727j06608o7598R5686J10553Q8003N7851o1328m1498l5821r4179K8181
$$ 248727 142119 74521 170207 280760 368763 426614 365286 323788 287967 193788 221969
27284B21969j6804k0890J33772o786j0026n5934j9609O0156k1052m5992L7959
$$ 221969 205165 184275 318047 311261 301235 245301 225692 285848 264796 218804 256763
27273B56763Q2754j20599j165K9902j2382n2989l7472N7852N7388r4771o1576
$$ 256763 339517 218918 217753 247655 235273 182284 144812 202664 260052 165281 103705
27262A03705P5515M1964l7274j4207j32799l4628J2202J4421n3526K9566J30323
$$ 103705 179220 221184 183910 169703 36904 2276 14478 28899 -24627 4939 135262
27251A35262R1778L7284j4473P0064Q8888j47069n2667J14014L1969n1763j21356
$$ 135262 227040 264324 249851 319915 408803 261734 209067 323081 355050 303287 181931
27240A81931m327n202m6324K5969J04313L0786j80850m0738J6587J19047l205
$$ 181931 177604 172402 126078 152047 256360 287146 106296 65558 82145 201192 197987
27229A97987o0501L2941k771J9110k6069l4833M1488P6659P3191J12511j50672
$$ 197987 137486 170427 167656 186766 160697 125864 167352 244011 317202 429713 279041
27218B79041m0859n0763p7414p1544P2548J07293N7572k0805m176J05434J0363
$$ 279041 238182 187419 110005 38461 111009 218302 275874 255069 250893 356327 366690
27207C66690j2826J0586j38987l6953j8890p6262r327M195O6681l8530L198n0264
$$ 366690 353864 364450 225463 188510 169620 93358 84031 88226 154907 116377 119575 69311
27195F9311l6383J1787J12346N0835K3431K5282k5331L469n4237P0674j40091
$$ 69311 32928 44715 157061 207896 231327 256609 231278 234747 180510 251184 111093
27184A11093m2564p5595n3708J6162j1900j38626M4099K17118J22036k3687j95879
$$ 111093 68529 -7066 -60774 -44612 -56512 -195138 -151039 66079 188115 164428 -31451
27173c1451p8683J39612K3860K6526M2221M1578k4656j30117N0247J68096R579
$$ -31451 -110134 29478 53338 79864 122085 163663 139007 8890 59137 227233 236812
27162B36812r8437m8822J3352J01155q1598j20233j3185J4781P9780l3903j19751
$$ 236812 138375 89553 102905 204060 122462 2229 -10956 3825 83605 49702 -70049
27151g0049M1535k0615J18203J10215r3796J39881K8082m4788k0853k8708m598
$$ -70049 -28514 -49129 69074 179289 85493 225374 253456 208668 187815 159107 154509
27140A54509P147P265K1453p3178j05164q6883N0429j0196l2390q4981M0065J28453
$$ 154509 161656 168921 190374 117196 12032 -74851 -24422 -34618 -67008 -151989 -111924 16529
27128A6529K6626j5743R7536J69337J06760M8183j5227o3691N6994J7648r3132
$$ 16529 43155 27412 124948 294285 401045 449228 434001 370310 427304 444952 351820
27117C51820j81679j12894p1143Q9075J05177j9438j2431l9107n6886K6266K1951
$$ 351820 170141 57247 -13896 75179 180356 160918 148487 109380 52494 78760 100711
27106A00711Q6480J33082J5909n2410L0421j12515j85431m9893R0653P4294J3792
$$ 100711 187191 320273 336182 283772 314193 201678 16247 -33646 57007 131301 145093
27095A45093j0879j5734J40442K6129m5070O3422o8189j53487r8708J502L69J01461
$$ 145093 134214 118480 258922 285051 239981 303403 235214 81727 -16981 -15479 -15110 86351
27083H6351K6909r5220j28937Q825O0951J24633M959p1275r4474M2490O0304q2108
$$ 86351 113260 18040 -110897 -102072 -41121 83512 88471 17196 -77278 -34788 25516 -56592
27071e6592o5822K49889J29760m6319M0467n8494j06079J2807N0333k0986n3655
$$ -56592 -122414 127475 257235 210916 251383 192889 86810 99617 149950 128964 75309
27060G5309M4557L4879n2841j94625P1651l7300k7647R1840J42336m5671J7359
$$ 75309 119866 154745 101904 -92721 -21070 -58370 -86017 5823 148159 102488 119847
27049A19847L6867P4524p8433p5563N0506k8861J10562L08l4115m3396q7674L5965
$$ 119847 156714 231238 152805 77242 127748 98887 209449 209757 175642 132246 44572 80537
27037H0537J04667N2443m2506k22216P831n0328O0802K35727J33629r9254j23516
$$ 80537 185204 237647 195141 -27075 -19244 -69572 -8770 226957 360586 261332 137816
27026A37816r9180o2126J53211k8699J3140J6724j57354l2991j0097q4451r7747
$$ 137816 38636 -23490 129721 101022 114162 130886 -26468 -59459 -69556 -154007 -251754
27015b51754j9911J55955Q4808L2997J02160P2962o5501Q5501J72120O113j79152
$$ -251754 -271665 -115710 -30902 2095 104255 177217 111716 197217 369337 375450 196298
27004A96298r7950P8396k8246j12913M3631k7133m9230O0439N7548q6824j53936
$$ 196298 98348 176744 148498 35585 79216 52083 2853 63292 120840 34016 -119920
26993a19920k2714J26935O2745j14965n9724J04393M2025K0397j5069K5336l7845
$$ -119920 -142634 -15699 47046 -67919 -127643 -23250 18775 39172 24103 49439 11594
26982A1594O7198n7574j04890J2832K86897k837K3448o431N2916O784n3979m5833
$$ 11594 78792 21218 -83672 -70840 216057 213220 236668 230237 283153 289937 235958 190125
26970A90125r7967L9035P9051m7436q0018o3742k1802n353n9918m5908J04159
$$ 190125 92158 131193 210244 162808 82790 19048 -2754 -8107 -68025 -113933 -9774
26959i774R2987O028P7040j2234r449J0386N3590k4064N604J4325K0715M1670
$$ -9774 83213 89241 166281 154047 144598 154984 208574 184510 190114 204439 225154 266824
26947B66824P36j5860k3619R227l9367q1354K4121N8916m4113j34875r8435N5455
$$ 266824 267560 251700 228081 237308 197941 116587 140708 199624 155511 20636 -77799 -22344
26935b2344n1033K9391l9127n5773P997J99575j7031q9668R8891R0709p7490K9085
$$ -22344 -73377 -43986 -83113 -138886 -130889 68686 51655 -38013 60878 151587 74097 103182
26923A03182M6677j03889p2230l3474N2678Q5431Q01N4197J7320Q5321P762p4530
$$ 103182 149859 45970 -26260 -59734 -7056 78375 79176 133373 150693 236014 243776 169246
26911A69246J5147O18j1297q4680n4793L0477P8680l5709o2174m969j52410q1903
$$ 169246 184393 185011 173714 89034 34241 64718 143398 107689 45515 40546 -111864 -193767
26899a93767p8245J69807J55261J7890p5385p081j24494K4128J06103k7175N6073
$$ -193767 -272012 -102205 53056 70946 -4439 -11520 -136014 -111886 -5783 -32958 23115
26888B3115j0336q03K9436M5213k0022J0153m1131J2793r111m9485o9770N5717
$$ 23115 12779 11976 41412 86625 66603 76756 35625 48418 39307 -10178 -79948 -24231
26876b4231J1458p7495k5554K27080J04814r1543n0248q3721M5333L3166J19629
$$ -24231 -12773 -90268 -115822 111258 216072 124529 74281 -9440 35893 69059 188688
26865A88688Q4107R242O1384m1495p9556j31769J3082Q6135j4256j7329l1951
$$ 188688 272795 282037 343421 301926 222370 90601 103683 189818 175562 158233 126282
26854A26282j68217P9939J0195j20343k9663N5685j5550O6255j5499m6230J5181
$$ 126282 -41935 38004 48199 -72144 -101807 -46122 -61672 4583 -10916 -57146 -41965
26843d1965J09821O2529k20875j68215J7617R7595J74603J39088L4024j78448
$$ -41965 67856 130385 -90490 -258705 -241088 -143493 31110 170198 204222 25774
26833B5774l0540J02331N9060q7963M280L5317J27266Q254k23041r7233j35290
$$ 25774 -4766 97565 156625 68662 72942 108259 235525 243779 20738 -76495 -211785
26822b11785k9327K4542R2318J44658M8070R0891J23655j75706q2045p3458j90076
$$ -211785 -241112 -216570 -124252 20406 68476 159367 283022 107316 25271 -48187 -238263
26811b38263n9528K3017K51750O8673L3293L2474N8244J12287n0706j02550j80794
$$ -238263 -297791 -274774 -23024 45649 78942 111416 169660 281947 231241 128691 -52103
26800e2103p499J04084O394o0778j35975P525q1039O4263J11760N4761p1121P8129
$$ -52103 -59602 44482 50876 -9902 -145877 -138352 -219391 -155128 -43368 11393 -59728 18401
26788A8401M6961O8124N5288r2530J6542k0137j50963j67193J2312Q2139R6785
$$ 18401 65362 133486 188774 96244 112786 92649 -58314 -225507 -213195 -131056 -34271
26777c4271N5134r782r727j33587L5232P2176m632Q7835J66067k7864k21760k8150
$$ -34271 20863 11081 1354 -132233 -97001 -24825 -29457 58378 224445 196581 -25179 -53329
26765e3329K8573J0909K6640N5789P3543J9482J0198q871j44749j04755j1678
$$ -53329 -24756 -13847 12793 68582 142125 161607 171805 162934 18185 -86570 -98248
26754i8248m1651r7140Q4902J22157N1386J4437p538M1172q0323m6050K9221k8144
$$ -98248 -139899 -237039 -152137 -29980 21406 35843 28305 69477 -10846 -56896 -27675 -55819
26742e5819O542J62K8244J64558o1690o0127l9784l4944J20223L0166R2991l7943
$$ -55819 -49277 -49115 -20871 143687 81997 21870 -17914 -52858 67365 97531 190522 152579
26730A52579l4156N0589n2711K667L7594J0479j2739j35231n7456o8874N45K7502
$$ 152579 118423 169012 116301 118968 156562 167041 154302 19071 -38385 -107259 -106714 -79212
26718g9212Q719j1454N1008J40243P2824p4958o0165r4742K5346J78068N6034
$$ -79212 -70493 -81947 -30939 109304 182128 107170 47005 -47737 -22391 155677 211711
26707B11711p3152j65226K9318R8677j38200p2312R2154p2699J4653O4279j5710
$$ 211711 138559 -26667 2651 101328 -36872 -109184 -17030 -89729 -75076 -10797 -26507
26696b6507l2795L6528N5899M1862R6434o8196j60929j68883J32884J17931q7389
$$ -26507 -59302 -22774 33125 74987 171421 103225 -57704 -226587 -93703 24228 -63161
26685f3161m3464p5766M7784N3204j0890q0139P3142k0962r2523Q6276J70916
$$ -63161 -106625 -182391 -134607 -81403 -92293 -172432 -99290 -120252 -212775 -126499 44417
26674D4417r27k3114M009Q2493j02349M5894p0511r3572M8256Q0045n442Q2816
$$ 44417 43490 20376 24385 106878 4529 50423 -20088 -113660 -65404 14641 9199 92015
26662I2015J1248j53340K963L0327J37913k325o8016n3942o9408Q3902n4889R8912
$$ 92015 103263 -50077 -47114 -16787 121126 118801 50785 -3157 -72565 11337 -43552 55360
26650E5360j17619k08101N8622q4191J2018N3360M3910M2850R7600Q7206k8044
$$ 55360 -62259 -270360 -211738 -295929 -283911 -230551 -186641 -143791 -46191 41015 12971
26639A2971q2310P6739o2974K2945Q2882J38449m7253r8322L2151p4738k0896
$$ 12971 -69339 7400 -55574 -32629 50253 188702 141449 43127 75278 540 -20356
26628b0356m996P6926m3884r2226J04729O1246j955j24223J6755J33798j00726
$$ -20356 -25352 51574 7690 -84536 20193 81439 79484 -44739 -27984 105814 5088
26617E088n6545o1260K0096p675P6158P4050j1626q0351m4529r9796K00312K1790
$$ 5088 -51457 -112717 -92621 -100296 -24138 49912 38286 -42065 -86594 -186390 13922 35712
26605C5712L6087O0637j39527k425R1928J6110l1680o3626k2717r5522K8544M692
$$ 35712 71799 132436 -7091 -9516 82412 98522 66842 3216 -19501 -115023 -86479 -81787
26593h1787K0629j0006j10602P9782L7996K8033P1172O7138j9238o4769R2912
$$ -81787 -61158 -71164 -181766 -101984 -63988 -35955 35217 102355 83117 18348 111260
26582A11260J35578K9354K9216j51129j69622j48928N8870m2197N8527M0201j3281
$$ 111260 246838 276192 305408 154279 -15343 -164271 -105401 -147598 -89071 -48870 -62151
26571f2151K5967K3875o884j73336J85162M3409j46107N4022J27415p677n5668
$$ -62151 -36184 -12309 -19193 -192529 -7367 36042 -110065 -56043 71372 63695 8027
26560H027p1357k2496M1693L9197O8980P1347j17679j75166o2438R9481K2610
$$ 8027 -63330 -85826 -44133 -4936 64044 135391 17712 -157454 -219892 -120411 -97801
26549i7801K2663Q8623J38469L1055j49925j43459K2646L0637N8967j7706j0354
$$ -97801 -75138 13485 151954 183009 33084 -110375 -87729 -57092 1875 -15831 -26185
26538b6185M9434l3773Q9426J02481k4341K1107m8158N0189r90j86326O186K5669
$$ -26185 23249 -10524 78902 181383 157042 178149 129991 180180 179190 -7136 -950 24719
26526B4719j15268p3232k8972N8281J01947M7737R0159L0861k755n3020K5879
$$ 24719 -90549 -163781 -192753 -134472 -32525 15212 105371 136232 133477 80457 106336
26515A06336k5460m8963N1218p0043O1798l6501j4645L7338k64R2878o3049k4403
$$ 106336 80876 31913 83131 13088 74886 38385 23740 61078 60814 153692 90643 66240
26503F6240k6056k6147M2173J16200Q0252j15881q4081K5549r448j55982j09211
$$ 66240 40184 14037 56210 172410 252662 136781 52700 78249 68801 -87181 -196392
26492a96392Q8982J35825K6340o0232L9123l609K2554l0268n4274M581L7010K7954
$$ -196392 -107410 28415 54755 -5477 33646 30037 52591 22323 -31951 -27370 9640 37594
26480C7594l11p7061n5864M2600j3505J43127l7852n1195K0106j529j3800j03386
$$ 37594 37283 -39778 -95642 -53042 -66547 76580 38728 -12467 7639 6110 -7690 -111076
26468a11076j08741J14159J11738m4093k1917m5381L4512r7821J00121P6918K4663
$$ -111076 -219817 -105658 6080 -38013 -59930 -105311 -70799 -168620 -68499 8419 33082
26457C3082J44302N176r6591k2436L9914j5686K957M7786j42320n0061o6579K704
$$ 33082 177384 182560 85969 63533 103447 87761 90718 138504 -3816 -53877 -120456 -117752
26445a17752K7797l3711M1384o270k5275j61253k4814R9011P9435O9349Q3048
$$ -117752 -89955 -123666 -82282 -88552 -113827 -275080 -299894 -200883 -121448 -52099 30949
26434C0949j19332P2024j19L4744R4968k8252k4421O3687j89341o3631N3103M1262
$$ 30949 -88383 -16359 -16478 18266 113234 84982 60561 124248 -65093 -128724 -75621 -34359
26422c4359J51371j5291j90897l5347r7934O3583Q2523K0665L4062J7147o0400
$$ -34359 117012 101721 -89176 -124523 -222457 -158874 -76351 -55686 -21624 -4477 -64877
26411f4877m8816n025o4444l9459J20681j07884r5656J20255L8862q4534j0604
$$ -64877 -113693 -118718 -183162 -222621 -101940 -209824 -305480 -185225 -146363 -230897 -241501
26400b41501m0637J55175R0672J17211J8813l2638p1355m2049R4161N8818l1842
$$ -241501 -282138 -126963 -36291 80920 99733 67095 -4260 -46309 47852 106670 74828
26389G4828j25388l4897O0306n1412L3015p2020p337P4812j29198n1422L6481
$$ 74828 -50560 -85457 -25151 -76563 -43548 -115568 -122905 -48093 -177291 -228713 -192232
26378a92232N6568k7389r2057N359P1794K0932M369M876O3874m5850n7725n6908
$$ -192232 -135664 -163053 -255110 -249751 -177957 -157025 -152656 -147780 -83906 -129756 -187481 -244389
26366b44389L5554n9137O0992J27022Q6989k6705k3643Q6483K9300n8475N7334
$$ -244389 -208835 -267972 -206980 -79958 7031 -19674 -43317 43166 72466 13991 71325
26355G1325k0730q8448j7574j95765k05207P9373J11719O3921R2484n4729j3452
$$ 71325 50595 -37853 -55427 -251192 -456399 -377026 -265307 -201386 -108902 -163631 -177083
26344a77083Q8105M1111J504N4715j4321l4880j6382p8155j04580M1176N8152
$$ -177083 -88978 -47867 -46363 8352 -5969 -40849 -57231 -135386 -239966 -198790 -140638
26333a40638N8733P5270m4473j79810M1763J97259Q0570o1235j19524p2034L6309
$$ -140638 -81905 -6635 -51108 -230918 -189155 8104 88674 27439 -92085 -164119 -127810
26322a27810J46181Q5648p8876o2178M7487p4512K8004R0417K1651j03119k12915
$$ -127810 18371 104019 25143 -37035 10452 -64060 -36056 54361 76012 -27107 -240022
26311b40022R5518J30891L3532N818L507n6296Q682J36365Q6374j9516p1682j66843
$$ -240022 -144504 -13613 19919 25737 29244 -27052 -18370 117995 204369 184853 113171 -53672
26299e3672j99931l5297P5758J85685J46860J2624q0674k6396l5115o4923J2375
$$ -53672 -253603 -288900 -213142 -27457 119403 132027 51353 24957 -10158 -75081 -62706
26288f2706n6425K2907L7302J18249J63003J818p201j88293J956k3174p598K3973
$$ -62706 -119131 -96224 -58922 59327 222330 224148 216947 28654 30610 7436 -162 23811
26276B3811J1099R1939J8033j07467n4050n5213o3553R7015p7033K8678o3821
$$ 23811 34910 126849 144882 37415 -16635 -71848 -135401 -38386 -115419 -86741 -150562
26265a50562q8174j2730J4065R5765k5043N4348j8858J9900J05758K7756o1143
$$ -150562 -238736 -251466 -237401 -141636 -166679 -112331 -131189 -111289 -5531 22225 -38918
26254c8918j66347K3542L0550L4895R4688P2569o7349n7016M8432r0154Q7701
$$ -38918 -205265 -181723 -151173 -116278 -21590 50979 -16370 -73386 -24954 -115108 -27407
26243b7407p72n1095R9038m5007o9571Q525P6687L5532r2754l5120k2929P0189
$$ -27407 -28179 -79274 19764 -25243 -94814 -86289 -9602 25930 -66824 -101944 -124873 -54684
26231e4684R6477n0473n9752J567J12919L5514p6808m8923j6167n328j23237j43408
$$ -54684 41793 -8680 -68432 -66865 46054 81568 4760 -44163 -60330 -65658 -188895 -332303
26219c32303k2956J48753J17469O003R5412Q7417l0216L681j8492q5752J6286
$$ -332303 -355259 -206506 -89037 -83034 12378 99795 69579 73260 54768 -30984 -14698
26208a4698J1915n1894j22627J04956j7618r1251J83417m4899J8717O2401N7519
$$ -14698 -2783 -54677 -177304 -72348 -89966 -181217 2200 -42699 -23982 38419 95938
26197I5938m291m9132k11669j71167O7638J73481J12333k14211k7743Q8858j9610
$$ 95938 91647 42515 -169154 -340321 -272683 -99202 13131 -201080 -228823 -139965 -159575
26186a59575J3233l258k0133n0332J17603p792k5218J11465J59823j23320q9706
$$ -159575 -146342 -149600 -169733 -220065 -102462 -110254 -135472 -24007 135816 12496 -77210
26175g7210k2931m8761k7698K3624L507L1255J41157q6N7484q3426k5627M4193
$$ -77210 -100141 -148902 -176600 -152976 -149469 -118214 22943 22857 80341 -3085 -28712 15481
26163A5481j15776m1740l4326n876P4612K1954o5840o497M1427O7942M0475n4913
$$ 15481 -100295 -142035 -176361 -182237 -107625 -85671 -151511 -158008 -116581 -48639 -8164 -63077
26151f3077r9458K1104M8836q4757L3485J68806J06589j3273m3186K0929m9878
$$ -63077 -162535 -141431 -92595 -177352 -143867 24939 131528 118255 75069 95998 46120
26140D6120m5409k1570N1614M5678k8555L1348j163J2915N7462K5185k26349j33898
$$ 46120 711 -20859 30755 76433 47878 79226 78063 90978 148440 173625 -52724 -186622
26128a86622K859J4044J5369p4227J53J66614M3567m3278j60364k74k9745L4846
$$ -186622 -183763 -169719 -154350 -228577 -228424 -61810 -18243 -61521 -221885 -222159 -251904 -217058
26116b17058J15915J98309O4962j11007Q1404Q2809r712K8331r860p6320q8262
$$ -217058 -101143 97166 162128 51121 132525 215334 205622 233953 224093 147773 59511
26105E9511R7123k14854k38317K5655O4637L113R2350J09802k6302L4665m4477
$$ 59511 156634 -58220 -296537 -270882 -206245 -203132 -110782 -980 -27282 7383 -37094
26094c7094k7491J71049J7899j48524j12344J37879o208j01353k9233J61665J16604
$$ -37094 -64585 106464 124363 -24161 -136505 1374 -4834 -106187 -135420 26245 142849
26083A42849q3747o9482j46952j12107J12725N7719P0955o9812j32831p6984J82213
$$ 142849 59102 -10380 -157332 -269439 -156714 -98995 -28040 -97852 -230683 -307667 -125454
26072a25454L9879l4360n1479j5542K8144j0834O8317M5411J22941K6206k3294
$$ -125454 -85575 -119935 -171414 -186956 -158812 -169646 -101329 -55918 67023 93229 69935
26061F9935J6084L9912j24168j49636q9557M5242J70296J02144q153m9688j45368
$$ 69935 86019 125931 1763 -147873 -237430 -192188 -21892 80252 72099 22411 -122957
26050a22957P8773L1068J0213O4418l9174j14014o7230O1243Q3500N566J19028
$$ -122957 -44184 -13116 -2903 61515 22341 -91673 -158903 -97660 -14160 -8594 110434
26039A10434o9963k8169M3330j04928j27844Q832K6266O7162M108p2973j94093
$$ 110434 40471 12302 55632 -49296 -177140 -168308 -142042 -74880 -70772 -143745 -337838
26028c37838j9227J35467M9361m5706L4586L4610J63054q6350j28872p9807N009
$$ -337838 -357065 -221598 -172237 -217943 -183357 -148747 14307 -72043 -200915 -280722 -275713
26017b75713J05512l7399o3662K8918o0691O1881N9047P0114P2133k7124j22383
$$ -275713 -170201 -207600 -271262 -242344 -303035 -241154 -182107 -111993 -39860 -66984 -189367
26006a89367Q3538J12451k2922M6612O5298o092j97785m0722m5497O5039J55388
$$ -189367 -105829 6622 -16300 30312 95610 89518 -108267 -148989 -194486 -129447 25941
25995B5941M7381p9519o4410k5626M0548O1587J08300l8668k2483Q0367q2036
$$ 25941 73322 -6197 -70607 -96233 -55685 5902 114202 75534 53051 133418 51382
25984E1382o3681Q4521m2466j31838o3645O2851K0006N5884R4872j3137k5705
$$ 51382 -12299 72222 29756 -102082 -165727 -102876 -82870 -26986 67886 54749 29044
25973B9044j34651l6378j5052N9627m3751R7135J42990m2345j16860J1183P0113
$$ 29044 -105607 -141985 -157037 -97410 -141161 -44026 98964 56619 -60241 -49058 21055
25962B1055n9605K0863N4519Q9265P8364m4356K3171j6149j38135L0004M0837
$$ 21055 -38550 -17687 36832 126097 204461 160105 183276 167127 28992 58996 99833
25951I9833j67893o453p4983r8222O5007K1052j5075P9108K7349o548M1370J2030
$$ 99833 -68060 -74513 -149496 -247718 -182711 -161659 -176734 -97626 -70277 -76825 -35455 -23425
25939b3425J06908R703o1834q8245n3058J8136J25290P6120l4350q052k3094m9053
$$ -23425 83483 93186 31352 -56893 -109951 -91815 33475 109595 75245 67193 44099 -4954
25927d954k9151l6764J22163o1813o0377J5354l7857M050k3310j9900p5280J8668
$$ -4954 -34105 -70869 51294 -10519 -70896 -55542 -93399 -89349 -112659 -132559 -207839 -189171
25915a89171J51492M8097O9401m2125j63899q3142m7168n8697J09164J56036n3138
$$ -189171 -37679 10418 79819 37694 -126205 -209347 -256515 -315212 -206048 -50012 -103150
25904a03150r4871k4615J31856J30910k3366N5689Q306j13636J0613L841q2211
$$ -103150 -198021 -222636 -90780 40130 16764 72453 80759 -32877 -22264 -18423 -100634
25893a00634m312m410J9510J71215N4028r4669j7102j8897n1880n7024q6692l0183
$$ -100634 -104946 -109356 -89846 81369 135397 40728 23626 4729 -47151 -104175 -190867 -221050
25881b21050P1405R4911p0572J2747J11407J73520O4511p0908r8601j04011q9874
$$ -221050 -149645 -54734 -125306 -112559 -1152 172368 236879 165971 67370 -36641 -126515
25870a26515J0683m342n656l9560k3072P8356K7917k2339l7486J0919k3473m7189
$$ -126515 -115832 -120174 -125830 -165390 -188462 -110106 -82189 -104528 -142014 -131095 -154568 -201757
25858b01757k3237J25793J7575o635M4043k4433n6949L8718R4663P2963n1854
$$ -201757 -224994 -99201 -81626 -88261 -44218 -68651 -125600 -86882 7781 80744 28890
25847B8890j41556M3474j7885j1133l6089k2582O791p1960M1685Q8627P3150R4822
$$ 28890 -112666 -69192 -87077 -98210 -134299 -156881 -150090 -222050 -180365 -91738 -18588 76234
25835G6234j13535n964p6558n3576N8344J40683j7655j18354m5143P5444N073
$$ 76234 -37301 -43265 -119823 -173399 -115055 25628 7973 -110381 -155524 -80080 -75007
25824g5007j37987J32346n9696j32565J4851R075Q7378J56336O4732j32158j49966
$$ -75007 -212994 -80648 -140344 -272909 -258058 -248983 -161605 -5269 59463 -72695 -222661
25813b22661R6097k2955o3517o7194Q4623K7467j1648M1655j2196J01206J30422
$$ -222661 -126564 -149519 -213036 -280230 -195607 -168140 -179788 -138133 -150329 -49123 81299
25802H1299p4325l8366M787R4472j02358j63751L0456M3802O3535j1808j29912
$$ 81299 6974 -31392 -26605 67867 -34491 -198242 -167786 -123984 -60449 -72257 -202169
25791b02169o0235j9794j3181k0198N0196J24059J47062m685K5335o0817o309
$$ -202169 -262404 -282198 -295379 -315577 -265381 -141322 5740 1055 26390 -34427 -40736
25780d0736P1835p5479l3697L1989l4163r8243p6034J08973J12808P5086N614
$$ -40736 31099 -44380 -78077 -46088 -80251 -178494 -254528 -145555 -32747 42339 47953
25769D7953o7457o3458J50071O3511k7231r4256R9486J07505m2123r2552o7500
$$ 47953 -19504 -82962 67109 130620 103389 9133 108619 216124 174001 81449 13949
25758A3949R4630k2552K118l0421j0415N6214N6166m7709j33294N9749o116j00640
$$ 13949 108579 86027 88145 57724 47309 103523 159689 111980 -21314 38435 32319 -68321
25746f8321R1086M5045j48270j27153L5486J7121j83790R4987J22514J23905j35270
$$ -68321 22765 67810 -80460 -207613 -172127 -155006 -338796 -243809 -121295 2610 -132660
25735a32660j74970O730Q9482K7361J16632Q6750p1718j57335j34258N2266J58160
$$ -132660 -307630 -300900 -211418 -184057 -67425 19325 -52393 -209728 -343986 -291720 -133560
25724a33560Q595l4747J62910K15791j658p8817l0100r3830O4279L599r5929j5400
$$ -133560 -124965 -159712 3198 218989 217331 138514 108414 14584 78863 82462 -13467 -28867
25712b8867m9498L0501M3534l621j27998M5289M0099j011j03968J26465M8055
$$ -28867 -78365 -47864 -4330 -7951 -135949 -90660 -50561 -51572 -155540 -29075 18980
25701A8980p3930q5135l5174M9770J6914J41878K41781Q4901q0955j28296m1297
$$ 18980 -54950 -140085 -175259 -125489 -108575 33303 275084 359985 279030 150734 109437
25690A09437K6096n7037r5660K2562n7236K5071j33552r6753K48k30901P7636
$$ 109437 135533 78496 -17164 5398 -51838 -26767 -160319 -257072 -256824 -487725 -410089
25679d10089J61971J54899P7112j42905m1287O3903j4288N2961K0078j01000K0181
$$ -410089 -248118 -93219 -16107 -159012 -200299 -136396 -150684 -97723 -77645 -178645 -158464
25668a58464Q1623J38041M1880j03090r7594j9674k0363Q9098p7242O775O9421
$$ -158464 -76841 61200 103080 -10 -97604 -117278 -137641 -48543 -125785 -119010 -49589
25657d9589r6654K4137N9428M9387q4199M8805m8105o5233J01497J3870j22833
$$ -49589 -146243 -122106 -62678 -13291 -97490 -48685 -96790 -162023 -60526 -46656 -169489
25646a69489J03956R6970m169o5226j7445o760L8412N9109P1943n551n5802n3686
$$ -169489 -65533 31437 27268 -37958 -55403 -62163 -23751 35358 107301 101750 45948 -7738
25634g738q778q513o995K8161R018M877K4810P9286K9204q6086k4491p0274M445
$$ -7738 -16516 -25029 -32024 -3863 5155 10032 34842 114128 143332 57246 32755 -37519 -33074
25621c3074m3534M3175K4413j9151Q7949j02573j24585k6333P4961N9473l9871
$$ -33074 -76608 -33433 -9020 -28171 59778 -42795 -167380 -193713 -118752 -59279 -99150
25610i9150j86275R8118J50262K2580j9184m9871m9795M1195j9317L1579r9370
$$ -99150 -285425 -187307 -37045 -14465 -33649 -83520 -133315 -92120 -111437 -79858 -179228
25599a79228j07258R2312j2931R1835l3882J00481O1418n891O9096o0981p8280
$$ -179228 -286486 -194174 -207105 -115270 -149152 -48671 12747 6856 75952 14971 -63309
25588f3309J05602N1548Q5654J07768k09126j63366j061M9152L3561L4208p3580
$$ -63309 42293 93841 179495 287263 78137 -85229 -86290 -37138 -3577 30631 -42949
25577d2949N9413l4006p9366j7472L5318N3096n5970m6931K4565M8449n47K39815
$$ -42949 16464 -17542 -96908 -114380 -79062 -25966 -81936 -128867 -104302 -55853 -56400 183415
25565A83415L8550n7006p4653K1583q4093j03868n8676L4507L7870l8282J35503
$$ 183415 221965 164959 90306 111889 27796 -76072 -134748 -100241 -62371 -100653 34850
25554C4850k4433j01229n2739k3292R7295O6765L6832p227o7392m5916p5705j6588
$$ 34850 10417 -90812 -143551 -166843 -69548 -2783 34049 26822 -40570 -86486 -162191 -178779
25542a78779P414K5256l0770r5481J30693J507J23122k6965j71942n1253L0868
$$ -178779 -171365 -146109 -176879 -272360 -141667 -140160 -17038 -44003 -215945 -267198 -236330
25531b36330J76293Q2713J7585N5737k2028K8248P1142j27361j10989K4782k3354
$$ -236330 -60037 22676 40261 95998 73970 102218 173360 45999 -64990 -40208 -63562
25520f3562R3680k4752J2324j0844q856q0109k9863l8339j09098n5757m193K7505
$$ -63562 30118 5366 17690 6846 -2010 -82119 -111982 -150321 -259419 -315176 -319369 -291864
25508b91864J33807m058K6628l0290m7876J828P7190J01532k0317J12245Q5261
$$ -291864 -158057 -162115 -135487 -165777 -213653 -211825 -134635 -33103 -53420 58825 144086
25497A44086j0624n1995J00056o773Q7478k7659L7176j21247p8813l0871L4439
$$ 144086 133462 81467 181523 174750 262228 234569 271745 150498 71685 40814 75253
25486G5253j32517j8306K0067J6425N9064O0876N9171p9978J3312N1516k46980
$$ 75253 -57264 -75570 -55503 -39078 19986 80862 140033 60055 73367 124883 -122097
25475a22097j01400J8980J37282K06633o0770m9980Q2388r2564n2970N0772R5835
$$ -122097 -223497 -204517 -67235 139398 78628 28648 111036 18472 -34498 16274 112109
25464A12109N5859j47995m3168j6466q4753m7775O1008j3645m1905m9253J16147
$$ 112109 167968 19973 -23195 -39661 -124414 -172189 -111181 -124826 -166731 -215984 -99837
25453i9837P6901o4472j8320J02689j8771R616Q852N0084j03306k00750m506J19804
$$ -99837 -22936 -87408 -105728 -3039 -21810 -12194 -3342 46742 -56564 -257314 -261820 -142016
25441a42016M7289K3986r6783q0420k0135P5609K22401L5976L8777K4769l9286
$$ -142016 -94727 -70741 -167524 -247944 -268079 -192470 29931 65907 104684 129453 90167
25430I0167k1272P1272K612p2412o4853r6714o3148M1934L4365Q8033P4922J03852
$$ 90167 68895 140167 142779 70367 5514 -91200 -154348 -112414 -78049 9984 84906 188758
25418A88758j6800j24658q5841O8713r3957R8926n7422k2906r1844r9040P8532
$$ 188758 171958 47300 -38541 30172 -63785 35141 -22281 -45187 -137031 -236071 -157539
25407a57539M163O629m9115k1848M2050J08242P5516O8460m7696m4016j41518
$$ -157539 -153376 -146747 -195862 -217710 -175660 -67418 8098 76558 28862 -15154 -156672
25396a56672k9163N8931R6918J46696j761j26240m2336j84968j65739R376P1977
$$ -156672 -185835 -126904 -29986 116710 114949 -11291 -53627 -238595 -404334 -394958 -322981
25385c22981M0688O9341q3717P5034Q8814J1652m5623O8300M2419M5980k4009
$$ -322981 -282293 -212952 -296669 -221635 -132821 -121169 -166792 -98492 -56073 -10093 -34102
25374c4102J5434m1051Q6602j09338l5724O3010J04988k4425j70876k8067L4302
$$ -34102 -18668 -59719 26883 -82455 -118179 -55169 49819 25394 -145482 -173549 -139247
25363a39247Q9187J2319o0501q4758M117Q7268k6020O1258r9739l4071n2944K3194
$$ -139247 -50060 -37741 -98242 -183000 -178883 -91615 -117635 -56377 -156116 -190187 -243131 -219937
25351b19937N9268N3445K3001R5432J25548J29134q0767r3915L595k19436n3960
$$ -219937 -160669 -107224 -84223 11209 136757 265891 185124 91209 94804 -124632 -178592
25340a78592J55194N7729p1796j42284j3703J07528K0534j29156M1775M4193P0752
$$ -178592 -23398 34331 -37465 -179749 -193452 -85924 -65390 -194546 -152771 -108578 -37826
25329c7826J29173n6690K8241L0873p5793q0531J294M9420O7141m3434p8952j6593
$$ -37826 91347 34657 62898 93771 17978 -62553 -61259 -11839 55302 11868 -67084 -83677
25317h3677L0292K7918K1575r7938j26569m2519J07916J86329K2303n7908J7602
$$ -83677 -53385 -25467 -3892 -101830 -228399 -270918 -163002 23327 45630 -12278 5324
25306E324q7434o8325P2485l0253j70514p6617N571J40421O7249j0185n9254l7248
$$ 5324 -82110 -150435 -77950 -108203 -278717 -355334 -349763 -209342 -142093 -152278 -211532 -248780
25294b48780r636q868k898J60655J37206L3676J29424k541j01403o2295j76873
$$ -248780 -258416 -267284 -270182 -109527 27679 61355 190779 188238 86835 24540 -152333
25283a52333j48497J2574N4858O8150j9096K11279J40137j61580j96574p4145
$$ -152333 -300830 -288256 -233398 -165248 -184344 26935 167072 5492 -191082 -265227
25273b65227K0446M13L6136r7365R7059J42823N9914N368j7859j00992j10160
$$ -265227 -244781 -244368 -208232 -305597 -208538 -65715 -5801 -433 -18292 -119284 -229444
25262b29444J6976M4764o1797O8403J10766P0737p0180k6318j17879q1028m4443
$$ -229444 -212468 -167704 -229501 -161098 -50332 20405 -49775 -76093 -193972 -275000 -319443
25251c19443N3694J70381M9744m6474l5215O795L8014n400K9302j06751j9364
$$ -319443 -265749 -95368 -45624 -92098 -127313 -120518 -82504 -87904 -58602 -165353 -184717
25240a84717M0940P9042M5360L7304q7545j95167j081K9635P1578K7396m3122
$$ -184717 -143777 -64735 -19375 17929 -69616 -264783 -265864 -236229 -164651 -137255 -180377
25229a80377P6814J85299n1735o8698j4958J75K1130J08183O016j59123n2323
$$ -180377 -103563 81736 30001 -38697 -53655 -53480 -32350 75833 81849 -77274 -129597
25218a29597J00569J01184m1403N4055N3660J07470m3849n0372j62025j07125
$$ -129597 -29028 72156 30753 84808 138468 245938 202089 151717 -10308 -117433
25208a17433r799n7241k2183m971p3058l2304J12631K930l3727Q214J86890O9919
$$ -117433 -127232 -184473 -206656 -211627 -284685 -316989 -204358 -201428 -235155 -226941 -40051 29868
25196B9868n8472n9487J823M4871P418j06018k7486N6146O6408O1944k6439k7112
$$ 29868 -28604 -88091 -86268 -41397 -33979 -139997 -167483 -111337 -44929 17015 -9424 -36536
25184c6536P7349J3176k3112j15619Q1226J21627J0549j28635p3120R1684r3212
$$ -36536 40813 53989 30877 -84742 -3516 118111 128660 25 -73095 18589 -74623
25173g4623m5968l8855L6952N9602J24183o6948o1313J21368P3458j4065K3104
$$ -74623 -120591 -159446 -122494 -62892 61291 -5657 -66970 54398 127856 113791 136895
25162A36895j9614K117j10183n9462j17781O6130o8872l6426O190N9751r034k1997
$$ 136895 117281 119398 9215 -50247 -168028 -101898 -170770 -207196 -201006 -141255 -150289 -172286
25150a72286j0539J09476l9315p4548o4396J42494J18344M3389P6429r3682J0254
$$ -172286 -182825 -73349 -112664 -187212 -251608 -109114 9230 52619 129048 35366 45620
25139D5620M4724j15687L4545Q73j8698p40k3823P0258N8880J54j5644j32727
$$ 45620 90344 -25343 9202 10075 -8623 -9363 -33186 37072 95952 96106 80462 -52265
25127e2265k6025O3522r9104m6783Q940N4358p9943K0561R5068J03452j9327r417
$$ -52265 -78290 -14768 -113872 -160655 -151715 -97357 -177300 -156739 -61671 41781 22454 13037
25115A3037O703o1082J5374J0534J0027j31114m7921Q2833O9769j19266j40O5992
$$ 13037 19740 -41342 -25968 -15434 -5407 -136521 -184442 -101609 -31840 -151106 -151246 -85254
25103h5254j52999q452r2959K0788J38001O7159k6454L6384M752r701K648n4051
$$ -85254 -238253 -246705 -339664 -318876 -180875 -113716 -140170 -103786 -99034 -108735 -106087 -160138
25091a60138Q1867J0287n9331K6707j22672K037K14900m3234j30550K858P5098
$$ -160138 -78271 -67984 -127315 -100608 -223280 -221243 -6343 -49577 -180127 -177269 -102171
25080a02171J35585r6469k1073P0420l141n919o8058M3573M2569Q7996J9689j4768
$$ -102171 33414 -63055 -84128 -13708 -16849 -22768 -90826 -47253 -4684 83312 103001 88233
25068H8233O457j46783j31173j02470N7549R8209J21879Q1786Q0280j06318l4324
$$ 88233 94690 -52093 -183266 -285736 -228187 -129978 -8099 73687 153967 47649 13325
25057A3325n9547k9036K1325J02679l7151p487j47290j68121k1830L624J42213
$$ 13325 -46222 -75258 -53933 48746 11595 4108 -143182 -311303 -333133 -329509 -187296
25046a87296R0847L0556q5527k30028j3501J45804J58893O4938n0929M015j8280
$$ -187296 -96449 -65893 -151420 -381448 -394949 -249145 -90252 -25314 -76243 -72228 -90508
25035i0508O1895R6177k9262n4894o4014L600R7720J3355M1912r2437o8658L7932
$$ -90508 -28613 67564 38302 -16592 -80606 -77006 20714 34069 75981 -16456 -85114 -47182
25023d7182J67127J13325j16837j80499r8445Q5087J42660r5733m3350J6510L6732
$$ -47182 119945 233270 116433 -64066 -162511 -77424 65236 -30497 -73847 -57337 -20605
25012b0605j44738l6212N4878L5981O1197K0336K77n4656j4881m811M3080M2109
$$ -20605 -165343 -201555 -146677 -110696 -49499 -29163 -28886 -83542 -98423 -103234 -60154 -18045
25000a8045K1644q1144n0298J4730O2014J6839M6621J8423n8209M708p679M0609
$$ -18045 3599 -77545 -127843 -113113 -51099 -34260 12361 30784 -27425 -22717 -30396 10213
24988A0213m8824J4207J43523K3306j05937j34400j0209l9202J01920r608o5757
$$ 10213 -38611 -24404 119119 142425 36488 -97912 -108121 -147323 -45403 -55011 -120768
24977a20768Q6111R0178j7680j8676p6293q5223K9682l0183l4687O1576N1918
$$ -120768 -34657 55521 37841 19165 -57128 -142351 -112669 -142852 -177539 -115963 -64045
24966f4045q826K6462l975K1608r1101j0471L1823J1713o972p1842N6696J05298
$$ -64045 -72871 -46409 -50384 -28776 -119877 -130348 -98525 -86812 -93784 -165626 -108930 -3632
24954c632L5384K9180O5791R2177k06264j42003l9059m6675J4814p7152K07090
$$ -3632 31752 60932 126723 218900 12636 -129367 -168426 -215101 -200287 -277439 -70349
24943g0349R2233q3074O9556q0691l6295J9810l8808L7359j9655q1878j13244
$$ -70349 21884 -61190 8366 -72325 -108620 -88810 -127618 -90259 -109914 -191792 -305036
24932c05036l2954K06955J52537n0489n0991r141J49903L9749l6379n0215Q7178
$$ -305036 -337990 -131035 21502 -28987 -79978 -89119 60784 100533 64154 13939 101117
24921A01117O3544N6148p5404j43250j71792l9872J75305K02417l8242r2864l2638
$$ 101117 164661 220809 145405 2155 -169637 -209509 -34204 168213 129971 37107 4469
24910D469p73J53085o6876j75126J7891L4952j32687k5452M268J42990L1140j26120
$$ 4469 3696 156781 89905 -85221 -67330 -32378 -165065 -190517 -186249 -43259 -12119 -138239
24898a38239J8798J78496k7392k6719N1028k7982p735l1964p3353m1125r5137
$$ -138239 -119441 59055 31663 4944 55972 27990 20255 -11709 -85062 -126187 -221324
24887b21324n1042J13863P322K69685m700q8802p5554p8946j7171J49980J33319
$$ -221324 -272366 -158503 -151181 118504 113804 25002 -50552 -129498 -146669 3311 136630
24876A36630l3555p7115n5558j26474L0043J00551L1638J5478P7898l1335J6436
$$ 136630 103075 25960 -29598 -156072 -126029 -25478 6160 21638 99536 68201 84637
24865H4637L327p7230j93501M2511n6730j37374L0272K19967l1517J2888R0129
$$ 84637 87964 10734 -182767 -140256 -196986 -334360 -304088 -84121 -115638 -102750 -12621
24854a2621o6549n3855K9465L6352m3419j92598l2585J42665J35765J61598o7453
$$ -12621 -79170 -133025 -103560 -67208 -110627 -303225 -335810 -193145 -57380 104218 36765
24843C6765q4375k21204j8937J88037J82546n8806m170N1026n2599n4319J9648
$$ 36765 -47610 -268814 -287751 -99714 82832 24026 19856 70882 18283 -36036 -16388
24832a6388K962m0604N4749k9372o5273p4358m5718P3782N0843k3044M0754J30870
$$ -16388 -13426 -54030 719 -28653 -93926 -168284 -214002 -140220 -89377 -112421 -71667 59203
24820E9203p8843m661Q4275L1262r7219k1846k2609j45004L6868J61114J15602
$$ 59203 -19640 -24301 59974 91236 -5983 -27829 -50438 -195442 -158574 2540 118142
24809A18142J5184K6311l0489j9684M2755l1029j0757Q477o6696m4417N3115M6249
$$ 118142 133326 159637 129148 109464 152219 121190 110433 118910 52214 7797 60912 107161
24797A07161j04543n4837O1496l7156j35311Q673N4488Q9675K3021N641j3201
$$ 107161 2618 -52219 9277 -27879 -163190 -154517 -100029 -10354 12667 18308 5107
24786E107j11911k63N3747Q3752J4235p7982K2745o2965q5750K5266J5009m9735
$$ 5107 -106804 -107067 -53320 30432 44667 -33315 -10570 -73535 -159285 -134019 -119010 -168745
24774a68745j46059M8176L3714N136J06501J08809J3910o3217K2824Q3769j20992
$$ -168745 -314804 -266628 -232914 -227778 -121277 -12468 1442 -61775 -38951 44818 -76174
24763g6174l7465j6523n4942O4390J46695J25577m8556j36359j57896n2225l9172
$$ -76174 -113639 -130162 -185104 -120714 25981 151558 103002 -33357 -191253 -243478 -282650
24752b82650J20063n1173L2998K357K8104P6278K29807J54938m6430j37320M5632
$$ -282650 -162587 -213760 -180762 -178405 -150301 -74023 155784 310722 264292 126972 172604
24741A72604N5672j3771q5835q7283j91682j62762l4929K49785J55378j5869q9646
$$ 172604 228276 214505 128670 41387 -150295 -313057 -347986 -98201 57177 41308 -48338
24730d8338O1264j8542o694N4858M962j23925l910k7790M0969n0191r7455P4325
$$ -48338 12926 -5616 -12310 42548 47510 -76415 -80325 -108115 -67146 -117337 -214792 -140467
24718a40467J71676N633k4379R3771j27637p9352l8284n3029q9438J139K13259
$$ -140467 31209 36842 12463 106234 -21403 -100755 -139039 -192068 -281506 -280367 -67108
24707f7108m7050k3155J01519n9425N5916N511j46516j10416J11091J46916J0746
$$ -67108 -114158 -137313 -35794 -95219 -39303 -33792 -180308 -290724 -179633 -32717 -21971
24696b1971o6379J16480j932l3280j4879q560j591J09928k5410j18334N300R1542
$$ -21971 -88350 28130 26198 -7082 -21961 -30521 -32112 77816 52406 -65928 -60628 30914
24684C0914O083L1599J23l3997j72131j12318J8769O3086R2775J15254Q3613j53568
$$ 30914 36997 68596 68719 34722 -137409 -249727 -230958 -167872 -75097 40157 123770 -29798
24672b9798j19810J1825J6102J50249J40684p5109J1931j29672l3595K9122q0514
$$ -29798 -149608 -137783 -121681 28568 169252 94143 106074 -23598 -57193 -28071 -108585
24661a08585j6010j17945K9736N967p2099j6085o2703Q8071J83930m5602j55297
$$ -108585 -124595 -242540 -212804 -206837 -278936 -295021 -357724 -269653 -85723 -131325 -286622
24650b86622L6225N4262j22388R0304J30585N0270j9389J03061K9288p6191J71350
$$ -286622 -250397 -196135 -318523 -228219 -97634 -47364 -66753 36308 65596 -10595 160755
24639A60755j094n9864k0766j17968l7025j3134L4343Q178k5513R6386J17009
$$ 160755 159661 99797 79031 -38937 -75962 -89096 -54753 -46575 -72088 24298 141307
24628A41307k5135L5148Q2915K2192m6806l5675K526r8590j36141j5896o3158
$$ 141307 116172 151320 234235 256427 209621 173946 176472 77882 -58259 -74155 -137313
24617a37313J78919M7121k5602l8839L5170p1558K9566j05587j2370L7387J764
$$ -137313 41606 88727 63125 24286 59456 -12102 17464 -88123 -100493 -63106 -61342
24606f1342o1490Q1527J9240j60397j3164R8284N0834P6697l5648r9344j61629
$$ -61342 -122832 -41305 -22065 -182462 -195626 -97342 -46508 30189 -5459 -104803 -266432
24595b66432R647O1479q011J01375L5635j6864j4468n2649k1597J04895p1473
$$ -266432 -256785 -195306 -203317 -101942 -66307 -83171 -97639 -150288 -171885 -66990 -138463
24584a38463Q637J00546M763P1374m2317k1723j0146j75726l4249L6665m6107
$$ -138463 -129826 -29280 -24517 46857 4540 -17183 -27329 -203055 -237304 -200639 -246746
24573b46746J21111J35934L7786j58642o5110j63181r0675J77228R4797J14089
$$ -246746 -125635 10299 48085 -110557 -175667 -338848 -429523 -252295 -157498 -43409
24563d3409j8842l9444l8396n3529M8475O2964N1664j08055j7441L2505J32781
$$ -43409 -62251 -101695 -140091 -193620 -145145 -82181 -30517 -138572 -156013 -123508 9273
24552I273m8960j4015Q5476n0660j03909j6050O0569j4755J4155j1311O0870J27216
$$ 9273 -39687 -53702 31774 -18886 -122795 -138845 -78276 -93031 -78876 -90187 -29317 97899
24540I7899K2644n824o3793j30947J3381n5971Q2883p1133o3383m948n383j4629
$$ 97899 120543 114719 50926 -80021 -66640 -122611 -39728 -110861 -174244 -179192 -184575 -199204
24528a99204P0763J1382R5487J43552M7585P4522J08095o0294r0639j93890m8569
$$ -199204 -128441 -117059 -21572 121980 169565 244087 352182 291888 201249 7359 -41210
24517d1210N55j22849m0660N6471k1855l8474L062J42071J3049n2728J6838L4142
$$ -41210 -40655 -163504 -204164 -147693 -169548 -208022 -204960 -62889 -49840 -102568 -85730 -51588
24505e1588O8596k85j59260O76m6408O9620N4409L2158q104r050M345p3003J961
$$ -51588 17008 16723 -142537 -141861 -188269 -118649 -64240 -32082 -40186 -49236 -44891 -117894 -115933
24492a15933K2445p3925L2434K2133K8462J13993Q5307r2670n5816j02647k668
$$ -115933 -93488 -167413 -134979 -112846 -84384 29609 114916 22246 -33570 -136217 -138885
24481a38885o6913m4804P3376M957k2712P0205O2616j9849J3497J686J6722P1845
$$ -138885 -205798 -250602 -177226 -172269 -194981 -124776 -62160 -82009 -68512 -66826 -50104 21741
24469B1741J03702j23526K9512J08507k700j02763l3138j2274M0498M8000j7940
$$ 21741 125443 1917 31429 139936 137236 34473 1335 -10939 29559 77559 59619
24458E9619o9731l1733J881Q2599M069m6380l4267J13363O2296o8897Kp5609L8899
$$ 59619 -10112 -41845 -39964 42635 46704 324 -33943 79420 141716 72819 72821 -2788 36111
24445C6111J02147o4617j51833k30265k9968P5614J42952N4451k4445r6131o3029
$$ 36111 138258 73641 -78192 -308457 -338425 -262811 -119859 -65408 -89853 -185984 -249013
24434b49013J54755R2246q0821j0591l9304j38339N4532J78681J35645M9192p8960
$$ -249013 -94258 -2012 -82833 -93424 -132728 -271067 -216535 -37854 97791 146983 68023
24423F8023q7693j86235L199r0210K2975M7950N2411k3816m3022J8309J6670J30137
$$ 68023 -19670 -205905 -202706 -292916 -269941 -221991 -169580 -193396 -236418 -218109 -201439 -71302
24411g1302n269j22223M5442K5789j22241J31431O4685k8587n9927n3524K22377
$$ -71302 -76571 -198794 -153352 -127563 -249804 -118373 -53688 -82275 -142202 -195726 26651
24400B6651M4676j26269q4103O8495J29849p2081l394M1317N9824J9023j19234
$$ 26651 71327 -54942 -139045 -70550 59299 -12782 -16176 25141 84965 103988 -15246
24389a5246j00419m602j3162Q9310q9255j1254M6888j10883K0302N6429J1043
$$ -15246 -115665 -120267 -133429 -44119 -133374 -144628 -97740 -208623 -188321 -131892 -120849
24378a20849j2134J19963O8830M3067l5821M8292j12384j33248Q8641J18053J37538
$$ -120849 -132983 -13020 55810 98877 63056 111348 -1036 -134284 -45643 72410 209948
24367B09948n8352j33036L8546o2948j34680k330j460k4378P3732O1199O6732
$$ 209948 151596 18560 57106 -5842 -140522 -142852 -144312 -168690 -94958 -33759 32973
24356C2973L0812m2387j23857j6818l8589p4048K88707J32986m8675j79821j01768
$$ 32973 63785 21398 -102459 -119277 -157866 -231914 56793 189779 141104 -38717 -140485
24345a40485N2712J8233m9019j0682o2791r4379J2967P2222j4070M5856P2704
$$ -140485 -87773 -69540 -118559 -129241 -192032 -286411 -273444 -201222 -215292 -169436 -96732
24334i6732R4156j7191l3469m7038l0681j44759r9372l2463P613R6760J40579
$$ -96732 -2576 -19767 -53236 -100274 -130955 -275714 -375086 -407549 -399936 -303176 -162597
24323a62597J0471j1951j03179q547P1129p887Q7157O7011N6013k4186p1604m7863
$$ -162597 -152126 -164077 -267256 -275803 -204674 -212561 -125404 -58393 -2380 -26566 -98170 -146033
24311a46033p1127J1375L9590J65716j0542K3956K4469n0015L1085K4136k911
$$ -146033 -217160 -205785 -166195 -479 -11021 12935 37404 -12611 18474 42610 39699
24300C9699k2115P5851N0131J3045q8583O2548r65M1173J6299J53678J01273j15214
$$ 39699 17584 93435 143566 156611 68028 130576 129611 170784 187083 340761 442034 326820
24288C26820j30323j39724j06653l8026n4597p6515M7183J37488J31155k603r3327
$$ 326820 196497 56773 -49880 -87906 -142503 -219018 -171835 -34347 96808 94205 878
24277H78q8391N831M8588j6515r5013J00979J45569O5908O0328j52229q3309N478
$$ 878 -87513 -81682 -33094 -49609 -144622 -43643 101926 167834 228162 75933 -7376 -1898
24265a898K3435R3232J06389O9618k02352j74989q0559J37913J44921n0607r2501
$$ -1898 21537 114769 221158 290776 88424 -86565 -167124 -29211 115710 65103 -27398
24254b7398j7011J17896J14753K6080l8958r2231M3531m7055j23468L2409N0669
$$ -27398 -44409 73487 188240 214320 175362 83131 126662 79607 -43861 -11452 39217
24243C9217n7936m317p4405j06138N6005L5608L0282j7343P6585j0304M5922k8862
$$ 39217 -18719 -23036 -97441 -203579 -147574 -111966 -81684 -99027 -22442 -32746 13176 -15686
24231a5686k8693n1768L7724J44813L2957j15465j7916o7187M6437J70326J3000
$$ -15686 -44379 -96147 -58423 86390 119347 3882 -14034 -81221 -34784 135542 148542
24220A48542q6291j21097l5442J8548p4216k6573R1081J04012P1006j0309J2194
$$ 148542 62251 -58846 -94288 -75740 -149956 -176529 -85448 18564 89570 79261 91455
24209I1455L1289m1145K2976n5227N7685o0118N7676J625j52694K5631O4974j03531
$$ 91455 122744 81599 104575 49348 107033 46915 104591 106216 -46478 -20847 44127 -59404
24197e9404j52431r3485l1385P8646R5261O3676O7208k8127m4989M449J9941M1605
$$ -59404 -211835 -305320 -336705 -258059 -162798 -99122 -31914 -60041 -105030 -100581 -80640 -39035
24185c9035K6855O3204M6007q9921j35924m5078J61719q228l474k4692O5296M7060
$$ -39035 -12180 51024 97031 7110 -128814 -173892 -12173 -20401 -23875 -48567 16729 63789
24173F3789l1140R353j1673k9544l585L3236m7772L8668n9529J9460O6752j9440
$$ 63789 32649 42002 30329 785 -2800 30436 -17336 21332 -38197 -18737 48015 28575
24161B8575j0284L0887N8006k0118l994j81904q6465J52748J97905p3181L5638
$$ 28575 18291 49178 107184 87066 83072 -98832 -185297 -32549 165356 92175 127813
24150A27813J9082Q833m8572j98798L0291J34333Q2845j30803m9277O8363l6985
$$ 127813 146895 155728 107156 -91642 -61351 72982 155827 25024 -24253 44110 7125
24139G125P3978L3884q9612j34301o1941m646J37173L589o3615O1408M1504L9770
$$ 7125 81103 114987 25375 -108926 -170867 -175513 -38340 -34751 -98366 -36958 4546 44316
24127D4316K6414p8024n6767J23499J5813k1772N2451Q386K567M6486j0372N7850
$$ 44316 70730 -7294 -64061 59438 75251 53479 105930 114316 116883 163369 152997 210847
24115B10847p143j10471k07863l6778K9861M0412J9254K1111L1608K9589O5912
$$ 210847 203704 93233 -114630 -151408 -121547 -81135 -61881 -40770 -9162 20427 86339
24104H6339o1234o8507r4849O8525Q4298o694n8549j57355k0426J34646R1920
$$ 86339 25105 -43402 -138251 -69726 14572 7878 -50671 -208026 -228452 -93806 -1886
24093a886N0225K5261m9617k8778o552O276M1188J4902k0700k6604J72130J33656
$$ -1886 48339 73600 23983 -4795 -11347 -5071 36117 51019 30319 3715 175845 309501
24081C09501j84958q5294Q253K6398r1315R1664k3358j05067P2797P7018r7175
$$ 309501 124543 39249 47502 73900 -17415 74249 50891 -54176 18621 95639 -1536
24070a536M7241M4554j8020r2641n3913J574r6594p5506R2530K8038q825q6457
$$ -1536 45705 90259 72239 -20402 -74315 -72741 -169335 -244841 -152311 -124273 -133098 -219555
24058b19555L6376k7234L8950R7919Q2821l7506p2859r7913l0267Q0174O4188
$$ -219555 -183179 -210413 -171463 -73544 9277 -28229 -101088 -199001 -229268 -149094 -84906
24047h4906J2543L7759Q957o5470k6948j45768k7955Q3757J16238j3908m506K8962
$$ -84906 -72363 -34604 -25647 -91117 -118065 -263833 -291788 -208031 -91793 -105701 -110207 -81245
24035h1245m748j2560O2385l8489k02433l0077r0775K1397J57874J07730j14278
$$ -81245 -85993 -98553 -36168 -74657 -277090 -307167 -397942 -376545 -218671 -110941 -225219
24024b25219j34001Q9160K05677O409N114k1410J8488P5278O4115j5932K1719
$$ -225219 -359220 -270060 -64383 -57974 -52860 -74270 -55782 19496 83611 67679 89398
24013H9398j00404j41311K8553P5980j7329L3813J11213o5995k08259P7787L5216
$$ 89398 -11006 -152317 -123764 -47784 -65113 -31300 79913 13918 -194341 -116554 -81338
24002h1338r2924N6213R8278k02020n5293O6251J05712M2104j8113q803J3410
$$ -81338 -174262 -118049 -19771 -221791 -277084 -210833 -105121 -63017 -81130 -89933 -76523
23991g6523o1023r9227L3382J45501N5618p4496j9608l9600J20211q9578j00197
$$ -76523 -137546 -236773 -203391 -57890 -2272 -76768 -96376 -135976 -15765 -105343 -205540
23980b05540J86058N1656k6081J51408k7481j27900l8019j3927o8602Q5940J45659
$$ -205540 -19482 32174 6093 157501 130020 2120 -35899 -49826 -118428 -32488 113171
23969A13171N0930j25224n4752m5550N4459n0634j19739K5608K6961L2571o1171
$$ 113171 164101 38877 -15875 -61425 -6966 -57600 -177339 -151731 -124770 -92199 -153370
23958a53370k8733J71184K9308k3736j16891Q8Q8441k0976r4457q2571q067Q238
$$ -153370 -182103 -10919 18389 -5347 -122238 -122150 -33709 -54685 -149142 -231713 -239780 -231542
23946b31542Q3350R0624P9393J5478k8872Q0874o0725j3303o4728o6776l5357
$$ -231542 -148192 -57568 21825 37303 8431 89305 28580 15277 -49451 -116227 -151584
23935a51584J6118k7324M1315J48914o3218k0932j3871L5527j10473n1272r498
$$ -151584 -135466 -162790 -121475 27439 -35779 -56711 -70582 -35055 -145528 -196800 -206298
23924b06298R5872J03649J26776L7913m9478j3892j65363o7168K8217N9200J2786
$$ -206298 -110426 -6777 119999 157912 108434 94542 -70821 -137989 -109772 -50572 -37786
23913c7786O1535j11773j29043Q6154O2450m6277k9247n2622m435N0812J45463
$$ -37786 23749 -88024 -217067 -130913 -68463 -114740 -143987 -196609 -201044 -150232 -4769
23902d769Q5948j13283p42n3150M0641M9622L6996L3840k0726j18499J0548M6095
$$ -4769 81179 -32104 -32846 -85996 -45355 4267 41263 75103 54377 -64122 -53574 -7479
23890g479L4717l8826K5574R5241k5349q7998n2599N6684k0229j35905n6409L9708
$$ -7479 27238 -11588 13986 109227 83878 -4120 -56719 -35 -20264 -156169 -212578 -172870
23878a72870l180l541M3024P7010M7651M1413Q9281k3973q8279m1422o675N8354
$$ -172870 -176050 -179591 -136567 -59557 -11906 29507 118788 94815 6536 -34886 -41561 16793
23866A6793l9359p5473p6353o7941N2025K6410k1916m5659J19322J5982L0677
$$ 16793 -22566 -98039 -174392 -242333 -190308 -163898 -185814 -231473 -112151 -96169 -65492
23855f5492J10881J7059k2613j19654j9629j108j1475J49835J50718j51719p8449
$$ -65492 45389 62448 39835 -79819 -99448 -100556 -112031 37804 188522 36803 -41646
23844d1646j6942P4204j18984K1981k7355N0085k6442K2124L7982O9532N6737
$$ -41646 -58588 15616 -103368 -81387 -108742 -58657 -85099 -62975 -24993 44539 101276
23833A01276o4128j03431r980N3780o9878l2546N5967J07653R2724K8449j30464
$$ 101276 37148 -66283 -76263 -22483 -92361 -124907 -68940 38713 131437 159886 29422
23822B9422j75933M9696J74362k8158P0229j976k746r1789o4732N869O2209N6122
$$ 29422 -146511 -96815 77547 49389 119618 117642 114896 23107 -41625 -35756 26453 82575
23810H2575K28242q6920J1008n4870j33550j7581k2940N1533o7376p9302l3568
$$ 82575 310817 223897 234905 180035 46485 28904 5964 57497 -9879 -89181 -122749
23799a22749K3459J2380o0241J37882K12276j75165j32339J7839o1676o7776j950
$$ -122749 -99290 -86910 -147151 -9269 203007 27842 -104497 -86658 -148334 -216110 -218060
23788b18060R9025O6450K6399j4524M5402L5867p8120j10502J01717J4696L751
$$ -218060 -119035 -52585 -26186 -40710 4692 40559 -37561 -148063 -46346 -31650 -27899
23777b7899k8726R3623L1338q9800J10421J74123q7103j23536r0597J05495p8671
$$ -27899 -56625 36998 68336 -21464 88957 263080 175977 52441 -38156 67339 -11332
23766a1332j22646j36292k8042K8899P3193J05929J63005M6399p7411j01142o458
$$ -11332 -133978 -270270 -298312 -269413 -196220 -90291 72714 119113 41702 -59440 -65898
23755f5898L9794j0137J7401r8673j17057o569J30245J24480q5731p5109K2825
$$ -65898 -26104 -36241 -18840 -117513 -234570 -241139 -110894 13586 -72145 -147254 -124429
23744a24429M0699l4434j37684Q51J16568j34500K7659L9170k5083M1571J08013
$$ -124429 -83730 -118164 -255848 -254997 -138429 -272929 -245270 -206100 -231183 -189612 -81599
23733h1599j3637K6849l2998K1554P2213k9347j9243R4548J14286l7220j8458
$$ -81599 -95236 -68387 -101385 -79831 -7618 -36965 -56208 38340 152626 115406 96948
23722I6948k7340M5613O9598j2822n6782N966p5163q7174k5524N0946m6301l9809
$$ 96948 69608 115221 184819 171997 115215 121181 46018 -41156 -66680 -15734 -62035 -101844
23710a01844o4814O9867j9136J648N896J32329K8036j6039n4467M6095L3088Q9516
$$ -101844 -166658 -96791 -115927 -114279 -108383 23946 51982 35943 -18524 27571 60659 150175
23698A50175Q4829n4481j38543r0026L9592l2261r3152R3337j7154l8607n7728
$$ 150175 235004 180523 41980 -48046 -8454 -40715 -133867 -40530 -57684 -96291 -154019
23687a54019L9631K5149n117m2571Q4939J12637N2725l3386m0853q5708l4400
$$ -154019 -114388 -89239 -94356 -136927 -51988 60649 113374 79988 39135 -46573 -80973
23676h0973k4730N5518M1781j21225j01325Q3942J11531m9352j80832k4368J09761
$$ -80973 -105703 -50185 -8404 -129629 -230954 -147012 -35481 -84833 -265665 -290033 -180272
23665a80272J29472N2159P7811r686k457M6671k6892k4388L132j532N2686p1877
$$ -180272 -50800 1359 79170 69484 67027 113698 86806 62418 65550 64018 116704 44827
23653D4827p1462j9153Q4383J42154r8872n8323K3959q4525Q7393p9824N0194
$$ 44827 -26635 -45788 38595 180749 81877 23554 47513 -37012 50381 -29443 20751
23642B0751O4312l6461o0762l7270L1759J2440N2809Q5191o02r6696n3127j0627
$$ 20751 85063 48602 -12160 -49430 -17671 -5231 47578 132769 132167 35471 -17656 -28283
23630b8283N7970j35379m3174P8112j11964n2952L2556J61843O6627q056j6984
$$ -28283 29687 -105692 -148866 -70754 -182718 -235670 -203114 -41271 25356 17300 316
23619C16j02078L5072j0537L1662N5088j6354n0751K6843O2019R2544j11998O2531
$$ 316 -101762 -66690 -77227 -45565 9523 -6831 -57582 -30739 31280 123824 11826 74357
23607G4357K0329j00537o6255L6157m4042r0916J45556L5210j27821q9278N3308
$$ 74357 94686 -5851 -72106 -35949 -79991 -170907 -25351 9859 -117962 -207240 -153932
23596a53932K9290P3826L4103M8331M3542q2553j29943k7178N5074L6552L119
$$ -153932 -124642 -50816 -16713 31618 75160 -7393 -137336 -164514 -109440 -72888 -69769
23585f9769j20039j09141J41478J97917l0828j16892K6663N4950j0640j18076
$$ -69769 -189808 -298949 -157471 40446 9618 -107274 -80611 -25661 -36301 -154377
23575a54377k3763J26459M7360J1505J11517k0991L2135O2580q5503j76997N504
$$ -154377 -178140 -51681 -4321 7184 118701 97710 129845 192425 106922 -70075 -64571
23564f4571O3916j34308M494J01181J11235k4135L4891l1147q7879N7200O9098
$$ -64571 -655 -134963 -130469 -29288 81947 57812 92703 61556 -26323 30877 99975
23553I9975o9998l2144j6430n617m3931p4744j11155j02268N7140j435J9099J01723
$$ 99975 29977 -2167 -18597 -24214 -68145 -142889 -254044 -356312 -299172 -300607 -281508 -179785
23541a79785J13021P012J05866O3714j51820j23588m1797N7393J23825K0772L3475
$$ -179785 -66764 -59752 46114 109828 -41992 -165580 -207377 -149984 -26159 -5387 28088
23530B8088K7872o1110m4538O7918R24o9931J29237k0326j781J27315m8737j07029
$$ 28088 55960 -5150 -49688 18230 19154 -50777 78460 58134 56353 183668 134931 27902
23518B7902L2822m5604j60341L2039J1616o1622J0635M7700o3460j03330J13750
$$ 27902 60724 15120 -145221 -113182 -101566 -163188 -152553 -104853 -168313 -271643 -157893
23507a57893K1334J4594j9582L5603O2593O2114L005K359l4535l9376K2508o6461
$$ -157893 -136559 -121965 -141547 -105944 -43351 18763 21768 24127 -10408 -49784 -27276 -93737
23495i3737l7307J048R2015J35394k9459j47420m9415J3740Q9777M4384k2625
$$ -93737 -131044 -129996 -37981 97413 67954 -79466 -128881 -115141 -25364 19020 -3605
23484c605j2682j07418J71361Q0671k361L2268j24111j25942K01908L6524m0328
$$ -3605 -16287 -123705 47656 128327 125966 158234 34123 -91819 110089 146613 106285
23473A06285L0907j01104p4084m1235j26971l731J16650L9311P9586l1655j02004
$$ 106285 137192 36088 -37996 -79231 -206202 -209933 -93283 -53972 25614 -6041 -108045
23462a08045J12020o4741j51321L4089N1438r0073k1575j30394j15384J73162
$$ -108045 3975 -60766 -212087 -177998 -126560 -216633 -238208 -368602 -483986 -310824
23452c10824K14514r4818L211P0110R6773L643r9763J03835M2141j1144M546k9660
$$ -310824 -96310 -191128 -187917 -117807 -21034 -17391 -117154 -13319 28822 17678 22224 -7436
23440g436O173J24364n334j51281o2239N5624R9915O5152Q0010J8799o1250j12416
$$ -7436 -1263 123101 117767 -33514 -95753 -40129 59786 124938 204948 223747 162497 50081
23428E0081n9620K7108l592L6984Q6335j43952m7789O9194J15349n0765j60185
$$ 50081 -9539 17569 13977 50961 137296 -6656 -54445 14749 130098 79333 -80852
23417h0852L840L3609J03714N2842k7243j15069q2447m2734J34939J02218J7210
$$ -80852 -77012 -43403 60311 113153 85910 -29159 -111606 -154340 -19401 82817 100027
23406A00027p1048N2466J66375o4770l7316M3172o4374k6741m5265p1543p0972
$$ 100027 28979 81445 247820 183050 145734 188906 124532 97791 52526 -19017 -89989
23395h9989J09677O1234j7346L1090R7370m5526k889j50124o3173J10621j16767
$$ -89989 19688 80922 63576 94666 192036 146510 143621 -6503 -69676 40945 -75822
23384g5822p6093P8630r201k3166o2955m17k4686Q4818J08324o3267m5001n9380
$$ -75822 -151915 -73285 -82486 -105652 -168607 -169024 -193710 -108892 -568 -63835 -108836 -168216
23372a68216k6944N560J4056K8880j3010J3533N1993q3472P5687O6634M8062j12648
$$ -168216 -195160 -189600 -175544 -146664 -159674 -146141 -94148 -177620 -101933 -35299 12763 -99885
23360i9885J1242J19242M953j30500L5500R8668N6316L81o0691j0374J31854N3458
$$ -99885 -88643 30599 35552 -94948 -59448 39220 95536 95917 35226 24852 156706 210164
23348B10164r2782r5792r2872l322K18238M8239l1746j45017k030q3237q7516
$$ 210164 117382 21590 -71282 -74604 143634 191873 160127 15110 13080 -70157 -157673
23337a57673N45J32883R0221j1072R160K7339r3433P1672Q6925m1807q4870J36225
$$ -157673 -157128 -24245 65976 54904 64064 91403 -2030 69642 156567 114760 29890 166115
23325A66115J41861O7563o7612j32803K9720q8018k35488q5329j2618J55386N4547
$$ 166115 307976 375539 307927 175124 204844 116826 -118662 -203991 -216609 -61223 -6676
23314f676K7373k347Q3791M3519M4556l5162J16773m2746j09157j09284J06411
$$ -6676 20697 18350 102141 145660 190216 155054 271827 229081 119924 10640 117051
23303A17051L9847p2829O03n1390j61639o8790l4654K9789J28918P0220n8836
$$ 117051 156898 84069 84672 33282 -128357 -197147 -231801 -202012 -73094 -2874 -61710
23292f1710o4026O5701J07637M7411n5954m7338O635O0077p0223k42150O3595
$$ -61710 -125736 -60035 47602 95013 39059 -8279 -1644 58433 -11790 -253940 -190345
23281a90345K00812L7137J02984j20858l4033L2418n4296q9076j3561J23404Q0224
$$ -190345 10467 47604 150588 29730 -4303 28115 -26181 -115257 -128818 -5414 74810
23270G4810q0536P5749n4713L9427J64879m5081r2089l0265j2157K9987N265M7127
$$ 74810 -5726 70023 15310 54737 219616 174535 82446 52181 40024 70011 75276 122403
23258A22403j72423o4353J89658J44197j03707r0582j2080j9938n7019l4575q234
$$ 122403 -50020 -114373 75285 219482 115775 25193 13113 -6825 -63844 -98419 -106653
23247a06653j6928K37988R6983q1827j55788P9598P8520N0271q2182p5767L6563
$$ -106653 -123581 114407 211390 129563 -26225 53373 131893 182164 99982 24215 60778
23236F0778Q0639o5786j21780K9244R4362r2955j29306N5167M30J94698j9909
$$ 60778 141417 75631 -46149 -16905 77457 -15498 -144804 -89637 -89207 105491 85582
23225H5582k6427K0567N570L2634j5314K8005M6708m162K8208M2960p5825k07286
$$ 85582 59155 79722 85292 117926 102612 130617 177325 173163 201371 244331 168506 -38780
23213c8780q7348R5476r165P8336Q0422p0304j6125j9956M1211R3485q1807m8052
$$ -38780 -126128 -30652 -39817 38519 118941 48637 32512 12556 53767 147252 65445 17393
23201A7393L5002k2532N3305K10120J06614q3893j84599n9445o070l3894M3856
$$ 17393 52395 29863 83168 293288 399902 316009 131410 71965 65895 32001 75857
23190G5857J5510p602r727j19639l2026J08234J07393L2671j00087r8917l3618
$$ 75857 91367 83765 74038 -45601 -77627 30607 138000 170671 70584 -28333 -61951
23179f1951k9838L6157r147K663j80836M2403R2188K8112J25439n3332L3263Q3534
$$ -61951 -91789 -55632 -64779 -62116 -242952 -200549 -108361 -80249 45190 -8142 25121 108655
23167A08655r1157o4998N3903J58194M6282k05083J3998J50902j1245O7028j2751
$$ 108655 17498 -47500 6403 164597 210879 5796 19794 170696 159451 226479 213728
23156B13728k22179m4514P8676J4626j2489J86832M4579j07237M3859l6727j15962
$$ 213728 -8451 -52965 25711 40337 27848 214680 259259 152022 195881 159154 43192
23145D3192j12158J00439J83117p0708o1152q3091J912j00594L802K5185N0048
$$ 43192 -68966 31473 214590 143882 82730 -361 1551 -99043 -95241 -70056 -20008
23134b0008L837K2273P3623m8102q1128n4668P3786K4274L3922J42264N0105m6379
$$ -20008 -16171 6102 79725 31623 -49505 -104173 -30387 -6113 27809 170073 220178 173799
23122A73799j53700p4083K952J20042M2929Q8518J7981k23848O1517M0438k0368
$$ 173799 20099 -53984 -51032 69010 111939 200457 218438 -5410 56107 96545 76177
23111G6177j7316P8k3103J16323j6533j37030l9754N7277J02542j1389K6782k9173
$$ 76177 58861 58939 35836 152159 135626 -1404 -41158 16119 118661 107272 134054 104881
23099A04881L1662P3623n0575k3664Q5719l9094O5232K792j53134r4470J09764
$$ 104881 136543 210166 159591 135927 221646 182552 247784 250576 97442 2972 112736
23088A12736N7900J46966o529n1578n1170M1820k1714o6361p1852P2862J43267
$$ 112736 170636 317602 311073 259495 208325 250145 228431 162070 90218 163080 306347
23077C06347J54268K09040J07500q130P5285K02923L64533M32204K75618K94145
$$ 306347 460615 669655 777155 769025 844310 1047233 1411766 1843970 2119588 2413733
23067B413733K38029l1795j53510j35925r7411j68386l18751l25553k96727k90197
$$ 2413733 2651762 2619967 2466457 2330532 2233121 2064735 1745984 1420431 1123704 833507
23057H33507j63185p5299r4389r3150M9465n1998M1303J77817j46045j17723j20175
$$ 833507 670322 595023 500634 407484 456949 404951 446254 624071 478026 360303 240128
23046B40128j69027K692J19279R5203P5651l1372n1699K0255k2622o0138j54966
$$ 240128 71101 73793 193072 288275 363926 332554 280855 301110 278488 218350 63384
23035F3384m7381J28659R6940K6582m5740p4895Q2093l7160j22732k3829J25462
$$ 63384 16003 144662 241602 268184 222444 147549 229642 192482 69750 45921 171383
23024A71383m1145j53974m3518m7805k182M5100J7137j20779K756P5256R1504
$$ 171383 130238 -23736 -67254 -115059 -117241 -72141 -55004 -175783 -173027 -97771 -6267
23013f267R3680Q6479M5798k792j38400l1931O5238O348L5906m900j00327K0389
$$ -6267 87413 173892 219690 216898 78498 46567 111805 118153 154059 149159 48832 69221
23001F9221M2343j8306j379l2410k6825L6092J4506j10661O9262P3681J3706r8943
$$ 69221 111564 93258 91879 59469 32644 68736 83242 -27419 41843 115524 129230 30287
22989C0287L1069O5949o3075O5137R3038Q142P210j05821j47395K8254L5154N0756
$$ 30287 61356 127305 64230 129367 222405 230547 237757 131936 -15459 12795 47949 98705
22977I8705J17279j17096n692K53084L2330n8404k1230M8359N8611j21548r5696
$$ 98705 215984 98888 93196 346280 378610 320206 298976 347335 405946 284398 188702
22966A88702r1585N9069q0521j63028J1626Q3477n0436o8060J37187k3403l6978
$$ 188702 97117 156186 75665 -87363 -75737 7740 -42696 -110756 26431 3028 -33950
22955c3950l666m3221l8615K32087M7451m1602P8400j65950p9498R600J32978
$$ -33950 -37616 -80837 -119452 112635 160086 118484 196884 30934 -48564 -38964 94014
22944I4014N9344n1328p554k9742r0807k4088J71369R0070J7601k07101j62977
$$ 94014 153358 102030 94476 64734 -26073 -50161 121208 211278 228879 21778 -141199
22933a41199M5047N240N1455m3266P9527J89693j0683M126M1014n2966o3496P4162
$$ -141199 -96152 -90912 -39457 -82723 -3196 186497 175814 179940 220954 167988 104492 178654
22921A78654l9081k474p0281J0998K6463j19160J397r686o0035P2124k3418j6951
$$ 178654 139573 137099 66818 77816 104279 -14881 -13484 -23170 -83205 -11081 -34499 -51450
22909e1450J19869L3661R1479P3549m1905O513j39022l5062j7557j0277N6653
$$ -51450 68419 102080 193559 267108 225203 231716 92694 57632 40075 29798 86451
22898H6451o8116l7901r5795k8090J06421q1186N8575K14491O2107j3849j37055
$$ 86451 18335 -19566 -115361 -143451 -37030 -118216 -59641 154850 216957 203108 66053
22887F6053n5231j3299J0491Q4515M9755k1203j39955P7568J68839p558p2822
$$ 66053 10822 -2477 8014 92529 142284 121081 -18874 58694 227533 219975 147153
22876A47153n262k379j07987K2923r2693j19149J8416J20515J74974N0087n791
$$ 147153 141891 139512 31525 54448 -38245 -157394 -138978 -18463 156511 206598 200807
22865B00807o0789r366k2712L1498L6727r8881q1045J33186l058r2948p0011j12550
$$ 200807 140018 130652 107940 139438 176165 77284 -3761 129425 126367 33419 -36592 -149142
22853a49142Q3250K0727L6380P4115O3714l2503o7372j4693j1409q7703J09721
$$ -149142 -65892 -45165 -8785 65330 129044 96541 29169 14476 3067 -84636 25085
22842B5085J12808R5316L3002j5159o4361j8277K890k1882j6243j16772O1132
$$ 25085 137893 233209 266211 251052 186691 168414 171304 149422 133179 16407 77539
22831G7539M1072j25870K1806J75196N2856r9876l5617l0341o0184L4853r1381
$$ 77539 118611 -7259 14547 189743 242599 142723 107106 76765 16581 51434 -39947
22820c9947l4641p8538N1298J191K2126J99110N4617k2870n6641O226J22364J34251
$$ -39947 -74588 -153126 -101828 -100637 -78511 120599 175216 152346 95705 101931 224295 358546
22808C58546q8735j7096J36037q5276j40832o2741K4904P2674J37907m7564n6277
$$ 358546 269811 252715 388752 303476 162644 99903 124807 197481 335388 287824 231547
22797B31547j0402O262L9214o8552J9933m5372J4454j23348o7947J46969O9613
$$ 231547 221145 227407 266621 198069 218002 172630 187084 63736 -4211 142758 212371
22786B12371j8244P8123J3441q0810l9008j9062q763O9052N0724j3737J19399
$$ 212371 194127 272250 285691 204881 165873 146811 138048 207100 257824 244087 363486
22775C63486K9923L1119k808n6909r1240j64980q4801J59914J4714M1882j6101
$$ 363486 393409 424528 421720 364811 273571 108591 23790 183704 198418 240300 224199
22764B24199J712J83935K3776p3135L3223L2290o205m0208J08271p456j8385J33283
$$ 224199 225911 409846 433622 360487 393710 426000 419795 379587 487858 480402 462017 595300
22752E95300M2482J0393K3679o8356J19086J8404m115o6718k4380q0002r5763
$$ 595300 637782 648175 671854 603498 722584 740988 736873 670155 645775 565773 470010
22741D70010k8258j10319k0068J59210Q2647j13010n1502K0417J18796j8618j38027
$$ 470010 441752 331433 311365 470575 553222 440212 388710 409127 527923 509305 371278
22730C71278p8902J7391L0616L2281n1422j06255r0085L029M6828O5928J6706
$$ 371278 292376 309767 340383 372664 321242 214987 124902 127931 174759 240687 257393
22719B57393j32348n0373J01710O0037r4899o5255m5355K8970O451l741Q9566
$$ 257393 125045 74672 176382 236419 141520 76265 30910 59880 66331 62590 152156
22708A52156R3713J9836J27644l3989P5379L3707q5771j7681q1667K6255N4010
$$ 152156 245869 265705 393349 359360 434739 468446 382675 364994 283327 309582 363592
22697C63592N4232R7614q2496n1951r0383l8463j67513j6710Q7751N9379M4450
$$ 363592 417824 515438 432942 380991 290608 252145 84632 67922 155673 215052 259502
22686B59502m0874l3313J11472M7143o38J29333J553r4377k8638O365M1505O3086
$$ 259502 218628 185315 296787 343930 343292 472625 474178 379801 351163 357528 399033 462119
22674D62119O3123l9968m5978M9109J05307M799Q2874q64K6870p3395l4775P5153
$$ 462119 525242 485274 439296 488405 593712 598511 681385 680521 707391 633996 599221 674374
22662F74374J4091j18979K8256N0489j29761j70715j05263J04387O7882N8733
$$ 674374 688465 569486 597742 648231 518470 347755 242492 346879 414761 473494
22652D73494R6423j1703k4239J05147J5692j16332n6639N7147j180M7761Q4294
$$ 473494 569917 558214 533975 639122 654814 538482 481843 538990 537810 585571 669865
22641F69865j23661o9648K4542M9851P0990J35253O1738o420J78428J86042O5365
$$ 669865 546204 476556 501098 550949 621939 757192 818930 812510 990938 1176980 1242345
22630A242345M2234Q154J45264J76325R2111N5951J64877j02883r4037n5445N215
$$ 1242345 1284579 1292733 1437997 1614322 1706433 1762384 1927261 1824378 1730341 1674896 1680111
22619A680111r202p8561l9824p1241P3258N214j18145m8795o262J9627L0669J63820
$$ 1680111 1670909 1592348 1552524 1481283 1554541 1559755 1441610 1392815 1386553 1406180 1436849 1600669
22607A600669J79635P946O7729R8387J21490M2857o7871j54378q6181Q8158j3760
$$ 1600669 1780304 1788250 1855979 1954366 2075856 2118713 2050842 1896464 1810283 1898441 1884681
22596A884681j72144j14317m8280q3204j0925j05300p5677J09254J87583N9882
$$ 1884681 1712537 1598220 1549940 1466736 1455811 1350511 1274834 1384088 1571671 1631553
22586A631553J26364J39408j622P2266K75488L53801M67691M85661L91138L46951
$$ 1631553 1757917 1897325 1895703 1967969 2243457 2597258 3064949 3550610 3941748 4288699
22576D288699Q8870n0153n5222j57582l15473m50671k66352k64291k88623k00638
$$ 4288699 4377569 4327416 4272194 4114612 3799139 3348468 3082116 2817825 2529202 2328564
22566B328564m4558K6429j30185N3253Q9272M0232j7878j27534n179L4023k4018
$$ 2328564 2284006 2310435 2180250 2233503 2322775 2363007 2345129 2217595 2212416 2246439 2222421
22555B222421M0904J18808Q7053n9294p449j212J22036J07671M6889N272R3692
$$ 2222421 2263325 2382133 2469186 2409892 2402443 2401231 2523267 2630938 2677827 2683099 2776791
22544B776791J12692K64579L47189J04513J0590M1905K64250K77049K16349J50363
$$ 2776791 2889483 3154062 3501251 3605764 3616354 3658259 3922509 4199558 4415907 4566270
22534D566270L09276M40600K84358L59248M86772N04386L25290L91809M18736
$$ 4566270 4875546 5316146 5600504 5959752 6446524 6950910 7276200 7668009 8086745
22525H086745N36285O54708Q03730R22796J035366J367101J482094J704170J731068
$$ 8086745 8623030 9277738 10081468 11004264 12039630 13406731 14888825 16592995 18324063
22516A8324063J918811K529463L122809L571275M570593N992860P930063J0786153
$$ 18324063 20242874 22772337 25895146 29466421 34037014 40029874 47959937 58746090
22508E8746090J5556239K3460349L6184078N0558154N9784572O6099902P2580681
$$ 58746090 74302329 97762678 133946756 184504910 244289482 310389384 382970065
22501C82970065O8712717N0604189K4807633K977708j6878037m0886334n6004120
$$ 382970065 451682782 502286971 527094604 530072312 513194275 472307941 416303821
22494D16303821o0007799o0285702n3560166m2441553l2733873k5977110k0786785
$$ 416303821 356296022 296010320 242450154 200008601 167274728 141297618 120510833
22487A20510833j6200226j2624591j0248117q326717o769089n748788n005467
$$ 120510833 104310607 91686016 81437899 73111182 66342093 60593305 55587838
22480E5587838m426342l851109l336816k944999k664935k491023k246576j955251
$$ 55587838 51161496 47310387 43973571 41028572 38363637 35872614 33626038 31670787
22472C1670787j681790j626709j346864j166343q94016p62947o99670n79980m76312
$$ 31670787 29988997 28362288 27015424 25849081 24955065 24192118 23492448 22912468 22436156
22463B2436156m68991p34261q24935q38923p96476r00874q39986r18288o71500
$$ 22436156 21967165 21232904 20407969 19569046 18772570 17871696 17031710 16113422 15441922
22454A5441922n39991o69247o12402m07352m30650m44126l60960n24715l59485
$$ 15441922 14901931 14232684 13620282 13212930 12782280 12338154 11977194 11452479 11092994
22445A1092994l10262k01071l34302l93748l09845k88638j27372l27460l48864
$$ 11092994 10782732 10581661 10247359 9853611 9543766 9255128 9127756 8800296 8451432
22436H451432j73357k15949k20348j17882k23836k11308j54823J5226K1551j20566
$$ 8451432 8278075 8062126 7841778 7723896 7500060 7288752 7133929 7149155 7170706 7050140
22426G050140P8948J33146Q6882N9519J79641L36000J41101k33926k00371k93686
$$ 7050140 7129088 7262234 7349116 7408635 7588276 7924276 8065377 7831451 7631080 7337394
22416G337394m71204m76813n84548k80682k08603l23797l07246k33986k65229
$$ 7337394 6866190 6389377 5804829 5524147 5315544 4991747 4684501 4450515 4185286
22407D185286k54613k18086j01406q8499J1639j05119j01935j42938j18540l8786
$$ 4185286 3930673 3712587 3611181 3522682 3534321 3429202 3327267 3184329 3065789 3027003
22397C027003j89765j54681l5822j51953j55884n6910L3299J26543k6864j14398
$$ 3027003 2837238 2682557 2646735 2494782 2338898 2281988 2315287 2441830 2414966 2300568
22387B300568j6894j09493k04334j30091k35506k14482k464o3767r004j14354
$$ 2300568 2283674 2174181 1969847 1839756 1604250 1389768 1387304 1323537 1314533 1200179
22377A200179k12098j22l0302o5538j30125j05407K2328j5813o2977m6250j75956
$$ 1200179 988081 987959 957657 892119 761994 656587 678915 663102 600125 553875 377919
22366C77919K5644R7088j1075N2448m1719J37406k6477O093n6263l4799j5962
$$ 377919 403563 500651 489576 542024 500305 637711 611234 617327 561064 526265 510303
22355E10303r8758K1455P3427N687r4076M6391K0478J6906J2505k44980r9431
$$ 510303 411545 433000 506427 512114 418038 464429 484907 501813 514318 269338 169907
22344A69907P9429L2414K2229j8482n2712J1983J1412J42700o3471j29141p4991
$$ 169907 249336 281750 303979 285497 232785 244768 256180 398880 335409 206268 131277
22333A31277P8504j7593J66287J42011j02084r9516O1608J53032J02646N7323
$$ 131277 209781 192188 358475 500486 398402 298886 360494 513526 616172 673495
22323F73495q3698l5747q8845m2959q9280L6069M6291J72373J01664l3541n1292
$$ 673495 589797 554050 465205 422246 332966 369035 415326 587699 689363 655822 604530
22312F04530n6339r9033J51225l1027j29792l0708j41101j6038J31174L5234K4737
$$ 604530 548191 449158 600383 569356 439564 408856 267755 251717 382891 418125 442862
22301D42862m3316n5337n4568o0616L26M9452J19187L3368m9732J21292j77515
$$ 442862 399546 344209 289641 229025 229351 278803 397990 431358 381626 502918 325403
22290C25403j13920R2048R1455J66920m7761O7557K907n9550k10589p3086k0578
$$ 325403 211483 303531 394986 561906 514145 581702 584609 525059 314470 241384 220806
22279B20806L4034O2763P0403R1853l0593R4011j48751p2374l604l3178j20492
$$ 220806 254840 317603 388006 479859 449266 543277 394526 322152 318548 285370 164878
22268A64878o9415L6260L8583J2886j62985m6120j06353J27457R4108n6586P1340
$$ 164878 95463 131723 170306 183192 20207 -25913 -132266 -4809 89299 32713 104053
22257A04053o8733p9811N0128J17530Q9236l4970J6393k4580j47414j18851m0862
$$ 104053 35320 -44491 5637 123167 212403 177433 193826 169246 21832 -97019 -137881
22246a37881J11149K2603K3206o5566O7032M6461N658j00331J4961N0485j03274
$$ -137881 -26732 -4129 19077 -46489 20543 67004 72662 -27669 -12708 37777 -65497
22235f5497J53975M0719m2680p7657R9800J01400n0336p6655L4015n3917o6072
$$ -65497 88478 129197 86517 8860 108660 210060 159724 83069 117084 63167 -2905
22224b905J02158P5640j28934k22793L7106O144L3851O4823O782j6138o2516M7667
$$ -2905 99253 174893 45959 -176834 -139728 -133584 -99733 -34910 -28128 -44266 -106782 -59115
22212e9115M0538O0008n6641l7969J9551l8743k8505j26262k6283K548l0011K8373
$$ -59115 -18577 41431 -15210 -53179 -33628 -72371 -100876 -227138 -253421 -250873 -280884 -252511
22200b52511q193O5161K3357p1544m8602m4845J67516N5408O1416k1917K1948
$$ -252511 -260704 -195543 -172186 -243730 -292332 -337177 -169661 -114253 -52837 -74754 -52806
22189e2806j97789l6253J70551J29197r3224j5252M4399M8589o9068o556M2953
$$ -52806 -250595 -286848 -116297 12900 -80324 -95576 -51177 -2588 -71656 -78212 -35259
22178c5259q0602n1506J5933n5557j06846o1248j7836Q2386R085l7782J58333
$$ -35259 -115861 -167367 -151434 -206991 -313837 -375085 -392921 -310535 -301450 -339232 -180899
22167a80899K55326K848j04332j14480J5997K4027q536q3583L7588P7349K7361
$$ -180899 74427 77275 -27057 -141537 -125540 -101513 -110049 -193632 -156044 -78695 -51334
22156e1334o035N650J22857j6862l5057k0620j94725o0874Q8275L1928p0593P5861
$$ -51334 -57369 -51719 71138 54276 19219 -1401 -196126 -257000 -168725 -136797 -207390 -131529
22144a31529o1741P2450J66524K2769n320o7869J6948n8081j38120r1200P0980
$$ -131529 -193270 -120820 45704 68473 63153 -4716 12232 -45849 -183969 -275169 -204189
22133b04189R9457j23408j04001l0123O8577Q3627Q1380M4702J6249m1049M7282
$$ -204189 -104732 -228140 -332141 -362264 -293687 -210060 -128680 -83978 -67729 -108778 -61496
22122f1496P5621J510l4702P1882k7795j47353N2664L1806L2556J1264P6676m8988
$$ -61496 14125 15635 -19067 52815 25020 -122333 -69669 -37863 -5307 5957 82633 33645
22110C3645n9714l4886M7567Q6229O362j0287r8678L1680n1813r0176J14630K0743
$$ 33645 -26069 -60955 -13388 72841 79203 68916 -29762 1918 -49895 -140071 -25441 -4698
22098d698j73615o2866r2494Q6341M8946o8853N4488K16209m2514j54988m9838
$$ -4698 -178313 -241179 -333673 -247332 -198386 -267239 -212751 3458 -39056 -194044 -243882
22087b43882M0746k529L7222K1845r158n0427O021m1916o7953n1197M7127O5927
$$ -243882 -203136 -205665 -168443 -146598 -155756 -206183 -200162 -242078 -310031 -361228 -314101 -248174
22075b48174M8629r543O681J1594m8097N9404N6892l5173n305K071L709M698m118
$$ -248174 -199545 -209088 -202407 -190813 -238910 -179506 -122614 -157787 -163092 -161021 -157312 -152614 -156732
22062a56732O9645P8996K4902j49036j20257L6971O0559P6835j482R6220J17547
$$ -156732 -87087 -8091 16811 -132225 -252482 -215511 -154952 -78117 -79599 16621 134168
22051A34168q6060q5240m2385p9632l6360o4246j9575k281L1830J50025K9740
$$ 134168 48108 -37132 -79517 -159149 -195509 -259755 -279330 -281611 -249781 -99756 -70016
22040g0016J24336j7172k23017j14826R3955P0197J39802j19201l4859J37058
$$ -70016 54320 37148 -185869 -300695 -206740 -136543 3259 -115942 -150801 -13743
22030a3743M5301j3690p5313k5285Q4317J43520N8312M6625q5540j40452n6942
$$ -13743 31558 17868 -57445 -82730 1587 145107 203419 250044 164504 24052 -32890
22019c2890n6253N6375l4574m0950J01435M5395P6927n7706j60331o0625O4894
$$ -32890 -89143 -32768 -67342 -108292 -6857 38538 115465 57759 -102572 -163197 -98303
22008i8303q389p7236P3606O4554j32921N7754O4074j41240k9957Q2564J53871
$$ -98303 -106692 -183928 -110322 -45768 -178689 -120935 -56861 -198101 -228058 -145494 8377
21997H377L373j03904j27077q4111M9773J79792R0363O9846O6048j70978j35706
$$ 8377 11750 -92154 -219231 -303342 -253569 -73777 16586 86432 152480 -18498 -154204
21986a54204Q7406J59977j5950j01723J9697o3568R8340J28939j23704j70785
$$ -154204 -66798 93179 77229 -24494 -4797 -68365 29975 158914 35210 -135575
21976a35575k31255N0222J90444Q7303q656o9193L9178N3032n3161O5379M5870
$$ -135575 -366830 -316608 -126164 -38861 -47517 -116710 -77532 -24500 -77661 -12282 33588
21965C3588N9805p9965j62923J4959J64221L5336k1860k7103J47959m376j0630
$$ 33588 93393 13428 -149495 -134536 29685 65021 43161 16058 164017 159641 149011
21954A49011p8395j04553n0264M1806K9071j1424J17118J21382N0106m9280j33679
$$ 149011 70616 -33937 -84201 -42395 -13324 -24748 92370 213752 263858 214578 80899
21943H0899l4894L4721k9655n7395J71545N2570M7718K1648K7729K2335N6490
$$ 80899 46005 80726 51071 -6324 165221 217791 265509 287157 314886 337221 393711
21932C93711K0545j3005R3863J21989J05202K44135K94651L86389K69505J36016
$$ 393711 414256 401251 495114 617103 722305 966440 1261091 1647480 1916985 2053001
21922B053001J16272O9820J00259n9293r2717j76531l61954j97666l02074k16021
$$ 2053001 2169273 2239093 2339352 2280059 2187342 2010811 1648857 1451191 1149117 933096
21912I33096j58858j20909Q912o9869k15998r2557n7788j8846j3611P306j19767
$$ 933096 774238 653329 662241 592372 376374 283817 226029 207183 193572 200878 81111
21901H1111Q9153M7940K6987Q7937q3139j23130j52414P3594Q9820M3851j28812
$$ 81111 170264 218204 245191 333128 249989 126859 -25555 48039 137859 181710 52898
21890E2898k33171o9695Q6125K2039k8242J15041J14830O4532l6340l7459L705
$$ 52898 -180273 -249968 -163843 -141804 -170046 -55005 59825 124357 88017 50558 54263
21879E4263J3495m9769o8107M8235J4403L7582j83420J4466J5033J2333L1672
$$ 54263 67758 17989 -50118 -1883 12520 50102 -133318 -118852 -103819 -91486 -59814
21868e9814K145Q630k1373J06421M0835j5307M0079M9185l557M4693N1037O570
$$ -59814 -57669 -49039 -70412 36009 76844 61537 101616 150801 147244 191937 242974 249544
21856B49544p2235p4171o2466j96491m5938J98979M9927j66520n5698J41449o8031
$$ 249544 177309 103138 40672 -155819 -201757 -2778 47149 -119371 -175069 -33620 -101651
21845a01651l7276R7071j55262r7093J97085J44056n6933j0957M1038K5749j04042
$$ -101651 -138927 -41856 -197118 -294211 -97126 46930 -10003 -20960 20078 45827 -58215
21834e8215l9446K9664k5020K5580K1681L1271j03897N9868N1409o1252l1243
$$ -58215 -97661 -67997 -93017 -67437 -45756 -14485 -118382 -58514 -7105 -68357 -99600
21823i9600K5211n7726l3558J72827q5261J4009O3839k5723j39841j18075J28135
$$ -99600 -74389 -132115 -165673 7154 -78107 -64098 -259 -25982 -165823 -283898 -155763
21812a55763J72590J0026K1479J15540j61088m9114J23094l6321J766n8820l3998
$$ -155763 16827 26853 48332 163872 2784 -46330 76764 40443 42209 -16611 -50609
21801e0609o3021n4843q110J58780r9909J7054J50141j32096q5816N4185Q0507
$$ -50609 -113630 -168473 -176583 -17803 -117712 -100658 49483 -82613 -168429 -114244 -33737
21790c3737N2305m5168P1815J22803m6999k43032N5890p5373j58813J7182N7091
$$ -33737 18568 -26600 45215 168018 121019 -122013 -66123 -141496 -300309 -283127 -226036
21779b26036L9364K083q1701j02998k0521N1869J01125J55946J16771k3972p9909
$$ -226036 -186672 -184589 -266290 -369288 -389809 -337940 -236815 -80869 35902 11930 -67979
21768f7979j7306k0535O4024M2280j54493j83966J7960J65810J7328M6138J32283
$$ -67979 -85285 -105820 -41796 484 -154009 -337975 -320015 -154205 -136877 -90739 41544
21757D1544J1109j27758k5528j6869N6764P1386K3185K8109l9526q7070j7101
$$ 41544 52653 -75105 -100633 -117502 -60738 10648 33833 61942 22416 -64654 -81755
21746h1755J6074k436p4009n0841m9653J04505j9964j40677P9993J15014P0934
$$ -81755 -65681 -68117 -142126 -192967 -242620 -138115 -158079 -298756 -218763 -103749 -32815
21735c2815O5276O6543P1234J4510r2891j80306J0988j8483l822j6045M5033Q2123
$$ -32815 32461 99004 170238 184748 91857 -88449 -77461 -95944 -99766 -115811 -70778 11345
21723A1345L3735r2265j56479N7437l7993n286J7990l7952j6740M1059K3759P0882
$$ 11345 45080 -47185 -203664 -146227 -184220 -189506 -171516 -209468 -226208 -185149 -161390 -90508
21711i0508l8314N0232P2296p1117j27935J5412R5229Q2077M5352j03385k10629
$$ -90508 -128822 -78590 -6294 -77411 -205346 -189934 -94705 -12628 32724 -70661 -281290
21700b81290k5639m4549K27165J41203M656j17578j8360N0544J32989O7720m8374
$$ -281290 -306929 -351478 -124313 16890 21546 -96032 -114392 -63848 69141 136861 88487
21689H8487q4139r090J08760O5575j8864j358p9589n7234n5164l9615j12683p5082
$$ 88487 4348 -4742 104018 169593 150729 149371 69782 12548 -42616 -82231 -194914 -269996
21677b69996Q1614O3554k4025m1638r284M3783R6078K5284q8974J2870J92240
$$ -269996 -188382 -124828 -148853 -190491 -199775 -155992 -59914 -34630 -123604 -110734 81506
21666H1506J07635j02600k33812q6430j33638M4148O7451J59492n7607p4202N0047
$$ 81506 189141 86541 -147271 -233701 -367339 -323191 -255740 -96248 -153855 -228057 -178010
21655a78010J31092q41J14935J05373j07051q6031M572J6602q834M9249j05390
$$ -178010 -46918 -47759 67176 172549 65498 -20533 -15961 641 -8193 41056 -64334
21644f4334o6956j566J38443N3058j04174p8126k4457q439J39202j20992j11405
$$ -64334 -131290 -132856 5587 58645 -45529 -123655 -148112 -156551 -17349 -138341 -249746
21633b49746R9475N9538l3813M1501J08492J33880m0139j16601p8484N0202J12481
$$ -249746 -150271 -90733 -124546 -83045 25447 159327 119188 2587 -75897 -25695 86786
21622H6786r1456j12611l7756n5398J89285K46754N5973o6282p5758p9235r4511
$$ 86786 -4670 -117281 -155037 -210435 -21150 225604 281577 215295 139537 60302 -34209
21611c4209j65127O1640l3194j67794j3262K01610R1176m3763Q215J4257m1579
$$ -34209 -199336 -137696 -170890 -338684 -351946 -150336 -59160 -102923 -94708 -80451 -122030
21600a22030n5338n0963O5286K61058K6180j78217j61085j37285j09685J12824
$$ -122030 -177368 -228331 -163045 98013 124193 -54024 -215109 -352394 -462079 -349255
21590c49255J56978j2258R443J16444m3797j12109O4556J10110J4076J05162J15223
$$ -349255 -192277 -204535 -195092 -78648 -122445 -234554 -169998 -59888 -45812 59350 174573
21579A74573j26384j18023j21811J22595J85692L9734k00947j00204j3723J24121
$$ 174573 48189 -69834 -191645 -69050 116642 156376 -44571 -144775 -158498 -34377
21569c4377K8115j17937K1039M4221J06179o6037L0716J00398L2407r8009j48548
$$ -34377 -6262 -124199 -103160 -58939 47240 -18797 11919 112317 144724 46715 -101833
21558a01833P4733n2390r7105M744J2590N748O1432J02970o3221O3526r8578k12557
$$ -101833 -27100 -79490 -176595 -171851 -159261 -153513 -92081 10889 -52332 11194 -87384 -299941
21546b99941J24006J74768M3568q2804o1877P0682l1640J9523M8512o4000j54320
$$ -299941 -175935 -1167 42401 -40403 -102280 -31598 -63238 -43715 4797 -59203 -213523
21535b13523m373M9382P1416l6531l6519J59742k827j7791R234K3278L3757k4684
$$ -213523 -217896 -168514 -97098 -133629 -170148 -10406 -13233 -31024 -21790 1488 35245 10561
21523A0561j77101L6596J1603n2574J66703K8784j49591l3467J68960o2500j41153
$$ 10561 -166540 -129944 -118341 -170915 -4212 24572 -125019 -158486 10474 -52026 -193179
21512a93179k2887J05285J11346J2744r3124J7674P6440j5325m9846o5654Q9081
$$ -193179 -216066 -110781 565 13309 -79815 -62141 14299 -1026 -50872 -116526 -27445
21501b7445N4756l0412P2861J1719m4758j91144R7387J04964j04720n4478R1268
$$ -27445 27311 -3101 69760 81479 36721 -154423 -57036 47928 -56792 -111270 -20002
21490b0002N2224n3046n1731N1482m0884N7557j2704J7858l2914J085O158N3530
$$ -20002 32222 -20824 -72555 -21073 -61957 -4400 -17104 754 -32160 -31075 -24917 28613
21478B8613n1625o7115N4432O2627L3413r5187r8899q2344n090O9788J28672n5377
$$ 28613 -23012 -90127 -35695 26932 60345 -34842 -133741 -216085 -221175 -151387 -22715 -78092
21466g8092j81931q0680J03871L4515q1739J13580l800Q2565R9473L1435n6021
$$ -78092 -260023 -340703 -236832 -202317 -284056 -170476 -174276 -91711 7762 39197 -16824
21455a6824J0975Q0991k4169j4739j17813n0461j1603m3288q0757M4954p2280
$$ -16824 -5849 75142 50973 36234 -81579 -132040 -143643 -186931 -267688 -222734 -295014
21444b95014j73O6276k6747m6219J45807n3004j01094M7162q301J0311j45404
$$ -295014 -295187 -228911 -255658 -301877 -156070 -209074 -310168 -263006 -271307 -260996 -406400
21433d06400J52630R2969L2689J3059J58110l7010j23285j7345K4038O1296k1772
$$ -406400 -253770 -160801 -128112 -115053 43057 6047 -117238 -134583 -110545 -49249 -71021
21422g1021q2468M0736n0884l430l3194m0159J17912K8653l9158O6152P2371L1798
$$ -71021 -153489 -112753 -163637 -167067 -200261 -240420 -122508 -93855 -133013 -66861 5510 37308
21410C7308l0014J6422J7858P2771j15563j02532q046p4289o3714J60897L5850
$$ 37308 7294 23716 41574 114345 -1218 -103750 -111796 -186085 -249799 -88902 -53052
21399e3052J9559N2092Q130o7067M039n3243K1733j2704L5380P8219o8010k9385
$$ -53052 -33493 18599 26729 -40338 -36299 -89542 -67809 -80513 -45133 33086 -34924 -64309
21387f4309l2750P1267J60092L4585j00992l7075m9712j10560O6034K6343P2906
$$ -64309 -97059 -25792 134300 168885 67893 30818 -18894 -129454 -63420 -37077 35829
21376C5829J6659j6227p81J7497j2268J34608J42349q6571j64925r1926j27048
$$ 35829 52488 36261 35480 52977 40709 175317 317666 231095 66170 -25756 -152804
21365a52804J08311j1974J7168q8464p9560N7691J20919K29101m1076k30338p657
$$ -152804 -44493 -56467 -39299 -127763 -207323 -149632 -28713 200388 159312 -71026 -78683
21354g8683J89498N1977j88508j69451J51213N020J6511o221K5869R5413N0304
$$ -78683 110815 162792 -25716 -195167 -43954 -38934 -22423 -28644 -2775 92638 142942
21343A42942q6779L3404m5587K7745R0317l5117o8581p3949j05802l1126J07179
$$ 142942 56163 89567 43980 71725 162042 126925 58344 -15605 -121407 -152533 -45354
21332d5354L1224R9321J25269P7943j98966n9259o7051j00239o9666o5301o5101
$$ -45354 -14130 85191 210460 288403 89437 30178 -36873 -137112 -206778 -272079 -337180
21321c37180J20376J12557R3759l7952j35062O0577Q105p5364k5132k6052J9060
$$ -337180 -216804 -104247 -10488 -48440 -183502 -122925 -114820 -190184 -215316 -241368 -222308
21310b22308j65388j9798L7899N3110J34507J70603J0585j0398q0530o5849R576
$$ -222308 -387696 -407494 -369595 -316485 -181978 -11375 -790 -11188 -91718 -157567 -147991
21299a47991j6020m41M2066J4402M3377R44j8836p8954P9772M1604r2491J9785
$$ -147991 -164011 -164452 -122386 -107984 -64607 -63663 -82499 -161453 -81681 -40077 -132568 -112783
21287a12783M0572J01689r9067N9418j20196o3366N8409m1656n3670N3403Q3366
$$ -112783 -72211 29478 -69589 -10171 -130367 -193733 -135324 -176980 -230650 -177247 -93881
21276i3881R3616L0962l5267l6807N2136J2873N7282J4211j09907q8939m0774
$$ -93881 -265 30697 -4570 -41377 10759 23632 80914 95125 -14782 -103721 -144495
21265a44495j345J25306p7324K8445R0772Q0540k70J3692n0446o8872o280J10521
$$ -144495 -145840 -20534 -97858 -69413 21359 101899 101629 115321 64875 -3997 -10277 100244
21253A00244J5034M1745M354r1941k7149j1159R536J9703l5162m916j7050q0328
$$ 100244 115278 157023 161377 69436 42287 31128 40664 60367 25205 20289 3239 -77089
21241g7089J418K7817M2490m9000J5596l3695R576N1815p4604k2652j3784O0857
$$ -77089 -75671 -47854 -5364 -54364 -38768 -72463 -62887 -11072 -85676 -108328 -122112 -61255
21229f1255L1523j06678N3770J30235j8225p9016j08894J30233l3618l4595m4755
$$ -61255 -29732 -136410 -82640 47595 29370 -49646 -158540 -28307 -61925 -96520 -141275
21218a41275q380J5782K8860m4468o3440l9613J22952L35n4011r8902R2054L2949
$$ -141275 -149655 -133873 -105013 -149481 -212921 -252534 -129582 -129247 -183258 -282160 -190106 -157157
21206a57157R8550R1902q0178L6074R6425p0053R62Q2536l830j76633K8830Q5763
$$ -157157 -58607 33295 -46883 -10809 85616 15563 16525 99061 95231 -81402 -52572 33191
21194C3191Q4240n3051j01818l6357M1792j3099q2517j60094l4783J05200L8792
$$ 33191 117431 64380 -37438 -73795 -32003 -45102 -127619 -287713 -322496 -217296 -178504
21183a78504R5272n879P2914m6398M617k2851N8808J1693j5357O30J10371M4890
$$ -178504 -83232 -89111 -16197 -62595 -57978 -80829 -22021 -10328 -25685 -25055 85316 130206
21171A30206n5717j12095o8302L0823J5798O3126j00388j15646J2869L0536J08967
$$ 130206 74489 -37606 -105908 -75085 -59287 3839 -96549 -212195 -199326 -168790 -59823
21160e9823K05019j3403j23639j30951o0084L8868K3361J31272K6449p0494J457
$$ -59823 145196 131793 8154 -122797 -182881 -144013 -120652 10620 37069 -33425 -31968
21149c1968r1001J8711J24244J41943n382j17555j74593N1360Q7283J50444J39208
$$ -31968 -122969 -104258 19986 161929 156547 38992 -135601 -84241 3042 153486 292694
21138B92694k1719m9115j56964J7039J01251m7642j25354j4005N7217K1150l9422
$$ 292694 270975 221860 64896 81935 183186 135544 10190 -3815 53402 74552 35130
21127C5130o2316r1449K00118J14606j00783j26872L9843J33379j03912j83002
$$ 35130 -27186 -118635 81483 196089 95306 -31566 8277 141656 37744 -145258
21117a45258n2604l556l4078l1079K8925O4312P5567K7615r4012j44761m9705
$$ -145258 -197862 -201418 -235496 -266575 -237650 -173338 -97771 -70156 -164168 -308929 -358634
21106c58634L3300O9144J70756J72802l1020q677m3155K0395J69097K22q7988
$$ -358634 -325334 -256190 -85434 87368 56348 47671 4516 24911 194008 194230 106242
21095A06242Q2203k1229l7116M494l5116K9231p6836M7151j4488l5845l0569l9906
$$ 106242 188445 167216 130100 134594 99478 128709 51873 99024 84536 48691 18122 -21784
21083b1784L291J06128J03576n2398o4519M2517l1101j05360p6032r0112L3225
$$ -21784 -18493 87635 191211 138813 74294 116811 85710 -19650 -95682 -185794 -152569
21072a52569j5775K3778P7370K5091N862N2185l0524j29611j54823O528O8159
$$ -152569 -168344 -144566 -67196 -42105 -36243 15942 -14582 -144193 -299016 -292488 -224329
21061b24329J36171J46854M6949j05215O2538L8016o1194n0979j293q707K4087
$$ -224329 -88158 58696 105645 430 62968 100984 39790 -11189 -12482 -21189 2898
21050B898n5348N489Q8875J07087m7965j19671p087k1694n8829l8144J7596L4283
$$ 2898 -52450 -46961 41914 149001 101036 -18635 -25722 -47416 -106245 -144389 -126793 -92510
21038i2510J9983J18107P1339m2256p6234J283q9929m2831J54017J14967o2847
$$ -92510 -72527 45580 116919 74663 -1571 -288 -90217 -133048 20969 135936 73089
21027G3089k917j09984k4356q2990k6326N3965J8811j7889M6061N8252p2041n3759
$$ 73089 70172 -39812 -64168 -147158 -173484 -119519 -100708 -118597 -72536 -14284 -86325 -140084
21015a40084Q8726J910O3471M8140p0450L24R1846m6307J2753L8674o9207j8579
$$ -140084 -51358 -49448 14023 62163 -8287 -7963 83883 37576 50329 89003 19796 1217
21003A217J02282q3907m3129L3982Q3851J8351n788q6274o5203m5462J55640P6911
$$ 1217 103499 19592 -23537 10445 94296 112647 106859 20585 -44618 -90080 65560 142471
20991A42471n8482j82028p5809p6650j7072J12937J78075l2045m5688N9574K0753
$$ 142471 83989 -98039 -173848 -250498 -267570 -154633 23442 -8603 -54291 5283 26036
20980B6036J643j40692J3086P2024M2057k7568P7813n3101q0088P9864R7028M217
$$ 26036 27679 -113013 -99927 -27903 14154 -13414 64399 11298 -68790 11074 108102 112319
20968A12319r9854n407J9361L783q3383l8959R1685L9634j836j05407l1649J8578
$$ 112319 12465 7058 26419 30202 -53181 -92140 -455 39179 37343 -68064 -99713 -81135
20956h1135N1450j9899M9689k6058n2578R0351J9090k3546J32860j21965k02652
$$ -81135 -29685 -49584 105 -25953 -78531 11820 30910 7364 140224 18259 -184393
20945a84393n8396l5466m9261J22943Q2680j5308K153N8610J18428P7929j05578
$$ -184393 -242789 -278255 -327516 -204573 -121893 -137201 -135048 -76438 41990 119919 14341
20934A4341O1656k3336p033K1280O5424n4684n2024q4985n0708J12092K6042j37005
$$ 14341 75997 52661 45628 66908 132332 77648 25624 -59361 -110069 2023 28065 -108940
20922a08940k09320P3214R4616o5924J07216J02030M7033J1701p5660l4174J2701
$$ -108940 -318260 -245046 -150430 -216354 -109138 -7108 39925 51626 -24034 -58208 -45507
20911d5507M9236o6384j07875m1281N2417J17766J16924k2771p0980O526Q5310
$$ -45507 3729 -62655 -170530 -211811 -159394 -41628 75296 52525 -18455 -11929 73381
20900G3381Q9211q7968l0380P8225o087J16038O4042j02645j43846n2586j69097
$$ 73381 162592 74624 44244 122469 116382 232420 296462 193817 49971 -2615 -171712
20889a71712l715J62218O4572p0874K9133o1477p1737J03720P7694N2731j19344
$$ -171712 -175427 -13209 51363 -19511 9622 -51855 -123592 -19872 57822 110553 -8791
20878h791l8657p4854k0802n9949K5982J32098J61187N3843Q2423k7382j09608
$$ -8791 -47448 -122302 -143104 -203053 -177071 -44973 116214 170057 252480 225098 115490
20867A15490M6985K2979q7081J6821J2124l5452o7430l4736p7853o438j5099J12533
$$ 115490 162475 185454 98373 115194 127318 91866 24436 -10300 -88153 -94591 -109690 2843
20855B843Q2012j15317n6298Q5030r31r3196j9402j00537J37285p904J5956N178
$$ 2843 84855 -30462 -86760 -1730 -2661 -95857 -115259 -215796 -78511 -86415 -70459 -65281
20843f5281J09965m2050q4640n645Q454q8520Q7735p145j12579O2235P3957J63215
$$ -65281 44684 2634 -82006 -87651 -79197 -167717 -79982 -87127 -199706 -137471 -63514 99701
20831I9701k5561j36918q6951j33370Q5887J3163R4566O4468K742l058L0540q9807
$$ 99701 74140 -62778 -149729 -283099 -197212 -184049 -89483 -25015 -22273 -25331 5209 -84598
20819h4598L7245R0764r4532J0669n1713o1049m6095K5109l4142Q5907J15375
$$ -84598 -47353 43411 -51121 -40452 -92165 -153214 -199309 -174200 -208342 -122435 -7060
20808g060O6793n5122k5544k6910j8116O6666K2704l0777J090Q3732o8915q9901
$$ -7060 59733 4611 -20933 -47843 -65959 707 23411 -7366 -6276 77456 8541 -81360
20796h1360p0606J26235J80672P5012p0361q3411j07983J8071o3360M3796J01349
$$ -81360 -151966 -25731 154941 229953 159592 76181 -31802 -13731 -77091 -33295 68054
20785F8054J3364M3039j48131k913O6213q952j4185N0497r9403j95364N3878K29374
$$ 68054 81418 124457 -23674 -26587 39626 30674 16489 66986 -32417 -227781 -173903 55471
20773E5471Q612q5251p8563m0540J38520J4478o7690J47717J9667j28745k6594
$$ 55471 64083 -21168 -99731 -140271 -1751 12727 -54963 92754 112421 -16324 -42918
20762d2918j03873M9692J77809L2652r8169j80923j8823Q6896J47574q9931O8321
$$ -42918 -146791 -97099 80710 113362 15193 -165730 -184553 -97657 49917 -40014 28307
20751B8307j03589j87650P6022M0803N6226J37986q1609j22397n7711Q4302j3394
$$ 28307 -75282 -262932 -186910 -146107 -89881 48105 -33504 -155901 -213612 -129310 -142704
20740a42704Q4991K06164k4112p0509M6094l134o8364R4867J32308K7478j20394
$$ -142704 -57713 148451 124339 53830 99924 96790 28426 123293 255601 283079 162685
20729A62685m0494j7611p6015O4281K3050q0798O8078Q484j9895m5077r4259j2543
$$ 162685 122191 104580 28565 92846 115896 35098 103176 111660 91765 46688 -47571 -60114
20717f0114P1530J5644m5803J0100L6614n1276j03980l895j0320L3145J19009
$$ -60114 11416 27060 -18743 -8643 27971 -23305 -127285 -131180 -141500 -108355 10654
20706A0654N5083n7292R1407j00261p5728k8866p4041r460k4832k4968p3660N6427
$$ 10654 65737 8445 99852 -409 -76137 -105003 -179044 -188504 -213336 -238304 -311964 -255537
20694b55537J64773J00887N9176J2493n2186j47184Q4624M2862k3901p618O031
$$ -255537 -90764 10123 69299 81792 29606 -117578 -32954 9908 -13993 -21611 -15580
20683a5580J27111m8424j42883l1844K7944J811l9030K8892O7205O0113J05193
$$ -15580 111531 63107 -79776 -111620 -83676 -81865 -120895 -92003 -24798 35315 140508
20672A40508J430N216Q56O3132k3292r9524m1285l4215j25795o8368O1459J28441
$$ 140508 141938 147154 148010 211142 187850 88326 47041 12826 -112969 -181337 -119878 8563
20660H563J65995K3949q1969p8734j8708m028n0135n6695K0844p3201o9478k1968
$$ 8563 174558 198507 116538 37804 19096 15068 -35067 -91762 -70918 -144119 -213597 -235565
20648b35565O0849J18392K7450o2353M6307J08510J13127J0919j40750l5698K29107
$$ -235565 -174716 -56324 -28874 -91227 -44920 63590 176717 187636 46886 11188 240295
20637B40295n1624q5948m4555R0753q4385j3949J4420J9067m3606Q6540R3582
$$ 240295 188671 102723 58168 148921 64536 50587 65007 84074 40468 127008 220590
20626B20590l9564l7235j8531J6092j27995J38726k8753j97364n2388j6602K5551
$$ 220590 181026 143791 125260 141352 13357 152083 123330 -74034 -126422 -143024 -117473
20615a17473O6702O9880R4866J243r6213n8617k6185J23777J35335j29114k23206
$$ -117473 -50771 19109 113975 115218 19005 -39612 -65797 57980 193315 64201 -159005
20604a59005p377J77664P4322j21530k6085J2840P0453R279K6958L099P4734Q7760
$$ -159005 -166382 11282 85604 -35926 -62011 -49171 21282 30561 57519 60618 135352 223112
20592B23112q4946N65N0525J9814n8037l1585R1687R2146r9854j56334j34825
$$ 223112 138166 138731 189256 209070 151033 119448 211135 303281 203427 47093 -87732
20581h7732J6750L8938L5190L9038q9050Q5502N9474r6946K2236R4659K9968N4399
$$ -87732 -70982 -32044 3146 42184 -46866 38636 98110 1164 23400 118059 148027 202426
20569B02426j3210q6420r1641n0762J3962m73K5595Q5621p3667j5762R7191N9350
$$ 202426 189216 102796 11155 -39607 -25645 -26118 -523 85098 11431 -4331 92860 152210
20557A52210o9050q0039M8654o1710J7108M8514L8973R0696P0207m9316n265j28411
$$ 152210 83160 3121 51775 -9935 7173 55687 94660 185356 255563 206247 200982 72571
20545G2571K9820l5418o2859o7121j02120N8182J40275M413J23353P0455p2582
$$ 72571 102391 66973 4114 -63007 -165127 -106945 33330 37743 161096 231551 158969
20534A58969P0036O3718j12965j02316L0209k4926l4917K136L0559J8462j6611
$$ 158969 229005 292723 179758 77442 107651 82725 47808 49944 80503 98965 82354
20523H2354J0468J58558J0913j33782j507J18194J14299k7122o507J03361J54045
$$ 82354 92822 251380 262293 128511 127004 245198 359497 332375 325868 429229 583274
20512E83274j9538J1126J95778N0012o8689j08479q4780j36458O2182M2642L4443
$$ 583274 563736 574862 770640 820652 751963 643484 558704 422246 484428 527070 561513
20501E61513P2081j3742P4476L8848j6178J0557M0098r0044J94176k0446k01082
$$ 561513 633594 619852 694328 733176 716998 727555 767653 677609 871785 851339 650257
20490F50257n5996M6271q8413j0662q2848m2329n700l6305o7197q4642o6894J28551
$$ 650257 594261 640532 552119 541457 458609 416280 410580 374275 307078 222436 155542 284093
20478B84093j00197K7397O4624j01975P068N1214j7808O5485L6438O047J24111
$$ 284093 183896 211293 275917 173942 181010 232224 214416 279901 316339 322386 446497
20467D46497J74785J67114K34178n1977K6686R7732p8639j56183j01614J4157
$$ 446497 621282 788396 1022574 970597 997283 1095015 1016376 860193 758579 772736
20457G72736P8775J72314l8405P478q2553r1085n2228k7792J77326L2601j48194
$$ 772736 851511 1023825 985420 992898 910345 819260 767032 739240 916566 949167 800973
20446H00973j96154j12706J04313L9663j8827J20936j50818k57978o7123l1648
$$ 800973 604819 492113 596426 636089 617262 738198 587380 329402 262279 230631
20436B30631J03641o1624j12281j33730j4893P7532J47171L1108n0853q2364j87470
$$ 230631 334272 272648 160367 26637 11744 89276 236447 267555 216702 134338 -53132
20425e3132L0274J46502J54100r7311L7800N5910l201j05590k5948r089r9433
$$ -53132 -22858 123644 277744 180433 218233 274143 270942 165352 139404 130315 30882
20414C0882q7420p0983R6598J50642N4001J4079K5300n56n5814J05342P1001J1374
$$ 30882 -56538 -127521 -30923 119719 173720 187799 213099 212543 156729 262071 333072 344446
20402C44446q7305j14545K1029o0182q9525J60549J23174k891r8917l3961J44792
$$ 344446 257141 142596 163625 103443 13918 174467 297641 294750 195833 161872 306664
20391C06664m6262n0760K1220K1015n1124L8122R3528L0385J548K2598j25470
$$ 306664 260402 209642 230862 251877 200753 238875 332403 362788 364336 386934 261464
20380B61464p7986K9652k1871L6326q9436P4823Q4072O3667Q7839j39676j82427
$$ 261464 183478 213130 191259 227585 138149 212972 297044 360711 448550 308874 126447
20369A26447M2136j6360r9474n5921l0882P5893j1872K9173R4764J26l4535L625
$$ 126447 168583 152223 52749 -3172 -34054 41839 29967 59140 153904 154030 119495 123120
20357A23120P7391o8199J05090M2821j02288j45530M9511R3103j2415j36643j4439
$$ 123120 200511 132312 237402 280223 177935 32405 81916 175019 162604 25961 11522
20346A1522R5054O4O0196l2162n6127l3908N6626O9939M2667r2052K7138P8865
$$ 11522 106576 106640 166836 134674 78547 44639 101265 171204 213871 121819 148957 227822
20334B27822j3427J1078M9382p5043L8525r891K1373q7649k8932K3147J4368O0956
$$ 227822 214395 225473 274855 199812 238337 228446 249819 162170 133238 156385 170753 231709
20322B31709N7993k9768j19074O9218R4383n3522M9037j1828o0317K4424J0083
$$ 231709 289702 259934 140860 210078 304461 250939 299976 288148 227831 252255 262338
20311B62338k4203j77228m0128r047O9690J45012J05459l2748j24477j9950p8608
$$ 262338 238135 60907 20779 11732 81422 226434 331893 299145 174668 154718 76110
20300G6110l6654Q5071J23917R6178m3078q8089J0348J8790j46386J36523K2906
$$ 76110 39456 124527 248444 344622 301544 213455 223803 242593 96207 232730 255636
20289B55636Q9436N5915j51492O4117m7548k2698o6428R756o5276J9069N2845
$$ 255636 345072 400987 249495 313612 266064 243366 176938 186694 121418 140487 193332
20278A93332J89783N6698n8214j93265j10643P3678J87366j3038Q0357n2806k03220
$$ 193332 383115 439813 381599 188334 77691 151369 338735 325697 406054 353248 150028
20267A50028M2498J03461N7290j5297j5111j20970n5949j477l9619l4094R1652
$$ 150028 192526 295987 353277 337980 322869 201899 145950 144473 104854 70760 162412
20256A62412L9035n9611m7663Q9033l7232j48541O8809J22266n9491l792L662
$$ 162412 201447 141836 94173 183206 145974 -2567 66242 188508 129017 125225 128887
20245A28887J65590J49226K7983p7958r5045j07214m9613K26448J33494M7597
$$ 128887 294477 443703 471686 393728 298683 191469 141856 368304 501798 549395
20235E49395l2555j7209k8514q8133n7133P185n6078L4977o1686L6199N0552P9069
$$ 549395 516840 499631 471117 382984 325851 333036 276958 311935 250249 286448 337000 416069
20223D16069K01532l6334j00469r3684n8411L6532J00349j48613m6412O7342n7929
$$ 416069 617601 581267 480798 387114 328703 365235 465584 316971 270559 337901 279972
20212B79972k59046J1832k1200O4966Q1628R7006J30064J44637L0790j51189r8292
$$ 279972 20926 32758 11558 76524 158152 255158 385222 529859 560649 409460 311168
20201C11168p0686K3708N5864n5574n2982K5748Q402k9974J97762K46105L3517
$$ 311168 240482 264190 320054 264480 211498 237246 245648 215674 413436 659541 693058
20190F93058q4979M2448O7756o8135j16843o5708J7627j09597l2797k1240N0261
$$ 693058 608079 650527 718283 650148 533305 467597 485224 375627 342830 321590 371851
20179C71851J85734P0659j78492k3212J10363M9964p9270r0443p1016k9023J50659
$$ 371851 557585 628244 449752 426540 536903 586867 507597 417154 346138 317115 467774
20168D67774k223Q6813m3361r4196n0687q1722P189n1167o8982j23471m4354Q8640
$$ 467774 465551 552364 509003 414807 364120 282398 289587 238420 169438 45967 1613 90253
20156I0253J8366p8770l4216J25537N4947J03599J83465n4797j32450k4582K4881
$$ 90253 108619 29849 -4367 121170 176117 279716 463181 408384 275934 251352 276233
20145B76233J09521n8336l0875J05070P932o3045n7185m5061k9404P9701J52151
$$ 276233 385754 327418 296543 401613 409545 346500 289315 244254 214850 294551 446702
20134D46702N5213j1169n6664J27462J93758l0862j4940p0622j47698p7689M3761
$$ 446702 501915 490746 434082 561544 755302 724440 709500 638878 491180 413491 457252
20123D57252P0905J26038L1148J996K7633O6028K5902n3080R8080n7738l3782
$$ 457252 528157 654195 685343 687339 714972 781000 806902 753822 851902 794164 760382
20112G60382J2443p3329P8273M4376J00880L5946L7206M5374J11639J55239l3122
$$ 760382 772825 699496 777769 822145 923025 958971 996177 1041551 1153190 1308429 1275307
20101A275307J24701j13924N665J44394k5548M2670l5817j11745k328J5109k9512
$$ 1275307 1400008 1286084 1291749 1436143 1410595 1453265 1417448 1305703 1303375 1318484 1288972
20090A288972p7047l1217q1235o018J80890O4730j6671o8913k8222J8910K5439
$$ 1288972 1211925 1180708 1099473 1093455 1274345 1339075 1322404 1253491 1225269 1244179 1269618
20079A269618p1003o3778Q3731J71063K131K0895M0720k6057k537o0977J13948
$$ 1269618 1198615 1134837 1218568 1389631 1391762 1412657 1453377 1427320 1424783 1363806 1477754
20068A477754P2467m9882N5121J10493o1190J2538R7861M8917j9974P9634j5692
$$ 1477754 1550221 1500339 1555460 1665953 1604763 1617301 1715162 1764079 1744105 1823739 1808047
20057A808047N4587L2325N5376J91958R6353L984J10346P3307L918j53601o4382
$$ 1808047 1862634 1894959 1950335 2142293 2238646 2242630 2352976 2426283 2430201 2276600 2212218
20046B212218j5287k4129O6867K1191q0289K996n2815j10905O2890J24574J26385
$$ 2212218 2196931 2172802 2239669 2260860 2180571 2183567 2130752 2019847 2082737 2207311 2333696
20035B333696j5384k2985J21999P2613m0871J26665N9344n0452N0093R2356K61068
$$ 2333696 2318312 2295327 2417326 2489939 2449068 2575733 2635077 2584625 2634718 2727074 2988142
20024B988142J36011J98526K09482K40377J80611J96143L55615L06122K1402l0906
$$ 2988142 3124153 3322679 3532161 3772538 3953149 4149292 4504907 4811029 4832431 4801525
20014D801525J38021K68159K95302K86270L87637N64402P08835N20821M39095
$$ 4801525 4939546 5207705 5503007 5789277 6176914 6741316 7450151 7970972 8410067
20005H410067O12479P14895Q32457R50307R87897J154980J509701J856140K464307
$$ 8410067 9022546 9737441 10569898 11520205 12508102 13663082 15172783 17028923 19493230
19996A9493230L477479M998587P457955J1296965J6324944J9222767J8531182
$$ 19493230 22970709 27969296 35427251 46724216 63049160 82271927 100803109
19989A00803109J5785026J2072028P581368J639997n083144r632481j2935798
$$ 100803109 116588135 128660163 136241531 137881528 132798384 123165903 110230105
19982A10230105j2400206q248934l256610K132999Q502611J4340658J5636313
$$ 110230105 97829899 89580965 86324355 88457354 96959965 111300623 126936936
19975A26936936J3370671J0302959O545399J287243o552194j2356011j6285645
$$ 126936936 140307607 150610566 157155965 158443208 151891014 139535003 123249358
19968A23249358j7782040j5486295j2303331r870807q014589o253051m606550
$$ 123249358 105467318 89981023 77677692 67806885 59792296 53539245 48932695
19961D8932695l366782k610297k017036j521222j030653q72258p05788n17147
$$ 48932695 45565913 42955616 40938580 39417358 38386705 37514447 36808659 36291512
19953C6291512q1951O27841J341940K521600M280876O963163J1317554J6602525
$$ 36291512 36209561 36837402 38179342 40700942 44981818 51944981 63262535 79865060
19945G9865060J9262013J7350125J3868663J0560403O622251J92736p074397j1132543
$$ 79865060 99127073 116477198 130345861 140906264 147528515 147721251 140646854 129514311
19937A29514311j3373237j2274396q197187l408079K203670R249582J4836949
$$ 129514311 116141074 103866678 95669491 92261412 94465082 103714664 118551613
19930A18551613J5163885J2028281Q870262N622923J12276q671035j4414794j7312732
$$ 118551613 133715498 145743779 154614041 160236964 160349240 151678205 137263411 119950679
19922A19950679j7936863j5539497j2530257j0112779q158640o583339n052567
$$ 119950679 102013816 86474319 73944062 63831283 55672643 49089304 44036737
19915D4036737l938493l400640k693207k237058k087380k014281j855445j677517
$$ 44036737 40098244 36697604 34004397 31767339 29679959 27665678 25810233 24132716
19907B4132716j458664j304388j100367r58081r48079p93327q02889p22189n90429
$$ 24132716 22674052 21369664 20269297 19311216 18363137 17569810 16766921 16044732 15454303
19898A5454303n53364n79337n67524o25333o15965n53521n41932m74255n79415
$$ 15454303 14900939 14321602 13754078 13128745 12512780 11959259 11417327 10943072 10363657
19889A0363657m47798l56492l39200l45788k67678k46554l94033k39346k97145
$$ 10363657 9915859 9559367 9220167 8874379 8606701 8360147 7966114 7726768 7429623
19880G429623k54800k50013j79905k99633o2345j41624j62373n9656k74098l03502
$$ 7429623 7174823 6924810 6744905 6445272 6382927 6241303 6078930 6019274 5745176 5441674
19870E441674k11305j16108r9280k55190k11615k1063n9544q3238j38621j60719
$$ 5441674 5230369 5114261 5014981 4759791 4548176 4527113 4467569 4384331 4245710 4084991
19860D084991j75371j30084j26351j05397j01512q9079J2919j51905p4464L1109
$$ 4084991 3909620 3779536 3653185 3547788 3446276 3357197 3370116 3218211 3143747 3174856
19850C174856o5866J0372K9037q6036j32043j21899k07825j95547k5780n7897
$$ 3174856 3108990 3119362 3148399 3062363 2930320 2808421 2600596 2405049 2379269 2321372
19840B321372p523K6290P6580j43753k32429q932R4489O0665n1859j20339j20887
$$ 2321372 2313849 2340139 2416719 2272966 2040537 2031605 2126094 2186759 2134900 2014561 1893674
19829A893674m295r1646n7534K0054j77636j20797n2127n025r5417L2062j6128
$$ 1893674 1889379 1797733 1740199 1760253 1582617 1461820 1409693 1404668 1309251 1341313 1325185
19818A325185j68105q7653N6786N1869n1099K4196M9796m2837k54706j49664k1529
$$ 1325185 1157080 1069427 1126213 1178082 1126983 1151179 1200975 1158138 903432 753768 732239
19807G32239K4786l8067N6329O5167K0074K537O0338R5959Q1248r8660j78548
$$ 732239 757025 718958 775287 840454 860528 863065 923403 1019362 1100610 1001950 823402
19796H23402k5852K6569J4814J6285L7280L9951K3567m0165l2714N4496L0396
$$ 823402 797550 824119 838933 855218 892498 932449 956016 915851 883137 937633 968029
19785I68029r115n1170p3378k23659p1295J03870L6702j4009K0272p5120k6856
$$ 968029 958914 907744 834366 610707 539412 643282 679984 665975 686247 611127 584271
19774E84271K4899J45213K10736j4765j3480j58639j09341M6295J38638M3296
$$ 584271 609170 754383 965119 950354 936874 778235 668894 715189 853827 897123
19764H97123j4867j66666k3599J19677O6120j0156j6949l2206Q2686Q8212j02424
$$ 897123 882256 715590 691991 811668 877788 867632 850683 818477 901163 989375 886951
19753H86951r1187J2481N3754L2944p7448q4532J02144k2945J5428o7953O2424
$$ 886951 795764 808245 861999 894943 817495 732963 835107 812162 827590 759637 822061
19742H22061K2311M3690J09732J49169J86040J2928K21382K89021R4941L5908
$$ 822061 844372 888062 997794 1146963 1333003 1345931 1567313 1856334 1951275 1987183
19732A987183l1251k66978k14367j6780J75468K7697J9767J9994J8747q701j43086
$$ 1987183 1955932 1688954 1474587 1457807 1633275 1660972 1680739 1700733 1719480 1710779 1567693
19721A567693O8875j6560m5549l7047j06869J0702k3830j07854M6790n2309k33179
$$ 1567693 1636568 1620008 1574459 1537412 1430543 1441245 1417415 1309561 1356351 1304042 1070863
19710A070863j10818m509n452j4437J8499r0043J43618Q7449P69k482o4509P1526
$$ 1070863 960045 955536 950084 935647 954146 864103 1007721 1095170 1095939 1093457 1028948 1100474
19698A100474J03384j6127r3065j84118m8897M0881N4246J41165Q8862N6757q5551
$$ 1100474 1203858 1187731 1094666 910548 861651 902532 956778 1097943 1186805 1243562 1158011
19687A158011n6514K7619P5699q5777o7549J5046l2727m8714J03596K01958q0931
$$ 1158011 1101497 1129116 1204815 1119038 1051489 1066535 1033808 985094 1088690 1290648 1209717
19676A209717k5153L4070Q3671J55708j6355J1534k6491j27522k7022M3500J43516
$$ 1209717 1184564 1218634 1302305 1458013 1441658 1453192 1426701 1299179 1272157 1315657 1459173
19665A459173J4726l8638j25599q8044r73J0920Q8907J8768m0515N7686j5193
$$ 1459173 1473899 1435261 1309662 1221618 1220645 1231565 1320472 1339240 1298725 1356411 1341218
19654A341218j08212J89928R1635m9624k6282o8975l5504J39518J94108l0805
$$ 1341218 1233006 1422934 1514569 1464945 1438663 1369688 1334184 1473702 1667810 1637005
19644A637005L8119Q9486l3485J73897p8179j14089R8308K0570J79716J27933
$$ 1637005 1675124 1764610 1731125 1905022 1826843 1712754 1811062 1831632 2011348 2139281
19634B139281p7138L2146R2430J01340O6315n3209J47652J85481J00157Q6641
$$ 2139281 2062143 2094289 2186719 2288059 2354374 2301165 2448817 2634298 2734455 2821096
19624B821096J7004Q6974K21719R6217O7442K07161J45558N167L0796J03971K43811
$$ 2821096 2838100 2925074 3146793 3243010 3310452 3517613 3663171 3668338 3699134 3803105 4046916
19613D046916L22327M54077K75552K84184L71422M89646N06744Q18307J122368
$$ 4046916 4369243 4823320 5098872 5383056 5754478 6244124 6750868 7569175 8691543
19604H691543J130704J703146K312073L222391M631337P205102J0798598J2493734
$$ 8691543 9822247 11525393 13837466 17059857 21691194 28896296 39694894 52188628
19596E2188628R142387M666708L310456L406952J44507o420422q979102o860472
$$ 52188628 61331015 65997723 69308179 72715131 72859638 66439216 57460114 50599642
19588E0599642m254461k474766o59376K162420N877481Q914088Q269358M257212
$$ 50599642 46345181 43870415 43211039 45373459 51250940 60165028 68434386 72691598
19580G2691598J856928K067539O30199m715847r054852q174219n666596l665609
$$ 72691598 74548526 76616065 77246264 72530417 63475565 55301346 49634750 45969141
19572D5969141k216066m23124J965652N887796J0133995J1082747O848481K887616
$$ 45969141 43753075 43329951 45295603 51183399 61317394 72400141 79248622 82136238
19564H2136238K679809K642266k310912r279644r923141o857189m154963k376119
$$ 82136238 84816047 87458313 85147401 75867757 65944616 59087427 54932464 52556345
19556E2556345k93303K996144P194534R901371P858028L441514K191065L183534
$$ 52556345 52263042 55259186 62453720 72355091 80213119 83654633 85845698 89029232
19548H9029232J377475m400681o162199j588674M182014P228223N589959K096647
$$ 89029232 90406707 86006026 79843827 78255153 82437167 89665390 95255349 97351996
19540I7351996Q63179J147842j334451p147643j0098526q544781n944935l652430
$$ 97351996 98215175 99363017 98028566 90880923 80782397 72237616 66292681 62640251
19532F2640251j426630J550717N386166Q883949Q607481M870716J981799J514639
$$ 62640251 61213621 62764338 68150504 77034453 85641934 90512650 92494449 94009088
19524I4009088L53846m624783r561947r444024o891532m540093k760057q92940
$$ 94009088 94362934 89738151 80176204 70732180 63840648 59300555 56540498 55647558
19516E5647558J938622N451991Q767025R642827O619133L177379K098838J129232
$$ 55647558 57586180 63038171 71805196 81448023 88067156 91244535 93343373 94472605
19508I4472605k630162q080274r575863p577315m951404k995136q27349K447177
$$ 94472605 91842443 83762169 74186306 66608991 61657587 58662451 57835102 60282279
19500F0282279O006196Q268950O781828K984081Q97675M98810j864069p243325
$$ 60282279 66288475 74557425 81339253 84323334 85221009 85719819 83855750 76612425
19492G6612425j0820705r857722p628849o166683n142582m367535l510603k862608
$$ 76612425 65791720 55933998 48305149 42138466 36995884 32628349 29117746 26255138
19484B6255138k372015j937536j514881j272066j188499j043509r27348p60704
$$ 26255138 23883123 21945587 20430706 19158640 17970141 16926632 15999284 15238580
19476A5238580o23618m80084n70576o75694p19769o77599n88509n36121l88526
$$ 15238580 14614962 14134878 13564302 12888608 12168839 11491240 10902731 10366610 9978084
19467I978084l12890l05726k76288l76951k68227j90298j29560j47419k05430
$$ 9978084 9665194 9359468 9083180 8706229 8438002 8247704 8118144 7970725 7765295
19458G765295k14282k62563k27976k50626l17064k12203l04801k54303j44933
$$ 7765295 7551013 7288450 7060474 6809848 6492784 6280581 5975780 5721477 5576544
19449E576544r6229l02494j50248r2242J2675J1689k56412l32667p4816m1189
$$ 5576544 5480315 5177821 5027573 4935331 4948006 4959695 4703283 4370616 4295800 4254611
19439D254611k04092j09258q3120j13070j33641j11594K4486p9818k13261j94480
$$ 4254611 4050519 3941261 3858141 3745071 3611430 3499836 3524322 3444504 3231243 3036763
19429C036763j33680k9756o5469K7848o7347l0866J5092q0971j90914k23378j6400
$$ 3036763 2903083 2873327 2807858 2835706 2768359 2737493 2752585 2671614 2480700 2257322 2240922
19418B240922J03837M5055m7244q682J51058j20612j39587j96323P711P7019M9713
$$ 2240922 2344759 2389814 2342570 2333888 2484946 2364334 2224747 2028424 2036135 2113154 2162867
19407B162867j28911k67684j29769J3059o3824N9138J82907K26769K495j16694
$$ 2162867 2033956 1766272 1636503 1649562 1585738 1644876 1827783 2054552 2057047 1940353
19397A940353j26485q3475J0287k2960m4344j10843k82357j79432R1677r3724
$$ 1940353 1813868 1730393 1740680 1717720 1673376 1562533 1280176 1100744 1192421 1098697
19387A098697j01847j00538J5393J06321Q6044k5314r3335j27249l9639J37234
$$ 1098697 996850 896312 911705 1018026 1104070 1078756 985421 858172 818533 955767
19377I55767P0410q803l2443N8062J2085j33304j65154m6248L1843M7483R2056
$$ 955767 1026177 1017374 984931 1042993 1055078 921774 756620 710372 742215 789698 881754
19366H81754L9791j14317k14011j25132O4940L03409Q4346k49178j75386k7283
$$ 881754 921545 807228 593217 468085 533025 836434 920780 671602 496216 468933
19356D68933L6477J27409J55720j72328L3944k4804j00062J8830J18915J93017
$$ 468933 505410 632819 788539 616211 650155 625351 525289 544119 663034 856051
19346H56051J7272m4505r4795K2390n7704j82403K2453P0159n9082M4648J09510
$$ 856051 873323 828818 734023 756413 698709 516306 538759 608918 549836 594484 703994
19335G03994K2145L4782m0000p0248n0623p2339J6708O2909J7712N7702j28124
$$ 703994 726139 760921 720921 650673 600050 527711 544419 607328 625040 682742 554618
19324E54618k16858k017K06175P0959m4018J5169l5749l0164m1088r5004R2354
$$ 554618 337760 335743 541918 612877 568859 584028 548279 518115 477027 382023 474377
19313D74377Q3556m6595K1640P5586k746M5296l4309k16588m0826M9531R5106
$$ 474377 557933 511338 532978 608564 605818 651114 616805 400217 359391 408922 504028
19302E04028p509M8227M5213L1852M9400k03459l4996J14667M8084q2992p6206
$$ 504028 496519 544746 589959 621811 671211 467752 432756 547423 595507 512515 436309
19291D36309N8616k4784j02497m804J04672R9676O454j4356j04175n3778k2795
$$ 436309 494925 470141 367644 362840 467512 567188 573642 559286 455111 401333 378538
19280C78538n2392R9770J40452m9769p6284K015K2566J09537j36386J4534n823
$$ 378538 326146 425916 566368 516599 440315 442330 464896 574433 438047 452581 446758
19269D46758j38646m2165J3608Q782N4923o8025O7975K69489L0777n6906o354
$$ 446758 308112 265947 279555 288337 343260 275235 343210 612699 643476 586570 580216
19258E80216j869J85769O5278j4479j10428M654k1931n3697J21895O9594P7807
$$ 580216 578347 764116 829394 814915 704487 709141 687210 633513 755408 825002 902809
19247I02809M3135o3445j7020q526R0112M8354k1334p8884j1444P9763j21261
$$ 902809 945944 882499 865479 856953 947065 995419 974085 895201 883757 963520 842259
19236H42259K315P3793Q2966J8931k04287l14015j54732N0791Q2440j90364n3234
$$ 842259 844574 918367 1001333 1020264 815977 501962 347230 398021 480461 290097 236863
19225B36863J25275J38431k3182j25295N3715J35992k44j48055k18572k9114J9334
$$ 236863 362138 500569 477387 352092 405807 541799 541555 393500 174928 145814 165148
19214A65148l0016r992K22286J45153J052j23224P4995J7390n8278N1995J10764
$$ 165148 135132 125140 347426 492579 493631 370407 445402 462792 404514 456509 567273
19203E67273J5291p0383J46437J22950J07838J5563n5967P5091P177j24043p0659
$$ 567273 582564 512181 658618 781568 889406 904969 849002 924093 931270 807227 736568
19192G36568O8692M8581K7973K3918O1925J69186K50356k5952j71595j48332m5719
$$ 736568 805260 853841 881814 905732 967657 1136843 1387199 1361247 1189652 1041320 995601
19181I95601l6988j18874R757J9065j12599l9169J1224o4847R639K1772O2088
$$ 995601 958613 839739 849496 868561 755962 716793 728017 663170 672809 694581 756669
19170G56669L611j05712J29240J42854J06766p6868k8803N6470J30759K9948n6396
$$ 756669 760280 654568 783808 926662 1033428 956560 927757 984227 1114986 1144934 1088538
19159A088538p4180q2136j00769R373o6573o6840j24337k92L6699m3417R6099
$$ 1088538 1014358 932222 831453 840826 774253 707413 583076 582784 619483 576066 672165
19148F72165j3466J03142N4437n7635j20684o6045M4785M9783R3361m404q2752
$$ 672165 658699 761841 816278 758643 637959 571914 616699 666482 759843 755439 672687
19137F72687j79774k0035L8627K3450J04646K01141m2092l3531j0098q6745k4032
$$ 672687 492913 472878 511505 534955 639601 840742 798650 765119 755021 668276 644244
19126F44244J007J469n9406k1036J15848K2841r1675J45852J49888l4287n5739
$$ 644244 645251 646720 587314 566278 682126 704967 613292 759144 909032 874745 819006
19115H19006Q2055J42447R6468J9941K2980J10325p2138m279q1746o4078n5886
$$ 819006 901061 1043508 1139976 1159917 1182897 1293222 1221084 1216805 1135059 1070981 1015095
19104A015095L9261K4325J94764J39242L0790J3396j84190p7987L7398j50947
$$ 1015095 1054356 1078681 1273445 1412687 1443477 1456873 1272683 1194696 1232094 1081147
19094A081147r7663q5497P2890P2762j05274p4697m043j699J56174O8375l2871
$$ 1081147 983484 897987 970877 1043639 938365 863668 859625 857926 1014100 1082475 1049604
19083A049604O2380Q2915O2491K6271j54265k34759o3677l6417m161N4682L3879
$$ 1049604 1111984 1194899 1257390 1283661 1129396 894637 830960 794543 790382 845064 878943
19072H78943R5055j02476j20290q4867O1877J947J48029R6061O4024j04633l8493
$$ 878943 973998 871522 751232 666365 728242 730189 878218 974279 1038303 933670 895177
19061H95177R4105K4884n9323m5217p8079l5110P4051O6488P7227J10387q4759
$$ 895177 989282 1014166 954843 909626 831547 796437 870488 936976 1014203 1124590 1039831
19050A039831L2079J33773J70280K8339j01789j39114j40627R5952J41665Q0126
$$ 1039831 1071910 1205683 1375963 1404302 1302513 1163399 1022772 1118724 1260389 1340515
19040A340515q3947K79M9095j23076p3801j12894m1087r839j40142p3232K0532
$$ 1340515 1256568 1256847 1305942 1182866 1109065 996171 955084 945245 805103 731871 752403
19029G52403M6326L9249M7546O5374Q5208L2344o3979l9376k1029N0955J0689
$$ 752403 798729 837978 885524 950898 1036106 1068450 1004471 965095 944066 995021 1005710
19018A005710j23583N967j9192O7831L7052M6380L4798J49022P6230p6908O1206
$$ 1005710 882127 888094 868902 936733 973785 1020165 1054963 1203985 1280215 1203307 1264513
19007A264513M0861L2324L9043o138J1202l2550Q956P0392K6231k9808n8712r6708
$$ 1264513 1305374 1337698 1376741 1370603 1381805 1349255 1358211 1428603 1454834 1425026 1366314 1269606
18995A269606p5171j66723m9039Q532j2186L8824O4718m9072N5027O6311j4031
$$ 1269606 1194435 1027712 978673 987205 975019 1013843 1078561 1029489 1084516 1150827 1136796
18984A136796j91571j71075L7658K35267Q6165Q8047m6061O4163L5592k6972q6641
$$ 1136796 945225 774150 811808 1047075 1133240 1221287 1175226 1239389 1274981 1248009 1161368
18973A161368j21009j0756J06224P0656q7642j94641j4188J8359Q2704P9367j30356
$$ 1161368 1040359 1029603 1135827 1206483 1118841 924200 910012 928371 1011075 1090442 960086
18962I60086j23094j3087j1679j27603n3081j24857p4833P6748j8498q5984J45912
$$ 960086 836992 823905 812226 684623 631542 506685 431852 508600 490102 404118 550030
18951E50030O7134j48160N5581o7444m3352M510P7986Q3214j3703r5810m9895
$$ 550030 617164 469004 524585 457141 413789 418299 496285 579499 565796 469986 420091
18940D20091K3678N4213J5222L6878j59312J11644J77974j26162j17060J5846
$$ 420091 443769 497982 513204 550082 390770 502414 680388 554226 437166 453012
18930D53012N0428R7170J40871K1278k3989k916Q7101q8127R197K4257K6293K6513
$$ 453012 503440 600610 741481 762759 738770 735854 822955 734828 744025 768282 794575 821088
18918H21088o8438J9086j76916j79766N9848N2610l7594k9352J6418Q5949L4866
$$ 821088 752650 771736 594820 415054 474902 527512 489918 460566 476984 562933 597799
18907E97799j93844q4615J27887j1462j32465n1893Q1977O6631m8723l0666J10961
$$ 597799 403955 319340 447227 435765 303300 251407 333384 400015 351292 320626 431587
18896D31587R4896l4111k4776o5658k6078J92120O2478m9321j09895l5641o573
$$ 431587 526483 492372 467596 401938 375860 567980 630458 581137 471242 435601 429028
18885D29028J93338r930k1928K0399l4258j92495j15364J10433J23948J60155
$$ 429028 622366 612436 590508 610907 576649 384154 268790 379223 503171 663326
18875F63326N7974O6677J686r7179l0824q6577K7786k1516J735n7816j02294l8536
$$ 663326 721300 787977 789663 692484 661660 575083 602869 581353 583088 525272 422978 384442
18863C84442M1955O4808m8557p9377m0236O2705L7359k8728j42590j27504l3576
$$ 384442 426397 491205 442648 363271 323035 385740 423099 394371 251781 124277 90701
18852I0701R9353M2466L6218R379L0041q9803j32924J52392O2761Q1494N5196
$$ 90701 190054 232520 268738 278117 308158 218355 85431 237823 300584 382078 437274
18841D37274J06179J12934M5883p2445P405j09388P9340O6370N3463m1425j44559
$$ 437274 543453 656387 702270 629825 637230 527842 607182 673552 727015 685590 541031
18830E41031m1515J40191m8482j92279R2123O5567K9804N2823J0418j54781p0663
$$ 541031 499516 639707 591225 398946 491069 556636 586440 639263 649681 494900 424237
18819D24237R4795L9734N4559P4553j5018r9526j51959n0906J42576N9771m3529
$$ 424237 519032 558766 613325 687878 672860 573334 421375 370469 513045 572816 529287
18808E29287O4684n5885q7922k7690N8097l690j4608q4423j85967J1505j8400
$$ 529287 593971 538086 450164 422474 480571 476881 462273 377850 191883 203388 184988
18797A84988P1694J11513q592L2224J4300P7530J825K6382p7762j6057J52740
$$ 184988 256682 368195 359603 391827 406127 483657 485482 511864 434102 418045 570785
18786E70785L4815r8722k6541r334m5947q6314N4267J9608n8038J00087J60503
$$ 570785 605600 506878 480337 471003 425056 338742 393009 412617 354579 454666 615169
18775F15169P0541J161j77039P94J63865k3343l6341p954L3687O0183O0570j1146
$$ 615169 685710 686871 509832 510626 674491 651148 614807 606853 640540 700723 761293 750147
18763G50147n1850p7599K0807K03618J09454r408L6256j09034j20666p7754M808
$$ 750147 698297 620698 641505 845123 954577 945169 981425 872391 751725 673971 678779
18752F78779N7062k8477o1330q7678r2916J16149J1980k5290m5418P3447Q2971
$$ 678779 735841 707364 646034 558356 465440 581589 593569 568279 522861 596308 679279
18741F79279K4070J3447K0789Q1771J5146n978j95070R374l3887K4038N5012J23304
$$ 679279 703349 716796 737585 819356 834502 828524 633454 642828 608941 632979 687991 811295
18729H11295j62454j19341J25169J4356O2296J29705J34849n2877k8336j19551
$$ 811295 648841 529500 654669 669025 731321 861026 995875 942998 914662 795111
18719G95111q5034J63613O7223o8635J9995J9025J8141O2559R7339J64409l9521
$$ 795111 710077 873690 940913 872278 892273 911298 929439 991998 1089337 1253746 1214225
18708A214225j35675l9442J54025O4149l9942p4390k2314r8621j1880K33828J8808
$$ 1214225 1078550 1039108 1193133 1257282 1217340 1142950 1120636 1022015 1010135 1243963 1262771
18697A262771P4020N7653J01098N2751J19297M6969L7488k9534r021j5356r6887
$$ 1262771 1336791 1394444 1495542 1548293 1667590 1714559 1752047 1722513 1713492 1698136 1601249
18686A601249j20032P6474K8692J88084N0146o7840r7696J13547N5873O5976L2989
$$ 1601249 1481217 1557691 1586383 1774467 1824613 1756773 1659077 1772624 1828497 1894473 1927462
18675A927462k7288J76220K39560J35631J16297O1839P9257J89369J16910L22644
$$ 1927462 1900174 2076394 2315954 2451585 2567882 2629721 2708978 2898347 3015257 3337901
18665C337901J97753L53155M07493J98644K52431L31657K77136L42787N95355
$$ 3337901 3535654 3888809 4296302 4494946 4747377 5079034 5356170 5698957 6294312
18656F294312M28622N39080R19665R76375J097848J280774J638692K088794K710790
$$ 6294312 6722934 7262014 8181679 9158054 10255902 11536676 13175368 15264162 17974952
18647A7974952L646221N560571Q289414J1575615J4437610J6250092J7289289
$$ 17974952 21621173 27181744 35471158 47046773 61484383 77734475 95023764
18640I5023764J6245825J2799164P788072K076709l462131r160867j2976755j3691431
$$ 95023764 111269589 124068753 131856825 133933534 130471403 121310536 108333781 94642350
18632I4642350j4217957j3147053j0602496q410790o696766n214851m018752l239620
$$ 94642350 80424393 67277340 56674844 48264054 41567288 36352437 32333685 29094065
18624B9094065k750530k244501j870549j500072j358064j045192r10288r57924
$$ 29094065 26343535 24099034 22228485 20728413 19370349 18325157 17414869 16456945
18616A6456945q35818n93421m88155l91204m13732m22892l18818j64268n0442
$$ 16456945 15621127 15027706 14539551 14148347 13734615 13311723 12992905 12828637 12778195
18607A2778195R802L7072R648J56590J31458K88902N72436O30191Q69975J148779
$$ 12778195 12787997 12825069 12834717 12991307 13122765 13411667 13984103 14614294 15484269 16633048
18597A6633048J228081J466066J870072K458806L488432M941616P169571J0320676
$$ 16633048 17861129 19327195 21197267 23656073 27144505 32086121 39255692 49576368
18589D9576368J3116714J4794083J6030063J5404744J2465048Q370598L696321
$$ 49576368 62693082 77487165 93517228 108921972 121387020 129757618 133453939
18582A33453939q36590n562930p883922p217597n483739j238824M008439Q082080
$$ 133453939 132617349 127054419 119170497 111952900 106469161 105230337 109238776 117320856
18574A17320856J1174906J2068519J0104274O189308J028036m075386r535645
$$ 117320856 128495762 140564281 150668555 156857863 157885899 153810513 144274868
18567A44274868j3903532j5109876j5662028j5057200j2542198r875758p912945
$$ 144274868 130371336 115261460 99599432 84542232 72000034 62124276 54211331
18560E4211331o323183n016395l960706l312119k714587k269875k008349j792168
$$ 54211331 47888148 42871753 38911047 35598928 32884341 30614466 28606117 26813949
18552B6813949j674914j470721j300453j087324q55302p42589o73377o23045o99558
$$ 26813949 25139035 23668314 22367861 21280537 20425235 19682646 19009269 18386224 17686666
18543A7686666o35858n66600l82190l36904k23402j90315r2566M6355J0961K33738
$$ 17686666 17050808 16484208 16102018 15765114 15541712 15351397 15258831 15305186 15316147 15549885
18533A5549885L31320N24127O81466P58506J220875J602186J973902K889342M084726
$$ 15549885 15881205 16405332 17086798 17845304 19066179 20668365 22642267 25531609 29616335
18524B9616335O094297Q946548J2074155J4113488J5002408J4664272J2112572
$$ 29616335 35710632 44657180 56731335 70844823 85847231 100511503 112624075
18517A12624075Q173459L382890j592460p049197j1197378j2321865j2963978
$$ 112624075 120797534 124180424 122587964 115538767 104341389 92019524 79055546
18510G9055546j2643515j0645202q350563o627266n338987m266979l161290k489109
$$ 79055546 66412031 55766829 47416266 40789000 35450013 31183034 28021744 25532635
18502B5532635k136751j831906j642441j456841j288587j183410r53441p52249
$$ 25532635 23395884 21563978 19921537 18464696 17176109 15992699 15039258 14287009
18494A4287009q15112o86200p27974p75130o54483n59470m01441l99647n03832
$$ 14287009 13471897 12785697 12057723 11282593 10628110 10068640 9667199 9267552 8763720
18485H763720o10369l99320l68544l05973j37718k30811j37873j0935k08006k43569
$$ 8763720 8153351 7754031 7385487 7079514 6941796 6710985 6573112 6562177 6354171 6110602
18475F110602j90162j9473k17702k34791l00540q6653o1021j31832k13529k78439
$$ 6110602 5920440 5900967 5683265 5448474 5147934 5061281 5000260 4868428 4654899 4376460
18465D376460k92756N8488j6560m1245K0425m8571j44765j11645j43412j31870
$$ 4376460 4083704 4142192 4125632 4084387 4104812 4056241 3911476 3799831 3656419 3524549
18455C524549j14049j10031l05148k22897j38555p654K6535j69586j81592N9322
$$ 3524549 3410500 3300469 2995321 2772424 2633869 2626215 2652750 2483164 2301572 2360894
18445B360894L2503r0789k8539q7940r8941k44240j10361K8719j59l0954o917
$$ 2360894 2393397 2302608 2274069 2186129 2087188 1842948 1732587 1761306 1761147 1730193 1723276
18434A723276Q722k2552k2399n5599N0878j2972j46995o8575R7453M588k54464
$$ 1723276 1731998 1709446 1687047 1631448 1682326 1669354 1522359 1453784 1551237 1555825 1301361
18423A301361j72505N7875N5825n6868l564P4737J54744j6834p0848P7545j5774
$$ 1301361 1128856 1186731 1242556 1185688 1182124 1256861 1411605 1394771 1323923 1401468 1385694
18412A385694J3m76m4676k05354o7277P4741J09376J44335n8631j23723p4527
$$ 1385694 1385707 1385231 1340555 1135201 1067924 1142665 1252041 1396376 1337745 1214022 1139495
18401A139495J01621L8291j5066J7288p1680j01003M1877l2882k48095j19018
$$ 1139495 1241116 1279407 1264341 1281629 1209949 1108946 1150823 1117941 869846 750828
18391G50828L5624m9241j2118O4481j0698o2233K6579J13746j40607m0283J02499
$$ 750828 786452 737211 725093 789574 778876 716643 743222 856968 716361 676078 778577
18380G78577p1710l0238j6583j1029K2563M952j74569q0073n052O0845l5970K021
$$ 778577 706867 676629 660046 649017 671580 676532 501963 421890 416838 477683 441713 443734
18368D43734l938M0137J71693O5655j41536j20065P6479j2701j20678o3792k099
$$ 443734 439796 479933 651626 717281 575745 455680 532159 519458 398780 334988 332889
18357C32889k191P1654N4651P5103N6410m1493q1435J36516n102M9089j1105n7118
$$ 332889 330698 402352 457003 532106 588516 547023 465588 602104 597002 646091 634986 577868
18345E77868K5371Q6540J3816j47898m0257J31992Q9021K277m8981q0777l8258
$$ 577868 603239 689779 703595 555697 515440 647432 736453 738730 689749 608972 570714
18334E70714J0732j5930j1221k7734O0210J26569k3884l7212j88964n5873P0690
$$ 570714 581446 565516 554295 526561 586771 713340 689456 652244 463280 407407 478097
18323D78097M5211J6485j09099j9842j62822j78480k6800J5873K9097J27018j09213
$$ 478097 523308 539793 430694 410852 248030 69550 42750 58623 87720 214738 105525
18312A05525o9470L9419j2804Q5592K327N2034J2662J30253P7436k4428q1968
$$ 105525 36055 75474 62670 148262 150589 202623 215285 345538 422974 398546 316578
18301C16578Q5307M7333p0844J8687j7981j3413m4867j83303n4828R6731J43784
$$ 316578 401885 449218 378374 397061 379080 365667 320800 137497 82669 179400 323184
18290C23184J618K6304l708N4055k8997r5562j14814P5707P0495Q447j45926k6881
$$ 323184 324802 351106 347398 401453 372456 276894 162080 237787 308282 316729 170803 143922
18278A43922O4924k7387N5544J8509l5821l553J03206m7022k0856p6312n9307
$$ 143922 208846 181459 237003 255512 219691 216138 319344 272322 251466 175154 115847
18267A15847L8766P0310L6959l5939o1435n439Q430r4834p0049N4239N9650n9020
$$ 115847 154613 224923 261882 225943 164508 159069 167499 72665 2616 56855 116505 57485
18255E7485j7613l6293L5272M6992K9173K7286M8744k5540j37640M9447J05359
$$ 57485 39872 3579 38851 85843 115016 142302 191046 165506 27866 77313 182672
18244A82672L3000J3280Q3936J63662J1645j13707r8531m4286k9845J30301L540
$$ 182672 215672 228952 312888 476550 488195 374488 275957 231671 201826 332127 335667
18233C35667K0007q2458p7041j35977j86697j57572M9579J09052J09489J36725
$$ 335667 355674 273216 196175 60198 -126499 -284071 -234492 -125440 -15951 120774
18223A20774J24485O7109L6069j0197q4300r8639k1701Q4069p8451L7815P1860
$$ 120774 245259 312368 348437 338240 253940 155301 133600 217669 139218 177033 248893
18212B48893p9930j15591j3872n8163J5164m9611J69085J56191l6868k73513j16011
$$ 248893 168963 53372 39500 -18663 -3499 -53110 115975 272166 235298 -38215 -154226
18201a54226Q2052J14117m540n284q598P3469J3937J03674m5045J40489o379q1002
$$ -154226 -72174 41943 37403 32119 23521 96990 110927 214601 169556 310045 303666 222664
18189B22664r8814K4852P2027j5027O7667O1098J19585L0917j12139k7726M6544
$$ 222664 123850 148702 220729 205702 273369 334467 454052 484969 372830 345104 391648
18178C91648J6077k1555O2027j33782j21551Q3516O0069j3843m1821j12061J22235
$$ 391648 407725 386170 448197 314415 192864 276380 336449 322606 280785 168724 290959
18167B90959P0705L681p6264M196M9799Q0277l2235p4219k7319M6087n0061l1739
$$ 290959 361664 365345 289081 293277 343076 423353 391118 316899 289580 335667 285606 253867
18155B53867L332o7802j28107k4999J17305N7057n340J6754N2734l5323K7520
$$ 253867 257199 189397 61290 36291 153596 210653 205313 222067 274801 239478 266998
18144B66998n5593n1064J0034J86945J75378j16411j4114L2356j5601J2719O9816
$$ 266998 211405 160341 170375 357320 532698 416287 402173 434529 418928 431647 501463
18133E01463L3497k5369r0305J56473O6421n5474j04954o1877q4187J4056K778
$$ 501463 534960 509591 419286 575759 642180 586706 481752 419875 335688 349744 352522
18122C52522N4560r1063Q4765M1558J508q067J4848j77121M1312J20467p946r2987
$$ 352522 407082 316019 400784 442342 443850 435783 450631 273510 314822 435289 427343 334356
18110C34356L1900M4290q481J4463J39348J18841J05218L6285r9938P149J6572
$$ 334356 366256 410546 402065 416528 555876 674717 779935 816220 716282 723431 740003
18099G40003k3136n230k22587j50643O0531Q8184Q2401M2462j0001j22550o6543
$$ 740003 716867 711637 489050 338407 398938 487122 569523 611985 601984 479434 412891
18088D12891j05198l4221j9431j6235J24273K1853m6438P860K2210J15215J45660
$$ 412891 307693 273472 254041 237806 362079 383932 337494 345354 367564 482779 628439
18077F28439k9781j27594J7868Q3788n6162o7973R6166Q5645o6824o8864l5425
$$ 628439 598658 471064 488932 572720 516558 448585 544751 630396 563572 494708 459283
18066D59283K4863N4633q6231l4149j44003M1426P6284J65739k277J4560M6223
$$ 459283 484146 538779 452548 418399 274396 315822 392106 557845 555568 570128 616351
18055F16351r276Q7683J83326N6950P7233L522j4559J3137n2278j11106p8529
$$ 616351 607075 694758 878084 935034 1012267 1015789 1001230 1014367 962089 850983 772454
18044G72454k9642O4124n9780m866N8678K1239P3872J69227R6409j2599j24985
$$ 772454 742812 806936 747156 742290 800968 822207 896079 1065306 1161715 1149116 1024131
18033A024131j52970r0154j52156p1516J017j3311n2476j6538p3330Q0160k110
$$ 1024131 871161 781007 628851 557335 558352 545041 492565 476027 402697 482857 480747
18022D80747j75128o0759R205M2525J11573J29661K2187l8052q9604j38552p9933
$$ 480747 305619 244860 254065 296590 408163 537824 560011 521959 432355 293803 213870
18011B13870L9574p7376q4717R919J26380Q4099J76318Q0006j0378k32433j76950
$$ 213870 253444 176068 91351 101270 227650 311749 488067 568073 557695 325262 148312
18000A48312k65K679J85460L6311j37806n2538N5410k5246o5165M4656Q4473O2001
$$ 148312 148047 150726 336186 372497 234691 182153 237563 212317 147152 191808 276281 338282
17988C38282J3290K4719M2512k1144J74097P7598p2299p1291M182L4255r4302
$$ 338282 351572 376291 418803 397659 571756 649354 577055 505764 509946 544201 449899
17977D49899o8747j7556k215m7003j01996n5340O7496j5316o8254P082L292j57027
$$ 449899 381152 363596 361381 314378 212382 157042 224538 209222 140968 148050 151342 -5685
17965e685n6790L8429J16815J1314q8601j37946J37103N9443n1374j21667K2239
$$ -5685 -62475 -24046 92769 104083 15482 -122464 14639 74082 22708 -98959 -76720
17954g6720O7478m0584j4576O4810Q1964n4916j8140n4936q6180p6911L1105J5487
$$ -76720 -9242 -49826 -64402 408 82372 27456 9316 -45620 -131800 -208711 -177606 -162119
17942a62119K7985J30011Q1166j54804q245K25825Q8767j21722j50390j85613
$$ -162119 -134134 -4123 77043 -77761 -86006 139819 228586 106864 -43526 -229139
17932b29139j7365J33547K9601K2300L0319J8425M7057R278p664O3966k6774o1523
$$ -229139 -246504 -112957 -83356 -61056 -30737 -12312 34745 44023 36359 100325 73551 12028
17920A2028j22625j88171L8568M7889K4301K3863J4035Q4896j3719K3853J01734
$$ 12028 -110597 -298768 -260200 -212311 -188010 -164147 -150112 -65216 -78935 -55082 46652
17909D6652N0008J2710L524p9592j18865P365j4763J18902N3735M825k5823r416
$$ 46652 96660 109370 112894 33302 -85563 -78198 -92961 25941 79676 84501 58678 49262
17897D9262q8960M208j17083l4375P0847Q4578M6364r6956o2832j8081Q9948p0822
$$ 49262 -39698 -35490 -152573 -186948 -116101 -31523 14841 -82115 -144947 -163028 -73080 -143902
17885a43902J89781K7116j29723o0613L2435J28489j1391N6336J34779J1984j46520
$$ -143902 45879 72995 -56728 -117341 -84906 43583 32192 88528 223307 235291 88771
17874H8771j00328j81087j02204J22248J40614q8970p1731J30988n1456K1372
$$ 88771 -11557 -192644 -294848 -172600 -31986 -120956 -192687 -61699 -113155 -91783
17864i1783Q9226J30024j04865j70223o1929J05986K0223k8500L1239P0192J09927
$$ -91783 -2557 127467 22602 -147621 -209550 -103564 -83341 -111841 -80602 -10410 99517
17853I9517k3947k8142J23579M9920k16394j14657j0390l1030J28793N5769K5848
$$ 99517 75570 47428 171007 220927 4533 -110124 -120514 -151544 -22751 33018 58866
17842E8866l3855M5043J06661n0051l9195K5262k1286P8013m1697n1297m6793
$$ 58866 25011 70054 176715 126664 87469 112731 91445 169458 127761 76464 29671
17831B9671K1401r0785o9605L2245j09441r7479K1354n7938l0961R6711q275k8757
$$ 29671 51072 -39713 -109318 -77073 -186514 -283993 -262639 -320577 -351538 -254827 -263102 -291859
17819b91859K9823Q8742N6854k4429Q1184J14795j06282R4749L2339m9857j44477
$$ -291859 -262036 -173294 -116440 -140869 -59685 55110 -51172 43577 75916 26059 -118418
17808a18418p0788o762J03329Q4159P849l4809k501M1134q3221J2061k721J05039
$$ -118418 -189206 -195968 -92639 -8480 -631 -35440 -37941 3193 -80028 -67967 -70688 34351
17796C4351J27453n2395j20250j23710r2416M4001r555j0023M8697Q0738n141
$$ 34351 161804 109409 -10841 -134551 -226967 -182966 -192521 -202544 -153847 -73109 -78250
17785g8250M30M1249m733J6037L8937L5529J3496J54115P5057j6116k04760j60979
$$ -78250 -77820 -36571 -41304 -25267 13670 49199 62695 216810 291867 275751 70991 -89988
17773h9988P2069q0508K4521K32725M165L8806o1316j86296J5163m6431r459J994
$$ -89988 -17919 -98427 -73906 158819 162984 201790 140474 -45822 -30659 -77090 -86549 -84555
17761h4555Q0696J56749j19999j16674K2617R8224p0806M8299Q221q1285k8706
$$ -84555 -3859 152890 32891 -83783 -61166 37058 -33748 14551 22772 -58513 -87219
17750h7219q2284R0644J57598J8890R1438l4558j63735j06925R560j25585K1105
$$ -87219 -169503 -78859 78739 97629 189067 154509 -9226 -116151 -106591 -232176 -211071
17739b11071Q2515J56056J35302K6992J0330j21094j30946j03159J01044L2656
$$ -211071 -128556 27500 162802 189794 200124 79030 -51916 -155075 -54031 -21375
17729b1375o782P5821j0542M2648o407l9499m9343M4497Q0378R2080k8963J3522
$$ -21375 -28157 47664 37122 79770 73363 33864 -15479 29018 109396 201476 172513 186035
17717A86035r5261l2938N8305p2766r9104J3212L1990j56611n9019N7072P1942
$$ 186035 90774 57836 116141 43375 -55729 -42517 -10527 -167138 -226157 -169085 -97143
17706i7143Q4983k3962r7674j6672N5470m3610N053M9614j8329L2485K1591n9987
$$ -97143 -12160 -36122 -133796 -150468 -94998 -138608 -133555 -83941 -102270 -69785 -48194 -108181
17694a08181j60355k0830J01491K08907L3121j84066j79246l1471J3377R2768
$$ -108181 -268536 -289366 -187875 21032 54153 -129913 -309159 -340630 -327253 -234485
17684b34485n9106j32319M7351Q6663R3934M5458P2318M6931N8271m8283j28553
$$ -234485 -293591 -425910 -378559 -291896 -197962 -152504 -80186 -33255 25016 -23267 -151820
17673a51820M5814p113l4450p2235M2257R2506m672p9466R632M2107L6281m4099
$$ -151820 -106006 -113119 -147569 -219804 -177547 -85041 -89713 -169179 -159547 -117440 -81159 -125258
17661a25258J7678L5169J02030J78629k9334j06080j43933o3933L4850j08686
$$ -125258 -107580 -72411 29619 208248 178914 72834 -71099 -135032 -100182 -208868
17651b08868o2703R1793J41398k9231j24881l9748M4884J41399J39925L8391j26875
$$ -208868 -271571 -179778 -38380 -67611 -192492 -232240 -187356 -45957 93968 132359 5484
17640E484j55992L6059j455R027O9890P4802o7366o1499q4972L279Q3848k5729
$$ 5484 -150508 -114449 -115904 -106877 -36987 37815 -29551 -91050 -176022 -172743 -88895 -114624
17628a14624P8575J2342q7387K1559l5009n3470m2853k5064J65008J44300N7892
$$ -114624 -36049 -23707 -111094 -89535 -124544 -178014 -220867 -245931 -80923 63377 121269
17617A21269L6401r6561Q716j8780L3143Q4829l5204k6782j04857r5675q043n9805
$$ 121269 157670 61109 69825 51045 84188 169017 133813 107031 2174 -93501 -101544 -161349
17605a61349n8555j325J17798K137q5375N5065Q0550J8307l9256q4041O3324L9425
$$ -161349 -219904 -221229 -103431 -101294 -186669 -131604 -51054 -32747 -72003 -156044 -92720 -53295
17593e3295Q961j26978K2067J07495M1792m1385J1626k7405j09974N9066J62259
$$ -53295 -44334 -171312 -149245 -41750 42 -41343 -29717 -57122 -167096 -108030 54229
17582E4229L5329n4603j71767k1373J1055r8712J7736O8230p295l7932O9144L1996
$$ 54229 89558 34955 -136812 -158185 -147130 -245842 -228106 -159876 -167171 -205103 -135959 -103963
17570a03963n1070n1483K6800N0936P8646J9945l3390j40214r492O0291N8514
$$ -103963 -155033 -206516 -179716 -128780 -50134 -30189 -63579 -203793 -213285 -152994 -94480
17559i4480o02n8313q5942O6250Q3377n4914j62669o6178J23440Q8317k1751m9707
$$ -94480 -95082 -153395 -239337 -173087 -89710 -144624 -307293 -373471 -250031 -161714 -183465 -233172
17547b33172J9192N0088L1397R237k9655o9255r705J21982M9369m5397M4078O8842
$$ -233172 -213980 -163892 -132495 -123258 -152913 -222168 -231873 -109891 -60522 -105919 -61841 7001
17535G001Q172p2980p3595m8003K9839M7763p208j05929m1622K9654O5923Q9079
$$ 7001 15173 -57807 -131402 -179405 -149566 -101803 -109011 -214940 -256562 -226908 -160985 -71906
17523g1906q6816l0061p3019J58905J73758J9979m2123j28981k7215o4302J31539
$$ -71906 -158722 -188783 -261802 -102897 70861 90840 48717 -80264 -107479 -171781 -40242
17512d0242J84693O7017l857r9721j22007o1204J09841J05231m3843j25667n9504
$$ -40242 144451 211468 207611 107890 -14117 -75321 34520 139751 95908 -29759 -89263
17501h9263J68883J5473k1660q5960L9503l4514l3569J8613R1181o5510l0666
$$ -89263 79620 95093 73433 -12527 26976 -7538 -41107 -22494 68687 3177 -27489
17490b7489M8549n9865n7063L5604R6636p1230j0510J5877K8953n6900l5245K3189
$$ -27489 21060 -38805 -95868 -60264 36372 -34858 -45368 -29491 -538 -57438 -92683 -69494
17478f9494k23328j3753R5636L0939J40593Q5125j5454q1632j2841K2460l2821
$$ -69494 -292822 -306575 -210939 -180000 -39407 45718 30264 -51368 -64209 -41749 -74570
17467g4570j10460Q869J22389m705j30365j3040r6355N229J63725L7025m5486
$$ -74570 -185030 -176161 -53772 -58477 -188842 -201882 -298237 -293008 -129283 -92258 -137744
17456a37744n0696J3179L8136N7851j4522j06431q0442J24056Q612j09843Q4418
$$ -137744 -188440 -175261 -137125 -79274 -93796 -200227 -280669 -156613 -148001 -257844 -173426
17445a73426l5115j8828J17282Q9864M9497j18920j54264K2165K4680J0294k9087
$$ -173426 -208541 -227369 -110087 -20223 29274 -89646 -243910 -221745 -197065 -186771 -215858
17434b15858l4043r6396L6779M7826M0280Q454R7282O0149r9096j079o7141p363
$$ -215858 -249901 -346297 -309518 -261692 -221412 -212958 -115676 -55527 -154623 -155702 -222843 -230206
17422b30206K7870m2710n3969J4670J01226K1931l0396P8908j7901L7388q9372
$$ -230206 -202336 -245046 -299015 -284345 -183119 -161188 -191584 -112676 -130577 -93189 -182561
17411a82561j15354J41562R8768o670R0897l0378k2323N9738j45357j13747l5739
$$ -182561 -297915 -156353 -57585 -64255 26642 -3736 -26059 33679 -111678 -225425 -261164
17400b61164K08274J6862j39047k1124j649j1968p6648R2974J3396J8176k5800
$$ -261164 -52890 -36028 -175075 -196199 -197848 -209816 -286464 -193490 -180094 -161918 -187718
17389a87718L3368J7745L8490l9308Q4061P7824P0544J3733q9835N4126m7791
$$ -187718 -154350 -136605 -98115 -137423 -53362 24462 95006 108739 18904 73030 25239
$$ [...]
##END NTUPLES=NMR SPECTRUM
##END=
