##TITLE=Analysis number 318170
Compound Code cc 53709
Book Reference 458/108
Project Code adrs
Chemist Name stevem
##JCAMPDX= 6.0         $$ Bruker NMR JCAMP-DX V2.0
##DATA TYPE= NMR SPECTRUM
##DATA CLASS= NTUPLES
##ORIGIN= Bruker BioSpin GmbH
##OWNER= nmr
$$ XWIN-NMR		Version 3.5
$$ Fri Mar 17 11:52:14 2006 GMT Standard Time (UT+0h)  MAYBRIDGE\nmr@NMR_250MHZ
##.OBSERVE FREQUENCY= 250.131544655141
##.OBSERVE NUCLEUS= ^1H
##.ACQUISITION MODE= SIMULTANEOUS (DQD)
##.ACQUISITION SCHEME= undefined
##.AVERAGES= 16
##.DIGITISER RES= 18
##SPECTROMETER/DATA SYSTEM= dpx250
##.PULSE SEQUENCE= zg30
##.SOLVENT NAME= CDCl3
##.SHIFT REFERENCE= (INTERNAL, CDCl3, 0, 16.522)
##AUDIT TRAIL= $$ (NUMBER, WHEN, WHO, WHERE, WHAT)
$$ ##TITLE= Audit trail, XWIN-NMR		Version 3.5
$$ ##JCAMPDX= 5.01
$$ ##ORIGIN= Bruker BioSpin GmbH
$$ ##OWNER= nmr
$$ C:\u/data/dgb/nmr/ADRS/940/pdata/1/auditp.txt
$$ ##AUDIT TRAIL=  $$ (NUMBER, WHEN, WHO, WHERE, WHAT)
(   1,<2006-03-17 11:51:11.20 +000>,<MAYBRIDGE\nmr>,<NMR_250MHZ>,
      <created by zg, POWCHK disabled, PULCHK disabled
       configuration hash MD5:
       84 BC 41 DB A1 6E 1D 46 DA 25 12 A5 C1 ED C5 3A
       data hash MD5: 64K
       44 19 EA B1 99 7E FC E0 59 7E FD 93 70 63 9C 4D>)
(   2,<2006-03-17 11:51:32.05 +000>,<MAYBRIDGE\nmr>,<NMR_250MHZ>,
      <Start of raw data processing
       ef LB = 0.3 FT_mod = 6 PKNL = 1 SI = 32K 
       data hash MD5: 32K
       82 86 40 C9 ED 19 EC 15 64 35 74 22 32 2A 55 6A>)
(   3,<2006-03-17 11:51:36.20 +000>,<MAYBRIDGE\nmr>,<NMR_250MHZ>,
      <apk 
       data hash MD5: 32K
       42 62 8B B3 F3 E8 A7 29 DF 3C E4 3D E7 3A 77 A9>)
(   4,<2006-03-17 11:51:38.35 +000>,<MAYBRIDGE\nmr>,<NMR_250MHZ>,
      <abs ABSG = 5 
       data hash MD5: 32K
       75 7D 0F 50 F3 58 B5 14 18 C5 34 0F 1E 62 DF 43>)
$$ ##END=
$$ 
$$ hash MD5
$$ 2A B5 39 25 E3 10 78 7F ED 3F D4 A3 FE BA D8 08
##$RELAX= 
##$RELAX= 
##$RELAX= 
##$RELAX= 
##$RELAX= 
##$RELAX= 
##$RELAX= 
$$ Bruker specific parameters
$$ --------------------------
##$DU= <C:\u>
##$EXPNO= 940
##$NAME= <ADRS>
##$PROCNO= 1
##$TYPE= <nmr>
##$USER= <dgb>
##$AMP= (0..31)
100 100 100 100 100 100 100 100 100 100 100 100 100 100 100 100 100 100 
100 100 100 100 100 100 100 100 100 100 100 100 100 100 
##$AQSEQ= 0
##$AQ_mod= 3
##$AUNM= <au_zg>
##$AUTOPOS= <24 >
##$BF1= 250.13
##$BF2= 250.13
##$BF3= 250.13
##$BF4= 250.13
##$BF5= 500.13
##$BF6= 500.13
##$BF7= 500.13
##$BF8= 500.13
##$BYTORDA= 1
##$CFDGTYP= 0
##$CFRGTYP= 5
##$CHEMSTR= <none>
##$CNST= (0..31)
1 1 145 1 1 1 1 1 1 1 1 1 1 1 1 1 1 1 1 1 1 1 1 1 1 1 1 1 1 1 1 1 
##$CPDPRG= <>
##$CPDPRG1= <>
##$CPDPRG2= <>
##$CPDPRG3= <>
##$CPDPRG4= <mlev>
##$CPDPRG5= <mlev>
##$CPDPRG6= <mlev>
##$CPDPRG7= <mlev>
##$CPDPRG8= <mlev>
##$CPDPRGB= <>
##$CPDPRGT= <>
##$D= (0..31)
0 1 0 0 0 0 0 0 0 0.06 0 0 0 0 0 0 0.0002 0 0 0 0 0 0 0 0 0 0 0 0 0 0 
0 
##$DATE= 1142596269
##$DBL= (0..7)
120 120 120 120 120 120 120 120 
##$DBP= (0..7)
150 150 150 150 150 150 150 150 
##$DBP07= 0
##$DBPNAM0= <>
##$DBPNAM1= <>
$$ [...]
##$SUBNAM7= <"">
##$SUBNAM8= <"">
##$SUBNAM9= <"">
##$SW= 20.6930455092707
##$SWIBOX= (0..15)
0 0 3 0 0 0 0 0 0 0 0 0 0 0 0 0 
##$SW_h= 5175.983436853
##$TD= 65536
##$TD0= 1
##$TE= 294.16
##$TE2= 300
##$TE3= 300
##$TEG= 300
##$TL= (0..7)
0 120 120 120 120 120 120 120 
##$TP= (0..7)
150 150 150 150 150 150 150 150 
##$TP07= 0
##$TPNAME0= <>
##$TPNAME1= <>
##$TPNAME2= <>
##$TPNAME3= <>
##$TPNAME4= <>
##$TPNAME5= <>
##$TPNAME6= <>
##$TPNAME7= <>
##$TPOAL= (0..7)
0.5 0.5 0.5 0.5 0.5 0.5 0.5 0.5 
##$TPOFFS= (0..7)
0 0 0 0 0 0 0 0 
##$TUNHIN= 0
##$TUNHOUT= 0
##$TUNXOUT= 0
##$USERA1= <user>
##$USERA2= <user>
##$USERA3= <user>
##$USERA4= <user>
##$USERA5= <user>
##$V9= 5
##$VALIST= <valist>
##$VCLIST= <CCCCCCCCCCCCCCC>
##$VD= 0
##$VDLIST= <DDDDDDDDDDDDDDD>
##$VPLIST= <PPPPPPPPPPPPPPP>
##$VTLIST= <TTTTTTTTTTTTTTT>
##$WBST= 1024
##$WBSW= 4
##$XGAIN= (0..3)
0 0 0 0 
##$XL= 0
##$YL= 0
##$YMAX_a= 522087
##$YMIN_a= -509082
##$ZGOPTNS= <>
##$ZL1= 120
##$ZL2= 120
##$ZL3= 120
##$ZL4= 120
##$ABSF1= 16.522
##$ABSF2= -4.171173
##$ABSG= 5
##$ABSL= 3
##$ALPHA= 0
##$AQORDER= 0
##$ASSFAC= 0
##$ASSFACI= 0
##$ASSFACX= 0
##$ASSWID= 0
##$AUNMP= <proc_1d>
##$AZFE= 0.1
##$AZFW= 0.1
##$BCFW= 0
##$BC_mod= 0
##$BYTORDP= 0
##$COROFFS= 0
##$CY= 12.5
##$DATMOD= 1
##$DC= 0
##$DFILT= <>
##$DTYPP= 0
##$F1P= 14.0000005364418
##$F2P= -0.99999901652339
##$FCOR= 0.5
##$FTSIZE= 32768
##$FT_mod= 6
##$GAMMA= 0
##$GB= 0
##$INTBC= 1
##$INTSCL= 1
##$ISEN= 128
##$LB= 0.3
##$LEV0= 0
##$LPBIN= 0
##$MAXI= 10000
##$MC2= 0
##$MEAN= 0
##$ME_mod= 0
##$MI= 0
##$NCOEF= 0
##$NC_proc= -4
##$NLEV= 6
##$NOISF1= 0
##$NOISF2= 0
##$NSP= 0
##$NTH_PI= 0
##$NZP= 0
##$OFFSET= 16.522
##$PC= 1
##$PHC0= 173.8384
##$PHC1= 7.636099
##$PH_mod= 1
##$PKNL= yes
##$PPARMOD= 0
##$PSCAL= 4
##$PSIGN= 0
##$REVERSE= no
##$SF= 250.13
##$SI= 32768
##$SIGF1= 0
##$SIGF2= 0
##$SINO= 400
##$SIOLD= 32768
##$SREGLST= <1H.CDCl3>
##$SSB= 0
##$STSI= 32768
##$STSR= 0
##$SW_p= 5175.98343685301
##$SYMM= 0
##$S_DEV= 0
##$TDeff= 65536
##$TDoff= 0
##$TI= <Analysis number 999999
Compound Code 99
Book Reference 9
Project Code 9>
##$TILT= no
##$TM1= 0
##$TM2= 0
##$TOPLEV= 0
##$USERP1= <user>
##$USERP2= <user>
##$USERP3= <user>
##$USERP4= <user>
##$USERP5= <user>
##$WDW= 1
##$XDIM= 32768
##$YMAX_p= 406649884
##$YMIN_p= -194394
$$ End of Bruker specific parameters
$$ ---------------------------------
##NTUPLES= NMR SPECTRUM
##VAR_NAME=  FREQUENCY,     SPECTRUM/REAL,   SPECTRUM/IMAG
##SYMBOL=    X,             R,               I
##VAR_TYPE=  INDEPENDENT,   DEPENDENT,       DEPENDENT
##VAR_FORM=  AFFN,          ASDF,            ASDF
##VAR_DIM=   32768,         32768,           32768
##UNITS=     HZ,            ARBITRARY UNITS, ARBITRARY UNITS
##FACTOR=    0.157963299565203, 1,           1
##FIRST=     4132.6476996994, 0,             0
##LAST=      -1043.33573715361, 0,           0
##MIN=       -1043.33573715361, -194394,     0
##MAX=       4132.6476996994, 406649884,     0
$$ Real data points
##PAGE= N=1
##DATA TABLE= (X++(R..R)), XYDATA
$$ [...]
23414A1904l8980n158J5361k8305K281M0863J5753j3406k9542J0986j2035n429
$$ 11904 -27076 -32234 -16873 -45178 -42897 -2034 13719 313 -29229 -18243 -30278 -35707
23402c5707q349Q0585M6709k4539l3802j3884J7369J6970j3776o3220l6569M196
$$ -35707 -44056 36529 83238 58699 24897 11013 28382 45352 31576 -31644 -68213 -64017
23390f4017J7811k8722l122J7898J5503l0541p377J06029K0634l8773L438J3216
$$ -64017 -46206 -74928 -78050 -60152 -44649 -75190 -82567 23462 44096 5323 8761 21977
23378B1977K761l4319l4237J4969M7720P952j4877l2056J8543P930m2484j4175
$$ 21977 24738 -9581 -43818 -28849 18871 26823 11946 -20110 -1567 6363 -36121 -50296
23366e0296K3487L4868O045P752J7115J0274l384j2866r851K8898j3408k03k1800
$$ -50296 -26809 8059 14104 21856 38971 49245 45861 32995 23144 52042 38634 38431 16631
23353A6631J3417k1810k6785l1972r982M7532l0493k517P1651J8602q459J1056
$$ 16631 30048 8238 -18547 -50519 -60501 -12969 -43462 -45979 25672 44274 35815 46871
23341D6871J0188k5619r0581K126N9110L635Q917p615p076K3124Q137k6519j2114
$$ 46871 57059 31440 -59141 -57015 2095 5730 14647 7032 -44 23080 31217 4698 -7416
23328g416k8515j5453J4662K447l0831k2685K3894O564L0958j448Q97k7462N16
$$ -7416 -35931 -51384 -36722 -34275 -65106 -87791 -63897 -57333 -26375 -27823 -26926 -54388 -53872
23315e3872j462p744L1232J9359k3834k5995O441k201J6200q2269M2499N2799
$$ -53872 -55334 -63078 -31846 -12487 -36321 -62316 -55875 -58076 -41876 -124145 -81646 -28847
23303b8847P5163m8124j4146M2774N6754m3958l3569N1941J8107j2261k7399k6718
$$ -28847 46316 -1808 -15954 26820 83574 39616 6047 57988 76095 63834 36435 9717
23291I717P873k4645m2495p227N810j3199J2700l53M9289k6727Q533O5012J4463
$$ 9717 17590 -7055 -49550 -56777 -50967 -64166 -51466 -51819 -2530 -29257 -20724 44288 58751
23278E8751p116l3929j3965O68N0686m443l2719L6130k1870o8828n041Q4182m948
$$ 58751 51635 17706 3741 4409 55095 50652 17933 54063 32193 -36635 -41676 42506 37558
23265C7558l7122p966m2990K0958k9099m2718L7285N6191J4592L2154j5831m0940
$$ 37558 436 -7530 -50520 -29562 -58661 -101379 -64094 -7903 6689 38843 23012 -17928
23253a7928j5361l3390N6788J7951Q608M7778k4187l2054m9726j6040O8403Q086
$$ -17928 -33289 -66679 -9891 8060 16668 64446 40259 8205 -41521 -57561 10842 18928
23241A8928m8443L5746L4353o6193p2545K1250N7370K9625k9908k8044l3909N7122
$$ 18928 -29515 6231 40584 -25609 -98154 -76904 -19534 10091 -19817 -47861 -81770 -24648
23229b4648K7286K723j012j3006O915J9985n036P238k6757l1669K879n5832m9753
$$ -24648 2638 5361 4349 -8657 -1742 18243 13207 20445 -6312 -37981 -35102 -90934 -140687
23216a40687o807j5247M7918N1511N8838J3927o45o3704p108m4258J0418L0888
$$ -140687 -147494 -162741 -114823 -63312 -4474 9453 8808 -54896 -62004 -106262 -95844 -64956
23204f4956M72m6226k345K4851O5002K3562R391o2366K7595N2171n1885L980K0104
$$ -64956 -64484 -110710 -113055 -88204 -23202 360 9751 -52615 -25020 27151 -24734 -20754 -650
23191f50K4602Q071k9522k6027r89J8128L7190K2101l6089j6763j0864o317m5518
$$ -650 23952 32023 2501 -23526 -24515 -6387 30803 52904 16815 52 -10812 -17129 -62647
23178f2647j2117K5763J3994j0219J4636k1777o2236j3203M4228O2513L07m863
$$ -62647 -74764 -49001 -35007 -45226 -30590 -52367 -114603 -127806 -83578 -21065 -20758 -25621
23166b5621O0846m8703l0582L0736j0835m4439j1102O2230J5379n7215k1532K7916
$$ -25621 35225 -13478 -44060 -13324 -24159 -68598 -79700 -17470 -2091 -59306 -80838 -52922
23154e2922J7317m403k4638M5247M1843j7826J6547j4142q0432J0294J705M6761
$$ -52922 -35605 -40008 -64646 -19399 22444 4618 21165 7023 -73409 -63115 -61410 -14649
23142a4649K6101k8057n738J6090j7190j6764J3903J647J2122L1565O009K930
$$ -14649 11452 -16605 -22343 -6253 -23443 -40207 -26304 -24657 -12535 19030 25039 27969
23130B7969j7545l6159m089J0907j0450k3525k2987L7931M3507K1423l005m3852
$$ 27969 10424 -25735 -29824 -18917 -29367 -52892 -75879 -37948 5559 26982 23977 -19875
23118a9875m2378k5001K0730L5419K3382J6698M3030j8718k6990j230J4757J3365
$$ -19875 -62253 -87254 -66524 -31105 -7723 8975 52005 33287 6297 5067 19824 33189
23106C3189P9129Q067m3702k2351k7629j2030k0550m584p968p52L724M2628j1081
$$ 33189 112318 120385 76683 54332 26703 14673 -5877 -10461 -18429 -19181 -15457 27171 16090
23093A6090l4143j8261m045J7499J4284K5683P887o278k8217o4623k7475J5422
$$ 16090 -18053 -36314 -40359 -22860 -8576 17107 24994 18716 -9501 -74124 -101599 -86177
23081h6177M5408R7123L3492j793N447m2493l3715J4654j1437J919J4369J6186
$$ -86177 -40769 56354 89846 88053 93500 51007 17292 31946 20509 22428 36797 52983
23069E2983j1094n2657l7230o5536J6814Q210j300J1853L0693L2359P612K9732
$$ 52983 41889 -10768 -47998 -113534 -96720 -88510 -89810 -77957 -47264 -14905 -7293 22439
23057B2439J2798J5637l7275j9027K1512M2500J1923p107M110k9982j6013k2880
$$ 22439 35237 50874 13599 -5428 16084 58584 70507 63400 67510 37528 21515 -1365
23045a365j7070J829L3831r870l561j0577R760L9503J3211o7747j2912J3414R208
$$ -1365 -18435 -16606 17225 7355 3794 -6783 2977 42480 55691 -12056 -24968 -11554 -2346
23032b346L9887K6186k085m5949Q040j0421k1451L4333K3256O309l1584n6074
$$ -2346 37541 63727 61642 15693 23733 13312 -8139 26194 49450 55759 24175 -31899
23020c1899l270N4141M2407j9815k9731m155j1290J7318j2676k0761r517m7734
$$ -31899 -35169 18972 61379 41564 11833 7678 -3612 13706 1030 -19731 -29248 -76982
23008g6982K9512J04852Q616l8888l2657r0606k0525M5831N5370M0583k2038l1456
$$ -76982 -47470 57382 65998 27110 -5547 -96153 -116678 -70847 -15477 25106 3068 -28388
22996b8388L2423O836n4180n298L027P328L6200Q605M6207M6349n979p8391j9734
$$ -28388 4035 10871 -43309 -48607 -45580 -38252 -2052 6553 52760 99109 93130 14739 -4995
22983d995k1628L00J8074k4816k3739K8492o660j0349q989N8947J3088q088J6108
$$ -4995 -26623 -26323 -8249 -33065 -56804 -28312 -34972 -45321 -54310 4637 17725 9637 25745
22970B5745J594l3649l3404K9567k4416j0588K4204n7010L000J6469P2547L742
$$ 25745 27339 -6310 -39714 -10147 -34563 -45151 -20947 -77957 -74957 -58488 14059 17801
22958A7801R82J348k1051M087L8483o1826J5949J3993j4534n961j560j6784J8125
$$ 17801 18783 20131 -920 3167 41650 -20176 -4227 9766 -4768 -10729 -12289 -29073 -10948
22945a0948J8288n496r136M404j0368p654j078L0211q502p4574k6053N8509R3916
$$ -10948 7340 1844 -7292 -2888 -13256 -20910 -21988 8223 -279 -74853 -100906 -42397 51519
22932E1519Q809J2016o349k7254j6743j7824j8071K7728n5610m811J0247P391
$$ 51519 60328 72344 65995 38741 21998 4174 -13897 13831 -41779 -46590 -36343 -28952
22920b8952K4328K1845N969Q263j093j1764l194j0770o0770j4649J5516P5408
$$ -28952 -4624 17221 23190 31453 30360 18596 15402 4632 -56138 -70787 -55271 20137
22908B0137J2892j433N275m3034L238M3841K4918l7738k8053K4035L5956k5338
$$ 20137 33029 31596 36871 -6163 -2925 40916 65834 28096 43 24078 60034 34696
22896C4696l722m918l0048l0919l837k0922l244J3603L4275K8813o514k2830J7544
$$ 34696 30974 26056 -3992 -34911 -38748 -59670 -62914 -49311 -15036 13777 7263 -15567 1977
22883A977J9275L0362J0558J494J8713k042n944J9855j4681j8932k2458l3079
$$ 1977 21252 51614 62172 63666 82379 80337 74393 94248 79567 60635 38177 5098
22871E098j9523P040N3782k550m7595r079k1971L283K2465K1389j7934K1142J8525
$$ 5098 -14425 -7385 46397 43847 -3748 -12827 -34798 -31515 -9050 12339 -5595 15547 34072
22858C4072P338l6619k6174M7979L7550q014k2246J3232P898o4568l7237l2653
$$ 34072 41410 4791 -21383 26596 64146 56132 33886 47118 55016 -9552 -46789 -79442
22846g9442j6722L4647M1352N647J6988k7510j9052j2435M291K51j5262J5764
$$ -79442 -96164 -61517 -20165 -14518 2470 -25040 -44092 -56527 -52236 -51985 -67247 -51483
22834e1483K7976J6888K5736J2045J1256l3290l8802K1246M174J8017L9463R302
$$ -51483 -23507 -6619 19117 31162 42418 9128 -29674 -8428 -4254 13763 53226 62528
22822F2528o3815l1748O6611M7746R446m805m6090n2144J7406K3908j8469L4572
$$ 62528 -1287 -33035 33576 81322 90768 85963 39873 -12271 5135 29043 10574 45146
22810D5146J0343o049K2474Q865N310k1629o9831l7342j864K1757J3613p239K3001
$$ 45146 55489 49440 71914 80779 86089 64460 -5371 -42713 -44577 -22820 -9207 -16446 6555
22797F555n0247m0389j4028J0851J5512M2601J4932l7116k0262L8199K411l5505
$$ 6555 -43692 -84081 -98109 -87258 -71746 -29145 -14213 -51329 -71591 -33392 -30981 -66486
22785f6486k8550K0711K5353N4150k852m3843J7857J1478j4435J760M9415k641
$$ -66486 -95036 -74325 -48972 5178 2326 -41517 -23660 -12182 -26617 -24857 24558 21917
22773B1917k0448j5704N82L803L3096J284r396J565J6949k7244l7265L6908N2263
$$ 21917 1469 -14235 -13653 -9850 23246 24530 15134 16699 33648 6404 -30861 6047 58310
22760E8310k8568o0784l0114k472k0458J8287N3414O3763j2112j424l7292j6020
$$ 58310 29742 -31042 -61156 -63628 -84086 -65799 -12385 51378 39266 37842 550 -15470
22748a5470q91j2617j0363J8242M6973M8961o6378m5755q413o163K9576Q780r802
$$ -15470 -16361 -28978 -39341 -21099 25874 74835 8457 -37298 -45711 -51874 -22298 -13518 -23320
22735b3320M4686M0270K824K3568K7955j8366j367k642l0261n3598J1260K0629
$$ -23320 21366 61636 64460 88028 115983 97617 96250 93608 63347 9749 21009 41638
22723D1638O823q1427m3367N9288Q1015N305N0100K6265m5718l7970k4141r084
$$ 41638 48461 -32966 -76333 -17045 63970 69275 119375 145640 99922 61952 37811 28727
22711B8727K7091k5109K707n50K1611K881J7566K6489o3354o0859o24k387N7449
$$ 28727 55818 30709 33416 32866 54477 57358 74924 101413 38059 -22800 -23424 -25811 31638
22698C1638k0679j4325j0331l6504q568K1855M9320j9371l5375K0393j183r342
$$ 31638 10959 -3366 -13697 -50201 -58769 -36914 12406 -6965 -42340 -21947 -23130 -32472
22686c2472O5395L6717m4171l4523k610L6661L1754k4431k6835k5551N6186P5827
$$ -32472 32923 69640 25469 -9054 -11664 24997 56751 32320 5485 -20066 36120 111947
22674A11947l6351m3437J0891l8928k7833k9137k5145k4953o723p69L1544O0814
$$ 111947 75596 32159 43050 4122 -23711 -52848 -77993 -102946 -109669 -110438 -78894 -18080
22662a8080K602k9439k050j4385L556o447n0348m3116K5342O0930O4593m1254
$$ -18080 -15478 -44917 -46967 -61352 -57796 -64243 -114591 -157707 -132365 -71435 -6842 -48096
22650d8096k7708L9258L9005j401k3098k0208J0701l5106k0718M6631L0456K7708
$$ -48096 -75804 -36546 2459 1058 -22040 -42248 -31547 -66653 -87371 -40740 -10284 17424
22638A7424J4976J763K0632j1596o1882k4460k0040o958o744l0649K5183j7198
$$ 17424 32400 34163 54795 43199 -18683 -43143 -63183 -70141 -76885 -107534 -82351 -99549
22626i9549J6404K1458j0301r034J6982K4435m480J3081J8833j3655O2297k3090
$$ -99549 -83145 -61687 -71988 -81022 -64040 -39605 -44085 -31004 -12171 -25826 36471 13381
22614A3381o679P72M3606k0481m1734J2485K4327j1530j8064J4413L0237M5439
$$ 13381 6702 7474 51080 30599 -11135 1350 25677 14147 -3917 10496 40733 86172
22602H6172n2922l9798k8324j2269N5204K6193n5806l202K665m8489j4744N3709
$$ 86172 33250 -6548 -34872 -47141 8063 34256 -21550 -24752 -22087 -70576 -85320 -31611
22590c1611K7516J2819P627L4305J2137k5851K8018K970J8782K4588r028l7038
$$ -31611 -4095 8724 16351 50656 62793 36942 64960 67930 86712 111300 102272 65234
22578F5234k9733l3309p518j646O30K8557k4867K6993P089l8198l728J3034K3945
$$ 65234 35501 2192 -5326 -6972 -6342 22215 -2652 24341 31430 -6768 -10496 2538 26483
22565B6483j2074L3855L3521l6280M700l2565l7699R736k3148j3321K4326O2352
$$ 26483 14409 48264 81785 45505 50205 17640 -20059 -10323 -33471 -46792 -22466 39886
22553C9886j3628P116j4955l7465K8248O2731k0157p8330n595R529j8862l77K172
$$ 39886 26258 33374 18419 -19046 9202 71933 51776 -26554 -32149 -22620 -41482 -41859 -39687
22540c9687K2711P121L1320P373k7735O2612Q238k4474l5956m6444l976k339K2704
$$ -39687 -16976 -9855 21465 28838 1103 63715 71953 47479 11523 -34921 -38897 -41236 -18532
22527a8532L9145l9876l1479L6641M0749P104J9642o622k9805p607j367L8062
$$ -18532 20613 -19263 -50742 -14101 26648 33752 53394 46772 16967 9360 7993 46055
22515D6055K0519j7954k6281l0536L0078K4982O932r111M7049n089j1119j7494
$$ 46055 66574 48620 22339 -8197 21881 46863 53795 44684 91733 86644 75525 58031
22503E8031o9243k8075K7896K6852L207j043l7699M93j8206o272n268M4258M5643
$$ 58031 -11212 -39287 -11391 15461 18668 17625 -20074 -19581 -37787 -44059 -49327 -5069 40574
22490D0574m278M389p684j5106j5248m3475L355M7671j3962L0558m1801k3188
$$ 40574 36296 40685 33001 17895 2647 -40828 -37473 10198 -3764 26794 -15007 -38195
22478c8195R757M9524k536j7622J3373k0843l0101J4914K9308J9199m39l6689
$$ -38195 -28438 21086 18550 928 14301 -6542 -36643 -21729 7579 26778 26339 -10350
22466a0350j6544Q153K6686M3248k7314k5016j7002j7199l3447K0598j5259K1816
$$ -10350 -26894 -18741 7945 51193 23879 -1137 -18139 -35338 -68785 -48187 -63446 -41630
22454d1630L8355j054q203K1966k8383L183Q938K410k5585j3500j388j588K8004
$$ -41630 -3275 -4329 -12532 9434 -18949 -15766 -6828 -4418 -30003 -43503 -44891 -46479 -18475
22441a8475J660k6630N9198O0666L512l6120l3602M286m7506k3928M2328L8000
$$ -18475 -16815 -43445 15753 76419 79931 43811 10209 14495 -33011 -56939 -14611 23389
22429B3389l6658K1781L1910P554L8104q967k9129k4368n317K3550l8974r134
$$ 23389 -13269 8512 40422 47976 86080 77113 47984 23616 18299 41849 2875 -6259
22417f259J1502Q471J7471K9652p763o412m2205k7342k7079j7956l6769K3825
$$ -6259 5243 13714 31185 60837 53074 46662 4457 -22885 -49964 -67920 -104689 -80864
22405h0864K6355j6339P8941J9484o782J2194O445M456n0523K2002M2482L0949
$$ -80864 -54509 -70848 8093 27577 20795 32989 39434 43890 -6633 15369 57851 88800
22393H8800p2911l4742l824l2887K6313Q5804j6852o5385k1954l2040N0504K1492
$$ 88800 15889 -18853 -22677 -55564 -29251 56553 39701 -25684 -47638 -79678 -29174 -7682
22381g682K3460j3521q229K9226K4514k1955J8969J0471o5653l4795K5213L1219
$$ -7682 15778 2257 -5972 23254 47768 25813 44782 55253 -10400 -45195 -19982 11237
22369A1237m477l2913L1846K181m2624k8006M559O840L6061J8150l867L9458k5010
$$ 11237 6760 -26153 5693 7874 -34750 -62756 -58197 -51357 -15296 2854 -1013 38445 13435
22356A3435l8377m8147l5889K7351L8785n743j7238R591K3850J767n839J3564
$$ 13435 -24942 -73089 -108978 -81627 -42842 -48585 -65823 -56232 -32382 -30615 -36454 -22890
22344b2890L6135J1974k1533n1971j697L1643J8082l1165M839m0961k7173l6318
$$ -22890 13245 25219 3686 -48285 -49982 -18339 -257 -31422 -26583 -67544 -94717 -131035
22332a31035k0157P8559O7018j1519n3706J3035K7963j0658J6824J9379P448L6565
$$ -131035 -151192 -72633 -5615 -17134 -70840 -57805 -29842 -40500 -23676 -4297 3151 39716
22320C9716M0209n758n2439j7719k5035M17J571l4748m7506o98q592R18K5149
$$ 39716 79925 74167 21728 4009 -21026 -20609 -19038 -53786 -101292 -101990 -110582 -109664 -84515
22307h4515O602p555k0514M813K0009l484O985q863K4441K9113l137Q634p320
$$ -84515 -77913 -85468 -105982 -101169 -81160 -84644 -77659 -86522 -62081 -32968 -36105 -27471 -34791
22294c4791l8881j525K0903M806P34m513m00q642J2648J9894J4621N9110K8742
$$ -34791 -73672 -75197 -54294 -49488 -48754 -53267 -53667 -62309 -49661 -29767 -15146 43964 72706
22281G2706L2034o8540K584J6436K2274q637n9680l8531m975L4637K3793K1058
$$ 72706 104740 36200 38784 55220 77494 68857 9177 -29354 -34329 308 24101 45159
22269D5159n6643q0594P887O0216J4122n665J5293j1537m3293K8942j1364K4968
$$ 45159 -11484 -92078 -84191 -23975 -9853 -15518 -225 -11762 -55055 -26113 -37477 -12509
22257a2509L1299p2641J486N7679L494L3954N82n318k2836K049P97k1058j9120
$$ -12509 18790 -53851 -52365 5314 8808 42762 43344 38026 15190 17239 18036 -3022 -22142
22244b2142o2137Q488o365O4532N9141L8626n4357n7732O765k3330K5377P3934
$$ -22142 -84279 -75791 -82156 -17624 41517 80143 25786 -31946 -25181 -48511 -23134 50800
22232E0800J0626j1411l2291k0236l2683M422K0590m886m146M119j4035n75j4239
$$ 50800 61426 50015 17724 -2512 -35195 -30773 -10183 -15069 -19215 -15096 -29131 -29706 -43945
22219d3945j3782p809J8712o610K5451N1828J0444N210j5326k9871L1530l7906
$$ -43945 -57727 -65536 -46824 -53434 -27983 23845 34289 39499 24173 -5698 25832 -12074
22207a2074j3197J10940M4137m7327k8014j5699J1947n760L729n0607J3307K7237
$$ -12074 -25271 85669 129806 82479 54465 38766 50713 44953 48682 -1925 11382 38619
22195C8619L874n2152m8125O1698N6020p2574P57L5533K3254M466j3896l1558
$$ 38619 42493 -9659 -57784 3914 59934 -12640 -11883 23650 46904 51370 37474 5916
22183E916J8025J2647l6486n8449J3993J1080K2247l0949K4195L2887M0252K6135
$$ 5916 23941 36588 102 -58347 -44354 -33274 -11027 -41976 -17781 15106 55358 81493
22171H1493o307j0921Q59n3268o1937K886L0504k6598l9414L475l962L8978J9013
$$ 81493 75186 64265 65124 11856 -50081 -47195 -16691 -43289 -82703 -79228 -83190 -44212 -25199
22158b5199J5185J3373L901k4328k4257J4026M0785K3292j644J7798K2571m2808
$$ -25199 -10014 3359 7260 -17068 -41325 -27299 13486 36778 35134 52932 75503 32695
22146C2695l9714p79K156L2208J3719j2699q922j4871m5713n059L3721J4619m4930
$$ 32695 -7019 -7798 -5642 26566 40285 27586 18664 3793 -41920 -46979 -13258 1361 -43569
22133d3569j6640K8754J2432n7785j2102k7478M9590P3838M9105m6873k3354J9297
$$ -43569 -60209 -31455 -19023 -76808 -88910 -116388 -66798 7040 56145 9272 -14082 5215
22121E215J6946l2555L727k0461M2501L5795j1709k365K2513j0360k327j9849
$$ 5215 22161 -10394 -6667 -27128 15373 51168 39459 37094 59607 49247 46920 27071
22109B7071N7449p3996n8587K5073O2015j1954j9431l0411K5853j4572k6072k0682
$$ 27071 84520 10524 -48063 -22990 39025 27071 7640 -22771 3082 -11490 -37562 -58244
22097e8244J4706j0287L3008L4412K4289k1306j7218J765M86k3928m087k8654
$$ -58244 -43538 -53825 -20817 13595 37884 16578 -640 1125 1611 -22317 -26404 -55058
22085e5058L1010L1701k2931j230L8774l4924k5518K4298N8044L716N523k0685
$$ -55058 -24048 7653 -15278 -16508 22266 -12658 -38176 -13878 44166 47882 53405 32720
22073C2720l0193K9514M1409j7170m808k8413K6995j1070l0174j9022m9383m5085
$$ 32720 2527 32041 73450 56280 51472 23059 50054 38984 8810 -10212 -59595 -104680
22061a04680K6101M7898M4393R353J7465k0752k4208K7046M0810R894j5499J8196
$$ -104680 -78579 -30681 13712 23065 40530 19778 -4430 22616 63426 73320 57821 76017
22049G6017j7275k0280n3607M620k9534L185N2712p065K2016L757L7448k3878
$$ 76017 58742 38462 -15145 -10525 -40059 -36874 15838 8773 30789 34546 71994 48116
22037D8116l0290L074j2952m089m2290k4726M2940M7185P525K24o3663m3294k7218
$$ 48116 17826 20900 7948 3859 -38431 -63157 -20217 26968 34493 34717 -28946 -72240 -99458
22024i9458J3394Q474K9616m6418K1764j1592K4493n782P715J5450J6688J3141
$$ -99458 -86064 -77590 -47974 -94392 -72628 -84220 -59727 -65509 -57794 -42344 -25656 -12515
22012a2515L8669R301k2642n1196q792M1492P489n6224l1647R871L3212Q001K1377
$$ -12515 26154 35455 12813 -38383 -47175 -5683 1806 -54418 -86065 -76194 -42982 -34981 -13604
21999a3604K6960j9434M383K2418k3170J5645L2662m04j020n566j5121l2096o206
$$ -13604 13356 -6078 -1695 20723 -2447 13198 45860 45456 44436 38870 23749 -8347 -14553
21986a4553j1428j2429q737J0837K4705K2822l0468k2762O0098N3358p3967o451
$$ -14553 -25981 -38410 -47147 -36310 -11605 11217 -19251 -42013 18085 71443 -2524 -8975
21974h975l631O717r419M2740J7186k6809j1162r273K9380K0477Q380j568j267
$$ -8975 -12606 -5889 -15308 27432 44618 17809 6647 -2626 26754 47231 55611 54043 52776
21961E2776l4160k7373k1995m3144J8603N1616J9763k3615k8908J7051m860L074
$$ 52776 18616 -8757 -30752 -73896 -55293 -3677 16086 -7529 -36437 -19386 -24246 -21172
21949b1172K7887j7401k4585k7309J6313m65q850J9013J6344J2702K933L3360
$$ -21172 6715 -10686 -35271 -62580 -46267 -46732 -55582 -36569 -20225 -7523 -4590 28770
21937B8770k0116K1127J9368k5016J2151M7269J3061P788q075n6035p662j858
$$ 28770 8654 29781 49149 24133 36284 83553 96614 104402 96327 40292 32630 30772
21925C0772m6610M3118J5822Q45l2048p135r167R012M7966O1249J8174q3294l1611
$$ 30772 -15838 27280 43102 43947 11899 4764 -4403 4609 52575 113824 131998 48704 17093
21912A7093k8093l2528l3340n5676O942R6001L864p685M5490J9860o6010k2400
$$ 17093 -11000 -43528 -76868 -132544 -125602 -29601 -25737 -33422 12068 31928 -34082 -56482
21900e6482M8857L4992k1969l5617n3973M1625M6564K1054j2922j5866r982J8852
$$ -56482 -7625 27367 5398 -30219 -84192 -42567 3997 25051 12129 -3737 -13719 5133
21888E133J862j075K1744O92r511k0513k4334n1575q338K9958K2655J2305k4914
$$ 5133 6995 5920 27664 28356 18845 -1668 -26002 -77577 -85915 -55957 -33302 -20997 -45911
21875d5911k2625J3267K7235j189O0564K8341P501j7936J1708j9898l7505q209
$$ -45911 -68536 -55269 -28034 -29223 31341 59682 67183 49247 60955 41057 3552 -4657
21863d657N259j9781K5635N055k347k8280Q607j4164L5859O1515j3796l9697m5133
$$ -4657 602 -19179 6456 11511 9164 -19116 -10509 -24673 11186 72701 58905 19208 -25925
21850b5925j7234M411k361J3479J5590M9329J5038N4626k5108j2488J6420o7906
$$ -25925 -43159 -38748 -41109 -27630 -12040 37289 52327 106953 81845 69357 85777 17871
21838A7871l1904L191N9688L358J0331j4592q4256k7367M3305L1879m6003k9358
$$ 17871 -14033 -10842 48846 52204 62535 47943 -36313 -63680 -20375 11504 -34499 -63857
21826f3857O400l2402K8470L0332O848K9531K4040p997n0980J5852o155K2415
$$ -63857 -57457 -89859 -61389 -31057 -24209 5322 29362 21365 -29615 -13763 -19918 2497
21814B497k5414k4648j8952J2621L8698J9268j8467n0858m1476l8698K0020L8168
$$ 2497 -22917 -47565 -66517 -53896 -15198 4070 -14397 -65255 -106731 -145429 -125409 -87241
21802h7241k1965k6361M8466K4597J3145n620j5063N1786J5234j9150n669l779
$$ -87241 -109206 -135567 -87101 -62504 -49359 -54979 -70042 -18256 -3022 -22172 -27841 -31620
21790c1620p535j410o88K3356J0947j150L66j7843m521J3664k6552K5500P0170
$$ -31620 -39155 -40565 -41253 -17897 -6950 -8100 -7734 -25577 -30098 -16434 -42986 -17486 52684
21777E2684O0620l911o2226n9061j7687M4173M3503j716k4192k3422O534J4259
$$ 52684 113304 109393 47167 -11894 -29581 14592 58095 56379 32187 8765 15299 29558
21765B9558L7903L7714p975o7847m6581K2478J2869l1520l5028l248k1487O181
$$ 29558 67461 105175 97200 29353 -17228 5250 18119 -13401 -48429 -51677 -73164 -66983
21753f6983N5738M8362Q778j9608l3835k0803k0365j0297L2129O8814j9878j7775
$$ -66983 -11245 37117 45895 26287 -7548 -28351 -48716 -59013 -26884 41930 22052 4277
21741D277K5839K0769N196o475k7942k0505K0838j4698k0836M078P386j3451l3343
$$ 4277 30116 50885 56081 49606 21664 1159 21997 7299 -13537 -9459 -2073 -15524 -48867
21728d8867K9222N631Q226j146k822R770L022l3539N31J4844R889j129J2420J9281
$$ -48867 -19645 -14014 -5788 -6934 -9756 14 3036 -30503 -29972 -15128 -5239 -6368 6052 25333
21714B5333k7752m2224P247L393l0032Q870J53J9537K2924K814J3478k8587J0256
$$ 25333 -2419 -44643 -37396 -34003 -64035 -55165 -55012 -35475 -12551 -9737 3741 -24846 -14590
21701a4590N1318L6999L0300R220m2230n3621q149j2573l4513o956J3241J9146
$$ -14590 36728 73727 104027 113247 71017 17396 9247 -3326 -37839 -44795 -31554 -12408
21689a2408j2927k023L7027K790P058k7724l1874R899N497J0869M8172L0319j6103
$$ -12408 -25335 -27358 9669 12459 19517 -8207 -40081 -30182 -24685 -13816 34356 64675 48572
21676D8572m6307k2295p748J6887L0175k4044J311K7112J4294j4868K385k1632
$$ 48572 2265 -20030 -27778 -10891 19284 -4760 -3449 23663 37957 23089 25474 3842
21664C842J0950k180m1036j5321L0806Q107l1445k6588Q835k284J9938N509m472
$$ 3842 14792 12612 -28424 -43745 -12939 -4832 -36277 -62865 -54030 -56314 -36376 -30867 -35339
21651c5339N695Q432J1583k3629m1763M6654K63J1907K14m6990M5973J5276l3965
$$ -35339 -29644 -21212 -9629 -33258 -75021 -28367 -28104 -16197 -15983 -62973 -17000 -1724 -35689
21638c5689j4687p807j7194L472r594j6246L0106M0774r475L0173l9765k3605
$$ -35689 -50376 -58183 -75377 -71905 -81499 -97745 -67639 -26865 -36340 -6167 -45932 -69537
21626f9537L1362J0412J3642l3265j0047m0805J7688J4947L0922K2917k2265k659
$$ -69537 -38175 -27763 -14121 -47386 -57433 -98238 -80550 -65603 -34681 -11764 -34029 -36688
21614c6688k4232n583l3515j033j1801j052K1119J1433M0693J7977j6417K6519
$$ -36688 -60920 -66503 -100018 -101051 -112852 -113904 -92785 -81352 -40659 -22682 -39099 -12580
21602a2580j2570J4269L1840K1393L8114r367j2086k1264q395J041m4678m6184
$$ -12580 -25150 -10881 20959 42352 80466 71099 59013 37749 29354 30395 -14283 -60467
21590f0467M6153l585q42K9206k521l437q744j7716Q207M0201M4888l1490j664
$$ -60467 -14314 -17899 -18741 10465 7944 4507 -4237 -21953 -13746 26455 71343 39853 38189
21577C8189l0698o0047M753P791k1168Q579N498j8707j578J1336O1035L3228n4497
$$ 38189 7491 -52556 -47803 -40012 -61180 -52601 -47103 -65810 -67388 -56052 4983 38211 -16286
21564a6286K429k3574M187L0739q287l2137P687J4032K1084L5611n0317L30l3308
$$ -16286 -13857 -37431 -33244 -2505 -10792 -42929 -35242 -21210 -126 35485 -14832 -14502 -47810
21551d7810N64N649k516k8060j4908K5813L8568N9907K2280k3639q2770l7614
$$ -47810 -47246 -41597 -44113 -72173 -87081 -61268 -22700 37207 59487 35848 -46922 -84536
21539h4536K1659M8152K1626K1413k2673P258N305J3056k4409r98J4624l7714
$$ -84536 -62877 -14725 6901 28314 5641 12899 18204 31260 6851 5853 20477 -17237
21527a7237j1964O437J6023j2256o9878m571Q1033L8249m438J8873m4385l357
$$ -17237 -29201 -22764 -6741 -18997 -88875 -93446 -12413 25836 21398 40271 -4114 -7471
21515g471M787m8363O673K2243K8832Q264l8107Q534N356l8191l5439j3697j171
$$ -7471 -2684 -51047 -44374 -22131 6701 14965 -23142 -14608 -9252 -47443 -82882 -96579 -97750
21502i7750K706J6214L7423k8161n749N6054K7671r574N1092m8196n1034J689
$$ -97750 -95044 -78830 -41407 -69568 -75317 -19263 8408 -1166 49926 1730 -49304 -47615
21490d7615K2377q48j6365K3083P718l9214j0356M6165J3504O930J4189J1934
$$ -47615 -25238 -26086 -42451 -19368 -11650 -50864 -61220 -15055 -1551 5379 19568 31502
21478C1502j2019R573R735k2929o7495L1129J1964J825M9594L7160l7404j7695
$$ 31502 19483 29056 38791 15862 -51633 -20504 -8540 -6715 42879 80039 42635 24940
21466B4940Q91k7992m2410O950o5403o5013R510J8217j1539k0325K8083N5185
$$ 24940 25831 -2161 -44571 -37621 -103024 -168037 -158527 -140310 -151849 -172174 -144091 -88906
21454h8906Q261M3229J3329k7567J6375M3224k9728j1973K062m797l2547K6456
$$ -88906 -80645 -37416 -24087 -51654 -35279 7945 -21783 -33756 -31694 -36491 -69038 -42582
21442d2582p515m5285j315M1388M8230J0299K8814O6476l4052l9948n740p1733
$$ -42582 -50097 -95382 -96697 -55309 -7079 3220 32034 98510 64458 24510 18770 -52963
21430e2963j3222l922K7251Q75j177K9068j4205k5841M5896J3977m3256J3317
$$ -52963 -66185 -70107 -42856 -41981 -43158 -14090 -28295 -54136 -8240 5737 -37519 -24202
21418b4202K0406j9974J8207K823j3100j1266o790m929K0786R929k0005m3722
$$ -24202 -3796 -23770 -5563 -2740 -15840 -27106 -33896 -38825 -18039 -8110 -28115 -71837
21406g1837M3595O554J6491K0332J6498j507q3696P6L498Q699M8645L1157r960
$$ -71837 -28242 -21688 -5197 15135 31633 30126 -53570 -53494 -49996 -41297 7348 38505 28545
21393B8545K3136j4642l0466O171L4300k7099k6376j6926Q1534L3043m4961m5772
$$ 28545 51681 37039 6573 12744 47044 19945 -6431 -23357 58177 91220 46259 487
21381D87m9889n5435P279M2372J5258O074K8256K5283n555l798L260n3943l2597
$$ 487 -49402 -104837 -97558 -55186 -39928 -33854 -5598 19685 14130 10332 13592 -40351 -72948
21368g2948K2576N2123M6976P652J6941K3370j9225m2206k8273M2422K5435l8129
$$ -72948 -50372 1751 48727 56379 73320 96690 77465 35259 6986 49408 74843 36714
21356C6714k4603K0280L8748k6562q0530q5481Q806O6389Q487N9537l4681r24
$$ 36714 12111 32391 71139 44577 -35953 -121434 -112628 -46239 -37752 21785 -12896 -13820
21344a3820J752p841l257Q944M1955j2882l0407M8628R599l4639n3858k2197K3505
$$ -13820 -12068 -19909 -23166 -14222 27733 14851 -15556 33072 42671 8032 -45826 -68023 -44518
21331d4518L5624N2395k749n0054l0000L4164J5480M478O0244P1m0021m5878l0827
$$ -44518 -8894 43501 40752 -9302 -39302 -5138 10342 14820 75064 75135 35114 -10764 -41591
21318d1591k3721J9909K2152J4909O701K6242P271l2073l473k05P4344J0084m8121
$$ -41591 -65312 -45403 -23251 -8342 -1641 24601 31872 -201 -3674 -3879 70465 80549 32428
21305C2428k7543J1164j7413K28j7613n797J1527l6032J3354K4702J0866J4744
$$ 32428 4885 16049 -1364 -1136 -18749 -24546 -13019 -49051 -35697 -10995 -129 14615
21293A4615J2983K2798p358J0802k7186n7694j3812j3085j6504k1566O00J4338
$$ 14615 27598 50396 43038 53840 26654 -31040 -44852 -57937 -74441 -96007 -95407 -81069
21281h1069P671n0669L0706Q498K325M3014N1910M443K6472j7741k812Q151N79
$$ -81069 -73398 -124067 -93361 -84863 -82538 -39524 12386 16829 43301 25560 22748 30899 31478
21268C1478k0248k2020l6853l363K6186j097n992m151K6268L7381j1713o2808
$$ 31478 11230 -10790 -47643 -51006 -24820 -25917 -31909 -36060 -9792 27589 15876 -46932
21256d6932l7541j2459L5821P9360J4017j6978k9469l9034M4326M4437k9958L280
$$ -46932 -84473 -96932 -61111 18249 32266 15288 -14181 -53215 -8889 35548 5590 8870
21244H870j3531k8083J4435N6994R303k8080m5788J2700K4299K886j7564l7430
$$ 8870 -4661 -32744 -18309 38685 47988 19908 -25880 -13180 11119 14005 -3559 -40989
21232d0989J3464J6194J0003L1806k2843M477j4002K975J2831J2508l2610o052
$$ -40989 -27525 -11331 -1328 30478 7635 12112 -1890 1085 13916 26424 -6186 -12238
21220a2238J8886j4314j002Q873m8012J8856K9613K7259J2420j6130l4776l1494
$$ -12238 6648 -7666 -8668 205 -47807 -28951 662 27921 40341 24211 -10565 -42059
21208d2059O727J3878j3320K3796K1471r639k859o418m441k3864J433k9430L0693
$$ -42059 -35332 -21454 -34774 -10978 10493 854 -2005 -8423 -12864 -36728 -35295 -64725 -34032
21195c4032r855Q676J0058l1136O930J8943k0646M4217L8760j0549q503j0713
$$ -34032 -43887 -35211 -25153 -56289 -49359 -30416 -51062 -6845 31915 21366 12863 2150
21183B150k2615n196j652J7148J9682l8884l8225n314L785j785N277N8887m581
$$ 2150 -20465 -25661 -27313 -10165 9517 -29367 -67592 -72906 -69121 -70906 -65629 -6742 -11323
21170a1323l9641k9850L5781K8929n7888R159J7401L9215L4765n27k7917j158
$$ -11323 -50964 -80814 -45033 -16104 -73992 -64833 -47432 -8217 26548 26021 -1896 -3054
21158c054M8447M2763j4003k1043k9307m1330j4940L7494J5555m1633m1316J1714
$$ -3054 45393 88156 74153 53110 23803 -17527 -32467 5027 20582 -21051 -62367 -50653
21146e0653P630J3693K1640K5200L0469j9765l3444q9985l869M0271N2915j0017
$$ -50653 -43023 -29330 -7690 17510 47979 28214 -5230 -95215 -99084 -58813 -5898 -15915
21134a5915l9575r043L0147L7628m27k7797L4792J5398r72Q483N555J7386n0561
$$ -15915 -55490 -64533 -34386 3242 2815 -24982 9810 25208 24236 32719 38274 55660 5099
21121E099m2241p247j1194O89N3630K206J6383j704P088O420k5023k3458j3731
$$ 5099 -37142 -44389 -55583 -54894 -1264 942 17325 15621 22709 29129 4106 -19352 -33083
21108c3083l907j1719m3901L8308K4392K9376m354j2092K0830P771l7216n1804
$$ -33083 -36990 -48709 -92610 -54302 -29910 -534 -4888 -16980 3850 11621 -25595 -77399
21096g7399L5327L6311K4236K884L6895K147j5256r526J9056p6745k3586K8171
$$ -77399 -42072 -5761 18475 21359 58254 60401 45145 35619 54675 -22070 -45656 -17485
21084a7485J2795J5892J2911l979j6988p536M32N0689o156J2835O770J9477R549
$$ -17485 -4690 11202 24113 20134 3146 -4390 -3958 46731 40575 53410 60180 79657 89206
21071H9206n7907o7278k6018O1257j587m1526l0563j3545K277O5841K4171k8849
$$ 89206 31299 -35979 -61997 -740 -2327 -43853 -74416 -87961 -85684 -19843 4328 -24521
21059b4521j4104k3063N893n469P245o434j3239O187J1850M5636p725L9522J7617
$$ -24521 -38625 -61688 -55795 -61264 -54019 -60453 -73692 -67505 -55655 -10019 -17744 21778 39395
21046C9395K418K7531m490m4014l2010j3119j965l552N4292O7252K9467r0916
$$ 39395 41813 69344 64854 20840 -11170 -24289 -26254 -29806 24486 91738 121205 30289
21034C0289k4238k2755J2724N052l484o930r751J2971r220M5670l6070j1937l8693
$$ 30289 6051 -16704 -3980 1072 -2412 -9342 -19093 -6122 -15342 30328 -5742 -17679 -56372
21021e6372q448l4409p679P707M7520M6144j1236p444L6711J4551N43K3571l0642
$$ -56372 -64820 -99229 -106908 -99201 -51681 -5537 -16773 -24217 12494 27045 27588 51159 20517
21008B0517m6839J4589M1823o172p070M199K6854M365L0705L323K245k2464k1292
$$ 20517 -26322 -11733 30090 23918 16848 21047 47901 52266 82971 86294 88539 66075 44783
20995D4783J3924k3750J208M9467m9533j7044j2929M6005O9845l3613k4096Q037
$$ 44783 58707 34957 36165 85632 36099 19055 6126 52131 121976 88363 64267 72304
20983G2304o146o0457l5281k871L190R65J7232K0713J0545j783l4211M7225l5279
$$ 72304 66158 5701 -29580 -32451 -29261 -28296 -11064 9649 20194 18411 -15800 31425 -3854
20970c854o8092J7248M5113K0116L5226l0264n1793L7491L4233N116k5062q054
$$ -3854 -71946 -54698 -9585 10531 45757 15493 -36300 1191 35424 40540 15478 7424
20958G424o066Q497k1366l5954J1377n872k4627J3922J2186J6670P625Q859R83
$$ 7424 1358 9855 -11511 -47465 -36088 -41960 -66587 -52665 -40479 -23809 -16184 -7325 -6342
20945f342K4143n4232p13K0537o957P470L2482R011K3328k601o12q804m9370n8453
$$ -6342 17801 -36431 -37144 -16607 -23564 -16094 16388 25399 48727 46126 45514 36710 -12660 -71113
20931g1113R402M550M1354Q417l5576J1796J9313j6294l4437k262K5256J6552
$$ -71113 -61711 -57161 -15807 -7390 -42966 -31170 -11857 -28151 -62588 -64850 -39594 -23042
20919b3042L9620k9705j7698j0712K3896l6532m7441O1519P3365N936k167K4324
$$ -23042 16578 -13127 -30825 -41537 -17641 -54173 -101614 -40095 33270 39206 37039 61363
20907F1363L7141o129l7530l5952N3350J6264l6578p7178k5024j4480K941M5362
$$ 61363 98504 92375 54845 18893 72243 88507 51929 -25249 -50273 -64753 -61812 -16450
20895a6450L2262J1013j0933J4784j0291k9536J9569l5852o8989j1995L9601J2276
$$ -16450 15812 26825 15892 30676 20385 -9151 10418 -25434 -94423 -106418 -66817 -54541
20883e4541j8778N0542j1673O466K4777k2218j9413K5459l1875m3448K7660M5928
$$ -54541 -73319 -22777 -34450 -27984 -3207 -25425 -44838 -19379 -51254 -94702 -67042 -21114
20871b1114K3330J063K6989J985N917k0295K5069K2188j9655p4212J7820J5625
$$ -21114 2216 3279 30268 32253 38170 17875 42944 65132 45477 -28735 -10915 4710
20859D710N6606j3916n1399j2147J2740L792J0381n1533n3721r93O8353Q4699
$$ 4710 61316 47400 -3999 -16146 -3406 386 10767 -40766 -94487 -95480 -27127 57572
20847E7572k0180l7280j3112o4191Q08L1116N5178L9645j2692k5621J7727L5410
$$ 57572 37392 112 -13000 -77191 -76383 -45267 9911 49556 36864 11243 28970 64380
20835F4380k1570l9995l4785J4329k6557j0632J66M35l3803l0879M0319R702K372
$$ 64380 42810 2815 -31970 -17641 -44198 -54830 -54664 -54229 -88032 -118911 -78592 -68890 -66518
20822f6518J184L2080N9954N471j4464l3532M6995M4699l1433o3090l4099l4432
$$ -66518 -65334 -33254 26700 32171 17707 -15825 31170 75869 44436 -18654 -52753 -87185
20810h7185k4504J0420J4953L820L897J0985k4536k4619L5771N8516N3225q111
$$ -87185 -111689 -101269 -86316 -82496 -78599 -67614 -92150 -116769 -80998 -22482 30743 22632
20798B2632J5762M6423L028j8884k7484k8641m872j6563Q568k7041j3123k7651
$$ 22632 38394 84817 87845 68961 41477 12836 7964 -8599 -31 -27072 -40195 -67846
20786f7846N738K7797L2923L9798j1344j0665q653J2677j8373k6939J8672j8554
$$ -67846 -62108 -34311 -1388 38410 27066 16401 7748 20425 2052 -24887 -6215 -24769
20774b4769q115m2K043K80j4438n4069L9565R4349K2120l4961k5262j8236j8561
$$ -24769 -32884 -32926 -30883 -30603 -45041 -99110 -59545 34804 56924 21963 -3299 -21535 -40096
20761d0096K3950L2820L0066k1962J2411N2400k0441o6592o5508J6229l4882K5581
$$ -40096 -16146 16674 46740 24778 37189 89589 69148 2556 -62952 -46723 -81605 -56024
20749e6024p52O183O306L2361K5047m898j9424m8522J5128J0651J1119J8J9194
$$ -56024 -56776 -50593 -44287 -11926 13121 8223 -11201 -59723 -44595 -33944 -22825 -22807 -3613
20736c613p762l607M9907J2572k0579m3562l155K5500r711j2681L1978j2176l0036
$$ -3613 -11375 -14982 34925 47497 26918 -16644 -19799 5701 -4010 -16691 15287 3111 -26925
20723b6925m1462m6312L308M6409m341P400J9147Q681j2641L5671n2018N482p676
$$ -26925 -68387 -114699 -111391 -64982 -69323 -61923 -42776 -34095 -46736 -11065 -63083 -57601 -65277
20710f5277N6071M7259j882N354r512j3601K8517j0074j030o266l8460n8068m1721
$$ -65277 -9206 38053 36171 41525 32013 18412 46929 36855 35825 29559 -8901 -66969 -108690
20697a08690R88L0913L0195J3817O701L5583J5765k9099l4953O1978N0880l2196
$$ -108690 -107702 -76789 -46594 -32777 -26076 9507 25272 -3827 -38780 23198 74078 41882
20685D1882o4277j3757N664O8675N3074L2200k2662q9137j7361p423j06521m3813
$$ 41882 -22395 -36152 -30488 38187 91261 123461 100799 11662 -5699 -13122 -119643 -163456
20673a63456l0938J3586O9796J6853j5880K611K4325j0525L5399k3037j856K5003
$$ -163456 -194394 -180808 -111012 -94159 -110039 -107428 -83103 -93628 -58229 -81266 -83122 -58119
20661e8119N4608K35J8946L0524K9730j8924j4291j0088J0976m0637n1982p293
$$ -58119 -3511 -3276 15670 46194 75924 57000 42709 32621 43597 2960 -49022 -56315
20649e6315p383Q0100J2520m5907P220J1890j2259Q241L5910j8369k5571j9212
$$ -56315 -63698 16402 28922 -16985 -9765 2125 -10134 -1893 34017 15648 -9923 -29135
20637b9135M0759N199J3762K0484k1011k2224m2961l8395O1031l1388l2144M1654
$$ -29135 11624 16823 30585 51069 30058 7834 -35127 -73522 -12491 -43879 -76023 -34369
20625c4369N9508K0020l976j6155n7095K5223J7124M2522J3228j6536k2592k1683
$$ -34369 25139 45159 41183 25028 -32067 -6844 10280 52802 66030 49494 26902 5219
20613E219j4468j0681K7150K515J558l0771m2203N6663N3644j6820o68R691m3221
$$ 5219 -9249 -19930 7220 9735 11293 -19478 -61681 -5018 48626 31806 31138 40829 -2392
20600b392m7134K4599M1700k9242J6744K8651j939o0994n2M0218R798m1228l8595
$$ -2392 -49526 -24927 16773 -12469 4275 32926 30987 -30007 -30059 10159 19957 -21271 -59866
20587e9866N4244L8068o979l3893n3411L522R196o246k5535J4961M5518J7885
$$ -59866 -5622 32446 25467 -8426 -61837 -58315 -49119 -55365 -80900 -65939 -20421 -2536
20575b536n1597Q259J7243N1316j040k2078m775j0133j3852M7297k4187o331O78
$$ -2536 -54133 -45874 -28631 22685 21645 -433 -5208 -15341 -29193 18104 -6083 -12414 -11736
20562a1736r98J3180K5384o808l8053J2960l8301l8170n378J0080K3436K1549
$$ -11736 -12734 446 25830 19022 -19031 -6071 -44372 -82542 -87920 -77840 -54404 -32855
20550c2855M487P1932O6158l9326o2093k6152r573L868j3685k571L9996L3242
$$ -32855 -28368 43564 109722 70396 8303 -17849 -27422 -23554 -37239 -39810 186 33428
20538C3428L0451J3863m1212n7719o1154k3192M6476L0488l7012L3295M4645q859
$$ 33428 63879 77742 36530 -21189 -82343 -105535 -59059 -28571 -65583 -32288 12357 3498
20526C498L3771k1517j6910J8397k2939J6469J0734l0887J269J604m5535k482
$$ 3498 37269 15752 -1158 17239 -5700 10769 21503 -9384 -8115 -6511 -52046 -54528
20514e4528K9624o010n000k6027l2357R378M4359N7437J7693k5289j7969J0037
$$ -54528 -24904 -30914 -35914 -61941 -94298 -84920 -40561 16876 34569 9280 -8689 1348
20502A348P934k953l6873K2235k0728j092J207J9665K1482K5462r741n688p241
$$ 1348 9282 6329 -30544 -8309 -29037 -30129 -28922 -9257 12225 37687 27946 22258 15017
20489A5017L3482J510m3797n5365r887M8564L529l1176K234J9908K6562L3630
$$ 15017 48499 50009 6212 -49153 -59040 -10476 -6947 -38123 -35889 -15981 10581 44211
20477D4211J6726M377l9606k9248q3L9785k807r003j9541M2694m127k6003m4146
$$ 44211 60937 65314 25708 -3540 -3623 36162 33355 24352 4811 47505 43378 17375 -26771
20464b6771l8596L715j8308K0123L6453K625O031K0820k1235q5195o182O0315
$$ -26771 -65367 -61652 -79960 -59837 -23384 -20759 -14728 6092 -15143 -100338 -106520 -46205
20452d6205Q034R62M6054M5495k4087K3505J9670n5637l47J9486K0528k4115n016
$$ -46205 -38171 -37209 8845 54340 30253 53758 73428 17791 17444 36930 57458 33343 28327
20439B8327J9365l3648k8316k916J7806M2663K2322k7078j9895J827k7119L823
$$ 28327 47692 14044 -14272 -17188 618 43281 65603 38525 18630 20457 -6662 -2839
20427b839N8292j3515p536n2801J4883J1399p208j1723k3173l7783j9612j0660
$$ -2839 55453 41938 34402 -18399 -3516 7883 675 -11048 -34221 -72004 -91616 -102276
20415a02276K957j4216N2742K3314K8756K4878l7843l2865J5647J5456R741N29
$$ -102276 -99319 -113535 -60793 -37479 -8723 16155 -21688 -54553 -38906 -23450 -13709 -13180
20403a3180k2438J4403K5724M3101L5362r29n6776n60J8977q948j4008n537j1957
$$ -13180 -35618 -21215 4509 47610 82972 82043 25267 24707 43684 34736 20728 15191 3234
20390C234R921l68K6577J4429r998l018j4109l0754m6624K0647K8339J6988k9068
$$ 3234 13155 12787 39364 53793 43795 40777 26668 -4086 -50710 -30063 -1724 15264 -13804
20377a3804k4782J4003n099K9688K3360m5019p610J9427J6302j0840k5819j5289
$$ -13804 -38586 -24583 -29682 6 23366 -21653 -29263 -9836 6466 -4374 -30193 -45482
20365d5482j2986K4394N4036N3456n2101n1604j9756J2919k0331k1339P074L1700
$$ -45482 -58468 -34074 19962 73418 21317 -30287 -50043 -37124 -57455 -78794 -71720 -40020
20353d0020Q960k866l7179L8847J7486Q235j1741n11J5317j5368K7566K1592k461
$$ -40020 -31060 -33926 -71105 -32258 -14772 -6537 -18278 -18789 -3472 -18840 8726 30318 27857
20340B7857l3585m7030o6650L9096J8545l3745n581M7792L0795K0404k8488k928
$$ 27857 -5728 -52758 -119408 -80312 -61767 -95512 -101093 -53301 -22506 -2102 -30590 -33518
20328c3518N567L2135n037k7479R912l4418j2485j1418M2424L0375j1101l4643
$$ -33518 -27951 4184 -853 -28332 -18420 -52838 -65323 -76741 -34317 -3942 -15043 -49686
20316d9686O954J9875L0208M1906M625j086k8781r321j4571J3861J0614p703l7174
$$ -49686 -42732 -22857 7351 49257 53882 52796 24015 14694 123 13984 24598 16895 -20279
20303b0279J109K8767J1370O8303l0758l3602k5883k0944n365l2639N696L9119
$$ -20279 -19170 9597 20967 89270 58512 24910 -973 -21917 -27282 -59921 -54225 -15106
20291a5106Q726j736J1303K4045j6095m9066j47m785j2904j4337R25j650P1494
$$ -15106 -6380 -8116 3187 27232 11137 -37929 -38076 -42861 -55765 -70102 -69177 -70827 667
20278F67K8201L2662j8116k3916K676Q648m5470m7415j1953M174O914L537J6307
$$ 667 28868 61530 43414 19498 22174 30822 -14648 -62063 -74016 -69842 -62928 -59391 -43084
20265d3084k4583M902M1165J4027j3214m4756m417L2021n543j5809J1258K337
$$ -43084 -67667 -62765 -21600 -7573 -20787 -65543 -69960 -37939 -43482 -59291 -48033 -45696
20253d5696J9859M3439l2876n746k6155l4378M4624l25J7514P2961L4108m1327
$$ -45696 -25837 17602 -15274 -21020 -47175 -81553 -36929 -37254 -19740 53221 87329 46002
20241D6002n3513L6642K2641j6973o5448n1886L4386N7828K9495l265l0830k2787
$$ 46002 -7511 29131 51772 34799 -30649 -82535 -48149 9679 39174 35909 5079 -17708
20229a7708l7610j9393l003K4397j5282m453m5354j9244j6759p504J7522L7467
$$ -17708 -55318 -74711 -77714 -53317 -68599 -73052 -118406 -137650 -154409 -161913 -144391 -106924
20217a06924N9401K2728K7230N4187L1393j4848k6759j2436l0317K8328n5191
$$ -106924 -47523 -24795 2435 56622 88015 73167 46408 33972 3655 31983 -23208
20206b3208k4241N5161J0071N729K6001q601j1451m174p148o1257l1493J0546
$$ -23208 -47449 7712 17783 23512 49513 40912 29461 25287 18139 -43118 -74611 -64065
20194f4065L5676M4608P938L698l3331q7202o4379M3057J9406J8023J5933N671
$$ -64065 -28389 16219 24157 27855 -5476 -92678 -157057 -114000 -94594 -76571 -60638 -54967
20182e4967q969L2018K2527L8729p0937l4903J8043q91j1336n495J3165l9100
$$ -54967 -63936 -31918 -9391 29338 -41599 -76502 -58459 -59350 -70686 -76181 -63016 -102116
20170a02116o843Q752N5878O6047P681k5972k7507k5949J3084l297j9952n3747
$$ -102116 -108959 -100207 -44329 21718 29399 3427 -24080 -50029 -36945 -40242 -60194 -113941
20158a13941J6273M9631O0287o396K7094m0312m2055j2202P8054J2949m2062j4386
$$ -113941 -97668 -48037 12250 5854 32948 -7364 -49419 -61621 16433 29382 -12680 -27066
20146b7066l9411R234L6960L7701M476j5004j4173P90J9007j831o6387m603K7845
$$ -27066 -66477 -57243 -20283 17418 21894 6890 -7283 -6493 12514 10683 -55704 -60307 -32462
20133c2462N799j9596L2529R251j8685Q629j2607J8772K9149J8928m4433n1608
$$ -32462 -26663 -46259 -13730 -4479 -23164 -14535 -27142 -8370 20779 39707 -4726 -56334
20121e6334k0418j3981K5253K8605k6807L1911m5785k4971K511l7605J4021M9602
$$ -56334 -76752 -90733 -65480 -36875 -63682 -31771 -77556 -102527 -100016 -137621 -123600 -73998
20109g3998K5171J3361J2367j7945q143n210Q248L5780L2200J0855l9619J6636
$$ -73998 -48827 -35466 -23099 -41044 -49187 -54397 -46149 -10369 21831 32686 -6933 9703
20097I703r816n3655J5747l1127o944L5160m9497j3191N7208j198J1789L1029
$$ 9703 -113 -53768 -38021 -69148 -76092 -40932 -90429 -103620 -46412 -47610 -35821 -4792
20085d792j9996M5434O727k0853j9646k076M9307j2385m1551j3304r426p842J5685
$$ -4792 -24788 20646 27373 6520 -13126 -15202 34105 21720 -19831 -33135 -42561 -50403 -34718
20072c4718N2804K1362k0877J0340L4339m2546n6660k5068j3512L4364N6190K6621
$$ -34718 18086 39448 18571 28911 63250 20704 -35956 -61024 -74536 -40172 16018 42639
20060D2639q0977m4724K821M5261Q629M1752J3124o085L0715J4802k1371J8016
$$ 42639 -38338 -83062 -80241 -34980 -26351 15401 28525 22440 53155 67957 46586 64602
20048F4602Q711m0978o3231P834j3472m7455o1009L3785M1293J9251M7710l769
$$ 64602 73313 32335 -30896 -23062 -36534 -83989 -144998 -111213 -69920 -50669 -2959 -6728
20036f728k697M436L8421L4978n179l4183l31o769J044n634m2962n1199N2484
$$ -6728 -9425 -4989 33432 68410 63231 29048 28717 21948 22992 17358 -25604 -76803 -24319
20023b4319J0375l7839J9051J1455K3917N1581o0740n0569K7792J6757L4982k9267
$$ -24319 -13944 -51783 -32732 -21277 2640 54221 -6519 -57088 -29296 -12539 22443 -6824
20011f824K7960m6127n4815O2352J9762J6644K3202N3213J11m7683k1635l628
$$ -6824 21136 -24991 -79806 -17454 2308 18952 42154 95367 95478 47795 26160 22532
19999B2532m2906m5866r427j0224L6801N2832l7973n326L7587k7918m5117O880
$$ 22532 -20374 -66240 -75667 -85891 -49090 3742 -34231 -39557 -1970 -29888 -75005 -68125
19987f8125M8094j1043J3489M726O1084p536k2246l8132k3922K5280J6122k6983
$$ -68125 -20031 -31074 -17585 -12859 48225 40689 18443 -19689 -43611 -18331 -2209 -29192
19975b9192o1039L0774N5563K433j8095K635O14j0391j020j7987K1310R805O6737
$$ -29192 -90231 -59457 -3894 -1461 -19556 -16921 -16307 -26698 -27718 -45705 -24395 -14590 52147
19962E2147L928m0119p9642K7798M7115L3752k9323m3578M1849L3973n339j8609
$$ 52147 56075 15956 -63686 -35888 11227 44979 15656 -27922 13927 47900 42561 23952
19950B3952J4472M6405L7958m9390O738L0028m261n3859p7688Q010K081k2041
$$ 23952 38424 84829 122787 73397 80135 110163 105902 52043 -25645 -17635 -15554 -37595
19938c7595J7627K7927K457k6286K8236k3096l9139K149J9483M387j8358r798
$$ -37595 -19968 7959 10416 -15870 12366 -10730 -49869 -47720 -28237 -23850 -42208 -52006
19926e2006K0894N162k9176R498j998K1082L2474n3231R639L7271n9107o6333
$$ -52006 -31112 -25950 -55126 -45628 -47626 -26544 5930 -47301 -37662 -391 -59498 -125831
19914a25831J7581M801J7437k1591K8769J2282n523L1136k1615l9741p953L3829
$$ -125831 -108250 -103449 -86012 -107603 -78834 -66552 -72075 -40939 -62554 -102295 -110248 -76419
19902g6419P2109j1141j3288M3227K4114J7095m5998j8508L2729J5468l4989n4886
$$ -76419 -4310 -15451 -28739 14488 38602 55697 9699 -8809 23920 39388 4399 -50487
19890e0487p218k9161K4551K0688K0227p979K4360j3295J151J6291j5098j4511
$$ -50487 -57705 -86866 -62315 -41627 -21400 -29379 -5019 -18314 -17163 -872 -15970 -30481
19878c0481j236r937L1770l5670j1831J1641N0389k9297o4583M6936L3105J8099
$$ -30481 -31717 -41654 -9884 -45554 -57385 -45744 4645 -24652 -89235 -42299 -9194 8905
19866H905r262j8006K4584J3023j6614M4207k606k9442m2799k5929K9173j5630
$$ 8905 -357 -18363 6221 19244 2630 46837 44231 14789 -28010 -53939 -24766 -40396
19854d0396M0866M5689J5468j2700n577j6221l4263M220Q286k809J8407k2511
$$ -40396 470 46159 61627 48927 43350 27129 -7134 -2914 5372 2563 20970 -1541
19842a541O993J9950J3538o9008J5319J3461K4789j2254o1130j8070l5908Q158
$$ -1541 5452 25402 38940 -30068 -14749 -1288 23501 11247 -49883 -67953 -103861 -95703
19830i5703K5379k5406P2350J4001N6745P886l7693m037J6998j3689q0900j281
$$ -95703 -70324 -95730 -23380 -9379 47366 55252 17559 13522 30520 16831 -64069 -65350
19818f5350L7417o634K7873R1191j5156l7228M575m0987l1136m1721l8872L7980
$$ -65350 -27933 -34567 -6694 84497 69341 32113 36688 -4299 -35435 -77156 -116028 -78048
19806g8048L7877j4867K4786N2811K8212l5137m0576j3873O3906J3416k7957l9695
$$ -78048 -40171 -55038 -30252 22559 50771 15634 -24942 -38815 25091 38507 10550 -29145
19794b9145j8398J989p285J2293o977o2565L140K1204Q699O0728K2089n2664q018
$$ -29145 -47543 -45554 -52839 -40546 -47523 -110088 -106948 -85744 -77045 -16317 5772 -46892 -54910
19781e4910N9214K926l1835k6868K1453M7744j1687J6992j1725J535J6697k2134
$$ -54910 4304 7230 -24605 -51473 -30020 17724 6037 23029 11304 12839 29536 7402
19769G402k1280N081K4805l7881J624l052q979K1321K7574K8986k7277j6829l0063
$$ 7402 -13878 -8797 16008 -21873 -20249 -23301 -32280 -10959 16615 45601 18324 1495 -28568
19756b8568n2915l3060j8970K0724J0968J284J8825J459J7991L7739J7358k400
$$ -28568 -81483 -114543 -133513 -112789 -101821 -100537 -81712 -80253 -62262 -24523 -7165 -9565
19744i565j8434o2203k8588j1748K6080N7804J7877P972p918J3740l2348l3088
$$ -9565 -27999 -90202 -118790 -130538 -104458 -46654 -28777 -20805 -28723 -14983 -47331 -80419
19732h0419P207k194M3359L0769l6732M4512O1555K1915q2170j5297O2163N163
$$ -80419 -73212 -75406 -32047 -1278 -38010 6502 68057 89972 7802 -7495 54668 59831
19720E9831k6548j0041m392Q74k1524o916J0958L251l1834n1515K0084K8065N0306
$$ 59831 33283 23242 18850 19724 -1800 -8716 2242 5493 -26341 -77856 -57772 -29707 20599
19707B0599k519k9923l197O8963j10Q784n144j8646l7822k3656M2905j8938j8269
$$ 20599 18080 -11843 -15040 53923 53813 62597 57453 38807 985 -22671 20234 1296 -16973
19694a6973m9273m202P682Q455k7456q33L3873K0450O32J4531K9172k8681l7236
$$ -16973 -66246 -70448 -62766 -54311 -81767 -82600 -48727 -28277 -27645 -13114 16058 -12623 -49859
19681d9859J0763l008N6795M0301l155j3500m8802M694O735o4284k7184M3779
$$ -49859 -39096 -42104 14691 54992 51837 38337 -10465 -5771 964 -63320 -90504 -46725
19669d6725M906J8706j146k8925j49O7105N5639j5581j6091k3424l6775J8148
$$ -46725 -41819 -23113 -24259 -53184 -53333 13772 69411 53830 37739 14315 -22460 -4312
19657d312J5854k2142K467q295j0040K3670J7417K4727J5062k9089N2141N7101
$$ -4312 11542 -10600 -8133 -16428 -26468 -2798 14619 39346 54408 25319 77460 134561
19645A34561J8639k5608q3718j5978J0789J4326n135k2865m4298l8989K5735J9570
$$ 134561 153200 127592 43874 27896 38685 53011 47876 25011 -19287 -58276 -32541 -12971
19633a2971j393q27p316n3589o181J4004N808J654M7294J3199Q619j0994p489
$$ -12971 -14364 -15191 -22507 -76096 -82277 -68273 -62465 -60811 -13517 -318 8301 -2693 -10182
19620a0182M4710l6725L7269L3327o2657k4912n419L6538N0024N3781n2153l4795
$$ -10182 34528 -2197 35072 68399 5742 -19170 -24589 11949 61973 115754 63601 28806
19608B8806m1394p9906L5998O0450j456p7494n0270M4586n048j37j4479K8259
$$ 28806 -12588 -92494 -56496 3954 2498 -74996 -125266 -80680 -85728 -85865 -100344 -72085
19596g2085K7315J5911n431k980L3932O3L979Q820m0154j9016K0590k7197k8669
$$ -72085 -44770 -28859 -34290 -37270 -3338 -3275 704 9524 -30630 -49646 -29056 -56253 -84922
19583h4922L6202M1667o518m3980R001K0525k9359L3794K9805j7946j1725m0613
$$ -84922 -48720 -7053 -13571 -57551 -48550 -28025 -57384 -23590 6215 -11731 -23456 -64069
19571f4069K5521k3203P4696P1788j010k0853j1148o995n9556l2848N375M861
$$ -64069 -38548 -61751 12945 84733 83723 62870 51722 44727 -14829 -47677 -42302 -37441
19559c7441L4290M9260j5108k8732N1532K7529N1048l2106o8577J5178K551j0301
$$ -37441 -3151 46109 31001 2269 53801 81330 132378 100272 31695 46873 49424 39123
19547C9123j3788o7516k4817K967J3339O1335m758j4224J5953j7517m0787l9763
$$ 39123 25335 -42181 -66998 -64031 -50692 10643 5885 -8339 7614 -9903 -50690 -90453
19535i0453J763K1529K0072k5446l9948M1093K2815Q333q836L4577L4244K2315
$$ -90453 -88690 -67161 -47089 -72535 -112483 -71390 -48575 -40242 -49078 -14501 19743 42058
19523D2058p963j5861m0195J5774o008J1180k0981j018K5974K1776R102J4788
$$ 42058 34095 18234 -21961 -6187 -12195 -1015 -21996 -23014 2960 24736 33838 48626
19511D8626k5781m8694k9662J1585j7530L3104M9731l3416j3989J7585k1268K0192
$$ 48626 22845 -25849 -55511 -43926 -61456 -28352 21379 -12037 -26026 -8441 -29709 -9517
19499i517k1615k7430O537K2061r700m7730J1882J3524J1158K3420j9987m4069
$$ -9517 -31132 -58562 -52025 -29964 -39664 -87394 -75512 -61988 -50830 -27410 -47397 -91466
19487i1466L4718L0565L0987L0938k1767j782r500J4398J2264M0734J7668K09
$$ -91466 -56748 -26183 4804 35742 13975 12193 2693 17091 29355 70089 87757 87966
19475H7966k9190J5195J6127m4815j8390L7863m2681l3596J0794J4270N2447J8025
$$ 87966 58776 73971 90098 45283 26893 64756 22075 -11521 -727 13543 65990 84015
19463H4015m7297m3841J0373k6500o6789p1525O7533P4901K4094m1080j2642J8211
$$ 84015 36718 -7123 3250 -23250 -90039 -161564 -94031 -19130 4964 -36116 -48758 -30547
19451c0547M3189J1185L8690Q395p2305j5994J9396l512K1617K3563j1912k7211
$$ -30547 12642 23827 62517 70912 -1393 -17387 2009 -1503 20114 43677 31765 4554
19439D554K0053J1588J8040m3630O144M4940J397l3859M2531L5566j5644k43l3928
$$ 4554 24607 36195 54235 10605 16749 61689 63086 29227 71758 107324 91680 91437 57509
19426E7509J5610j9681n6123Q026N7606k1034N319j2240l2567m7022l3605k7638
$$ 57509 73119 53438 -2685 5341 62947 41913 47232 34992 2425 -44597 -78202 -105840
19414a05840R463J8461J8368M3451k0886P04O463O5600Q304o3152j7885L2097
$$ -105840 -96377 -77916 -59548 -16097 -36983 -36279 -29816 35784 44088 -19064 -36949 -4852
19402d852J4901K1306l61k6282L573K5099p6218Q201J7602K6506L7270K7469K0466
$$ -4852 10049 31355 30994 4712 8285 33384 -42834 -34633 -17031 9475 46745 74214 94680
19389I4680k0313o9116O541K0011K2938J5877m646j9397L5149L1653k4004p9000
$$ 94680 74367 5251 11792 31803 54741 70618 65972 46575 81724 113377 89373 10373
19377A0373p4682J3450K3859j204m633J3333Q0387L3715o0223l8380M934J1774
$$ 10373 -64309 -50859 -27000 -28204 -32837 -19504 60883 94598 34375 -4005 929 12703
19365A2703k1675k5525j3069J8428K4443K6797K7967L1343k5260J460O3793j6972
$$ 12703 -8972 -34497 -47566 -29138 -4695 22102 50069 81412 56152 57612 121405 104433
19353A04433p0500j8939m1455j084J9069O3161J6078n0531M102j8985P627l762
$$ 104433 33933 14994 -26461 -27545 -8476 54685 70763 20232 24334 5349 12976 9214
19341I214J4757N471R368k7276L911l246o0296L2074K4110J4360N792j8195J7399
$$ 9214 23971 29442 38810 11534 15445 12199 -48097 -16023 8087 22447 28239 10044 27443
19328B7443k2380L1981k7067m0965l1732M8118j902j0366r811o542k8752L173
$$ 27443 5063 37044 9977 -30988 -62720 -14602 -16504 -26870 -36681 -43223 -71975 -68802
19316f8802j3532O9076L2193l7182j5230j4800J8968k2059J5898J4218L1752p680
$$ -68802 -82334 -13258 18935 -18247 -33477 -48277 -29309 -51368 -35470 -21252 10500 2820
19304B820k9907N085L0593r904K6232l837J5606j4448l2820l2565L2582K1982
$$ 2820 -27087 -22002 8591 -1313 24919 21082 36688 22240 -10580 -43145 -10563 11419
19292A1419j7213k432J0655j0036Q025m6034q470O916K3396O169N3048l4995L854
$$ 11419 -5794 -8226 2429 -7607 418 -45616 -54086 -47170 -23774 -17605 35443 448 4302
19279D302l072R685K8554o308k9580r405K7778j4966j8676Q125L7712j8646n4944
$$ 4302 1230 10915 39469 33161 3581 -5824 21954 6988 -11688 -3563 34149 15503 -39441
19266c9441K995J2748K6344j4774R896M8001J672l7834j2233J1764K4458j0163
$$ -39441 -36446 -23698 2646 -12128 -2232 45769 47441 9607 -2626 9138 33596 23433
19254B3433J7755j2938R879O748j3531K7232j7503m7119K3273J2767l4784l3803
$$ 23433 41188 28250 38129 44877 31346 58578 41075 -6044 17229 29996 -4788 -38591
19242c8591o546M878K1132L9979l099K4343J3107m1500q204l3196j4617K8508
$$ -38591 -45137 -40259 -19127 20852 17753 42096 55203 13703 5499 -27697 -42314 -13806
19230a3806K8030o293J5519k5677k7555N2700P9247n7312q5550j0147n372l8836
$$ -13806 14224 7931 23450 -2227 -29782 22918 102165 44853 -40697 -50844 -56216 -95052
19218i5052K2603Q9034R630k2307n7991K530O3892J3892L0527K1946l4529m4447
$$ -95052 -72449 16585 26215 3908 -54083 -51553 12339 26231 56758 78704 44175 -272
19206b72J4181k9993l8431o338J1156J8363L963l1110l9066O2824P3357L490n0066
$$ -272 13909 -16084 -54515 -60853 -49697 -31334 -27371 -58481 -97547 -34723 38634 42124 -7942
19193g942o7188k7836L0755j3092p632M0047J1480L3248L1731K49j250k5187n5395
$$ -7942 -75130 -102966 -72211 -85303 -92935 -52888 -41408 -8160 23571 23820 22570 -2617 -58012
19180e8012L7256J05416J8939m4205m2284j4416J587K6440K3759k6355j7016k7528
$$ -58012 -20756 84660 103599 59394 17110 2694 4281 30721 54480 28125 11109 -16419
19168a6419n603K8264J0002p42J3723j8609l2443m8996K8866K267j4340j4709
$$ -16419 -22022 6242 16244 15502 29225 10616 -21827 -70823 -41957 -39690 -54030 -68739
19156f8739J9470K9369M5046R146K4550j1625o4600K1572L5289j3506j8817K3281
$$ -68739 -49269 -19900 25146 34292 58842 47217 -17383 4189 39478 25972 7155 30436
19144C0436o487k5328j2191q214L5714l947R971P5330j1192o880l6301j4813j809
$$ 30436 23949 -1379 -13570 -21784 13930 9983 19954 95284 84092 77212 40911 26098 24289
19131B4289j1181Q367n0270J6135P5243j5185k8638K2978K3951k192J4678L6877
$$ 24289 13108 21475 -28795 -12660 62583 47398 18760 41738 65689 63497 78175 115052
19119A15052l3473j14908m4750L7251K8216q717k9074O070J2999K0733k0579J8501
$$ 115052 81579 -33329 -78079 -40828 -12612 -21329 -50403 -44333 -31334 -10601 -31180 -12679
19107a2679N1430k0352o1620j4183m309N1146K551J1838o399P974j3855l2335
$$ -12679 38751 18399 -43221 -57404 -61713 -10567 -8016 3822 -2577 5397 -8458 -40793
19095d0793J3079J7257K8056j96j6810J0820j966o5538k3956M5395M367K7204
$$ -40793 -27714 -10457 17599 17403 593 11413 9447 -56091 -80047 -34652 -30285 -3081
19083c081N3172J3885j3538k0070o4070L4510j635K3184K1787l765o329l48J081
$$ -3081 50091 63976 50438 30368 -33702 808 -827 22357 44144 40379 34050 33702 34783
19070C4783m5580l8603M4768N6896m7717J0586P68k6654K5647j0092k9665n4685
$$ 34783 -10797 -49400 -4632 52264 4547 15133 15901 -10753 14894 4802 -24863 -79548
19058g9548K4899L1548M942q0631k4307O2202M8695K3085J33L7057l0132m6162
$$ -79548 -54649 -23101 -18159 -98790 -123097 -60895 -12200 10885 11018 48075 17943 -28219
19046b8219n1647J6909N5200K7908J0634Q045J211J1139P328l9879Q870L6663
$$ -28219 -79866 -62957 -7757 20151 30785 38830 40041 51180 58508 18629 27499 64162
19034F4162k03N871J1855J9805Q435K6447k5619k5517j6321L142K3663O199j0035
$$ 64162 63959 69830 81685 101490 109925 136372 110753 85236 68915 72057 95720 101919 91884
19021I1884k5858l0722j1266k1905J1986J3295m398L677m3283J5364K3159M5702
$$ 91884 66026 35304 24038 2133 14119 27414 23016 26693 -16590 -1226 21933 67635
19009F7635j5818m193k2334M229l919K5377j5738l7055j6107K7601j3037j4778
$$ 67635 51817 47624 25290 29519 25600 50977 35239 -1816 -17923 9678 -3359 -18137
18997a8137n385J802m491L024K6057J4563M1693k210k9834n0913K7911P272K7555
$$ -18137 -23522 -21720 -26211 -23187 2870 17433 59126 56916 27082 -23831 4080 11352 38907
18984C8907j5161M5775l4449L9015M632J3502J6737k7911n0208k8872l6140O346
$$ 38907 23746 69521 35072 74087 78719 92221 108958 81047 30839 1967 -34173 -27827
18972b7827k2062J1739N9986k1846J0487q457k6293J4551N0332j3339r606k2416
$$ -27827 -49889 -38150 21836 -10 10477 2020 -24273 -9722 40610 27271 17665 -4751
18960d751O662K0767K0309O84k6545Q784K5654m6154k4804J4506O4261K491o6857
$$ -4751 1911 22678 42987 43671 17126 25910 51564 5410 -19394 -4888 59373 61864 -4993
18947d993j1047p970l1217J3920O4277L4954m139k4320K4745Q029m7113o5740
$$ -4993 -16040 -24010 -55227 -41307 22970 57924 53785 29465 54210 62239 15126 -50614
18935e0614R205O1559M9699O827o2813l1490j3317m598L3668k4234r350j5261
$$ -50614 -41409 20150 69849 76676 13863 -17627 -30944 -35542 -1874 -26108 -35458 -50719
18923e0719o44o439L2775J7019J4496j26j6931J7181L1645m187J7223Q259m1435
$$ -50719 -51363 -57802 -25027 -8008 6488 6362 -10569 6612 38257 34070 51293 59552 18117
18910A8117p487k8574m7358j7073K2886L9422K8184L0563k2513K0336n156J3026
$$ 18117 10630 -17944 -65302 -82375 -59489 -20067 8117 38680 16167 36503 31347 44373
18898D4373j5014L0429J1419n0715L2381L0927l5777l8343j6984n172N724K0153
$$ 44373 29359 59788 71207 20492 52873 83800 48023 9680 -7304 -12476 -6752 13401
18886A3401J4283L4217k1989J5320J593j2189k4416k7915m638k3231J2117j5597
$$ 13401 27684 61901 39912 55232 56825 44636 20220 -7695 -12333 -35564 -23447 -39044
18874c9044L5486J5250j5038j6007k4828j6423P1792J7993j3679j6558J2790L6981
$$ -39044 -3558 11692 -3346 -19353 -44181 -60604 11188 29181 15502 -1056 11734 48715
18862D8715o3551l2081P5618M0525o1115k4101M9119m036J9626O562j0716J3613
$$ 48715 -14836 -46917 28701 69226 8111 -15990 33129 29093 48719 55281 44565 58178
18850E8178j4683R588J4409J3515J8332j5343p0336j4740J9827k3003Q789m056
$$ 58178 43495 53083 67492 81007 99339 83996 13660 -1080 18747 -4256 4533 477
18838D77K3338j1253j4436M6216N7819k2453J3074k5761J3326j6064k1817k5222
$$ 477 23815 12562 -1874 44342 102161 79708 92782 67021 80347 64283 42466 17244
18826A7244L6994P0277j6642j8827j9023R599M7091M3310J0751j6619n571r511
$$ 17244 54238 124515 107873 89046 70023 79622 126713 170023 180774 164155 158584 149073
18814A49073j530k5600n9854k993K2618j29K3455k0108m1603J0617K9804K0573
$$ 149073 147543 121943 62089 59096 81714 81585 105040 84932 43329 53946 83750 104323
18802A04323J287K1328J9211K6066K591M5258Q1031Q3004q038m2531l2618k9939
$$ 104323 105610 126938 146149 172215 174806 220064 301095 384099 376061 333530 300912 270973
18790B70973l1717n6364k6251M6386O4067J19747J30151m7440r9122n8394n5665
$$ 270973 239256 182892 156641 203027 267094 386841 516992 469552 370430 312036 256371
18779B56371r362k7592o290Q6214O7273L7072O3044k1103k0051O3271P1993J75012
$$ 256371 247009 219417 213127 299341 366614 403686 466730 445627 425576 488847 560840 735852
18767G35852K34348R9659j65907j68615r4612r4501R446k0568k5235L8342N0179
$$ 735852 970200 1069859 903952 735337 640725 546224 555670 535102 509867 548209 598388
18756E98388R1668N3324K3877M8383P6425j8047O14L3850m908m6943j33232l5046
$$ 598388 690056 743380 767257 815640 892065 874018 874632 908482 903574 856631 723399 688353
18744F88353K2691L1551j6414m928J42855J43847N5444n4539j31319j81066j26015
$$ 688353 711044 742595 726181 721253 864108 1007955 1063399 1008860 877541 696475 570460
18733E70460l7170l4706L5112J18094Q6477K3294m904n4652j16536p9897p561
$$ 570460 533290 498584 533696 651790 738267 761561 756657 702005 585469 505572 498011
18722D98011p195P842k4932o5433l0725K6509J528L8413K9045O9682J02119Q2252
$$ 498011 490816 498658 473726 408293 377568 404077 405605 444018 473063 542745 644864 727116
18710G27116L1128l101K2100Q518L8305K9290j1818k5304m0773o8669n1982k8820
$$ 727116 758244 755143 777243 785761 824066 853356 841538 816234 775461 706792 654810 625990
18698F25990J7828P0879N1532L7812P2059N3849m3527r3740p0394n2291q6109
$$ 625990 643818 714697 766229 804041 876100 929949 886422 792682 722288 669997 583888
18687E83888n7953q1867k6332N6985K2167M7119j152j19596l3106l5942p2885
$$ 583888 525935 444068 417736 474721 496888 544007 542855 423259 390153 354211 281326
18676B81326p9432k8916m753n7529o1410n2371Q328J2495K1939P828L3918L7574
$$ 281326 201894 172978 168225 110696 49286 -3085 5243 17738 39677 47505 81423 118997
18664A18997R041K8547k6535n8672l1979J3302j2615n479N1165j5580j390K8696
$$ 118997 128038 156585 130050 71378 39399 52701 40086 34607 85772 70192 68802 97498
18652I7498J0862l1929k5078J8849J1983l7085j0986M7480N5918j4565p854j97
$$ 97498 108360 76431 51353 70202 82185 45100 34114 81594 137512 122947 115093 114896
18640A14896k9754K5778J7102k3290j4259q495m2353j2890K8902L7324o5052j3545
$$ 114896 85142 110920 128022 104732 90473 81978 39625 26735 55637 92961 27909 14364
18628A4364M8626P0896K2614m1502j0544K450P438L9241j1586J2783L8127J3707
$$ 14364 62990 133886 156500 114998 104454 106904 114342 153583 141997 154780 192907 206614
18616B06614k358n3348l8503l917K6529K1698m545j3492m7137p5942L1560L0629
$$ 206614 204256 150908 112405 108488 135017 156715 152170 138678 91541 15599 47159 77788
18604G7788k7160K8096N5363J4922j0011J0683N136M7895L1006k0199k3419m3649
$$ 77788 50628 78724 134087 149009 138998 149681 154817 202712 233718 213519 190100 146451
18592A46451p978j9034o5870k2585K501J8961J9383O1760M259l690J3541m903
$$ 146451 138473 119439 53569 30984 33485 52446 71829 133589 137848 134158 147699 142796
18580A42796M9097M6483l3410k5590L7676k1012j8198r563k1119L110J3887O989
$$ 142796 191893 238376 204966 179376 217052 196040 177842 168279 147160 150270 164157 171146
18568A71146N359j485K939j0962n5428K14q486M0539M086m0623R911M6101O9l795
$$ 171146 176505 175020 177959 166997 111569 111783 103297 143836 147922 107299 117210 163311 163380 159585
18554A59585k2262J2041k1740j8560J2934K1200L4961q476J0563L7530l2081K2868
$$ 159585 137323 149364 127624 109064 121998 143198 178159 169683 180246 217776 185695 208563
18542B08563L326j7945K7024j4237k2395m6700n237M7994K8095J3901J8150m832
$$ 208563 211889 193944 220968 206731 184336 137636 132399 180393 208488 222389 240539 235707
18530B35707j550j572m596j0034m1117j3484j9620K1679l3024o235J3130j9776
$$ 235707 234157 232585 227989 217955 176838 163354 143734 165413 132389 126154 139284 119508
18518A19508j7001P3252O5246j0352k682J4865M994m738R61K5063O6062k7152
$$ 119508 102507 175759 241005 230653 227971 242836 247830 243092 244053 269116 335178 308026
18506C08026l4013l2938k480k2780r248m5333N976M6604K2361l6629j77j6517
$$ 308026 274013 241075 238595 215815 206567 161234 167210 213814 236175 199546 199369 182852
18494A82852L8101N278J8394N1067J5135m848j8136o0054J3744L7901l988l3224
$$ 182852 220953 226231 244625 295692 310827 305979 287843 227789 241533 279434 275446 242222
18482B42222R321j6447n2537l2386K056L8821O7181j0902k001j8350J6760N0747
$$ 242222 251543 235096 182559 150173 152229 191050 258231 247329 245328 226978 243738 294485
18470B94485m1911n895J4967L0456o293k1082K6823l2694K2532j1181K7328L8071
$$ 294485 252574 246679 261646 292102 285809 264727 291550 258856 281388 270207 297535 335606
18458C35606k3437m6931l816P496j8367J6197O3351k277p6404j8934K8255J0044
$$ 335606 312169 265238 261422 268918 250551 266748 330099 327822 251418 232484 260739 270783
18446B70783m7076n304M5797Q933K0435J7081l7366k1755M4769M4632J2630J574
$$ 270783 223707 218403 264200 273133 293568 310649 273283 251528 296297 340929 353559 355133
18434C55133J9049M2264j3353l7094k3717N55q117m4169p2084K3799L5388J6888
$$ 355133 374182 416446 403093 365999 342282 342837 334720 290551 218467 242266 277654 294542
18422B94542k44j5039j5704k2457L5117O8248k27j297q084p669J2487l7278j1629
$$ 294542 294298 279259 263555 241098 276215 344463 344236 342939 334855 327186 339673 302395 290766
18409B90766r308N4920j6605Q021L6448M3445p587m3846j7599k1895p667L8144
$$ 290766 281458 336378 319773 327794 364242 407687 400100 356254 338655 316760 309093 347237
18397C47237M8663j9212o845P8849N7500M427N8970J06949N0113K3388J22770
$$ 347237 395900 376688 369843 448692 506192 510619 569589 676538 726651 750039 872809
18386H72809J35489O1178q929q2366j33212n0442n9656q1965o3793r7241l9242
$$ 872809 1008298 1069476 1060547 978181 844969 794527 734871 652906 589113 491872 452630
18375D52630L5339L5181K5111M6250J00158O5764n4658p7212K992L664l789J2707
$$ 452630 487969 523150 548261 594511 694669 760433 705775 628563 631555 635219 631430 644137
18363F44137j5519l1617j6652P3401M5533k4514M0767M5994j1338m8311K5773
$$ 644137 628618 597001 580349 653750 699283 674769 715536 761530 750192 701881 727654
18352G27654P4284O3346K9865L2934Q764n8893j7439k3663K8860R4313J37876
$$ 727654 801938 865284 895149 928083 936847 877954 860515 836852 865712 960025 1097901
18341A097901J10230Q9718N850j05564m3541M5820M7329N6988Q5364J5046K382
$$ 1097901 1208131 1297849 1303699 1198135 1154594 1200414 1247743 1304731 1390095 1405141 1407523
18330A407523j9474P075q672o3265j8046J2757P5349J03068J36195K00742J82084
$$ 1407523 1388049 1395124 1386452 1323187 1305141 1317898 1393247 1496315 1632510 1833252 2015336
18319B015336P6874M0099M2946O1716L8669M9352Q9066J68907J63898K12527K34301
$$ 2015336 2092210 2132309 2175255 2236971 2275640 2324992 2414058 2582965 2746863 2959390 3193691
18308C193691K59028L58040O53342J104744J931299L100028L274921Q19459j840633
$$ 3193691 3452719 3810759 4464101 5568845 7500144 10600172 13875093 14694552 12853919
18299A2853919k147148j077708p1894O50873J283525K262910L768131O575506
$$ 12853919 10706771 9629063 9557169 10208042 11491567 13754477 17522608 24098114
18291B4098114J1733940J7613103J6060507Q677246M756631K378521o263502j0571123
$$ 24098114 35832054 53445157 69505664 78182910 82939541 85318062 79054560 68483437
18283F8483437n621923k480797o531475p912539m755492k661822j397939J838116
$$ 68483437 62861514 60380717 53849242 45936703 41181211 38519389 37121450 38959566
18275C8959566O028602O984015R16295o290383p486622l586858J201775O659615
$$ 38959566 44988168 51972183 52888478 46598095 39111473 35524615 36726390 43386005
18267D3386005J4121640K1305534K0018788J5845695K1033240K8234235J3632037
$$ 43386005 57507645 78813179 98831967 114677662 135710902 163945137 177577174
18260A77577174o876326j0316595l753917r572325j9830106k2005700j5828768
$$ 177577174 170700848 160384253 156630336 147058011 127227905 105222205 89393437
18253H9393437r210890m339534j367972K568055R493433J4242560P775002l506951
$$ 89393437 80182547 75843013 74475041 77043096 86536529 100779089 108554091 105047140
18245A05047140n723644K173285J3975069K3754797K2343547Q804660q621568
$$ 105047140 99323496 101496781 115471850 139226647 161570194 170374854 161753286
18238A61753286j3949697r224772J441718P874396K312162n028716l870614l242808
$$ 161753286 147803589 138578817 140020535 147894931 150207093 145178377 141307763 138064955
18230A38064955j0237280j3063067j2773828j4361098j3291236o575592j56406
$$ 138064955 127827675 114764608 101990780 87629682 74338446 67762854 67606448
18223F7606448K002928L275211P329113R702056L668485n104590o922439l641061
$$ 67606448 69609376 72884587 80213700 89915756 93584241 88479651 81557212 77916151
18215G7916151n35268K992741P475757J3994744K4224183L0589232K1363662J2194596
$$ 77916151 77380883 80373624 87849381 101844125 126068308 156657540 178021202 190215798
18207A90215798J7033995J6926491q992629k8884166k4387259j5248501j7200895
$$ 190215798 207249793 224176284 215183655 186299489 161912230 146663729 129462834
18200A29462834j6025478r879629j0701164j5218233j3835415p011140M38972
$$ 129462834 113437356 103557727 92856563 77638330 63802915 56791775 57230747
18193E7230747P645408J3261713J2770988R744355J4272420K2902151J9715129
$$ 57230747 64876155 78137868 90908856 100653211 114925631 137827782 157542911
18186A57542911N538279q217981k2965427l3037692l0142674j9600894j1683654
$$ 157542911 163081190 154863209 131897782 98860090 68717416 49116522 37432868
18179C7432868p340688m935146l339826k101847j177172l59731J107801L077313
$$ 37432868 30092180 25157034 21817208 19715361 18538189 18178458 19286259 22363572
18171B2363572L069991r83630m639692m819486l235105k029284j407726r06010
$$ 22363572 25433563 24449933 19810241 14990755 11755650 9726366 8318640 7412630
18163G412630o07058m60472l62677l13558l37740l25719j96787j47678k21222
$$ 7412630 6805572 6345100 5982423 5668865 5331125 5005406 4808619 4660941 4439719
18154D439719k33978k88858l94545l69767l31436j66176j60003j74402j75218
$$ 4439719 4205741 3916883 3522338 3152571 2821135 2654959 2494956 2320554 2145336
18145B145336j42346j11220r3660j05376o7084m2973o5334r3327p2530n1639q2398
$$ 2145336 2002990 1891770 1798110 1692734 1625650 1582677 1517343 1424016 1351486 1299847 1217449
18134A217449J147N9623P8664M4810K9553j5898q450Q1449O7855Q7392R8385J50135
$$ 1217449 1218596 1278219 1356883 1401693 1431246 1415348 1406898 1488347 1556202 1643594 1741979 1892114
18122A892114J63037K28958K81405K81082M31935N89106Q00100J239322J735086
$$ 1892114 2055151 2284109 2565514 2846596 3278531 3867637 4667737 5907059 7642145
18113G642145K942009N554537J1235844K3371726L5675428J4992547k1078637
$$ 7642145 10584154 16138691 27374535 50746261 86421689 101414236 80335599
18106H0335599l2432292j9826322r786275n400484l360828k196382j475709r99725
$$ 80335599 47903307 28076985 18290710 12890226 9529398 7333016 5857307 4857582
18098D857582p43884m99694m09097l08958l06690k60750j88213j24199o8499j27152
$$ 4857582 4113698 3614004 3204907 2895949 2589259 2328509 2140296 2016097 1947598 1820446
18088A820446j49991j18625p4386o9873k7621j07494q0494k8086l8281r8052n7416
$$ 1820446 1670455 1551830 1477444 1407571 1379950 1272456 1191962 1163876 1125595 1027543 970127
18077I70127n9750l1307l4386p4993l0927J1783L1353L418k5527k8550j7540l941
$$ 970127 910377 879070 844684 769691 738764 750547 781900 785318 759791 731241 713701 709760
18065G09760o8647n3783j8024n2530n2635j2738o242J166L8704L6069j4447l2979
$$ 709760 641113 587330 569306 516776 464141 451403 445161 446327 485031 521100 506653 473674
18053D73674M7556K3891j3692k2302n5938K930j2656J5853O5444M0584L9759K4729
$$ 473674 521230 545121 531429 509127 453189 456119 443463 459316 524760 565344 605103 629832
18041F29832j0000q2042p4457O311Q619j6655n508j2309L5442L8524p032l6181
$$ 629832 619832 537790 463333 469644 478263 461608 456100 443791 479233 517757 510725 474544
18029D74544N217J7044K830p159K4896j0161j8053J9449J1794k4771n3909K0904
$$ 474544 479761 496805 499635 492476 517372 507211 489158 508607 520401 495630 441721 462625
18017D62625P2635r960o3058j5465K66k8071R264J3508k3140J8275M460j3239
$$ 462625 535260 525300 462242 446777 447043 418972 428236 441744 418604 436879 441339 428100
18005D28100J9562j547K8531K9095L8948j0231k0222K4223O5267P131j2375O400
$$ 428100 447662 446115 474646 503741 542689 532458 512236 536459 601726 608857 596482 602882
17993F02882j9723M3326J7490K0544o785J2504m933l3940J9161R392R689n472
$$ 602882 583159 626485 643975 664519 657734 670238 665305 631365 650526 659918 669607 664135
17981F64135O1801L2400l4767m7906m7039n1584j6879K9018N817m0820J1628K9187
$$ 664135 725936 758336 723569 675663 628624 577040 560161 589179 594996 554176 565804 594991
17969E94991l0559K1015k0442k4941n37J647R804m688o192L3882J6886q801M3943
$$ 594991 564432 585447 565005 540064 539527 541174 550978 546290 540098 573980 590866 582065 626008
17956F26008N2487L9109L010J1393N7538M3987O9081J62814J87328P5199L0593
$$ 626008 678495 717604 720614 732007 789545 833532 902613 1065427 1252755 1327954 1358547
17945A358547k6183m3027M6999P6782J22759J10584L5572L2888O4698J23990J47949
$$ 1358547 1332364 1289337 1336336 1413118 1535877 1646461 1682033 1714921 1779619 1903609 2051558
17934B051558J51815K49318L36452M40347O59979R42477J199160J763763K882082
$$ 2051558 2203373 2452691 2789143 3229490 3889469 4831946 6031106 7794869 10676951
17925A0676951N245948Q726826R256131K356169m418060m607053R1511O300079
$$ 10676951 15922899 24649725 33905856 36262025 31843965 27236912 27328423 33628502
17917C3628502J4129465J8548548P329775j0824371j7219194j1257387l527596
$$ 33628502 47757967 66306515 73636290 62811919 45592725 34335338 30807742
17910C0807742L139501P994003M573365n974012j1571569r202744n332479l162159
$$ 30807742 33947243 41941246 46514611 40540599 28969030 19766286 14433807 11271648
17902A1271648k061361j421164r44177o60734m35890l77718l78721k85285p0602
$$ 11271648 9210287 7789123 6844946 6184212 5748322 5370604 4991883 4706598 4635996
17893D635996J53139J60982K06488J63272M1079L1516J35135L46808O39820R97918
$$ 4635996 4789135 4950117 5156605 5319877 5360956 5392472 5527607 5874415 6514235 7512153
17883G512153J594569K652805M747748P769920P762398J707778l185242j783496
$$ 7512153 9106722 11759527 16507275 24277195 32039593 33747371 30562129 28778633
17875B8778633L625873Q624699R218683Q077912J2255149J7590133J4163359J059387
$$ 28778633 32404506 41029205 50247888 58325800 70580949 88171082 102334441 103393828
17867A03393828j1222503j3503559r688064j0799391j3039808j0439891m467418
$$ 103393828 92171325 78667766 68979702 58180311 45140503 34700612 30233194
17860C0233194P85985L935846J495554m902277q119194o566977m008986k435670
$$ 30233194 31019179 34955025 36450579 31548302 23429108 16862131 12853145 10417475
17852A0417475j616517j157631p66023m22889l88521l45966k54642j07139R202
$$ 10417475 8800958 7643327 6877304 6454415 6065894 5719928 5465286 5358147 5367349
17843E367349j20201k55444k22928r8079l6073K6647O0317K89490N72570Q02286
$$ 5367349 5247148 4991704 4768776 4670697 4634624 4661271 4721588 5011078 5583648 6385934
17833F385934J191823K261880M359289O568077M312889j509757m098854k024208
$$ 6385934 7577757 9839637 14198926 20767003 25079892 23570135 19471281 17447073
17825A7447073J633480O179649J1094420R167652k440814j0586844r285909m246383
$$ 17447073 19080553 25260202 36354622 45522274 43081460 32494616 23208707 18962324
17817A8962324j15082L459224M159597q97472n841751o248445l933888k206844
$$ 18962324 18847242 22306466 26466063 25568591 19726840 13478395 9544507 7337663
17809G337663j393663r57268o20932m09963k50073j57263k40792k57679j97778
$$ 7337663 5944000 4986732 4365800 3955837 3705764 3548501 3307709 3050030 2852252
17800B852252j17149o0239M2245O2335m5664j47987j64389j78247r5154K2208
$$ 2852252 2735103 2674864 2717109 2779444 2733780 2585793 2421404 2243157 2148003 2170211
17790B170211J25440K8981M91n3280l0531J5568m5041n3466M6959O2174j702J4180
$$ 2170211 2295651 2324632 2325123 2271843 2241312 2256880 2211839 2158373 2205332 2267506 2265804 2279984
17778B279984L6050J02960J49072J25983J45786P0400P3995K11807K50488L38605
$$ 2279984 2316034 2418994 2568066 2694049 2839835 2910235 2984230 3196037 3446525 3785130
17768C785130N38186O56860O59596M99224L96584M34880O22028R84091J518599
$$ 3785130 4323316 4980176 5639772 6138996 6535580 6970460 7592488 8576579 10095178
17759A0095178K203077L027375M606824O998358Q169809O319389N067300N615786
$$ 10095178 12298255 15325630 19932454 26930812 35100621 41420010 46487310 52103096
17751E2103096M597897J395045q97637l80636L853559J2765297K5236113L6012191
$$ 52103096 56700993 58096038 57198401 56817765 60671324 73436621 98672734 134684925
17743A34684925L3173815O550779k0934688k3743305n422679K0259246N2249413
$$ 134684925 167858740 174409519 153474831 129731526 124308847 144568093 196817506
17736A96817506Q1429445P7660633M2983581P758719j4335182l3368034n2711847
$$ 196817506 278246951 355907584 398891165 406649884 392314702 358946668 306234821
17729C06234821o3417779n8570131m4404860k9552549j6953666n808050M862450
$$ 306234821 242817042 184246911 139842051 110289502 93335836 87527786 92390236
17722I2390236J3341978J3539648M752763o029569j4136283j8111510j7718568
$$ 92390236 105732214 119271862 124024625 117995056 103858773 85747263 68028695
17715F8028695j4155705r656232n986621l687980k455202j834876j591464j173338
$$ 68028695 53872990 44216758 38230137 34542157 32086955 30252079 28660615 27487277
17707B7487277n02848R6544P82217J825360L917528P573878J1129186R344474
$$ 27487277 26984429 27080973 27863190 29688550 33606078 41179956 52309142 61653616
17699F1653616K532411n56239M717964J4812479K1137471J5922875N433318J661676
$$ 61653616 64186027 63629788 68347752 83160231 104297702 120220577 125653895 127315571
17691A27315571M453866J0449915K0769527K3133495M931792j2905848j3672046
$$ 127315571 131769437 142219352 162988879 186122374 191054166 178148318 164476272
17684A64476272j527125J6066397L4753004M3072826K9318192N578376j0015116
$$ 164476272 162949147 179015544 213768548 256841374 286159566 291737942 281722826
17677B81722826k2828890l8063067m8841093m7579818l6690284k3600182j4235823
$$ 281722826 258893936 220830869 171989776 124409958 87719674 64119492 49883669
17670D9883669q858752n641125l705381k233756n54706J470839K498986J424345
$$ 49883669 41024917 35383792 31678411 29444655 28889949 30360788 32859774 34284119
17662C4284119n3620o31993j420936k925382m173387m357460l610236k701010
$$ 34284119 34230499 33598506 32177570 29252188 25078801 20721341 17111105 14410095
17654A4410095k097236j650459j273351j145679j027045p67621n93200n36170
$$ 14410095 12312859 10662400 9389049 8243370 7216325 6448704 5855504 5319334
17646E319334m39582l69792l22801l00299k62227k19825j34091k04681k09343
$$ 5319334 4879752 4509960 4187159 3886860 3624633 3404808 3270717 3066036 2856693
17637B856693j81643j90829k11979j12369r1747j12205j46041j14103o1948p9373
$$ 2856693 2675050 2484221 2272242 2159873 2068126 1955921 1809880 1695777 1633829 1554456
17627A554456o3965m8678m1970m4579m7233n8207j13026r2143l4429j5174j2366
$$ 1554456 1490491 1441813 1399843 1355264 1308031 1249824 1136798 1044655 1010226 995052 982686
17616I82686m4771q7058r0898j3647l4161q4891L512K6249K988K1399O215j9881
$$ 982686 937915 850857 759959 746312 712151 627260 630772 657021 660009 681408 687623 667742
17604F67742l8906K7546N8925P0226K8582J5197l2150l5968l404o0791o1017K6286
$$ 667742 628836 656382 715307 785533 814115 829312 797162 761194 757790 696999 635982 662268
17592F62268K7520k4000q7692n7713N0547N5260J7429Q358j2460m7256o5214j7248
$$ 662268 689788 665788 578096 520383 570930 626190 643619 651977 639517 592261 527047 509799
17580E09799K0231m885l5105P390r442j1080l166L0920j6771n6923k4298L3284
$$ 509799 530030 525145 490040 497430 487988 476908 473742 504662 487891 430968 406670 439954
17568D39954J4868k4592n4197n2635k8644K0100k323J7082k6749l822K2093L21
$$ 439954 454822 430230 376033 323398 294754 314854 312531 329613 302864 299042 321135 321456
17556C21456j4995K3220M1420j796j2037q292K4707J0067j0353l5516N3642Q6479
$$ 321456 306461 329681 371101 369305 357268 348976 373683 383750 373397 337881 391523 478002
17544D78002R137n5057l0119m8037m9263l6945J832j4036M4720j9186m1281j1492
$$ 478002 487139 432082 401963 353926 304663 267718 269550 255514 300234 281048 239767 228275
17532B28275j930K2049l3859m889j5457j4613J5733M326J5526j7511n4906J9366
$$ 228275 226345 248394 214535 209646 194189 179576 195309 199635 215161 197650 142744 162110
17520A62110O0603k212L7883M4730M9138j0044m6438k6005J0643m8678M3347K9810
$$ 162110 222713 220501 258384 303114 352252 342208 295770 269765 280408 231730 275077 304887
17508C04887n968j7946J6683K0243l2019m5410K0231J5113K3248q386N879J3011
$$ 304887 298919 280973 297656 317899 285880 240470 260701 275814 299062 290676 296555 309566
17496C09566j9064j2660m9049l7298k8486L9645P2614j5099m2988K110m4719k9829
$$ 309566 290502 277842 228793 191495 163009 202654 275268 260169 217181 219291 174572 144743
17484A44743J8005P68J7534K698N8423L7407l3073m7700k8214K122r008n9207
$$ 144743 162748 163516 181050 183748 242171 279578 246505 198805 170591 172713 163705 104498
17472A04498j7025N4180k14J0834K0075r443J063J7891m619m5426j1187J5168
$$ 104498 87473 141653 141439 152273 172348 162905 163968 181859 177240 131814 120627 135795
17460A35795J4960K8048q068J9980m1302j4487L8258l2389K4222K6210N0782J954
$$ 135795 150755 178803 170735 190715 149413 134926 173184 140795 165017 191227 242009 243963
17448B43963K14m340K159P0536R1132J38086J04919j6400j94835j18627o7288
$$ 243963 244177 239837 241996 312532 403664 541750 646669 630269 435434 316807 249519
17437B49519l3167k1982k6104l203j6003j0730K067N0261M9485l8386q6846m8200
$$ 249519 216352 194370 168266 165063 149060 138330 140397 190658 240143 201757 114911 66711
17425F6711j9488L758L2319J567L05K2030M3842M7876L6737L340m244N250Q910
$$ 66711 47223 50981 83300 84867 85172 107202 151044 198920 235657 238997 234753 240003 248913
17412B48913L2988L3642n0303k8319L3437M0209P9678J18711m911m8232p2389
$$ 248913 281901 315543 265240 236921 270358 310567 390245 508956 504045 455813 383424
17401C83424j10191m1060J4847L9203j1508q9164j6954N392o105m3039k0299o307
$$ 383424 273233 232173 247020 286223 274715 185551 168597 173989 167884 124845 104546 98239
17389I8239m639n14M0769j6758l7884r293p463J7733L1160j471k7521k9192M0229
$$ 98239 93600 93086 133855 117097 79213 69920 62457 80190 111350 109879 82358 53166 93395
17376I3395K3892q69k5909k7158j6338M5966p114L1813K6193Q2061J08230M780
$$ 93395 117287 116418 90509 63351 47013 92979 85865 117678 143871 225932 334162 338942
17364C38942k1803j0279L04L4381R7815Q0409J38856N0090j62661j04257l7195
$$ 338942 317139 306860 307164 341545 439360 519769 658625 708715 546054 441797 404602
17353D04602m4354L7793k49o0063k9298m2117l6111m5440J710Q379o580o3738
$$ 404602 360248 398041 397792 337729 308431 266314 230203 184763 186473 194852 188272 124534
17341A24534j7326L614j1729l4553J6447l01Q56l0163l0303j0561p297J6205l342
$$ 124534 107208 110822 99093 64540 80987 80686 81542 51379 21076 10515 3218 19423 16081
17328A6081L5149L7098J8706M3548L5067k6593L568M5424K7026k0218p299K4496
$$ 16081 51230 88328 107034 150582 185649 159056 162624 208048 235074 214856 207557 232053
17316B32053k6285j7291M0744O1065P4309L8575k6128q1836o9149m8071N196L1506
$$ 232053 205768 188477 229221 290286 364595 403170 377042 295206 226057 177986 183182 214688
17304B14688j6824K062l24k2379m9502k1447m5906k9275J0763M0717j1600k1877
$$ 214688 197864 199926 199602 177223 127721 106274 60368 31093 41856 82573 70973 49096
17292D9096n2531k7239J0227K6374m1766l1985j7683q971L8975M3614O225K9606
$$ 49096 -3435 -30674 -20447 5927 -35839 -67824 -85507 -94478 -55503 -11889 -5664 23942
17280B3942O2489J3403J0938k2790k9914L3967j4502o3839k9240P5820M137L373
$$ 23942 86431 99834 110772 87982 58068 92035 77533 13694 -15546 60274 64411 67784
17268F7784L1157l8300j3145J3893N872r887k8040n7505J3832M0273L5571M1611
$$ 67784 98941 60641 47496 61389 67261 57374 29334 -28171 -14339 25934 61505 103116
17256A03116J3368k4073K923j0000n7952o87K6066k2559M4375M6172K5339M3598
$$ 103116 116484 92411 95334 85334 27382 26695 52761 30202 74577 120749 146088 189686
17244A89686K931R3760J10996P9048N2915M8335j613R6963Q655l454L515P5917
$$ 189686 192617 286377 397373 476421 529336 577671 576058 673021 681676 678222 681737 757654
17232G57654O1643O4710R6970J08326L3276L3468J0176J2396J08734N5987j07039
$$ 757654 819297 884007 980977 1089303 1122579 1156047 1166223 1178619 1287353 1343340 1236301
17221A236301j99109j69347k7443Q4388J49364O3135j2535o7861j23160j08564
$$ 1236301 1037192 867845 840402 924790 1074154 1137289 1124754 1056893 933733 825169
17211H25169j38962q6213j08341n8757m7623j9068L9780M1399l7924p1464l7896
$$ 825169 686207 599994 491653 432896 385273 366205 405985 447384 409460 337996 300100
17200C00100J6054p490q935O55m9185m0741m8205K3606K3907N9279J16223J03761
$$ 300100 316154 308664 299729 300384 251199 210458 162253 185859 209766 269045 385268 489029
17188D89029M4876J5103M6300J00029L0668J8836R705N0994J00390R5598L2450
$$ 489029 533905 549008 595308 695337 726005 744841 754546 805540 905930 1001528 1033978
17177A033978K0350j5739o329j7315l3103m2788k7715m4578n1197j36396n6146
$$ 1033978 1054328 1038589 1032260 1014945 981842 939054 911339 866761 815564 679168 623022
17166F23022n0055j7379l5383L8381R5509J08551N7655J4104l0714j3125n5061
$$ 623022 572967 555588 520205 558586 654095 762646 820301 834405 803691 790566 735505
17155G35505p0984m6574r3278q5505j05046o7602k6305m4120m1952m8322n2592
$$ 735505 664521 617947 524669 439164 334118 266516 240211 196091 154139 105817 53225
17144E3225P590j3285k4908J0682N0083O140j3290j3333L7704L0871p008m7088
$$ 53225 60815 47530 22622 33304 83387 89527 76237 62904 100608 131479 124471 77383
17132G7383m2805L2815K9934n8542j2490P2173K8828k9620j1702k2329k9856N112
$$ 77383 34578 67393 97327 38785 26295 98468 127296 97676 85974 63645 33789 38901
17120C8901l7324O136K0982k8597m8185j5496N5061n879m072K6034l0576o182
$$ 38901 1577 7713 28695 98 -48087 -63583 -8522 -14401 -18473 7561 -23015 -29197
17108b9197J9902K6461N25n6071R682J3813M0801N8491l2516l1247J2814J3856
$$ -29197 -9295 17166 17691 -38380 -28698 -14885 25916 84407 51891 20644 33458 47314
17096D7314j682j5028m4606l251J4233M4433j6806J1292J092k4301r611J575J484
$$ 47314 45632 30604 -14002 -17253 -3020 41413 24607 35899 36991 12690 3079 4654 6138
17083F138m198l7779L1148j0137J2983k172j9841J3814N1406L5043O019k1628
$$ 6138 1940 -35839 -4691 -14828 -1845 -4017 -23858 -10044 41362 76405 82424 60796
17071F0796l9565j0124m109j2181J0849k1424J6228J0977M9219j7701j3195j7703
$$ 60796 21231 11107 6998 -5183 5666 -15758 470 11447 60666 42965 29770 12067
17059A2067J1578l899P161j0003k2811j7659K6811l976O637L2414J8314m2913
$$ 12067 23645 19746 26907 16904 -5907 -23566 3245 -731 5906 38320 56634 13721
17047A3721J2096L969l5223k7412N379j4741n915J8926J1557M1553l8594j6504
$$ 13721 25817 29786 -5437 -32849 -27470 -42211 -48126 -29200 -17643 23910 -14684 -31188
17035c1188j6822J4999J3327M0364P533k0045k1624K4146J1059J4553p186k1022
$$ -31188 -48010 -33011 -19684 20680 28213 8168 -13456 10690 21749 36302 29116 8094
17023H094l9516l4032p368J6206L5449N2493K9218l5225k4536J0560L0816m113
$$ 8094 -31422 -65454 -72822 -56616 -21167 31326 60544 25319 783 11343 42159 38046
17011C8046k7535k4415J7972O732J2701K1527M3604n21K012k8158k6789m00n3377
$$ 38046 10511 -13904 4068 10800 23501 45028 88632 88111 90123 61965 35176 34776 -18601
16998a8601k3141N1572K1943o591l3927k3041j1613J4630J0422j4552K4930J0917
$$ -18601 -41742 9830 31773 25182 -8745 -31786 -43399 -28769 -18347 -32899 -7969 2948
16986B948L6972L7135J4071j2257k5592m0380L6977j6756j9528O3458P739m2898
$$ 2948 39920 77055 91126 78869 53277 12897 49874 33118 13590 77048 84787 41889
16974D1889j7652n9922r64L0443K313J0891k1076M8098K3374j8778m6535J2250
$$ 41889 24237 -35685 -36649 -6206 -3893 6998 -14078 34020 57394 38616 -7919 4331
16962D331L2570Q447k2387m7630l8706q037Q0601O9685l8583p9594q021M0377
$$ 4331 36901 45348 22961 -24669 -63375 -71412 9189 78874 40291 -39303 -47324 -6947
16950f947r870O814M1245r289K9781k082n7963m9591j3139M1032P8033O1281k0024
$$ -6947 -16817 -10003 31242 21953 51734 49652 -8311 -57902 -71041 -30009 48024 109305 89281
16937H9281r3619o8859K7138M4564l9431j8860r01j0083M093K5915j7314O767
$$ 89281 -4338 -73197 -46059 -1495 -40926 -59786 -60687 -70770 -66677 -40762 -58076 -51309
16925e1309J6400L2049L9525p45K8033K7653m7895j6780n698J2478J5019m8616
$$ -51309 -34909 -2860 36665 35920 63953 91606 43711 26931 21233 33711 48730 114
16913A14k5057P6696k9317k2878N2168j4651J491l0094l8498j8474K1028J4952
$$ 114 -24943 51753 22436 -442 51726 37075 38566 8472 -30026 -48500 -27472 -12520
16901a2520j6543j5675N8072Q086K6132j5150k6996l2170n0346j8779K7645N3515
$$ -12520 -29063 -44738 13334 21420 47552 32402 5406 -26764 -77110 -95889 -68244 -14729
16889a4729K1853K5785K5652k3001K948J024l4679j6749m929J1971O133p2735
$$ -14729 7124 32909 58561 35560 38508 39532 4853 -11896 -16825 -4854 1279 -71456
16877g1456M3409P1873m8379L6444L3718j6262J8595J1591l7679m2407k1081p826
$$ -71456 -28047 43826 -4553 31891 65609 49347 67942 79533 41854 -553 -21634 -29460
16865b9460J5803l1952j3613Q517M4146l2419N388M4263M3445R745m3529l1734
$$ -29460 -13657 -45609 -59222 -50705 -6559 -38978 -33590 10673 54118 63863 20334 -11400
16853a1400L1333J6656j1902N5676K6337k9597j7056o8652q5945K0539J2010p449
$$ -11400 19933 36589 24687 80363 106700 77103 60047 -8605 -94550 -74011 -62001 -69450
16841f9450m756N2687P783q989J2168N2273k587J454L889k0269m9445l2769K1137
$$ -69450 -74206 -21519 -13736 -22725 -10557 41716 39129 40583 44472 24203 -25242 -58011 -36874
16828c6874O828K7136P6743L8264q361k1769j5843l5000o0162j8986P508K4371
$$ -36874 -30046 -2910 73833 112097 103736 81967 66124 31124 -29038 -48024 -40516 -16145
16816a6145J4143Q611L1819p831n971K0803m5035k8640j1094k8268k6097J5800
$$ -16145 -2002 6609 38428 30597 24626 45429 394 -28246 -39340 -67608 -93705 -77905
16804g7905K4783N9455Q177o3653n4423L6097K0408M9307n427p748p12l6557M7006
$$ -77905 -53122 6333 14510 -49143 -103566 -67469 -47061 2246 -3181 -10929 -11641 -48198 -1192
16791a192L7726J1786j3307k2375K5866q20J6599l1672n0158J0860M7046P622
$$ -1192 36534 48320 35013 12638 38504 37684 54283 22611 -27547 -16687 30359 37981
16779C7981o8m5065m3634P591K1156R379Q041J5822j2031l8061J2910O2834o989
$$ 37981 37913 -7152 -50786 -43195 -22039 -12660 -4619 11203 -828 -38889 -25979 36855 29866
16766B9866j1129K1140q031J0429k3704m3152m6429J9690N7620P9636j21j3335
$$ 29866 18737 39877 31846 42275 18571 -24581 -71010 -51320 6300 85936 85815 72480
16754G2480k9661l969j0050n6580m5937K6549O9050r602j6622n517k0508O165
$$ 72480 42819 38850 28800 -27780 -73717 -47168 21882 12280 -4342 -9859 -30367 -24202
16742b4202J8488J2245j5637L1720K2035L2518l4984l8870k2963N219p106N394
$$ -24202 -5714 6531 -9106 22614 44649 77167 42183 3313 -19650 -14431 -21537 -16143
16730a6143K133k195q652K3363L0036O4994Q423j02093K299L7435q307l8232J0684
$$ -16143 -14010 -16205 -24857 -1494 28542 93536 101959 -134 2165 39600 31293 -6939 3745
16717C745J0082r433j262o156k7856P773m835l597K3847P8823l651q4185k4921
$$ 3745 13827 4394 3132 -3024 -30880 -23107 -27942 -31539 -7692 71131 67480 -16705 -41626
16704d1626k5173L2792K5450l1493M9793j4476m315P099l1609k9872K115J3086
$$ -41626 -66799 -34007 -8557 -40050 9743 -4733 -9048 -1949 -33558 -63430 -61315 -48229
16692d8229k9246J0956L6326J8594m0325q456J3407k3282L3089k3277l0884J8895
$$ -48229 -77475 -66519 -30193 -11599 -51924 -60380 -46973 -70255 -37166 -60443 -91327 -72432
16680g2432O5262N1612K2094k089N0396j1362n9388m6786J4159R671l718K0715
$$ -72432 -7170 44442 66536 64447 114843 103481 44093 -2693 11466 21137 17419 38134
16668C8134l2259m6938R566k1063N607K2492J8585j237k3577q544K3550K909k1599
$$ 38134 5875 -41063 -31497 -52560 -46953 -24461 -5876 -7113 -30690 -39234 -15684 -12775 -34374
16655c4374j3194K0873k2404j3159l3992k2754O860M2404Q1468K7110L1836j6535
$$ -34374 -47568 -26695 -49099 -62258 -96250 -119004 -112144 -69740 11728 38838 70674 54139
16643E4139k6450k7151M712M1391M0930j6457m5100o163J2929J4177l9822K9704
$$ 54139 27689 538 5250 46641 87571 71114 26014 19851 32780 46957 7135 36839
16631C6839M3159P177m349J4969J8472k2261m3210k4715K5604L2123j4205l8543
$$ 36839 79998 87175 82826 97795 116267 94006 50796 26081 51685 83808 69603 31060
16619C1060j5807k6297L8490N0474k447q5196l4044J7321K1379K2482L6419j8943
$$ 31060 15253 -11044 27446 77920 75473 -9723 -43767 -26446 -5067 17415 53834 34891
16607C4891o2826m538K5726K1365n762J6506k72k3069j2670j1908j6664m6312
$$ 34891 -27935 -32473 -6747 14618 8856 25362 25090 2021 -10649 -22557 -39221 -85533
16595h5533o5785L7304J6724P5264M2069k5624l8110j2772k3717M8814J9604k94
$$ -85533 -151318 -114014 -97290 -22026 20043 -5581 -43691 -56463 -80180 -31366 -11762 -12056
16583a2056K2106o6223j5295L7282K1162j4922M556P981K6691j1547J7324m808
$$ -12056 10050 -56173 -71468 -34186 -13024 -27946 -23390 -15409 11282 -265 17059 12251
16571A2251n2675l6180M497L4308j8242L3510p039j1934K0201L2499L2136l1536
$$ 12251 -40424 -76604 -72107 -37799 -56041 -22531 -29570 -41504 -21303 11196 43332 11796
16559A1796L0537j2661L65J0104o427j2432o548L8665K2215O871l3974j7631l3260
$$ 11796 42333 29672 30037 40141 33714 21282 14734 53399 75614 82485 48511 30880 -2380
16546b380K8737k1408m5480M0337K5227J2203n0317m3489m939o2974M3617K2137
$$ -2380 26357 4949 -40531 -194 25033 37236 -13081 -56570 -61509 -124483 -80866 -58729
16534e8729m3603n0517q864N3313J5759M1064O555O176r713j4766J0707j739K294
$$ -58729 -102332 -152849 -161713 -108400 -92641 -51577 -45022 -38846 -48559 -63325 -52618 -54357 -52063
16521e2063P4824Q947p1041j0813M9171M828j5862k6125m3670Q098R056L3202
$$ -52063 22761 31708 -39333 -50146 -975 3853 -12009 -38134 -81804 -73706 -64650 -31448
16509c1448P843j1339L8497q210l2004J1932p31K2381J9232M1062j3647K019l6902
$$ -31448 -23605 -34944 3553 -4657 -36661 -24729 -25460 -3079 16153 57215 43568 45587 8685
16496H685n7664j411O361J853L8228J3740k5472m2674P15Q180K2769J1016N639
$$ 8685 -48979 -50390 -44029 -42176 -3948 9792 -15680 -58354 -57639 -49459 -26690 -15674 -10035
16483a0035M6699L914o0230P701L0665M025m7120l474M267P93l4693J6252M1831
$$ -10035 36664 40578 -19652 -11951 18714 22739 -24381 -27855 -23588 -22795 -57488 -41236 595
16470E95K5083j4446m7844J510K5081J8538k3141o51N491l2718l019j6449K7754
$$ 595 25678 11232 -36612 -35102 -10021 8517 -14624 -15275 -9784 -42502 -45521 -61970 -34216
16457c4216N9504Q480j6215o491M584n660M8853J7944L491k1701l4992n0858m1091
$$ -34216 25288 33768 17553 11062 15646 9986 58839 76783 80274 58573 23581 -27277 -68368
16444f8368L9120P641l0446m5852l5195M2062j3213N294M8805j9657k3685K3866
$$ -68368 -29248 -21607 -52053 -97905 -133100 -91038 -104251 -98957 -50152 -69809 -93494 -69628
16432f9628K6900K0195R881J4468R272j2003L5447L057J3807m9209k1001m062
$$ -69628 -42728 -22533 -12652 1816 11088 -915 34532 37589 51396 2187 -18814 -22876
16420b2876l7000k4674N0423L4099K789k0620l1076R210q741J3389j0528K4985
$$ -22876 -59876 -84550 -34127 -28 2761 -17859 -48935 -39725 -48466 -35077 -45605 -20620
16408b0620N567j2062n6846j0829L473M4785N8075l3555l4674K2194l3888O4622
$$ -20620 -15053 -27115 -83961 -94790 -91317 -46532 11543 -22012 -56686 -34492 -68380 -3758
16396c758N4291j3659K0033L6010k9602k0341J3555k0768l521q813M4063L773
$$ -3758 50533 36874 56907 92917 63315 42974 56529 35761 32240 23427 67490 71263
16384G1263m602l1739k3802j899L2779K590J8910k7797l9946L867l3624l3964
$$ 71263 66661 34922 11120 9221 42000 44590 63500 35703 -4243 -376 -34000 -67964
16372f7964L3786M6848j5680k8057m0736l2273N2365N0874K8843J9187m6037k6517
$$ -67964 -34178 12670 -3010 -31067 -71803 -104076 -51711 -837 28006 47193 1156 -25361
16360b5361K0783M6094k2840k6655L5920O3627L7856k3399m6214o1046Q979K582
$$ -25361 -4578 41516 18676 -7979 27941 91568 129424 106025 59811 -1235 7744 10326
16348A0326j9498J8397j9993j7080N7971J0757p231j5801k9855k5595j7092q887
$$ 10326 -9172 9225 -10768 -27848 30123 40880 33649 17848 -12007 -37602 -54694 -63581
16336f3581J5725N0514j630n3299m9138K4351P0288J7564R988j2896k9813p919
$$ -63581 -47856 2658 1028 -52271 -101409 -77058 -6770 10794 20782 7886 -21927 -29846
16324b9846p695m1126k931N7873K7904K9804n961m2332m6715O606N7807K3166
$$ -29846 -37541 -78667 -81598 -23725 4179 33983 28022 -14310 -61025 -54419 3388 26554
16312B6554O225r060k4878J3809l009m4731J3658J209m4200Q121M4117M6219M9524
$$ 26554 32779 23719 -1159 12650 9641 -35090 -21432 -20223 -64423 -56302 -12185 34034 83558
16299H3558k2206l2243J397P942j0003P447k3198L3369J2001j8358k9524k646
$$ 83558 61352 29109 30506 38448 28445 35892 12694 46063 58064 39706 10182 7536
16287G536l2429l9719N985M3076K2361J0523J1345J6908l9484m8545N4139L0554
$$ 7536 -24893 -64612 -58627 -15551 6810 17333 28678 45586 6102 -42443 11696 42250
16275D2250M6335k334k6598n1030l8124l9354J0835N29P480m535k8746J1370K7575
$$ 42250 88585 86251 59653 8623 -29501 -68855 -58020 -57491 -50011 -54546 -83292 -71922 -44347
16262d4347M1690J4388l6400j5478L8166J2484p595m2567j8771j3403k2013N8491
$$ -44347 -2657 11731 -24669 -40147 -1981 10503 2908 -39659 -58430 -71833 -93846 -35355
16250c5355L0197k3083o327k5791k0236j4050K3263L4442J4029N621p048m7103
$$ -35355 -5158 -28241 -34568 -60359 -80595 -94645 -71382 -36940 -22911 -17290 -24338 -71441
16238g1441K8181M4539P641j9203j3665k1386R79O376j0440j3036j6629P6147
$$ -71441 -43260 1279 8920 -10283 -23948 -45334 -44355 -37979 -48419 -61455 -78084 -1937
16226a937L6149l769j8668J2707k1148k9062K41j2201j0079J004J0547L7534l3520
$$ -1937 34212 30443 11775 24482 3334 -25728 -25487 -37688 -47767 -46763 -36216 1318 -32202
16213c2202j2229J3203K3414m45K4094K5302L0607J9946J0297j4493n1018j6265
$$ -32202 -44431 -31228 -7814 -8259 15835 41137 71744 91690 101987 87494 36476 20211
16201B0211m1231J65J087j3850m4628L5280L1872L6607L6659m4713j5268L9155
$$ 20211 -21020 -20855 -19768 -33618 -78246 -42966 -11094 25513 62172 17459 2191 41346
16189D1346J0003l1053j6761L5004K1614j1248l2955o708m6447L3442L4684o982
$$ 41346 51349 20296 3535 38539 60153 48905 15950 9242 -37205 -3763 30921 23939
16177B3939j8925k9877j3945K9772K0587l8957n4057K4728n922K3416J2275J3952
$$ 23939 5014 -24863 -38808 -9036 11551 -27406 -81463 -56735 -62657 -39241 -26966 -13014
16165a3014P044K7897k2358Q035J730o193J8336R996l7558K5132l00R427j7825
$$ -13014 -5970 21927 -431 7604 9334 3141 21477 31473 -6085 19047 18747 28174 10349
16152A0349M2521K5450p870k0454m3553k2975K380l753J7141m228M555k3830j8371
$$ 10349 52870 78320 70450 49996 6443 -16532 -14152 -17905 -764 -4992 -437 -24267 -42638
16139d2638n589L1575K2755K1041m043k616K3276m2162j1990l0356j8198K4044
$$ -42638 -48227 -16652 6103 27144 23101 20485 43761 1599 -10391 -40747 -58945 -34901
16127c4901Q34J9708L2798k4508k0269l1931J5916K2537l1944J1883J4512Q703
$$ -34901 -34067 -14359 18439 -6069 -26338 -58269 -42353 -19816 -51760 -39877 -25365 -16662
16115a6662K3714K0504J1123q1607M3808N2090K5914l04k449k3978K280J1098
$$ -16662 7052 27556 38679 -42928 880 52970 78884 78580 76131 52153 54433 65531
16103F5531m99p137N4866l5156l2021L278m5803m628J1003j4552m78K1254j4767
$$ 65531 65032 57895 112761 77605 45584 48862 3059 -1569 9434 -5118 -5596 15658 891
16090H91o8048j6660J7367M9292J146K7835m806o468J1685n37j400l4781j2871
$$ 891 -67157 -83817 -66450 -17158 -16012 11823 7017 549 12234 11697 10297 -24484 -37355
16077c7355K6889L6451L066l6366k8461N639J8464P0125P4475j3952m9936l9197
$$ -37355 -10466 25985 29051 -7315 -35776 -30137 -11673 58452 132927 118975 69039 29842
16065B9842k0152J0935k4009k7584r006J5980L5516M6644l548j7612L6850K5979
$$ 29842 9690 20625 -3384 -30968 -39974 -23994 11522 58166 54618 37006 73856 99835
16053I9835o072k2480q5537k2792K4883K3788J8291l6871m9283j4996k715K461
$$ 99835 93763 71283 -14254 -37046 -12163 11625 29916 -6955 -56238 -71234 -73949 -71488
16041g1488l0573j801M6380J8384K951m482K2956m3263O47L7163l177J2790J05
$$ -71488 -102061 -103862 -57482 -39098 -36147 -40629 -17673 -60936 -60289 -23126 -26303 -13513 -13408
16028a3408K9193m370m4056L272K7305M9856J507n2524J2298L4467m7442j7702
$$ -13408 15785 11415 -32641 -29369 -2064 47792 49299 -3225 9073 43540 -3902 -21604
16016b1604J4132K1214j675j4381k1162l1745K9620L5867l9584o136N722M6150
$$ -21604 -7472 13742 12067 -2314 -23476 -55221 -25601 10266 -29318 -35454 -29732 16418
16004A6418j7264m0974n300j7935J4507M1199l2972q742J7645m9795l3855R696
$$ 16418 -846 -41820 -47120 -65055 -50548 -9349 -42321 -51063 -33418 -83213 -117068 -107372
15992a07372J3296J9587L8824k6818n0493N6419M0570K4645J658j3727P246L0830
$$ -107372 -94076 -74489 -35665 -62483 -112976 -56557 -15987 8658 10316 -3411 3835 34665
15980C4665J5577L9161j2743L6403J5557o9772l3208O410n9607o1725J1553K5726
$$ 34665 50242 89403 76660 113063 128620 58848 25640 32050 -27557 -89282 -77729 -52003
15968e2003O5482K2658j551l7519k0851M092m54n208j3814J7040L1757l0088j6801
$$ -52003 13479 36137 34586 -2933 -23784 -19692 -20146 -25354 -39168 -22128 9629 -20459 -37260
15955c7260Q7860L9932q0391q308l0539K0444L8391j5494l8650J8717K8584n3654
$$ -37260 50600 90532 10141 1833 -28706 -8262 30129 14635 -24015 -5298 23286 -30368
15943c0368J0938M6018o252l6081K9369J6234M79n3731j2606J6773r642j0005
$$ -30368 -19430 26588 20336 -15745 13624 29858 30337 -23394 -36000 -19227 -28869 -38874
15931c8874j215J528K5141J8636q460k1291O695L3404j7396L1145M4905k0749
$$ -38874 -40089 -38561 -13420 5216 -3244 -24535 -17840 15564 -1832 29313 74218 53469
15919E3469k4175k946j2414K8115K8686l1363o3739j9778N728J5480Q186O780
$$ 53469 29294 26348 13934 42049 70735 39372 -24367 -44145 -38417 -22937 -14751 -7971
15907g971O290L6656j5352m1764M63L6280j1957N0319m1706p834J8736k6030j3251
$$ -7971 -1681 34975 19623 -22141 -21678 14602 2645 52964 11258 3424 22160 -3870 -17121
15894a7121j632k1956m0307J3431L4635K1768l9418j9200k6119k4802L3219P1901
$$ -17121 -18753 -40709 -81016 -67585 -32950 -11182 -50600 -69800 -95919 -120721 -87502 -15601
15882a5601Q9088K5295M61m3330o7295p908K0107j99j6082J0042J5897O912j7625
$$ -15601 73487 98782 99243 55913 -11382 -19290 817 618 -15464 -5422 10475 17387 -238
15869b38J008l7926j3516j7708J9913j465J1631O8385K3069k0317K1003m2519
$$ -238 770 -37156 -50672 -68380 -48467 -49932 -38301 30084 53153 32836 53839 11320
15857A1320p0424N961K5353q910L2482O997K0489J9857l7319m2399j9731q824
$$ 11320 -59104 -53143 -27790 -36700 -4218 2779 23268 43125 5806 -36593 -56324 -65148
15845f5148L5390k2230M170K4139k1185o395J4137L8750Q047m7923L1073K1836
$$ -65148 -29758 -51988 -47818 -23679 -44864 -51259 -37122 1628 9675 -38248 -7175 14661
15833A4661k5943n5244k3840k336k6181J38M9606N4692M026M914L4622K6761k2311
$$ 14661 -11282 -66526 -90366 -92702 -118883 -118745 -69139 -14447 -10421 -5507 29115 55876 33565
15820C3565J227K3608m4239m5087q937Q544l9304P063J9384K1031O917k9186J6374
$$ 33565 34792 58400 14161 -30926 -39863 -31319 -70623 -63560 -44176 -23145 -16228 -45414 -29040
15807b9040p577j0870k1477O704Q2871O2832m493n0188l2554n5571r5814l0059
$$ -29040 -36617 -47487 -68964 -62260 20611 83443 78950 28762 -3792 -59363 -155177 -185236
15795a85236P1956M0403j4618N7308L8910j3737l998J5389l1552j6837j0289K2426
$$ -185236 -113280 -72877 -87495 -30187 8723 -5014 -9012 6377 -25175 -42012 -52301 -29875
15783b9875L1057K6091R239q6004l467p820K2415L5824k414k7040m2188j8288
$$ -29875 1182 27273 36512 -49492 -52959 -60779 -38364 -2540 -4954 -31994 -74182 -92470
15771i2470K1695M0442J0387N2654j0858j2460M852J2937l9322n2333L5649J1570
$$ -92470 -70775 -30333 -19946 32708 21850 9390 14242 27179 -12143 -64476 -28827 -17257
15759a7257r930o173k7155K457j7142J828q22L4105J5896M47k4883K7974L582
$$ -17257 -27187 -33360 -60515 -58058 -75200 -73372 -74194 -40089 -24193 -23746 -48629 -20655 -17073
15746a7073M7705o254j6114l5809k4921K2017J3579q613j5751J1134M4279k7455
$$ -17073 30632 24378 8264 -27545 -52466 -30449 -16870 -25483 -41234 -30100 14179 -13276
15734a3276o017k7741k1180L4622J240j0760L9618k59j3720k4894L259m377J4217
$$ -13276 -19293 -47034 -68214 -33592 -32352 -43112 -3494 -3753 -17473 -42367 -39108 -43485 -29268
15721b9268L6775j3051j7943k2767k168M9607L0778l0650J4620k704k4570m2161
$$ -29268 7507 -5544 -23487 -46254 -48422 1185 31963 1313 15933 13229 -11341 -53502
15709e3502R194o4K5246p946M2125J4641m7115R463o562K4352M871J0571K8459
$$ -53502 -44308 -44372 -19126 -27072 15053 29694 -17421 -7958 -14520 9832 14703 25274 53733
15696E3733n0670m4710j0396L2132L2088m861l4909M7126K2003j0474k6629k097
$$ 53733 3063 -41647 -52043 -19911 12177 7316 -27593 19533 41536 31062 4433 2336
15684B336j1229l5892K8743Q2009j4586m6937j8528k0403L826n819N781M8960
$$ 2336 -8893 -44785 -16042 65967 51381 4444 -14084 -34487 -30661 -36480 -30699 18261
15672A8261K967J5130Q16K4596M576K208j7345j2013J3644m361m5498n9099N0995
$$ 18261 21228 36358 37174 61770 66346 68554 51209 39196 52840 48479 2981 -56118 -5123
15659e123M407l2709L1176K715J928k2448N8041M3870n146k7169N057n863k0064
$$ -5123 -716 -33425 -2249 466 2394 -20054 37987 81857 76711 49542 54599 48736 28672
15646B8672l4592J6249J6350k1659j1935Q422L0297j1978l4352J7076L5773l8995
$$ 28672 -5920 10329 26679 5020 -6915 1507 31804 19826 -14526 2550 38323 -672
15634f72l2218l190M5644M9546k3392L6334l2165Q575N4377M5964j9743O598o1115
$$ -672 -32890 -36080 9564 59110 35718 72052 39887 48462 102839 148803 129060 135658 74543
15621G4543n9597L1710M255j7292j7713o234R635o809k4480m1032j6525K2900
$$ 74543 14946 46656 50911 33619 15906 9672 19307 12498 -11982 -53014 -69539 -46639
15609d6639N2608N591j1442K3840P8800j4877r1441n0851k8931j4410j2726L8836
$$ -46639 5969 11560 118 23958 102758 87881 -3560 -54411 -83342 -97752 -110478 -71642
15597g1642P0288l0680j4572L1181K2186M1915l4254P96p749J7287q786K1130
$$ -71642 -1354 -32034 -46606 -15425 6761 48676 14422 15218 7469 24756 15970 37100
15585C7100M2216n6244m7702J3393O261L6603L6889j8613J3785M645n7224m5023
$$ 37100 79316 23072 -24630 -11237 -4976 31627 68516 49903 63688 68333 11109 -33914
15573c3914J1926O5146l3576l4418K3119n608j2987Q232J6105L594O4653J6542
$$ -33914 -21988 43158 9582 -24836 -1717 -7325 -20312 -12080 4025 7619 72272 88814
15561H8814n0082k0959J4833k9134m4650N024J7147N033J628n654j6750k5864
$$ 88814 38732 17773 32606 3472 -41178 -36154 -19007 -13974 -12346 -18000 -34750 -60614
15549f0614k5047M0973K5546M097m0177r548j6489j0336K2747l1272M864j7817
$$ -60614 -85661 -44688 -19142 -15045 -55222 -64770 -81259 -91595 -68848 -100120 -95256 -113073
15537a13073K6608Q174j6695k226j2489L5065P8528L2097J4857j1240m9237l4785
$$ -113073 -86465 -78291 -94986 -97212 -109701 -74636 3892 35989 50846 39606 -9631 -44416
15525d4416K2574M8793M0142n1981o6623P745J8031j2146L0384J8886L523j2507
$$ -44416 -21842 26951 67093 15112 -51511 -43766 -25735 -37881 -7497 11389 14912 2405
15513B405q613K937J8451J8163P634n4356j9469Q199N4744j9712l4316l7901l2440
$$ 2405 -6208 -3271 15180 33343 40977 -13379 -32848 -24649 30095 10383 -23933 -61834 -94274
15500i4274j2745J1373K0950L9299J6031P972M502J633J8858L9731N310R295j1128
$$ -94274 -107019 -95646 -74696 -35397 -19366 -11394 -6892 -5259 13599 53330 58640 67935 56807
15487E6807j5802r053m143n02k1427J3478M0240o1175o2306K1627K5694l420J9884
$$ 56807 41005 31952 27809 27307 5880 19358 59598 -1577 -63883 -42256 -16562 -19982 -98
15474i8L8718R545n3589p3743L1872M5558Q944m252j5389p437J0974k4968L3363
$$ -98 38620 48165 -5424 -79167 -47295 -1737 7207 2955 -12434 -19871 -8897 -33865 -502
15461e02L3157P200m442K9962K5738l5503q7064l0500N8079L8952k9711n2775
$$ -502 32655 39855 35413 65375 91113 55610 -31454 -61954 -3875 35077 5366 -47409
15449d7409k7654M0680j446j4027N1787M748m9297J5398o767k1618L1831k5734
$$ -47409 -75063 -34383 -35829 -49856 1931 6679 -42618 -27220 -33987 -55605 -23774 -49508
15437d9508j6448J3306N2562K7752K4537N1951l2316k0195k7936m0644j6609l4357
$$ -49508 -65956 -52650 -88 27664 52201 104152 71836 51641 23705 -16939 -33548 -67905
15425f7905K093J8280l659k1808K7089R0491K2086n2336k7697M53M0822j0404
$$ -67905 -65812 -47532 -51191 -72999 -45910 44581 66667 14331 -13366 -12913 27909 17505
15413A7505k4244L0103k3657l8123N2610K4382j5741k5061J1423K0685j0915K6616
$$ 17505 -6739 23364 -293 -38416 14194 38576 22835 -2226 9197 29882 18967 45583
15401D5583N594p1887J1054J9872r501M2527r41l5445Q493L3643j1879k0334k8058
$$ 45583 51177 -20710 -9656 10216 715 43242 42301 6856 15349 48992 37113 16779 -11279
15388a1279n0268N462L5087J307o067P9511O1630k4781O58k6612n0860O755m5686
$$ -11279 -61547 -56085 -20998 -19691 -25758 53753 115383 90602 91260 64648 13788 20543 -25143
15375b5143j1236q653j1998j3694O6243M9929J965J4244M422j4142n1473j4203
$$ -25143 -36379 -45032 -57030 -70724 -4481 45448 47413 61657 66079 51937 464 -13739
15363a3739J0147r534M722j2844O67l2462J4035L9134K025j3537q465O450n2478
$$ -13739 -3592 -13126 -8404 -21248 -20581 -53043 -39008 126 2151 -11386 -19851 -13401 -65879
15350f5879k8311l2021j8885P0514O7515J6640q444P031j5944o540J4212L67K2915
$$ -65879 -94190 -126211 -145096 -74582 -7067 9573 1129 8160 -7784 -14324 -112 255 23170
15337B3170k1568m0534j4983j4829m3291J644L8208L8835K5246O3969J0519m2779
$$ 23170 1602 -38932 -53915 -68744 -112035 -110391 -72183 -33348 -8102 55867 66386 23607
15325B3607q019L8772K2517k2596l6843j2269O144j577J7805K741m3608p789K2481
$$ 23607 15588 54360 76877 54281 17438 5169 11313 9736 27541 30282 -13326 -21115 1366
15312A366L8020q412R422m4109m7226j5107p724O3986j8951m2268J9451J9730
$$ 1366 39386 30974 40396 -3713 -50939 -66046 -73770 -9784 -28735 -71003 -51552 -31822
15300c1822M1763m145k9208o3796j6598N9439J04361N8927j8360m6895l3313J9682
$$ -31822 9941 5796 -23412 -87208 -103806 -44367 59994 118921 100561 53666 20353 40035
15288D0035q768k6730k1203l1081N332O4273k8881l2208k3897K1251K4812O685
$$ 40035 31267 4537 -16666 -47747 -42415 21858 -7023 -39231 -63128 -41877 -17065 -10380
15276a0380k3742j6864K1756K2255N570P632K601j8954r839Q873K9924J1433K1725
$$ -10380 -34122 -50986 -29230 -6975 -1405 6227 8828 -10126 -19965 -11092 18832 30265 51990
15263E1990L5847r102r708j3316k93p0764o9986L9483J7174l306J8368j4605K8234
$$ 51990 87837 78735 69027 55711 55418 -15346 -85332 -45849 -28675 -31981 -13613 -28218 16
15250A6K0657M8409p423L8303J7402k7856n0788j6800K2796n8712l7315J4326
$$ 16 20673 69082 61659 99962 117364 89508 38720 21920 44716 -13996 -51311 -36985
15238c6985k974K7716K5311M0960k8349j5861J6357J781n95j4489k4600K6700
$$ -36985 -39959 -12243 13068 54028 25679 9818 26175 27956 27361 12872 -11728 14972
15226A4972l9812q409M292J6952k0754N447L7314p254q307L136k4171n478k0249
$$ 14972 -24840 -33249 -28957 -12005 -32759 -27312 10002 2748 -5559 -2423 -26594 -32072 -52321
15213e2321N252J2421j9027J1228L4936O23o267o909J0775m1063L0210M8705R439
$$ -52321 -47069 -34648 -53675 -42447 -7511 -6888 -13155 -20064 -9289 -50352 -20142 28563 38002
15200C8002p8799p158O5116L8960K6859o6028m3407q372K6271L1379J6780j725
$$ 38002 -40797 -47955 17161 56121 82980 16952 -26455 -34827 -8556 22823 39603 37878
15188C7878k4713j8857J0967O147K6518o379l4768J559j604J2247M640J8377J716
$$ 37878 13165 -5692 5275 11422 37940 31561 -3207 -1648 -3252 8995 13635 32012 33728
15175C3728R606k1154m3545M8209o277j6539j7843L3663J1621K3003m262m347
$$ 33728 43334 22180 -21365 26844 20567 4028 -13815 19848 31469 54472 50210 45863
15163D5863j9698J4460l5695j7774M1243L0084j2976P09M909m8691m0470Q85j3392
$$ 45863 26165 40625 4930 -12844 28399 58483 45507 46216 51125 2434 -38036 -37151 -50543
15150e0543N346J327P001L4043J5324K1766p122j356l6936K492j0798K8125L6635
$$ -50543 -45197 -43870 -36869 -2826 12498 34264 27142 25786 -11150 -8658 -19456 8669 45304
15137D5304K2645j1285k7549o191M787J8192p57J8789r36o9504M142l3958m527
$$ 45304 67949 56664 29115 22924 27711 45903 45146 63935 62999 -6505 -2363 -36321 -40848
15124d0848m2631K3558M4431L0669j515k5816l8922k7459j6581O356L7612O3556
$$ -40848 -83479 -59921 -15490 15179 13664 -12152 -51074 -78533 -95114 -88758 -51146 12410
15112A2410J3224q530k310M6389J4707P014l8593k8863K0216r474Q171j8697l1792
$$ 12410 25634 17104 14794 61183 75890 82904 44311 15448 35664 26190 34361 15664 -16128
15099a6128P409k518l0475m496J297K9495J2344j8065l4006j1657L8924M2243
$$ -16128 -8719 -11237 -41712 -46208 -44911 -15416 -3072 -21137 -55143 -66800 -27876 14367
15087A4367n079J7848k6927l3502j1686j3597O79M6967l701j3131r101j0933L6144
$$ 14367 9288 27136 209 -33293 -44979 -58576 -57897 -10930 -14631 -27762 -36863 -47796 -11652
15074a1652Q902n92L090O397j8090k1716J6080L937l8502r658k21O2424N0991
$$ -11652 -2750 -3342 -252 6145 -11945 -33661 -17581 -13644 -52146 -61804 -62025 399 51390
15061E1390q798k2382j2854j7512j1849j5021O0612M2704n4913j1833L39n4474
$$ 51390 42592 20210 7356 -10156 -22005 -37026 23586 66290 11377 -456 -117 -54591
15049e4591k6087N2383Q479K1235J9204o1956j1165K3408L750Q153J4385J3774
$$ -54591 -80678 -28295 -19816 1419 20623 -41333 -52498 -29090 -25340 -17187 -2802 10972
15037A0972J240j3954K3048l02M027J1036J9086k7160p3262j7535r135L2891L4753
$$ 10972 12212 -1742 21306 21004 25031 36067 55153 27993 -45269 -62804 -71939 -39048 -4295
15024d295J3152Q612J056m278l2787K1274k3820j8582N3447K8892L2326J8589
$$ -4295 8857 17469 18525 14247 -18540 2734 -21086 -39668 13779 42671 74997 93586
15012I3586l4405n3625j4276l5593n215N602J2339j0892m8793k8226M038K6154
$$ 93586 59181 5556 -8720 -44313 -49528 -43926 -31587 -42479 -91272 -119498 -115460 -89306
15000h9306P8906J5612M0384k1616O46l1762J0891j5648Q797j4334J7898J8148
$$ -89306 -10400 5212 45596 23980 24626 -7136 3755 -11893 -3096 -17430 468 18616
14988A8616l7964j5953N674j98N0664j5374l6158j5822r277K5239j0354k0154
$$ 18616 -19348 -35301 -29627 -29825 20839 5465 -30693 -46515 -55792 -30553 -40907 -61061
14976f1061O3476j8823j9294Q7926L4739k3063l0714k8057l2563L7411J4732o3930
$$ -61061 2415 -16408 -35702 52224 86963 63900 33186 5129 -27434 9977 24709 -39221
14964c9221k7259N5808M2804K7493k2157j4342L1065q253J5958J9815k6722L4456
$$ -39221 -66480 -10672 32132 59625 37468 23126 54191 45938 61896 81711 54989 89445
14952H9445l9985p3145k1422K7414j2753L6103J4787L5797j0702n5996l2580k5400
$$ 89445 49460 -23685 -45107 -17693 -30446 5657 20444 56241 45539 -10457 -43037 -68437
14940f8437O566P83k7265M5209K0688q3469l4103J2393Q0503K9427K5389J7074
$$ -68437 -61871 -61088 -88353 -43144 -22456 -105925 -140028 -127635 -47132 -17705 7684 24758
14928B4758M9060j3472m2081l86J2652l392k8860k9619o563N8034j8913k1115
$$ 24758 73818 60346 18265 17879 30531 27139 -1721 -31340 -37903 20131 1218 -19897
14916a9897j6382o6567K0685M4189N1124l7524J982j6233K357k7283l2373J373
$$ -19897 -36279 -102846 -82161 -37972 13152 -24372 -22390 -38623 -36266 -63549 -95922 -94549
14904i4549L2278j1259j5152O718M6507N9524K661j4896M1594j6333k9158k4149
$$ -94549 -62271 -73530 -88682 -81964 -35457 24067 26728 11832 53426 37093 7935 -16214
14892a6214m8571l4580M5389M9533L8869N5368j3336o742l2341l7386k4254m917
$$ -16214 -64785 -99365 -53976 -4443 34426 89794 76458 69716 37375 -11 -24265 -29182
14880b9182J9889j3844M6377M8629k8724K182j7852o7675q971J909j8516J2526
$$ -29182 -9293 -23137 23240 71869 43145 45327 27475 -40200 -49171 -47262 -65778 -53252
14868e3252K1358o15m563R147P9L8831J052j5235j359J9394J2189k4425J2514
$$ -53252 -31894 -32509 -37072 -27925 -27846 10985 12037 -3198 -4557 14837 27026 2601 15115
14855A5115r925l3917q050R00J2025k623j3070k2138k2360o788K2008o33j8085
$$ 15115 5190 -28727 -36777 -35877 -23852 -26475 -39545 -61683 -84043 -90831 -68823 -69456 -87541
14842h7541P751L2426O5022K5125j5803P107k0063m1548K8765N1610l6405n5974
$$ -87541 -79790 -47364 17658 42783 26980 34087 14024 -27524 1241 52851 16446 -39528
14830c9528L0637N9669M2197n1457l2377l0110K127M1692M8830J4117l8576j6125
$$ -39528 -8891 50778 92975 41518 9141 -20969 -18842 22850 71680 85797 47221 31096
14818C1096k3586K892P9900j8946o0864k4985j2428K7034m2490l445O254l3638
$$ 31096 7510 10402 90302 71356 10492 -14493 -26921 113 -42377 -45822 -39568 -73206
14806g3206M0489P2282k25o7224n1060K8787J222L1573P3672m4149n7885K2119
$$ -73206 -32717 39565 39340 -27884 -78944 -50157 -48935 -17362 56310 12161 -45724 -23605
14794b3605L2938l8480m4384p094N436n4J1679L9401J0714L0415J1314p661j9903
$$ -23605 9333 -29147 -73531 -80625 -75189 -75243 -63564 -24163 -13449 16966 28280 20619 716
14781G16l3433J4315p643k7826O3165N5398l4551j80l642l1818O464K7073j3763
$$ 716 -32717 -18402 -26045 -53871 9294 64692 30141 29961 26319 -5499 965 28038 14275
14768A4275N575l4074n6682K8902N1759l264K9956k5594k4799M297R403l8356
$$ 14275 19850 -14224 -70906 -42004 9755 6491 36447 10853 -13946 -9649 -246 -38602
14756c8602J3523r814k6788q375N1715L6566O635p1540J2847N069J4185M6649
$$ -38602 -25079 -34893 -61681 -70056 -18341 18225 24860 -46680 -33833 -28764 -14579 32070
14744C2070j8606m1685r355N2694L8378k2575l7424J7149J9888N442m223o719
$$ 32070 13464 -28221 -37576 15118 53496 30921 -6503 10646 30534 35976 31753 25034
14732B5034n814K8627o672n4237k7431M0196J1834l2600j4393J1141K0069j0425
$$ 25034 19220 47847 41175 -13062 -40493 -297 11537 -21063 -35456 -24315 -4246 -14671
14720a4671K044O980j3664K3912N3788K0912n3700R776K2925J7912l5256M739
$$ -14671 -12627 -5647 -19311 4601 58389 79301 25601 35377 58302 76214 40958 45697
14708D5697j328n3450l7052k8977M8100P6598J7805Q808J9951M8258k3309l2300
$$ 45697 44369 -9081 -46133 -75110 -27010 49588 67393 76201 96152 144410 121101 88801
14696H8801n689J8854j7259m5990m3867r5586k1627Q3863M9656K8872K156j4177
$$ 88801 83112 101966 84707 38717 -5150 -100736 -122363 -38500 11156 40028 42184 28007
14684B8007l5145r20R057K3665l0209j2519j7603k3120k5294J6766M3380M5194
$$ 28007 -7138 -8058 999 24664 -5545 -18064 -35667 -58787 -84081 -67315 -23935 21259
14672B1259k4673l0108J1698K7564o605m6211L8003K2507L5931L3832j7529j7787
$$ 21259 -3414 -33522 -21824 5740 -865 -47076 -9073 13434 49365 83197 65668 47881
14660D7881m2768j6315k8575K5936J7039K5120j9302K6427Q291J3496j1147k3503
$$ 47881 5113 -11202 -39777 -13841 3198 28318 9016 35443 43734 57230 46083 22580
14648B2580j3525K5560J7414K640J0303l2224m9013j1927J609J3030m2763k9899
$$ 22580 9055 34615 52029 54669 64972 32748 -16265 -28192 -26583 -13553 -56316 -86215
14636h6215J5625N2775k2618m4163N0103j1984K8565r780j2342K8873J6555Q907
$$ -86215 -70590 -17815 -40433 -84596 -34493 -46477 -17912 -27692 -40034 -11161 5394 14301
14624A4301j8760M353n5444J3774L2651M9918J3226k0291k0109o0959K548P0979
$$ 14301 -4459 -106 -55550 -41776 -9125 40793 54019 33728 13619 -47340 -44792 26187
14612B6187P1213N715j1829p0361j9055k488M1908K1266R903k4841k5786M8735
$$ 26187 97400 103115 91286 20925 1870 -618 41290 62556 72459 47618 21832 70567
14600G0567K1862o2075l0388J5107n8944m7456J2673N2471L7837R44l717k7796
$$ 70567 92429 30354 -34 15073 -43871 -91327 -78654 -26183 11654 12598 8881 -18915
14588a8915k4331O1921j5911j6840k3455N6907L2273K5389r5o8893j5273Q947
$$ -18915 -43246 18675 2764 -14076 -37531 19376 51649 77038 76943 8050 -7223 1724
14576A724L0946j5849l6741K0266N0995L6662n6685n1448L2872j9891Q748j8633
$$ 1724 32670 16821 -19920 346 51341 88003 31318 -20130 12742 -7149 1599 -17034
14564a7034L7801K3564j6050j1032M975k895k4831l8714j5629N3502N231m6408
$$ -17034 20767 44331 28281 17249 22224 19329 -5502 -44216 -59845 -6343 -1112 -47520
14552d7520O557J626O213J1080K2462M7586j5954l2006m1197K5058P629L4273
$$ -47520 -40963 -39337 -33124 -22044 418 48004 32050 44 -41153 -16095 -8466 25807
14540B5807j4282l9683J9386K6173k5937j7599R913K1382k896J5513J1724K1258
$$ 25807 11525 -28158 -8772 17401 -8536 -26135 -16222 5160 2264 17777 29501 50759
14528E0759O808K4072j2471k2940J1395O158k350r168J7673k7121k8365m021J6245
$$ 50759 57567 81639 69168 46228 57623 63781 61431 52263 69936 42815 14450 10429 26674
14515B6674K8841r229l1274k7862n251M5386n744m8855j631K7409j1971m765L7411
$$ 26674 55515 46286 15012 -12850 -18101 27285 21541 -27314 -28945 -1536 -13507 -18272 19139
14502A9139k0850J833O282k5775p086k9331M0816L3239L7109L0150L3730M9883
$$ 19139 -1711 122 6404 -19371 -26457 -55788 -14972 18267 55376 85526 119256 169139
14490A69139j113m1879j5592M4886N2661l5767l7728J0205K0319K2154j1319K3434
$$ 169139 168026 126147 110555 155441 208102 172335 134607 144812 165131 187285 175966 199400
14478A99400j9094P161M6169O2785J15586N5884L8615Q5045O5495O7138k3347
$$ 199400 180306 187467 233636 296421 412007 467891 506506 591551 657046 724184 700837
14467G00837R883m7483j4288R302n1916p7678k1813j1776k4314k0025k1184l3730
$$ 700837 710720 663237 648949 658251 606335 528657 506844 495068 470754 450729 429545 395815
14455C95815L0695j967p1518q2804j5809J8604J9458J3138l5119K2351L6233P7113
$$ 395815 426510 424543 353025 270221 254412 273016 292474 305612 270493 292844 329077 406190
14443D06190N8273N2506M0162M806K3673L8141P7916P9976M4437l8732n82k703
$$ 406190 464463 516969 557131 561937 585610 623751 701667 781643 826080 787348 786766 784063
14431G84063l8114j5030k3211r2886o5660j32597r2383n6720k0910j7675K7749
$$ 784063 745949 730919 707708 614822 549162 416565 324182 267462 246552 228877 256626
14420B56626O244l1320k2273k9932k256m824k7039m8526k4709j9159j228k8883
$$ 256626 262870 231550 209277 179345 177089 172265 145226 96700 71991 52832 51604 22721
14408B2721o560j6979n5903k7449J5861M2107j0762K2959j600N0565M0185n3344
$$ 22721 16161 -818 -56721 -84170 -68309 -26202 -36964 -14005 -15605 34960 75145 21801
14396B1801m7113J0891K3006O7388k3872m3309k9561k1608O204m911L1122J8681
$$ 21801 -25312 -14421 8585 75973 52101 8792 -20769 -42377 -36173 -41084 -9962 8719
14384H719k5815Q723J7505L3164K5120l2743n6066j660K7870K0281M0275Q071
$$ 8719 -17096 -8373 9132 42296 67416 34673 -21393 -23053 4817 25098 65373 73444
14372G3444l3622O331j6126j112K8648J6795l0309m5275J4627O025L8944m153
$$ 73444 39822 46153 30027 28915 57563 74358 44049 -1226 13401 19426 58370 54217
14360E4217l140J177j5850l3523p214K1319l490q112k2142l1295L04P474p736
$$ 54217 51077 52254 36404 2881 -4333 16986 13496 5384 -16758 -48053 -47749 -40275 -48011
14347d8011K930k7862k6635J9081N52m10O9378O0148j1578j5987J1207M170J9413
$$ -48011 -45081 -72943 -99578 -80497 -79945 -80355 -10977 49171 37593 21606 32813 36983 56396
14334E6396K1750K8166J102l293L5188K0690l9662o0132M99R598l1173J9702K9072
$$ 56396 78146 106312 107414 104121 139309 159999 120337 60205 60704 70302 39129 58831 87903
14321H7903P693J0210o2874o6464O248N6096K7353O395n2689J6061j1913k7909
$$ 87903 95596 105806 42932 -23532 -17284 38812 66165 72560 19871 35932 24019 -3890
14309c890K3231r436R627n2905N308N7345J172K4586k669M82J5910Q329J8025
$$ -3890 19341 9905 19532 -33373 -28065 29280 30452 55038 52369 52851 68761 77090 95115
14296I5115j0996J8765l1521J0457k480p7084p463j5557L3759M913K8519K9291
$$ 95115 84119 102884 71363 81820 79340 2256 -5207 -20764 12995 17908 46427 75718
14284G5718N0072j970m0340L0898J828j5658L0224J4909M0762m8533l5878j0196
$$ 75718 125790 123820 83480 114378 116206 100548 130772 145681 186443 137910 102032 91836
14272I1836o173k1679j0111K7522J8237J2000J3770j8014l1859J10J014L4036
$$ 91836 85663 63984 53873 81395 99632 111632 125402 107388 75529 75639 76653 110689
14260A10689L5995k6108n8763k3585J4359N460J3420k5567Q304L7686K1181M0432
$$ 110689 146684 120576 61813 38228 52587 58047 71467 45900 54204 91890 113071 153503
14248A53503L3327j4920J7954j1403m6559L3288L1235p644K1273l9340l7465k7432
$$ 153503 186830 171910 189864 178461 131902 165190 196425 188781 210054 170714 133249 105817
14236A05817P414n9674l6678j0557N1051K0008J3108m579j7207l2937l2878K9067
$$ 105817 113231 53557 16879 6322 57373 77381 90489 85910 68703 35766 2888 31955
14224C1955j2086j3519R184o113K8766r076K4507k6005L034N5247J5614m2172
$$ 31955 19869 6350 15534 9421 38187 29111 53618 27613 30647 85894 101508 59336
14212E9336n4636K3880k8798l5581Q869k7452J2297J1377J4260N3699N5658m663
$$ 59336 4700 28580 -218 -35799 -26930 -54382 -42085 -30708 -16448 37251 92909 88246
14200H8246l1520k4039J8147J0314Q827m289k6180M2720J2985o081K0310j6731
$$ 88246 56726 32687 50834 61148 69975 65686 39506 82226 95211 89130 109440 92709
14188I2709M1829l1929l9660p177N160P606j9937p048Q922K2133P335o6380J8752
$$ 92709 134538 102609 62949 55772 60932 68538 48601 41553 50475 72608 79943 13563 32315
14175C2315J8219K4970L1179L8028k7942M353M383m2169k79L6209j623O53l0589
$$ 32315 50534 75504 106683 144711 116769 121122 125505 83336 83057 119266 117643 118296 87707
14162H7707P214k2469r632L5992o661L7545M360l2692N529O8977M5515k9289o8760
$$ 87707 94921 72452 62820 98812 92151 129696 134056 101364 106893 175870 221385 192096 123336
14149A23336L4418M0129L2855L2750L5007l3363m1899Q982N0457n78N433k9726
$$ 123336 157754 197883 230738 263488 298495 265132 223233 232215 282672 282094 287527 257801
14137B57801k9382K5889L1257J421l0341j3507O0661J5154j8162n0598p2215o393
$$ 257801 228419 254308 285565 286986 256645 243138 303799 318953 300791 250193 177978 171585
14125A71585j0529Q196N5905j1408J5112P011L8915P8524R218j5885k3675q908
$$ 171585 161056 169252 225157 213749 228861 235872 274787 353311 362529 346644 322969 314061
14113C14061K6026q969j9973M5560M7148J9130j3632k5143K042L136K8023J0739
$$ 314061 340087 331118 311145 356705 403853 422983 409351 384208 386250 389386 417409 428148
14101D28148n1116j6134L4640J5838j4660m986K8562k6826K1016J0323K5103k6480
$$ 428148 377032 360898 395538 411376 396716 391730 420292 393466 414482 424805 449908 423428
14089D23428K0781L3203R532L0867m61j8079M7237M7551J1103J5714N7633P5888
$$ 423428 444209 477412 486944 517811 517350 499271 546508 594059 605162 620876 678509 754397
14077G54397N2888k9741M5595Q7815M6960k7314N3239L0169N9884N7181L1207
$$ 754397 807285 777544 823139 910954 957914 930600 983839 1014008 1073892 1131073 1162280
14066A162280L7315P5513L5304L4821N4275Q4581P2931J39654J32586P2859J51861
$$ 1162280 1199595 1275108 1310412 1345233 1399508 1484089 1557020 1696674 1829260 1902119 2053980
14055B053980J53635J62678J62166K15631K60394K34451K52537L11111L68271
$$ 2053980 2207615 2370293 2532459 2748090 3008484 3242935 3495472 3806583 4174854
14046D174854M15863M72948N90782O81500P46846R28474J091932J261055J539205
$$ 4174854 4590717 5063665 5654447 6335947 7082793 8011267 9103199 10364254 11903459
14037A1903459J728081K023444K379108K801388L387119M132609N104670O218713
$$ 11903459 13631540 15654984 18034092 20835480 24222599 28355208 33459878 39678591
14029C9678591P503223R019814J0484154J1692765J2542247J2707383J2028354
$$ 39678591 47181814 56201628 66685782 78378547 90920794 103628177 115656531
14022A15656531J0556370Q245325N282789K070324j192007m078260o459530q018073
$$ 115656531 126212901 134458226 139741015 141811339 140619332 136541072 130081542 122063469
14014A22063469q770643q873231q408959p557521o566933n511083m579433l636438
$$ 122063469 113292826 104419595 96010636 88453115 81886182 76375099 71795666 68159228
14006F8159228k820350k067234j439794q82439l54595K78411R08575J536448K217119
$$ 68159228 65338878 63271644 61831850 60949411 60594816 60873227 61781802 63318250 65535369
13997F5535369L013771L851370M803904N897417P005706Q043018Q921142R361693
$$ 65535369 68549140 72400510 77204414 83101831 90107537 98150555 107071697 116433390
13989A16433390R187393Q287916O618715M260752J140377k202310n489434q408046
$$ 116433390 125620783 133908699 140527414 144788166 145928543 143726233 138236799 129828753
13981A29828753j0588687j1965621j2541772j2314777j1506158j0264586q790574
$$ 129828753 119240066 107274445 94732673 82417896 70911738 60647152 51856578
13974E1856578p381068o112644n062907m182326l546734l023474k601053k165698
$$ 51856578 44475510 38362866 33299959 29117633 25570899 22547425 19946372 17780674
13966A7780674j871567j677166j435433j242390j043563r33811q07526p70951
$$ 17780674 15909107 14231941 12796508 11554118 10510555 9576744 8769218 7998267
13958G998267p09563o53270n57056m42706l98459l53168l45021l34626l33051
$$ 7998267 7288704 6635434 6078378 5635672 5237213 4884045 4539024 4204398 3871347
13949C871347k69197j90280k09901k23587j95670j25981j79966j81285j27302
$$ 3871347 3602150 3411870 3201969 2978382 2782712 2656731 2476765 2295480 2168178
13940B168178j53720j33968j21344n1124j01180o4094r3059j04660j3453l3733
$$ 2168178 2014458 1880490 1759146 1708022 1606842 1542748 1449689 1345029 1331576 1297843
13930A297843l5477J2268o1511j3851j09392p4035m9108j6550n0789j9954j92
$$ 1297843 1262366 1274634 1213123 1199272 1089880 1015845 966737 950187 899398 879444 879252
13919H79252n7735l5041l3779l8418k1897K233Q922k2645p2954o9604n397K7106
$$ 879252 821517 786476 752697 714279 692382 694615 703537 680892 607938 538334 532937 560043
13907E60043k1916o972J4914m2612o1232l5658J6402J5168J0682l3175n9170r749
$$ 560043 538127 531155 546069 503457 442225 406567 422969 438137 448819 415644 356474 346725
13895C46725K6678N560l5508o2191R003J4783K5441L0792K8025L8453n3104n2172
$$ 346725 373403 378963 343455 281264 290267 305050 330491 361283 389308 427761 374657 322485
13883C22485Q074P425j8237j1499j4356k2668m7251n7651N8839K6673K5406K0527
$$ 322485 330559 337984 319747 308248 293892 271224 223973 166322 225161 251834 277240 297767
13871B97767J7245p960j4220m3414J5741K721k0636n0743j3382P105j826m394
$$ 297767 315012 307052 292832 249418 265159 267880 247244 196501 183119 190224 188398 184004
13859A84004J7322L9513m6728P863J864j3728J42J3237K8574k0910k1372L4901
$$ 184004 201326 240839 194111 201974 203838 190110 190252 203489 232063 211153 189781 224682
13847B24682L5077l4848L8559l9665m1083J7250k5221J254J8690m0112j0761J5197
$$ 224682 259759 224911 263470 223805 182722 199972 174751 176005 194695 154583 143822 159019
13835A59019M6337L363k4189J9711L9895p528k3567j0534l406l151l1417j3594
$$ 159019 205356 208719 184530 204241 244136 236608 213041 202507 199101 195950 164533 150939
13823A50939K9126Q0693m6280r0973l16M0201L7195l8620K884j8045M557k7646
$$ 150939 180065 260758 214478 123505 123189 163390 200585 161965 164849 146804 151361 123715
13811A23715P547o714k4684P997M9564M7479j3020l4243m8969K5856K0761m4523
$$ 123715 131262 124548 99864 107861 157425 204904 191884 157641 108672 134528 155289 110766
13799A10766J1055K395m636L607n6530M1907L8772o922M4817j6805m2496j9570
$$ 110766 121821 124216 119580 123187 66657 108564 147336 140414 185231 168426 125930 106360
13787A06360l4848J6404L8373R032L1316j0479m4376l965L1647M3997K4192k0580
$$ 106360 71512 87916 126289 135321 166637 156158 111782 107817 139464 183461 207653 187073
13775A87073m7107n0782k5763L507k5062N53J2581N364l4287m515Q470J9252p151
$$ 187073 139966 89184 63421 66928 41866 42419 55000 60364 26077 21562 30032 49284 42133
13762D2133p676P10k6652L2084M6435J7459k7973j1299J0614L5382j2706n15N4046
$$ 42133 34457 35167 8515 40599 87034 104493 76520 65221 75835 111217 98511 97996 152042
13749A52042j7023k9867k3130k6399l581P3735K5309l693M828l6586j542J3654
$$ 152042 135019 105152 82022 55623 52042 125777 151086 147393 152221 115635 114093 127747
13737A27747m1087o1372M0138P7141J6352M5055J9177l0893o5521n0048pK6402
$$ 127747 86660 25288 65426 142567 158919 203974 223151 192258 126737 76689 76682 103084
13725A03084j4274j9087K3784K1949K0971P83l1953J3299j5184o5560k4825L4121
$$ 103084 88810 69723 93507 115456 136427 137210 105257 118556 103372 37812 12987 47108
13713D7108M6109j1197o4200j1098K4242k1008m8226n857J2253K8638J7423j03
$$ 47108 93217 82020 17820 6722 30964 9956 -38270 -44127 -31874 -3236 14187 14084
13701A4084O975Q3251J7447l3579J2129J5713K7463n5518Q920J9041j3596o551
$$ 14084 21059 104310 121757 88178 100307 116020 143483 87965 96885 115926 102330 95779
13689I5779K0801j2313n2106R489R706m1118K2579k0389o25P0075k074l8066J8922
$$ 95779 116580 104267 52161 61650 71356 30238 52817 32428 31803 101878 99804 61738 80660
13676H0660K6767k2990k9852L485o8118k9589N0757j6065P789L5301O0L7813O0338
$$ 80660 107427 84437 54585 58070 -10048 -39637 11120 -4945 2844 38145 38205 76018 136356
13663A36356k3847k3450J1933L6611k6152p1759j490M0020K176k818k211J381
$$ 136356 112509 89059 100992 137603 111451 39692 38202 78222 80398 77580 75369 76750
13651G6750L1246q671j8473n84J5312J6784m641k0592J6561j332K6935L3390j0194
$$ 76750 107996 99325 80852 80268 95580 112364 107723 87131 103692 102360 129295 162685 152491
13638A52491j166P513m9426q132L9328O915Q922k6909m5396o3411m1763k9775
$$ 152491 151325 158838 109412 101280 140608 147523 156445 129536 84140 20729 -21034 -50809
13626e0809p491K0741K5780L8887K5843L3479k172m3144l4702q68o6555q2018
$$ -50809 -58300 -37559 -11779 27108 52951 86430 84258 41114 6412 5544 -61011 -143029
13614a43029L4950M4771L8261M3899Q150j6552L3137m064R474L8017P956k8480
$$ -143029 -108079 -63308 -25047 18852 27002 10450 43587 39523 48997 87014 94970 66490
13602F6490K1695l6588p3724j3209M6932J8568L7753k1745j8527l2835j9403K2409
$$ 66490 88185 51597 -22127 -35336 11596 30164 67917 46172 27645 -5190 -24593 -2184
13590b184L2345p9p767M8939M7337r248m3101j6492N1544K3842r893N838M2899
$$ -2184 30161 30082 22315 71254 118591 109343 66242 49750 101294 125136 115243 121081 163980
13577A63980K383K4P5194J07362K667J2486P4222P2956P3126J07404Q2834K4610
$$ 163980 166363 166387 241581 348943 351610 364096 438318 511274 584400 691804 774638 799248
13565G99248o341k3158j0626l0749j3153l8346n7291o8682n5272l9372p798l6440
$$ 799248 792907 769749 759123 728374 715221 676875 619584 550902 495630 456258 448460 412020
13553D12020l7992m523j8209K7866N096k3965J9478M827N273j3416j3598J1208
$$ 412020 374028 369505 351296 379162 384258 360293 379771 384598 389871 376455 362857 374065
13541C74065j882O034L6335R8544N3761L0764P7180K9362L6996M2683k1569J0430
$$ 374065 372183 378217 414552 513096 566857 597621 674801 704163 741159 783842 762273 772703
13529G72703J7300k8970k8397p3383o0158j05194n8008l1522n1121o3314m8384
$$ 772703 790003 761033 732636 659253 599095 493901 435893 404371 353250 289936 241552
13518B41552L3304n963r514m8830l7357l4779L856l3988P87J9829m3434p5626
$$ 241552 274856 268893 259379 210549 173192 138413 142269 108281 109068 128897 85463 9837
13506I837k0696M333K4258j0445K1179K1015m0232q314J5519L2973l206L0762
$$ 9837 -10859 -6526 17732 7287 28466 49481 9249 935 16454 49427 46221 76983
13494G6983L3291J6546N185k4205j3976n4748n1316K8998K3538K9697J133o9670
$$ 76983 110274 126820 132005 107800 93824 39076 -12240 16758 40296 69993 71126 1456
13482A456n9796n621J8920Q480L5177l684k379k090k5800J2383N8003M7527m0156
$$ 1456 -58340 -63961 -45041 -36561 -1384 -5068 -7447 -9537 -35337 -22954 35049 82576 42420
13469D2420q923M2627k8618J4032p495k6055q682K0868k4082l4421N2291O658
$$ 42420 33497 76124 47506 61538 54043 27988 19306 40174 16092 -18329 33962 40620
13457D0620Q856Q477M3103m324n7729R135K8220o609p8222J293N5259J1185j1540
$$ 40620 49476 57953 101056 96732 39003 48138 76358 69749 -8473 -7180 48079 59264 47724
13444D7724K459k4557J7343j2622n725M9285k0375k8154K6173J9608J7026K4478
$$ 47724 50183 25626 42969 30347 24622 73907 53532 25378 51551 71159 88185 112663
13432A12663l787j06876l6803Q1038L894m0447k3702P030o814N6238K1137j0100
$$ 112663 108876 2000 -34803 46235 50129 9682 -14020 -6990 -13804 42434 63571 53471
13420E3471N2407P515o0230l619J375m8002j8102k758Q019L2484M1277K4969p285
$$ 53471 105878 113393 53163 49544 50919 2917 -15185 -17943 -9924 22560 63837 88806 81521
13407H1521o8937J065P3269K3493l2799l4008j2924j7658j6433j6869J9010K6006
$$ 81521 12584 13649 86918 110411 77612 43604 30680 13022 -3411 -20280 -1270 24736
13395B4736P427K8291m8595k1900M7810R705o888k3789J6899L107j4268J6739
$$ 24736 32163 60454 11859 -10041 37769 47474 40586 16797 33696 36803 22535 39274
13383C9274l8647K4833M636j1794J889J7913o84K4688K1105j0607n2689k0558
$$ 39274 627 25460 30096 18302 20191 38104 37420 62108 83213 72606 19917 -641
13371f41J2071j0035O3492L7252l5115p547N1610M7107p79n1071J2870j8420l8141
$$ -641 11430 1395 64887 102139 67024 59477 111087 158194 157415 106344 119214 100794 62653
13358F2653n8942j8328J0756j7448J4630L7281J884N842J8384k3448n2394k7509
$$ 62653 3711 -14617 -3861 -21309 -6679 30602 32486 38328 56712 33264 -19130 -46639
13346d6639m422P6110K457m5004l2291p020L4653L9858K2434k3908m2947J878
$$ -46639 -51061 25049 27506 -17498 -49789 -56809 -22156 17702 40136 16228 -26719 -24841
13334b4841j1926L3231K4048K8489O680k3602l4543n088J0301k485J2148n0989
$$ -24841 -36767 -3536 20512 49001 55681 32079 -2464 -7552 2749 264 12412 -38577
13322c8577j765L4330J7798K5956j7841o203J2180K319l1338n3647J7351R221
$$ -38577 -40342 -6012 11786 37742 19901 13698 25878 28197 -3141 -56788 -39437 -30216
13310c0216q103M0349o775M4127J5385k403m2840o970O215k5314k685N7151J9621
$$ -30216 -38319 2030 -4745 39382 54767 52364 9524 2554 8769 -16545 -19230 37921 57542
13297E7542j5494p4465m057O6726K1917l771p323o0595j239M7623J3128J3336
$$ 57542 42048 -32417 -36474 30252 52169 48398 41075 -19520 -20759 26864 39992 53328
13285E3328L161j4099L3403J8492J4421j8710o3264J1542K9230m629R517j3125
$$ 53328 56489 42390 75793 94285 108706 89996 26732 38274 67504 62875 72392 59267
13273E9267l8228j9051m1417l4095K1922M4633N4007j8075l4291J1920M452J7731
$$ 59267 21039 1988 -39429 -73524 -51602 -6969 47038 28963 -5328 6592 11044 28775
13261B8775n0569K4747J5310m626k5558m1528m4044L4687N9247j2396j7760R435
$$ 28775 -21794 2953 18263 13637 -11921 -53449 -97493 -62806 -3559 -15955 -33715 -24280
13249b4280k7743j5422L2931q206J785j8427k6100L8556N2746K7767k3739M2314
$$ -24280 -52023 -67445 -34514 -42720 -40935 -59362 -85462 -46906 5840 33607 9868 52182
13237E2182j0956L030k0930p0334L7774j6990r046j0668J6922j2327J1793L8945
$$ 52182 41226 44256 23326 -47008 -9234 -26224 -35270 -45938 -29016 -41343 -29550 9395
13225I395k7297k3031J4519k4993M0330L9402K4744J4572j1732P604L6920l0727
$$ 9395 -17902 -40933 -26414 -51407 -11077 28325 53069 67641 55909 63513 100433 69706
13213F9706j0832n404m9432m792O9655m5650k2476R312J6002L269k2072m7649
$$ 69706 58874 53470 4038 -754 68901 23251 775 10087 26089 29358 7286 -40363
13201d0363q187J6318p514K3204M524M6779J4563m4410k9218J4678o856k9615
$$ -40363 -48550 -32232 -39746 -16542 -12018 34761 49324 4914 -24304 -9626 -16482 -46097
13189d6097J0797l1067Q757J5533L5157J1066m5127m584K5738k0175j208M1151
$$ -46097 -35300 -66367 -57610 -42077 -6920 4146 -40981 -45565 -19827 -40002 -41210 -59
13177e9M2722J7667k5273J2595J6344k7197O077K0874l6035j3000k6917l7587
$$ -59 42663 60330 35057 47652 63996 36799 42876 63750 27715 14715 -12202 -49789
13165d9789l988j342K6342n565k7713K8717j342R416K5319L4071K855k043l9777
$$ -49789 -53777 -55119 -28777 -34342 -62055 -33338 -34680 -25264 55 34126 36981 34938 -4839
13152d839O039k3842J2351j1634j6210J4881P6518O799l7758k214J4580p609k4888
$$ -4839 1200 -22642 -10291 -21925 -38135 -23254 53264 60063 22305 20091 34671 27062 2174
13139B174Q932J350K6998j4270k7068l8623J8849K7010L7899p642K7119K094k9243
$$ 2174 11106 12456 39454 25184 -1884 -40507 -21658 5352 43251 35609 62728 64822 35579
13126C5579J3857R872m8055j9201J8815M0921k0495k9421K1427L0450J4617l5814
$$ 35579 49436 59308 11253 -7948 10867 51788 31293 1872 23299 53749 68366 32552
13114C2552o0732k3273J0678q054M0921P8962l0058J2422K1548k3735n0720K0035
$$ 32552 -28180 -51453 -40775 -48829 -7908 71054 40996 53418 74966 51231 511 20546
13102B0546K7236k7471m0897k9049J6164K4196J9271N0576j4266M30k1508k4792
$$ 20546 47782 20311 -20586 -49635 -33471 -9275 9996 60572 46306 46736 25228 436
13090D36J1412j2001J7607j3780K1434n4658n7100M378M1564P4167L0612k2407
$$ 436 11848 -153 17454 3674 25108 -29550 -86650 -82272 -40708 33459 64071 41664
13078D1664j2851j1719o5122K6762M9528m75j8457M011P761O5336j4496m8873
$$ 41664 28813 17094 -48028 -21266 28262 27787 9330 13341 21102 86438 71942 23069
13066B3069j8115N323l7203L6859K4488k1364m1068j3689L6566J1389k7613j4240
$$ 23069 4954 10277 -26926 9933 34421 13057 -28011 -41700 -5134 6255 -21358 -35598
13054c5598N8622L1263m785K2950j9029m9283n3081J7289r533j0114L1198N8825
$$ -35598 23024 54287 49502 72452 53423 4140 -48941 -31652 -41185 -51299 -20101 38724
13042C8724J3591l356k5758K5435J9880j7642L2501L2011l4561m4357n1873n4418
$$ 38724 52315 48959 23201 48636 68516 50874 83375 115386 80825 36468 -15405 -69823
13030f9823K1022j8949Q836N1141M6858K3751k2839L5837Q378n6559k9840K788
$$ -69823 -48801 -67750 -58914 -7773 39085 62836 39997 75834 84212 27653 -2187 601
13018F01R049J3447R468O770J792O278m5653m1594k2469J2621J0864J9567K2248
$$ 601 9650 23097 32565 39335 41127 47405 1752 -39842 -62311 -49690 -38826 -19259 2989
13005B989j109J0130M67L360J7706k4154k321k9040j6509j2428O743J94k9940
$$ 2989 1880 12010 12477 15837 33543 9389 7068 -21972 -38481 -50909 -44166 -43972 -73912
12992g3912J5172K4222K5402M8749R925m4318m7466n2318J768N6111Q847L7567
$$ -73912 -58740 -34518 -9116 39633 49558 5240 -42226 -94544 -92776 -36665 -27818 9749
12980I749r136k7349k2942N5880j6569j8952n273L3276L8742L5421q603m0906
$$ 9749 613 -26736 -49678 6202 -10367 -29319 -34592 -1316 37426 72847 64244 23338
12968B3338Q311L1702N911n2135n527n3494l9760L4621N0956K9212L4868M147
$$ 23338 31649 63351 69262 17127 11600 -41894 -81654 -47033 3923 33135 68003 72150
12956G2150j0397M946J8543r570k0133K9446j6866j5959M427k4012l6693r503
$$ 72150 61753 66699 85242 75672 55539 84985 68119 52160 56587 32575 -4118 -13621
12944a3621l8785J5893O1444r128p1987j714N4490L823J862K5127J1596q136r452
$$ -13621 -52406 -36513 24931 15803 -56184 -57898 -3408 415 2277 27404 39000 30864 21412
12931B1412L2318K7816R923J748l4414m9019k8020Q891J3696J3851O4085j5142
$$ 21412 53730 81546 91469 93217 58803 9784 -18236 -9345 4351 18202 82287 67145
12919F7145r987K4630K9600l3108o309K7856j1890r1718l3743L542K6787J4409
$$ 67145 57158 81788 111388 78280 71971 99827 87937 -3781 -37524 -33982 -7195 7214
12907G214l856p650M82J9529M6653m4j772k9434m0831J6209K181K3338J2561K0135
$$ 7214 3358 -4292 -3810 15719 62372 62328 60556 31122 -9709 6500 8681 32019 44580 64715
12893F4715m2285P478J4734k6282K7437K4717n80L6533N488L272l8368k9422j0853
$$ 64715 22430 29908 44642 18360 45797 70514 69934 106467 111955 115227 76859 47437 36584
12880C6584J892J4752R915N429l9253k3155L1603K7749k2096k5782M4812O431
$$ 36584 38476 53228 63143 68572 29319 6164 37767 65516 43420 17638 62450 68881
12868F8881l0899j9993K6792m687l7485J8581L4273j355J9525m1265k1283N63
$$ 68881 37982 17989 44781 40094 2609 21190 55463 54108 73633 32368 11085 11648
12856A1648k7118K3011K0866Q828j0532J7218J6426p217K8512j3150J6656K6990
$$ 11648 -15470 7541 28407 37235 26703 43921 60347 53130 81642 68492 85148 112138
12844A12138m2123n3228m8921J6891L9520m261L1021l5438k7769K9103K1435N939
$$ 112138 70015 16787 -32134 -15243 24277 20016 51037 15599 -12170 16933 38368 44307
12832D4307j1164q8323k2064J7460P4916N1997K0386n9434k6393M4937M0183q0
$$ 44307 33143 -55180 -77244 -59784 15132 67129 87515 28081 1688 46625 86808 86728
12820H6728r440j6588m7410k5801K6511K7570m170m235k8799O5433l4218m9336
$$ 86728 77288 60700 13290 -12511 14000 41570 37400 33165 4366 69799 35581 -13755
12808a3755N759L3746j1819R219L0880J9847n6202p4908K8678L6248j0775j4757
$$ -13755 -7996 25750 13931 23150 54030 73877 17675 -57233 -28555 7693 -3082 -17839
12796a7839M1855J6817p552m9674m244L0561K5245m6673R535J1797K76q88q494
$$ -17839 24016 40833 33281 -16393 -20637 9924 35169 -11504 -1969 9828 10104 9216 722
12783G22J7992k9519q770J4213K0816M1245N2363K3712j3965j850N8601j9102
$$ 722 18714 -10805 -19575 -5362 15454 56699 109062 132774 118809 116959 175560 156458
12771A56458k7553J8168n5897J979L2273N0642p036j00005k4230K6511k989l1981
$$ 156458 128905 147073 91176 93155 125428 176070 169034 69029 44799 71310 68321 36340
12759C6340K0697J8202m0964K9205L215l783M3471K0615M0506M025M2654k620
$$ 36340 57037 75239 34275 63480 66695 62912 106383 126998 167504 171529 214183 211563
12747B11563m7542l0586m70J835L8426L9126J7200m1872o9134m5330L4192K0180
$$ 211563 164021 133435 132965 134800 173226 212352 229552 187680 118546 73216 107408 127588
12735A27588j7211k4050j5737R214O74n008r808P5552j9647m2670Q544M4017r682
$$ 127588 110377 86327 70590 79804 80478 75470 65662 141214 121567 78897 87441 131458 121776
12722A21776k2086n651j7013K94J7975K5424L1455Q532N609J5632k987M200J7069
$$ 121776 99690 94039 77026 77320 95295 120719 152174 160706 166315 181947 178960 183160 200229
12709B00229l5650j5775J808l5249k4404J0132m006j2658k8507m792J9373o119
$$ 200229 164579 148804 150612 115363 90959 101091 97085 84427 55920 51128 70501 64382
12697F4382m0944k0751J1439j2273K5948O688M3347J9752K8112j3804j5501N519
$$ 64382 23438 2687 14126 1853 27801 34489 77836 97588 125700 111896 96395 101914
12685A01914K1522j5557Q300K6041l256k1882K6774q025k9452J6920m5704k0564
$$ 101914 123436 107879 116179 142220 138964 117082 143856 135831 106379 123299 77595 57031
12673E7031j9913k0329L879K5851K640m5664m3585k5103o718M3193K0267m7673
$$ 57031 37118 16789 20668 46519 49159 3495 -40090 -65193 -71911 -28718 -8451 -56124
12661e6124j7543r236N9041M1426r624n1060l4741J6155O3332O7393J0070K40
$$ -56124 -73667 -82903 -23862 17564 7940 -43120 -77861 -61706 1626 69019 79089 79329
12649G9329j6586j0934n647m2700k3410j0216L3874q904j3604J2713J6398J189
$$ 79329 62743 51809 46162 3462 -19948 -30164 3710 -5194 -18798 -6085 10313 11502
12637A1502m295m3658p145N8959K7338k5809K0275k1166k6037K0079j9789O044
$$ 11502 7207 -36451 -43596 15363 42701 16892 37167 16001 -10036 10043 -9746 -3702
12625c702K5098j9594j2473j8800j3560n442j6009P836J2951L9866L9921P063
$$ -3702 21396 1802 -10671 -29471 -43031 -48473 -64482 -56646 -43695 -3829 36092 43155
12613D3155k0453J939J4188j2067n4745p03J7702k7929j7574K0986M968J9324
$$ 43155 22702 24641 38829 26762 -27983 -28686 -10984 -38913 -56487 -35501 -30533 -11209
12601a1209j1131J718j9134r30J142J1478l2387J143j2582J544N0534q044j4533
$$ -11209 -22340 -20622 -39756 -40686 -39544 -28066 -60453 -59310 -71892 -70348 -19814 -27858 -42391
12588d2391M8313j012n5407Q563n048k5044o830N4920K2942J4318J6361O808K3278
$$ -42391 5922 4910 -50497 -41934 -46982 -72026 -78856 -23936 -994 13324 29685 36493 59771
12575E9771J6420k392k7404m3383l1475M7971o30K2068K3611k3787n793J171k9448
$$ 59771 76191 73799 46395 3012 -28463 19508 18878 40946 64557 40770 34977 36148 6700
12562F700j3727m182P5916P1187l838k2551r556m9676l1434o124M4304r680J2091
$$ 6700 -7027 -11209 64707 135894 132056 109505 99949 50273 18839 12715 57019 47339 59430
12549E9430j7857l4781j6545M3206J7583N947o991Q866l0618L5456L8384j9149
$$ 59430 41573 6792 -9753 33453 51036 56983 49992 58858 28240 63696 102080 82931
12537H2931n8118J8180M1450l6261L2363J8518m8136l4673K753M328m952l6194
$$ 82931 24813 42993 84443 48182 80545 99063 50927 16254 19007 23335 18383 -17811
12525a7811J007L2955L0775N7287K583J7222l504j9610k2952n362J7807N144K4916
$$ -17811 -16804 16151 46926 104213 106796 124018 120514 100904 77952 72590 90397 95541 120457
12512A20457k0936N178O8571R721l1041p0266J6176N3327K1790N8488L1821j0290
$$ 120457 99521 104699 173270 182991 151950 81684 97860 151187 172977 231465 263286 252996
12500B52996J2263L5594R5371J54866J25186Q1807Q7224Q5458O54p1731r4872
$$ 252996 265259 300853 396224 551090 676276 758083 845307 930765 931419 859688 764816
12489G64816q2949p2762o6890m442N0560m6938o3041j8343M6219J01945N2985
$$ 764816 681867 609105 542215 537773 588333 541395 478354 460011 506230 608175 661160
12478F61160N0503j4224K3546K0455Q897N0390O6980M4412m7117m7632N330K703
$$ 661160 711663 697439 720985 741440 750337 800727 867707 912119 865002 817370 822700 825403
12466H25403K6743M017L3719Q6003J40884J87816K03614K10408K33836K13178
$$ 825403 852146 856163 889882 975885 1116769 1304585 1508199 1718607 1952443 2165621
12456B165621P0271o1084j56017k23983j62801j81263k11330j32070q1394m5326
$$ 2165621 2235892 2174808 2018791 1794808 1632007 1450744 1239414 1107344 1025950 980624
12446I80624Q08j8898l1370m4497J063L0898k8206p3060l4035j5256J636J2350
$$ 980624 981432 962534 931164 886667 887730 918628 890422 817362 783327 768071 769707 782057
12434G82057J5192Q402p5919q1832n9227o4889j0135M5950K4304L4326Q2849R7491
$$ 782057 797249 805651 729732 647900 588673 523784 513649 559599 583903 618229 701078 798569
12422G98569N7528R1387O0896J2565k9621j30863j52585j52260j45531n7437j5645
$$ 798569 856097 947484 1008380 1020945 991324 860461 707876 555616 410085 352648 337003
12411C37003k456j5116q3256o5831q180n7002n998J5475O4495J1849N636n9363
$$ 337003 334547 319431 236175 170344 162164 105162 99164 114639 179134 190983 196619 137256
12399A37256m7312k2346L5020J0298j276j1740j1178K3237o010k9392l3318J623
$$ 137256 89944 67598 102618 112916 111640 99900 88722 111959 105949 76557 43239 44862
12387D4862P418L3587L2968N335j3344q024L0740K4806l9992j6653J2242J6223
$$ 44862 52280 85867 118835 124170 110826 102802 133542 158348 118356 101703 113945 130168
12375A30168k7220k9556q219N1929k1453j2524o0394p091k9425j4358L5676K8524
$$ 130168 102948 73392 65173 117102 95649 83125 22731 15640 -13785 -28143 7533 36057
12363C6057m2089K8186K3352M641p729J0423l2069j0798K9411j0017q768M4961
$$ 36057 -6032 22154 45506 50147 42418 52841 20772 9974 39385 29368 20600 65561
12351F5561p603K3176K3029k6423r988P416j3055n1280l2707j163J157j7576k5730
$$ 65561 57958 81134 104163 77740 67752 75168 62113 10833 -21874 -23037 -21880 -39456 -65186
12338f5186Q5787L0894p361n8441p7158M4471J17554M0383l5974n6132L0832L100
$$ -65186 20601 51495 44134 -14307 -91465 -46994 70560 110943 74969 18837 49669 52769
12326E2769j811k4662K7227J7318m1984m9023K5416L6928k3260m0530j3010N1142
$$ 52769 50958 26296 53523 70841 28857 -20166 5250 42178 18918 -21612 -34622 16520
12314A6520M1450K5336K5703m5744O014K1844n5883m0531k7498K1801K4539J7710
$$ 16520 57970 83306 109009 63265 69279 91123 35240 -5291 -32789 -10988 13551 31261
12302C1261j2692k0718k206k758r015Q727J3016J497j9929p662j8951L6612K5196
$$ 31261 18569 -2149 -4355 -7113 -16128 -7401 5615 7112 -12817 -20479 -39430 -2818 22378
12289B2378k5734o8214J621K9395M5829M7817j2458q977j0890l9804l575m564
$$ 22378 -3356 -71570 -69949 -40554 5275 53092 40634 31657 20767 -19037 -22612 -27176
12277b7176k374k3203j6799R306l2635M2599O2616k0860M138P4584K217o9070
$$ -27176 -29550 -52753 -69552 -60246 -92881 -50282 12334 -8526 -4388 70196 72413 3343
12265C343k0355L3113r402K4299J3158m417L799l4722q812J8801P657k923L329
$$ 3343 -17012 16101 6699 30998 44156 39739 43538 8816 4 18805 26462 23539 26868
12252B6868J5194K9678n2728q4675n6011K7279N7635j4763J0251j4393M8234L550
$$ 26868 42062 71740 19012 -65663 -121674 -94395 -36760 -51523 -41272 -55665 -7431 -3881
12240c881K3273j1113j1100O6074L4136k0687m1813o2457l5852M1089K2222K0880
$$ -3881 19392 8279 -2821 63253 97389 76702 34889 -27568 -63420 -22331 -109 20771
12228B0771k190O242j4997J2540M369m0831j5545l1359L9629K8744j6998J277
$$ 20771 18581 24823 9826 22366 26735 -14096 -29641 -61000 -21371 7373 -9625 -8348
12216h348M5797K5919m3976j5447j1334j9812L7878K5937l8748m0668L797J8201
$$ -8348 37449 63368 19392 3945 -7389 -27201 10677 36614 -2134 -42802 -39005 -20804
12204b0804J9670N5774M2981O991m9226l2150j2464j5385r266j8899l3922l3766
$$ -20804 -1134 54640 97621 104612 55386 23236 10772 -4613 -13879 -32778 -66700 -100466
12192a00466L355L5082J7423N187J0295o040j0328n40R012M0654P09j9691k5898
$$ -100466 -97111 -62029 -44606 -39419 -29124 -35164 -45492 -46032 -37020 3634 4343 -15348 -41246
12179d1246j3513J1438O1178J3598M9901N7042k5895m8590p0103k4709p763J956
$$ -41246 -54759 -43321 17857 31455 81356 138398 112503 63913 -6190 -30899 -38662 -36706
12167c6706L9708K8258r402k8224l3648j7446J9531J5552M4703O528m1852k6870
$$ -36706 3002 31260 21858 -6366 -40014 -57460 -37929 -22377 22326 28854 -12998 -39868
12155c9868M5120K0892M2396j7747j9288n9447J8409R7364O2560m5619p4497m2828
$$ -39868 5252 26144 68540 50793 31505 -27942 -9533 87831 150391 104772 30275 -12553
12143a2553j5399J0143J4593J2774l0393K5548J8048k1121j9276L4223n4183k0897
$$ -12553 -27952 -17809 -3216 9558 -20835 4713 22761 1640 -17636 16587 -37596 -58493
12131e8493N9756k0160l8470J913L4438L6870p289J1832Q721j4666k0089K853
$$ -58493 1263 -18897 -57367 -55454 -21016 15854 8565 20397 29118 14452 -5637 -2784
12119b784M7512K1525N03k4028k3152o299l9654o7950J6356L7635j0921l5315
$$ -2784 44728 66253 66756 42728 19576 13277 -26377 -94327 -77971 -40336 -51257 -86572
12107h6572r234J2106N0966k3996j5108L7343K206M2810P0249j1410n3300k2502
$$ -86572 -95806 -83700 -32734 -56730 -71838 -34495 -32289 10521 80770 69360 16060 -6442
12095f442K2168L573j9924j7282k8493l8281j6024J8903L9349M3621J1256l7643
$$ -6442 15726 19299 -625 -17907 -46400 -84681 -100705 -81802 -42453 1168 12424 -25219
12083b5219o842k4070L2568n740k2297L2767j2291j4755K8976K6144k3005O14
$$ -25219 -32061 -56131 -23563 -29303 -51600 -18833 -31124 -45879 -16903 9241 -13764 -13150
12071a3150P5827N6355j1442j3019j3909n4040K159J8206m7729l4855J1675l0935
$$ -13150 62677 119032 107590 94571 80662 26622 28781 46987 -742 -35597 -23922 -54857
12059e4857K1622Q0550R127K0977k7020J1496j8839n7660j8815J3343J9003K0490
$$ -54857 -33235 47315 56442 77419 50399 61895 43056 -14604 -33419 -20076 -1073 19417
12047A9417K5840k1119k4689m9487l595l1034m9159K6893K6451k1608L5947O0491
$$ 19417 45257 24138 -551 -50038 -53633 -84667 -133826 -106933 -80482 -102090 -66143 -5652
12035e652L5652O842l4395K451J8428J6806k2353m7810m3118j4989J7728J1251
$$ -5652 30000 36842 2447 4898 23326 40132 17779 -30031 -73149 -88138 -70410 -59159
12023e9159J7474J5994L744J1018L1281j8961r378L0308L0547q066J6102l7730
$$ -59159 -41685 -25691 -21947 -10929 20352 1391 -7987 22321 52868 44802 60904 23174
12011B3174m7614L7868L8385j6092m4574l1196L2269L6798J9547j7754K559K10
$$ 23174 -24440 13428 51813 35721 -8853 -40049 -7780 29018 48565 30811 33370 33580
11999C3580j877m8601r9583k0244N4307R1269K7852K8199k2748m2528l1866K0389
$$ 33580 31703 -16898 -116481 -136725 -82418 8851 36703 64902 42154 -374 -32240 -11851
11987a1851o324k9203k3075K7716K0185n536j811l312K193L642j0281m0502L2545
$$ -11851 -18175 -47378 -70453 -42737 -22552 -28088 -29899 -33211 -31018 -27376 -37657 -78159 -45614
$$ [...]
##END NTUPLES=NMR SPECTRUM
##END=
