##TITLE=Analysis number 319447
Compound Code cc 55413
Book Reference 440/190
Project Code adrs
Chemist Name craigr
##JCAMPDX= 6.0         $$ Bruker NMR JCAMP-DX V2.0
##DATA TYPE= NMR SPECTRUM
##DATA CLASS= NTUPLES
##ORIGIN= Bruker BioSpin GmbH
##OWNER= nmr
$$ XWIN-NMR		Version 3.5
$$ Tue May 16 08:34:15 2006 GMT Daylight Time (UT+1h)  MAYBRIDGE\nmr@NMR_250MHZ
##.OBSERVE FREQUENCY= 250.131544655141
##.OBSERVE NUCLEUS= ^1H
##.ACQUISITION MODE= SIMULTANEOUS (DQD)
##.ACQUISITION SCHEME= undefined
##.AVERAGES= 16
##.DIGITISER RES= 18
##SPECTROMETER/DATA SYSTEM= dpx250
##.PULSE SEQUENCE= zg30
##.SOLVENT NAME= CDCl3
##.SHIFT REFERENCE= (INTERNAL, CDCl3, 0, 16.522)
##AUDIT TRAIL= $$ (NUMBER, WHEN, WHO, WHERE, WHAT)
$$ ##TITLE= Audit trail, XWIN-NMR		Version 3.5
$$ ##JCAMPDX= 5.01
$$ ##ORIGIN= Bruker BioSpin GmbH
$$ ##OWNER= nmr
$$ C:\u/data/dgb/nmr/ADRS/4300/pdata/1/auditp.txt
$$ ##AUDIT TRAIL=  $$ (NUMBER, WHEN, WHO, WHERE, WHAT)
(   1,<2006-05-16 08:33:46.22 +100>,<MAYBRIDGE\nmr>,<NMR_250MHZ>,
      <created by zg, POWCHK disabled, PULCHK disabled
       configuration hash MD5:
       84 BC 41 DB A1 6E 1D 46 DA 25 12 A5 C1 ED C5 3A
       data hash MD5: 64K
       A3 8E 19 BF 20 80 78 63 55 66 71 D4 7C D8 DE 3F>)
(   2,<2006-05-16 08:34:04.11 +100>,<MAYBRIDGE\nmr>,<NMR_250MHZ>,
      <Start of raw data processing
       ef LB = 0.3 FT_mod = 6 PKNL = 1 SI = 32K 
       data hash MD5: 32K
       47 05 AD A5 EB 62 68 DD 5D 1F C0 07 69 A6 D9 39>)
(   3,<2006-05-16 08:34:05.88 +100>,<MAYBRIDGE\nmr>,<NMR_250MHZ>,
      <apk 
       data hash MD5: 32K
       8B DC EF F0 6B 6F C0 F6 2F 52 19 A3 D8 F4 8C 19>)
(   4,<2006-05-16 08:34:06.80 +100>,<MAYBRIDGE\nmr>,<NMR_250MHZ>,
      <abs ABSG = 5 
       data hash MD5: 32K
       7E 64 97 6B 6E 5C 6B AA 17 96 1B C7 08 CD 61 D8>)
$$ ##END=
$$ 
$$ hash MD5
$$ 6F 22 10 0F 05 9C CD DC 79 A0 A0 C5 D0 51 45 23
##$RELAX= 
##$RELAX= 
##$RELAX= 
##$RELAX= 
##$RELAX= 
##$RELAX= 
##$RELAX= 
$$ Bruker specific parameters
$$ --------------------------
##$DU= <C:\u>
##$EXPNO= 4300
##$NAME= <ADRS>
##$PROCNO= 1
##$TYPE= <nmr>
##$USER= <dgb>
##$AMP= (0..31)
100 100 100 100 100 100 100 100 100 100 100 100 100 100 100 100 100 100 
100 100 100 100 100 100 100 100 100 100 100 100 100 100 
##$AQSEQ= 0
##$AQ_mod= 3
##$AUNM= <au_zg>
##$AUTOPOS= <1 >
##$BF1= 250.13
##$BF2= 250.13
##$BF3= 250.13
##$BF4= 250.13
##$BF5= 500.13
##$BF6= 500.13
##$BF7= 500.13
##$BF8= 500.13
##$BYTORDA= 1
##$CFDGTYP= 0
##$CFRGTYP= 5
##$CHEMSTR= <none>
##$CNST= (0..31)
1 1 145 1 1 1 1 1 1 1 1 1 1 1 1 1 1 1 1 1 1 1 1 1 1 1 1 1 1 1 1 1 
##$CPDPRG= <>
##$CPDPRG1= <>
##$CPDPRG2= <>
##$CPDPRG3= <>
##$CPDPRG4= <mlev>
##$CPDPRG5= <mlev>
##$CPDPRG6= <mlev>
##$CPDPRG7= <mlev>
##$CPDPRG8= <mlev>
##$CPDPRGB= <>
##$CPDPRGT= <>
##$D= (0..31)
0 1 0 0 0 0 0 0 0 0.06 0 0 0 0 0 0 0.0002 0 0 0 0 0 0 0 0 0 0 0 0 0 0 
0 
##$DATE= 1147764824
##$DBL= (0..7)
120 120 120 120 120 120 120 120 
##$DBP= (0..7)
150 150 150 150 150 150 150 150 
##$DBP07= 0
##$DBPNAM0= <>
##$DBPNAM1= <>
$$ [...]
##$SUBNAM7= <"">
##$SUBNAM8= <"">
##$SUBNAM9= <"">
##$SW= 20.6930455092707
##$SWIBOX= (0..15)
0 0 3 0 0 0 0 0 0 0 0 0 0 0 0 0 
##$SW_h= 5175.983436853
##$TD= 65536
##$TD0= 1
##$TE= 295.16
##$TE2= 300
##$TE3= 300
##$TEG= 300
##$TL= (0..7)
0 120 120 120 120 120 120 120 
##$TP= (0..7)
150 150 150 150 150 150 150 150 
##$TP07= 0
##$TPNAME0= <>
##$TPNAME1= <>
##$TPNAME2= <>
##$TPNAME3= <>
##$TPNAME4= <>
##$TPNAME5= <>
##$TPNAME6= <>
##$TPNAME7= <>
##$TPOAL= (0..7)
0.5 0.5 0.5 0.5 0.5 0.5 0.5 0.5 
##$TPOFFS= (0..7)
0 0 0 0 0 0 0 0 
##$TUNHIN= 0
##$TUNHOUT= 0
##$TUNXOUT= 0
##$USERA1= <user>
##$USERA2= <user>
##$USERA3= <user>
##$USERA4= <user>
##$USERA5= <user>
##$V9= 5
##$VALIST= <valist>
##$VCLIST= <CCCCCCCCCCCCCCC>
##$VD= 0
##$VDLIST= <DDDDDDDDDDDDDDD>
##$VPLIST= <PPPPPPPPPPPPPPP>
##$VTLIST= <TTTTTTTTTTTTTTT>
##$WBST= 1024
##$WBSW= 4
##$XGAIN= (0..3)
0 0 0 0 
##$XL= 0
##$YL= 0
##$YMAX_a= 499545
##$YMIN_a= -449131
##$ZGOPTNS= <>
##$ZL1= 120
##$ZL2= 120
##$ZL3= 120
##$ZL4= 120
##$ABSF1= 16.522
##$ABSF2= -4.171173
##$ABSG= 5
##$ABSL= 3
##$ALPHA= 0
##$AQORDER= 0
##$ASSFAC= 0
##$ASSFACI= 0
##$ASSFACX= 0
##$ASSWID= 0
##$AUNMP= <proc_1d>
##$AZFE= 0.1
##$AZFW= 0.1
##$BCFW= 0
##$BC_mod= 0
##$BYTORDP= 0
##$COROFFS= 0
##$CY= 12.5
##$DATMOD= 1
##$DC= 0
##$DFILT= <>
##$DTYPP= 0
##$F1P= 14.0000005364418
##$F2P= -0.99999901652339
##$FCOR= 0.5
##$FTSIZE= 32768
##$FT_mod= 6
##$GAMMA= 0
##$GB= 0
##$INTBC= 1
##$INTSCL= 1
##$ISEN= 128
##$LB= 0.3
##$LEV0= 0
##$LPBIN= 0
##$MAXI= 10000
##$MC2= 0
##$MEAN= 0
##$ME_mod= 0
##$MI= 0
##$NCOEF= 0
##$NC_proc= -3
##$NLEV= 6
##$NOISF1= 0
##$NOISF2= 0
##$NSP= 0
##$NTH_PI= 0
##$NZP= 0
##$OFFSET= 16.522
##$PC= 1
##$PHC0= 14.08732
##$PHC1= 5.324521
##$PH_mod= 1
##$PKNL= yes
##$PPARMOD= 0
##$PSCAL= 4
##$PSIGN= 0
##$REVERSE= no
##$SF= 250.13
##$SI= 32768
##$SIGF1= 0
##$SIGF2= 0
##$SINO= 400
##$SIOLD= 32768
##$SREGLST= <1H.CDCl3>
##$SSB= 0
##$STSI= 32768
##$STSR= 0
##$SW_p= 5175.98343685301
##$SYMM= 0
##$S_DEV= 0
##$TDeff= 65536
##$TDoff= 0
##$TI= <Analysis number 999999
Compound Code 99
Book Reference 9
Project Code 9>
##$TILT= no
##$TM1= 0
##$TM2= 0
##$TOPLEV= 0
##$USERP1= <user>
##$USERP2= <user>
##$USERP3= <user>
##$USERP4= <user>
##$USERP5= <user>
##$WDW= 1
##$XDIM= 32768
##$YMAX_p= 333212768
##$YMIN_p= -220193
$$ End of Bruker specific parameters
$$ ---------------------------------
##NTUPLES= NMR SPECTRUM
##VAR_NAME=  FREQUENCY,     SPECTRUM/REAL,   SPECTRUM/IMAG
##SYMBOL=    X,             R,               I
##VAR_TYPE=  INDEPENDENT,   DEPENDENT,       DEPENDENT
##VAR_FORM=  AFFN,          ASDF,            ASDF
##VAR_DIM=   32768,         32768,           32768
##UNITS=     HZ,            ARBITRARY UNITS, ARBITRARY UNITS
##FACTOR=    0.157963299565203, 1,           1
##FIRST=     4132.6476996994, 0,             0
##LAST=      -1043.33573715361, 0,           0
##MIN=       -1043.33573715361, -220193,     0
##MAX=       4132.6476996994, 333212768,     0
$$ Real data points
##PAGE= N=1
##DATA TABLE= (X++(R..R)), XYDATA
$$ [...]
$$ plain form
16604 1391111 1521035 1683481 1848018 2017108 2199036 2393752 2620185 2907352 3259207
16595 3259207 3731834 4395925 5355345 6790746 8951104 12107513 16635345 22521309 29500158
16586 29500158 37608940 45348251 51775223 57057244 58978365 58200337 56093765 51822308
16578 51822308 47740952 45357661 44596461 46150501 50138354 54974030 59227372 62955387
16570 62955387 63887103 61770306 58163274 51905746 44597205 37797468 31231442 25816713
16562 25816713 21776205 18753068 16590129 15047727 13893956 12983190 12237186 11608491
16554 11608491 11075802 10616160 10209274 9848603 9517503 9199978 8877995 8546205 8208200
16545 8208200 7872291 7559314 7268470 6999475 6761612 6567115 6404209 6242485 6080693
$$ packed form
16604A391111J29924J62446J64537J69090J81928J94716K26433K87167L51855
16595C259207M72627O64091R59420J435401K160358L156409M527832N885964O978849
16586B9500158Q108782P739311O426972N282021J921121p78028k106572m271457
16578E1822308m081356k383291p61200J554040L987853M835676M253342L728015
16570F2955387R31716k116797l607032o257528p308541o799737o566026n414729
16562B5816713m040508l023137k162939j542402j153771r10766p46004o28695
16554A1608491n32689m59642m06886l60671l31100l17525l21983l31790l38005
16545H208200l35909l12977k90844k68995k37863j94497j62906j61724j61792
$$ plain form
16536 6080693 5916451 5744206 5568485 5381932 5182700 4992484 4807390 4635209 4481946
16527 4481946 4342888 4206869 4088051 3971147 3854839 3755756 3671094 3574270 3475301 3379003
16517 3379003 3291280 3216023 3134637 3047222 2964626 2886938 2811927 2739548 2669320 2603178 2537615
16506 2537615 2468389 2404575 2338235 2280148 2225373 2168835 2112277 2066464 2019289 1968362 1929927
16495 1929927 1883114 1838543 1807664 1764060 1722416 1680463 1641585 1599223 1550181 1515869 1481655
16484 1481655 1448185 1415978 1375111 1339733 1309158 1272170 1242179 1205234 1169600 1146541 1126660
16473 1126660 1099655 1060860 1029470 1002523 975348 948360 921389 897707 871783 846406 829061
16462 829061 817699 807786 793832 778032 761999 747830 726512 708659 698311 684243 667219 647396
$$ packed form
16536F080693j64242j72245j75721j86553j99232j90216j85094j72181j53263
16527D481946j39058j36019j18818j16904j16308r9083q4662r6824r8969r6298
16517C379003q7723p5257q1386q7415q2596p7688p5011p2379p0228o6142o5563
16506B537615o9226o3814o6340n8087n4775n6538n6558m5813m7175n0927l8435
16495A929927m6813m4571l0879m3604m1644m1953l8878m2362m9042l4312l4214
16484A481655l3470l2207m0867l5378l0575l6988k9991l6945l5634k3059j9881
16473A126660k7005l8795l1390k6947k7175k6988k6971k3682k5924k5377j7345
16462H29061j1362r913j3954j5800j6033j4169k1318j7853j0348j4068j7024j9823
$$ plain form
16450 647396 633877 621648 613186 609195 606305 607311 601602 583207 564922 549444 534109 522768
16438 522768 508000 485450 478365 464468 448740 433443 412247 396848 387059 375821 364058 349370
16426 349370 335914 324534 315385 305961 291790 274756 256145 243258 223376 209497 201736 197343
16414 197343 193777 187932 187827 181457 170070 165815 161502 159013 150459 143236 137820 130678 126227 123161
16400 123161 120659 116128 107761 100844 97760 103247 101907 99867 93099 93100 91838 90553 98619 101624 98017
16385 98017 97868 97935 97069 97595 99338 96248 97004 104904 107596 102205 98429 93794 98352 107806 109347 99081
16369 99081 96943 101192 104853 104964 104082 104650 99783 84142 82260 85670 89532 90269 92757 92788 87547 89545
16353 89545 85655 78073 73967 73446 69968 68747 65100 58011 58582 55918 53262 53798 53710 58574 59045 55910
$$ packed form
16450F47396j3519j2229q462l991k890J006n709j8395j8285j5478j5335j1341
16438E22768j4768k2550p085j3897j5728j5297k1196j5399r789j1238j1763j4688
16426C49370j3456j1380r149r424j4171j7034j8611j2887j9882j3879p761m393
16414A97343l566n845j05o370j1387m255m313k489q554p223n416p142m451l066
16400A23161k502m531q367o917l084N487j340k040o768Jj262j285Q066L005l607
16385I8017j49O7q66N26J743l090P56P900K692n391l776m635M558R454J541j0266
16369I9081k138M249L661J11q82N68m867j5641j882L410L862P37K488L1n241J998
16353H9545l890p582m106n21l478j221l647p089N71k664k656N36q8M864M71l135
$$ plain form
16337 55910 63065 64564 62273 64043 60848 53487 51697 53953 50960 53519 60769 56227 54129 49458
16323 49458 45277 44549 42153 44102 46385 55379 63798 64893 56529 50017 50668 55472 54700 55274 62904
16308 62904 64793 50589 47297 53417 46460 43735 46193 48556 52595 51951 46405 40632 38001 31460
16294 31460 33342 31963 30326 29822 28325 24191 22993 27334 26104 20956 12661 8167 12879 19068 10630
16279 10630 9933 15119 14284 10475 14363 15338 14584 17004 20245 19467 15395 19306 20038 21307 19256 19642
16263 19642 19932 25919 35343 35178 31468 35738 35295 25902 24876 26601 33336 39576 41042 40328 42662
16248 42662 43144 38003 41278 51289 60304 52710 46108 39225 45707 53201 69048 72254 74424 87109
16234 87109 95850 95561 94431 92861 87154 88395 90763 82226 81741 86696 94329 104619 110403 116126 108757
$$ packed form
16337E5910P155J499k291J770l195p361j790K256k993K559P250m542k098m671
16323D9458m181p28k396J949K283Q994Q419J095q364o512O51M804p72N74P630
16308F2904J889j4204l292O120o957k725K458K363M039o44n546n773k631o541
16294C1460J882j379j637n04j497m134j198M341j230n148q295m494M712O189q438
16279A0630o97N186q35l809L888R75p54K420L241p78m072L911P32J269k051L86
16263A9642K90N987R424j65l710M270m43r393j026J725O735O240J466p14K334
16248D2662M82n141L275J0011R015p594o602o883O482P494J5847L206K170J2685
16234H7109Q741k89j130j570n707J241K368q537m85M955P633J0290N784N723p369
$$ plain form
16219 108757 104454 100499 95359 97848 107356 114437 116815 137173 168021 208668 255516 317790 383298
16206 383298 436569 467878 464089 447079 402208 340250 278539 223723 184703 157785 132864 122047
16194 122047 112679 96623 84972 79775 73753 68034 69461 72343 75980 71432 67794 59911 58747 59285
16180 59285 52634 45734 38656 36777 39522 37244 40445 41606 42918 46389 45985 42559 40232 34772 30082
16165 30082 26086 24757 26184 27802 29390 29426 27680 25959 32164 31778 25427 20897 20677 24420 27934
16150 27934 35403 42959 33329 17642 11120 12733 15216 19037 10329 16593 20791 17040 11607 12257
16136 12257 11652 11674 9236 2506 3238 11646 6555 4036 10664 12110 6370 6986 7370 9575 6971 9574
16120 9574 10159 3878 4623 5413 4771 7485 7557 1693 -1931 -2894 -1346 -1358 5581 7795 5820 10971 8791
$$ packed form
16219A08757m303l955n140K489R508P081K378K0358L0848M0647M6848O2274O5508
16206C83298N3271L1309l789j7010m4871o1958o1711n4816l9020k6918k4921j0817
16194A22047r368j6056j1651n197o022n719J427K882L637m548l638p883j164N38
16180E9285o651o900p078j879K745k278L201J161J312L471m04l426k327n460m690
16165C0082l996j329J427J618J588L6j746j721O205l86o351m530k20L743L514
16150B7934P469P556r630j5687o522J613K483L821q708O264M198l751n433O50
16136A2257o05K2k438o730P32Q408n091k519O628J446n740O16L84K205k604K603
16120I574N85o281P45P90o42K714P2n864l624r63J548j2O939K214j975N151k180
$$ plain form
16103 8791 1704 -1822 -1537 -3260 2131 9683 11125 7443 505 3452 2990 9179 20375 14456 8235
16088 8235 6285 8274 3872 -1241 653 7830 8559 10607 17924 20956 18695 12774 9473 10526 8317
16073 8317 5358 3554 9178 16955 11740 5082 3212 5898 7565 5723 6098 6137 4709 4454 6190 6526
16057 6526 10390 12115 14374 12632 13735 22374 19547 13860 13444 28670 36626 34372 41782 56525
16043 56525 75084 97729 127494 165515 202718 237949 275814 309929 316367 308641 302283 288109
16031 288109 270970 260324 259837 262382 279595 305344 324288 345186 353977 341130 315015 286550
16019 286550 245610 210150 173804 145578 130722 122554 110418 92958 83072 76716 75400 70898
16007 70898 68107 68162 63909 57486 61622 58505 49174 47294 54328 52498 46201 41771 37677 40443 41311
$$ packed form
16103H791p087l526K85j723N391P552J442l682o938K947m62O189J1196n919o221
16088H235j950J989m402n113J894P177P29K048P317L032k261n921l301J053k209
16073H317k959j804N624P777n215o658j870K686J667j842L75L9j428k55J736L36
16057F526L864J725K259j742J103Q639k827n687m16J5226P956k254P410J4743
16043E6525J8559K2645K9765L8021L7203L5231L7865L4115O438p726o358j4174
16031B88109j7139j0646m87K545J7213K5749J8944K0898Q791j2847k6115k8465
16019B86550m0940l5460l6346k8226j4856q168j2136j7460r886o356j316m502
16007G0898k791N5m253o423M136l117r331j880P034j830o297m430m094K766Q68
$$ plain form
15992 41311 44483 40236 38523 31638 30228 30172 31716 24097 14313 9345 3598 12330 19332 16969 14887
15977 14887 23861 27630 26549 28297 18568 14307 19541 19586 21418 25333 22639 13888 8476 2879 -1563
15962 -1563 7377 16474 15157 13906 9902 5805 6709 7183 10355 7644 3835 855 8403 8895 7226
15947 7226 10121 9951 7242 866 2448 4838 7246 11779 17074 17921 16123 16430 10538 2601 3791
15932 3791 1861 -6392 -7463 -6714 -5719 -2272 -7657 -5273 -5392 -5882 2125 11898 13083 9825 436 -4144
15916 -4144 2394 7790 10574 9724 9814 6701 11765 12877 13825 13532 10367 9028 8977 10772 4784 74
15900 74 -5499 -6253 -2735 -3574 -1284 5845 -2093 -6158 -2053 -8016 -9895 -12181 -11042 -7721 -2377 -3803
15884 -3803 -9840 -8773 -11488 -7354 -3696 661 -236 1994 -3166 -7601 -6937 1246 894 -3642 -6163
$$ packed form
15992D1311L172m247j713o885j410n6J544p619r784m968n747Q732P002k363k082
15977A4887Q974L769j081J748r729m261N234M5J832L915k694q751n412n597m442
15962a563Q940R097j317j251m004m097R04M74L172k711l809k980P548M92j669
15947G226K895j70k709o376J582K390K408M533N295Q47j798L07n892p937J190
15932C791j930q253j071P49R95L447n385K384j19m90Q007R773J185l258r389m580
15916d144O538N396K784q50R0l113N064J112R48k93l165j339n1J795n988m710
15900G4n573p54L518q39K290P129p938m065M105n963j879k286J139L321N344j426
15884c803o037J067k715M134L658M357q97K230n160m435O64Q183l52m536k521
$$ plain form
15869 -6163 504 12217 9557 14336 9048 5084 8374 9785 5461 1236 2526 -247 -5482 -7986
15855 -7986 -1821 4653 9176 12765 19655 18964 15653 11095 12114 12070 6048 2760 -703 -4666 -7988
15840 -7988 -3047 1798 2595 984 2132 2851 5023 7786 8341 866 -503 -2293 -1501 -10747 -8719 1423
15824 1423 12398 6027 -3755 -5893 -11281 -17456 -18259 -5875 -1558 -6804 -7580 -2116 813 327 7013
15809 7013 5365 2380 990 -741 -497 -2869 -3318 -7468 -7343 -7345 -13048 -16259 -12366 -10741 -13698 -12412
15793 -12412 -11610 -12043 -8180 -6186 -4173 -8089 -1823 -1216 -5263 -5570 -1114 -1197 -3966 -488 210 5032
15777 5032 2240 -5979 -8242 -8296 -5709 2792 6865 -693 -5987 -8536 -11812 -6261 1707 -1281 1137
15762 1137 2984 -2042 323 -1131 873 3603 7797 9696 719 -1225 913 -477 -2147 -340 -2453
$$ packed form
15869f163O667J1713k660M779n288l964L290J411m324m225J290k773n235k504
15855g986O165O474M523L589O890o91l311m558J019m4o022l288l463l963l322
15840g988M941M845P97j611J148P19K172K763N55p475j369j790P92r246K028J0142
15824A423J0975o371r782k138n388o175q03J2384M317n246p76N464K929m86O686
15809G013j648k985j390j731K44k372m49m150J25kn703l211L893J625k957J286
15793a2412Q02m33L863J994K013l916O266O07m047l07M456q3k769L478O98M822
15777E032k792q219k263n4K587Q501M073p558n294k549l276N551P968k988K418
15762A137J847n026K365j454K004K730M194J899q977j944K138j390j670J807k113
$$ plain form
15747 -2453 -13102 -13050 -14339 -17057 -13441 -11603 -11508 -9009 -8847 -10519 -13007 -15684 -13424 -786 -2266
15732 -2266 761 4026 3042 637 5099 -1447 -6685 -9328 -4899 -2460 -3161 -3575 -3347 -2569 1115 -1097
15716 -1097 -1898 -2033 3078 2744 -1905 -609 3520 7680 8233 2577 1206 1748 -875 -5850 -6249 760
15700 760 8223 10113 8672 1545 -9603 -6561 -2034 -634 -4746 -5538 -10016 -3546 2414 -3158 -506
15685 -506 -573 -1636 -4865 2224 6563 -481 -5202 43 -4472 1887 2682 -1799 -10772 -12415 -17055 -16643
15669 -16643 -17534 -12866 -6022 1250 328 -4254 -8139 -11483 -13932 -18596 -20674 -12884 -12721 -9295 -4787
15654 -4787 -2947 -1298 -1754 -2928 -9691 -7020 -1025 45 1204 1501 -8089 -6131 -5977 -9251 -11131
15639 -11131 -15422 -12446 -6056 -3817 5921 8338 2993 566 -1591 -459 -3398 86 2263 -987
$$ packed form
15747b453j0649N2j289k718L616J838R5K499J62j672k488k677K260J2638j480
15732b266L027L265r84k405M462o546n238k643M429K439p01m14K28P78L684k212
15716a097q01j35N111l34m649J296M129M160N53n656j371N42k623m975l99P009
15700G60P463J890j441p127j1148L042M527J400m112p92m478O470N960n572K652
15685e06o7j063l229P089M339p044m721N245m515O359P95m481q973j643m640M12
15669a6643q91M668O844P272r22m582l885l344k449m664k078P790J63L426M508
15654d787J840J649m56j174o763K671N995J070J159K97r590J958J54l274j880
15639a1131m291K976O390K239R738K417n345k427k157J132k939L484K177l250
$$ plain form
15625 -987 -1239 5183 1667 1376 163 -3421 -2671 -905 -3472 -4360 -8442 -6812 -6397 -702 8382 9147
15609 9147 4819 5947 10896 14558 13174 15289 11943 7781 7629 1106 565 3516 1426 -9204 -16651
15594 -16651 -15437 -15820 -13891 -7135 -2577 355 5893 -2820 -12626 -16392 -6421 -840 307 2471 9051
15579 9051 12872 9066 6564 6297 9595 10785 9221 3767 3896 1513 -1493 -6232 -9810 -13416 -10589
15564 -10589 -10402 -10515 -12057 -10991 -9710 -4988 -7713 -3980 -6389 -8951 -8637 -5529 -4690 -6804 -4072
15549 -4072 -4969 -7284 -7076 -8818 -8314 -4233 -4470 -6671 -6053 -7957 -13901 -15144 -13507 -3719 -2248 -6517
15533 -6517 -8156 -7140 -5533 -4153 -5643 -9021 -10717 -11084 -9210 -7450 -1332 3243 2772 5267 4767
15518 4767 312 2181 396 -4877 -6097 -2893 -2088 -3189 -3350 858 -3193 -3236 1747 7544 1969 -8593
$$ packed form
15625i87k52O422l516k91j213l584P50J766k567q88m082J630M15N695R084P65
15609I147m328J128M949L662j384K115l346m162j52o523n41K951k090j0630p447
15594a6651J214l83J929O756M558K932N538q713r806l766R971N581J147K164O580
15579I051L821l806k502k67L298J190j564n454J29k383l006m739l578l606K827
15564a0589J87j13j542J066J281M722k725L733k409k562L14L108Q39k114K732
15549d072q97k315K08j742N04M081k37k201O18j904n944j243J637R788J471m269
15533f517j639J016J607J380j490l378j696l67J874J760O118M575m71K495n00
15518D767m455J869j785n273j220L204Q05j101j61M208m051m3M983N797n575j0562
$$ plain form
15502 -8593 -16248 -15964 -10597 -16118 -14856 -12666 -13457 -14853 -13637 -15016 -10301 -9138 -6641 -3772 -14548
15487 -14548 -16976 -14717 -16628 -13374 -16376 -10647 -8399 -8138 -4478 -5949 -6289 -10430 -10737 -36 7354
15472 7354 9821 6195 4860 6961 1823 -3640 -10168 -5510 2603 3087 4480 -804 1208 1534 -473
15457 -473 -2380 6160 2376 -2092 5855 4884 -3967 -10385 -8773 -8805 -7453 -6806 -8504 -6810 -3575 -2319
15441 -2319 -108 7271 5303 8398 7190 4131 -5504 -8894 -8544 -9032 -10800 -17178 -12513 -10467 -10330
15426 -10330 -7083 -7964 -6116 545 5271 8694 6293 3448 3903 -1726 -3415 -965 -3321 -9105 -13325
15411 -13325 -9046 224 4117 3021 -2011 -7037 -5468 -7226 -7582 -8581 -15973 -19107 -13295 -10284 -11383
15396 -11383 -14698 -14560 -13983 -9563 -8705 -8619 -6518 -92 -4782 -13658 -20144 -15601 -13120 -10235 -6309 -6893
$$ packed form
15502h593p655K84N367n521J262K190p91j396J216j379M715J163K497K869j0776
15487a4548k428K259j911L254l002N729K248K61L660j471l40m141l07J0701P390
15472G354K467l626j335K101n138n463o528M658Q113M84J393n284K012L26k007
15457d73j907Q540l784m468P947r71q851o418J612l2J352O47j698J694L235J256
15441b319K211P379j968L095j208l059r635l390L50m88j768o378M665K046J37
15426a0330L247q81J848O661M726L423k401k845M55n629j689K450k356n784m220
15411a3325M279R270L893j096n032n026J569j758l56r99p392l134N812L011j099
15396a1383l315J38N77M420Q58Q6K101O426m690q876o486M543K481K885L926n84
$$ plain form
15380 -6893 -7364 -4712 1179 620 -4974 -10568 -7040 -10625 -10008 -11372 -11245 -12611 -7061 -3885 -2076 -4861
15364 -4861 539 2187 -2852 -5538 -11949 -7804 -5101 -10288 -11500 -12066 -14132 -16448 -14309 -8626 -3885
15349 -3885 -482 5051 3220 3220 364 9 -3705 -6729 -2717 -2002 -7405 -8450 -6843 623 7296 7680
15333 7680 4634 3212 -3676 -1092 767 -2003 -2504 515 -3947 -9855 -5144 -5884 -12055 -16856 -20485
15318 -20485 -14108 -316 -1610 -5821 -12018 -5816 -2953 -1017 -1265 -4559 -5938 -1011 -1135 1064 -642
15303 -642 -9140 -12112 -16554 -16421 -16707 -15746 -10245 -4615 -5918 -8996 -7421 -7888 -5723 -5626 -10515 -12365
15287 -12365 -10331 -13322 -11958 -6543 -3243 -1685 -9717 -16311 -12533 -11740 -2962 4119 3904 2791 1484
15272 1484 -8613 -8991 -12152 -17275 -23955 -20425 -14652 -15970 -9718 -3759 -8004 -11264 -8885 -8296 -7945
$$ packed form
15380f893m71K652N891n59n594n594L528l585O17j364J27j366N550L176J809k785
15364d861N400J648n039k686o411M145K703n187j212n66k066k316K139N683M741
15349c885L403N533j831%k856l55l714l024M012P15n403j045J607P466O673L84
15333G680l046j422o888K584J859k770n01L019m462n908M711p40o171m801l629
15318b0485O377J3792j294m211o197O202K863J936k48l294j379M927j24K199j706
15303f42q498k972m442J33k86R61N501N630j303l078J575m67K165R7m889j850
15287a2365K034k991J364N415L300J558q032o594L778P93Q778P081k15j113j307
15272A484j0097l78l161n123o680L530N773j318O252N959m245l260K379N89L51
$$ plain form
15257 -7945 -13169 -14809 -12043 -13699 -14104 -15347 -11691 -7447 -10279 -15410 -18934 -23243 -22992 -27950 -27247
15242 -27247 -16485 -9256 -8731 -9816 -4593 897 -3334 -3644 -2691 -5267 -9844 -14138 -15999 -12038 -6801
15227 -6801 -2296 2893 5324 3830 -4198 -6737 -3004 -5065 -9382 -4681 2449 3421 6 -650 -4586
15212 -4586 -5524 439 -1168 -4824 -7380 -4243 -5398 -5548 -4914 1001 3217 -6689 -9042 -3104 739
15197 739 4649 5197 -1916 -4290 -10044 -14973 -10626 -5952 -6059 -5674 -2128 1228 6525 7704 9304 12252
15181 12252 16183 16521 17594 15275 15651 15302 14279 7093 9828 15048 22626 23202 18552 16776 12728
15166 12728 7028 5427 2286 773 462 1709 1259 -4582 2306 2564 -4819 -11161 -8160 -8323 -2977
15151 -2977 -822 3695 4123 2961 5456 2413 -1172 -2248 -4923 -6375 -2021 225 1314 -5779 -21836
$$ packed form
15257g945n224j640K766j656m05j243L656M244k832n131l524m309K51m958P03
15242b7247J0762P229N25j085N223N490m231l10R53k576m577m294j861L961N237
15227f801M505N189K431j494q028k539L733k061m317M701P130R72l415o56l936
15212d586r38N963j607l656k556L137j155j50O34N915K216r906k353N938L843
15197G39L910N48p113k374n754m929M347M674j07L85L546L356N297J179J600K948
15181A2252L931L38J073k319L76l49j023p186K735N220P578N76m650j776m048
15166A2728n700j601l141j513l11J247m50n841O888K58p383o342L001j63N346
15151b977K155M517M28j162K495l043l585j076k675j452M354K246J089p093j6057
$$ plain form
15136 -21836 -22743 -13408 -13632 -14791 -12573 -4700 -2758 -317 -2264 -8409 -15879 -15603 -10326 -3211 3621
15121 3621 2581 -3404 -5345 -6861 -3510 -2750 -7241 -8299 -6428 -3510 102 -361 -4180 -9489 -11683
15106 -11683 -5434 -671 -2808 -3025 -1590 1356 -3764 -3764 -6665 -3702 -888 313 477 -2130 -4296 -1194
15090 -1194 -2068 -6199 -11449 -7146 -1100 -122 -4947 -7260 -4933 -5028 -6255 -6990 -6434 -4547 -686 2708
15074 2708 8774 17329 25688 31139 27280 20622 22163 19569 19171 13629 7612 12330 17243 28921 30538
15059 30538 28443 26509 22519 13115 6538 7817 10902 16981 21647 17917 12667 15132 15478 9271 12875
15044 12875 19211 15066 12920 14486 12044 7485 7930 9759 10949 6313 4413 -319 -5723 -3177 4001
15029 4001 6250 3372 -746 -280 -6847 -5082 285 745 -3577 -581 -711 -5953 -7341 -7880 -6855 -4143
$$ packed form
15136b1836r07R335k24j159K218P873J942K441j947o145p470K76N277P115O832
15121C621j040n985j941j516L351P60m491j058J871K918L612m63l819n309k194
15106a1683O249M763k137k17J435K946n120%k901K963K814J201J64k607k166L102
15090a194q74m131n250M303O046R78m825k313K327r5j227p35N56J887L861L394
15074B708O066Q555Q359N451l859o658J541k594l98n542o017M718M913J1678J617
15059C0538k095j934l990r404o577J279L085O079M666l730n250K465L46o207L604
15044A2875O336m145k146J566k442m559M45J829J190m636j900m732n404K546P178
15029D001K249k878m118M66o567J765N367M60m322K996j30n242j388n39J025K712
$$ plain form
15013 -4143 -2591 -1406 -2915 -4633 -402 -2111 -4006 -5132 -7255 -7560 -3538 -1282 5782 6659 3023
14998 3023 -2763 -5406 -4349 -4303 995 3125 -3562 -9981 -11421 -9564 -2227 -8341 -17584 -15487 -6284
14983 -6284 -7690 -13094 -8433 -6869 -13571 -10986 -10995 -13947 -10569 -6209 -1016 -3261 -5599 -5943 -9357 -3598
14967 -3598 691 152 -1523 -2956 -7469 -11711 -12704 -8456 -9812 -7949 4028 6791 2923 2184 3655
14952 3655 5477 -101 2420 10114 17090 28588 35235 34010 25637 15793 2070 2971 6027 5362 7340
14937 7340 4180 2059 -142 4866 9964 8274 1657 1608 1512 -7986 -10920 -9509 -4460 -7082 -10910 -11693
14921 -11693 -5901 -1801 257 5092 -935 -1964 -636 -2333 -12005 -14651 -10125 -9863 -8227 -3758 -1880
14906 -1880 -3760 -2862 -6601 -9730 -9369 -12041 -11893 -11806 -7507 -5388 -4507 -8436 -1647 2259 -5431 -4877
$$ packed form
15013d143J552J185j509j718M231j709j895j126k123l05M022K256P064Q77l636
14998C023n786k643J057M6N298K130o687o419j440J857P337o114r243K097R203
14983f284j406n404M661J564o702K585rk952L378M360N193k245k338l44l414N759
14967c598M289n39j675j433m513m242r93M248j356J863J1977K763l868p39J471
14952C655J822n578K521P694O976J1498O647j225q373r844j3723R01L056o65J978
14937G340l160k121k201N008N098j690o617m9r6r498k934J411N049k622l828p83
14921a1693N792M100K058M835o027j029J328j697r672k646M526K62J636M469J878
14906a880j880Q98l739l129L61k672J48Q7M299K119Q81l929O789L906p690N54
$$ plain form
14890 -4877 -2992 -2882 -7562 -16416 -21122 -13274 -6281 -8858 -6601 -1242 -960 -9453 -7773 -3618 -4187
14875 -4187 -5340 -6874 -7355 -3158 -431 -2993 -342 -5191 -5555 -5750 -7975 -2381 -5196 -7613 -7013 -7944
14859 -7944 -12741 -19123 -12812 -13991 -10151 -8517 -3587 763 -2761 -6821 -13730 -12921 -11678 -15508 -21659
14844 -21659 -15163 -11375 -9444 -15248 -18916 -12284 -13460 -8854 -8932 -13599 -5406 -3464 -397 645 -801
14829 -801 1723 5795 1965 -10387 -7304 -5573 -4924 1093 -4061 -9958 -10443 -10795 -9927 -11454 -16562 -9890
14813 -9890 -6611 -8122 -10662 -2842 -2257 -3485 -508 2151 2987 1128 -3657 -9020 -4219 -1601 -8114
14798 -8114 -11626 -8112 -4977 -9951 -8175 -3598 -6002 -7998 -11846 -10456 -15279 -13986 -2755 2461
14784 2461 -1321 -421 -6614 -9684 -5329 -5608 -5326 16 -3899 -11697 -8296 -6819 -7112 -10502 -11797 -11974
$$ packed form
14890d877J885J10m680q854m706P848O993k577K257N359K82q493J680M155n69
14875d187j153j534m81M197K727k562K651m849l64j95k225N594k815k417O00r31
14859g944m797o382O311j179L840J634M930M350l524m060o909Q09J243l830o151
14844b1659O496L788J931n804l668O632j176M606p8m667Q193J942L067J042j446
14829h01K524M072l830j2352L083J731O49O017n154n897m85l52Q68j527n108O672
14813i890L279j511k540P820N85j228K977K659Q36j859m785n363M801K618o513
14798h114l512L514L135m974J776M577k404j996l848J390m823J293J1231N216
14784B461l782R00o193l070M355k79K82N342l915p798L401J477k93l390j295j77
$$ plain form
14768 -11974 -7870 -9332 -4750 -4893 -5825 -6579 -6283 -5269 -1234 -8076 -10149 2958 6186 2504 141
14753 141 -10123 -6249 134 1233 -5652 -6448 101 2679 1959 -240 -598 2819 -697 2996 5417
14738 5417 1885 4097 8020 641 -1363 -4272 -9086 -7033 -3864 866 -2854 -9337 -10432 -13062 -18528
14723 -18528 -10041 -7120 -14455 -12952 -16394 -16610 -16109 -14453 -10803 -10559 -8276 -6342 -17894 -15199 -15995
14708 -15995 -20427 -15710 -9473 -8769 -7370 -5616 -5054 -6064 -7827 -10119 -15285 -18812 -16900 -12858 -19280
14693 -19280 -11182 -7475 -8787 -7585 -5781 -10801 -17315 -16712 -5037 -4835 -5727 -2507 -426 -3124 -2409
14678 -2409 -3592 -613 -3117 -5840 -11104 -12976 -18105 -14997 -10169 -8938 -3905 -1969 -2275 -9459 -14352
14663 -14352 -21392 -23458 -18811 -7628 3356 5227 4664 2064 -527 -5678 -10436 -10409 -10508 -5748 -1435
$$ packed form
14768a1974M104j462M582j43r32p54K96J014M035o842k073J3107L228l682k363
14753A41j0264L874O383J099o885p96O549K578p20k199l58L417l516L693K421
14738E417l532K212L923p379k004k909m814K053L169M730l720o483j095k630n466
14723a8528Q487K921p335J503l442k16N01J656L650K44K283J934j1552K695p96
14708a5995m432M717O237P04J399J754N62j010j763k292n166l527J912M042o422
14693a9280Q098L707j312J202J804n020o514O03J1675K02q92L220K081k698P15
14678b409j183K979k504k723n264j872n129L108M828J231N033J936l06p184m893
14663a4352p040k066M647J1183J0984J871n63k600k591n151m758K7r9M760M313
$$ plain form
14648 -1435 -3561 -7863 -9167 -10750 -599 5909 3110 -1923 -2179 -4035 -3116 228 -4784 -3126 -801
14633 -801 -5152 -6253 -15543 -16587 -19667 -17401 -11900 -7465 -9834 -6874 3036 1615 -4593 -7900 -6831
14618 -6831 -10533 -9833 -6553 -11094 -5666 -2698 590 204 2733 9279 6798 3055 3488 4090 10260 7737
14602 7737 438 -1149 -1029 512 2021 -3745 -6994 -2365 -1537 -3369 -6429 -4546 -145 2753 1285
14587 1285 4783 6630 2449 -40 179 1904 1884 4726 2428 -1165 -1199 -3294 -4974 -4057 -7086 -15075
14571 -15075 -9065 -5654 -8616 -9751 2734 6252 -142 -3854 -2224 -2204 -2355 -8512 -10868 -13184 -19310
14556 -19310 -18856 -9655 -1992 -4800 -6302 -10735 -13282 -18105 -18661 -13182 -8145 -3332 817 -2873 -5036
14541 -5036 -12630 -17893 -13274 -6052 -4282 -8014 -3966 3419 -3094 -10032 -13551 -6476 -2446 -8277 -4079
$$ packed form
14648a435k126m302j304j583J0151O508k799n033k56j856R19L344n012J658K325
14633h01m351j101r290j044l080K266N501M435k369K960R910j421o208l307J069
14618f831l702P00L280m541N428K968L288l86K529O546k481l743M33O02O170k523
14602G737p299j587J20J541J509n766l249M629Q28j832l060J883M401K898j468
14587A285L498J847m181k489K19J725k0K842k298l593l4k095j680R17l029p989
14571a5075O010L411k962j135J2485L518o394l712J630K0j51o157k356k316o126
14556a9310M54R201P663k808j502m433k547m823n56N479N037M813M149l690k163
14541e036p594n263M619P222J770l732M048P385o513o938l519P075M030n831M198
$$ plain form
14526 -4079 -1612 -9404 -15403 -12136 -9496 -9804 -11673 -9626 -6026 -5687 -7094 -840 -4459 -13444 -16401
14511 -16401 -15870 -15802 -13569 -8080 -4758 1428 -1544 -3151 -1799 -5834 -15031 -17532 -17612 -10504 -3317 -289
14495 -289 -3169 -2391 5846 5085 1287 348 -2029 2068 -5389 -2740 -8408 -8394 -3884 -3270 465 -901
14479 -901 -387 -4022 -7053 -1088 8756 20253 21890 22288 20838 20549 15082 14295 9736 1836 1579 6949
14463 6949 2517 -411 -7639 -13264 -11725 -9690 -9439 1715 16050 6251 -4711 -7352 -9308 -10045
14449 -10045 -11312 -8823 -7677 -4911 -5679 -6215 -10846 -8008 -5356 -1383 -1540 -5275 -9471 -1697 7224
14434 7224 12610 16531 17575 8451 3094 1683 3604 10458 15279 15301 9660 6075 6376 9638 4159
14419 4159 -180 655 -453 -1389 5247 18199 17668 19212 18547 11931 8646 3466 6029 3370 -1159
$$ packed form
14526d079K467p792n999L267K640l08j869K047L600L39j407O254l619q985k957
14511a6401N31O8K233N489L322O186k972j607J352m035r197k501q0P108P187L028
14495b89k880P78Q237p61l798r39k377M097p457K649n668J4M510O14L735j366
14479i01N14l635l031N965R844J1497J637L98j450k89n467p87m559p900k57N370
14463F949m432k928p228n625J539K035K51J1154J4335r799j0962k641j956p37
14449a0045j267K489J146K766p68n36m631K838K652L973j57l735m196P774Q921
14434G224N386L921J044r124n357j411J921O854M821K2n641l585L01L262n479
14419D159m339Q35j108r36O636J2952n31J544o65o616l285n180K563k659m529
$$ plain form
14404 -1159 -3225 3959 13472 9375 7595 11612 7310 3307 3126 2483 -942 -9404 -11409 -11901 -13229
14389 -13229 -11988 -4040 2957 3489 -4387 -10324 -11527 -8979 -13694 -17016 -11243 -17122 -11322 -18268 -19062
14374 -19062 -10933 -6899 -9160 -9837 -12557 -9350 1810 9366 17854 14412 10923 8527 773 -3105
14360 -3105 1027 10039 13362 12989 23203 31672 23135 15446 10677 5726 -5580 -5857 2257 7343 14762
14345 14762 13131 2163 -2705 -7568 -11307 -5216 1107 3195 -1108 -2704 -2136 -9905 -15091 -12820
14331 -12820 -11435 -14265 -4105 -2011 -4290 -8293 -8246 -1692 -960 -4782 -4770 -4330 -6133 -13435 -13688 -5222
14315 -5222 -1826 -1721 -1054 1445 -571 -1914 -2841 -1619 -833 -3458 -2854 -3700 4529 6088 2816 9304
14299 9304 3473 2801 6371 2892 1726 3564 1428 7565 4400 -1898 -7657 -9307 -7114 3993 3567
$$ packed form
14404a159k066P184R513m097j780M017m302m003j81o43l425q462k005m92j328
14389a3229J241P948O997N32p876n937j203K548m715l322N773n879N800o946p94
14374a9062Q129M034k261o77k720L207J1160P556Q488l442l489k396p754l878
14360c105M132R012L323l73J0214Q469q537p689m769m951j1306k77Q114N086P419
14345A4762j631j0968m868m863l739O091O323K088m303j596N68p769n186K271
14331a2820J385k830J0160K094k279m003M7O554P32l822J2M40j803p302k53Q466
14315e222L396J05O67K499k016j343r27J222P86k625O04q46Q229J559l272O488
14299I304n831o72L570l479j166J838k136O137l165o298n759j650K193J1107m26
$$ plain form
14284 3567 -1224 -117 7873 10693 11995 7595 1827 -4175 -5171 -2058 -363 913 -1096 -5814 -1707
14269 -1707 6665 8586 2156 -1389 -11341 -10320 -5331 -3459 432 -956 623 1231 -619 82 822
14254 822 1457 -553 -112 1360 -2602 -4964 -8351 -11962 -11490 -10083 -9549 -9467 -5938 -4348 -581 2602
14238 2602 4057 4296 2392 -1423 110 -5710 -8553 -9455 -6490 -5161 -8850 -9718 -7934 -7393 -8615 -5036
14222 -5036 -10151 -14627 -14531 -18050 -14487 -8044 -11982 -11859 -11095 -11233 -9419 -17663 -22122 -17533 -11191 -17865
14206 -17865 -17362 -10467 -3220 -2043 -8515 -9691 -8886 -11683 -10930 -6376 -2904 -537 -3052 -5158 -5020
14191 -5020 -8162 -10535 -8884 -11888 -16865 -9780 773 2504 -1036 -3469 -9748 -13274 -10586 -12930
14177 -12930 -15111 -10009 -4769 -4929 -11407 -11529 -7946 -7912 -981 -1822 -4680 -1577 -70 -1562 -4804 -1864
$$ packed form
14284C567m791J107P990K820J302m400n768o002r96L113J695J276k009m718M107
14269a707Q372J921o430l545r952J021M989J872L891j388J579O08j850P01P40
14254H22O35k010M41J472l962k362l387l611M72J407N34Q2L529J590L767L183
14238B602J455K39j904l815J533n820k843r02K965J329l689q68J784N41j222L579
14222e036n115m476R6l519L563O443l938J23P64j38J814q244m459M589O342o674
14206a7865N03O895P247J177o472j176Q05k797P53M554L472K367k515k106J38
14191e020l142k373J651l004m977P085J0553J731l540k433o279l526K688k344
14177a2930k181N102N240j60o478j22L583L4O931q41k858L103J507j492l242K940
$$ plain form
14161 -1864 3121 -1185 -3515 -846 1803 -5499 -7104 -2906 -5882 -6831 -11954 -17127 -15017 -7549 -4483
14146 -4483 992 -2678 -4499 -5054 -3429 -2799 -6012 -13060 -15961 -10014 -9051 -14838 -11226 -7675 -8285 -11654
14130 -11654 -11436 -8132 -9641 -16581 -16250 -13074 -12220 -5203 1556 -5755 -8685 -6143 -4617 -5560 -8149
14115 -8149 -6490 -5832 -6899 -5076 -7051 -5474 -11340 -14055 -11003 -9139 -6527 -1274 -515 -1928 1504
14100 1504 5290 3996 1071 -5541 -2118 7834 4856 1735 -1072 -6795 -8609 -4775 -294 2811 -4732
14085 -4732 -13490 -15262 -12735 -14278 -16200 -10540 1974 -1103 -1884 -5885 -16395 -17227 -13748 -9646 -3903
14070 -3903 -3183 -5650 -10723 -8739 -5244 -5319 -9708 -12247 -8880 -10402 -11139 -8533 -2271 -6776 -7500 231
14054 231 -4959 -19391 -16342 -4482 -3431 -3990 -8936 -11993 -11314 -2113 7595 4063 -4269 -7242 -3903
$$ packed form
14161a864M985m306k330K669K649p302j605M198k976r49n123n173K110P468L066
14146d483N475l670j821n55J625O30l213p048k901N947R63n787L612L551o10l369
14130a1654K18L304j509o940L31L176Q54P017O759p311k930K542J526r43k589
14115h149J659O58j067J823j975J577n866k715L052J864K612N253P59j413L432
14100A504L786j294k925o612L423R952k978l121k807n723j814L834M481L105p543
14085d732q758j772K527j543j922N660J2514l077p81m001j0510q32L479M102N743
14070c903P20k467n073J984L495p5m389k539L367j522p37K606O262m505p24P731
14054B31n190j4432L049J1860J051n59m946l057O79R201R708l532q332k973L339
$$ plain form
14039 -3903 3788 6081 6453 11147 14192 14769 3208 -676 1521 100 1575 -4566 -4342 -3864 -8972
14024 -8972 -12059 -9385 514 1715 -4502 -12664 -7998 -3544 -12684 -18362 -18324 -5733 -3470 -6361 -7387
14009 -7387 -270 6420 4034 2596 2925 3918 5481 3404 -4965 -8103 -4807 -387 -1975 -6453 -10002
13994 -10002 -8096 -3938 -8706 -8591 -11341 -5860 -9029 -13090 -16149 -20072 -20382 -17873 -12137 -9001 -11335
13979 -11335 -8980 -10083 -13932 -10787 -6957 -12234 -9288 -8391 -8362 -12851 -12511 -11766 -5972 1371 4728 1526
13963 1526 234 -527 -6426 -12758 -13197 -9202 -9829 -5584 -1451 -4059 -3734 -12092 -17152 -14413 -8374 -2061
13947 -2061 -1158 -5285 -4541 -2064 -1745 -7612 -14802 -15149 -13050 -13883 -14635 -11607 -8198 -103 -5023 -5689
13931 -5689 -7047 -13109 -8093 -1624 -3166 -44 5775 2577 -5910 -10060 -12402 -9023 -8536 -6094 -3202
$$ packed form
14039c903P691K293L72M694L045N77j1561l884K197j421J475o141K24M78n108
14024h972l087K674R899J201o217q162M666M454r140n678L8J2591K263k891j026
14009g387P117O690k386j438L29R93J563k077q369l138L296M420j588m478l549
13994a0002J906M158m768J15k750N481l169m061l059l923l10K509N736L136k334
13979a1335K355j103l849L145L830n277K946Q97K9m489L40P45N794P343L357l202
13963A526j292p61n899o332m39L995o27M245M133k608L25q358n060K739O039O313
13947b061R03m127P44K477L19n867p190l47K099q33p52L028L409Q095m920o66
13931e689j358o062N016O469j542L122N819l198q487m150k342L379M87K442K892
$$ plain form
13916 -3202 -4583 -1806 566 4275 -2066 -11089 -12824 -5487 -2921 2599 2150 -1077 -5633 -2762 1876
13901 1876 -2202 -10137 -6477 -1396 -7118 -10903 -9261 -1648 3824 -3982 -7773 -8644 -1503 7130 9586
13886 9586 7046 1858 -5597 -3207 3221 1516 -7436 -9893 -6928 3826 2468 -1256 1026 954 -5767
13871 -5767 -11987 -15707 -17635 -18516 -17701 -10960 -3295 -2898 -8679 -11075 -10243 -8387 -3997 553 3329 -1763
13855 -1763 -10936 -9902 -4242 -215 -5348 -5159 -10393 -13946 -13545 -11810 -10148 -13667 -11335 -9656 -19340
13840 -19340 -15449 -14056 -20927 -14669 -3708 438 -1432 -9399 -12742 -14519 -9636 -479 -2590 -1819
13826 -1819 -3082 -5337 -8354 -8962 -9575 -18969 -18777 -13386 -7341 -8779 -5160 -857 1456 941 -3706 -673
13810 -673 1304 -4239 -8515 -10485 -9604 -5515 3534 5828 1277 -594 -650 3815 818 -3119 -8078 -2879
$$ packed form
13916c202j381K777K372L709o341r023j735P337K566N520m49l227m556K871M638
13901A876m078p935L660N081n722l785J642P613N472p806l791q71P141Q633K456
13886I586k540n188p455K390O428j705q952k457K965J0754j358l724K282p2o721
13871e767o220l720j928q81Q15O741P665L97n781k396Q32J856M390M550K776n092
13855a763r173J034N660M027n133J89n234l553M01J735J662l519K332J679r684
13840a9340L891J393o871O258J0961M146j870p967l343j777M883R157k111P71
13826a819j263k255l017o08o13r394J92N391O045j438L619M303K313n15m647L033
13810f73J977n543m276j970Q81M089R049K294m551j871n6M465k997l937m959N199
$$ plain form
13794 -2879 3251 3682 1190 -6220 -7013 -9137 -16860 -22570 -22028 -18770 -17685 -6703 -4868 -15431 -19125
13779 -19125 -12104 -3937 3607 2928 -1250 1475 1695 701 -216 -5034 -11669 -14094 -11720 -7268 -10299
13764 -10299 -11976 -5862 -5621 -2853 -5897 -8031 -10138 -7948 -7458 -11118 -15487 -13617 -9617 -6847 -5200
13749 -5200 -9984 -9997 -13486 -19022 -17005 -13280 -17525 -21221 -14202 -14128 -13928 -12080 -9644 -11292 -14826 -16583
13733 -16583 -13405 -7168 -6645 -7160 -7744 -5983 -11730 -14894 -13731 -9290 -7422 -8129 -10512 -5955 -421
13718 -421 5122 1932 -4919 -6047 -7023 -4351 -381 942 850 12433 19373 15543 12326 11990 13476 17903
13702 17903 24914 27603 28155 22554 19303 12518 11240 9720 8841 5373 3244 1946 1887 -6011 -10010
13687 -10010 -8685 -6463 -4984 -478 2946 -968 -8234 -5520 -9405 -16882 -18155 -16889 -15725 -14727 -17207
$$ packed form
13794b879O130M31k492p410p93k124p723n710N42L258J085J0982J835j0563l694
13779a9125P021Q167P544o79m178K725K20r94r17m818o635k425K374M452l031
13764a0299j677O114K41K768l044k134k107K190M90l660m369J870M000K770J647
13749e200m784j3l489n536K017L725m245l696P019P4K00J848K436j648l534j757
13733a6583L178O237N23n15n84J761n747l164J163M441J868p07k383M557N534
13718d21N543l190o851j128r76K672L970J323r2J1583O940l830l217l36J486M427
13702A7903P011K689N52n601l251o785j278j520q79l468k129j298n9p898l999
13687a0010J325K222J479M506L424l914p266K714l885p477j273J266J164R98k480
$$ plain form
13672 -17207 -12511 -3071 -152 1241 5752 3695 2258 1762 -3270 -51 -233 -6783 -12565 -9388 -7687
13657 -7687 -6232 -6595 -12309 -11300 -7815 -6353 -4550 -2813 1821 2815 2086 4645 11306 12824 8763
13642 8763 -1152 1917 -283 -6329 -2055 61 -6423 -3045 -2235 -4267 2771 4837 -2667 -3007 824
13627 824 -4408 -6023 -3331 -3782 -3593 -4000 -4691 -5420 -3329 -8012 -11291 -14007 -12050 -6268 -4870 -1954
13611 -1954 -8552 -12138 -16764 -10526 -3191 -6713 -11877 -9941 4559 6927 7329 6302 5075 7877 11698
13596 11698 12011 19657 35385 50964 76955 105321 143393 171994 183157 184024 179048 163846 140614
13583 140614 118566 96604 72474 53774 43988 33323 31304 31200 33525 30427 25060 17158 9252
13570 9252 8977 15919 24335 16139 10615 9378 4744 2100 3936 5543 9595 8024 9821 10091 10802
$$ packed form
13672a7207M696R440K919J393M511k057j437m96n032L219j82o550n782L177J701
13657g687J455l63n714J009L485J462J803J737M634R94p29K559O661J518m061
13642H763r915L069k200o046M274K116o484L378Q10k032P038K066p504l40L831
13627H24n232j615K692m51J89m07o91p29K091m683l279k716J957N782J398K916
13611a954o598l586m626O238P335l522n164J936J4500K368M02j027j227K802L821
13596A1698L13P646J5728J5579K5991K8366L8072K8601J1163Q67m976j5202k3232
13583A40614k2048k1962k4130j8700r786j0665k019j04K325l098n367p902p906
13570I252k75O942Q416q196n524j237m634k644J836J607M052j571J797K70P11
$$ plain form
13555 10802 8371 10985 12320 11969 6911 6696 3561 -1621 -4207 -1875 2379 11279 15703 10571 15751
13540 15751 17730 16189 10447 6417 6643 1160 2677 5736 -216 1006 2455 1534 392 3508 4673
13525 4673 7124 3207 -254 -5165 -4598 -1061 4268 13522 8690 -893 422 2040 2807 1491 -1119
13510 -1119 -609 -9903 -13896 -11522 -1667 6913 2753 -634 3272 1801 2281 579 3557 4867 1120
13495 1120 -5774 -8510 -10447 -9764 -5746 -2672 -1748 1975 751 2905 2428 -2643 -2880 -4394 -8044 -11931
13479 -11931 -10439 -9517 -15412 -13059 -5295 2067 -3504 -5952 -5014 -6649 -6227 -6045 -11049 -15892 -15769 -7029
13463 -7029 -2207 -5679 -10453 -11995 -13012 -5543 -3378 -6371 -9965 -11727 -10590 -5151 -1097 2890 2796
13448 2796 -1588 -8189 -10353 -13854 -13573 -6034 31 -5882 -7296 4781 12646 8094 697 -6384 -8376
$$ packed form
13555A0802k431K614J335l51n058k15l135n182k586K332M254Q900M424n132N180
13540A5751J979j541n742m030K26n483J517L059n952J222J449r21j142L116J165
13525D673K451l917l461m911N67L537N329R254m832r583J315J618P67j316k610
13510a119N10r294l993K374R855Q580m160l387L906j471M80j702K978J310l747
13495A120o894k736j937O83M018L074R24L723j224K154m77n071k37j514l650l887
13479a1931J492R22n895K353P764P362n571k448R38j635M22J82n004m843J23Q740
13463g029M822l472m774j542j017P469K165k993l594j762J137N439M054L987r4
13448B796m384o601k164l501K81P539O065n913j414J2077P865m552p397p081j992
$$ plain form
13433 -8376 -7865 -3920 -2429 -7251 -8064 -13287 -6249 -6342 -4681 -3245 -3800 -5323 -5334 -4082 -3522 -8021 -7981
13416 -7981 -2599 -3212 -2845 -5905 -13767 -20570 -20977 -15476 -12300 -9030 -5275 -6915 -7673 -12372 -13939 -8277
13400 -8277 -4194 2181 9134 10769 14436 13012 15160 9482 4114 8508 7251 10070 10676 9073 10674
13385 10674 -508 -3261 1398 3859 1318 -3188 -2416 -3788 -1825 -2326 -4830 -11243 -8076 -5812 -8817
13370 -8817 -7265 -5409 -2182 3963 -258 -1864 -3374 -3604 -2957 -4951 -7400 -5485 -7251 -10194 -9119
13355 -9119 -9722 -7324 -1444 423 2175 6415 13176 10150 3839 -2409 -3364 -6160 -5590 -4579 -1393
13340 -1393 -3962 -7585 -11226 -5371 -1853 -7426 -9129 -8878 -11148 -12238 -15289 -18486 -19782 -21912 -23232
13325 -23232 -14096 -5575 -7765 -7710 -8655 -18855 -14799 -6584 -6127 -8724 -7044 -11310 -12671 -11933 -11326 -12375
$$ packed form
13433h376N11L945J491m822q13n223P038r3J661J436n55j523j1J252N60m499M0
13416g981N382o13L67l060p862o803m07N501L176L270L755j640p58m699j567N662
13400h277M083O375O953J635L667j424K148n678n368M394j257K819O06j603J601
13385A0674j1182k753M659K461k541m506P72j372J963n01k504o413L167K264l005
13370h817J552J856L227O145m221j606j510k30O47j994k449J915j766k943J075
13355i119o03K398N880J867J752M240O761l026o311o248r55k796N70J011L186
13340a393k569l623l641N855L518n573j703K51k270j090l051l197j296k130j320
13325b3232R136Q521k190N5r45j0200M056Q215M57k597J680m266j361P38O07j049
$$ plain form
13309 -12375 -19383 -13329 -10556 -14961 -20555 -12055 -7458 -2486 -105 -1143 -8290 -7778 -4130 -3594 -3164
13294 -3164 -2569 -3482 -5130 -6394 -5667 -3065 -521 -3599 -9097 -15001 -14401 -12646 -8799 -6701 -6966 -2609
13278 -2609 -4899 -9179 -10891 -12721 -14670 -6941 267 -1533 6710 9443 -505 -9674 -13839 -10097 -7859
13263 -7859 -1984 2935 3166 -5263 -11920 -8414 -991 4398 4233 2357 -3837 -8408 -2742 7266 6729
13248 6729 -3058 -6428 -8234 -8604 -6649 -7402 -6832 -5855 -10207 -12633 -17901 -17874 -7857 -2813 -3899 -12144
13232 -12144 -9562 -6654 -6984 -4583 -7310 -9152 -13469 -13451 -6067 -4534 -5477 -4472 -3744 -1076 -3895 -2638
13216 -2638 -1649 -8786 -13120 -8836 -1411 -5182 -6591 -6110 -4454 -9726 -10144 -8523 -6278 -6169 -4846 -1837
13200 -1837 2894 6201 999 8110 6670 7100 7459 7384 4959 5248 1932 -1591 4586 4775 939 -2396
$$ packed form
13309a2375p008O054K773m405n594Q500M597M972K381j038p147N12L648N36M30
13294c164N95r13j648j264P27K602K544l078n498n904O00J755L847K098k65M357
13278b609k290m280j712j830j949P729P208j800Q243K733r948r169m165L742K238
13263g859N875M919K31q429o657L506P423N389j65j876o194m571N666J0008n37
13248F729r787l370j806l70J955p53N70R77m352k426n268K7J0017N044j086q245
13232a2144K582K908l30K401k727j842m317J8P384J533r43J005P28K668k819J257
13216b638R89p137m334M284P425l771j409M81J656n272m18J621K245J09J323L009
13200a837M731L307n202P111j440M30L59p5k425K89l316l523O177J89l836l335
$$ plain form
13184 -2396 -5825 -6967 -862 6907 11114 10132 16661 17128 20294 16605 11929 12934 13867 17609 15119
13169 15119 15245 16417 8515 6555 9701 19542 21899 16038 15865 13483 18662 26510 33118 43236 63240
13154 63240 84749 97648 109489 103140 87845 66988 46182 28867 23545 21338 16935 17250 18076
13141 18076 22466 23324 14469 15757 15321 11014 10320 11642 11187 9469 13354 15291 19207 14674 9049
13126 9049 7216 3859 -243 -4467 -4593 -442 5034 6942 7223 16005 20752 30363 37662 49954 66262
13111 66262 95102 153409 228803 293221 332606 326305 279560 209322 146147 105948 75211 58959
13099 58959 57175 51426 47965 52121 50016 43739 33462 32353 33402 34938 30295 27734 28408 30613
13085 30613 33441 32611 28931 24976 32338 35726 34587 31064 30618 24739 23730 26035 27229 22262 24119
$$ packed form
13184b396l429j142O105P769M207r82O529M67L166l689m676J005R33L742k490
13169A5119J26J172p902j960L146R841K357n861j73k382N179P848O608J0118K0004
13154F3240K1509J2899J1841o349j5295k0857k0806j7315n322k207m403L15Q26
13141A8076M390Q58q855J288m36m307o94J322m55j718L885J937L916m533n625
13126I049j833l357m102m224j26M151N476J908K81Q782M747R611P299J2292J6308
13111F6262K8840N8307P5394O4418L9385o301m6745p0238o3175m0199l0737j6252
13099E8959j784n749l461M156k105o277j0277j109J049J536m643k561O74K205
13085C0613K828q30l680l955P362L388j139l523m46n879j009K305J194m967J857
$$ plain form
13070 24119 35854 52327 62148 69230 105098 152617 222163 296041 338984 348097 314186 243424
13058 243424 177429 130740 105818 87134 71955 72786 73317 68713 58732 45347 34468 33997 36592
13045 36592 37369 34395 32115 32179 28780 32234 37970 40587 29324 23464 25343 27120 32334 29911 23799
13030 23799 18886 21903 19757 22778 29184 41480 50828 55309 57217 62344 78107 98448 115689
13017 115689 124971 131290 126537 110008 91580 72168 59124 50121 43517 42748 40195 35647 40412
13004 40412 37588 31752 24040 23535 28767 32936 30002 22123 20133 19020 23237 18188 16855 19416 20306
12989 20306 21854 22052 22072 26478 30225 30858 26409 17692 8336 12049 16338 25196 27182 18407 9527
12974 9527 10309 17594 26920 27128 22033 22002 11735 6049 7237 11916 12284 13052 15650 15460 18794 21297
$$ packed form
13070B4119J1735J6473R821P082L5868M7519O9546P3878M2943R113l3911p0762
13058B43424o5995m6689k4922j8684j5179Q31N31m604r981j3385j0879m71K595
13045C6592P77k974k280O4l399L454N736K617j1263n860J879J777N214k423o112
13030B3799m913L017k146L021O406J2296R348M481J908N127J5763K0341J7241
13017A15689R282O319m753j6529j8428j9412j3044r003o604p69k553m548M765
13004D0412k824n836p712n05N232M169k934p879j990j113M217n049j333K561Q90
12989B0306J548J98K0M406L747O33m449q717r356L713M289Q858J986q775q880
12974I527P82P285R326K08n095l1j0267n686J188M679L68P68K598j90L334K503
$$ plain form
12958 21297 26692 31788 33139 33553 29870 26168 27909 30112 30116 25970 24529 23110 16350 15451 17120 20013
12942 20013 19244 14115 17622 21983 25240 19667 14411 10953 14457 14478 16172 17190 15271 13030 16689
12927 16689 19483 15508 12406 11552 9499 6305 7800 9525 3221 2353 7544 14782 13496 5849 3413
12912 3413 7510 10599 13078 13202 7850 6475 11300 11541 15380 20269 20680 19915 20535 19101 11831 15583
12896 15583 15103 14293 15265 10398 8356 10433 18399 18654 13350 11282 3407 3874 1388 1337 12035 13999
12880 13999 5979 5828 5097 729 1831 339 8911 9865 3378 -5162 -935 -1123 645 2772 7662
12865 7662 7568 4979 762 2159 1450 -1509 -2396 -7628 -8276 -3519 4065 6867 6423 5405 9592 12015
12849 12015 2267 3785 12727 16512 14191 7339 7664 9031 6745 2303 2508 8940 18243 14583 4617
$$ packed form
12958B1297N395N096J351M14l683l702J741K203Mm146j441j419o760q99J669K893
12942B0013p69n129L507M361L257n573n256l458L504K1J694J018j919k241L659
12927A6689K794l975l102q54k053l194J495J725o304q68N191P238j286p647k436
12912C413M097L089K479J24n352j375M825K41L839M889M11p65O20j434p270L752
12896A5583m80q10R72m867k042K077P966K55n304k068p875M67k486n1J0698J964
12880A3999q020j51p31m368J102j492Q572R54o487q540M227j88J768K127M890
12865G662r4k589m217J397p09k959q87n232o48M757P584K802m44j018M187K423
12849A2015r748J518Q942L785k321o852L25J367k286m442K05O432R303l660r966
$$ plain form
12834 4617 8437 15478 13078 5592 10536 13337 13658 14476 15187 8481 7239 12176 12016 11711 8847 9830
12818 9830 14892 7612 8355 9852 10487 15898 20712 13562 8274 10891 8421 17588 17104 12534 17972
12803 17972 32114 32032 27441 22326 16968 20332 15626 9129 1197 -11447 -15226 -10648 -9137 -9559 -5309
12788 -5309 -5871 -72 6091 5766 1737 2298 4837 6410 18559 23786 13403 20496 18325 10201 4589
12773 4589 7931 14256 13866 16860 19370 23183 21930 24662 27449 33110 31129 27309 32615 30627 35352
12758 35352 40943 41638 39789 40526 42784 37493 36208 35096 31539 29261 34523 36031 31571 34056 40866
12743 40866 47610 47423 49014 53876 66711 84509 87060 84588 86285 94273 107505 129929 163618
12730 163618 211029 278814 375261 486133 633058 795124 939071 1055715 1139427 1162714
$$ packed form
12834D617L820P041k400p486M944K801L21Q18P11o706j242M937j60l05k864R83
12818I830N062p280P43J497O35N411M814p150n288K617k470R167m84m570N438
12803A7972J4142q2m591n115n358L364m706o497p932j2644l779M578J511m22M250
12788e309n62N799O163l25m029N61K539J573J2149N227j0383P093k171q124n612
12773D589L342O325l90K994K510L813j253K732K787N661j981l820N306j988M725
12758C5352N591O95j849P37K258n291j285j112l557k278N262J508m460K485O810
12743D0866O744j87J591M862J2835J7798K551k472J697P988J3232K2424L3689
12730A63618M7411O7785R6447J10872J46925J62066J43947J16644Q3712K3287
$$ plain form
12720 1162714 1131655 1071117 966125 837744 711866 597367 489133 403793 338418 297694
12710 297694 265267 241608 224344 212662 195990 186779 179897 177341 167772 159598 157175 150922 144445
12697 144445 139634 127902 120344 112130 106945 106841 110496 108570 106303 113525 106738 104619 96061 89870
12683 89870 84639 78602 76378 75950 71505 72569 65889 62659 58398 53058 55691 57682 64918 60376 55341
12668 55341 57182 61110 66147 68470 65746 63565 65572 60801 57625 61573 56231 47711 39552 35510
12654 35510 37582 39554 35653 36199 44763 42419 37427 32728 28402 25783 31334 32717 30725 36251 31649
12639 31649 27704 30465 29398 26028 24529 24629 23691 20277 19001 17220 14372 15493 13774 16550 12104
12624 12104 11914 10439 8110 10462 9143 13774 18293 22596 18296 14797 10087 4286 -6973 -7884 -16241
$$ packed form
12720A162714l1059o0538j04992j28381j25878j14499j08234q5340o5375m0724
12710B97694l2427k3659j7264j1682j6672r211o882k556r569q174k423o253o477
12697A44445m811j1732p558q214n185j04L655j926k267P222o787k119q558o191
12683H9870n231o037k224m28m445J064o680l230m261n340K633J991P236m542n035
12668E5341J841L928N037K323k724k181K007m771l176L948n342q520q159m042
12654C5510K072J972l901N46Q564k344m992m699m326k619N551J383j992N526m602
12639C1649l945K761j067l370j499J00r38l414j276j781k848J121j719K776m446
12624A2104j90j475k329K352j319M631M519M303m300l499m710n801j1259r11q357
$$ plain form
12609 -16241 -15987 -7380 6516 18019 31184 42481 52779 66541 77923 85242 87027 83093 87269
12596 87269 95769 92329 91768 87240 77961 73749 73677 76360 71521 67845 75543 79765 80648 79212 74068
12581 74068 75277 78015 79810 79283 73366 66487 62919 58663 57853 66798 69834 69335 71726 72555 74162
12566 74162 67901 60982 69752 72958 75522 87370 99240 114623 122817 134496 148606 155241 168070
12553 168070 187645 198828 193965 194643 178055 169267 170364 164663 161136 159532 155878 148156 149222 153728
12539 153728 155905 165293 178234 199199 234993 278380 316545 329068 317792 290335 275034 266282
12527 266282 266397 258155 243008 222296 206503 191230 182609 174447 180683 184909 189224 193892 186121
12514 186121 177753 172732 176739 183779 192842 203934 224817 245884 255084 253319 239415 228516 224690
$$ packed form
12609a6241K54Q607J3896J1503J3165J1297J0298J3762J1382P319J785l934M176
12596H7269Q500l440n61m528r279m212p2K683m839l676P698M222Q83j436n144
12581G4068J209K738J795n27n917o879l568m256q10Q945L036m99K391Q29J607
12566G4162o261o919Q770L206K564J1848J1870J5383Q194J1679J4110O635J2829
12553A68070J9575J1183m863O78j6588q788J097n701l527j604l654p722J066M506
12539A53728K177R388J2941K0965L5794M3387L8165J2523j1276k7457j5301q752
12527B66282J15q242j5147k0712j5793j5273q621q162O236M226M315M668p771
12514A86121q368n021M007P040R063J1092K0883K1067R200j765j3904j0899l826
$$ plain form
12501 224690 229401 243316 252865 263359 274383 291648 322003 369425 435701 517763 591497 624738
12489 624738 597972 522828 460361 429962 416523 398992 377296 350797 324639 312583 298526
12478 298526 292619 296583 305112 306665 301546 292467 274323 264428 262954 265974 275532 277230 277504 279426
12464 279426 285981 278575 257494 240724 227891 223315 232062 247112 274136 306790 327000 335466
12452 335466 342187 365043 392156 411601 410636 380706 328423 284259 249720 231304 224974 223259
12440 223259 223491 228386 224476 220976 220441 214148 203303 203459 210567 221292 229004 244408 265238 290933
12426 290933 306153 326724 343734 340378 351771 351979 338378 326214 314671 299623 296395 295986 293930
12413 293930 295884 295347 289375 291714 296765 298020 299161 307523 315423 320937 323667 334909 335063 337944
$$ packed form
12501B24690M711J3915R549J0494J1024J7265L0355M7422O6276Q2062P3734L3241
12489F24738k6766p5144o2467l0399j3439j7531k1696k6499k6158j2056j4057
12478B98526n907L964Q529J553n119r079j8144r895j474L020R558J698K74J922
12464B79426O555p406k1081j6770j2833m576Q747J5050K7024L2654K0210Q466
12452C35466O721K2856K7113J9445r65k9930n2283m4164l4539j8416o330j715
12440B23259K32M895l910l500n35o293j0845J56P108J0725P712J5404K0830K5695
12426B90933J5220K0571J7010l356J1393K08j3601j2164j1543j5048l228m09k056
12413B93930J954n37n972K339N051J255J141Q362P900N514K730J1242J54K881
$$ plain form
12399 337944 350923 362729 367269 376175 380874 377437 370563 362017 367927 366445 363048 360951 359556 369181
12385 369181 380547 394705 408420 421678 438768 456100 469242 484490 499376 501183 503342 498453
12373 498453 501386 511822 512262 524251 533569 535750 535337 542691 556590 572114 588403 597332 606496
12360 606496 619551 629884 633367 636845 643307 654166 667001 682528 704761 725007 742453 770304
12348 770304 801157 828939 862737 900599 933158 967519 997357 1035389 1057648 1077219 1098308
12337 1098308 1125394 1152517 1182693 1223761 1281090 1353798 1453617 1582742 1726527 1880819 2049542
12326 2049542 2227753 2422421 2647316 2911399 3225776 3625106 4123814 4736551 5480448
12317 5480448 6359748 7357813 8453962 9649011 10938794 12347714 14033803 16224431
$$ packed form
12399C37944J2979J1806M540Q906M699l437o874q546N910j482l397k097j395R625
12385C69181J1366J4158J3715J3258J7090J7332J3142J5248J4886J807K159m889
12373D98453K933J0436M40J1989R318K181m13P354J3899J5524J6289Q929R164
12360F06496J3055J0333L483L478O462J0859J2835J5527K2233K0246J7446K7851
12348G70304L0853K7782L3798L7862L2559L4361K9838L8032K2259J9571K1089
12337A098308K7086K7123L0176M1068N7329P2708R9819J29125J43785J54292J68723
12326B049542J78211J94668K24895K64083L14377L99330M98708O12737P43897
12317E480448Q79300R98065J096149J195049J289783J408920J686089K190628
$$ plain form
12309 16224431 19324929 24082374 31327167 41857264 56899374 76680826 99804195
12302 99804195 126455913 153846043 176446959 195533784 207764170 207531703 200833560
12295 200833560 187411962 165074190 141712539 119099520 96867103 78735774 65077118
12288 65077118 54755498 47434613 42425356 38883640 36162032 33938970 32019384 30236681
12280 30236681 28549595 26944790 25418584 24003339 22710504 21553899 20526552 19611398
12272 19611398 18796009 18056909 17374740 16748487 16173619 15632148 15126778 14648896 14178152
12263 14178152 13719181 13264086 12817428 12383531 11954386 11541456 11156150 10786477 10442254
12254 10442254 10127977 9836804 9568021 9311084 9067815 8845293 8625826 8407604 8199485
$$ packed form
12309A6224431L100498M757445P244793J0530097J5042110J9781452K3123369
12302I9804195K6651718K7390130K2600916J9086825J2230386k32467o698143
12295B00833560j3421598k2337772k3361651k2613019k2232417j8131329j3658656
12288F5077118j0321620p320885n009257l541716k721608k223062j919586j782703
12280C0236681j687086j604805j526206j415245j292835j156605j027347r15154
12272A9611398q15389p39100o82169o26253n74868n41471n05370m77882m70744
12263A4178152m58971m55095m46658m33897m29145m12930l85306l69673l44223
12254A0442254l14277k91173k68783k56937k43269k22522k19467k18222k08119
$$ plain form
12245 8199485 7991306 7780403 7564104 7350566 7144285 6947952 6747199 6560419 6380708
12236 6380708 6207994 6050661 5895744 5749867 5615249 5479996 5351197 5226608 5105265
12227 5105265 4988031 4883864 4782858 4691223 4615190 4552554 4511322 4486708 4472647 4465916 4469798
12216 4469798 4450214 4401647 4331729 4232733 4093183 3948567 3792270 3623270 3464457 3321622
12206 3321622 3194556 3083924 2985526 2882741 2788433 2703606 2622900 2547227 2470769 2402820 2336971
12195 2336971 2270990 2218009 2164904 2105420 2045480 1997434 1953049 1902655 1851298 1801301 1752230
12184 1752230 1699005 1655153 1624020 1586011 1550866 1523198 1494441 1470280 1444435 1419256 1407204
12173 1407204 1389795 1372652 1359153 1330724 1295411 1263410 1238070 1212772 1192896 1175323 1156383
$$ packed form
12245H199485k08179k10903k16299k13538k06281j96333k00753j86780j79711
12236F380708j72714j57333j54917j45877j34618j35253j28799j24589j21343
12227E105265j17234j04167j01006r1635p6033o2636m1232k4614j4061o731L882
12216D469798j9584m8567o9918r8996j39550j44616j56297j69000j58813j42835
12206C321622j27066j10632r8398j02785r4308q4827q0706p5673p6458o7949o5849
12195B336971o5981n2981n3105n9484n9940m8046m4385n0394n1357m9997m9071
12184A752230n3225m3852l1133l8009l5145k7668k8757k4161k5845k5179j2052
12173A407204j7409j7143j3499k8429l5313l2001k5340k5298j9876j7573j8940
$$ plain form
12162 1156383 1130938 1107969 1092113 1074860 1049583 1032025 1001898 962054 921911 888220 856467
12151 856467 824740 777237 724568 684752 648165 610871 575759 552782 535662 514628 492123
12140 492123 472230 460751 452121 437256 417259 397816 379561 371212 355779 341663 333630 327561
12128 327561 314237 306580 300484 298262 294933 300409 305900 300229 293568 286979 283171 280069 267820 254748
12114 254748 238818 222057 213549 202079 186715 190860 197153 195807 204024 220502 228663 238593 251366
12101 251366 261330 262182 256419 251017 242334 240893 238673 230574 231794 223569 216009 210460 213284 219502
12087 219502 223597 224626 217650 214924 221140 224715 226964 223555 220492 215597 204320 195855 185992 177878
12073 177878 164896 156997 150481 143979 134222 119129 114139 117191 112751 107757 109337 105974 109617 109984
$$ packed form
12162A156383k5445k2969j5856j7253k5277j7558l0127l9844m0143l3691l1753
12151H56467l1727m7503n2669l9816l6587l7294l5112k2977j7120k1034k2505
12140D92123j9893j1479q630j4865j9997j9443j8255q349j5433j4116q033o069
12128C27561j3324p657o096k222l329N476N491n671o661o589l808l102j2249j3072
12114B54748j5930j6761q508j1470j5364M145O293j346Q217J6478Q161R930J2773
12101B51366R964Q52n763n402q683j441k220q099J220q225p560n549K824O218
12087B19502M095J029o976k726O216L575K249l409l063m895j1277q465r863q114
12073A77878j2982p899o516o502r757j5093m990L052m440m994J580l363L643L67
$$ plain form
12059 109984 112949 118467 117217 120973 130004 133777 135812 138512 138835 141222 147027 147471 146097 145367 140140
12044 140140 139969 139857 136947 125972 122878 125787 114101 114798 114853 113315 110896 119529 122665 120973 116482
12029 116482 114004 109717 114057 112807 109498 111815 111846 107138 101063 100730 107527 108644 106565 96941 87795
12014 87795 78979 73529 68199 64784 59077 54685 43260 34668 35404 35073 33175 25066 27854 18389 8180
11999 8180 3666 -1863 -6087 -16632 -13466 -1450 2295 7143 22587 40277 49737 58244 60739 63498
11985 63498 73555 71235 65996 67485 65517 60355 55958 47649 44449 46892 51393 57928 60170 54146
11971 54146 49686 46769 46435 44191 45617 47439 45795 48068 49303 46699 41657 36203 30181 29092 27414
11956 27414 31147 36570 35182 34732 37399 30354 22301 24254 34730 38151 40552 49325 47216 36435
$$ packed form
12059A09984K965N518j250L756R031L773K035K700L23K387N805M44j374p30n227
12044A40140j71j12k910j0975l094K909j1686O97N5j538k419Q633L136j692m491
12029A16482k478m287M340j250l309K317L1m708o075l33O797J117k079r624r146
12014H7795q816n450n330l415n707m392j1425q592P36l31j898q109K788r465j0209
11999H180m514n529m224j0545L166J2016L745M848J5444J7690R460Q507K495K759
11985F3498J0057k320n239J489j968n162m397q309l200K443M501O535K242o024
11971E4146m460k917l34k244J426J822j644K273J235k604n042n454o022j089j678
11956B7414L733N423j388m50K667p045q053J953J0476L421K401Q773k109j0781
$$ plain form
11942 36435 36515 34948 35276 30379 27107 24928 17521 13696 9453 7908 6825 12587 19453 24086 27005
11927 27005 28439 28023 25123 20751 16587 17893 20348 31406 30312 27096 29932 30636 29872 30816 28475
11912 28475 28823 24809 27202 32083 34440 26401 24673 27487 30602 30879 24952 14228 12095 17325 21058
11897 21058 15565 20362 27500 27935 31002 33631 39727 40636 48154 51364 48176 45908 47789 56570 67313
11882 67313 74094 81108 99028 117339 133417 166865 219733 291869 389444 517687 662376 820931
11870 820931 965666 1077751 1154722 1168597 1130417 1057131 938160 807052 674380 547536
11860 547536 443430 369942 315042 272543 238232 215798 205010 194096 181331 173392 164641 150346
11848 150346 142358 137791 126627 117763 108689 100555 89877 82387 78704 73988 71897 69175 67983 70466
$$ packed form
11942C6435Q0j567L28m897l272k179p407l825m243j545j083N762O866M633K919
11927B7005J434m16k900m372m164J306K455J1058j094l216K836P04p64R44k341
11912B8475L48m014K393M881K357q039j728K814L115K77n927j0724k133N230L733
11897B1058n493M797P138M35L067K629O096R09P518L210l188k268J881Q781J0743
11882F7313O781P014J7920J8311J6078L3448N2868P2136R7575J28243J44689J58555
11870H20931J44735J12085P6971J3875l8180p3286j18971j31108j32672j26844
11860E47536j04106p3488n4900m2499l4311k2434j0788j0914j2765p939q751j4295
11848A50346p988m567j1164q864r074q134j0678p490l683m716k091k722j192K483
$$ plain form
11834 70466 73069 69065 71644 70010 66518 61451 53057 45009 43720 46090 47153 47636 51125 57969 61817
11819 61817 58855 60800 61047 59020 56325 51327 55785 56153 60617 61351 53943 43015 38639 49012 44906
11804 44906 32668 32544 36880 39061 41675 44656 45664 42078 35012 28044 33098 33728 31286 35093 35896
11789 35896 39427 34237 37089 40692 40037 37312 35053 34041 28791 33982 40534 42978 46354 40190 34197
11774 34197 31204 35553 33315 26649 25824 26658 27366 22775 21564 20032 12541 10579 17087 17870 19959
11759 19959 22072 26389 22007 18975 22422 23984 25892 23196 26264 23231 18752 18964 15233 21377 26649
11744 26649 27410 25298 17391 13489 5434 10419 13873 15662 17085 18457 21424 26704 26108 22653 26659
11729 26659 24277 17108 17975 18816 22677 23503 15944 18631 22717 23716 16977 18951 14656 6197 2214
$$ packed form
11834G0466K603m004K579j634l492n067q394q048j289K370J063M83L489O844L848
11819F1817k962J945K47k027k695m998M458L68M464P34p408j0928m376J0373m106
11804D4906j2238j24M336K181K614K981J008l586p066o968N054O30k442L807Q03
11789C5896L531n190K852L603o55k725k259j012n250N191O552K444L376o164n993
11774C4197k993M349k238o666q25Q34P08m591j211j532p491j962O508P83K089
11759A9959K113M317m382l032L447J562J908k696L068l033m479K12l731O144N272
11744B6649P61k112p907l902q055M985L454J789J423J372K967N280n96l455M006
11729B6659k382p169Q67Q41L861Q26p559K687M086R99o739J974m295q459l983
$$ plain form
11714 2214 3663 10673 8460 7025 5785 5918 2564 -2210 144 -4258 -2728 2378 4595 2040 2611
11699 2611 5856 12635 9992 4631 2485 9099 9431 6278 9434 8212 10355 8695 13879 20223 15226
11684 15226 14855 13472 7071 5415 1789 -2602 -594 1677 3036 1132 4718 10619 4545 -1826 2135
11669 2135 4324 -3264 -9777 -17162 -20239 -13597 -9284 -11013 -13261 -12340 -11677 -4813 -1870 -5099 -2608
11654 -2608 3115 5666 9985 13753 11688 9929 8100 6217 12336 21712 24593 22950 20075 16647 18325
11639 18325 18511 13223 15177 16731 20593 19836 15966 9640 6514 11661 13906 11570 14993 18331 20292
11624 20292 23125 20912 21945 21153 17109 16523 13690 9682 15604 18006 17014 10834 6575 1484 -12136
11609 -12136 -14543 -9971 -8650 -7332 -401 1746 903 -69 603 4519 4083 -4633 -7186 -7450 -12128 -13942
$$ packed form
11714B214J449P010k213j435j240J33l354m774K354m402J530N106K217k555N71
11699B611L245O779k643n361k146O614L32l153L156j222K143j660N184O344m997
11684A5226l71j383o401j656l626m391K008K271J359j904L586N901o074o371L961
11669B135K189p588o513p385l077O642M313j729k248R21O63O864K943l229K491
11654b608N723K551M319L768k065j759j829j883O119R376K881j643k875l428J678
11639A8325J86n288J954J554L862p57l870o326l126N147K245k336L423L338J961
11624B0292K833k213J033p92m044n86k833m008N922K402r92o180m259n091j3620
11609a2136k407M572J321J318O931K147q43r72O72L916m36q716k553k64m678j814
$$ plain form
11593 -13942 -11474 -3020 889 136 1457 1025 3542 -1214 -4384 1491 5369 -394 -1463 6105 9109
11578 9109 7546 14379 10937 5322 5718 659 -6264 -4100 -8535 -12570 -11025 -6253 -3819 -3595 702
11563 702 -1830 -6346 -10017 -12056 -11075 -11074 -8547 -3665 1408 3397 9386 6728 4923 3619 450 5078
11547 5078 14837 10048 7265 6495 4709 -887 -2237 -5520 -5587 66 -4110 -7966 1912 -4182 -6337
11532 -6337 -6467 -6725 -5733 2530 1992 1477 1596 -1634 -446 5458 2381 -6381 -6080 -2805 7278 5845
11516 5845 -2006 53 846 223 -7528 -1778 -866 -5329 -1245 897 4904 9228 11728 10450 5957
11501 5957 4347 -1080 -122 -2358 -1143 2951 -975 451 -402 5847 3900 1540 1215 -1779 -1576 3894
11485 3894 11201 9101 523 1046 9343 7543 2628 6025 -1569 -3687 -871 6978 16113 6133 -4115
$$ packed form
11593a3942K468Q454L909p53J321m32K517m756l170N875L878n763j069P568L004
11578I109j563O833l442n615L96n059o923K164m435m035J545M772K434K24M297
11563G02k532m516l671k039R81JK527M882N073J989N989k658j805j304l169M628
11547E078R759m789k783p70j786n596j350l283o7N653m176l856R878o094k155
11532f337j30k58R92Q263n38n15J19l230J188N904l077q762L01L275J0083j433
11516E845p851K059P93o23p751N750R12m463M084K142M007M324K500j278m493
11501E957j610n427R58k236J215M094l926J426q53O249j947k360l25k994K03N470
11485C894P307k100q578N23Q297j800m915L397p594k118K816P849R135r980j0248
$$ plain form
11470 -4115 2235 2297 -6391 -3445 1815 5367 2572 6055 5713 7691 10628 2591 -1619 -714 -2144 -6098
11454 -6098 -1158 337 -2360 -8648 -9608 -9285 -5178 -2938 241 3730 2177 -4172 -12148 -10366 -10358 -8499
11438 -8499 -6566 -8399 -13232 -4757 1414 1834 -1116 -4839 -8103 -9850 -7018 -8102 -6100 -4809 -1034
11423 -1034 2036 3555 308 312 4876 3559 1731 3137 -807 -12656 -14480 -8750 281 -93 -1266
11408 -1266 2696 2264 -609 -2554 5482 7974 5600 2387 1520 -1920 -5041 -4568 -1309 841 4171
11393 4171 2344 -1675 -6989 -2851 1693 4018 6388 3218 2034 7545 10109 8292 472 -1167 -4805
11378 -4805 -3835 -1172 1014 -2957 -901 1314 4544 11780 16245 8142 5879 2638 -569 2423 4317
11363 4317 5996 9055 3461 -2555 -5228 -3295 -1471 -4151 1352 434 -4292 -10363 -6735 -5210 -8256
$$ packed form
11470d115O350O2q688K946N260L552k795L483l42J978K937q037m210R05j430l954
11454f098M940J495k697o288r60L23M107K240L179L489j553o349p976J782QJ859
11438h499J933j833m833Q475O171M20k950l723l264j747K832j084K002J291L775
11423a034L070J519l247MM564j317j828J406l944j1849j824N730R031l74j173
11408a266L962m32k873j945Q036K492k374l213q67l440l121M73L259K150L330
11393D171j827m019n314M138M544K325K370l170j184N511K564j817p820j639l638
11378d805R70K663K186l971K056K215L230P236M465q103k263l241l207K992J894
11363D317J679L059n594o016k673J933J824k680N503r18m726o071L628J525l046
$$ plain form
11348 -8256 -9261 -9391 -9878 -10116 -6882 -3974 4215 4144 5049 1473 7983 11376 4579 -2190 -6168 -7547
11332 -7547 -8432 -4807 808 -275 -986 1738 2538 8170 12792 7195 7907 7786 10033 6676 6385 3363
11316 3363 1917 4387 9152 3405 6370 2957 6061 7312 9077 -1920 -6244 -4368 -2256 398
11302 398 -1011 5337 7163 -397 146 -4204 -6002 -3675 3233 -725 -3989 -3032 -69 -2427 -4922
11287 -4922 -5862 -3030 5581 6595 5863 2583 3888 -1193 -485 5111 13405 10575 3558 3951 -970 -286
11271 -286 235 1970 7180 12873 13170 7580 6467 3974 -1091 -3518 -5216 -8277 -6855 -2286 -2423 -4018
11255 -4018 -3380 3583 5153 2359 993 3812 -2676 -7647 -1192 -4631 -6619 -3485 -96 1397 -2309
11240 -2309 -3413 -2948 -3383 1180 3586 3862 2887 -7748 -758 2434 961 2323 3085 -1405 -4847 -7940
$$ packed form
11348h256j005j30m87k38L234K908Q189p1R05l576O510L393o797o769l978j379
11332g547q85L625N615j083p11K724Q00N632M622n597P12j21K247l357k91l022
11316C363j446K470M765n747K965l413L104J251J765j0997m324J876K112K654
11302C98j409O348J826p560N43m350j798K327O908l958l264R57K963k358k495
11287d922r40K832Q611J014p32l280J305n081P08N596Q294k830p017L93m921O84
11271b86N21J735N210N693K97n590j113k493n065k427j698l061J422M569j37j595
11255d018O38O963J570k794j366K819o488m971O455l439j988L134L389J493l706
11240b309j104M65m35M563K406K76r75j0635O990L192j473J362P62m490l442l093
$$ plain form
11224 -7940 -3968 662 7280 2205 -5154 -4727 -6815 426 2442 6480 3721 3700 4851 1809 2314 2021
11208 2021 3630 2632 -4529 -6972 -9948 -11643 -8492 -1289 -3228 -8687 -7284 -7140 -10844 -8183 189
11193 189 7002 17682 28143 31150 42346 54111 47611 39350 24829 16980 12458 17325 15073 10249
11179 10249 10654 7412 -1036 -1193 1218 -1250 -1569 -1307 -3215 -1807 -5749 -12213 -7405 7887 14917
11164 14917 16826 14696 9702 13700 9090 2732 372 -3416 496 3048 146 -7016 -8538 -4113
11150 -4113 -6079 -5400 4667 11243 8616 3589 3441 3573 3792 6221 5806 1027 7338 6699 5699 430
11134 430 -879 1821 1116 3070 5223 -3513 -1377 1098 1905 7869 9844 12366 9251 7483 5130
11119 5130 1412 -852 -9433 -10212 -1807 -1739 2484 1527 46 -5044 -10362 -5549 -262 7273 6305 5066
$$ packed form
11224g940L972M630O618n075p359M27k088P241K016M038k759k1J151l042N05k93
11208B021J609r98p161k443k976j695L151P203j939n459J403J44l704K661Q372
11193A89O813J0680J0461L007J1196J1765o500q261j4521p849m522M867k252m824
11179A0249M05l242q448j57K411k468l19K62j908J408l942o464M808J5292P030
11164A4917J909k130m994L998m610o358k360l788L912K552k902p162j522M425
11150d113j966O79J0067O576k627n027j48J32K19K429m15m779O311o39j000n269
11134D30j309K700p05J954K153q736K136K475Q07N964J975K522l115j768k353
11119E130l718k264q581p79Q405O8M223r57j481n090n318M813N287P535r68j239
$$ plain form
11103 5066 1723 3614 2196 -438 -5249 -9398 -11917 -19569 -12518 -1870 4919 7917 6485 10339
11089 10339 20217 15851 8373 7244 6989 5619 -3742 300 3294 1522 -228 7888 15584 9795 4718
11074 4718 -828 -429 -4221 -5226 -8463 -9921 -1871 4645 439 4823 3090 3391 9608 9901 6057
11059 6057 -3976 -6771 -3068 2556 5064 892 -4036 -5309 -8308 -9609 -7744 -3692 -7464 -18639
11045 -18639 -12712 -4539 1888 -1241 1522 974 -3231 -7885 -4504 9526 13034 9518 10968 9930
11031 9930 443 -6268 2070 1382 3363 5355 1128 561 3667 5433 6972 9004 3032 -195 2978
11016 2978 -1154 -6796 -3945 4688 5109 -4732 -11294 -5865 3907 2732 7122 8996 -7109 -13274 -8885
11001 -8885 -3383 -2078 -2958 -3130 -1837 -3529 -4191 -4916 -1010 2473 -2457 -9350 -6337 626 2163 3040
$$ packed form
11103E066l343J891j418k634m811m149k519p652P051J0648O789K998j432L854
11089A0339R878m366p478j129k55j370r361M042K994j772j750Q116P696n789n077
11074D718n546L99l792j005l237j458Q050O516m206M384j733L01O217K93l844
11059F057j0033k795L703N624K508m172m928j273k999j301J865M052l772j1175
11045a8639N927Q173O427l129K763n48m205m654L381J4030L508l516J450j038
11031I930r487o711Q338o88J981J992m227n67L106J766J539K032n972l227L173
11016B978m132n642K851Q633M21r841o562N429R772j175M390J874j6105o165M389
11001h885N502J305q80j72J293j692o62p25L906L483m930o893L013O963J537Q77
$$ plain form
10985 3040 5868 10837 3480 -9007 -5031 7140 6633 5786 -863 2198 4302 2342 1503 -2187 -1645
10970 -1645 1335 9385 14680 17928 15176 6806 -3005 -2452 -384 1544 5384 8334 6059 -1728 -6978
10955 -6978 -10113 -11398 -4582 -587 -1604 -484 -275 26 4681 13979 5720 -652 -579 2344 1964 -858
10939 -858 -1641 -6271 2621 7101 6882 2121 4295 4695 4342 9300 9141 5376 223 -988 -623 -2339
10923 -2339 6128 7749 10584 5709 6428 6683 5924 11038 8305 1791 2116 -5879 -5256 3075 6415 8844
10907 8844 15656 11740 10332 2597 881 3514 541 4975 5977 -1079 3141 6217 920 -232 1866
10892 1866 5756 4853 4036 544 9413 18476 12728 6552 9801 10868 10203 12358 17123 16793 12943 9631
10876 9631 11390 8772 11307 11843 13985 10545 11995 5712 9111 13537 17638 19248 12242 6099 6957
$$ packed form
10985C040K828M969p357j2487L976J2171n07q47o649L061K104j960q39l690N42
10970a645K980Q050N295L248k752q370r811N53K068J928L840K950k275p787n250
10955f978l135j285O816L995j017J120K09L01M655R298q259o372P3K923l80k822
10939h58p83m630Q892M480k19m761K174M00l53M958j59l765n153j211L65j716
10923b339Q467J621K835m875P19K55p59N114k733o514L25p995O23Q331L340K429
10907H844O812l916j408p735j716K633k973M434J002p056M220L076n297j152K098
10892A866L890r03q17l492Q869R063n748o176L249J067o65K155M765l30l850l312
10876I631J759k618K535N36K142l440J450o283L399M426M101J610p006o143Q58
$$ plain form
10861 6957 18143 19124 19217 19073 18339 21119 20997 20737 14012 11832 13118 10741 7482 6125 7342 6453
10845 6453 9751 12124 10242 5259 295 5146 10765 9817 8607 11221 9315 14958 15226 11042 14344
10830 14344 18090 22278 26610 29986 31269 26629 20285 7917 6343 13889 18155 26904 27858 19241
10816 19241 21765 21979 20978 19836 24815 26437 21949 12902 13245 13912 13604 19828 25655 29422 30462
10801 30462 24346 20764 23535 27976 27667 30808 30709 31588 32450 25152 20980 14967 20485 27729 28893 21961
10785 21961 21387 21977 27250 30156 30721 31161 25387 21741 23174 24440 29970 33066 32819 32150 27778 36619
10769 36619 40165 37931 43970 43070 34595 33451 42696 42799 37242 35208 33973 41328 42337 43957 41675
10754 41675 39524 36859 34210 26938 21637 18980 13646 15725 14270 16151 19864 25273 26441 13042
$$ packed form
10861F957J1186R81R3j44p34K780j22k60o725k180J286k377l259j357J217q89
10845F453L298K373j882m983m964M851N619r48j210K614j906N643K68m184L302
10830A4344L746M188M332L376J283m640o344j2368j574P546M266Q749R54q617
10816A9241K524K14j001j142M979J622m488r047L43O67l08O224N827L767J040
10801C0462o116l582K771M441l09L141r9Q79Q62p298m172o013N518P244J164o932
10785B1961n74N90N273K906N65M40n774l646J433J266N530L096k47o69m372Q841
10769C6619L546k234O039r00q475j144R245J03n557k034j235P355J009J620k282
10754D1675k151k665k649p272n301k657n334K079j455J881L713N409J168j3399
$$ plain form
10740 13042 7852 10316 7613 8182 7684 7517 19461 25657 24335 20606 16713 18787 13308 13490 13952
10725 13952 15768 23794 26029 25775 16047 15100 22598 27305 34142 34864 35097 31666 23672 18794 12529
10710 12529 8186 8259 7601 7022 7386 7320 12830 13730 3521 6927 10527 13594 6970 9374 17449 17990
10694 17990 19944 22164 23956 29232 34778 33420 24980 18759 25541 23228 12131 12294 17280 17860 22190
10679 22190 19311 12086 14909 17649 12141 9489 12329 22152 30145 39712 59336 69570 65985 63639
10665 63639 51775 42828 40831 34386 30115 33348 33752 42448 48250 47295 45349 35249 32403 36315
10651 36315 43521 54986 54970 58777 62347 67255 70458 72387 66942 62053 50167 49322 45506 45097 46051
10636 46051 52206 53602 62717 62638 63787 67514 68825 65863 56128 41996 33825 25202 22043 19811 20350
$$ packed form
10740A3042n190K464k703N69m98j67J1944O196j322l729l893K074n479J82M62
10725A3952J816Q026K235k54r728r47P498M707O837P22K33l431p994m878o265
10710A2529m343P3o58n79L64o6N510R00j0209L406L600L067o624K404Q075N41
10694A7990J954K220J792N276N546j358q440o221O782k313j1097J63M986N80M330
10679B2190k879p225K823K740n508k652K840R823P993R567J9624J0234l585k346
10665F3639j1864q947j997o445m271L233M04Q696N802r55j946j0100k846L912
10651C6315P206J1465j6L807L570M908L203J929n445m889j1886q45l816m09R54
10636D6051O155J396R115p9J149L727J311k962r735j4132q171q623l159k232N39
$$ plain form
10621 20350 20124 24220 27040 22674 21315 21538 14731 11151 18183 23690 26590 29839 23066 16982 22443
10606 22443 40032 60782 76470 97958 122973 142954 151253 164189 172860 170526 171331 168637 158314
10593 158314 144842 125879 118257 112892 102889 99752 101675 104230 103764 100609 92025 84849 77883 76001
10579 76001 76696 77066 68656 67429 65248 61058 58087 55360 50944 55127 55134 56827 60321 58253 62141 68266
10563 68266 69542 73119 74068 79174 86581 96071 105046 119460 143314 164103 178502 189982 205404
10550 205404 215898 214890 216745 219085 218622 219910 212874 201932 196029 197335 207267 230883 262195
10537 262195 325309 418599 554632 749393 985064 1231580 1500089 1730822 1862800 1938489
10527 1938489 1904411 1741018 1552324 1340388 1096893 891915 731118 598966 511135 447917
$$ packed form
10621B0350k26M096K820m366j359K23o807l580P032N507K900L249o773o084N461
10606B2443J7589K0750J5688K1488K5015J9981Q299J2936Q671k334Q05k694j0323
10593A58314j3472j8963p622n365j0003l137J923K555m66l155q584p176o966j882
10579G6001O95L70q410j227k181m190k971k727m416M183PJ693L494k068L888O125
10563F8266J276L577R49N106P407R490Q975J4414K3854K0789J4399J1480J5422
10550B05404J0494j008J855K340m63J288p036j0942n903J306R932K3616L1312
10537B62195O3114R3290J36033J94761K35671K46516K68509K30733J31978P5689
10527A938489l4078j63393j88694k11936k43495k04978j60797j32152q7831o3218
$$ plain form
10517 447917 395528 360392 336531 316231 298186 282881 270591 263652 261137 259133 258402 263770 262273
10504 262273 256303 244650 238794 237712 237721 235819 233564 231862 226636 232608 253392 293948 337286 381969
10490 381969 416215 436781 430392 387461 332726 282680 235573 199760 178017 162985 148787 142963
10478 142963 134023 132947 124262 115377 111379 110393 116399 122086 116327 110518 107706 109030 112182 102097
10464 102097 98463 100619 105122 96306 84255 78213 81312 78245 79466 88315 84073 75850 71345 67314
10450 67314 61310 54013 50462 46455 42994 44505 46089 36871 26427 18998 10556 1381 -5418 -4213
10436 -4213 9470 31919 48987 66548 87000 106784 123807 142773 143071 136418 137931 144195 136466
10423 136466 131956 137044 134469 134184 133255 127750 123711 130485 141514 137721 130573 126550 125606 122078 122136
$$ packed form
10517D47917n2389l5136k3861k0300j8045j5305j2290o939k515k004p31N368j497
10504B62273n970j1653n856j082Rj902k255j702n226N972K0784M0556M3338M4683
10490C81969L4246K0566o389m2931n4735n0046m7107l5813k1743j5032j4198n824
10478A42963q940j076q685q885l998r86O006N687n759n809k812J324L152j0085
10464A02097l634K156M503q816j2051o042L099l067J221Q849m242q223m505m031
10450F7314o004p297l551m007l461J511J584r218j0444p429q442r175o799J205
10436d213J3683K2449J7068J7561K0452J9784J7023J8966K98o653J513O264p729
10423A36466m510N088k575k85r29n505m039O774J1029l793p148m023r44l528N8
$$ plain form
10408 122136 127386 128479 132781 139187 145531 153325 168850 195942 217749 243233 266418 280927 278976
10395 278976 288820 305770 348917 413422 475515 511949 503416 427276 345674 308470 295298 295491
10383 295491 319104 332669 337369 353215 352011 326546 312131 297346 269407 247906 228835 206779
10371 206779 196999 196744 201146 197143 196516 197665 201616 207698 212056 216995 215584 211201 203310 194943 191643
10356 191643 185305 175672 164759 162202 155761 148994 144511 133647 118555 103845 86849 71733 58623
10343 58623 54155 52493 49971 55595 58275 63247 55987 60021 64136 67672 69962 76261 71260 62001
10329 62001 60015 53408 45348 40148 47268 50868 46782 40761 44593 56058 72363 86628 103512
10316 103512 121421 131629 146296 156539 152295 139873 119270 99518 86778 75442 62750 55147
$$ packed form
10408A22136N250J093M302O406O344P794J5525K7092K1807K5484K3185J4509j951
10395B78976R844J6950M3147O4505O2093L6434q533p6140q1602l7204j3172J93
10383B95491K3613J3565M700J5846j204k5465j4415j4785k7939k1501j9071k2056
10371B06779r780k55M402m003o27J149L951O082M358M939j411m383p891q367l300
10356A91643o338r633j0913k557o441o767m483j0864j5092j4710j6996j5116j3110
10343E8623m468j662k522N624K680M972p260M034M115L536K290O299n001r259
10329F2001j986o607q060n200P120L600m086o021L832J1465J6305J4265J6884
10316A03512J7909J0208J4667J0243m244j2422k0603j9752j2740j1336j2692p603
$$ plain form
10304 55147 53554 65988 80426 93709 113571 126825 133956 135156 132620 134387 128480 127750 132622
10291 132622 132647 133242 134620 133826 139884 142974 144992 156515 176968 201001 222791 235464 241629 240691
10277 240691 233517 222624 210537 205785 202834 191635 178295 172587 168742 168379 169785 174568 178535
10264 178535 183830 191807 196350 207109 227354 243627 258661 290948 325253 361783 397101 423921
10252 423921 449752 475009 470680 467677 465070 445090 422678 416136 405190 395701 392679 393933 395494
10239 395494 402190 407562 407787 411715 416169 419564 427053 441190 449619 458299 471179 484732 498126
10226 498126 513318 514585 514018 514645 513704 509125 511134 510313 513271 517804 528068 535099 550511 566709
10212 566709 583164 602437 621990 650167 671240 695138 715292 735250 746879 759138 771476
$$ packed form
10304E5147j593J2434J4438J3283J9862J3254P131J200k536J767n907p30M872
10291A32622K5N95J378p94O058L090K018J1523K0453K4033K1790J2673O165r38
10277B40691p174j0893j2087m752k951j1199j3340n708l845l63J406M783L967
10264A78535N295P977M543J0759K0245J6273J5034L2287L4305L6530L5318K6820
10252D23921K5831K5257m329l003k607j9980k2412o542j0946r489l022J254J561
10239C95494O696N372K25L928M454L395P489J4137Q429Q680J2880J3553J3394
10226D98126J5192J267n67O27r41m579K009q21K958M533J0264P031J5412J6198
10212E66709J6455J9273J9553K8177K1073K3898K0154J9958J1629J2259J2338
$$ plain form
10201 771476 775366 778414 783229 789461 799749 815556 838921 864872 889166 911914 934512 957879
10189 957879 970736 984342 990209 998437 1005507 1010003 1013023 1021090 1034425 1049672 1076219 1114046 1166704
10176 1166704 1216794 1264530 1318947 1386019 1458083 1530538 1605661 1687379 1761778 1835725 1898584
10165 1898584 1941329 1973447 2000823 2035550 2104226 2201063 2341277 2530469 2758931 3031251
10155 3031251 3354374 3723887 4157430 4660244 5219339 5834055 6484424 7110940 7738159
10146 7738159 8365455 8985606 9716438 10611941 11736211 13254566 15244317 17844968 21344665
10137 21344665 26160800 33193567 44137027 60832590 84341018 116562206 157633640
10130 157633640 201198317 246165042 289411449 316068817 329827856 333212768 312953685
$$ packed form
10201G71476L890L048M815O232J0288J5807K3365K5951K4294K2748K2598K3367
10189I57879J2857J3606N867Q228P070M496L020Q067J3335J5247K6547L7827N2658
10176A166704N0090M7736N4417O7072P2064P2455P5123Q1718P4399P3947O2859
10165A898584M2745L2118K7376L4727O8676R6837J40214J89192K28462K72320
10155C031251L23123L69513M33543N02814N59095O14716O50369O26516O27219
10146G738159O27296O20151P30832Q95503J124270J518355J989751K600651L499697
10137B1344665M816135P032767J0943460J6695563K3508428L2221188M1071434
10130A57633640M3564677M4966725M3246407K6657368J3759039L384912k0259083
$$ plain form
10123 312953685 281064764 246892623 204552500 164308251 132732547 106908645 87512854
10116 87512854 74375596 65413331 58849827 53750187 49684045 46320895 43479432 41091347
10108 41091347 39096708 37385425 35890487 34608168 33397205 32217883 31076464 29879313
10100 29879313 28669631 27494389 26331413 25251486 24289446 23407753 22604333 21864252 21155943
10091 21155943 20476734 19810671 19147074 18503980 17898401 17330011 16821651 16385762 16021009
10082 16021009 15728846 15484797 15249639 15036481 14781271 14432445 14044295 13612317 13125949
10073 13125949 12650563 12195729 11747073 11334632 10952970 10605392 10287018 9994683 9723146
10064 9723146 9465542 9217647 8976281 8746372 8524821 8306049 8092022 7882454 7692846
$$ packed form
10123C12953685l1888921l4172141m2340123m0244249l1575704k5823902j9395791
10116H7512854j3137258q962265o563504n099640m066142l363150k841463k388085
10108D1091347j994639j711283j494938j282319j210963j179322j141419j197151
10100B9879313j209682j175242j162976j079927r62040q81693q03420p40081p08309
10091B1155943o79209o66063o63597o43094o05579n68390n08360m35889l64753
10082A6021009k92163k44049k35158k13158k55210l48826l88150m31978m86368
10073A3125949m75386m54834m48656m12441l81662l47578l18374k92335k71537
10064I723146k57604k47895k41366k29909k21551k18772k14027k09568j89608
$$ plain form
10055 7692846 7506589 7320233 7136706 6954966 6776156 6601676 6425421 6258538 6099440
10046 6099440 5951390 5804845 5662243 5530673 5406864 5289203 5168716 5051400 4936257
10037 4936257 4820637 4706723 4596426 4485850 4360453 4234324 4118902 3999987 3885321
10028 3885321 3770180 3662915 3562527 3468018 3385870 3301211 3209727 3135052 3072501 2998265 2927193
10017 2927193 2850931 2775338 2703738 2634363 2564702 2497937 2432044 2370773 2316924 2267584 2218763
10006 2218763 2174785 2133348 2113257 2096028 2069221 2052009 2024355 1987023 1954137 1918779 1879025
9995 1879025 1844171 1812376 1780233 1750064 1717283 1689987 1659214 1631914 1597584 1559326 1520118
9984 1520118 1474089 1421258 1378290 1323149 1262571 1200767 1131569 1056825 990323 928942 884152
$$ packed form
10055G692846j86257j86356j83527j81740j78810j74480j76255j66883j59098
10046F099440j48050j46545j42602j31570j23809j17661j20487j17316j15143
10037D936257j15620j13914j10297j10576j25397j26129j15422j18915j14666
10028C885321j15141j07265j00388r4509q2148q4659r1484p4675o2551p4236p1072
10017B927193p6262p5593p1600o9375o9661o6765o5893o1271n3849m9340m8821
10006B218763m3978m1437k0091j7229k6807j7212k7654l7332l2886l5358l9754
9995A879025l4854l1795l2143l0169l2781k7296l0773k7300l4330l8258l9208
9984A520118m6029n2831m2968n5141o0578o1804o9198p4744o6502o1381m4790
$$ plain form
9973 884152 846184 801933 763214 736704 715347 701323 682686 665160 648306 624124 601420 577808
9961 577808 554156 530240 514699 494922 466743 447667 433585 423388 410287 391407 386925 391485
9949 391485 391533 392994 392731 386741 371010 359164 333868 307794 292979 288992 278230 277881 282663 291128
9935 291128 303403 309718 322918 338772 359597 375360 379474 376473 371322 365286 358870 352417 347749
9922 347749 346357 349104 348050 336142 329292 333524 334934 343083 353721 351789 347394 349354 351164 352383
9908 352383 358098 343576 326337 316627 306655 289297 274147 255641 243393 229952 220163 215922 208471
9895 208471 198037 190221 178736 162667 156211 163179 161716 156620 156631 164113 179082 194315 202875 206224
9881 206224 215872 229452 231455 227990 229070 229196 233969 228407 223741 218746 208084 199579 194071 188206
$$ packed form
9973H84152l7968m4251l8719k6510k1357j4024j8637j7526j6854k4182k2704k3612
9961E77808k3652k3916j5541j9777k8179j9076j4082j0197j3101j8880m482M560
9949C91485M8J461k63n990j5731j1846k5296k6074j4815l987j0762l49M782Q465
9935B91128J2275O315J3200J5854K0825J5763M114l001n151o036o416o453m668
9922C47749j392K747j054j1908o850M232J410Q149J0638j932m395J960J810J219
9908C52383N715j4522j7239r710r972j7358j5150j8506j2248j3441r789m241p451
9895B08471j0434p816j1485j6069o456O968j463n096J1P482J4969J5233Q560L349
9881B06224R648J3580K003l465J080J26M773n562m666m995j0662q505n508n865
$$ plain form
9867 188206 186242 184600 177784 173632 173008 176817 177341 170541 172408 180759 177932 179092 178750 175556 176124
9852 176124 168978 168689 165854 164298 157275 152335 149861 141972 138064 136455 127466 121671 119347 111343 95253
9837 95253 88895 81479 71280 60918 54411 46834 45892 40766 36195 31072 24093 16551 10748 7036
9823 7036 3839 9259 24879 43073 61850 90890 125704 141946 151430 160299 164554 160724 163699
9810 163699 160330 155018 149421 151849 166317 190419 214721 237952 263508 319450 427227 637394
9798 637394 957640 1312650 1579560 1647271 1452597 1090689 753714 550204 434258 359532
9788 359532 314574 280581 251103 230405 217690 214276 206956 198837 194925 195780 194359 189790 187559
9775 187559 185902 185254 188372 185694 181456 174370 155545 137750 133591 126752 122870 118908 115913 114887
$$ packed form
9867A88206j964j642o816m152o24L809N24o800J867Q351k827J160l42l194N68
9852A76124p146k89k835j556p023m940k474p889l908j609q989n795k324q004j6090
9837I5253o358p416j0199j0362o507p577r42n126m571n123o979p542n803l712
9823G036l197N420J5620J8194J8777K9040L4814J6242R484Q869M255l830K975
9810A63699l369n312n597K428J4468K4102K4302K3231K5556N5942J07777K10167
9798F37394L20246L55010K66910O7711j94674l61908l36975k03510j15946p4726
9788C59532m4958l3993k9478k0698j2715l414p320q119l912Q55j421m569k231
9775A87559j657o48L118k678m238p086j8825j7795m159o839l882l962k995j026
$$ plain form
9761 114887 113960 106070 105907 107870 112396 110732 104777 98551 103743 109626 115793 120302 122291 123770 125980
9746 125980 132739 131076 130294 128331 124819 129262 133628 128594 130183 131278 139581 146322 156437 165706
9732 165706 166260 171871 184657 208626 246516 301857 386246 515859 687349 906430 1157522
9721 1157522 1424231 1683720 1858586 1945290 1948851 1816003 1624316 1419042 1171974 938963
9711 938963 761164 620768 517949 451821 403741 373728 346808 326807 315274 304778 297439
9700 297439 287158 273932 266436 258540 249390 240750 232165 216917 207906 205099 200641 197741 208986
9687 208986 207747 206548 205435 204899 197520 189922 181729 162710 147254 141805 127257 113972 112390 109925
9673 109925 112157 111946 112582 101509 97704 97259 90623 88490 89725 81189 75244 74457 75784 76403 80386
$$ packed form
9761A14887r27p890j63J963M526j664n955o226N192N883O167M509J989J479K210
9746A25980O759j663p82j963l512M443M366n034J589J095Q303O741J0115R269
9732A65706N54N611J2786K3969L7890N5341Q4389J29613J71490K19081K51092
9721A157522K66709K59489J74866Q6704L561j32848j91687k05274k47068k33011
9711I38963j77799j40396j02819o6128m8080l0013k6920k0001j1533j0496p339
9700B97439j0281j3226p496p896r150q640q585j5248r011k807m458k900J1245
9687B08986j239j199j113n36p379p598q193j9019j5456n449j4548j3285j582k465
9673A09925K232k11O36j1073l805m45o636k133J235q536n945p87J327O19L983
$$ plain form
9658 80386 79649 75097 66717 70001 73647 77869 81489 82860 80030 87030 84160 76577 72804 71711 75597
9643 75597 77403 83907 86320 79163 74070 80544 87447 77257 76942 80492 79081 72982 78003 82917 80488
9628 80488 74542 73049 72769 70627 64824 64002 61657 51137 51864 58257 63314 67344 80838 86633 87667
9613 87667 94756 102126 105409 107219 108076 105190 102717 97261 87838 87274 87010 75861 68155 63974 59535
9598 59535 59231 58299 56617 55548 54250 54753 49387 45758 48019 54662 59640 54378 52014 60381 69929
9583 69929 69844 74150 84561 89335 85534 82419 84965 86399 84686 74966 62029 57640 53690 46714 50150
9568 50150 47347 48693 51349 54911 63951 62651 54179 53547 50062 50031 57935 56915 60490 70074 71143
9553 71143 70167 75898 84299 86920 89394 94993 92331 96069 95789 98819 100817 103727 105342 108054 115001
$$ packed form
9658H0386p37m552q380L284L646M222L620J371k830P000k870p583l773j093L886
9643G5597J806O504K413p157n093O474O903j0190l15L550j411o099N021M914k429
9628H0488n946j493k80k142n803q22k345j0520P27O393N057M030J3494N795J034
9613H7667P089P370L283J810Q57k886k473n456r423n64k64j1149p706m181m439
9598E9535l04r32j682j069j298N03n366l629K261O643M978n262k364Q367R548
9583F9929q5M306J0411M774l801l115K546J434j713r720j2937m389l950o976L436
9568E0150k803J346K656L562R040j300q472o32l485l1P904j020L575R584J069
9553G1143r76N731Q401K621K474N599k662L738k80L030J998K910J615K712O947
$$ plain form
9538 115001 125727 146843 188633 233663 257433 265958 248684 222243 202047 187519 173713 157921
9526 157921 141737 129782 124285 128025 134722 150649 171100 195342 221677 248042 268740 288477
9514 288477 302478 298803 291737 281131 273976 265104 257611 243311 232893 237552 244738 242590 231466
9501 231466 220789 219037 222960 246617 286622 337276 415195 518970 629490 703869 719272 633100
9489 633100 506608 411070 346213 299913 269483 254271 252226 258434 269822 270262 266090 265198 267499
9476 267499 271997 281752 292980 296638 306757 326534 335104 330471 314625 300686 284622 270687 247812
9463 247812 217315 195123 184400 185601 188942 195453 201701 204510 215381 234072 248618 270389 294637
9450 294637 311390 304642 272058 226630 194818 182491 170581 155239 152778 146053 143770 145278 140799
$$ packed form
9538A15001J0726K1116M1790M5030K3770Q525j7274k6441k0196j4528j3806j5792
9526A57921j6184j1955n497L740O697J5927K0451K4242K6335K6365K0698J9737
9514B88477J4001l675p066j0606p155q872p493j4300j0418M659P186k148j1124
9501B31466j0677j752L923K3657M0005N0654P7919J03775J10520P4379J5403q6172
9489F33100j26492r5538o4857m6300l0430j5212k045O208J1388M40m172q92K301
9476B67499M498R755J1228L658J0119J9777Q570m633j5846j3939j6064j3935k2875
9463B47812l0497k2192j0723J201L341O511O248K809J0871J8691J4546K1771K4248
9450B94637J6753o748l2584m5428l1812j2327j1910j5342k461o725k283J508m479
$$ plain form
9437 140799 136048 139345 135372 124239 116331 106001 101154 104826 103912 97801 93704 102149 107149 100702
9423 100702 96105 96392 95612 88207 81392 76505 77007 84843 89939 87104 83200 79042 76163 82823 85362
9408 85362 87086 91728 90719 79179 78149 80583 83767 85178 86795 82801 77202 79151 79027 70078 59608
9393 59608 60336 60893 59521 56657 53810 54459 55177 60428 68776 82304 86611 83155 77452 69304 74403
9378 74403 76285 70417 70228 74727 79784 74122 68982 64994 58758 52940 55934 59415 57295 58012 58668
9363 58668 63024 68404 65464 67963 71990 72065 71606 70407 64443 67289 69708 63245 58047 60656 66227
9348 66227 74528 76352 67173 60099 56960 59326 60299 61564 57901 58369 62527 65308 64726 62867 61658
9333 61658 62249 65858 67827 72180 77091 83426 79021 73019 76897 76248 73344 75889 66830 63670 67883
$$ packed form
9437A40799m751L297l973j1133p908j0330m847L672r14o111m097Q445N000o447
9423A00702m597K87p80p405o815m887N02P836N096k835l904m158k879O660K539
9408H5362J724M642j009j1540j030K434L184J411J617l994n599J949j24q949j0470
9393E9608P28N57j372k864k847O49P18N251Q348J3528M307l456n703q148N099
9378G4403J882n868j89M499N057n662n140l988o236n818K994L481k120P17O56
9363E8668M356N380k940K499M027P5m59j199n964K846K419o463n198K609N571
9348F6227Q301J824r179p074l139K366R73J265l663M68M158K781n82j859j209
9333F1658N91L609J969M353M911O335m405o002L878o49k904K545r059l160M213
$$ plain form
9318 67883 62561 66808 72790 67230 64015 65514 62664 61228 59490 62990 65362 67184 65211 65502 70461
9303 70461 72875 73757 73937 72296 74077 72115 65806 66756 69310 68599 70656 76157 70779 70947 81814 91797
9287 91797 91057 94737 90947 90363 87040 83814 77511 82317 92996 95984 106132 110266 99348 90030
9273 90030 93588 94406 90692 90306 96560 98970 97237 99433 99560 97802 91507 91060 92318 87017 84038 86405
9257 86405 77933 67380 69549 71701 70163 67355 62385 62553 70776 76293 72954 73014 78302 70090 68318
9242 68318 72326 75936 73602 69834 67949 68215 74986 77823 68820 57571 58592 64008 68894 67128 66455
9227 66455 70934 76389 76882 83848 78955 73221 71152 76863 81347 83649 82810 77853 70733 62663 60927
9212 60927 61497 70475 71305 78557 71864 71412 87297 94029 90777 90397 89778 87812 83965 82908 86938 92299
$$ packed form
9318F7883n322M247N982n560l215J499k850j436j738L500K372J822j973K91M959
9303G0461K414Q82J80j641J781j962o309R50K554p11K057N501n378J68J0867R983
9287I1797p40L680l790n84l323l226o303M806J0679K988J0148M134j0918r318
9273I0030L558Q18l714l86O254K410j733K196J27j758o295m47J258n301k979K367
9257H6405q472j0553K169K152j538k808m970J68Q223N517l339O0N288q212j772
9242F8318M008L610k334l768j885K66O771K837r003j1249J021N416M886j766o73
9227F6455M479N455M93O966m893n734k069N711M484K302q39m957p120q070j736
9212F0927N70Q978Q30P252o693m52J5885O732l252l80o19j966l847j057M030N361
$$ plain form
9196 92299 90077 89802 83420 77015 75273 82444 88290 86022 84991 85444 85251 80407 76442 81847 84165
9181 84165 84953 87623 83955 78175 77187 76751 73885 67671 69189 71358 72962 77385 78206 80466 76370 76319
9165 76319 82500 86977 88357 89289 90717 86663 85583 89711 88191 87916 87187 95739 104282 99909 100629 96235
9149 96235 92704 91160 90395 97526 103602 105855 105486 114879 115921 116024 124205 131293 136851 134366 129238
9134 129238 123536 115420 110969 113009 115478 119837 122087 123993 123647 121001 124653 119891 111871 109740 115285
9119 115285 117142 120775 122802 120874 121188 119752 117644 115287 117178 110979 105161 110309 111571 112885 114269
9104 114269 111880 109938 108630 105114 103374 111776 115581 112143 116417 119801 123310 130341 136355 141298
9090 141298 141224 135605 131933 124045 128287 131821 127509 121381 120739 132998 139862 139967 135582 127698 127259
$$ packed form
9196I2299k222k75o382o405j742P171N846k268j031M53j93m844l965N405K318
9181H4165P88K670l668n780r88m36k866o214J518K169J604M423Q21K260m096n1
9165G6319O181M477J380R32J428m054j080M128j520k75p29Q552Q543m373P20m394
9149I6235l531j544p65P131O076K253l69R393J042J03Q181P088N558k485n128
9134A29238n702q116m451K040K469M359K250J906l46k646L652m762q020k131N545
9119A15285J857L633K027j928L14j436k108k357J891o199n818N148J262J314J384
9104A14269k389j942j308l516j740Q402L805l438M274L384L509P031O014M943
9090A41298p4n619l672p888M242L534m312o128o42J2259O864J05m385p884m39
$$ plain form
9075 127259 131476 137451 135680 130205 127154 131619 132065 125935 130391 133399 134049 129638 129390 127455 132950
9060 132950 137154 138134 140766 147475 141843 129941 129436 132157 139434 132299 126786 130198 130642 141590 148182
9045 148182 141028 138534 133922 136407 136821 133813 136922 143106 133884 124454 120416 125860 127918 141245
9031 141245 144591 138261 131778 130657 135904 147109 148882 143208 142483 139530 139439 140770 142656 146526 147296
9016 147296 149927 152298 151212 148159 151028 158101 161888 154061 158216 155539 152550 149787 151119 153539
9002 153539 152375 156113 162889 161665 163152 166181 165825 161750 157047 157842 154999 158131 158878 151974 154854
8987 154854 161762 160437 156871 162405 169045 175327 173207 167722 169433 176003 175689 169229 169237 168044 164346
8972 164346 166052 169546 171183 176433 177615 168433 166554 165543 170871 170658 166450 168834 180114 188013
$$ packed form
9075A27259M217N975j771n475l051M465M46o130M456L008O50m411k48j935N495
9060A32950M204R80K632O709n632j1902n05K721P277p135n513L412M44J0948O592
9045A48182p154k494m612K485M14l008L109O184r222r430m038N444K058J3327
9031A41245L346o330o483j121N247J1205J773n674p25k953r1J331J886L870P70
9016A47296K631K371j086l053K869P073L787p827M155k677k989k763J332K420
9002A53539j164L738O776j224J487L029l56m075m703P95k843L132P47o904K880
8987A54854O908j325l566N534O640O282k120n485J711O570l14o460Qj193l698
8972A64346J706L494J637N250J182r182j879j011N328k13m208K384J1280P899
$$ plain form
8958 188013 193259 192579 199212 200293 197744 198614 195525 193040 193405 190763 189262 185973 182628 187350 188145
8943 188145 191988 197867 200864 202339 208611 204283 195149 190486 192610 196339 192496 189288 196401 202099
8929 202099 203456 208126 211198 212994 214516 216171 218306 218945 217574 224917 224109 223002 224360 227209 232286
8914 232286 233715 234238 239444 244487 241445 245271 243632 251316 256019 256979 262735 266379 272981 268299 269667
8899 269667 269655 271633 271299 278653 285164 288967 291036 292941 299471 303340 304180 301606 298597 294668 288179
8884 288179 294342 296590 300562 312878 322129 323891 325702 321394 321740 326764 339949 346687 344726 347107
8870 347107 345732 344258 345989 350032 353599 355044 359919 368213 371232 375382 383512 383119 383035 381528 386490
8855 386490 387407 394560 402790 403817 401404 401941 399510 404709 412499 416502 418199 421099 427051 436308 431171
$$ packed form
8958A88013N246o80O633J081k549Q70l089k485L65k642j501l289l345M722P95
8943A88145L843N879K997J475O272m328r134m663K124L729l843l208P113N698
8929B02099J357M670L072J796J522J655K135O39j371P343q08j107J358K849N077
8914B32286J429N23N206N043l042L826j639P684M703R60N756L644O602m682J368
8899B69667j2J978l34P354O511L803K069J905O530L869Q40k574l009l929o489
8884B88179O163K248L972J2316R251J762J811m308L46N024J3185O738j961K381
8870C47107j375j474J731M043L567J445M875Q294L019M150Q130l93q4j507M962
8855C86490R17P153Q230J027k413N37k431N199P790M003J697K900N952R257n137
$$ plain form
8840 431171 427362 436271 445560 449904 453691 452227 450565 451468 446892 444790 452182 454164 455142 447036 450936
8825 450936 468563 477658 483592 490582 490371 490010 492361 494161 494203 494698 495223 493543 491643 490661 494513 493104
8809 493104 498895 497643 496129 506308 513420 515157 519035 521418 527680 537500 542516 547876 554150 561068
8795 561068 566396 573853 579800 586973 591454 590954 592138 598837 610792 616093 618916 623978 633441 643471
8781 643471 652089 662312 666677 678644 682363 688428 700913 708412 704886 717296 731927 738586 748583
8768 748583 761767 777514 786377 799810 809863 822081 828865 832184 838913 848013 858705 871815 883586
8755 883586 887081 904236 922548 934280 940652 951596 965498 977283 995046 1019292 1036351 1045778
8743 1045778 1061825 1081919 1092746 1108873 1126908 1139591 1159204 1178113 1193533 1210714 1221778
$$ packed form
8840D31171l809Q909R289M344L787j464j662R03m576k102P392J982R78q106L900
8825D50936J7627R095N934O990k11l61K351J800M2M95N25j680j900r82L852j409
8809D93104N791j252j514J0179P112J737L878K383O262R820N016N360O274O918
8795E61068N328P457N947P173M481n00J184O699J1955N301K823N062R463J0030
8781F43471Q618J0223M365J1967L719O065J2485P499l526J2410J4631O659R997
8768G48583J3184J5747Q863J3433J0053J2218O784L319O729R100J0692J3110J1771
8755H83586L495J7155J8312J1732O372J0944J3902J1785J7763K4246J7059R427
8743A045778J6047K0094J0827J6127J8035J2683J9613J8909J5420J7181J1064
$$ plain form
8732 1221778 1242861 1264887 1277650 1301978 1331938 1352365 1370502 1385975 1401572 1425303 1457337
8721 1457337 1479892 1499980 1532395 1554624 1572478 1589090 1607446 1637108 1670863 1707664 1733976
8710 1733976 1755957 1775202 1801969 1830932 1867883 1901328 1929855 1965194 2003807 2039859 2078279
8699 2078279 2116876 2150342 2186668 2231883 2273288 2319197 2371750 2425502 2474592 2524689 2573727
8688 2573727 2625801 2683064 2741484 2794342 2850567 2910055 2978728 3044327 3118043 3186528 3258621
8677 3258621 3342746 3426222 3499133 3576243 3662475 3752235 3841442 3935740 4040925 4145341 4251019
8666 4251019 4355448 4470009 4583857 4700213 4832237 4977525 5130931 5282667 5432783 5597092
8656 5597092 5761520 5935202 6120898 6317298 6520341 6739210 6964444 7200783 7452450 7720712
$$ packed form
8732A221778K1083K2026J2763K4328K9960K0427J8137J5473J5597K3731L2034
8721A457337K2555K0088L2415K2229J7854J6612J8356K9662L3755L6801K6312
8710A733976K1981J9245K6767K8963L6951L3445K8527L5339L8613L6052L8420
8699B078279L8597L3466L6326M5215M1405M5909N2553N3752M9090N0097M9038
8688B573727N2074N7263N8420N2858N6225N9488O8673O5599P3716O8485P2093
8677C258621Q4125Q3476P2911P7110Q6232Q9760Q9207R4298J05185J04416J05678
8666D251019J04429J14561J13848J16356J32024J45288J53406J51736J50116J64309
8656E597092J64428J73682J85696J96400K03043K18869K25234K36339K51667K68262
$$ plain form
8646 7720712 8008278 8309005 8619312 8947399 9289550 9651508 10036676 10447247 10880236 11348810
8636 11348810 11850536 12380288 12952114 13554540 14188507 14866373 15597878 16370980 17192339
8627 17192339 18077334 19010787 20004840 21062454 22198669 23407571 24701664 26080132 27540266
8618 27540266 29086803 30725229 32461585 34284146 36185093 38156656 40184346 42257879
8610 42257879 44359455 46462357 48528339 50520031 52406372 54154058 55710133 57044452
8602 57044452 58151451 59000843 59542422 59739970 59564580 59010613 58183645 57157272 55957004
8593 55957004 54604929 53131764 51576419 49953006 48294349 46621046 44959347 43328492
8585 43328492 41736786 40183615 38682101 37238774 35861980 34534896 33270398 32064165
$$ packed form
8646G720712K87566L00727L10307L28087L42151L61958L85168M10571M32989M68574
8636A1348810N01726N29752N71826O02426O33967O77866P31505P73102Q21359
8627A7192339Q84995R33453R94053J057614J136215J208902J294093J378468J460134
8618B7540266J546537J638426J736356J822561J900947J971563K027690K073533
8610D2257879K101576K102902K065982J991692J886341J747686J556075J334319
8602E7044452J106999Q49392N41579J97548j75390n53967q26968j026373j200268
8593E5957004j352075j473165j555345j623413j658657j673303j661699j630855
8585D3328492j591706j553171j501514j443327j376794j327084j264498j206233
$$ plain form
8577 32064165 30914004 29824982 28781322 27786197 26844896 25943968 25078783 24255816 23473007
8568 23473007 22729638 22025525 21350794 20704966 20076938 19481164 18919314 18381297 17869972
8559 17869972 17396987 16974204 16616183 16341509 16087100 15801000 15434254 14902689 14319180
8550 14319180 13819755 13396702 13018811 12668423 12333910 12015974 11715007 11428867 11151091
8541 11151091 10877306 10619947 10367765 10127183 9894440 9667172 9448818 9235018 9025457
8532 9025457 8817751 8612392 8421171 8241697 8074660 7933818 7807243 7700580 7600398 7474241
8522 7474241 7311872 7114013 6908958 6716487 6552376 6404510 6272970 6146650 6021710 5922151
8512 5922151 5847688 5808443 5787391 5742917 5659582 5511509 5309039 5128131 4984215 4855527
$$ packed form
8577C2064165j150161j089022j043660r95125r41301r00928q65185q22967p82809
8568B3473007p43369p04113o74731o45828o28028n95774n61850n38017n11325
8559A7869972m72985m22783l58021k74674k54409k86100l66746n31565n83509
8550A4319180m99425m23053l77891l50388l34513l17936l00967k86140k77776
8541A1151091k73785k57359k52182k40582k32743k27268k18354k13800k09561
8532I025457k07706k05359j91221j79474j67037j40842j26575j06663j00182j26157
8522G474241j62369j97859k05055j92471j64111j47866j31540j26320j24940r9559
8512E922151p4463l9245k1052m4474q3335j48073k02470j80908j43916j28688
$$ plain form
8502 4855527 4735200 4635249 4541045 4449354 4365105 4270890 4187568 4103979 4020725 3954460 3892217
8491 3892217 3826262 3766133 3702172 3631380 3557481 3488577 3424739 3350340 3288660 3236260 3204983
8480 3204983 3171988 3163962 3209600 3281033 3338724 3346162 3255722 3091549 2931736 2810297 2715879
8469 2715879 2645261 2583242 2525379 2472869 2428104 2385725 2336270 2285647 2241751 2203008 2162962
8458 2162962 2123941 2077825 2034278 1999483 1964753 1928794 1893200 1858476 1825487 1796147 1762114
8447 1762114 1735840 1706459 1677956 1651523 1619297 1583601 1554168 1522131 1492726 1458435 1433279
8436 1433279 1413958 1397888 1378967 1366665 1363939 1369557 1396660 1434718 1453822 1452186 1401260 1331644
8424 1331644 1265659 1212786 1173024 1140799 1117828 1103556 1085939 1067651 1056193 1035368 1019224
$$ packed form
8502D855527j20327r9951r4204r1691q4249r4215q3322q3589q3254o6265o2243
8491C892217o5955o0129o3961p0792p3899o8904o3838p4399o1680n2400l1277
8480C204983l2995q026M5638P1433N7691P438r0440j64173j59813j21439r4418
8469B715879p0618o2019n7863n2510m4765m2379m9455n0623m3896l8743m0046
8458B162962l9021m6116m3547l4795l4730l5959l5594l4724l2989k9340l4033
8447A762114k6274k9381k8503k6433l2226l5696k9433l2037k9405l4291k5156
8436A433279j9321j6070j8921j2302k726N618K7103L8058J9104j636n0926o9616
8424A331644o5985n2873l9762l2225k2971j4272j7617j8288j1458k0825j6144
$$ plain form
8413 1019224 1007183 993203 982072 970807 960637 950100 932162 924185 909343 902171 897605 887323
8401 887323 878607 862209 847748 826564 811814 806978 802171 795387 786257 781026 776158 767325 758709
8388 758709 747780 736887 730530 718133 709804 705925 703289 696241 688529 677285 670841 663886 655461
8375 655461 642475 633222 627264 622499 623229 619451 613552 605367 593125 579705 571867 567510 565090 561201
8361 561201 557441 551616 542625 537103 530784 522783 520368 521999 523070 517608 514987 516650 511322 506228
8347 506228 501053 494075 493369 486161 469498 459496 456228 452461 446643 454427 447997 440529 438154 437567
8333 437567 437306 433615 424563 418390 413620 413056 414120 412441 404207 396527 396676 394578 385906 375741 376913
8318 376913 378070 374334 367077 352038 343693 341200 341793 342872 340998 330744 319142 327191 324095 316064
$$ packed form
8413A019224j2041j3980j1131j1265j0170j0537j7938p977j4842p172m566j0282
8401H87323q716j6398j4461k1184j4750m836m807o784r130n231m868q833q616
8388G58709j0929j0893o357j2397q329l879k636p048p712j1244o444o955q425
8375F55461j2986r253n958m765P30l778n899q185j2242j3420p838m357k420l889
8361E61201l760n825q991n522o319q001k415J631J071n462k621J663n328n094
8347E06228n175o978p06p208j6663j0002l268l767n818P784o430p468k375n87
8333D37567k61l691r052o173m770n64J064j679q234p680J49k098q672j0165J172
8318C76913J157l736p257j5039q345k493N93J079j874j0254j1602Q049l096q031
$$ plain form
8304 316064 309866 307027 304826 302348 295525 288736 292905 294593 298654 300984 305224 303357 292821 287938
8290 287938 289366 289731 290581 282703 272891 270544 272892 279497 278458 275866 275020 270177 266601 261678 257582
8275 257582 256642 259176 255206 249173 244519 246541 246465 246008 244367 245612 242553 239208 242993 245726 244357
8260 244357 241672 233903 233910 230010 231259 236918 235898 232897 225662 220450 213377 209775 210839 209720 214846
8245 214846 213699 207748 204275 210896 215208 209617 210925 203190 194993 195331 197509 205944 208824 208536 205395
8230 205395 199333 198628 186652 189341 191485 183767 184369 180704 184839 192029 197888 205050 198539 191797 193551
8215 193551 192483 191201 186512 180763 173746 166924 166058 164625 165525 169899 169290 164161 159213 154112 158932
8200 158932 163787 167377 167054 165276 166196 164956 165997 163684 158993 165540 168697 163848 154959 155223 152253
$$ packed form
8304C16064o198k839k201k478o823o789M169J688M061K330M240j867j0536m883
8290B87938J428L65Q50p878r812k347K348O605j039k592q46m843l576m923m096
8275B57582r40K534l970o033m654K022p6m57j641J245l059l345L785K733j369
8260B44357k685p769Pl900J249N659j020l001p235n212p073l602J064j119N126
8245B14846j147n951l473O621M312n591J308p735q197L38K178Q435K880k88l141
8230B05395o062p05j1976K689K144p718O02l665M135P190N859P162o511o742J754
8215A93551j068j282m689n749p017o822q66j433R00M374o09n129m948n101M820
8200A58932M855L590l23j778R20j240J041k313m691O547L157m849q889K64k970
$$ plain form
8185 152253 143937 147286 154090 157446 153638 152882 150876 151779 144840 143931 148143 154290 150356 141701 131150
8170 131150 128808 131408 139310 138433 143383 138032 133779 126223 119312 114708 121339 125635 126366 126602 129613
8155 129613 125511 126930 128987 121417 115630 111191 114037 121182 123905 124072 117841 107749 102417 103616
8141 103616 107541 108519 108981 114813 117789 113678 109014 106966 114111 112422 113048 117495 116603 105507 104017
8126 104017 108530 102430 94695 97047 100640 98129 101952 99847 105254 105629 103068 107263 111873 106459 103092
8111 103092 95954 99036 100322 103731 109215 106459 99109 96268 90974 91607 92373 96705 94035 92034 89539
8096 89539 88860 87285 88031 89129 91545 97098 96163 97270 98705 101403 102408 99134 97806 97475 97834 93191
8080 93191 92788 95031 94432 99511 99141 96621 91642 86961 84680 89374 93701 88367 86014 88907 85550
$$ packed form
8185A52253q316L349O804L356l808p56k006R03o939r09M212O147l934q655j0551
8170A31150k342K600P902q77M950n351m253p556o911m604O631M296P31K36L011
8155A29613m102J419K057p570n787m439K846P145K723J67o231j0092n332J199
8141A03616L925R78M62N832K976m111m664k048P145j689O26M447q92j1096j490
8126A04017M513o100p735K352L593k511L823k105N407L75k561M195M610n414l367
8111A03092p138L082J286L409N484k756p350k841n294O33P66M332k670k001k495
8096H9539o79j575P46J098K416N553r35J107J435K698J005l274j328l31L59m643
8080I3191m03K243n99N079l70k520m979m681k281M694M327n334k353K893l357
$$ plain form
8065 85550 86143 87169 88454 90936 88610 91096 91308 85257 81799 93808 102235 99820 101831 96817 92817
8050 92817 93365 91853 96800 101572 97968 92073 79403 82797 92560 90276 88669 88068 89857 85213 89806
8035 89806 93287 90364 87102 88387 85393 83140 90325 95799 103707 99675 92894 90711 92672 90211 83458
8020 83458 83999 83420 89143 87608 88581 86479 84759 88453 92531 91013 85998 78605 80886 88962 89281 90466
8004 90466 87324 83519 81386 80652 84729 83949 79969 79091 79848 78813 77658 75710 76131 78841 80623 84142
7988 84142 92668 91467 88756 87892 90266 93935 95421 98366 100059 101438 94951 85650 77747 73764 71341
7973 71341 76340 83440 84405 82437 76679 67092 58949 56750 49642 47203 52282 53086 59840 78254 91521
7958 91521 103885 119892 127636 127835 128137 128114 121068 103505 82432 69079 60332 50922 44384 33134
$$ packed form
8065H5550N93J026J285K482k326K486K12o051l458J2009Q427k415K011n014m000
8050I2817N48j512M947M772l604n895j2670L394R763k284j607o01J789m644M593
8035H9806L481k923l262J285k994k253P185N474P908m032o781k183J961k461o753
8020H3458N41n79N723j535R73k102j720L694M078j518n015p393K281Q076L19J185
8004I0466l142l805k133p34M077p80l980q78P57j035j155j948M21K710J782L519
7988H4142Q526j201k711q64K374L669J486K945J693J379o487r301p903l983k423
7973G1341M999P100R65j968n758r587q143k199p108k439N079Q04O754J8414J3267
7958I1521J2364J6007P744J99L02k3p046j7563k1073j3353q747r410o538j1250
$$ plain form
7944 33134 37474 51093 58270 60070 61511 64941 63445 62664 64979 65260 69059 68680 74370 77406 74228
7929 74228 70027 65253 58599 57862 59187 60127 58494 58872 65779 67835 65454 66357 70998 70504 67540 64819
7913 64819 56582 55721 58518 52777 50257 55092 57531 55510 58748 57473 47471 44733 44004 46477 41568
7898 41568 36639 40428 40895 40593 52574 58724 56021 57234 55020 51871 45883 44974 43216 41573 47137
7883 47137 52958 59121 60256 57667 52667 50162 44965 45003 51360 49472 42349 39797 40225 29747 27935
7868 27935 28804 38428 41167 35999 30605 28351 38426 42251 44670 47383 42043 40613 41050 47595 50704
7853 50704 35920 27954 33557 35634 35488 40840 42304 41728 42790 38519 37457 45456 42269 39610 34197
7838 34197 34032 35674 41624 36556 31929 33341 40677 44315 36906 35967 34811 38837 29700 27609 30819
$$ packed form
7944C3134M340J3619P177J800J441L430j496p81K315K81L799l79N690L036l178
7929G4228m201m774o654p37J325R40j633L78O907K056k381R03M641m94k964k721
7913F4819q237q61K797n741k520M835K439k021L238j275j0002k738p29K473m909
7898D1568m929L789M67l02J1981O150k703J213k214l149n988r09j758j643N564
7883D7137N821O163J135k589n000k505n197L8O357j888p123k552M28j0478j812
7868B7935Q69R624K739n168n394k254J0075L825K419K713n340j430M37O545L109
7853E0704j4784p966N603K077j46N352J464n76J062m271j062P999l187k659n413
7838C4197j65J642N950n068m627J412P336L638p409r39j156M026r137k091L210
$$ plain form
7823 30819 28188 30643 30170 34704 37995 30394 27386 31447 36137 34710 32591 35428 36859 37772 37779 30177
7807 30177 27947 30450 32097 29662 25020 32655 34669 30956 25485 28457 28770 30468 35158 32045 31567
7792 31567 29924 35141 41996 39671 32648 23212 25749 27462 26797 33586 37381 38065 31345 32675 31624
7777 31624 32069 31375 35126 35162 36295 35028 36062 29705 19410 22809 30817 40546 41013 35563 40269 47353
7761 47353 42455 41193 43409 40191 34313 36441 38321 31671 32886 36440 34720 41086 42217 46173 38898
7746 38898 31383 31342 30657 26562 27884 24686 22455 23328 20165 21073 24717 21635 18039 14768 16473 24210
7730 24210 31020 32354 33178 30955 31902 27819 26496 27130 26397 32022 33600 33250 32080 33017 32724 29087
7714 29087 24815 19642 15056 14645 17883 17650 22606 21445 14580 11791 20534 27125 34377 37912 32580
$$ packed form
7823C0819k631K455m73M534L291p601l008M061M690j427k119K837J431R13Pp602
7807C0177k230K503J647k435m642P635K014l713n471K972L13J698M690l113m78
7792C1567j643N217O855k325p023r436K537J713o65O789L795O84o720J330j051
7777C1624M45o94L751L6J133j267J034o357j0295L399Q008R729M67n450M706P084
7761D7353m898j262K216l218n878K128J880o650J215L554j720O366J131L956p275
7746C8898p515m1o85m095J322l198k231Q73l163R08L644l082l596l271J705P737
7730B4210O810J334Q24k223R47m083j323O34p33N625J578l50j170R37k93l637
7714B9087m272n173m586m11L238k33M956j161o865k789Q743O591P252L535n332
$$ plain form
7699 32580 27155 26195 24931 22246 19214 18235 18761 20633 20498 22235 26030 25617 26074 19865 19261 24249
7683 24249 26769 24078 23453 21987 18557 17917 20578 23743 22611 28914 32192 25542 23939 25549 22053
7668 22053 17681 13259 15615 14682 15630 23523 25525 25980 21077 18233 22499 26016 21776 15670 13467
7653 13467 12040 9615 10821 12864 9929 8138 3182 -1294 1731 7428 9468 10223 7711 13403 17273
7638 17273 14838 23697 32690 25857 17117 10347 15470 19058 15381 14467 12442 8151 10078 9873 10693
7623 10693 14775 13969 8131 8797 11473 10209 6770 14220 15991 10420 12827 17990 22606 20894 16380
7608 16380 17974 15436 18244 12674 11905 10560 8234 6144 5276 7575 17988 23196 20874 20299 16068
7593 16068 14670 19318 20465 21905 20616 15326 10151 7605 6794 13405 15059 8099 8888 12190 9094
$$ packed form
7699C2580n425r60j264k685l032r79N26J872j35J737L795m13M57o209o04M988
7683B4249K520k691o25j466l430o40K661L165j132O303L278o650j603J610l496
7668B2053m372m422K356r33R48P893K002M55m903k844M266L517m240o106k203
7653A3467j427k425J206K043k935j791m956m476L025N697K040P55k512N692L870
7638A7273k435Q859Q993o833q740o770N123L588l677r14k025m291J927k05Q20
7623A0693M082q06n838O66K676j264l439P450J771n571K407N163M616j712m514
7608A6380J594k538K808n570p69j345k326k090q68K299J0413N208k322n75m231
7593A6068j398M648J147J440j289n290n175k546q11O611J654o960P89L302l096
$$ plain form
7578 9094 4458 6527 8241 15030 22012 15919 23202 23540 19979 22326 18575 11499 7013 5062 6442
7563 6442 5252 16746 20643 16016 9788 10735 14221 8489 5854 7723 17631 16234 11625 13780 7559
7548 7559 13939 13456 8923 10519 13199 15796 13122 7739 12386 15585 12489 13066 15626 12053 12821 17329
7532 17329 15366 11321 10003 12487 15374 13516 14358 11826 13462 13478 11373 9563 19354 14374 14704 12172
7516 12172 6149 3544 5213 8051 2299 3277 -1219 -5330 -2064 5524 10205 15497 15493 16485 19076 17282
7500 17282 15419 13503 14958 16019 11695 9962 13447 15784 19967 22176 18650 17294 15791 17422 15092
7485 15092 13906 11260 6835 6095 9470 4007 10084 11397 15254 17401 18674 14036 6850 1175 2603
7470 2603 12401 15924 9740 11607 9844 7926 12144 7913 5785 11494 20352 23070 20161 15158 11182
$$ packed form
7578I094m636K069J714O789O982o093P283L38l561K347l751p076m486j951J380
7563F442j190J1494L897m627o228R47L486n732k635J869R908j397m609K155o221
7548G559O380m83m533J596K680K597k674n383M647L199l096N77K560l573P68M508
7532A7329j963m045j318K484K887j858Q42k532J636J6k105j810R791m980L30k532
7516A2172o023k605J669K838n752R78m496m111L266P588M681N292mR92K591j794
7500A7282j863j916J455J061m324j733L485K337M183K209l526j356j503J631k330
7485A5092j186k646m425p40L375n463O077J313L857K147J273m638p186n675J428
7470B603R798L523o184J867j763j918M218m231k128N709Q858K718k909n003l976
$$ plain form
7455 11182 9572 13221 12577 11306 11873 14193 13805 9297 8161 13083 10963 8720 13370 11710 13739
7440 13739 9681 16865 25282 23339 18520 19152 21359 19538 13764 7566 8179 5872 1746 5139 3841
7425 3841 4720 10124 8205 5023 3267 -2821 -1097 5493 10675 13653 13935 9490 10064 16879 18316 16666
7409 16666 12842 15029 15077 17187 16045 6512 744 -206 3621 2438 1004 1010 5177 7296 12465 18309
7393 18309 14574 17531 19540 14128 16455 18766 16771 11184 339 -3186 -3350 1327 6018 12452 12991
7378 12991 15609 15712 21331 23970 24102 20253 16753 5112 4977 17614 18155 20725 22464 21476 21331 22335
7362 22335 14545 9174 176 306 1846 4792 4042 3812 385 -1727 2612 2714 2251 2479 3008 4429
7346 4429 4346 4904 3929 7537 11805 18788 19737 16648 10825 2402 13205 15787 13586 14279 16079 12974
$$ packed form
7455A1182j610L649o44j271N67K320l88m508j136M922k120k243M650j660K029
7440A3739m058P184Q417j943m819O32K207j821n774o198O13k307m126L393j298
7425C841Q79N404j919l182j756o088J724O590N182K978K82m445N74O815J437j650
7409A6666l824K187M8K110j142r533n768r50L827j183j434OM167K119N169N844
7393A8309l735K957K009n412K327K311j995n587j0845l525j64M677M691O434N39
7378A2991K618J03N619K639J32l849l500j1641j35J2637N41K570J739r88j45J004
7362B2335p790n371q998J30J540K946p50k30l427k112M339J02m63K28N29J421
7346D429q3N58r75L608M268O983R49l089n823q423J0803K582k201O93J800l105
$$ plain form
7330 12974 8459 8384 6917 7052 12403 16438 21888 18153 17564 15404 16179 14583 12734 9583 12051 12920
7314 12920 1489 -860 -517 2241 892 7471 10521 9527 5333 5562 9579 15674 21281 20156 22625
7299 22625 27105 28129 16661 5117 265 6642 9465 239 -3577 -403 2087 -4692 -5520 2136
7285 2136 6213 14556 10541 5640 332 -4674 -862 608 7353 4838 2121 2103 11106 18292 16143
7270 16143 14993 8718 12516 11832 4411 1186 9489 12898 15177 11680 13059 6228 3757 7229 10106
7255 10106 11915 11116 8658 13679 18921 18247 14928 8606 5284 6098 10190 17194 18631 18930 16278 10970
7239 10970 6085 4779 2237 7742 10147 10632 14327 11514 12467 4074 1397 2530 4175 5095 7950
7224 7950 9861 13521 12457 6168 6181 8447 9407 10299 12304 12404 3957 1899 6307 1625 -760 -3233
$$ packed form
7330A2974m515p5j467J35N351M035N450l735n89k160P75j596j849l151K468Q69
7314A2920j1431k349L43K758j349O579L050r94m194K29M017O095N607j125K469
7299B2625M480J024j1468j1544m852O377K823r226l816L174K490o779q28P656
7285B136M077Q343m015m901n308n006L812J470O745k515k717j8R003P186k149
7270A6143j150o275L798o84p421l225Q303L409K279l497J379o831k471L472K877
7255A0106J809p99k458N021N242o74l319o322l322Q14M092P004J437K99k652n308
7239A0970m885j306k542N505K405M85L695k813R53q393k677J133J645R20K855
7224G950J911L660j064o289J3K266R60Q92K005J00q447k058M408m682k385k473
$$ plain form
7208 -3233 1113 4977 4034 9266 7415 8574 10395 13721 15223 15560 17037 22346 21508 16453 16092 17063
7192 17063 16219 11608 10195 10136 10471 15020 17012 12885 11819 10443 5158 6924 13896 17449 16341 12802
7176 12802 11079 8351 8698 13069 8418 7399 7791 14438 13656 7716 3989 3896 6365 7987 8622 7155
7160 7155 -3699 -4796 3423 8234 5404 2058 -4671 -9364 -1699 718 5349 1623 458 2413 -4248
7145 -4248 -8894 -3574 5681 6138 -4284 -4744 -4756 -5559 -2835 7396 9966 9896 9861 7282 8271 6577 9193
7128 9193 11986 19483 10120 789 499 1078 1703 -3695 2193 7620 8188 3491 -3393 1670 7471 6816
7112 6816 3438 2324 7103 13056 7834 3389 2839 4829 8876 6728 7590 6294 10998 14181 13297 8142
7096 8142 3879 523 6563 14840 18179 10065 5799 2135 2314 13064 18437 23494 18932 7942 6901
$$ packed form
7208c233M346L864r43N232j851J159J821L326J502L37J477N309q38n055l61R71
7192A7063q44m611j413n9L35M549J992m127j066j376n285J766O972L553j108l539
7176A2802j723k728L47M371m651j019L92O647p82n940l727r3K469J622O35j467
7160G155j0854j097Q219M811k830l346o729m693P665K417M631l726j165J955o661
7145d248m646N320R255M57j0422m60j2q03K724J0231K570p0l5k579R89j694K616
7128I193K793P497r363r331k90N79O25n398N888N427N68m697o884N063N801o55
7112F816l378j114M779N953n222m445n50J990M047k148Q62j296M704L183q84n155
7096H142m263l356O040Q277L339q114m266l664J79J0750N373N057m562j0990j041
$$ plain form
7081 6901 5780 4613 -749 1611 6301 11941 13856 14456 15577 12585 10604 9550 7971 12759 13280
7066 13280 8224 3122 5856 7358 10748 14528 17991 12410 4803 2188 6706 3476 -300 -2094 -4654
7051 -4654 -8018 -3256 2301 11400 12499 -1635 -10994 -2728 7116 11203 -2062 -7228 -8986 -13100
7037 -13100 -8873 -3317 922 852 -7245 -11042 -4304 2357 3411 6139 10041 11498 4575 271 3753
7022 3753 13060 15556 6830 5685 5270 -1355 -4278 -8159 -9802 -3390 7077 7251 7089 4709 596
7007 596 5719 5126 4212 3312 509 3843 7562 5664 2144 -2315 4636 10976 9683 9705 6405 2940
6991 2940 3899 5183 679 -2155 -543 3305 3198 3392 -1019 1810 -948 1960 8275 6389 4709 3020
6975 3020 7736 7372 10210 2108 -5134 -5238 -2128 7780 5511 1304 4536 10570 11393 13533 10727 7257
$$ packed form
7081F901j121j167n362K360M690N640J915O00J121k992j981j054j579M788N21
7066A3280n056n102K734J502L390L780L463n581p607k615M518l230l776j794k560
7051d654l364M762N557R099J099j4134r359Q266R844M087j3265n166j758m114
7037a3100M227N556M239p0q097l797O738O661J054K728L902J457o923m304L482
7022C753R307K496q726j145m15o625k923l881j643O412J0467J74j62k380m113
7007E96N123n93r14r00k803L334L719j898l520m459O951O340j293K2l300l465
6991B940R59J284m504k834J612L848j07J94m411K829k758K908O315j886j680j689
6975C020M716l64K838q102p242j04L110R908k269m207L232O034Q23K140k806l470
$$ plain form
6959 7257 -1287 5662 12178 13712 10897 4703 1680 6284 10066 5160 3432 73 6138 8351 8513
6944 8513 10822 18070 20642 18970 11455 13506 10647 8983 6611 1768 3279 4241 6657 9119 8670
6929 8670 4587 -2434 -1224 6334 7540 6723 6516 3650 -2337 -2302 -9504 -11631 -4044 4659 5300 4816
6913 4816 2215 1360 2777 -301 -4725 -7099 -6278 -3995 -301 1589 6146 9982 5958 5294 5267 2000
6897 2000 3864 7994 7810 7032 5130 8222 8220 4648 2666 -1227 -1617 -1763 -1418 -2138 1388 3090 2641
6880 2641 -909 -4278 -5774 -780 85 1487 6833 9989 5641 -1984 -5056 -6574 -2329 4403 2338
6865 2338 -2950 -5201 -7187 -9319 -5141 -4955 -1740 -2727 -2282 10344 7951 2003 -5359 -6367 -6522 -8584
6849 -8584 -12927 -4667 5184 5696 4687 5634 4370 -983 -436 2824 2140 2192 8444 3605 -972 -23 -1758
$$ packed form
6959G257q544O949O516J534k815o194l023M604L782m906j728l359O065K213J62
6944H513K309P248K572j672p515K051k859j664k372m843J511R62K416K462m49
6929H670m083p021J210P558J206q17k07k866n987L5p202k127P587Q703O41m84
6913D816k601q55J417l078m424k374Q21K283L694J890M557L836m024o64k7l267
6897B000J864M130j84p78j902L092kl572j982l893l90j46L45p20L526J702m49
6880B641l550l369j496M994Q65J402N346L156m348p625l072j518M245O732k065
6865B338n288k251j986k132M178J86L215r87M45J2626k393n948p362j008j55k062
6849h584m343Q260R851N12j009R47j264n353N47L260o84N2O252m839m577R49j735
$$ plain form
6832 -1758 -54 4111 -641 1575 4832 9686 11437 8848 3061 -5597 -3089 1399 1288 5671 6984
6817 6984 7052 8186 4451 -1647 -5074 -3283 2768 11994 8995 1768 -1318 -5792 -4336 2430 -2812
6802 -2812 -2163 2057 7652 6441 14812 16340 11283 6709 3073 7806 2664 3191 3851 6155 15861 24234
6786 24234 22406 17508 10404 11031 8268 10289 10691 7736 8220 6146 9606 10630 14309 16623 12864
6771 12864 15146 19072 17394 16408 12148 22333 28965 40410 48150 46498 36945 23829 10188 6370
6757 6370 8795 10376 13101 12061 9270 8661 7205 7174 8062 13223 12623 7622 10955 14634 16552 19917
6741 19917 10997 8006 9440 8980 5108 9642 7066 5271 1663 -2836 -3002 3178 10926 6726 2895
6726 2895 -1327 -1304 -4390 366 7270 9111 8889 7454 10719 15092 10263 5831 3797 3061 3822 9014
$$ packed form
6832a758J704M165m752K216L257M854J751k589n787q658K508M488j11M383J313
6817F984O8J134l735o098l427J791O051R226k999p227l086m474J456O766n242
6802b812O49M220N595j211Q371J528n057m574l636M733n142N27O60K304R706Q373
6786B4234j828m898p104O27k763K021M02k955M84k074L460J024L679K314l759
6771A2864K282L926j678r86m260J0185O632J1445P740j652r553j3116j3641l818
6757F370K425J581K725j040k791o09j456l1Q88N161o00n001L333L679J918L365
6741A9917q920k991J434m60l872M534k576j795l608m499j66O180P748m200l831
6726B895m222K3l086M756O904J841k22j435L265M373m829m432k034p36P61N192
$$ plain form
6710 9014 12691 8854 9045 12787 8168 12368 10390 4536 8453 11177 5780 6005 6135 8348 9640 8307
6694 8307 6677 4584 4607 4497 -8 -972 3863 6290 12442 12276 5605 3354 10732 12718 9426 4738
6678 4738 5381 6634 8197 6583 11764 18362 17320 11225 4125 3820 3170 6801 6874 10367 10916 9996 10715
6661 10715 9958 7987 6443 2527 1821 1096 6478 -1212 -9059 -727 3744 2489 1618 -2634 -2663 1962
6645 1962 3061 5485 4760 6780 2871 3878 10598 10221 5690 -1046 1172 5393 2310 -426 -5552
6630 -5552 -822 -1526 -10388 -6637 -1955 -6280 -6225 -362 2826 1861 1269 -7768 -5535 -8210 -1392 525
6614 525 -2477 -4539 -4911 593 3394 47 3034 7315 5868 6812 5191 11148 19101 17017 10213 5860
6598 5860 6643 -734 -5079 2937 5367 2755 1383 425 -581 -2937 -7170 -10543 -9547 -8126 -7716 -5578
$$ packed form
6710I014L677l837J91L742m619M200j978n854L917K724n397K25J30K213J292j333
6694H307j630k093K3j10m505r64M835K427O152j66o671k251P378J986l292m688
6678D738O43J253J563j614N181O598j042o095p100l05o50L631P3L493N49r20P19
6661A0715p57j971j544l916p06p25N382p690p847Q332M471j255q71m252k9M625
6645A962J099K424p25K020l909J007O720l77m531o736K218M221l083k736n126
6630e552M730p04q862L751M682m325N5N863L188r65n92r037K233k675O818J917
6614E25l002k062l72N504K801l347K987M281j447R44j621N957P953k084o804m353
6598E860P83p377m345Q016K430k612j372r58j006k356m233l373R96J421M10K138
$$ plain form
6582 -5578 -6847 -5106 -8587 -9581 -14369 -8685 1099 -4467 -7383 -11793 -11516 -13732 -16180 -9751 -3867
6567 -3867 -5713 -2722 1693 4476 -1485 -9552 -9246 -13483 -22055 -17437 -13640 -11099 -7308 -11218 -10471
6552 -10471 -7505 -9727 -5325 -3402 -7058 -3913 5279 1161 -6887 -8290 -1556 168 2574 -4758 -13202
6537 -13202 -13115 -8094 -10462 -12964 -4267 -731 967 3431 -2313 -2893 -1619 -4673 5461 13133 8444
6522 8444 1461 -3252 -5492 -9534 -14673 -10929 -4990 -1461 -2196 1842 7640 7457 7913 6005 -4846
6507 -4846 -10540 -12900 -12301 -16158 -21574 -18280 -17909 -12451 -5472 -1775 -3495 -6397 -3368 -981 3361
6492 3361 9185 9246 13881 8056 2575 -1664 2432 3954 2823 1918 3020 1701 -2192 -13086 -22226
6477 -22226 -18375 -13898 -5009 3684 1287 -3808 -3763 -10059 -8570 -316 5461 4309 3231 8288 2125
$$ packed form
6582e578j269J741l481r94m788N684R784n566k916m410K77k216k448O429N884
6567c867j846K991M415K783n961q067L06m237q572M618L797K541L791l910P47
6552a0471K966k222M402J923l656L145R192m118q048j403O734J724K406p332q444
6537a3202Q7N021k368k502Q697L536J698K464n744n80J274l054J0134P672m689
6522H444o983m713k240m042n139L744N939L529p35M038N798j83M56j908j0851
6507d846n694k360N99l857n416L294L71N458O979L697j720k902L029K387M342
6492C361N824O1M635n825n481m239M096J522j131r05J102j319l893j0894r140
6477b2226L851M477Q889Q693k397n095M5o296J489Q254N777j152j078N057o163
$$ plain form
6462 2125 -3076 -4300 -1805 -343 -472 -1229 2395 6574 5140 6578 2426 -106 -1669 -1084 -49 3230
6446 3230 2515 4354 10338 5962 4961 7679 10227 7775 2081 4000 3447 2510 10538 10481 3439 -499
6430 -499 4344 12824 7080 4255 8610 4890 9777 11623 10682 7265 5916 5020 6340 8078 6789 6204
6414 6204 -3155 -1734 -2507 -605 -814 -750 3911 1639 -6353 -7965 -6617 -1410 6518 8171 5031 148
6398 148 1028 8785 6672 -765 -2440 -2296 -6757 -5101 -2444 6707 4647 2449 2239 -3963 -3348 -932
6382 -932 3056 1038 2606 2011 803 -753 -3208 -8287 -5746 -1997 -330 1369 4262 6755 -883
6367 -883 -2833 -2310 -2543 7551 11586 12411 6319 8711 6945 248 99 -2314 -5741 -6161 969 6091
6351 6091 7628 9888 11551 10762 11480 3419 -2292 -3961 -3782 -102 4280 7494 10970 4676 3342 4009
$$ packed form
6462B125n201j224K495J462j29p57L624M179j434J438m152k532j563N85J035L279
6446C230p15J839N984m376j001K718K548k452n694J919n53r37Q028n7p042l938
6430d99M843Q480n744k825M355l720M887J846r41l417j349q96J320J738j289n85
6414F204r359J421p73J902k09O4M661k272p992j612J348N207P928J653l140m883
6398A48Q80P757k113p437j675J44m461J656K657R151k060k198k10o202O15K416
6382i32L988k018J568n95j208j556k455n079K541L749J667J699K893K493p638
6367h83j950N23k33J0094M035Q25o092K392j766o697j49k413l427m20P130N122
6351F091J537K260J663p89P18q061n711j669J79L680M382L214L476o294j334O67
$$ plain form
6335 4009 -3431 7181 16290 10128 8980 7738 4929 3673 -2966 -6906 -692 8327 10751 10842 5625
6320 5625 980 -1915 1102 2018 9865 9384 2882 -7300 -18304 -16486 -8518 -5432 -11028 -14231 -12730
6305 -12730 -3775 -479 -2323 -2964 -1225 -4617 -11113 -7930 -5330 -3666 -578 -4269 -3972 -1788 -5918
6290 -5918 -4113 -2193 -3351 -3499 -4138 -5833 -2562 204 2533 3422 3707 8137 8192 4618 -29 -550 65
6273 65 -1425 -9907 -11997 -12774 -5306 3298 3537 -5435 -8316 -7279 -8598 -8984 -6810 -4640 -6703 1577
6257 1577 5645 3565 2924 1777 5872 5135 4707 -7574 -7059 -6490 -9818 -2637 -313 -6098 -10079 -4783
6241 -4783 -3337 -6988 -10103 -8877 -8727 -9648 -11745 -4412 6498 5780 3421 1735 894 -798 3816 5219
6225 5219 2458 6938 9826 13135 8932 7169 481 -8476 -6474 -2652 -37 -3448 628 5251 1964
$$ packed form
6335D009p440J0612R109o162j148j242k809j256o639l940O214R019K424R1n217
6320E625m645k895L017R16P847m81o502j0182j1004J818P968L086n596l203J501
6305a2730Q955L296j844o41J739l392o496L183K600J664L088l691K97K184m130
6290e918J805J920j158j48o39j695L271K766K329Q89K85M430N5l574m647n21O15
6273F5j490q482k090p77P468Q604K39q972k881J037j319l86K174K170k063Q280
6257A577M068k080o41j147M095p37m28j2281N15N69l328P181K324n785l981N296
6241d783J446l651l115J226J50r21k097P333J0910p18k359j686q41j692M614J403
6225E219k761M480K888L309m203j763o688q957K002L822K615l411M076M623l287
$$ plain form
6210 1964 1019 4193 3291 -4603 -5621 -5360 639 6331 9664 12496 5681 -2821 -8302 -12453 -14506 -8231
6194 -8231 -3271 501 -7071 -10774 -2290 3432 8581 -582 -2157 1895 3749 4091 -2163 -12349 -3451
6179 -3451 -3673 -7196 -6746 -8333 -5368 -260 -904 -7868 -20038 -16211 -8035 -2139 52 -482 -2125 -4142
6163 -4142 -5600 -1302 8960 6201 1603 36 -4167 -393 2634 6246 4840 2990 -2298 331 1792
6148 1792 -2120 -10912 -2855 9623 11530 7898 1 -4132 -4818 -3920 -6781 -6701 -4606 -5415 -4058 -618
6132 -618 964 513 -4836 -6802 -4224 -11712 -13561 -14951 -5770 1652 -5267 -8107 -6704 -5263 -2876
6117 -2876 -6253 -3778 -1481 -5539 -5163 5702 9897 4459 1767 2096 -2609 -6911 -9068 -5721 -1721
6102 -1721 -6158 -6456 -5858 -4789 -8582 -11223 -7872 -4710 -8754 -11817 -5084 -423 1984 791 5655
$$ packed form
6210A964r45L174r02p894j018K61N999N692L333K832o815q502n481m151k053O275
6194h231M960L772p572l703Q484N722N149r163j575M052J854L42o254j0186Q898
6179c451k22l523M50j587K965N108o44o964j2170L827Q176N896K191n34j643k017
6163d142j458M298J0262k759m598j567m203L774L027L612j406j850n288K629J461
6148A792l912q792Q057J2478J907l632p897m133o86Q98k861Q0K095q09J357L440
6132f18J582m51n349j966K578p488j849j390R181P422o919k840J403J441K387
6117b876l377K475K297m058L76J0865M195n438k692L29m705m302k157L347M000
6102a721m437k98N98J069l793k641L351L162m044l063O733M661K407j193M864
$$ plain form
6087 5655 9455 5500 2282 5195 5993 2242 -1129 -2305 -7570 -6560 -10388 -10001 -1059 963 -4194
6072 -4194 -8854 -6359 -5218 -6802 -6580 -7950 -3420 5723 4042 -23 -6336 -10905 -16751 -17247 -11859
6057 -11859 -8909 634 9810 12674 13635 7054 2976 -261 191 5442 5904 10035 13932 18680 16861
6042 16861 10475 4416 4915 4981 2421 601 -2561 1112 -1228 -5086 -4043 -465 1846 -7738 -11342
6027 -11342 -11137 -12152 -9496 -10332 -7316 -5813 -5406 -6771 -1292 2375 2988 -2519 -5165 -5074 -4639 -4909 -1730
6010 -1730 -6775 -4074 -993 83 6517 5701 4125 3582 -3253 -6505 -7645 -11441 -17075 -13932 -5605
5995 -5605 2352 -2647 -2716 300 654 -2892 -5314 -7306 -7724 -8387 -4537 -3116 -9854 -8920 -5411 -5901 -12675
5978 -12675 -16144 -12720 -6895 -6169 -52 3578 2939 2774 4539 -3689 -4839 -622 -3837 -2516 -1710 -259
$$ packed form
6087E655L800l955l218K913P98l751l371j176n265J010l828L87Q942K022n157
6072d194m660K495J141j584K22j370M530R143j681m065o313m569n846m96N388
6057a1859K950R543R176K864R61o581m078l237M52N251M62M131L897M748j819
6042A6861o386o059M99O6k560j820l162L673k340l858J043L578K311r584l604
6027a1342K05j015K656q36L016J503M07j365N479L667O13n507k646R1M35k70L179
6010a730n045K701L081J076O434q16j576n43o835l252j140l796n634L143Q327
5995e605P957m999o9L016L54l546k422j992m18o63L850J421o738R34L509m90o774
5978a2675l469L424N825P26O117L630o39j65J765q228j150M217l215J321Q06J451
$$ plain form
5962 -259 2931 1792 1227 2151 -2215 -2522 -293 289 -6460 -12739 -9908 -5517 -2472 5554 5979 -836
5946 -836 -3506 -3708 -4511 -4720 -3203 -9179 -13704 -12416 -7376 -846 -195 -5936 -4089 -6197 -3091 -3805
5930 -3805 -2487 -3604 -5302 -9301 -8640 -7936 -3537 1734 4868 3612 -948 -3341 -4014 -5653 3629 5523
5914 5523 -1672 -5030 -3343 -3803 -3270 -3689 -1745 -3299 -5374 -480 833 1229 3376 -2082 -8941 -8910
5898 -8910 -11839 -18253 -19803 -10029 -9856 -5278 -2713 -1849 -2702 -1017 -2087 -101 833 -5844 -6204 -5277
5882 -5277 -12361 -13390 -3675 -1913 -7585 -15804 -18706 -14293 -11126 -2079 -4151 -9794 -4807 -4761 -6982
5867 -6982 -1022 -6301 -11040 -8973 -10706 -15407 -5480 392 2993 10345 8750 8760 8897 5481 -1372 -265
5851 -265 -3489 -11084 -6671 -8297 -7940 -659 1465 -1569 657 5430 605 -1049 5342 4104 1405
$$ packed form
5962b59L190j139n65R24m366l07K229N82o749o279K831M391L045Q026M25o815
5946h36k670k02q03k09J517n976m525J288N040O530O51n741J847k108L106p14
5930c805J318j117j698l999O61P04M399N271L134j256m560k393o73j639R282J894
5914E523p195l358J687m60N33m19J944j554k075M894J313L96K147n458o859L1
5898h910k929o414j550R774J73M578K565Q64q53J685j070J986R34o677l60R27
5882e277p084j029R715J762n672q219k902M413L167R047k072n643M987M6k221
5867f982N960n279m739K067j733m701R927N872K601P352j595J0J37l416o853J107
5851b65l224p595M413j626L57P281K124l034K226M773m825j654O391j238k699
$$ plain form
5836 1405 315 -9041 -3905 -5329 1184 6021 6785 7453 5772 2864 -1755 -14368 -13619 -10375 -3158
5821 -3158 -1518 -4972 -6093 -7937 -7097 -11835 -11448 -2090 4029 8433 2701 -768 -4294 -4099 3844 67
5805 67 265 4258 9440 13281 10133 6430 6527 5749 11237 14375 11572 11735 8559 4738 6973 2814 -4477
5788 -4477 -12913 -16599 -22515 -29021 -28474 -26445 -24368 -26255 -29695 -18897 -9679 -6936 -16529 -7374 -2609
5773 -2609 2011 7338 5070 9092 5467 -1035 -2071 -3795 -4154 -3926 -976 918 -4374 -13671 -11642
5758 -11642 -11706 -10357 -7846 -6075 -197 2645 3590 8593 13408 8486 13 -6692 -8050 -1319 1006
5743 1006 -5877 -21492 -24044 -17589 -10637 -10409 -11552 -8342 -2718 114 5160 6167 5439 1629 -4250
5728 -4250 -2637 -8294 -10551 -7778 -4857 3130 7325 5303 5370 7293 6330 8086 10659 12209 10435 6029
$$ packed form
5836A405j090r356N136j424O513M837P64O68j681k908m619j2613P49L244P217
5821c158J640l454j121j844Q40m738L87R358O119M404n732l469l526J95P943l777
5805F7J98L993N182L841l148l703R7p78N488L138k803J63l176l821K235m159p291
5788d477q436l686n916o506N47K029K077j887l440J0798R218K743r593R155M765
5773b609M620N327k268M022l625o502j036j724l59K28K950J894n292r297K029
5758a1642o4J349K511J771N878K842R45N003M815m922q473o705j358O731K325
5743A006o883j5615k552O455O952K28j143L210N624K832N046J007p28l810n879
5728d250J613n657k257K773K921P987M195k022O7J923r63J756K573J550j774m406
$$ plain form
5712 6029 -1218 -1960 -1903 -2195 -4297 -4201 -3316 -9052 -11461 -13438 -13827 -19678 -16350 -2744 3753 -106 -3910
5695 -3910 -3863 -5961 -9546 -5525 1754 1695 109 -1064 -7302 -6449 62 -860 -517 -2506 -3798 -6206 -3105
5678 -3105 2609 5315 3053 3068 2337 -2407 -6695 -6559 -9079 -7200 -7095 79 1634 -5385 -4686 -3114
5662 -3114 5514 8428 12012 12532 10226 1848 -228 -1069 1410 1479 -6797 -7694 -5475 638 5134 5724
5646 5724 -2937 -7841 -3428 -5970 -5756 -5878 -10366 -14841 -18744 -11506 -5766 -4890 -10361 -7153 -1772 -1499
5630 -1499 -3096 -7260 -9827 -1679 8900 9036 2221 -6998 -8630 -3267 210 -552 3346 4951 2730
5615 2730 211 -4613 -2146 -2416 -4130 -6100 -2758 -6619 -9596 -12032 -18988 -23155 -21138 -18559 -17375
5600 -17375 -19357 -14555 -13745 -10133 -7174 -3860 -2556 -1588 -3116 -11683 -12620 -10894 -4691 -886 194
$$ packed form
5712F029p247p42N7k92k102R6Q85n736k409j977l89n851L328J3606O497l859l804
5695c910M7k098l585M021P279n9j586j173o238Q53O511r22L43j989j292k408L101
5678c105N714K706k262J5p31m744m288J36k520J879J05P174J555p019O99J572
5662c114Q628K914L584N20k306q378k076q41K479O9q276q97K219O113M496N90
5646E724q661m904M413k542K14j22m488m475l903P238N740Q76n471L208N381K73
5630a499j597m164k567Q148J0579J36o815r219j632N363L477p62L898J605k221
5615B730k519m824K467k70j714j970L342l861k977k436o956m167K017K579J184
5600a7375j982M802Q10L612K959L314J304R68j528q567r37J726O203L805J080
$$ plain form
5585 194 2234 -2317 -6523 -11610 -9242 -7100 -1269 2362 4517 5247 6359 6617 8204 13936 14968 12701
5569 12701 7917 4807 1875 -2082 -4082 -8594 -7370 -9198 -11622 -4411 -2820 -2737 -4942 -8968 -2057
5554 -2057 6970 2933 -2988 -2003 702 1589 -6955 -5226 1910 3461 -1547 -11754 -12670 -8114 -1126
5539 -1126 289 -3549 204 3008 2433 327 -6711 -8475 -7957 -11270 -10408 -10791 -9802 -4230 -4139 -7155 -5906
5522 -5906 -1851 5448 6867 5505 1252 -1530 -6481 -9021 -9181 -5762 -448 -6127 -7377 -7582 -12253
5507 -12253 -13764 -8538 -2232 -4894 -6286 -10929 -8155 -5074 -2938 -854 5251 -1977 -12250 -10831
5493 -10831 -8864 -2453 -3094 -267 -2536 -3450 134 -249 -1645 -314 -3014 -8027 -5745 -2247 7358
5478 7358 10371 6288 2665 4870 3441 4203 -3050 -9809 -3554 -287 -1741 -6585 -10723 -13439 -8233
$$ packed form
5585A94K040m551m206n087K368K142N831L631K155P30J112K58J587N732J032k267
5569A2701m784l110k932l957k000m512J224j828k424P211J591Q3k205m026O911
5554b057R027m037n921R85K705Q87q544J729P136J551n008j0207r16M556O988
5539a126J415l838L753K804n75k106p038j764N18l313Q62l83R89N572R1l016J249
5522e906M055P299J419j362m253k782m951k540j60L419N314n679j250k05m671
5507a2253j511N226O306k662j392m643K774L081K136K084O105p228j0273J419
5493a0831J967O411o41K827k269r14L584l83j396J331k700n013K282L498R605
5478G358L013m083l623K205j429P62p253o759O255L267j454m844m138k716N206
$$ plain form
5463 -8233 -5632 -636 -311 5352 -3640 -6632 487 7473 16015 15180 14589 10484 5678 -1045 -4010 -4257
5447 -4257 -1594 -1617 -1871 -6835 -1719 2312 -594 582 151 -4598 -3266 -1052 -4029 4403 2290 -3096
5431 -3096 -1576 -437 4191 4617 -2968 -6100 -3947 -3220 -2815 390 1754 2330 -200 -1449 1723 -4590
5415 -4590 -7569 -3198 -1669 1935 6299 165 -6571 -4333 -6574 -7103 -2646 -835 -771 4317 1089 -1884
5399 -1884 -4753 483 5533 8895 8373 2701 -891 -4241 -11338 -6131 580 120 -7247 -7153 -4280 -5680
5383 -5680 -8110 -14080 -8666 -6777 -8460 -12479 -12120 -10534 -8744 -6279 -1204 -449 -4918 -5938 -272
5368 -272 7160 1593 -3347 -4733 -6641 -2829 -2050 -2193 -2256 2230 2249 -504 -2354 -6846 -8295 -4514 -6990
5351 -6990 -11718 -9876 -9324 -12820 -13207 -2416 -115 -10239 -17484 -13230 -4441 -9253 -12320 -12512 -7356
$$ packed form
5463h233K601M996L25N663q992k992P119O986Q542q35n91m105m806o723k965k47
5447d257K663k3k54m964N116M031k906J176m31m749J332K214k977Q432k113n386
5431c096J520J139M628M26p585l132K153P27M05L205J364N76k530j249L172o313
5415d590k979M371J529L604M364o134o736K238k241n29M457J811O4N088l228k973
5399a884k869N236N050L362n22n672l592l350p097N207O711m60p367R4K873j400
5383e680k430n970N414J889j683m019L59J586J790K465N075P55m469j020N666
5368b72P432n567m940j386j908L812P79j43o3M486J9k753j850m492j449L781k476
5351f990m728J842N52l496l87J0791K301j0124p245M254Q789m812l067j92N156
$$ plain form
5336 -7356 -9684 -8157 -7536 -6750 -1512 -4737 -12594 -16692 -15773 -12131 -5946 -3046 -6807 -2576 1073 3728
5320 3728 2833 2152 -4 -4954 5613 11702 2343 -8316 -13347 -10376 -7353 -7146 -4292 -3491 -7110
5305 -7110 -6140 -9050 -6215 -4533 2469 6680 2439 -3125 -7838 -14247 -14605 -10113 -556 6321 8565
5290 8565 22 -3779 -5536 -1296 -2529 -4723 -10436 -9215 -7042 -7506 -7706 -502 7512 12218 8839
5275 8839 7031 8167 5390 2999 1073 -4043 -5613 -4335 -7098 -10016 -4291 -1718 2794 810 1141
5260 1141 2159 1049 -3827 -212 2493 4160 2270 6323 3450 -5721 1596 8738 7381 1792 -15
5245 -15 662 5666 7927 6748 -549 -13166 -17123 -15703 -9917 -1453 2957 1270 -1309 -508 -639 3141
5229 3141 7947 8005 58 -8224 -7385 -2 -2348 178 410 559 194 -7918 -6528 -1054 -3201 128
$$ packed form
5336g356k328J527O21P86N238l225p857m098R19L642O185K900l761M231L649K655
5320C728q95o81k156m950J0567O089r359j0659n031K971L023K07K854Q01l619
5305g110R70k910K835J682P002M211m241n564m713o409l58M492R557O877K244
5290H565q543l801j757M240j233k194n713J221K173m64k00P204Q014M706l379
5275H839j808J136k777k391j926n116j570J278k763k918N725K573M512j984L31
5260A141J018j110m876L615K705J667j890M053k873r171P317P142j357n589j807
5245a5O77N004K261j179p297j2617l957J420N786Q464M410j687k579Q01j31L780
5229C141M806N8p947q282Q39P383k346K526K32J49l65q112J390N474k147L329
$$ plain form
5213 128 -2091 -9258 -12366 -5952 -8109 -8465 -11853 -9760 -6757 672 1340 2571 -3259 -6854 -1733 -1065
5197 -1065 -4771 -4290 -3269 -6362 -16102 -13513 -12610 -7828 44 41 -212 3124 1118 -5822 -9810 -10554 -11213
5180 -11213 -7917 -695 4925 -2609 -8157 -8282 -11580 -4952 4712 2071 -3174 -3541 -5109 -2840 -9353
5165 -9353 -12101 -6937 -8355 -12775 -5645 -1062 1176 5268 2175 4587 3135 1153 -28 -1673 -7074
5150 -7074 -6666 -7694 -10222 -13870 -14387 -14423 -20014 -17252 -11715 -17150 -17243 -9331 -2961 -5767 -10610 -13357
5134 -13357 -19087 -19858 -8613 -2571 -2975 -525 2329 -3128 -10562 -14954 -18569 -9977 -549 -2168 -9857
5119 -9857 -7262 -1630 -1865 -3654 -164 -224 -3433 -1881 -6319 -11130 -12026 -14304 -12984 -12851 -720 -660
5103 -660 -9011 -12001 -15863 -12615 -3507 32 -3638 -3801 -5929 -5231 -4157 -1271 -2565 -5150 -2412 1127
$$ packed form
5213A28k219p167l108O414k157l56l388K093L003P429O68J231n830l595N121O68
5197a065l706M81J021l093r740K589R03M782P872lk53L336k006o940l988p44o59
5180a1213L296P222N620p534n548j25l298O628R664k641n245l67j568K269o513
5165i353k748N164j418m420P130M583K238M092l093K412j452j982j181j645n401
5150g074M08j028k528l648n17l6n591K762N537n435r3P912O370k806m843k747
5134a3357n730p71J1245O042m04K450K854n457p434m392l615Q592R428j619p689
5119i857K595N632k35j789L490o0l209J552m438m811q96k278J320J33J2131O0
5103f60q351k990l862L248R108L539l670j63k128O98J074K886j294k585K738L539
$$ plain form
5087 1127 -8345 -12367 -9235 -2787 -865 -7381 -13276 -7490 -435 -3284 -2824 1380 3096 -3572 -4211
5072 -4211 -81 4732 759 -1117 -1814 -4905 -5901 -6386 -7170 -6076 -10570 -11238 -12234 -7197 -1142 5424
5056 5424 8496 8463 5238 1183 -4536 -6582 -2171 -1063 -4225 -6486 -5247 -6930 -7270 -7788 1079 3544
5040 3544 2301 -1961 -7574 -8989 -8407 -8072 -10259 -5268 2080 2955 -939 -11912 -12943 -6979 -5457
5025 -5457 -7722 -1217 3134 -2121 -7500 -8851 -10365 -6508 -4920 -3841 -2926 -6139 -4744 -6282 -5346
5010 -5346 -7096 -8829 -5789 -3493 -171 -1315 -3581 -2605 -8360 -4690 1354 -1834 -4928 -101 -7131
4995 -7131 -12585 -8085 -7174 -5627 -3741 -9641 -12840 -5598 90 -6707 -4678 1940 -1471 -172 -1404
4980 -1404 2077 -1890 -3509 -5091 -5394 -9486 -14034 -16397 -17759 -17637 -14541 -15193 -17243 -19742 -17382 -15039
$$ packed form
5087A127r472m022L132O448J922o516n895N786P055k849M60M204J716o668o39
5072d211M130M813l973j876o97l091r96m85p84J094m494o68r96N037O055O566
5056E424L072l3l225m055n719k046M411J108l162k261J239j683l40n18Q867K465
5040C544j243m262n613j415N82L35k187M991P348Q75l894j0973j031N964J522
5025e457k265O505M351n255n379j351j514L857J588J079R15l213J395j538R36
5010e346j750j733L040K296L322j144k266R76n755L670O044l188l094M827p030
4995g131n454M500R11J547J886n900l199P242N688o797K029O618l411J299j232
4980a404L481l967j619j582l03m092m548k363j362J22L096o52k050k499K360K343
$$ plain form
4964 -15039 -9993 -7272 -7693 -9429 -6996 1108 3919 8612 3108 -1976 -3812 -3961 852 5555 4246
4949 4246 844 -5237 -4675 -4865 -2746 1884 4355 1030 961 -3294 -9008 -17072 -15457 -10993 -14132 -9546
4933 -9546 -10729 -9923 -6067 2523 6047 -1508 -3822 -3015 -17057 -22783 -20667 -11900 -1719 624 479
4918 479 -5712 -8864 -9909 -4399 545 -150 -127 -3158 -8662 -6618 -14991 -15347 -11984 -12795 -6181 -6579 -2838
4901 -2838 534 -502 -3518 -9137 -14741 -14961 -14773 -15366 -22542 -19700 -2433 6885 6882 4930 4468 -1593
4885 -1593 -5117 -2610 484 3421 4482 1027 -665 -4159 -4652 -2566 -1996 -1504 -417 4033 4855 2665
4869 2665 -2690 -5219 -6406 -5895 -6454 -3900 -3084 -4174 -12789 -17106 -11987 -4668 -2692 -3097 39 4248
4853 4248 4210 5503 10779 12593 10138 6617 760 -2071 469 4315 -2694 -6368 -3843 -1646 6409
$$ packed form
4964a5039N046K721m21j736K433Q104K811M693n504n084j836j49M813M703j309
4949D246l402o081N62j90K119M630K471l325o9m255n714q064J615M464l139M586
4933i546j183Q06L856Q590L524p555k314Q07j4042n726K116Q767J0181K343j45
4918D79o191l152j045N510M944o95K3l031n504K044q373l56L363q11O614l98L741
4901b838L372j036l016n619n604k20J88n93p176K842J7267R318lj952m62o061
4885a593l524K507L094K937J061l455j692l494m93K086N70M92J087M450Q22k190
4869B665n355k529j187N11n59K554Q16j090q615m317N119P319J976m05L136M209
4853D248l8J293N276J814k455l521n857k831K540L846p009l674K525K197Q055
$$ plain form
4838 6409 14023 12808 8328 8599 8766 9079 11243 10136 12338 10477 5342 9420 852 -9316 -11573
4823 -11573 -7775 -5714 -3617 -6832 -7918 -7941 -7788 -5915 -3874 -1584 3136 -477 -7308 -15079 -16329
4808 -16329 -19953 -14885 -10606 -11348 -10209 -7384 -9378 -9094 -5052 -182 -3660 -5319 -7139 -10336 -7381
4793 -7381 -887 -3608 -3904 -10357 -13578 -9819 -7732 719 6871 2022 -4306 558 5687 -78 -3381
4778 -3381 -3110 1425 2529 -5111 -7264 2510 -1103 -3739 -956 -2387 -3602 -5635 -11736 -15352 -13922
4763 -13922 -13640 -14056 -13917 -11888 -13432 -11172 -10240 -4327 -1011 -7129 461 437 3829 9176 5195 6789
4747 6789 7485 4824 1081 -1529 -5705 -4155 -2868 5908 -5740 -15867 -7010 -2131 -1746 -10436 -13072
4732 -13072 -5782 -1253 8215 7602 2394 -1860 -5064 -5575 -5267 -3529 -6364 -9016 -10699 -11671 -4834 -1885
$$ packed form
4838F409P614j215m480K71J67L13K164j107K202j861n135M078q568j0168k257
4823a1573L798K061K097l215j086k3J53J873K041K290M720l613o831p771j250
4808a6329l624N068M279p42J139K825j994K84M042M870l478j659j820l197K955
4793g381O494k721k96o453l221L759K087Q451O152m849o328M864N129n765l303
4778c381K71M535J104p640k153R774l613k636K783j431j215k033o101l616J430
4763a3922K82m16J39K029j544K260R32N913L316o118P590k4L392N347l981J594
4747F789O96k661l743k610m176J550J287Q776j1648j0127Q857M879L85q690k636
4732a3072P290M529R468o13n208m254l204n11L08J738k835k652j683r72O837K949
$$ plain form
4716 -1885 4832 2915 -3061 -3133 -8546 -13840 -12259 -9201 -10959 -871 -3760 -8637 -7806 -11533 -10769 -7026
4700 -7026 -8703 -10026 -10386 -9154 -2141 4921 6508 6752 3453 -2047 60 5006 4836 4534 -1226 -3766
4684 -3766 -656 4768 293 -7930 -10690 -10280 -8703 -9518 -12108 -14324 -16935 -8788 -1405 -2559 -932
4669 -932 -4494 -3795 3051 3556 -3666 -9859 -4237 -2289 4927 5140 9886 6170 1158 -2755 -7597 -14954
4653 -14954 -16972 -16045 -8275 -3687 -1945 938 -5829 -7980 -1721 -1134 -2585 -6130 -2217 -731 -5485
4638 -5485 -8470 -6914 -8328 -4839 1323 385 -397 -381 976 1952 -838 -6203 -12616 -13285 -10968 -9968
4622 -9968 -8575 1367 -901 -8027 -13078 -17824 -17212 -17284 -12152 -1947 1291 284 3911 10072 9510 4380
4606 4380 -821 -6974 -4431 -8423 -8331 -3391 -6681 -14904 -17930 -13767 -13764 -3201 -223 -7836 -4565 74
$$ packed form
4716a885O717j917n976p2n413n294J581L058j758J0088k889m877Q31l727P64L743
4700g026j677j323l60J232P013P062J587K44l299n500K107M946j70l02n760k540
4684c766L110N424m475q223k760M10J577q15k590k216k611Q147P383j154J627
4669i32l562O99O846N05p222o193N622J948P216K13M746l716n012l913m842p357
4653a4954k018R27P770M588J742K883o767k151O259N87j451l545L913J486m754
4638e485k985J556j414L489O162r38p82J6J357R76k790n365o413o69K317J000
4622i968J393R942k268p126n051m746O12p2N132J0205L238j007L627O161n62n130
4606D380n201o153K543l992R2M940l290q223l026M163LJ0563K978p613L271M639
$$ plain form
4590 74 -4782 -9030 -6727 -7459 -7585 -10025 -3464 2295 4983 7702 -231 -4965 -13358 -11910 -7265 -8276
4574 -8276 -9598 -11777 -14359 -12308 -8341 -14206 -14186 -11226 -19032 -21931 -18547 -10470 -2989 1120 4246
4559 4246 322 -2315 -1377 -3249 7282 2198 -6510 -16112 -18012 -13032 -13728 -11929 -8743 -6057 -72
4544 -72 -2360 399 2909 1159 4351 11864 11701 11042 11536 7327 859 -1534 -1556 -3982 1599 6783 1779
4527 1779 -1319 -7157 -9591 -12601 -6355 -9797 -13139 -14445 -10820 -5406 -3315 -179 -3664 -5151 -3391
4512 -3391 -7332 -6200 -5644 -1379 -5101 -4967 -4948 -2232 -1955 -2546 2218 2182 975 -2821 -5528 -4042 2029
4495 2029 1504 -2162 -2918 -6839 -3709 -3348 -5418 -7903 -8220 -14031 -10505 -9442 -7181 -8352 -6703 -5596
4479 -5596 -5153 683 48 -3331 -1994 -994 -6442 -12748 -10933 -10680 -12385 -12331 -9852 -4207 -6455 -8701
$$ packed form
4590G4m856m248K303p32j26k440O561N759K688K719p933m734q393J448M645j011
4574h276j322k179k582K051L967n865K0K960p806k899L384Q077P481M109L126
4559D246l924k637R38j872J0531n084q708r602j900M980o96J799L186K686N985
4544g2k288K759K510j750L192P513j63o59M94m209o468k393k2k426N581N184n004
4527A779l098n838k434l010O246l442l342j306L625N414K091L136l485j487J760
4512c391l941J132N56M265l722J34J9K716K77n91M764l6j207l796k707J486O071
4495B029n25l666p56l921L130L61k070k485l17n811L526J063K261j171J649J107
4479e596M43N836o35l379J337J000n448o306J815K53j705N4K479N645k248k246
$$ plain form
4463 -8701 -9198 -4905 -942 -1934 1823 874 -4724 -4458 -9338 -19208 -18920 -12848 -6668 -4109 -16 -342
4447 -342 -6197 588 422 -2487 -12255 -15965 -12807 -7381 -5606 -8610 -10226 -11093 -7383 -8310 -11612 -17005
4431 -17005 -18924 -15910 -7625 2018 5513 5501 5021 5074 4695 7715 2942 -7945 -8281 284 4026 6641
4415 6641 1432 -2944 -7150 -7243 -10353 -12309 -13399 -6787 5990 8641 11600 13254 11150 9944 8779
4400 8779 13458 3627 28 2958 -301 -285 -2380 2172 7611 13350 11021 8571 9585 4518 1394
4385 1394 -1623 -11133 -13336 -14098 -12870 -3617 -8393 -6618 200 3569 -2667 -12575 -13098 -5473 -5102 -7634
4369 -7634 -11467 -11292 -11163 -8091 -4082 -1496 -1727 -2591 -2466 -2376 -6156 -6949 -4985 -7071 -7198 -10829 -9777
4352 -9777 -652 -1417 -365 3726 435 -6480 -10031 -11974 -5101 2439 3563 1145 -5767 -8396 -4821
$$ packed form
4463h701m97M293L963r92L757r49n598K66m880r870K88O072O180K559M093l26
4447c42n855O785j66k909r768l710L158N426J775l004j616q67L710r27l302n393
4431a7005j919L014Q285R643L495j2m80N3l79L020m773j0887l36Q565L742K615
4415F641n209m376m206r3l110j956j090O612J2777K651K959J654k104j206j165
4400H779M679r831l599K930l259J6k095M552N439N739k329k450J014n067l124
4385A394l017r510k203p62J228R253m776J775O818L369o236r908n23P625L71k532
4369g634l833J75J29L072M009K586k31q64J25R0l780p93J964k086j27l631J052
4352i777R125p65J052M091l291o915l551j943O873P540J124k418o912k629L575
$$ plain form
4337 -4821 -776 2864 -519 -921 3098 7251 7091 6488 -520 -6676 -12354 -9890 -12085 -11483 -13843 -14966
4321 -14966 -12603 -12810 -3598 3393 -1811 -5138 676 2269 -1630 3147 5957 3485 4240 10133 21345
4306 21345 19059 6542 -1515 -4570 -3449 -5175 -6731 -8655 -8229 -7 2287 4855 -582 2039 5438
4291 5438 5861 -2359 -9274 -13771 -12593 -9696 -15683 -7897 1407 3665 -583 -4303 -7367 -8497 -5334
4276 -5334 565 -132 -7398 -11864 -17064 -12400 -3966 4965 5269 -2056 -13383 -12900 -12327 -12130 -9210 -3350
4260 -3350 1284 2795 109 2698 2540 -1284 -4189 -4764 1630 3930 -48 -2334 -3995 -4869 -3920 -1391
4244 -1391 -5701 -8687 -3875 5485 4753 3162 2937 -7372 -8553 -7519 -5958 -2549 2245 655 -6134
4229 -6134 -2891 -4009 -2704 6355 2311 -7189 -4782 -3431 -654 2857 585 4147 4899 3962 3651 -2618
$$ packed form
4337d821M045L640l383m02M019M153j60o03p008o156n678K464k195O02k360j123
4321a4966K363k07R212O991n204l327N814J593l899M777K810k472P55N893J1212
4306B1345k286j2517q057l055J121j726j556j924M26Q222K294K568n437K621L399
4291E438M23q220o915m497J178K897n987P786R304K258m248l720l064j130L163
4276e334N899o97p266m466n200M664Q434Q931L04p325j1327M83N73J97K920N860
4260c350M634J511k686K589j58l824k905n75O394K300l978k286j661q74R49K529
4244a391m310k986M812R360p32j591k25j0309j181J034J561L409M794j590o789
4229f134L243j118J305R059m044r500K407J351K777L511k272L562P52r37l11o269
$$ plain form
4213 -2618 -5125 -8188 -5462 -3133 -708 -20 -2615 -7453 -8681 -9884 -8079 -3107 -2563 -3601 -8365
4198 -8365 -13739 -14062 -6798 2096 6303 4179 -82 -4818 -7582 -6718 -9215 -14599 -16991 -14766 -3899
4183 -3899 5673 3851 6165 3073 -946 642 -8022 -10151 -11537 -13796 -6751 4505 1179 -2748 -9995
4168 -9995 -12584 -9508 -5855 465 -888 -1246 423 899 5459 150 -9767 -8520 -2198 -5471 -7698
4153 -7698 -363 8662 8617 7359 7970 13800 10410 4717 -5 4084 8800 8791 3334 -3273 -3018 -7743 -7602
4136 -7602 -3195 -5194 1513 -1375 -11723 -17163 -19814 -14600 -11281 -7914 -2149 -4872 -5809 -7181 -1729
4121 -1729 8734 8412 6658 9119 921 -3237 218 531 1481 5079 -1504 -8697 -8143 -5169 -9120 -5859
4105 -5859 -1321 -5457 -5412 -12732 -12821 -3130 135 2734 -5151 -7277 -6004 -1085 -1947 3318 523 -3904
$$ packed form
4213b618k507l063K726K329K425O88k595m838j228j203J805M972N44j038m764
4198h365n374l23P264Q894M207k124m261m736k764Q64k497n384k392K225J0867
4183c899R572j822K314l092m019J588q664k129j386k259P045J1256l326l927p247
4168i995k589L076L653O320j353l58J669M76M560n309r917J247O322l273k227
4153g698P335R025m5j258O11N830l390n693m722M089M716rn457o607K55m725J41
4136g602M407j999O707k888j0348n440k651N214L319L367N765k723r37j372N452
4121a729J0463l22j754K461q198m158L455L13R50L598o583p193N54K974l951L261
4105e859M538m136M5p320q9R691L265K599p885k126J273M919q62N265k795m427
$$ plain form
4089 -3904 -6195 -6377 -7419 -12195 -8656 -4073 -3995 -9877 -22260 -21800 -15284 -7687 -1520 -6559 -6677 -7139
4073 -7139 2803 4971 690 -2097 340 2819 2269 -238 -2036 -7885 -10176 -13649 -12575 -3957 1114
4058 1114 3370 3323 1010 -99 -383 -3658 -2559 -5891 -16136 -19575 -16814 -14800 -8119 5903 10492
4043 10492 1735 3328 1325 -5835 -2924 -7683 -16705 -10122 -7808 -7535 -590 134 -764 -2728 -7489
4028 -7489 -10489 -17598 -24351 -18136 -13680 -7156 -5405 -9087 -1795 821 6996 9865 12922 15391 10008
4013 10008 4692 -1993 2198 128 -6692 -2110 2366 -2443 -10479 -13720 -11084 -1774 37 -3855 -7627
3998 -7627 -7328 -12075 -7908 -4918 488 -1539 -674 5569 4983 -2046 -6141 -4027 -2892 -1227 -1846 3252
3982 3252 223 2867 4396 -4537 -5361 4572 4165 4686 3293 10540 6318 -2565 -3929 -1045 2942 -924
$$ packed form
4089c904k291j82j042m776L539M583P8n882j2383M60O516P597O167n039j18m62
4073g139R942K168m281k787K437K479n50k507j798n849k291l473J074Q618N071
4058A114K256m7k313j109k84l275J099l332j0245l439K761K014O681J4022M589
4043A0492q757J593k003p160K911m759r022O583K314K73O945P24q98j964m761
4028g489l000p109o753O215M456O524J751l682P292K616O175K869L057K469n383
4013A0008n316o685M191k070o820M582M476m809q036l241K636R310J811l892l772
3998g627K99m747M167K990N406k027Q65O243n86p029m095K114J135J665o19N098
3982C252l029K644J529q933q24R933m07N21j393P247m222q883j364K884L987l866
$$ plain form
3966 -924 -3861 -1139 1476 8445 1974 2800 5158 5846 8599 4763 -2431 -4148 5241 8285 6430 1466
3950 1466 -2064 -11807 -15955 -10031 -4587 -1111 -58 -917 3313 5678 7745 1088 -1840 -1887 -6391 -8836
3934 -8836 -7274 -11977 -13146 -10263 -9010 -7483 -14817 -18594 -10444 -9370 -10363 -1505 822 6676 4843
3919 4843 -585 -3934 -5376 -8045 -4488 774 -458 3042 -1237 -8867 -2213 1724 -1903 -5409 -1680
3904 -1680 2080 7223 6830 2880 6191 5921 -273 -852 -2860 -2436 6228 6431 8516 9232 10676 4282
3888 4282 1961 3164 2158 808 5709 11922 12203 3511 1108 2301 3328 9896 8703 -1510 -5602
3873 -5602 1260 864 -1603 -1319 1512 5149 7182 11555 8549 5393 4851 -1839 -5895 -4431 -119 354
3857 354 -3227 -5414 -5444 -5040 -4697 100 -4039 -10613 -18905 -17930 -8357 -6756 -9170 -14075 -10828 -4520
$$ packed form
3966i24k937K722K615O969o471Q26K358O88K753l836p194j717R389L044j855m964
3950A466l530r743m148N924N444L476J053q59M230K365K067o657k928m7m504k445
3934h836J562m703j169K883J253J527p334l777Q150J074r93Q858K327N854j833
3919D843n428l349j442k669L557N262j232L500m279p630O654L937l627l506L729
3904a680L760N143l93l950L311k70o194n79k008M24Q664K03K085P16J444o394
3888D282k321J203j006j350M901O213K81q692k403J193J027O568j193j0213m092
3873e602O862l96k467K84K831L637K033M373l006l156n42o690m056J464M312M73
3857C54l581k187l0M04L43M797m139o574q292R75R573J601k414m905L247O308
$$ plain form
3841 -4520 592 1047 9150 9771 2109 -8123 0 7502 4293 1013 -1737 -14675 -21504 -16951 -9242
3826 -9242 -8854 -8020 -1619 1969 -2655 -1949 660 -3262 -5956 -7200 -8148 -9777 -10882 -7557 -673 -92
3810 -92 4569 5444 1949 -4900 -4915 -7711 -9067 -10547 -12675 -9647 -5979 -2400 1197 5366 4652 7450
3794 7450 8189 -250 -8310 -7746 1156 7913 6756 -244 -2441 4964 8220 -216 -5290 -2911 -6136
3779 -6136 -816 577 -7164 -6411 3471 11360 9061 1304 -2580 -3950 184 -2073 -4145 -2354 -1346
3764 -1346 -5221 -8787 -8164 -4747 1567 -1864 -5784 -7139 -957 -2419 -5105 -5791 -9604 -3672 -1011
3749 -1011 -6298 -4607 38 6035 4061 802 666 -1188 -4240 -10975 -15339 -18993 -13357 -1047 1574
3734 1574 -2012 3808 8554 -111 -4967 -5289 -6065 -777 4081 4295 10056 12828 4441 -4338 -10729 -9827
$$ packed form
3841d520N112M55Q103O21p662j0232Q123P502l209l280k750j2938o829M553P709
3826i242L88Q34O401L588m624P06K609l922k694j244r48j629j105L325O884N81
3810i2M661Q75l495o849j5k796j356j480k128L028L668L579L597M169p14K798
3794G450P39q439q060N64Q902O757j157p000k197P405L256q436n074K379l225
3779f136N320J393p741P53R882P889k299p757l884j370M134k257k072J791J008
3764a346l875l566O23L417O314l431l920j355O182j462k686o86l813N932K661
3749a011n287J691M645N997j974l259j36j854l052o735m364l654N636J2310K621
3734A574l586N820M746q665m856l22p76N288M858K14N761K772q387q779o391R02
$$ plain form
3718 -9827 -5412 -4261 -1736 4272 6289 3848 609 -4032 -2699 9865 14684 7581 7169 9186 8801
3703 8801 6028 259 -3129 -5273 -10731 -12020 -6313 -2050 1053 1448 3167 3864 4332 -3541 -1771 -292
3687 -292 818 5821 3133 5782 -1537 -3447 1829 -4024 -5179 -5946 -12263 -17169 -11713 -3604 3882
3672 3882 7218 9734 15890 18908 12960 9131 9734 34 -12542 -11526 -8841 -9535 -5575 -1336 2499
3657 2499 3701 -2156 1710 5345 2240 -884 -10804 -15179 -12690 -577 -2485 -4002 1 -1887 -1927
3642 -1927 -114 -3444 -2282 -5767 -7964 -7620 -5091 -9587 -10643 -5247 -6061 -12091 -10287 -7401 -8198 -8821
3626 -8821 -9320 -12244 -15369 -12161 -5580 -9331 -16686 -17491 -17966 -11071 -7537 -4501 -4253 -7425 -3702 -8116
3610 -8116 -7522 -1608 494 -175 -3909 -4542 -393 1922 1629 624 1017 -5501 -6880 -5902 -969 -3169
$$ packed form
3718i827M415J151K525O008K017k441l239m641J333J2564M819p103m12K017l85
3703H801k773n769l388k144n458j289N707M263L103L95J719O97M68p873J770J479
3687b92J110N003k688K649p319j910N276n853j155p67o317m906N456Q109P486
3672C882L336K516O156L018n948l829O03r700j2576J016K685o94L960M239L835
3657B499J202n857L866L635l105l124r920m375K489J2113j908j517M003j888m0
3642a927J813l330J162l485k197L44K529m496j056N396q14o030J804K886p97o23
3626h821m99k924l125L208O581l751p355q05m75O895L534L036K48l172L723m414
3610h116N94N914K102o69l734o33M149K315k93j005L93o518j379R78M933k200
$$ plain form
3594 -3169 -8809 -14724 -13976 -10437 -6628 -1143 864 -2503 -4081 -3780 -3081 -5569 -1862 5493 11393 10769
3578 10769 9434 9823 10529 9084 6913 6754 11094 13306 8598 4817 2523 6859 8124 8309 5174 -1962
3562 -1962 -4469 -7815 -5796 -5566 -2308 -3877 -6293 -10417 -6663 -668 3295 1212 -1579 -1718 -46
3547 -46 -9724 -10941 -5885 -239 3446 2110 1458 -210 -1056 -2805 -3616 -4519 -6200 -6532 -7460 -3604 -6317
3530 -6317 -6091 -5654 -4832 -6091 -12537 -9886 -3943 -569 -327 1011 6415 1119 -5366 -8448 -2363 -771
3514 -771 -1972 3369 4790 3750 7124 14056 12221 1456 1543 7474 3604 -1150 -4289 -8306 -5156
3499 -5156 -2226 -8389 -7366 -10357 -15081 -6911 821 -2407 -1694 -3613 -6677 -3037 548 3628 626
3484 626 1557 6168 14025 16273 10157 6853 4321 3958 2264 -1971 -4079 4358 552 -1169 -2545 -5171
$$ packed form
3594c169n640n915P48L539L809N485K007l367j578L01O99k488L707P355N900o24
3578A0769j335L89P06j445k171j59M340K212m708l781k294M336J265J85l135p136
3562a962k507l346K019K30L258j569k416m124L754N995L963k083k791j39J672
3547d6r678j217N056N646L685j336o52j668q46j749q11r03j681l32r28L856k713
3530f317K26M37Q22j259o446K651N943L374K42J338N404n296o485l082O085J592
3514g71j201N341J421j040L374O932j835j0765Q7N931l870m754l139m017L150
3499e156K930o163J023k991m724Q170P732l228P13j919l064L640L585L080l002
3484F26R31M611P857K248o116l304k532l63j694m235k108Q437l806j721j376k626
$$ plain form
3468 -5171 -7822 -9737 -10634 -4262 -4623 -9319 -6815 -1799 -6139 -2287 -1146 2665 5124 934 -6124
3453 -6124 -6626 -3041 4135 3069 3140 -3045 -6989 -7217 -4853 -3073 -3017 -1591 -8014 -11727 -9574 -5774
$$ packed form
3468e171k651j915q97O372l61m696K504N016m340L852J141L811K459m190p058
3453f124n02L585P176j066P1o185l944k28K364J780N6J426o423l713K153L800
$$ [...]
##END NTUPLES=NMR SPECTRUM
##END=
