##TITLE=Analysis number 318571
Compound Code cc 56022
Book Reference 440/166
Project Code adrs
Chemist Name craigr
##JCAMPDX= 6.0         $$ Bruker NMR JCAMP-DX V2.0
##DATA TYPE= NMR SPECTRUM
##DATA CLASS= NTUPLES
##ORIGIN= Bruker BioSpin GmbH
##OWNER= nmr
$$ XWIN-NMR		Version 3.5
$$ Tue Apr  4 11:01:51 2006 GMT Daylight Time (UT+1h)  MAYBRIDGE\nmr@NMR_250MHZ
##.OBSERVE FREQUENCY= 250.131544655141
##.OBSERVE NUCLEUS= ^1H
##.ACQUISITION MODE= SIMULTANEOUS (DQD)
##.ACQUISITION SCHEME= undefined
##.AVERAGES= 16
##.DIGITISER RES= 18
##SPECTROMETER/DATA SYSTEM= dpx250
##.PULSE SEQUENCE= zg30
##.SOLVENT NAME= CDCl3
##.SHIFT REFERENCE= (INTERNAL, CDCl3, 0, 16.522)
##AUDIT TRAIL= $$ (NUMBER, WHEN, WHO, WHERE, WHAT)
$$ ##TITLE= Audit trail, XWIN-NMR		Version 3.5
$$ ##JCAMPDX= 5.01
$$ ##ORIGIN= Bruker BioSpin GmbH
$$ ##OWNER= nmr
$$ C:\u/data/dgb/nmr/ADRS/2010/pdata/1/auditp.txt
$$ ##AUDIT TRAIL=  $$ (NUMBER, WHEN, WHO, WHERE, WHAT)
(   1,<2006-04-04 11:01:26.35 +100>,<MAYBRIDGE\nmr>,<NMR_250MHZ>,
      <created by zg, POWCHK disabled, PULCHK disabled
       configuration hash MD5:
       84 BC 41 DB A1 6E 1D 46 DA 25 12 A5 C1 ED C5 3A
       data hash MD5: 64K
       30 9B 9F C0 A1 F6 15 10 C6 35 27 C9 5F 55 A0 87>)
(   2,<2006-04-04 11:01:39.82 +100>,<MAYBRIDGE\nmr>,<NMR_250MHZ>,
      <Start of raw data processing
       ef LB = 0.3 FT_mod = 6 PKNL = 1 SI = 32K 
       data hash MD5: 32K
       A3 72 D7 FE C8 AD 57 4D 13 87 EA A0 C2 A5 52 11>)
(   3,<2006-04-04 11:01:41.62 +100>,<MAYBRIDGE\nmr>,<NMR_250MHZ>,
      <apk 
       data hash MD5: 32K
       D7 29 62 5E BB 02 81 91 E9 46 BD 9F 86 17 06 AE>)
(   4,<2006-04-04 11:01:42.41 +100>,<MAYBRIDGE\nmr>,<NMR_250MHZ>,
      <abs ABSG = 5 
       data hash MD5: 32K
       D2 76 12 2E 37 5E C5 85 DB 53 53 A3 42 D0 D3 24>)
$$ ##END=
$$ 
$$ hash MD5
$$ BD E7 CE FD 8D 6C 4C F8 3E 14 56 59 19 33 5D FC
##$RELAX= 
##$RELAX= 
##$RELAX= 
##$RELAX= 
##$RELAX= 
##$RELAX= 
##$RELAX= 
$$ Bruker specific parameters
$$ --------------------------
##$DU= <C:\u>
##$EXPNO= 2010
##$NAME= <ADRS>
##$PROCNO= 1
##$TYPE= <nmr>
##$USER= <dgb>
##$AMP= (0..31)
100 100 100 100 100 100 100 100 100 100 100 100 100 100 100 100 100 100 
100 100 100 100 100 100 100 100 100 100 100 100 100 100 
##$AQSEQ= 0
##$AQ_mod= 3
##$AUNM= <au_zg>
##$AUTOPOS= <4 >
##$BF1= 250.13
##$BF2= 250.13
##$BF3= 250.13
##$BF4= 250.13
##$BF5= 500.13
##$BF6= 500.13
##$BF7= 500.13
##$BF8= 500.13
##$BYTORDA= 1
##$CFDGTYP= 0
##$CFRGTYP= 5
##$CHEMSTR= <none>
##$CNST= (0..31)
1 1 145 1 1 1 1 1 1 1 1 1 1 1 1 1 1 1 1 1 1 1 1 1 1 1 1 1 1 1 1 1 
##$CPDPRG= <>
##$CPDPRG1= <>
##$CPDPRG2= <>
##$CPDPRG3= <>
##$CPDPRG4= <mlev>
##$CPDPRG5= <mlev>
##$CPDPRG6= <mlev>
##$CPDPRG7= <mlev>
##$CPDPRG8= <mlev>
##$CPDPRGB= <>
##$CPDPRGT= <>
##$D= (0..31)
0 1 0 0 0 0 0 0 0 0.06 0 0 0 0 0 0 0.0002 0 0 0 0 0 0 0 0 0 0 0 0 0 0 
0 
##$DATE= 1144144884
##$DBL= (0..7)
120 120 120 120 120 120 120 120 
##$DBP= (0..7)
150 150 150 150 150 150 150 150 
##$DBP07= 0
##$DBPNAM0= <>
##$DBPNAM1= <>
$$ [...]
##$SUBNAM7= <"">
##$SUBNAM8= <"">
##$SUBNAM9= <"">
##$SW= 20.6930455092707
##$SWIBOX= (0..15)
0 0 3 0 0 0 0 0 0 0 0 0 0 0 0 0 
##$SW_h= 5175.983436853
##$TD= 65536
##$TD0= 1
##$TE= 294.16
##$TE2= 300
##$TE3= 300
##$TEG= 300
##$TL= (0..7)
0 120 120 120 120 120 120 120 
##$TP= (0..7)
150 150 150 150 150 150 150 150 
##$TP07= 0
##$TPNAME0= <>
##$TPNAME1= <>
##$TPNAME2= <>
##$TPNAME3= <>
##$TPNAME4= <>
##$TPNAME5= <>
##$TPNAME6= <>
##$TPNAME7= <>
##$TPOAL= (0..7)
0.5 0.5 0.5 0.5 0.5 0.5 0.5 0.5 
##$TPOFFS= (0..7)
0 0 0 0 0 0 0 0 
##$TUNHIN= 0
##$TUNHOUT= 0
##$TUNXOUT= 0
##$USERA1= <user>
##$USERA2= <user>
##$USERA3= <user>
##$USERA4= <user>
##$USERA5= <user>
##$V9= 5
##$VALIST= <valist>
##$VCLIST= <CCCCCCCCCCCCCCC>
##$VD= 0
##$VDLIST= <DDDDDDDDDDDDDDD>
##$VPLIST= <PPPPPPPPPPPPPPP>
##$VTLIST= <TTTTTTTTTTTTTTT>
##$WBST= 1024
##$WBSW= 4
##$XGAIN= (0..3)
0 0 0 0 
##$XL= 0
##$YL= 0
##$YMAX_a= 399792
##$YMIN_a= -289324
##$ZGOPTNS= <>
##$ZL1= 120
##$ZL2= 120
##$ZL3= 120
##$ZL4= 120
##$ABSF1= 16.522
##$ABSF2= -4.171173
##$ABSG= 5
##$ABSL= 3
##$ALPHA= 0
##$AQORDER= 0
##$ASSFAC= 0
##$ASSFACI= 0
##$ASSFACX= 0
##$ASSWID= 0
##$AUNMP= <proc_1d>
##$AZFE= 0.1
##$AZFW= 0.1
##$BCFW= 0
##$BC_mod= 0
##$BYTORDP= 0
##$COROFFS= 0
##$CY= 12.5
##$DATMOD= 1
##$DC= 0
##$DFILT= <>
##$DTYPP= 0
##$F1P= 14.0000005364418
##$F2P= -0.99999901652339
##$FCOR= 0.5
##$FTSIZE= 32768
##$FT_mod= 6
##$GAMMA= 0
##$GB= 0
##$INTBC= 1
##$INTSCL= 1
##$ISEN= 128
##$LB= 0.3
##$LEV0= 0
##$LPBIN= 0
##$MAXI= 10000
##$MC2= 0
##$MEAN= 0
##$ME_mod= 0
##$MI= 0
##$NCOEF= 0
##$NC_proc= -3
##$NLEV= 6
##$NOISF1= 0
##$NOISF2= 0
##$NSP= 0
##$NTH_PI= 0
##$NZP= 0
##$OFFSET= 16.522
##$PC= 1
##$PHC0= 16.4676
##$PHC1= 9.788498
##$PH_mod= 1
##$PKNL= yes
##$PPARMOD= 0
##$PSCAL= 4
##$PSIGN= 0
##$REVERSE= no
##$SF= 250.13
##$SI= 32768
##$SIGF1= 0
##$SIGF2= 0
##$SINO= 400
##$SIOLD= 32768
##$SREGLST= <1H.CDCl3>
##$SSB= 0
##$STSI= 32768
##$STSR= 0
##$SW_p= 5175.98343685301
##$SYMM= 0
##$S_DEV= 0
##$TDeff= 65536
##$TDoff= 0
##$TI= <Analysis number 999999
Compound Code 99
Book Reference 9
Project Code 9>
##$TILT= no
##$TM1= 0
##$TM2= 0
##$TOPLEV= 0
##$USERP1= <user>
##$USERP2= <user>
##$USERP3= <user>
##$USERP4= <user>
##$USERP5= <user>
##$WDW= 1
##$XDIM= 32768
##$YMAX_p= 313348142
##$YMIN_p= -101621
$$ End of Bruker specific parameters
$$ ---------------------------------
##NTUPLES= NMR SPECTRUM
##VAR_NAME=  FREQUENCY,     SPECTRUM/REAL,   SPECTRUM/IMAG
##SYMBOL=    X,             R,               I
##VAR_TYPE=  INDEPENDENT,   DEPENDENT,       DEPENDENT
##VAR_FORM=  AFFN,          ASDF,            ASDF
##VAR_DIM=   32768,         32768,           32768
##UNITS=     HZ,            ARBITRARY UNITS, ARBITRARY UNITS
##FACTOR=    0.157963299565203, 1,           1
##FIRST=     4132.6476996994, 0,             0
##LAST=      -1043.33573715361, 0,           0
##MIN=       -1043.33573715361, -101621,     0
##MAX=       4132.6476996994, 313348142,     0
$$ Real data points
##PAGE= N=1
##DATA TABLE= (X++(R..R)), XYDATA
$$ [...]
18850A11274j604m33j022j765P398N509J869L484N603Q207r28m039K797L767O877
18835A46994R087R268J6084J8240J0239L834K202n255j0497j6930j2181j0699
18823A60386j3216q018j687M828P019O533o31m922n226J266K880J953j910k558
18809A46697n230n52O070N322K947j177M81l524J546l817k866q104o620l172n274
18794A22727R56l543q333l025j940J752L52n071n196k84q98J474o42j620K517
18779I9226j807q42J432K44L872M997L520j620m606M130M517J300O960O496p73
18764A27046k037p235n952l015q799R38J274j057M620N829M891K066N727N588
18750A29884J378k420k644L708J6671K1438K2904J8590J0830P522j007P88R221
$$ plain form
18850 111274 109670 109237 108215 106450 113848 119357 121226 124710 130313 138520 137592 133553 136350 140117 146994
18835 146994 156081 165349 181433 199673 209912 213746 215948 210693 200196 183266 171085 160386
18823 160386 147170 139152 137465 142293 149312 155845 155214 150292 145066 146332 149212 151165 149255 146697
18809 146697 141467 140915 146985 152307 155254 154077 154558 151034 152580 148763 145897 137793 131173 128001 122727
18794 122727 123683 120140 111807 108782 106842 108594 108946 103875 98679 98395 97497 98971 98329 96709 99226
18779 99226 97419 96577 98009 98253 102125 107122 110642 109022 104416 108546 113063 114363 121323 127819 127046
18764 127046 125009 117774 111822 108807 100008 100946 102220 101163 105783 111612 116503 118569 124296 129884
18750 129884 131262 128842 126198 129906 146577 168015 190919 209509 220339 227861 226854 227642 236863
18737B36863O560Q440J4320J1770J6565K0680J4191n75k0520l0610l2978k6041
18725B18665j2625j4191q193j502l582K050J1200O790K804M046m26l795m250r152
18711A87839l601l50K150o77K565l678J651L681M711P155J0824R996J3576K2957
18697B58799K9672L3454L6500M9527N0082N2616M3950M4859L5006J6456k113j4922
18685F33886k7757l1719k9729q207J2387K7258L7856M9735N0623K7795p76k6634
18673G14718n2569o8475o3942n1259m2199k7929j8657j0726j0385q176k507k992
18661C54902l225q391j0341l755l403k457q53l900N723M70l991K262J796K203
18647C27040L780J226k476l710Q86L098K48m999J517K752R165J3017Nj55J748
$$ plain form
18737 236863 243423 251863 266183 277953 294518 315198 329389 328814 308294 277684 244706 218665
18725 218665 206040 191849 183656 182154 178572 180622 191822 198612 201416 205462 205036 201241 196991 187839
18711 187839 184238 183888 186038 185361 187926 184248 185899 189580 194291 201446 212270 222266 235842 258799
18697 258799 288471 321925 358425 407952 458034 510650 554600 599459 634465 650921 648808 633886
18685 633886 606129 574410 544681 536474 548861 576119 613975 663710 714333 742128 741352 714718
18673 714718 662149 593674 529732 478473 436274 408345 389688 378962 368577 360401 357894 354902
18661 354902 351677 343286 332945 329190 325787 323330 322477 318577 324300 324770 320779 323041 324837 327040
18647 327040 330820 332046 329570 325860 326746 329844 330092 325093 326610 329362 338527 351544 351549 351394 353142
18632C53142J410j353J258k046j856L651K095L806Q959M981K633N544P340K335
18618C91899J491O017J0318N587P123J2579O709O390R269J2369K6277K5449K7402
18605E48879L4541L8831L7746L8756L9224M2686M4162M2632M8976M9565M8644
18594A014642N3799N9120O6102O9332O2908O2209O4422Q3262J03833J10384J06896
18583A856909J13246J47362J81184K17988K50358K86900L36576M17058N43109
18574D350690O95883Q70394J083507J329401J624172K065229K767714L725636
18566A8512626M616962M930684M279315K755020J396750R11610M30288r04414
18558C6928841k419689k579343j295410N38636K160811K985208K649605J277726
$$ plain form
18632 353142 354552 353199 354457 352411 350555 354206 356301 360107 369066 374047 376680 382224 389564 391899
18618 391899 393390 399407 409725 415312 422435 435014 441723 448113 457382 469751 496028 521477 548879
18605 548879 583420 622251 659997 698753 737977 780663 824825 867457 916433 965998 1014642
18594 1014642 1068441 1127561 1193663 1262995 1325903 1388112 1452534 1535796 1639629 1750013 1856909
18583 1856909 1970155 2117517 2298701 2516689 2767047 3053947 3390523 3807581 4350690
18574 4350690 5046573 5916967 7000474 8329875 9954047 12019276 14786990 18512626
18566 18512626 23129588 28060272 32339587 35094607 36491357 37402967 37833255 36928841
18558 36928841 34509152 31929809 30634399 31173035 33333846 36319054 38968659 40246385
18550D0246385m6599n69377j150864k685629m511107n120368m455054l402116
18542A8305271k480816j813850j359914j046508q23303o72572n72607m98086m32650
18533H604965l93289l74233l36895l11648k79879k53532k27751k09521j98060
18524F020157j86262j78028j64516j53419j59255j47208j41416j47520j51328
18515D591205j45338j43102j35928j34140j29399j27822j19114j12809j00204
18506C443349r2215r6896q9554p4261o9078o6429n8134n2272n3640n8045o2241
18495B670584n8967o0442n8576n4550n1953m9661n0051m8133m3541l7462l3263
18484B123985k9632k9804k3480k2092q075n491j5095j9005k2541j3630j7189k6689
$$ plain form
18550 40246385 40199786 39630409 38479545 35793916 31282809 26162441 21707387 18305271
18542 18305271 15824455 14010605 12650691 11604183 10780880 10108308 9535701 9037615 8604965
18533 8604965 8211676 7837443 7500548 7188900 6909021 6655489 6427738 6218217 6020157
18524 6020157 5833895 5655867 5491351 5337932 5178677 5031469 4890053 4742533 4591205
18515 4591205 4445867 4302765 4166837 4032697 3903298 3775476 3656362 3543553 3443349
18506 3443349 3351134 3254238 3164684 3090423 3021345 2954916 2896782 2844510 2790870 2732825 2670584
18495 2670584 2611617 2551175 2492599 2438049 2386096 2336435 2286384 2238251 2194710 2157248 2123985
18484 2123985 2094353 2064549 2041069 2018977 2010902 2005411 1990316 1971311 1948770 1935140 1917951 1891262
18472A891262l0048k2767k5292j4566j3960p928n79O478J3959J8393L0264K9426
18460A874642K7891J3641K858J665J50k3007l3148j9388j2934J872R897K8490
18448A872629L7797L6614L6177J7573n287j7593j7557k2418l5787m7615m3837
18437A810696m2062l5528l8688m0100l7025m5822m4135m0142k6877j1220m438
18426A444659r282p025L37j506j2402k0559l1341l6974l9667l1956j9320p130
18414A227834R063J4145J2540J0141k773j1132k7004m1931m0376l5624l1338k9126
18402A054419k7699k4342j9829j5110j5885j6934j6077k3380j9699j8004k2326
18391H35134j4944j4293j6511q763l444q767j3959q844n923m36j206m416p89O365
$$ plain form
18472 1891262 1861214 1838447 1813155 1798589 1784629 1776701 1776122 1782600 1796559 1814952 1845216 1874642
18460 1874642 1902533 1916174 1919032 1920697 1920847 1897840 1864692 1845304 1832370 1834242 1844139 1872629
18448 1872629 1910426 1947040 1983217 2000790 1995503 1977910 1960353 1937935 1902148 1854533 1810696
18437 1810696 1768634 1733106 1694418 1654318 1617293 1571471 1527336 1487194 1460317 1449097 1444659
18426 1444659 1435377 1428352 1428689 1427183 1414781 1394222 1362881 1325907 1286240 1254284 1234964 1227834
18414 1227834 1236897 1251042 1263582 1273723 1270950 1259818 1232814 1190883 1150507 1114883 1083545 1054419
18402 1054419 1026720 1002378 982549 967439 951554 934620 918543 895163 875464 857460 835134
18391 835134 820190 805897 789386 780623 777179 768412 754453 745609 739686 739250 738044 733628 732839 739204
18377G39204J1218J6753J1867J6145J6996J8354J5309J8439K1461J9360K9337
18366I34443L6689N7459P6744R7138J14048J11723Q8346O5407N6947M2807K0566
18355A702317j2246k3602K672L8259Q6486J30544J71929K13600K54318K90939
18345B855216L37124M25873N76485Q29267J246867J971926L133270M631344O022790
18336B2030162O509706N505454L221507J022090K18649m42075k137760m517977
18328C1409756n364716m302341k278753q2945K076604M100896N542805N656666
18320C6757972M177903J664449n4859o38674j621144l786882n932232o178941
18312B4387592m997922l463176k283091j544210j104144q32276o58684n50484
$$ plain form
18377 739204 750422 767175 779042 795187 812183 830537 845846 864285 885746 905106 934443
18366 934443 971132 1028591 1105335 1202473 1316521 1428244 1516590 1581997 1638944 1681751 1702317
18355 1702317 1690071 1666469 1669141 1707400 1793886 1924430 2096359 2309959 2564277 2855216
18345 2855216 3192340 3618213 4194698 5023965 6270832 8242758 11376028 16007372 22030162
18336 22030162 28539868 34045322 37266829 38288919 38507568 38065493 35927733 31409756
18328 31409756 26045040 21742699 19463946 19381001 21457605 25558501 31101306 36757972
18320 36757972 40935875 42600324 42545465 41906791 40285647 36498765 30566533 24387592
18312 24387592 19389670 15926494 13643403 12099193 10995049 10162773 9504089 8953605
18304H953605m81400m33694m15279l88047l54285l14288k72321k33527j95639
18295E865125j60065j40899j33954j37116j42700j46869j53412j66597j77382
18286D506131j79293j68173j50984j35752j29987j17858j03984r0805q4844q5703
18276C258748q2569p8775p4882o5067n4905n5451n2599m6201m9127n4690m5672
18265B598810m2663n1961o1871p4837p4564o3338n8259n7596o2107n8101m4985
18254A948528l8254l3998l6811m2827l6683k7788k4470k4837k4491k4805k2625
18243A610939k3526j9072j8913j3288j2847j1921l890j227j804m827k19L840l78
18230A502867k840P824J1167N936L759L493O897j427r880k1207k5150k2349l0700
$$ plain form
18304 8953605 8472205 8038511 7623232 7235185 6880900 6566612 6294291 6060764 5865125
18295 5865125 5705060 5564161 5430207 5293091 5150391 5003522 4850110 4683513 4506131
18286 4506131 4326838 4158665 4007681 3871929 3741942 3624084 3520100 3429295 3344451 3258748
18276 3258748 3176179 3097404 3022522 2957455 2902550 2847099 2794500 2748299 2699172 2644482 2598810
18265 2598810 2556147 2504186 2442315 2367478 2292914 2229576 2171317 2113721 2051614 1993513 1948528
18254 1948528 1910274 1876276 1839465 1796638 1759955 1732167 1707697 1682860 1658369 1633564 1610939
18243 1610939 1587413 1568341 1549428 1536140 1523293 1511372 1507482 1506255 1504451 1499624 1499405 1503245 1502867
18230 1502867 1500027 1507851 1519018 1524954 1528713 1532206 1539103 1537676 1527796 1506589 1481439 1459090 1428390
18217A428390k5006k1469o769O629J7141K8144K8830K4293J4406O395J668k0776
18205A481876m3015m8242n1390o0616n5091m4348k8359j3604R19J0055P947J0710
18193A166842M632q175j6137k3147l3462l4423m1371l9749l4003l0419k4654k5346
18181H60588j5647j9930j2940j3496k0265k4221j9149j7163j5592j1435r649l799
18169F77302J221P78k790j0006q690j1544r014l076K645l52Q58K472J5357K5090
18155F80251K0443L0649M5014L8720L3586L9062L2252K285j8890j7176j4576l5042
18143H36578m1005k6329j6759j8155j9594j0202j1836j2447j1438j2982j2400
18132F43431p184j1276p620o167r142r968n596l549L68K323L517M571J4499J1579
$$ plain form
18217 1428390 1403384 1381915 1375146 1381775 1398916 1427060 1455890 1480183 1494589 1500984 1502652 1481876
18205 1481876 1438861 1390619 1339229 1278613 1223522 1179174 1150815 1137211 1138130 1148185 1156132 1166842
18193 1166842 1171474 1163299 1147162 1124015 1090553 1056130 1014759 975010 941007 910588 885934 860588
18181 860588 844941 825011 812071 798575 778310 754089 734940 717777 702185 690750 681101 677302
18169 677302 678523 679301 676511 666505 657815 646271 637257 634181 636826 636474 637332 639804 655161 680251
18155 680251 700694 731343 776357 815077 848663 887725 919977 922262 903372 886196 871620 836578
18143 836578 795573 769244 752485 734330 714736 704534 692698 680251 668813 655831 643431
18132 643431 636247 624971 617351 611184 602042 592074 586478 582929 583297 585620 589137 593708 608207 619786
18118F19786J3401L3003N4058O2871Q8643J36670K23498L87317O96063J110858
18108C426168J356352J237284L55214j289214j511467r31980n20294k87705j68466
18099A665892j04134o2271n4298n5530m5977m3901o9068p2797n4813m5600m9688
18088A007815m2540l2275j9286j9342j6499j7813j5500j8357j4655j1287j6953
18077G83308j4907j4147j5182m799N87l364n50L678j119N427R687J0656K1030
18064G80305K0469K0736K5747L0744L4794M0757L5310L7767N7066P2974P9415
18053A236084R0050R7852J04308J12266J18347J25133J33395J58537K09255K93921
18043B679148L94015N22681O88155Q17165Q69062Q34251Q75768J026783J103145
$$ plain form
18118 619786 633187 666190 720248 783119 871762 1008432 1231930 1619247 2315310 3426168
18108 3426168 4782520 6019804 6375018 5085804 3574337 2642357 2122063 1834358 1665892
18099 1665892 1561758 1499487 1445189 1389659 1343682 1299781 1230713 1157916 1103103 1057503 1007815
18088 1007815 965275 933000 913714 894372 877873 860060 844560 826203 811548 800261 783308
18077 783308 768401 754254 739072 734273 734860 731496 730946 734624 733505 738932 748619 759275 780305
18064 780305 800774 821510 847257 878001 912795 953552 988862 1026629 1083695 1156669 1236084
18053 1236084 1326134 1423986 1528294 1640560 1758907 1884040 2017435 2175972 2385227 2679148
18043 2679148 3073163 3595844 4283999 5101164 5970226 6804477 7680245 8707028 9810173
18034I810173R46619R01428J570723K743855L904455M723062N209235N161897
18026C4971447N432456O238373N777420K489278j517818j836766j241897k947028
18018D7365465n012675m737623l370224k670925k510359j858010j009645p23904
18010B5472100j312688k007131j929497j603237j561494j715708j649086j322000
18002A2371259r60400o79541m99406l82473k93005k23716j80823j54306j11768
17993H885821k6685Q2494K30025M71583P98967J133786J396745J508961J473308
17984A5955005J540012J771225J820066J373012Q88774J316197K254479L002123
17976B9920893L384092M004677M859742M731962K922118J335542J623300J176626
$$ plain form
18034 9810173 10756792 11658220 13228943 15972798 19877253 24600315 29809550 34971447
18026 34971447 40403903 46642276 52419696 54908974 53391156 51554390 50312493 47365465
18018 47365465 42352790 37615167 34244943 31574018 29063659 27205649 26196004 25472100
18010 25472100 24159412 22152281 20222784 18619547 17058053 15342345 13693259 12371259
18002 12371259 11410859 10731318 10231912 9849439 9556434 9332718 9151895 8997589 8885821
17993 8885821 8859136 8941630 9171655 9643238 10442205 11575991 12972736 14481697 15955005
17984 15955005 17495017 19266242 21086308 22459320 23348094 24664291 26918770 29920893
17976 29920893 33304985 37309662 42169404 46901366 49823484 51159026 52782326 53958952
17968E3958952k437705n843724n369102l934682l773482m351099l906582k827264
17960B1515312j853259j130718p92759r07895j178328j106468r14916q68134r24760
17951A1838075q81774p28662n78378m70342l97705l37658l00697k84033k83290
17942G575536k64520k51030k37407k25231k14993k02379j86640j78097j68121
17933E647118j60386j48247j38543j29495j28386j20652j11097j05531r6718q6898
17923D421165q1614p2990p2161o3045n5711m9957n3313n5667n4433n0029n8452
17912C753793o5785o7472p2668p9450p6374o7461o2735m9420l6464k3545j7602
17901C134817n062N367n618j5360k9406l8885n9697p6861p2979p1865p4165o6886
$$ plain form
17968 53958952 51521247 45677523 40308421 36373739 32600257 28249158 24342576 21515312
17960 21515312 19662053 18531335 17738576 16830681 15652353 14545885 13630969 12762835 11838075
17951 11838075 10956301 10227639 9649261 9178919 8781214 8443556 8142859 7858826 7575536
17942 7575536 7311016 7059986 6822579 6597348 6382355 6179976 5993336 5815239 5647118
17933 5647118 5486732 5338485 5199942 5070447 4942061 4821409 4710312 4604781 4508063 4421165
17923 4421165 4339551 4266561 4194400 4131355 4075644 4025687 3972374 3916707 3862274 3812245 3753793
17912 3753793 3688008 3620536 3547868 3468418 3392044 3324583 3261848 3212428 3175964 3152419 3134817
17901 3134817 3129755 3135122 3129504 3114144 3084738 3045853 2986156 2909295 2836316 2764451 2690286 2623400
17889B623400n3833n0256m7597m1007m6448m4757m6176m7681m3854l1674l0644
17878B139473l1462l3980k7220j8779j4355j2651j6897j8787j5805j6797p547
17867A925193m361j073J962k308m69R22q714k0261j7307j1550k0696l2939l5409
17854A772990l3065l0443k0955j3140n408O817J7280J4884k069M886j1747l9496
17842A660534m2613m7505o4877n8163m9267m8023m5474m3656l3870l4325l3115
17831A159646k9451k9037k6519l1370k6727j7903k3407l0277k6094j7752j6343
17820H84766j8727k3160j8396k3409k5984k0175k2778k0812j0944j1401j1370
17809F77610q353j5252j5600j0405n559p757j3017r438p907p572m979o505j2523
$$ plain form
17889 2623400 2569567 2519311 2471714 2430707 2384259 2339502 2293326 2245645 2201791 2170117 2139473
17878 2139473 2108011 2074031 2046811 2028032 2013677 2001026 1984129 1965342 1949537 1932740 1925193
17867 1925193 1920832 1919759 1921721 1919413 1918944 1919866 1911152 1890891 1873584 1862034 1841338 1808399 1772990
17854 1772990 1739925 1709482 1688527 1675387 1669979 1676796 1694076 1708960 1706891 1711777 1700030 1660534
17842 1660534 1617921 1570416 1505539 1447376 1398109 1350086 1304612 1260956 1227086 1192761 1159646
17831 1159646 1130195 1101158 1074639 1043269 1016542 998639 975232 944955 918861 901109 884766
17820 884766 866039 842879 824483 801074 775090 754915 732137 711325 700381 688980 677610
17809 677610 669257 654005 638405 628000 622441 614684 601667 592229 584322 576750 571771 565266 552743
17796E52743j3688j116n772j0275l571l345n125n417r65n705j3303n086l859l343
17782D72173j1648q407l379p574j4294j0612n855m572n804j5583q737m108m483
17769C67117q600j2921o073k720j1619j5723q886n731r730j3447p602k484j207
17756B60374j524N78k277q68k550L186j484P303J3957J3714J5031K8569K8547
17743C62556K6949J9156L864m088o705j0754k0404k8599j9705j5563o246J2146
17731C12607K2998J9624K8797K7283P417Q11o378j1859k6380l9275l3984k9122
17719B72539k4802j7984n705r810j2201q783o298r725m247o165r794r082q447
17706A39496j157N685j260l009n654l91m881n55n688n999j414j466k819q20n722
$$ plain form
17796 552743 539055 537939 532167 521892 518321 514976 509851 504434 503469 497764 484461 479375 475516 472173
17782 472173 460525 452118 448739 441165 426871 416259 410404 405832 400028 384445 375708 371600 367117
17769 367117 358517 345596 339523 336803 325184 309461 300575 294844 285114 271667 264065 261581 260374
17756 260374 258850 259428 257151 256283 253733 256919 255435 262738 276695 290409 305440 334009 362556
17743 362556 389505 408661 412525 408437 401732 390978 370574 341975 322270 306707 300461 312607
17731 312607 335605 355229 384026 411309 418726 419537 413159 401300 374920 335645 301661 272539
17719 272539 247737 229753 224048 214238 202037 193254 186956 177231 172984 166819 157025 147943 139496
17706 139496 138339 144024 142764 139755 134101 133710 128829 128274 122586 116587 115173 113707 110888 110068 104346
17691A04346m558l160q247k924l871k08K472M521M895l026n981k62k006k385m65
17676G9141o551M865O984Q2p48n631q156o139l143j553k371k920J088M501j912
17661E7537K805L597o959l786l5n10j733k854n593O5k61J514m917j605L810K592
17645D3667l29k322l132k875r79k284M624q75j772l757j18J435o65j98l228l535
17629B3657o30m823j876K84R72K775L221m623l895P89L158Q05J68L848j009l508
17613A9313p03k124n054K185L371J433R64P0j683m891j116L336M173l291o153
17598I830l975J619L700M074N230o24k914M719r98N89n465j829O489k96m566j926
17582A3657m715J109o25k519K156L516n648k23J06k76j30o523j696M611o89j416
$$ plain form
17691 104346 99788 96628 88381 85457 81586 81378 83850 88371 93266 90240 84259 83997 81991 79606 79141
17676 79141 72590 77455 84439 84521 83773 78142 69986 63847 60704 59151 56780 53860 54948 59449 57537
17661 57537 60342 63939 56980 53194 53159 52649 50916 48062 42469 42534 42273 43787 38870 37265 41075 43667
17645 43667 43338 41016 37884 35009 34030 31746 36370 35495 33723 29966 29848 31283 30618 30420 27192 23657
17629 23657 23027 18204 16328 16612 17584 20359 23580 18957 15062 15851 19009 19814 19982 23830 22821 19313
17613 19313 18610 16486 11432 13617 16988 18421 19385 19455 17772 12881 11765 15101 19274 15983 9830
17598 9830 5855 7474 11174 15248 20478 19854 16940 21659 20661 21250 15785 13956 20445 20149 15583 13657
17582 13657 8942 10051 9426 6907 9063 12579 6931 6708 6814 6538 6408 -115 -1811 2800 2111 695
17566F95J699j512l494j212j505j87l202m748M731j056M76K457J510k556o023
17551a3927J271L033J853N576L687m079M97L711j01k534m174k252Q08K093P52
17536c786Q92l27L678L340M871L390N286N121K943N885J8450J5112O487J2908
17522H4250J1993J7774J8187J3089P066Q853J0549J1727J2119Q925J476l483j210
17509B01315R214L51j2436k1865k3845j8057j6179j0807j1767j2478j1909m804
17497F6733j144k733k607M490J742J426l534m894o325o874j698o026j525L78l957
17482C3452l71Q17l39M137Q751P381P693J1761J4150J8682K0683J7201J4252O169
17468A64419K390O457J1383j908j3379j5264j3071M35J085K346J95J0811J0731
$$ plain form
17566 695 2394 882 -2612 -3824 -5329 -5516 -8718 -13466 -8735 -9791 -9315 -6858 -5348 -7904 -13927
17551 -13927 -12656 -9623 -7770 -2194 1493 -2586 -2089 1622 1521 -1013 -5187 -7439 -6631 -4538 -3786
17536 -3786 -2894 -3221 457 3797 8668 12058 17344 22465 25408 31293 49743 64855 71342 84250
17522 84250 96243 114017 132204 145293 152359 161212 171761 183488 195607 204532 206008 202525 201315
17509 201315 210529 210880 198444 176579 152734 134677 118498 107691 95924 83446 71537 66733
17497 66733 65589 62856 60249 64739 66481 67907 64373 59479 53154 46280 44582 38556 37031 37409 33452
17482 33452 33081 33898 33559 37696 46447 53828 61521 73282 87432 106114 126797 143998 158250 164419
17468 164419 166809 173266 184649 182741 169362 154098 141027 141462 142547 144893 145088 155899 166630
17455A66630L988N758M482J30j7283k0066j2896j2313j4274j7360j6777p180l080
17442E9759k332Q60M065J1q538m884j0552j0064p096l654l375k00k901M413O026
17427B1538J258n66L697q68l316K438K842o016k098r20q34k635m636k333J402
17412H953O90N80K82l276l952l783p46J63j61k90k087K740J650n18J22j42J293
17395A518k390m499l140K86K91L586J141J882O43q15j081R51L119N82j180j645
17379g51R59p07p625j957L427k866j476M847M270j320l032K202k197K876K643
17364g07O6j731k297J054J52K772R58j786J22J875j50j28q22M91k354k024j966
17347f475k786j440j347K77N045k451j375R04K355M375j892n498m581j607L221
$$ plain form
17455 166630 170618 176376 180858 180988 163705 143639 130743 118430 104156 86796 70019 62839 59759
17442 59759 57427 58287 62352 62363 53825 48941 38389 28325 21229 17575 14200 14000 11099 15512 21538
17427 21538 22796 22230 25927 25059 21743 24181 27023 21007 18909 17989 17155 14520 9884 7551 8953
17412 8953 9643 10223 10505 7229 3277 -506 -1252 -1089 -1250 -1540 -3627 -887 763 245 367 225 1518
17395 1518 -872 -5371 -8511 -8225 -7934 -4348 -3207 -1325 -682 -1497 -2578 -1627 1492 2074 894 -751
17379 -751 208 -499 -8124 -10081 -6654 -9520 -10996 -6149 -1879 -3199 -6231 -4029 -6226 -3350 -707
17364 -707 -641 -2372 -4669 -3615 -3463 -691 267 -1519 -1397 478 328 200 -622 -131 -2485 -4509 -6475
17347 -6475 -9261 -10701 -12048 -11771 -6726 -9177 -10552 -9648 -7293 -2918 -4810 -10308 -14889 -16496 -13275
17332a3275j286J024r93n36N02M401K206M818L469l72k780k909o999n095K422
17317a5403O149k549n700M321O338j355j212l315Q56K438j808J459p34o208J475
17302a5248J935J010K059j908M77K419j926o55k18n294k529j69M661L178N598
17287f610j973k168J645k838k784J463R93K222K281j68n065k492O360k31n599
17272a4964k378q8l103J293L591K4K540P85O05K016J380l566M378J056n550l662
17256a5643l403J930N983J616Q56J963l679K510j79l102L4k415j869N75l452j874
17240b0149M396L767K892m489p05K868K279J946m26M25J540j411J047l222K263
17225f979l660J748K346n59m162K664N79P82j92K960l426l057J167O618l973l485
$$ plain form
17332 -13275 -14561 -13537 -14530 -15066 -14564 -10163 -7957 -3139 330 -42 -2822 -5731 -12730 -17825 -15403
17317 -15403 -9254 -11803 -17503 -13182 -6844 -8199 -9411 -12726 -11870 -9432 -11240 -9781 -10515 -16723 -15248
17302 -15248 -13313 -12303 -10244 -12152 -11675 -9256 -11182 -11837 -12055 -17349 -19878 -20047 -15386 -12208 -6610
17287 -6610 -8583 -10751 -9106 -11944 -14728 -13265 -12272 -10050 -7769 -7937 -13002 -15494 -9134 -9365 -14964
17272 -14964 -17342 -17430 -20533 -19240 -15649 -15625 -13085 -12300 -11695 -9679 -8299 -11865 -7487 -6431 -11981 -15643
17256 -15643 -19046 -17116 -11133 -9517 -8661 -6698 -10377 -7867 -8046 -11148 -11114 -13529 -15398 -14823 -18275 -20149
17240 -20149 -15753 -11986 -9094 -13583 -14288 -11420 -9141 -7195 -7621 -7196 -5656 -7067 -6020 -9242 -6979
17225 -6979 -10639 -8891 -6545 -7104 -11266 -8602 -8023 -7241 -7433 -4473 -7899 -10956 -9789 -3171 -7144 -10629
17209a0629J343q06l056m164L866L485O48J154j961k161L67J31K616K853l464
17194i778m791n77J804M134Q61N16k009k013R39M637j953k176p70L292L250m662
17178i296J251J349l468O084j181J335j085m301o076j811P895M72n548L531L58
17163a0491o60N402j960q23l67j184M117L567n104n487J339M734P679N92k670
17148a316j806J517L164J278j358j039q81j063L71k352O987P885o03J427K386
17133A4597O492P385R458J9539K4543K7953L0325J1507j4644k7628j8880j0592
17121H0055k618K652J3774K4746K5422L5306L9212L1004M687j2181k3591m0642
17109A77826l7771k6471k0049q647L804Q879J0985K2192K3549J0455m282k1260
$$ plain form
17209 -10629 -9286 -10092 -13148 -17312 -13446 -9961 -9313 -8159 -10120 -12281 -11914 -11783 -9167 -6314 -9778
17194 -9778 -14569 -15146 -13342 -9208 -8347 -7831 -9840 -11853 -10914 -6277 -8230 -10406 -11176 -7884 -4634 -9296
17178 -9296 -8045 -6696 -10164 -4080 -5261 -3926 -5011 -9312 -15388 -17199 -9304 -8832 -14380 -10849 -10491
17163 -10491 -11151 -5749 -7709 -8532 -8899 -10083 -5966 -2399 -7503 -12990 -11651 -6917 762 1354 -1316
17148 -1316 -3122 -1605 1559 2837 1479 440 -441 -1504 -1133 -3485 3502 11387 10784 12211 14597
17133 14597 21089 28474 37932 57471 82014 109967 140292 151799 137155 109527 90647 80055
17121 80055 77437 80089 93863 118609 144031 179337 218549 249553 254240 242059 218468 177826
17109 177826 140055 113584 93535 84888 88692 97571 108556 130748 154297 164752 160470 139210
17097A39210k9216k4301j7656j1198n172l113n042m246m511p70n747n537m421
17084A8280J976J525J743k829p080m000K808M05k787J8j537L72L632J408p86K38
17068A3386j772K746l791r08l641j350K398L314J92k26j806n21J171K061L494
17053A4747n153n231j711J767M592p62j029o4j36l030M799m03l190j072j60j07
17037C857k719M663m89K748r75J455K453M12l791j21P871j970m457k058l834n960
17021b915j93L79L528J217J18L431M26m531l185j852j809L177O115J709l038K53
17005B830O309m15k090Q01j843k975l544j097l656L801Q61N012j238k303j6k58
16989A79N001J467n210J81R67K698K514J880L90o234o356q60Q60Q00K481j709
$$ plain form
17097 139210 109994 85693 68037 56839 51667 48554 43512 39266 34755 33985 28238 22701 18280
17084 18280 20256 21781 23524 20695 13615 9615 12423 12828 10041 10059 8522 8894 12526 13934 13148 13386
17068 13386 11614 14360 10569 9661 6020 4670 7068 10382 10574 10348 8542 8021 9192 11253 14747
17053 14747 9594 4363 2652 4419 9011 8249 7220 7156 7020 3990 8789 8386 5196 4124 3964 3857
17037 3857 1138 5801 5312 8060 7085 8540 10993 11405 7614 7493 15364 13394 8937 6879 3045 -2915
17021 -2915 -3108 -2729 799 2016 2134 5565 5991 1460 -1725 -3577 -5386 -2209 3906 5615 2577 2830
17005 2830 9139 8724 6634 7435 5592 2617 -927 -2024 -5680 -1879 -1018 3994 2756 453 437 179
16989 179 5180 6647 1437 1618 2585 5283 7797 9677 10067 3833 -2523 -3383 -2523 -1723 758 -951
16973i51k691J578M779K937P84o279j924K285m196j657J175M834n281k059j519
16958h185l248O689K452p261m27N103J052J160L602R16n85L130l041k864m221
16943e728k3K916P410N8j966L593j792L597J1481K191K200P216r16J425J493M855
16927C8010j521j726j136m938j2202o317k191k708Q70P121P565J963o621m363
16913A1806l832J016K644K900P44N14n856m849K914q96o508n931R47Q575J605
16898E793l124K347k510q205k238j98j436k996J274K477N28O521M237m678l280
16883e488j014l071K388J832L644L083o28k33J934n46Q36K047P157n57m793l170
16867C421l812J33l84q38k450L731L400K463M398J73k380j168q88p60N99n604
$$ plain form
16973 -951 -3642 -2064 2715 5652 6436 157 -1767 518 -3678 -5335 -4160 674 -4607 -6666 -8185
16958 -8185 -11433 -4744 -2292 -9553 -9980 -4877 -3825 -2665 937 1853 1268 4398 1357 -1507 -5728
16943 -5728 -5751 -2835 4575 4633 2667 6260 4468 8065 19546 21737 23937 31153 30237 31662 33155 38010
16927 38010 36489 34763 33627 28689 16487 10170 7979 5271 6141 13262 20827 22790 16169 11806
16913 11806 7974 8990 11634 14534 15278 15792 9936 5087 8001 7105 597 -5334 -4387 4188 5793
16898 5793 2669 5016 2506 -5699 -7937 -8135 -9571 -12567 -11293 -8816 -8288 -1767 2470 -2208 -5488
16883 -5488 -6502 -9573 -7185 -5353 -1709 1374 746 513 2447 1901 2737 4784 11941 11384 6591 3421
16867 3421 -391 -258 -642 -1480 -3930 -199 3201 5664 10062 10235 7855 6687 5799 5039 5638 34
16851C4O43K090L06M027J539m15K614l868o568l080k591r37K613N34j107L818
16835c48K497q04rM240N624k921Q26J332O75J04k266N511O851J528J966M87k962
16818B2331l280K583P4j885K276O538O775J214M34N090N138K283o362l665q01
16803C8743m104j544L177j886k40Q43L728k6l998m090Q6k2j13k33J30n682o820
16786A7949m26M30j654K721J329l894m4P154K631k422n010k848J599K987J559
16771B2061K620K320o360r50J479l838j190j696j146J491N057j422m607O71M491
16756A8981P66k982l418m201k925k594K343K176j7n280L107j756j446l990L455
16741B219L737L654N971j403M76l739J857k184r35J41k143p85O138L546N483O113
$$ plain form
16851 34 677 2767 3073 7100 8639 8224 10838 6970 402 -2678 -5269 -6206 -3593 -3059 -4166 -348
16835 -348 2149 1345 1336 5576 11200 8279 9105 10437 11112 11216 8950 14461 21312 22840 24806 25293 22331
16818 22331 19051 21634 21708 19823 22099 28637 35412 36626 37060 42150 47288 49571 43209 39544 38743
16803 38743 34639 33095 36272 34386 34146 34989 38717 38691 34693 30603 30689 30667 30554 30321 30451 24769 17949
16786 17949 17523 17953 16299 19020 20349 16455 16411 23565 26196 23774 18764 15916 17515 20502 22061
16771 22061 24681 27001 20641 19691 21170 17332 16142 14446 13300 14791 19848 18426 13819 14490 18981
16756 18981 19747 16765 13347 9146 6221 3627 5970 8146 8129 2849 5956 4200 2754 -1236 2219
16741 2219 5956 9610 15581 14178 14654 10915 12772 10588 9653 9794 7651 6866 13004 16550 22033 28146
16725B8146L241M463o91j650j999J271k223j08P270R162J007L487L580r99J628
16710E5585k231J174K002J760M087O557K650O000J6733J6453K6913L0355L3981
16697B02019K5425J6382J622j8795k7157k2751j4618n464M325K5844L4954M6735
16685B68521N2761N5366M0397J617j6701l0892m8739m9564l3782j5188q319Q252
16673B23729J8043K8582L1303K0379J1169n861l0038m0142l0669j9012r458p093
16661A90932j2k021m157j397p13l577m967l791o115K369P460M352N63N694l857
16646A80763j357Q51q282p180K499M838M05L691M363K970o34P51M640K550Q27
16631A91695L104l071k197j106n355l33K544L630j393L387Q538L651Q929N855
$$ plain form
16725 28146 31387 35850 35159 33509 31510 32781 30558 30450 37720 46882 47889 51376 54956 53957 55585
16710 55585 53354 54528 56530 58290 62377 68934 71584 77584 94317 110770 137683 168038 202019
16697 202019 227444 243826 245448 226653 199496 176745 162127 156663 160988 186832 221786 268521
16685 268521 321282 376648 417045 418662 401961 371069 322330 272766 238984 223796 215477 223729
16673 223729 241772 270354 301657 322036 333205 327344 297306 257164 226495 207483 198025 190932
16661 190932 190920 188899 184742 183345 182632 179055 174088 170297 164182 166551 174011 178363 178926 184620 180763
16646 180763 179406 180257 171975 164795 167294 172132 172537 176228 180591 183561 182927 183678 188318 190868 191695
16631 191695 194799 191728 189531 188425 183070 182737 185281 188911 187518 190905 199443 203094 212023 217878
16617B17878M972L284J602M0p23Q783J3278J1978J1610J0875P027J4335J5296
16604C20235J9732K7464L2872M0796N2729P3153P7924R0748R7635J04136J19908
16593A057332J34478J17111P6696K7428P565L1601P3941J18740J53233J78911
16583A977036K13117K86144L69400M33277M73206M96565N55487Q09405J384888
16574F998525K395168L857843N356226N898399M535267M76939m219621n300159
16566A9998587l771555k025567o24933O37069K157704M165396O390725Q030176
16558C4957602Q111686N264356N60719k830454o123973q133218o856451m534857
16550B0415410k619007j168606J29749J631435L355925M675849M632820K383378
$$ plain form
16617 217878 222850 226134 227736 227776 227053 235836 249114 261092 272702 283577 290604 304939 320235
16604 320235 339967 367431 400303 441099 493828 566981 644905 735653 833288 937424 1057332
16593 1057332 1191810 1308921 1385617 1413045 1420610 1452211 1526152 1644892 1798125 1977036
16583 1977036 2190153 2476297 2845697 3278974 3752180 4248745 4804232 5613637 6998525
16574 6998525 9393693 13251536 18607762 24506161 29041428 29518367 25298746 19998587
16566 19998587 16227032 14201465 13576532 14213601 16371305 20536701 26927426 34957602
16558 34957602 43069288 48333644 48894363 46063909 39939936 31806718 24950267 20415410
16550 20415410 17796403 16627797 16757546 18388981 21744906 26420755 31053575 33436953
16542C3436953k283741n820397n592589l948973k590085j739849j249800r48418
16534I263101p44131n86594m70185l81543l15091k68305k19928k00488j93531
16525E883305k01080k12488k41090k43153k16186j84766j68964j50098j27428
16516D138052j13568r8990r3445r7729j13929j23366j27259j18118j09843j01349
16506C040456r0991q6787p9082p6073p6154o4193o3887n9776n9536o0390o1637
16495B261950n6347m9080m7566m9607m6228m5872m3372l7701m1616l7135l3680
16484A773746l6647l1211l3708l0842k5140k7208k7187k5361k2065j8220k3137
16473A473020k0983j8867j7752j4054k008j43r278n759J061r65J823P540j196
$$ plain form
16542 33436953 31153212 25332815 19740226 15791253 13201168 11461319 10211519 9263101
16534 9263101 8518970 7932376 7462191 7080648 6765557 6497252 6277324 6076836 5883305
16525 5883305 5682225 5469737 5228647 4985494 4769308 4584542 4415578 4265480 4138052
16516 4138052 4024484 3925494 3832049 3734320 3620391 3497025 3369766 3251648 3141805 3040456
16506 3040456 2949465 2862678 2783596 2707523 2631369 2567176 2503289 2443513 2383977 2323587 2261950
16495 2261950 2205603 2156523 2108957 2059350 2013122 1967250 1923878 1886177 1844561 1807426 1773746
16484 1773746 1737099 1705888 1672180 1641338 1616198 1588990 1561803 1536442 1514377 1496157 1473020
16473 1473020 1452037 1433170 1415418 1401364 1399356 1399213 1389935 1384176 1385237 1384272 1386095 1393635 1392439
16460A392439j0312j2972j2378k0174j7499r003l040O52N576J3659J9443J7341
16448A363732J5785J9317J7764N837j0369l1455m2543m5152m7730l6099j8553
16437A190534p579N44J2467K4012K4627J8332K144m934m0155n6347n2223o1592
16425A049830n5368m4338k9917j9094q345L896P290j759o942j4980k5872m1986
16413H12415m2708k6145j9389k1859j8473j2945j1391j6891j7386j6851j4866
16402E93511k1206k1903j4859j6014j2106n637j985p095p472o258m504r165q945
16389D56362j1021q769r456p138j493o925p338l281k8j1771j6773n462j026n396
16375C60485q528r599q293o185O24J016q029j816q88r287l977p800j4352j0331
$$ plain form
16460 1392439 1382127 1369155 1356777 1336603 1319104 1310101 1307061 1307713 1313289 1326948 1346391 1363732
16448 1363732 1379517 1398834 1416598 1422435 1412066 1380611 1338068 1292916 1245186 1209087 1190534
16437 1190534 1182955 1183499 1195966 1219978 1244605 1262937 1265081 1260147 1219992 1163645 1111422 1049830
16425 1049830 994462 950124 920207 901113 892768 896664 903954 902195 895253 880273 854401 812415
16413 812415 769707 743562 724173 702314 683841 670896 659505 642614 625228 608377 593511
16402 593511 572305 550402 535543 519529 507423 501786 499801 492706 485234 478976 474472 465307 456362
16389 456362 445341 436572 427116 419978 418485 411560 404222 400941 400913 389142 372369 366907 365881 360485
16375 360485 351957 342358 334065 327880 328504 329520 321491 319675 318787 309500 305523 297723 283371 273040
16361B73040k566j124o720j0233m769l811R03m89k636o413j1742r954m227k389
16347B06870l004l027m036p237n795L277M601n601r138q284r06M63M585J231m721
16332A69278l726k245k797l287l111o92m96N36j504j855o17k568Q19J123m03m009
16316A44446o507q878J229Q597o019n771l858r7K5L877r56k685J166n345p038
16301A12186o160m846j948q13J80l915J9K704l993n303p717p549j427K39L760
16286G5417M147o86l136k196n971n068j940N31j874r221j221J410K148J472l97
16271E3415R29o87o51J381q26J539L05l865q86q20M159k25j466m467j771R20n68
16254D6416j417k123L732J144k483P90N348K90o776m942J976l660r77J696j334
$$ plain form
16361 273040 270474 269350 262630 252397 247628 243817 244720 244231 241595 235182 223440 213486 209259 206870
16347 206870 203866 200839 196803 189566 183771 187048 191649 186048 176910 168626 167720 168183 172768 173999 169278
16332 169278 165552 163307 160510 157223 154112 153420 152924 153460 151956 150101 149484 146916 147735 148858 148455 144446
16316 144446 137939 129061 130290 138887 132868 127097 123239 123142 123167 127044 126088 123403 124569 119224 112186
16301 112186 106026 101180 99232 98419 98599 94684 94703 97407 93414 88111 80394 72845 71418 71657 75417
16286 75417 79564 78878 75742 73546 67575 62507 60567 61098 59224 50003 48782 50192 52340 53812 53415
16271 53415 54344 53657 53006 54387 53561 55100 55405 51540 50654 49834 53993 53768 52302 47835 46064 46984 46416
16254 46416 44999 42876 46608 47752 45269 46059 51407 51697 44921 39979 41955 38295 37318 39014 37680
16239C7680j480k934J418j793p61K859j001j659p161m843m19K552j382J330O43
16224B3049j553k295r92L943K626p25K018L726r41k624j064l670j946m66K52n542
16208A3796N074K232k193l064L842O798o88m863o76J804L622n652o549j104O327
16193A8706l27k931r82M508N44n027j631M209p65l071j674J005k350M68l767n514
16177A401j054K055n673k794k418K307N471J090J304J640k5J812J808J318q77
16162G365m492n251j276o144k312J106r87L469P552J381r912j760M732N713j814
16147b630j110J000q64k87K318o85k140m787L637J730l8k199K752j031m467j763
16131a0564L911j783m942J039L308O566k448n38N353N45m519k625L549J977k692
$$ plain form
16239 37680 36200 33266 34684 32891 32130 34989 33988 32329 25168 20325 19906 22458 21076 22406 23049
16224 23049 21496 19201 18209 22152 24778 24053 26071 29797 28856 26232 25168 21498 19552 19086 19338 13796
16208 13796 18870 21102 18909 15845 19687 26485 25797 20934 20258 22062 25684 20032 13483 12379 18706
16193 18706 18379 15448 14466 18974 19518 14491 12860 17069 16304 13233 11559 12564 10214 10682 6915 1401
16177 1401 347 2402 -3271 -6065 -8483 -6176 -705 385 1689 3329 3304 5116 6924 8242 7365
16162 7365 2873 -2378 -3654 -9798 -12110 -11004 -11991 -8522 -970 411 -9501 -11261 -6529 -816 -2630
16147 -2630 -3740 -2740 -3604 -3891 -1573 -2258 -4398 -9185 -5548 -3818 -3856 -6055 -3303 -4334 -8801 -10564
16131 -10564 -6653 -8436 -13378 -12339 -9031 -2465 -4913 -5451 -98 447 -4072 -6697 -3148 -1171 -3863
16116c863k119N65j862j61p42J666L434n11R793j629q597j548j255l540k62m298
16100a4929K413L741J024L899k281j029l07k14j222r487o042j428N407L454p96
16085a7797M133l069J831M513Q7L61K150J72m409m810n88j655L116Q43K457k368
16069a5033o71j864l069L512k441m43M967P692J155J742K435N84j094P96K246
16054E14K706l19n605l163R11K732o540l099O018M216L762m622l373l2J172J269
16038c453m80m53n77K96k739n224K689P597j014k679l604L341P218K630l650j17
16022b19K94J560K210L841K086l855j290L540j480L938P435J0162J6852L3326
16008G8400L2085K5785Q102j2275k4856k4190j2719M54m73N192K0464K9645L4730
$$ plain form
16116 -3863 -5982 -5417 -7279 -7440 -8182 -6516 -3082 -3593 6200 4571 -4026 -5574 -6829 -10369 -10631 -14929
16100 -14929 -12516 -8775 -7751 -3852 -6133 -7162 -7469 -7683 -8905 -18392 -24434 -25862 -20455 -17001 -17797
16085 -17797 -13664 -16733 -14902 -10389 -10302 -9941 -7791 -7619 -12028 -16838 -17426 -19081 -15965 -15122 -12665 -15033
16069 -15033 -15704 -17568 -20637 -17125 -19566 -20009 -15042 -7350 -6195 -4453 -2018 -1434 -2528 -1732 514
16054 514 3220 2901 -2704 -5867 -4956 -2224 -8764 -11863 -5845 -1629 2133 -2489 -5862 -5894 -4722 -3453
16038 -3453 -3933 -4386 -4963 -4667 -7406 -12630 -9941 -2344 -3358 -6037 -9641 -6300 918 3548 -102 -219
16022 -219 75 1635 3845 7686 9772 5917 4627 8167 6687 10625 18060 28222 45074 78400
16008 78400 110485 136270 144372 132097 107241 83051 70332 70786 70313 75505 95969 125614 160344
15995A60344M4190L0772J4965j814k5989m0246l0392k2316j7252j1610l229M609
15983A02032R250K2231K3959J3273j519j9719k8642k3680k0300o966j0577j0731
15971D8611l426r21p69n002k470j043L025n473m170k439m721J339O33l351n662
15956A4161k008k083R02m951K522K030j382L648j337m168j055J650j194m187l741
15941a193N63N814J439P06q2p553k113l48m60J450M677j296j811r61K624N28k880
15924h96l05j172K955l90l136n703j037L225K37J039P294M09j621k504j911j34
15908c650K822j666K212J458j770k165l933n267J240L705m21K146N877j127q41
15893a380j648q17m739j180J578K706K231O80J065k325l83K588j008P35O565J585
$$ plain form
15995 160344 204534 235306 250271 248457 222468 182222 151830 129514 112262 100652 97423 102032
15983 102032 111282 133513 157472 170745 169226 149507 120865 97185 76885 69919 59342 48611
15971 48611 45185 44264 43495 38493 36023 34980 38005 32532 28362 25923 21202 22541 23174 19823 14161
15956 14161 12153 10070 10972 6021 8543 10573 9191 12839 11502 7334 6279 7929 6735 2548 -1193
15941 -1193 -630 5184 6623 7329 7247 -306 -2419 -2767 -3227 -1777 2900 1604 -207 -1168 1456 1984 -896
15924 -896 -1201 -2373 582 192 -2944 -8647 -9684 -6459 -6222 -5183 2111 2520 899 -1605 -3516 -3650
15908 -3650 -828 -2494 -282 1176 -594 -2759 -6692 -11959 -10719 -7014 -7435 -5289 588 -539 -1380
15893 -1380 -3028 -3845 -8584 -9764 -8186 -5480 -3249 -2569 -1504 -3829 -4212 -1624 -2632 -1897 4668 6253
15877F253k763n233n36L911K579n024l881j942M762K910l168r87j574q186k4L658
15861i245M889L426l84m589l072Q84N803J06l687p60N892j039m429l703O729O310
15845C131K277n708k228k010o300N44N628K407L190m008j803o56J862o49K743
15830a580l754K194K24j298M38Q45J624M36Q51k709l022j029l599k556L091L013
15814f831j502J736O575L084n752k064m457K35K995M829N505j532l523M10l955
15799d247j429l797J969O044j239m41R17q79l192Q34K845j259O853K455j076L524
15783G882j277l319k800q42k690l420J236K168j490K816O821j629o082N05L480
15768A359L016k556J356J316J324p9M214M962r02l470K186j983l696K813M298
$$ plain form
15877 6253 3490 -1743 -2279 1632 4211 -813 -4694 -6636 -1874 1036 -2132 -3119 -4693 -12879 -12903 -9245
15861 -9245 -4356 -930 -1314 -5903 -8975 -8091 -2288 -2182 -5869 -6629 -737 -1776 -6205 -9908 -3179 3131
15845 3131 5408 -300 -2528 -4538 -10838 -10294 -4666 -2259 931 -3077 -4880 -5536 -3674 -4323 -1580
15830 -1580 -5334 -3140 -2916 -4214 -3776 -2931 -1307 -871 -20 -2729 -5751 -6780 -10379 -12935 -9844 -6831
15814 -6831 -8333 -6597 -22 3062 -2690 -4754 -9211 -8976 -5981 -1152 4353 2821 -702 -292 -4247
15799 -4247 -5676 -9473 -7504 -1460 -2699 -3140 -2223 -3102 -6294 -5460 -2615 -3874 2979 5434 4358 7882
15783 7882 6605 3286 486 -356 -3046 -6466 -5230 -3062 -4552 -1736 5085 3456 -2626 -2121 1359
15768 1359 4375 1819 3175 4491 5815 5736 9950 14912 14010 10540 12726 10743 7047 9860 14158
15753A4158K407j669r56p359k058K765J833p08o35m676j178o92j875L4J816R03
15737B110L116k703m262l404K328K807l6k229K436l920j45M167j172k587m438
15722g932O96N616J619P3L370n68k536k125J241q7k059J580o23M345K061K83K601
15705G555L835L253n95k828l086l675M45k834m802R82L457O528j424k322J054
15690E543M288L87P4j947N41J135J616K091l765N44K037J69M59j913m692l030
15674C537M807P466O781m156p228K396K576L52n295o738m52l649j688N27J626
15659H62K784p33p00k293j985J562P202k175m721o44k87J559L79l152J715J625
15643I98L913M499K595L621Q38j555L386m381k693k46J411o973l260N493N320
$$ plain form
15753 14158 16565 14896 13940 6581 4523 7288 9121 8413 7778 3102 1924 1232 -643 -609 1207 2110
15737 2110 5226 2523 -1739 -5143 -2815 -8 -44 -2273 163 -3757 -3902 265 -907 -3494 -7932
15722 -7932 -7236 -1620 -1 72 3442 2874 338 -1787 -546 -633 -2692 -1112 -1735 2610 4671 4954 7555
15705 7555 11390 14643 14048 11220 8134 4459 4904 2070 -2732 -1750 1707 8235 6811 4489 5543
15690 5543 9831 10218 10292 8345 8886 10021 11637 13728 9963 10507 12544 12713 13172 11259 6567 3537
15674 3537 8344 15810 22591 18435 11207 13603 16179 16531 11236 4498 4046 397 -1291 -764 862
15659 862 3646 2913 2213 -80 -2065 -503 6699 4524 -197 -841 -1128 431 810 -2342 -627 998
15643 998 4911 9410 12005 15626 16464 14909 18295 13914 11221 10975 12386 5413 2153 7646 12966
15628A2966L298O28L122n059K278J689l899O74L720j96n567m252m304M385J206
15613A0689k280l366q584j585N413J284j684J13K158k426n824L040P615L645p88
15598G420R48l163O73M243J775l51r989K027L201M57K109L622N527k594l901j422
15582A0582n828K510J0659M651p86R62k463m520m601J24k347k403k909L545N963
15567A3139J18k070J144k365j552L915J070K539J889M531P350j336l605Q50j741
15552B3876J304M261R57L290R49k250J321l287K155M760M614L169n475k863l571
15537C3210k129K538k419K417M893p88P074R547R068Q324J7482K2326K7281L2317
15523A71141M0009N1956O1030O6716P0569O3765N9432M7275K2331m008k1321l9788
$$ plain form
15628 12966 16264 16892 20014 14955 17233 18922 15023 15697 19417 19221 13654 9402 5098 9483 10689
15613 10689 8409 5043 -3541 -5126 287 1571 -113 0 2158 -268 -6092 -3052 4563 8208 7420
15598 7420 8368 5205 5878 10121 11896 11545 1556 3583 6784 7241 9350 12972 18499 15905 12004 10582
15582 10582 4754 7264 17923 22574 21788 22750 20287 15767 11166 11290 8943 6540 3631 7176 13139
15567 13139 13257 11187 12331 9966 8414 12329 13399 15938 17827 22358 29708 28372 24767 25617 23876
15552 23876 25180 29441 30398 33688 34637 32387 33708 30421 32576 37336 41950 45119 39644 36781 33210
15537 33210 31081 33619 31200 33617 38510 37722 44796 54343 63411 71735 89217 111543 138824 171141
15523 171141 211150 263106 324136 390852 461421 525186 584618 631893 654224 650216 628895 589107
15511E89107n2603n7277n9690o0210n0892m8017l2839k6610k2156j4324j6452
15500A48037q427n740l735p469j1210j3502k43k599l251m112n097n063k510J523
15486G6602l445m455l167j131k998m661k269J650J484p63n729k665m416l789m01
15471C9847K519M894L151k337n120l048J364j248l995j097K251j143o50K759q77
15456C7270k511k815O16R88L196j515J68j576k872Q03L136K233m485l507L779
15441C2908M630J549J40j980l117l519K5J275N19R95l063l942m265k241J112L629
15425B4655K586j1j115K065O64J857n397m352k823O30J292j668k269J246j152
15410A6208j056N678p36L223K712p40k759q29k220j157L455M567n18J548J3n26
$$ plain form
15511 589107 536504 479227 419537 359327 308435 260418 227579 200969 178813 164489 148037
15500 148037 139610 133870 130135 122666 111456 97954 97711 95112 91861 87749 82652 77589 75079 76602
15486 76602 73157 68702 65535 64404 61406 56745 54476 56126 57610 56847 51118 48453 44037 40248 39847
15471 39847 42366 47260 50411 48074 42954 39906 41270 40022 36027 34930 37181 36038 35388 38147 37270
15456 37270 34759 31944 32560 33548 36744 35229 35397 33821 30949 31752 34888 37121 32636 29129 32908
15441 32908 37538 39087 39227 37247 34130 30611 30636 31911 32430 33425 30362 26420 22155 19914 21026 24655
15425 24655 27241 27230 26115 28180 28844 30701 25304 20952 18129 18759 20051 18383 16114 17360 16208
15410 16208 15152 20830 20094 23317 26029 25289 22530 21701 19481 18324 21779 26346 25828 27376 27389 26863
15394B6863K018J550m50k340O22n95k172l054o911l044k231L324K533l550k798
15379I765k023L406N62n130m653K66o999O049M633L104n92O337P039L173P28Q44
15363B6509M330R02l521K902M197k498l45l173J766p86J449M700k99k244J21L
15347C4013j235L072K645K27N277L916N035N365L771q01K388Q171J2721J1441
15333I6006O080L486R028P047L976M336o20m658k725n993q571r147j4284j0659
15319G3302o148m319o076j210m51o35L12N46m509Q18R15P19L198j104l916o902
15303D4540m320K369L585J268J634O37q13K002J091L789J487k767L75M051J337
15288F0265j653j832m167m087J20o843r783l649n87k947l035m744j86k230o17
$$ plain form
15394 26863 28881 30431 29981 27641 28263 27668 25496 22442 15531 12487 10256 13580 16113 12563 9765
15379 9765 7742 11148 11710 6580 1927 2193 -4806 1243 5876 8980 8388 14725 21764 24937 25665 26509
15363 26509 30839 31741 28220 31122 35319 32821 32476 29303 31069 30283 31732 36432 36133 33889 34010 34013
15347 34013 32778 35850 38495 38722 43999 47915 52950 58315 62086 61285 63673 71844 84565 96006
15333 96006 102086 105572 114600 121647 125623 129959 129339 124681 121956 115963 107392 98245 83961 73302
15319 73302 67154 62835 56759 55549 55098 54463 54775 55321 50812 51630 52545 53264 56462 55358 51442 44540
15303 44540 40220 42589 46174 47442 49076 49713 48900 50902 51993 55782 57269 54502 54877 58928 60265
15288 60265 58612 56780 52613 48526 48646 41803 32020 28371 27784 24837 21802 17058 16872 14642 14025
15273A4025K140p540p214k956o291l508r477M42J927j886L484J923k868K554P923
15258g322N554O037P592L103M879L924j008P579L990l187k513L077J856rM200
15243C7752M014k610K126N442P014N519J0843J0645J3048M916k569q948l367M600
15229H8425L747l597l519j791n24L154N164N876Q734R008J0150J6699J6240J2415
15215A70181J9459J9735K8140L2072M7676O6150P4445Q9154J04105J09782J00852
15204H61751Q5224O1686L8832L756k5627n0360o7440q0491q4506q0960p4123n8533
15192E29209m0823l1818k3456j5870q456r558r339p177r402r301j433q623l410
15179C50543O217J414m095R66j626J198K260P220k218J122r38k74M397Q764R906
$$ plain form
15273 14025 16165 8625 1411 -1545 -7836 -11344 -20821 -20379 -18452 -20338 -16854 -14931 -17799 -15245 -7322
15258 -7322 -1768 4269 11861 14964 19843 23767 22759 30338 34328 31141 28628 31705 33561 33552 37752
15243 37752 41766 39156 41282 46724 53738 59257 70100 80745 93793 98709 96140 87192 83825 88425
15229 88425 92172 88575 85056 83265 82741 85895 91059 96935 105669 114677 124827 141526 157766 170181
15215 170181 189640 209375 237515 269587 317263 383413 457858 547012 651117 760899 861751
15204 861751 946975 1008661 1047493 1051249 1025622 975262 907822 827331 742825 661865 587742 529209
15192 529209 488386 456568 433112 417242 408786 399228 389889 382712 373310 364009 362576 353953 350543
15179 350543 356760 358174 354079 355045 353419 354617 356877 364097 361879 363001 362063 361789 366186 374950 384856
15164C84856K203m437k592J863j13k134o663k997j559r75K160L40j27K243L916
15149C75984k701n682l6M882K196N289L640M656L654K542N786P43o76m643Q36
15134C96470K568j556n01Q6L406J600j925R644R665J7138K6434K6834K5588K6541
15120E41992L4385M4013L9588M4174M4804M7177N6212N0570M9873M8719N9713
15109A061220O8632P4865Q6579J02334J11829J25397J39989J67309K00240K34290
15099B372684K88018L61959M35549N29071O31634P42821Q60319R84072J154811
15090H360938J385615J726637K265120L110026M424090O267105Q513543J0789339
15082D6842413J2582680J3575244J3631197J2829402J1101110Q333613M503905
$$ plain form
15164 384856 387059 382622 380030 381893 381780 379646 372983 369986 368427 367452 369612 369952 369825 372068 375984
15149 375984 373283 367601 367565 372447 374643 379932 383572 388228 391882 394424 400210 400953 400277 395634 396470
15134 396470 399038 397482 396981 397067 400473 402073 400148 409792 419457 436595 463029 489863 515451 541992
15120 541992 576377 620390 659978 704152 748956 796133 852345 902915 952788 1001507 1061220
15109 1061220 1129852 1204717 1291296 1393630 1505459 1630856 1770845 1938154 2138394 2372684
15099 2372684 2660702 3022661 3458210 3987281 4618915 5361736 6222055 7206127 8360938
15090 8360938 9746553 11473190 13738310 16848336 21272426 27539531 36053074 46842413
15082 46842413 59425093 73000337 86631534 99460936 110562046 118895659 123399564
15075A23399564J3295m283992p775889j0065431j1441236j1988959j1774374j0727012
15067E5355966q978793o940982n097249l737558k834964k261934j879858j613469
15059B2011159j424791j278156j155451j036681r23830q32104p40589o61144n95580
15050A3362833n44946m99195m66662m36341m12796l94688l81264l66375l47060
15041I513506l30012l13657k96498k82939k65142k42085k28722k20001k07000
15032G127450j93505j84831j74745j68715j64411j53603j56169j54854j47198
15023E629419j50474j47726j46533j37200j34326j30622j25973j17718j12462
15014D426385j12002j10079j03132r6157q9355q6921q1503p6929p1892o6005o4755
$$ plain form
15075 123399564 123412859 119128867 111352978 101287547 89846311 77857352 66082978 55355966
15067 55355966 46377173 39436191 34338942 30601384 27766420 25504486 23624628 22011159
15059 22011159 20586368 19308212 18152761 17116080 16192250 15360146 14619557 13958413 13362833
15050 13362833 12817887 12318692 11852030 11415689 11002893 10608205 10226941 9860566 9513506
15041 9513506 9183494 8869837 8573339 8290400 8025258 7783173 7554451 7334450 7127450
15032 7127450 6933945 6749114 6574369 6405654 6241243 6087640 5931471 5776617 5629419
15023 5629419 5478945 5331219 5184686 5047486 4913160 4782538 4656565 4538847 4426385
15014 4426385 4314383 4204304 4101172 4005015 3915660 3828739 3747236 3670307 3598415 3532410 3467655
15003C467655o2581o4863o3182o1073n3155n5552n5784m8514m3167m4981m5949
14992B868854m1672l3760l0113k4908k6560k1894j8949j3037o755p706o124n353
14980B632023n696M381P652J2450J8490K8806L6450L8232M5607M9747L8579L2315
14968B939036K1681K096q711l4086n2245n9152o9198o2882o0867o0424l6350j3396
14956B505502M454K0042L0385L3492L3062K4873J2343j3064m0051o0959p8623
14945B471456r3449j05066j05227j04139r5145q4227p2875o5835n5728m9074m1652
14934A599039m0649l9817l0403k9751k1989k0813k9070l3445l1513l3653l5931
14923A252005l3786l6821l1895l0272k1509k3828k1925k1180j8084j5970j7141
$$ plain form
15003 3467655 3405074 3340211 3277029 3215956 3162801 3107249 3051465 3002951 2959784 2914803 2868854
14992 2868854 2827182 2793422 2763309 2738401 2711841 2689947 2670998 2657961 2651206 2643500 2637376 2632023
14980 2632023 2626327 2630708 2638360 2650810 2669300 2698106 2734556 2772788 2818395 2868142 2906721 2939036
14968 2939036 2960717 2962813 2954102 2920016 2867771 2808619 2739421 2676539 2615672 2555248 2518898 2505502
14956 2505502 2509956 2529998 2560383 2593875 2626937 2651810 2664153 2651089 2611038 2550079 2471456
14945 2471456 2378007 2272941 2167714 2063575 1968430 1884203 1811328 1745493 1689765 1640691 1599039
14934 1599039 1558390 1518573 1488170 1458419 1436430 1415617 1386547 1353102 1321589 1287936 1252005
14923 1252005 1218219 1181398 1149503 1119231 1097722 1073894 1051969 1030789 1012705 996735 979594
14912I79594j6706j0227j3948j4512q820j7595j9703j3899j5308j1636j5010j5675
14900H06555j1410j4067j6531j1649k625o907j998m249m550j967n216p536j4668
14887G03182j4854j5208j5175j1789j0759j4049j6733j9636j7554j6811j0671
14876E39943j2802r338j1203j5073r806j5404j1144r858p790j2546j4433j2806
14864C97740q389o442p011n067p279l128l485m880L25l478K739M585J65J425P514
14849C65334N702M601J0724N936J1830J0667N935J59o959q179j1135j2243r328
14836C73044j2121j1821j3280p024q954o678o426n316p191o736p416r191q810
14823B62080p441n376p369j204m446j3099o773m182M09n047q308o770o40k92j306
$$ plain form
14912 979594 962888 952661 938713 924201 915381 897786 878083 864184 848876 837240 822230 806555
14900 806555 795145 781078 764547 752898 750273 743366 741368 737119 732569 730602 725386 717850 703182
14887 703182 688328 673120 657945 646156 635397 621348 604615 584979 567425 550614 539943
14876 539943 527141 517803 506600 491527 481721 466317 455173 445315 437525 424979 410546 397740
14864 397740 389351 382909 375898 370831 363552 360424 356939 352059 352384 348906 351645 356230 356395 357820 365334
14849 365334 371036 375637 386361 392297 404127 414794 420729 420888 413929 405750 394615 382372 373044
14836 373044 360923 349102 335822 328798 319844 313166 306740 301424 294233 287497 280081 270890 262080
14823 262080 254639 249263 241894 240690 236244 223145 216372 212190 212599 207552 199244 192474 191834 191542 190236
14808A90236o19J568n87m095r993j0228l225K03j0043q349r2J278j203o292j0034
14793A28525L228k35k472M488k053j789M57j889n223m55n05Q057L098o55j332
14778A31245l485q233o965j459K347j439Q40J247J963p49l096o189k259l856Q24
14763A00736J013o99m091n317l986k515k044J426J56n384l857Q10L618k12J330
14748H0984J846j207k352k821P79n05l633N452o25m24k263l672n763j114n583
14733E9099n470J383m029k349M869Q084O175J633q78m355p470k243k173n490N155
14718E1941J788n253j659J673L754l801o714l909J438j645l668p996K83R41N835
14703C3008O279J046R95k849p128K625L581m9n225k453K932J214j677k057k604
$$ plain form
14808 190236 189617 191185 190598 186503 176510 166282 163057 163260 153217 144868 144776 146054 144851 138559 128525
14793 128525 131753 131518 129046 133534 131481 129692 130149 128260 123037 122582 122077 130134 133232 132577 131245
14778 131245 127760 119527 112562 111103 113450 112011 112851 114098 116061 115312 112216 106027 103768 99912 100736
14763 100736 101749 101050 96959 91642 87656 85141 83097 84523 84679 79295 75438 76248 79866 79654 80984
14748 80984 82830 81623 79271 76450 77229 76724 73091 78543 77918 77494 75231 71559 65796 64682 59099
14733 59099 53629 55012 50983 48634 53503 61587 67762 69395 68517 64162 56692 54449 52276 46786 51941
14718 51941 53729 48476 46817 48490 52244 48443 41729 37820 39258 37613 33945 25949 26232 27173 33008
14703 33008 39287 40333 41328 38479 31351 33976 37557 37508 32283 29830 32762 33976 32299 30242 27638
14688B7638n15l022m870p13M452K673Q36j659j543o42k808R34j03M80L530J905
14672B6573q29J600J246j383j428j366j686j280k632q28k983P250j136k64J633
14657B2487o94l957k130K498Q235K293k267P244O862R550N338O244J1938R755
14643H3396J1700J0354J7643L2036L9409N1867O4119P2993O6961O3798O0149M4060
14631F18485K5950R941j7859l9315n1948o0287o3930n9350n7091m9082l3989k4652
14619A96873k0304j9876j2525j4142j3659q686q910n506m529r269m657o110m461
14606F4239l322p607l650k288n581j576J292j07J229R90k563N05q76p69J158n658
14590C5416k794j271J499j410M050j139l414K727j571N85R32k928j309L851r2
$$ plain form
14688 27638 27123 24101 19231 18518 22970 25643 26479 24820 23277 22635 19827 20761 20658 21138 24668 26573
14672 26573 25744 27344 28590 27207 25779 24413 22727 21447 18815 17987 15004 22254 21118 20854 22487
14657 22487 21793 17836 15706 18204 26439 28732 26465 33709 40571 50121 55459 61703 73641 83396
14643 83396 95096 105450 123093 155129 194538 246405 310524 383517 450478 514276 574425 618485
14631 618485 644435 654376 636517 597202 545254 484967 421037 361687 304596 255514 221525 196873
14619 196873 176569 156693 144168 130026 116367 107681 98771 93265 88736 79467 74810 68700 64239
14606 64239 60917 53310 49660 47372 41791 40215 41507 41400 42629 43619 41056 41561 40685 39916 41074 35416
14590 35416 32622 31351 32850 31440 35490 34351 30937 33664 32093 32678 33610 30682 29373 33224 33132
14575C3132n826j0386q398J006N199N864L85l989n060m661m80K657m12K114N014
14560A6159N927l598l612J676n392o161j595n014L673L542n93r38K73J535K478
14545H360M703L3k348L8M287L249n430n094r37J638L681M161j412%o494l245J958
14528G148j375K382K03J439K512M153n05k780j076l066k260n207k416N549M878
14513I579L868K86j495o598m516K174J551M771J353O76n11p53n882n128K992Q625
14497A0992j372p526j445k297l78Q066j908k348Q81K007j963j337J669l600l90
14482i49L934L074N16k099J172j0m254m305J063Q882m309K254J221n593K081K370
14466E048o19m814l578R76K605L274j700P38M534j833l529j484k839N353O4j148
$$ plain form
14575 33132 27306 16920 8522 9528 14727 20591 20976 16987 11927 7266 6786 9443 9031 11145 16159
14560 16159 22086 18488 14876 16552 11160 4999 3404 -1610 2063 5605 5012 4074 4347 5882 8360
14545 8360 13063 13096 10748 10786 15073 18322 12892 7798 6861 8499 12180 16341 14929 14929 8435 5190 7148
14528 7148 5773 8155 8358 9797 12309 16462 15957 13177 12101 9035 6775 1568 -848 4701 9579
14513 9579 13447 13733 12238 5640 1124 3298 4849 9620 10973 11649 11138 10385 4503 -625 2367 10992
14497 10992 9620 2094 649 -1648 -2026 6040 4132 1784 2665 4672 2709 1372 3041 -559 -949
14482 -949 2985 6059 6575 4476 5648 5638 1384 -2921 -1858 7024 2715 4969 6190 597 2678 5048
14466 5048 4429 -385 -3963 -2987 -382 2892 1192 1930 6464 4631 1102 -382 -3221 2132 2196 1048
14450A048k0o282R84j289K967j821k115J405j104J32j506l953K270l21N28k387
14434a1464o45K956m472k319K747m60j28L694k634j670L220R31N981M362K241
14419B340k114l401m933K274L910n6R42n066O14k857o094l982L730O188o38m061
14403a3204j679n166M065O434K826j237M116o19n976k067L297N129p73m209j668
14388a0731j937k570J396L474l497n08K736J274L145N082J421k882j985m314l630
14373a3526j871l89J652N814N385K077k692l758j226k024j785Q77O690L170k833
14358d439j297J57K312L877k771m787M08L666J255M588k149o712J774J152J508
14343a458O50J409j5J94n290k341N73J980J767n93o54N650L224K816O834J825
$$ plain form
14450 1048 1028 -5254 -4270 -5559 -2592 -4413 -6528 -5123 -6227 -6095 -7601 -11554 -9284 -9605 -9077 -11464
14434 -11464 -12109 -9153 -13625 -15944 -13197 -13657 -13785 -10091 -12725 -14395 -11175 -10244 -4263 99 2340
14419 2340 226 -3175 -8108 -5834 -1924 -1980 -1038 -6104 -5490 -8347 -14441 -18423 -14693 -8505 -9143 -13204
14403 -13204 -14883 -20049 -15984 -9550 -6724 -7961 -3845 -4464 -10440 -12507 -9210 -4081 -4854 -9063 -10731
14388 -10731 -12668 -15238 -13842 -10368 -13865 -14373 -11637 -10363 -7218 -2136 -715 -3597 -5582 -9896 -13526
14373 -13526 -15397 -15786 -14134 -8320 -2935 -858 -3550 -7308 -8534 -10558 -12343 -11466 -4776 -1606 -4439
14358 -4439 -5736 -5579 -3267 610 -2161 -6948 -6540 -2874 -1619 2969 820 -5892 -4118 -2966 -1458
14343 -1458 -808 601 586 780 -4510 -6851 -6278 -4298 -2531 -3124 -3778 1872 5096 7912 14746 16571
14327A6571J641N170P299R185P587P475R281J4863Q587M463O439M069M81K963
14313A06074J689l082k499l623rq03j1023l785r960j1851j2611n333p784n432
14299B9968j835o175m601j724J274O390j391o090n217m758J366J704J041J175
14285A1127k055J045l522K148L359P45n660k525o73n473n052j269N711P806n30
14270E182n34j074k430o89p17m215n585J903K124J071K627K11J73l213R83j647
14254e830l668n21n25j069N873N941J096n293l631l9j621L872Q954J671j351n407
14238a548l726j216L050j06r6k424M54M83m56k85Q8L05N020K084J280L063k760
14221C210j819k515k803L314M051j081k482K667K037k418k808O540Q85j571m286
$$ plain form
14327 16571 18212 23382 30681 39866 47453 54928 64209 79072 87659 92122 98561 102630 103111 106074
14313 106074 107763 104681 102182 98559 98550 97747 86724 82939 72979 61128 48517 43184 35400 29968
14299 29968 28133 21958 17357 15633 16907 23297 21906 15816 10599 5841 7207 8911 9952 11127
14285 11127 9072 10117 6595 8743 12102 12847 7187 4662 3989 -1484 -6536 -7805 -2094 5712 5182
14270 5182 4648 3574 1144 455 -262 -4477 -10062 -8159 -6035 -4964 -2337 -2126 -1953 -5166 -4183 -5830
14254 -5830 -9498 -10019 -10544 -11613 -5740 201 1297 -3996 -7627 -7666 -9287 -5415 3539 5210 3859 -1548
14238 -1548 -5274 -6490 -3440 -3546 -3642 -6066 -5612 -5129 -5585 -5870 -5782 -5477 -457 1627 2907 5970 3210
14221 3210 1391 -1124 -3927 -613 3438 2357 -125 2542 4579 2161 -647 5893 6778 5207 921
14206I21k746O35j983O308P004n289m468k688K494M173j069k476j178K14j987
14191b135M78R21l145m437J661j453o621k797P536L147k612J098M209L511k933
14176c572r965n239M045N936j345Q00P45J288K113L178j859j872L382m86K799
14161e2l707m265j858M156m62N74J843K98j783j250k045L11K295K953J046K324
14145C78J486j474l95j160n58J50j030k545m515k001j470l950J006N024J586L240
14129f228L106k114J608Q48m266P1j557N684N253l258r1j917k633k710k357Q65
14113i696L096K799J404m046M690l945O1N088k438j939J932l2k026NR32k317n564
14096a1996j553K439L063M015K43k97p74j854j741K81L509l069n559k345L840
$$ plain form
14206 921 -1825 -1190 -3173 3135 10139 4850 382 -2306 188 4361 3292 816 -362 -148 -2135
14191 -2135 -1657 -736 -3881 -8318 -6657 -8110 -14731 -17528 -9992 -6845 -9457 -8359 -4150 -639 -3572
14176 -3572 -13537 -18776 -14731 -8795 -10140 -9340 -8595 -7307 -5194 -2016 -3875 -5747 -2365 -2851 -52
14161 -52 -3759 -8024 -9882 -5726 -6188 -5614 -3771 -3473 -5256 -6506 -8551 -8240 -5945 -2992 -1946 378
14145 378 1864 390 -5 -1165 -1723 -1573 -2603 -5148 -9663 -11664 -13134 -17084 -16078 -11054 -9468 -6228
14129 -6228 -3122 -5236 -3628 -2780 -7046 -6975 -8532 -2848 2405 -853 -944 -2861 -5494 -8204 -10561 -9696
14113 -9696 -6600 -3801 -2397 -6443 -1753 -5698 -5637 -549 -2987 -4926 -2994 -3026 -5052 -5047 -4115 -6432 -11996
14096 -11996 -13549 -11110 -8047 -4032 -3789 -4086 -4860 -6714 -8455 -8174 -4665 -7734 -13293 -15638 -11798
14081a1798k63K251j15K703q30o67j554j573O180N598K41N742o83j104l663l953
14065c488o22L324j483n098K917N930L89l145m73K706M610J862N154O889l632
14050A5840N683O645O563J4340J6553K3214L6492M3582M6891N8848N3989N1443
14038C80083N3925M9202L3269J2514l254k9546l8651n0245m8342m8683m8743m3896
14026B17633l6939k7987k1080j5584j1360j1766p738j1434p452l998k546p472
14014E2277p869L25M841J505m394j406M87n303j0945k366K123J370m460k349l373
13999B0463L760jk067M370L694N38k797l418m447k455M27J130J996Q19k938l308
13983A5766L38N30K270K340j709K03m107o436m195L938o84p39L739J943N78o450
$$ plain form
14081 -11798 -12061 -9810 -9925 -7222 -8052 -8719 -10273 -11846 -5666 -68 173 5915 5232 4128 465 -3488
14065 -3488 -4110 -786 -2269 -7367 -4450 1480 1869 -1276 -1749 957 5567 7429 12583 19472 15840
14050 15840 21523 28168 34731 49071 65624 88838 125330 168912 215803 274651 328640 380083
14038 380083 434008 483210 516479 528993 525739 496193 457542 407297 358955 310272 261529 217633
14026 217633 180694 152707 131627 116043 104683 92917 85179 73745 66293 62295 59749 52277
14014 52277 44408 44733 49574 51079 46685 45279 45766 40463 29518 27152 29275 30645 26185 23836 20463
13999 20463 24223 24222 22155 26525 30219 30757 27960 24542 20095 17640 18067 19197 21193 22012 19074 15766
13983 15766 16104 16634 18904 21244 19535 19738 15631 9195 5000 8938 8254 7515 11254 13197 13775 7325
13967G325M517Q161J956J58j462J536m420m397o195J823L286L36l899j113Q23
13952H435N87j871j580K240L304L42k261K424o256R29O926M715L81Q17n882k670
13936A0580n631j244M61j036K344K31n659L747K310Q4l56P92j82K84L812j809
13920H728n750k249o801M24M489M264L963L797N719O97k32p411j317N150o941
13905F530J097N983l809q292l117r84K240j716m33p42q33l090M29k604J477J421
13889f443Q86k380k611m228Q05M214J400j012O042J975j482m259k15J4K296l921
13873h919j058K255K386K069o10J778O38k24k880J486J874N427J461L591L647
13858A2921K522j824m42k726K316O135K219j175q780n656K34m724J757k824m820
$$ plain form
13967 7325 11842 20003 21959 22117 20655 22191 17771 13374 7179 9002 12288 12624 8725 7612 8435
13952 8435 9022 7151 5571 7811 11115 11457 9196 11620 5364 6293 13219 17934 18315 19132 13250 10580
13936 10580 4949 3705 4166 3130 5474 5705 46 3793 6103 6187 5831 6623 6441 6725 10537 8728
13920 8728 2978 729 -6072 -5648 -1159 3105 7068 10865 16584 17281 17049 9638 8321 13471 6530
13905 6530 7627 13610 9801 1509 -1608 -2592 -352 -2068 -2501 -3243 -4076 -7166 -6737 -9341 -7864 -6443
13889 -6443 -5557 -7937 -10548 -14776 -13971 -9757 -8357 -9369 -3327 -1352 -2834 -7093 -7308 -7294 -4998 -8919
13873 -8919 -9977 -7722 -5336 -3267 -3877 -2099 -1461 -1685 -4565 -3079 -1205 4222 5683 9274 12921
13858 12921 15443 13619 13177 10451 12767 18902 21121 19946 11166 5510 5744 1020 2777 -47 -4867
13843d867l731L98N614M821M264l155l010J283J116J70L39m134k307j566Q13p64
13827d716Q781K542n93k319qJ412K646R963O835N120K365M144J0803P532K152
13812E6659p341o587Q61o93l712m163o836o309o767j138J823J130l548m95K921
13797A5805o84l665m740n824q00K698K148j201l135K271M037J761N96q65J30j223
13781G309L615J933K680j711J145j300K245L538K610N02k8J745l576m72Q18l742
13765A7311J302K343o38k240p10k809k634J12k927l525L472N21k86J766k985o935
13749A138n140j879L222O1K454j701J372M26M221j162k768J578k373p139l177
13734a0867p63k882M759Q170p89j669k52K825j550K866N111K439l874j604N318
$$ plain form
13843 -4867 -8598 -8200 -2586 2235 6499 3344 334 1617 2733 2903 3242 -892 -3199 -4765 -3952 -4716
13827 -4716 4065 6607 6014 3695 3687 5099 7745 17708 24543 29663 32028 36172 46975 54507 56659
13812 56659 49318 42731 43592 42899 39187 35024 28188 21879 15112 13974 15797 16927 13379 12884 15805
13797 15805 15121 11456 6716 892 92 2790 4938 3737 602 2873 6910 8671 9267 8402 8532 7309
13781 7309 10924 12857 15537 13826 14971 13671 15916 19454 22064 22566 22538 24283 20707 20235 21053 17311
13765 17311 18613 20956 20318 18078 17368 14559 11925 12037 9110 5585 9057 9578 9292 11058 8073 1138
13749 1138 -4002 -5881 -2659 -2598 -144 -1845 -473 -47 4174 3012 244 1822 -551 -7690 -10867
13734 -10867 -11630 -14512 -9753 -1583 -2372 -4041 -4293 -1468 -3018 -152 4959 7398 3524 1920 7238
13719G238j643m169o278q5m04k918l212J112P151j282l937p23K418l84k647m18
13703a0181M588Q81M10j466n308j110k965L684O122M247o61j943k295K87J035
13688d675j45K363k872n00J819k767m208m069K638P512L493q6M588j689J250K742
13672E394J462p531o784p13j847J966J011o775l237K529O440j515k43O43j656
13657a0856j586K91Q514N705n49k360o024k323O052j439j229l43Q71j46K634k040
13641d828j010J924j504k813J168l40O99J303j899o43J433O202o478n999j67J16
13625a2836O677p5k734k790K8J559M580L460p51k87k560j661L695K057J94l735
13609e179o687Q01P553O649j584j213q23l56K605L15j332r12M44m896m776l88
$$ plain form
13719 7238 5595 1426 -4852 -4937 -5341 -8259 -11471 -10359 -3208 -4490 -8427 -9150 -6732 -7116 -9763 -10181
13703 -10181 -5593 -4712 -4302 -5768 -11076 -12186 -15151 -11467 -5345 -1098 -1759 -3702 -5997 -5710 -4675
13688 -4675 -4820 -2457 -5329 -5829 -4010 -6777 -10985 -15054 -12416 -4904 -1411 -1497 3091 1402 2652 5394
13672 5394 6856 -675 -7459 -8172 -10019 -8053 -7042 -13817 -17054 -14525 -8085 -9600 -9843 -9200 -10856
13657 -10856 -12442 -12151 -3637 2068 1519 -841 -6865 -9188 -3136 -4575 -5804 -6147 -5276 -5422 -2788 -4828
13641 -4828 -5838 -3914 -5418 -8231 -7063 -7403 -6704 -5401 -7300 -7943 -6510 -308 -6786 -12785 -12952 -12836
13625 -12836 -6159 -6234 -8968 -11758 -11730 -10171 -5591 -2131 -2882 -3169 -5729 -7390 -3695 -1638 -1444 -5179
13609 -5179 -11866 -11065 -3512 3137 1553 340 -483 -839 1766 2081 749 -163 281 -4615 -9391 -9779
13593i779k83j298L171N901M22l507O67n381m593K488O697K821r19j858Q01p3
13577d723K221J41R1K73m240m335m18J331j761M8Q71K952K1k389L462n16N361
13560a610k537m659k877l999K433J215k107K237K447K378l584m113L394J054O886
13545c442J796j589p77K728J26K013k115j294m327K4K47M810M344j638k784l63
13529b241M038k442k533k831m170L943J192k101l076L027K852n706Q60K644q57
13514g401k696j982m105J532L743l452j380N843M552J225j874j399M133L387J030
13499A156m205m16K670k007M13j208K736P016L230O61j075k356M023K048L179
13484A5865J082m132j269J526j953k765r406k71J974J313J044k731n086m603j749
$$ plain form
13593 -9779 -10062 -11360 -8189 -2288 -1866 -5373 -4706 -10087 -14680 -12192 -5495 -2674 -3593 -5451 -4650 -4723
13577 -4723 -2502 -2361 -2270 -1997 -6237 -10572 -10990 -9659 -11420 -11372 -10501 -7549 -7528 -9917 -6455 -6971 -1610
13560 -1610 -4147 -8806 -11683 -15682 -13249 -12034 -14141 -11904 -9457 -7079 -10663 -14776 -11382 -10328 -3442
13545 -3442 -1646 -3235 -4012 -1284 -1158 855 -1260 -2554 -6881 -6857 -6610 -1800 2544 906 -1878 -2241
13529 -2241 1797 -645 -3178 -6009 -10179 -6236 -5044 -7145 -10221 -7194 -4342 -10048 -9188 -6544 -7401
13514 -7401 -10097 -12079 -16184 -14652 -10909 -14361 -15741 -9898 -5346 -4121 -5995 -7394 -3261 126 1156
13499 1156 -3049 -3465 -795 -2802 -2389 -3597 -861 6155 9385 10046 8971 6615 10638 12686 15865
13484 15865 16947 12815 11546 13072 11119 8354 -1052 -1323 651 1964 3008 277 -4809 -9412 -11161
13469a1161k521K469O144L38l94l911M18P444k301J658J165j769n419j230k183
13454a1253M316R412j782m888K70m944j663l733JL245N551O164M865K341m84n53
13438F865J492j847m585m183j847n83N7R44K751K231K780l661O82R22n40J725
13422C203k367N17N937p04l4l99k63j698n12n43k777K773K78k608l656L926K418
13405C491j092K200L451K12J804K582q79k434J900J716J024k025o888r313l219
13390g470N111J688P06L276L210J17K62o70J307M398J629j2k431j108J870J450
13374A3333Q34j087m651N147K488n299p60j3l030J567O88K375K108J289L226J490
13358A9705r57q37l152l41L154n586l422k809J962K828L292J487l186J107K14
$$ plain form
13469 -11161 -13682 -11213 -5069 -4731 -5125 -9036 -8618 -1174 -3475 -1817 -652 -2421 -7840 -9070 -11253
13454 -11253 -6937 2475 693 -4195 -3925 -8869 -10532 -14265 -14264 -11019 -5468 696 5561 7902 7418 6865
13438 6865 8357 6510 1925 -2258 -4105 -4688 -4631 -3687 -936 1295 4075 414 1096 2018 1478 3203
13422 3203 836 1353 7290 6586 6552 6153 5890 4192 3680 3137 360 3133 3411 803 -2853 1073 3491
13405 3491 2399 4599 8050 8262 10066 12648 11769 9335 11235 12951 13975 11950 5062 -4251 -7470
13390 -7470 -2359 -671 35 3311 6521 6638 6900 6230 7537 11935 13564 13552 11121 10013 11883 13333
13374 13333 14167 13080 8429 13576 16064 10765 10005 9992 6962 8529 9217 11592 13700 14989 18215 19705
13358 19705 18748 17911 14759 14418 17572 11986 8564 5755 7717 10545 13837 15324 12138 13245 13459
13343A3459l224m574m325J564R13N00M565N259q813j191J191K80m46L15l423n779
13327c729m434K411P822L532K250J806L057O090J940l05j230n224j804K693N512
13312B0387k515L040L822l054J385m999j916o76N37j373O5j298o85K407J642m069
13296A2700l138J567L9Q13j996q73L107J675q49m69N554M881n76l383j621Q4R51
13279A8466N98k901k818K28j644K299P24j401J573R74n137l05l277o56O532J0365
13263B3620M666m92r22m849k543N779K6m722m684O18N215P45o547k600l90O33
13247A3553M9K312J656J193L890J561j936J375k813j404o77N241M836K255L245
13232C4336r26m011R40j490r42k792p67r46M760O79q815j367N281J392M645Q95
$$ plain form
13343 13459 10235 5661 1336 2900 3813 4313 8878 14137 5324 4133 5324 5604 5158 5473 2050 -3729
13327 -3729 -8163 -5752 2070 5602 7852 9658 12715 18805 20745 20440 19210 13986 12182 14875 20387
13312 20387 17872 20912 24734 21680 23065 18066 16150 15474 16011 14638 14703 13405 12720 15127 16769 12700
13296 12700 9562 11129 11168 11981 9985 9112 12219 13894 13045 12576 18130 23011 22435 19052 17431 17515 18466
13279 18466 19064 16163 13345 13573 11929 14228 14952 13551 15124 16098 10961 10656 7379 6723 13255 23620
13263 23620 28286 27794 26872 22023 19480 25259 25285 20563 15879 16497 21712 22457 15910 13310 12920 13553
13247 13553 13602 15914 17570 18763 22653 24214 22278 23653 20840 19436 18759 24000 28836 31091 34336
13232 34336 33410 29399 30339 28849 27907 25115 24348 23402 28162 28841 20026 18659 23940 25332 29977 30872
13216C0872n007l653O002J3632J0221O069P124R414N021P058J1705J5565P375
13203A21398J9407K8539K7219M0026N6874Q5859J36344K05934K99135L46494K87802
13192A655031O6596k57215l65321k89490j89056j25283q5934n6950m2856l4034
13182B75488k2041j3174j2208j0881j3611q660r993j2895o030l797n882m938n242
13169A46136n712j0915j8345p573m613k366j111o19n212p6L744K598LL657M163
13154A03759J3673J9478J3771R333K301j1670j9582j1887j2278r177o641l734
13142H7346n946l172m376p511j220l514n321R46r28l134j920K970K61l066n86
13127E0829l592m178M977n37K069l541l531o01K911J205L391L526L124O565M976
$$ plain form
13216 30872 25865 22212 28214 41846 52067 58136 65260 74674 79695 86753 98458 114023 121398
13203 121398 140805 169344 196563 236589 293463 379322 515666 721600 1020735 1367229 1655031
13192 1655031 1721627 1464412 1099091 809601 620545 495262 409328 352378 309522 275488
13182 275488 253447 240273 228065 217184 203573 194913 184920 172025 165995 162198 156316 151378 146136
13169 146136 140424 129509 111164 103591 98978 96612 95501 94882 89670 89594 93338 95936 95939 99596 103759
13154 103759 117432 136910 150681 160014 162315 150645 131063 119176 106898 97721 91080 87346
13142 87346 81400 78228 73852 66341 65121 61607 56286 57232 56304 53170 51250 54220 54481 51415 50829
13127 50829 47237 43059 48036 47499 49568 46027 42496 41895 44806 46011 49402 52928 56052 62617 67593
13112F7593O504J6529J7424K4399M6971N9589M6463K2802j0622m3989n2258m0912
13100A60493l0947j7053o449o653j2773q976j562j004m074m032m556j498k824
13087E8092l902Q97P19m95L835P357j29k209L723K831j10k716l389K4L509m532
13071F3505p29L085N93L447O857J6143K0066K5103L9012N4783M8240L1139k955
13058C08289m5309n1606n2395l6815j6305r422j1750q795k291K305K537l14n377
13045G2752q972j0068j1075n536m413o974q306j974Q958J1211r59p545j011j579
13031B4509j820m918K959j202j867M259O90O082K314N303J1868J4405J3580J2274
13017H8436J8799J6245J1676M145p504j6471j6873r686j828q201r023o615r927
$$ plain form
13112 67593 74097 90626 108050 132449 179420 239009 285472 308274 297652 253663 201405 160493
13100 160493 129546 112493 106044 99391 86618 77642 76080 75076 71002 66970 62414 60916 58092
13087 58092 54190 55087 55806 55311 59146 66503 66374 64165 67888 70719 70609 67893 64504 64528 68037 63505
13071 63505 62776 65861 66454 69901 76758 92901 112967 138070 177082 231865 280105 311244 308289
13058 308289 262980 211374 158979 122164 105859 96437 84687 75892 73601 75906 78443 78129 72752
13045 72752 63780 53712 42637 37101 32688 25714 17408 15434 24392 35603 34644 27099 26088 24509
13031 24509 22689 17771 20730 19528 17661 21920 22610 28692 31006 36309 48177 62582 76162 88436
13017 88436 107235 123480 135156 139301 131797 115326 98453 88767 86939 78738 69715 63100 53173
13004E3173j0345p38O951P498Q442R921R509m061p184m220M389O746J3584J5691
12990A09356J2655L896n490K5429N2422M3257R417j1953r680m395j7519k9374
12978A78021k4575k5632k2941j5994j0203m727J809P510J37j1926o053P50R97
12965F7173l01M413K097J813k162k559j4002j147P254J1888P385P799M293L349
12951I7293o205n640n556j0825k503J2534R531J1211O044k789j0151r112l627
12938H0205n379r336j5698j5117j0097L085J2039P494J088j1555j5950q315j6263
12925c799o943p078q558j2702k6127k5512j0902J7026J7859J6606J6536J9919
12913a3675J5123J388J1073J2864R974N552R81J480k736o203m388o22O211L831
$$ plain form
13004 53173 42828 42090 49041 56539 64981 74902 84411 80350 73166 68946 73335 80081 93665 109356
12990 109356 122011 125907 120417 145846 198268 241525 250942 238989 229309 224914 207395 178021
12978 178021 153446 127814 104873 88879 78676 73949 75758 83268 83405 71479 65426 66176 67173
12965 67173 66872 71285 73382 75195 73033 70474 56472 55325 62579 74467 81852 89651 93944 97293
12951 97293 91088 85448 79892 69067 66564 79098 88629 99840 105884 103095 92944 83832 80205
12938 80205 74826 65490 49792 34675 24578 27663 39702 47196 48284 36729 20779 12464 -3799
12925 -3799 -10742 -17820 -26378 -39080 -65207 -90719 -101621 -84595 -66736 -50130 -33594 -13675
12913 -13675 1448 2836 13909 26773 36747 42299 43280 44760 42024 35821 31433 30811 37022 40853
12899D0853O531N531N641N227N045O078O351J1986K0706K8661J8032K332k941
12886A60033J1570j2055l8609l0841j0225k066K765J3250J2723J4213K0014K4786
12874A65558J2157M928Q777J2932K1335K9573K7866L1009L0110L7846O0280R0811
12862E33182J36820K31732L95693M36398L12474K66228J24086k95796m64879l43387
12852A332551k52507k00036j40607p1448j4013J453j440j0897j8371k3993j8899
12841E81793p332m86O564J8705L1384L1279L8493N4187Q3681J38225K19289L01201
12829A496983L22368K34625l7170l21011l24169k22351j27039o9660m2644k9461
12819H80471l5665l2561l1312k5949k0722j0071l087K642L370Q435O908J0861
$$ plain form
12899 40853 47384 52915 58556 63783 68828 74906 81257 93243 113949 142610 160642 162974 160033
12886 160033 171603 159548 120939 90098 79873 77807 80572 93822 106545 120758 140772 165558
12874 165558 177715 182643 191420 204352 225687 255260 283126 314135 344245 382091 442371 533182
12862 533182 670002 901734 1297427 1733825 2046299 2312527 2436613 2140817 1675938 1332551
12852 1332551 1080044 880008 739401 667953 653940 655393 653953 643056 624685 600692 581793
12841 581793 574461 573975 580539 599244 630628 661907 700400 754587 838268 976493 1195782 1496983
12829 1496983 1819351 2053976 2016806 1695795 1371626 1149275 1022236 952576 909932 880471
12819 880471 844806 812245 780933 754984 734262 724191 721104 723746 727116 735551 742459 753320
12807G53320J7650K6043L6635L3703J4826q33k741k510K656J1840J3350J0485
12795I14424N865J0782K0745K0364J3969P186J7034M1723O1541O6356M8501k8869
12783A199621r5654q9437m1540O174K6103L2098O0641J18601J64663J78247J68964
12772A728481J27634M5054j2227k5006l5248l4859l437K7600O4992J23260J73761
12761B180005J79271J91653K01550K04598K06204J92576K25284L11595M31512
12752D324248N99375P94613R59579J059810J074524R39144R02039J120051J460571
12743A3233954J826725K166965K552324L441061N054290P563308J1553333J8305370
12735F5697330K9793346M6457515O2071397O3640363M5688191m73921n7304310
$$ plain form
12807 753320 770970 797013 833648 867351 882177 881344 878603 876093 878749 890589 903939 914424
12795 914424 920289 931071 951816 972180 986149 993335 1010369 1052092 1113633 1179989 1228490 1199621
12783 1199621 1103967 1014530 972990 979164 1005267 1037365 1098006 1216607 1381270 1559517 1728481
12772 1728481 1856115 1901169 1888942 1863936 1828688 1793829 1790392 1817992 1882984 2006244 2180005
12761 2180005 2359276 2550929 2752479 2957077 3163281 3355857 3581141 3892736 4324248
12752 4324248 4923623 5718236 6677815 7737625 8812149 9751293 10653332 11773383 13233954
12743 13233954 15060679 17227644 19779968 23221029 28275319 35838627 47391960 65697330
12735 65697330 95490676 141948191 204019588 267659951 313348142 312874221 255569911
12728B55569911o7497532n0137968l2832112k0966141j4093730j0036984p222892
12721E2782552n196479l875025l066684k691624k681774k557529k189522j840768
12713B8683147j596774j430908j246284j081443r32091q18608p57560p28389o89532
12704A9401558o56047o54129o56926o25781n77218n31022n08292n01652n06181
12695A4184310m95690m63799l99318l24242k63335k35362k46930k74572l24657
12686A1156405l36673l22305l20805l10056k68788k39739k36573k42236k50571
12677H628659k34724k26478k10426k00958k12219k21428k13847j97822j80605
12668F730152j70598j60143j43865j32575j24887j20922j11291j10212j17356
$$ plain form
12728 255569911 188072379 137934411 105102299 84136158 70042428 60005444 52782552
12721 52782552 47586073 43711048 40644364 37952740 35270966 32713437 30523915 28683147
12713 28683147 27086373 25655465 24409181 23327738 22395647 21577039 20819479 20091090 19401558
12704 19401558 18745511 18091382 17434456 16808675 16231457 15700435 15192143 14690491 14184310
12695 14184310 13688620 13224821 12825503 12501261 12237926 12002564 11755634 11481062 11156405
12686 11156405 10819732 10497427 10176622 9866566 9597778 9358039 9121466 8879230 8628659
12677 8628659 8393935 8167457 7957031 7756073 7543854 7322426 7108579 6910757 6730152
12668 6730152 6559554 6399411 6255546 6122971 5998084 5877162 5765871 5655659 5538303
12659E538303j06211r4706r4199r7799r3118q6704q6361q0092p3592p1898p4423
12648D579200p2108n9716n1309m7336m8493n3571l8133j8207j9804j9200j9113
12637D132210q439r133j0922j0791j2137k123J5607L6662N3089P4776R2274J14926
12625D465999J48784J62741J35237O7602j1439q8636j72927k37419k41519k14556
12615D013867j64222j18499r2975o4213l1026K9804J13991K16597L27954L35528
12605D566806J65950m2481q6773l50628m21353k85506k15891j79582j46535j17052
12595B886955r8794q0829p2892o4285n1811n7822n1995n6213n4828m0963m1166
12584B215357l6506l0289k5844l2196m0853m2100n4767p0099o7039p8191p7225
$$ plain form
12659 5538303 5432092 5337386 5243187 5145388 5052270 4965566 4879205 4799113 4725521 4653623 4579200
12648 4579200 4507092 4447376 4396067 4348731 4300238 4246667 4208534 4190327 4170523 4151323 4132210
12637 4132210 4123771 4114638 4103716 4092925 4080788 4078665 4094272 4130934 4184023 4258799 4351073 4465999
12625 4465999 4614783 4777524 4912761 4980363 4968924 4880288 4707361 4469942 4228423 4013867
12615 4013867 3849645 3731146 3638171 3573958 3542932 3572736 3686727 3903324 4231278 4566806
12605 4566806 4732756 4690275 4603502 4252874 3831521 3546015 3330124 3150542 3004007 2886955
12595 2886955 2788161 2707332 2634440 2570155 2518344 2460522 2408527 2352314 2297486 2256523 2215357
12584 2215357 2178851 2148562 2122718 2090522 2049669 2007569 1952802 1882703 1815664 1737473 1660248
12573A660248k8256l987o78j9102k0535k8478k9344j9557j6731j3108j8817k2959
12561A438696k4969k1119j8509k5835l2295l0664k7815j9702j3725j1229j4542
12550A198292k0196j8540q893o28K716K643L107j228j8154k6556l6335l8883k6865
12537A010480k0246j4931j9400l0376l5298k4085k4042j7521n154o990j8298k3368
12525G70771k7222j9683j6538j6761j8819k3414j8420j5790k045J751p246m658
12513F01926J893j4267j7740j0625l492o133k97K095M505N679K784j738j0324
12500E54266m589M976J1154P476N082N864J989o941j1150k0405j3234p136o849
12487E20503q415j5675j0782q891q876j1058r152r925j2845q89l209j5419q419
$$ plain form
12573 1660248 1631992 1628005 1627327 1608225 1587690 1559212 1529868 1510311 1493580 1480472 1461655 1438696
12561 1438696 1413727 1392608 1374099 1348264 1315969 1285305 1257490 1237788 1224063 1212834 1198292
12550 1198292 1178096 1159556 1150663 1150035 1152751 1155394 1158501 1157273 1139119 1112563 1076228 1037345 1010480
12537 1010480 990234 975303 955903 925527 890229 866144 842102 824581 819427 812437 794139 770771
12525 770771 743549 723866 707328 690567 671748 648334 629914 614124 612079 613830 606584 601926
12513 601926 603819 589552 571812 561187 557695 551562 551265 553360 557865 563544 566328 564590 554266
12500 554266 549677 554653 565807 573283 578365 584229 586218 579277 568127 547722 534488 527352 520503
12487 520503 512088 496413 485631 476740 467864 456806 447654 437729 424884 423995 420786 405367 396948
12474C96948n303j1926j7200r756o560o062k718m989n991j2170q789p222K360
12461C00622Q319L057j427o483r784m770r168q400p043l495L85n273p181n211
12447B44148l517K163j15m879j0526o429l392N356R840J3384L833m197l118p721
12433B34830p183m073k454o962o667r24L239K646P84J982P036K332o040k687r658
12418B06201k1957j7311j2618o181m765Q438M787K093M485j019k902M05k335k617
12404A54704k199j396m215o018l993n889M506O412l982l361J639k352m544o05
12390A28707Q77k81J150j187n566n666n912r94N093K280k55k850m830n559l796
12375A01211l015q38m4N596K092K09l815j018l093j710l32n821k480m27l72K322
$$ plain form
12474 396948 391645 379719 362519 352763 346203 340141 337423 332434 326443 314273 305484 298262 300622
12461 300622 308941 311998 310571 304088 294304 289534 280366 271966 264923 261428 261813 256540 249359 244148
12447 244148 240631 242794 242679 237800 227274 220845 217453 222809 232649 246033 249866 245669 242551 234830
12433 234830 227647 223574 221120 214158 207491 206567 209806 212452 213236 215218 222254 224586 218546 215859 206201
12418 206201 184244 166933 154315 148134 143369 151807 156594 158687 163172 162153 159251 159656 157321 154704
12404 154704 152505 151109 146894 140876 136883 130994 135500 141912 137930 134569 136208 133856 129312 128707
12390 128707 129584 129303 130453 129266 123700 118034 112122 111128 116221 118501 118246 115396 110566 105007 101211
12375 101211 98196 97358 97314 102910 105002 105211 101396 100378 97285 95575 95243 89422 86942 86515 86143 88465
12359H8465M255N794R411K596p224j0677q644l503k8o418o851k928j712p76J252
12344F3012J879O315k759k823R01K347K577P48k997r272o978j866K522K195P806
12329F3607M424L844l22M140l89l680l455m079r02l473o727l638L472K660Q45
12314E6327k493k860j000o64J157k597p18L167J097K169N557N36J347l33K899
12299F3591K014J653Q139L220j830n656q180j511n49j623l15J543m43N129M953
12284G0135j12m4j2J1476J1793J0092N901M086Q567J2902J0251J0368J1994K2216
12270A89613K4021L1491N1495P4880J09652J78037K69907L54299L50368K12151
12260A845914q6002l15661k94697k00233j12620n9667l2439j1211l337m703j3937
$$ plain form
12359 88465 92720 98514 107925 110521 103297 92620 83976 80473 80445 74027 67176 64248 62536 61760 63012
12344 63012 64891 71206 68447 65624 66525 68872 71449 72197 69200 59928 52950 51084 53606 55801 63607
12329 63607 68031 71875 71553 75693 75304 71624 68169 64090 63188 59715 52988 49350 52822 55482 56327
12314 56327 53834 50974 49974 49310 50467 47870 47152 50319 51416 53585 59142 59678 61025 60692 63591
12299 63591 65605 67258 75397 78617 76787 71131 62951 61440 60891 59268 58953 60496 60053 65182 70135
12284 70135 70023 69979 69967 81443 93236 103328 109229 113315 121882 134784 145035 155403 167397 189613
12270 189613 213634 245125 296620 371500 481152 659189 929096 1283395 1633763 1845914
12260 1845914 1759912 1444251 1149554 949321 836701 777034 744595 733384 730047 725344 711407
12249G11407j9354l0971l3482m2915m4576m8796m4376l6085l3421l0478k1000
12238C25953k0504j7937j2106j0733j7718j3817j2951j2230q402q450n974k063
12226A83068R04k678o144r621q191n134p180l461j848p83k195o813o451k526j630
12211A19317k231m300l137k793r15j991o823o192n704j559K74N598J747o068k117
12196H3106J481j433m379R08n363k564J80o046k574j10k158m09j235M7l416k102
12180E3933J850j477l388k545K868M192l259k752M062K434J780P425L263Q56m978
12165F4264q996N27K956l544l762K676J380O83O48K688M182O99n876m755L341
12150E7111K906k890j87k348l591K943L418j353j494P87k76j165J206K220J445
$$ plain form
12249 711407 692053 661082 627600 584685 540109 491313 446937 410852 377431 346953 325953
12238 325953 305449 287512 275406 264673 246955 233138 220187 207957 199555 191105 185131 183068
12226 183068 183972 181294 175150 165529 157338 152204 145024 141563 139715 138932 136737 129924 123473 120947 119317
12211 119317 117086 112786 109649 106856 105941 103950 97127 90935 85231 83672 83946 89544 91291 85223 83106
12196 83106 84587 83154 78775 79683 74320 71756 71936 65890 63316 63206 61048 60639 59404 59451 56035 53933
12180 53933 55783 54306 50918 48373 51241 55433 52174 49422 53484 55918 57698 65123 68386 69242 64264
12165 64264 55268 55795 58751 55207 51445 54121 55501 56184 56832 59520 63702 64401 58525 53770 57111
12150 57111 60017 57127 56940 54592 51001 53944 57362 56009 54515 55302 55026 53861 55067 57287 58732
12135E8732l401j628n224n055K59K986L263n481q651l509N638L615k178k058l649
12120C3659K35K474K132j73j895j286k817k686K686l09l035K436K988k941k024
12105B9444o269P41L385j314j011m160k19K640L084j927m975P94M506N908l247
12090B7380j410k085j285j439k335n170o064L809M494K000J543n70L485L501p24
12075B5130l478J581p52m021J755N917r22m734K587m621L18q60n323k401K612
12060A2788L288j074l167j036J833J449M175l10K497m563k253L193J333j835m760
12045A1558J393R59k661J042l408j653J623k933k58J871M105N372n805r61K642
12030A2886n09K111R67K13K061J209L19m097k381l436q014J034L220M91N595M452
$$ plain form
12135 58732 55331 53703 48479 43424 43683 46669 49932 44451 35800 32291 37929 41544 39366 37308 33659
12120 33659 33894 36368 38500 38327 36432 35146 32329 29643 32329 32020 28985 31421 34409 31468 29444
12105 29444 23175 23916 27301 25987 24976 20816 20597 23237 26321 24394 19419 20213 24719 30627 27380
12090 27380 25970 23885 22600 21161 18826 13656 7592 11401 15895 17895 19438 18868 22353 25854 25130
12075 25130 21652 23233 22481 18460 20215 26132 25210 20476 23063 18442 18760 17900 12577 10176 12788
12060 12788 16076 15002 11835 10799 12632 14081 18256 17946 20443 15880 13627 16820 18153 16318 11558
12045 11558 12951 13910 11249 12291 8883 7230 8853 5920 5662 7533 11638 17010 11205 10244 12886
12030 12886 12377 14488 15455 15668 17729 18938 19257 15160 12779 9343 1329 2363 5583 6074 11669 16121
12014A6121k629k121m82L75O583Q530N154m87j697l961l048k695J974k559l965
11999A5093k851J054m396j180Q83n530l123K088J891L060j731J004j914n472p41
11984a865L292J295L545j292l976L355J690n42l390J439Q12R43k686K170J783
11969F573J568K197m567p361M679M61K625K377K741k688n436J484M297N78m229
11954E299l587L107L321K123j728l76N087J263l252k640K561K31m713K408j05
11939H999M32Q04m279l367J636j488j87j679J598J699Q47k002L22K650J277K220
11923I482k089j389j448Q37k471k735L500J424K919K65K171n875j0338L305Q874
11908F432L791j364j855m07j567J292J185l48l391J451K91K373l27k792j178O073
$$ plain form
12014 16121 13492 11371 10889 11264 17847 26377 31531 31044 29347 25386 22338 19643 21617 19058 15093
11999 15093 12242 13296 8900 7720 8603 3073 -50 2038 3929 6989 5258 6262 4348 -1124 -1865
11984 -1865 1427 2722 6267 4975 999 4354 6044 5502 2112 3551 4363 5306 2620 4790 6573
11969 6573 8141 10338 5771 -1590 3089 3550 6175 8552 11293 8605 3169 4653 8950 9528 5299
11954 5299 1712 4819 8140 10263 8535 8159 13246 14509 11257 8617 11178 11409 6696 9104 8999
11939 8999 9431 10235 5956 2589 4225 2737 2550 871 2469 4168 5015 3013 3335 5985 7262 9482
11923 9482 7393 6004 4556 5393 2922 187 3687 5111 8030 8295 10466 4591 -5747 -2442 6432
11908 6432 10223 8859 7004 6597 5030 6322 7507 7159 3768 5219 5510 7883 7556 4764 3586 9659
11892I659K28j746m275j519L118L195K299J846k77m24l491j040j672J818K341
11877A0060j037k218k344J244J452O08m436j740J544M358L97n248M88m78K236
11862D886K672L857m516n64k229K61j42k81L93n33J290k523l532L542j32N350
11846G799L520K424n202o002j775j482j445l128M798J893J932L484R53k393j100
11831D276O096l701n653l835K836K126K382K655K173J495j877K859R72j927k695
11816H182k440J837J574k619k295M81N68K674L184L90j086K00o994P49J776L598
11800I779p021K73M032K851l589j220m454j351M537Q72n356k858K181j415l823
11785f562m020M655p73O176L933M5m833n15Q085M551L122k964q115J896M556k032
$$ plain form
11892 9659 9887 8141 3866 2347 5465 8660 10959 12805 12528 12104 8613 7573 5901 7719 10060
11877 10060 9023 6805 4461 5705 7157 7765 3329 1589 3133 7491 7888 2640 3128 2650 4886
11862 4886 7558 11415 6899 6335 4106 4367 4225 3944 4337 3804 5094 2571 -961 2581 2449 7799
11846 7799 11319 13743 8541 2539 764 -718 -2163 -5291 -493 1400 3332 6816 7769 5376 4276
11831 4276 10372 6671 1018 -2817 19 2145 4527 7182 9355 10850 8973 11832 12804 10877 8182
11816 8182 5742 7579 9153 6534 4239 4720 5288 7962 11146 11536 10450 10650 3656 4405 6181 9779
11800 9779 2758 3031 7063 9914 6325 5105 651 -700 3837 4709 -647 -3505 -1324 -2739 -6562
11785 -6562 -10582 -5927 -6700 -524 3409 3454 -1379 -1894 6191 10742 13864 10900 2785 4681 9237 7205
11769G205q11K669N236M267M917Q204k757l197l53O548N022O068O707J3685N125
11754F8535m15Q240J4177R957j023n39q58j737n570q462j3078r500m513l57j864
11739E2993n934k446m719J770o201n381m69j133j364k217K062J209K156P88J784
11724C2898J438J461N680n607k057M287O525R066K254K041K358O763N247N606
11710G7960Q132N539R685l206k239M308p701q187J477n078j2799j3655j0647k879
11696D0710k489J903L493m50m141m144q178m634K746k685o468J185K280k590m379
11681A2159k682o3M687p4k182j74J98J170l344N195J511m417l576K73L002N0j340
11664A0393m56K675o153m044j2O160q77K707L91k283K005p28n72L563l0k074o872
$$ plain form
11769 7205 6394 9063 14299 18566 23483 31687 28930 25733 25380 31928 36950 43018 49725 63410 68535
11754 68535 68120 76360 90537 100494 99471 98932 98074 96337 90767 82305 69227 59727 55214 54857 52993
11739 52993 47059 44613 39894 41664 35463 30082 29613 28480 27116 24899 26961 28170 30326 31114 32898
11724 32898 34336 35797 41477 35870 33813 38100 44625 53691 55945 57986 60344 67107 72354 77960
11710 77960 86092 91631 101316 98110 95871 100179 92478 84291 85768 80690 67891 54236 43589 40710
11696 40710 38221 40124 43617 43167 39026 34882 26704 22070 24816 22131 15663 16848 19128 16538 12159
11681 12159 9477 9414 14101 14027 11845 11671 11869 13039 9695 14890 16401 11984 8408 8681 11683 11733 10393
11664 10393 9937 12612 6459 2415 2403 8563 7686 10393 10784 8501 10506 9778 9206 12769 12739 10665 3793
11647C793M398N701P95k968j202M451j840l348q91K738L058Q89J407l048k478
11632A1455n39j1l633j223J422L229p11p3n386m055R38K338k718l333Q62J998
11616E60j322J133K575O352M50n743j380k124j604n4L991N209m657p86K015N272
11600I887n487j811j698k339k68Q108L424m076n665q10l97n49j860L04J660M539
11584B962L118k457m522J393M018q37K55l316k753q58K201k68l748j962K496k75
11568d553K166l267J822O788k471J464o706J79j747k940M077N825N48L266N621
11553A0072j483l946M96K998l043n168l123k250J756L996M017O793J697l476q287
11538A049j427j470M11k87K023J941R23L80K297Q66r73l224k59m772o91J257o24
$$ plain form
11647 3793 8191 13892 14687 11719 10517 14968 13128 9780 8889 11627 14685 15574 16981 13933 11455
11632 11455 10916 10905 7272 6049 7471 10700 9989 9916 4530 475 1413 3751 1033 -2300 -1438 560
11616 560 -762 371 2946 9298 9748 4005 2625 501 -1103 -1157 2834 8043 3386 2600 4615 9887
11600 9887 4400 2589 891 -1448 -1716 6392 9816 5740 75 -735 -1132 -1681 -3541 -3237 -1577 2962
11584 2962 6080 3623 -899 494 4512 3675 3930 614 -2139 -2997 -796 -1064 -4812 -6774 -4278 -4553
11568 -4553 -2387 -5654 -3832 2956 485 1949 -4757 -4578 -6325 -9265 -5188 637 1185 4451 10072
11553 10072 8589 4643 5139 8137 5094 -74 -3197 -5447 -3691 305 4322 11115 12812 9336 1049
11538 1049 -378 -1848 -1437 -1724 299 2240 3163 3543 5840 6706 5733 2509 2250 -2522 -3213 -1956 -2580
11521b580m766L371K025K91n073l485J44N455J419O006K675l712l064J373l37
11506b58J639M06p76K243L460j745K174P592l322o202m079l38K027J107r21K751
11490E758o12J958K73k621m42R62j899k088J406j833j027K770Q27j143k931n423
11474f065M156N176K428n815M38Q08k227J227M39l842j116l033N9j519l989K291
11458a0584P452K443j830M6k340Q7L643K830m065N0N610O229Q33j239J789K430
11442A3384j401J909m145m314m727o484O387L986j414k428J063L541M738k112
11428G983k035n978o403j648J18l349K26M600N35J892J580l976K152j029J775
11413c557J223P045k908o044j568j144j97K810O715j622l389L155L508M82J315
$$ plain form
11521 -2580 -7346 -3975 -1950 -1659 -6732 -10217 -10073 -4618 -3199 2807 5482 1770 -1294 79 -258
11506 -258 1381 1787 1011 3254 6714 4969 7143 14735 11413 5211 1132 794 2821 3928 3007 5758
11490 5758 5146 7104 7377 4756 4314 5276 3377 1289 2695 862 -165 2605 3432 2289 -642 -6065
11474 -6065 -1909 3267 5695 -120 318 1126 -1101 126 565 -3277 -4393 -7426 -7367 -8886 -12875 -10584
11458 -10584 -3132 -689 -2519 -2473 -4813 -4726 -1083 1747 -2318 -2268 3342 9571 10404 9165 10954 13384
11442 13384 11983 13892 9747 5433 706 -5778 609 4595 3181 753 1816 5357 10095 7983
11428 7983 5948 -30 -6433 -8081 -7963 -11312 -11086 -6486 -5951 -4059 -2479 -6455 -4303 -5332 -3557
11413 -3557 -2334 4711 1803 -4241 -5809 -6953 -7150 -4340 2375 753 -2636 519 4027 4509 5824
11398E824l583l076K53J630J847K316j099p83m638k850K256L126p86j939J714
11383B12j278J817M19l134M010k091q18K460m289k67K471l174K666K432p68k485
11367a817N050K127l858k464l866k006M154M390j804R58K956m678j773j874n526
11352a0031M62O755k630n19J017M737O98N65l224p96L226J602m124j886L349K958
11336B159K925J965J426K486K25m578M79J83l188j569M614k082R62O83k185k182
11320B323o3l47r79l054J584K600K175l094m239J907l28l145qJ800N674m0j286
11303A480l049L22n09l038K160K752N73K45N567n390M07M577k676n255j927M195
11287D34m49j725K460q93k54K124j501p10j55n31M23L38n421N17m178m334K520
$$ plain form
11398 5824 2241 -835 -582 1048 2895 5211 4112 3329 -1309 -4159 -1903 1223 437 -1502 212
11383 212 -1066 751 1170 -1964 2046 -45 -863 1597 -2692 -2959 -488 -3662 -996 1436 668 -1817
11367 -1817 3233 5360 1502 -962 -4828 -6834 -2680 1710 -94 864 3820 -858 -2631 -4505 -10031
11352 -10031 -9569 -2814 -5444 -5963 -4946 -209 489 1054 -2170 -2966 260 1862 -2262 -4148 -799 2159
11336 2159 5084 7049 8475 10961 11186 6608 7087 7270 4082 2513 7127 5045 6007 6690 4505 2323
11320 2323 2260 1913 934 -2120 -536 2064 4239 1145 -3094 -1187 -1515 -4660 -4668 -2868 2806 2766 1480
11303 1480 -1569 -1247 -1756 -4794 -2634 118 691 936 6503 1113 1520 6097 3421 -1834 -3761 434
11287 434 -15 -1740 720 -173 -427 1697 196 -514 -669 -1200 -777 -439 -5860 -5343 -9521 -13855 -11335
11270a1335M361o86J798M0L976P374m620m175j733J879j845k348L092j126l145
11255h493M649J797M211L815N86l536l004j206J149q35l066j742K420o82r21L806
11239a052J715m059n49Q41L236K184k289k148n105M75j632J188K569J262J295
11224b069j294j51l1l487o23L618J851K829j09j312m433K719j316j591L006K735
11208C42J322j624J426l382K31M219k717m378q20Q3k084M99L460M327n178j56
11192d430L884K446j24k191K077J358j515m433m341j010J349R11l88K133J161
11177c113l279l343M749L821K696j050l832J153J653r96o860m09O390l805j666
11162g891l938k13L113L39L67L170N778L972j8o481l97M572M89n987k864j868
$$ plain form
11270 -11335 -6974 -7660 -5862 -5822 -1846 5528 908 -3267 -5000 -3121 -4966 -7314 -4222 -5348 -8493
11255 -8493 -3844 -2047 2164 5979 6565 3029 25 -1181 -32 -867 -3933 -5675 -3255 -3937 -4858 -1052
11239 -1052 663 -3396 -3945 -3104 132 2316 27 -2121 -7226 -6751 -8383 -7195 -4626 -3364 -2069
11224 -2069 -3363 -3514 -3545 -7032 -7655 -4037 -2186 643 534 -778 -5211 -2492 -3808 -5399 -2393 342
11208 342 1664 40 1466 -1916 -1685 2534 -183 -4561 -5381 -5298 -7382 -6883 -3423 904 -4274 -4430
11192 -4430 -546 1900 1776 -415 1662 3020 1505 -2928 -7269 -8279 -6930 -6019 -6407 -4274 -3113
11177 -3113 -6392 -9735 -4986 -1165 1531 481 -3351 -2198 -545 -1541 -8401 -8810 -2420 -6225 -7891
11162 -7891 -11829 -12042 -8929 -8590 -8223 -5053 725 4697 4679 -1802 -2199 2373 2862 -3125 -5989 -7857
11146g857J758q5K30O266l96m430m637l281J262M461l08l140O54Q89K49K197j600
11129g768K883O989J660j764J465K523j928m620j764k399J51K212j575K80J23
11114c532j257l27R86J405L571L468J265j471j871m484L73J934l19n344J015M979
11098C91K825J115n48n605k873m31j384o74l673J516M620k918k745r02r4J504
11082i876K742J922j95N490L660k999m971j435P011k966r36M827L050L050l135
11067E239p279r39m783l778o75k239J364m92J420L860j86l279k706l601M868P594
11051e612k27l214J280N394k07J599j059m137l019L462L13l340K303L865M64q44
11035b979l57l901K857J093l897j219l500N03P227K693N93O85K714k392n742K208
$$ plain form
11146 -7857 -6099 -6184 -5954 312 -84 -4514 -9151 -12432 -11170 -6709 -7017 -10157 -9503 -8614 -8365 -6168 -7768
11129 -7768 -4885 2104 3764 2000 3465 5988 4060 -560 -2324 -4723 -4572 -2360 -3935 -3655 -3532
11114 -3532 -4789 -5116 -4130 -2725 846 4314 5579 4108 2237 -2247 -1874 60 -259 -5603 -4588 391
11098 391 3216 4331 3783 -1822 -4695 -5126 -6510 -7184 -10857 -9341 -4721 -7639 -10384 -11286 -11380 -9876
11082 -9876 -7134 -5212 -5407 83 3743 744 -4227 -5662 1349 -1617 -2553 2274 5324 8374 5239
11067 5239 -2040 -2979 -7762 -11540 -12215 -14454 -13090 -13582 -12162 -8302 -8488 -11767 -14473 -18074 -13206 -5612
11051 -5612 -5839 -9053 -7773 -2379 -2586 -987 -2046 -6183 -9202 -5740 -5427 -8767 -6464 -2599 -2135 -2979
11035 -2979 -3336 -7237 -4380 -3287 -7184 -8403 -11903 -11400 -4173 -1480 -887 -202 2512 120 -5622 -3414
11019c414L64J220J169j656j431M64K475k199J061J375J826o88m682L36k161k142
11003h083k551J696M870l450l026J784K384N119K180m287m028j531l933l388K085
10988a4159O193j100j622o42M847R73N610m22p708J221L515J676K518R85k761
10973h76j753l421M306J071j978L620L162n461o083K93K683j911O06L468K747
10958D73j241m527n570q53M902K249K705l862l809K090k502l935o31N518L403
10943e590J613L135j602m441p56K478k076k971k49p39K657J743k514k545K141
10928i716L835j369q25K518j611K345J638j41m598m169J654L297R94k025r08r10
10912i991M379j039m248L028K475O20k401O31m43k04K88j976K052N0q299n91P425
$$ plain form
11019 -3414 -3050 -1830 -661 -2317 -3748 -3284 -809 -3008 -1947 -572 1254 566 -4116 -3780 -5941 -8083
11003 -8083 -10634 -8938 -4068 -7518 -10544 -8760 -6376 -1257 923 -3364 -7392 -8923 -12856 -16244 -14159
10988 -14159 -7966 -9066 -10688 -11330 -6483 -5510 100 -322 -8030 -6809 -3294 -1618 900 1885 -876
10973 -876 -2629 -6050 -1744 -673 -2651 969 4131 -1330 -7413 -7120 -4437 -6348 -5742 -2274 473
10958 473 -768 -5295 -10865 -11718 -6816 -4567 -1862 -5724 -9533 -7443 -9945 -13880 -14511 -8993 -5590
10943 -5590 -3977 -842 -2444 -6885 -7641 -5163 -7239 -10210 -10459 -11198 -8541 -6798 -9312 -11857 -9716
10928 -9716 -5881 -7250 -8075 -5557 -7168 -4823 -3185 -3326 -7924 -12093 -10439 -7142 -6148 -8173 -9081 -9991
10912 -9991 -5612 -6651 -10899 -7871 -5396 -4776 -7177 -6546 -6989 -7193 -6905 -8881 -6829 -6779 -15078 -15669 -8244
10895h244L384j020k867L428k081l145L499L228k933J716k797n775K461L548L78
10880g220L34R32L714N282K870j948j060l324k433OJ556N86q46j719N88K729J929
10863A976k927p78j885k727l295n00M661M350J214k523j367m93O87j535k679k989
10847a0810k28N95L568L760m015l205k526o07L690K668k051l009K116K221j815
10832i648K619l677l710j746J396j127p74Q212L463K352L936n317q170k468J818
10817a2841K871J312j415K456N486j097l123j773l162l741P89O651O971J90K09
10802b17k785k899J76l19N46L393m768J458N138O79k855L743K11n375m326o61
10786h861j70K018k661j655N951P180M776m181n500j614K184l197k428p42k85
$$ plain form
10895 -8244 -4860 -5880 -8747 -5319 -7400 -10545 -7046 -3818 -6751 -5035 -7832 -13607 -11146 -7598 -7220
10880 -7220 -6886 -5954 -2240 3042 5912 3964 2904 -420 -2853 -2847 -1291 -705 -1551 -3270 -2682 47 1976
10863 1976 -951 -1729 -3614 -6341 -9636 -10136 -5475 -1125 89 -2434 -3801 -4294 -3607 -5142 -7821 -10810
10847 -10810 -11038 -10443 -6875 -3115 -7130 -10335 -12861 -13468 -9778 -7110 -9161 -12170 -10054 -7833 -9648
10832 -9648 -7029 -10706 -14416 -16162 -14766 -15893 -16667 -8455 -4992 -2640 1296 -4021 -12191 -14659 -12841
10817 -12841 -9970 -8658 -10073 -7617 -2131 -3228 -6351 -8124 -11286 -15027 -14238 -7587 -616 -426 -217
10802 -217 -3002 -5901 -5725 -6044 -5498 -2105 -6873 -5415 -277 402 -2453 1290 1501 -3874 -8200 -8861
10786 -8861 -9031 -7013 -9674 -11329 -5378 1802 6578 2397 -3103 -4717 -2533 -5730 -8158 -8900 -9185
10771i185m65j140L93n82m119j166L295R45m31L608j069N893N216j583R8j902
10755b194J666K215j726j055l632k173K40K482L932k538K17K886J527J192J235
10740D274N553k697p923M6J018m160J815L187m269J060K185j931J787L823j038
10725B730j375J682L047o587K377L538k841p068l984L347N5N42k648l644M94L944
10709f391K985q15J586m500m872K545K121J968l917r417L74L540K639Q79J995
10694i280N607J916L90k63j590Q49P87k053l483k930K771J769M172l555l374n087
10678a3354O927N756L352J474k716j460k786p64j02m043J041l234L005K177k094
10663f821k87P14j576N724M571M487l483p664l670k093K49j969N531K935k547
$$ plain form
10771 -9185 -9650 -10790 -10397 -10979 -15098 -16264 -12969 -12024 -12455 -8847 -9916 -4023 1193 -390 -292 -2194
10755 -2194 -528 1687 -39 -1094 -4726 -6899 -6659 -4177 -245 -2783 -2566 320 1847 3039 4274
10740 4274 9827 7130 -793 -747 271 -3889 -2074 1113 -3156 -2096 89 -1842 -55 3768 2730
10725 2730 1355 3037 6084 -503 1874 5412 2571 -4497 -8481 -5134 -5079 -4537 -7185 -10829 -10335 -6391
10709 -6391 -3406 -4221 -2635 -7135 -12007 -9462 -7341 -5373 -9290 -18707 -18333 -14793 -12154 -11275 -9280
10694 -9280 -3673 -1757 -1367 -1630 -3220 -2371 -1584 -3637 -7120 -10050 -7279 -5510 -1338 -4893 -8267 -13354
10678 -13354 -6427 -671 2681 4155 1439 -21 -2807 -3571 -3673 -7716 -6675 -9909 -6904 -4727 -6821
10663 -6821 -7108 -6394 -7970 -2246 2325 6812 3329 -4335 -8005 -10098 -9849 -11818 -6287 -3352 -5899
10648e899k371K298n55j677M967P733n0m374k649k174K682j230l967j181m9L347
10632e149M536k852n742n37k399J903J402j273k230p72J732k57l184k328N664
10617a1486J761j956J88m60J426J251j277M089l199m646L989M377J99j180L326
10602c598J985p25k315l137j242K550K568R2J630L175K104M62m792p22n480O01
10586f844K294N28n0m89N719P008r46m77M993l244r862n116l757O868N933l23
10570B235l738N845k724J458J949M492p995n142k574j076M218Q110k8m903r44
10555h17R93K520n957M457M761j124k756L81m35o339j689L951j33O05M957M30
10539C805k175P89J878J44K030J278l820j207O70P43r69J969K682k690l175R33
$$ plain form
10648 -5899 -8270 -5972 -6527 -8204 -3237 4496 4446 72 -2577 -4751 -2069 -3299 -7266 -8447 -8496 -5149
10632 -5149 -613 -3465 -9207 -9744 -12143 -10240 -8838 -10111 -12341 -13113 -11381 -11638 -14822 -17150 -11486
10617 -11486 -9725 -11681 -11493 -11953 -10527 -9276 -10553 -6464 -9663 -14309 -10320 -5943 -5744 -6924 -3598
10602 -3598 -1613 -2338 -4653 -7790 -9032 -6482 -3914 -3822 -2192 983 3087 3549 -1243 -1965 -7445 -6844
10586 -6844 -4550 -4022 -4072 -4561 1158 8166 7220 6743 11736 8492 -1370 -6486 -10243 -3375 2558 2235
10570 2235 -1503 4342 1618 3076 5025 9517 1522 -3620 -6194 -7270 -3052 5058 5030 127 -817
10555 -817 176 2696 -3261 1196 5957 4833 2077 2458 2023 -4316 -6005 -2054 -2187 -1582 3375 3805
10539 3805 1630 2419 4297 4441 6471 7749 3929 2722 3392 4135 3166 5135 7817 5127 1952 2885
10523B885K320O5p98l265l634l534K534M570R68j385j03j701j837l953M180j623
10507d311N13N879o60J829q39M240K036j458k378o393k533J636m545Q1N436m103
10491e570j250M265K67K231P7L893O925N224K566o009p498J514K727J828j199
10476I991m669l9k339J232q87m139m803K144L288L025k568j796q93K123L853k935
10460E88o639l803n67M545j574J478p85r90O319N054M09j932L203K468l470m074
10444B30r08J231R1m814Q26L112O682M242o103n591m073n945o03M826J288j876
10428g385k352K801P777M993m54J154n556l870k80K760j588J790N431L66j039
10413D548k078J533K950k117l216q63J377M44Q10l87j9k671l726k768l040j834
$$ plain form
10523 2885 5205 5270 4472 1207 -2427 -5961 -3427 1143 2111 726 623 -1078 -2915 -6868 -2688 -4311
10507 -4311 -3798 2081 1421 3250 2411 6651 8687 7229 4851 -1542 -4075 -2439 -6984 -6903 -1467 -5570
10491 -5570 -6820 -2555 -2288 -57 20 3913 10838 16062 18628 12619 5121 6635 9362 11190 9991
10476 9991 5322 5283 2944 4176 3289 -850 -5653 -3509 -221 2804 236 -1560 -2453 -330 3523 588
10460 588 -6051 -9854 -10421 -5876 -7450 -5972 -6757 -7747 -1428 3626 4035 2103 5306 7774 4304 230
10444 230 -678 553 644 -4170 -3344 -232 6450 10692 4589 -1002 -5075 -11020 -11623 -6797 -5509 -7385
10428 -7385 -9737 -6936 841 5834 5380 6534 978 -2892 -3172 -412 -2000 -210 5221 5587 4548
10413 4548 2470 4003 6953 4836 1620 757 2134 2578 3388 3001 2982 311 -3415 -6183 -9223 -11057
10397a1057k861J470J1803O126J180L799M628N307N110N977P797P368L560r768
10383D0439p186n561j1366q690j1596l026K223l61L033J80j681j943r26O29K803
10368c029N01M83M578M512j367J838N31j633J366l195m158j731r85k884k26K13
10352e186m02K479O469J932o398j526m41Q04j833m318j57O88J994j895K462O71
10336d657l079K003M776k528o883l980M148Q098M781j124j618K87K887l380l422
10321c691J01J829J379n151o54j231J190M404R60M108J493j222j567R47l671j625
10305b401Q49J058m320M147O948l518L177P518L168j043K97J354K016J1215J5397
10290D5862K0311K4025M1381M6288M4188M2350M6206L9607K2138P378o709k0013
$$ plain form
10397 -11057 -13918 -12448 -645 5481 6661 10460 15088 20395 25505 31482 39279 46647 50207 40439
10383 40439 33253 27692 16326 7636 -3960 -6986 -4763 -5124 -2091 -1911 -3592 -5535 -6461 -5832 -3029
10368 -3029 -2528 -2045 2533 7045 5678 7516 8047 6414 7780 4585 427 -1304 -2289 -5173 -5399 -5186
10352 -5186 -5588 -3109 3360 5292 -1106 -2632 -3073 -2269 -4102 -8420 -8577 -7889 -5895 -7790 -5328 -4657
10336 -4657 -7736 -5733 -957 -3485 -10368 -14348 -10200 -2102 2679 1555 -63 224 3111 -269 -3691
10321 -3691 -3590 -1761 -382 -5533 -6187 -7418 -6228 -1824 -864 3244 4737 3515 1948 2895 -776 -2401
10305 -2401 -1552 -494 -4814 -667 6281 2763 5940 13458 16626 15583 15880 17234 19250 30465 45862
10290 45862 66173 90198 131579 177867 222055 264405 310611 350218 372356 379734 373025 353012
10278C53012k9759l5015l7172l9590k9477k6215k9271k6201j3423o465l556q728
10266F8140o099q536m295M739k141K78j136n289o723q330m930K089j23j770n753
10251B0121K987M065M38m771k400O657m91m125q862J523k69p56K389P48j622m76
10235A5156k934J42j77m51Q73k143l551l836k759L570P098K188j861j310R71j322
10219I654P81L121P12j9r43L492K767r73L738M637P655J2299O993N589r23j79
10203E8401j722j1602p157l898p736J220l114k323l51k86n998k182L28m2k826
10188A0712M85J044K933j399m317n88k461K611N014j486m523k354N77L07K471
10173I026K882J406j047n974K006L603M458J371j315m852m440J818l568L699R25
$$ plain form
10278 353012 323253 288238 251066 211476 181999 155784 126513 100312 86889 80424 76868 68140
10266 68140 62041 53505 49210 53949 51808 52086 50950 45661 38938 30608 25678 27767 27644 25874 20121
10251 20121 23108 27173 27611 22840 20440 27097 26606 22481 13619 15142 14873 14117 16506 17254 15632 15156
10235 15156 12222 12364 12187 11736 12609 10466 6915 3079 320 3890 10988 13176 11315 10005 10976 9654
10219 9654 10435 13556 14268 14249 13306 16798 19565 18592 22330 26967 34622 46921 53914 59503 58580 58401
10203 58401 56679 45077 37920 34022 26286 27506 24392 22069 21718 21432 15434 13252 13580 13538 10712
10188 10712 11197 12241 15174 13775 9458 8870 6409 9020 14034 12548 8025 5671 6248 6555 9026
10173 9026 11908 13314 12267 6293 8299 11902 16360 17731 16416 11564 7124 8942 5374 9073 9998
10158I998l833J467p42n041K583q94l349k012J586M066L222l718l16J995M999
10143A0011k174M267l82k212J860l862L657K177J779J425J585p149n174k519P35
10128D024q9l278l658R25K617j700J025K769K497k642n166k167N061L526L603
10113G347l463j54l403K83k58q80O86R34K334m016k590K794K024p46q13j426j487
10096b834M083J299j244j575k200j757N216K368k077Q09M241K136r97j040n251
10081A177j741Q22j510L682J776j396K985M555K839o411m680M34j136k995K679
10066A080j662k398j332k473n837J952M997M675k106J66N338Q273K283J821o24
10051A4153r28l122m685l502k546M737j138J500j682K576J709n944j506M145j19
$$ plain form
10158 9998 6165 7632 6890 1849 4432 3538 189 -1823 -237 3829 7051 3333 3017 5012 10011
10143 10011 7837 12104 11722 9510 11370 7508 11165 13342 15121 16546 18131 10982 5808 3289 4024
10128 4024 3935 657 -3001 -2076 541 -1159 -134 2635 5132 2490 -2676 -4843 218 3744 7347
10113 7347 3884 3730 327 610 352 -528 158 1092 3426 -590 -3180 -386 1638 892 79 -1347 -2834
10096 -2834 1249 2548 1304 -271 -2471 -4228 988 3356 1279 2088 6329 8465 7468 6428 1177
10081 1177 -564 258 -1252 2430 4206 2810 5795 10350 13189 6778 2098 2532 1396 -1599 1080
10066 1080 -582 -2980 -4312 -6785 -12622 -10670 -5673 -998 -3104 -2938 2400 10673 12956 14777 14153
10051 14153 13225 10103 5418 1916 -630 4107 2969 4469 2787 5363 7072 1128 -378 3767 3648
10036C648P08J375N100J943o40j96J60n53J915n986o566j791j64k886N561N279
10020F907k770P25n510l178j073j437M599l63l320M324L047l860m855K34L989
10005b541M002m342k326J263L494k501j975j543p72N197K679L319o37J133K812
9990G262j503j334l349J025N894Q918P279k408j0287k285K074k279o735k064j545
9975a337j2l317N19J768N040J736q255k163K324M127K509k93L716L206K50m105
9959E713M92O77L267k500o59j997O443k292o663m109K497N759J052M746O015O60
9943A9101K55K337j136j721O796N885L709j038m165q63n095l699l282m582l723
9928H779j867K116m00J38k454Q2K225P808n98k925k067K101J226l199J236J573
$$ plain form
10036 3648 4356 5731 10831 12774 12134 11938 12098 11545 13460 7474 908 -883 -1047 -3933 1628 6907
10020 6907 4137 4862 -648 -3826 -4899 -6336 -1737 -2100 -5420 -1096 1951 -1909 -6764 -6530 -2541
10005 -2541 1461 -2881 -5207 -3944 -450 -2951 -4926 -6469 -7241 -2044 635 3954 3317 4450 7262
9990 7262 5759 4425 1076 2101 7995 16913 24192 21784 11497 9212 11286 9007 2272 208 -1337
9975 -1337 -1349 -4666 -4147 -2379 2661 4397 -3858 -6021 -3697 430 2939 2646 6362 9568 9818 5713
9959 5713 6205 6882 10149 7649 6990 4993 11436 9144 2481 -1628 869 6628 7680 12426 18441 19101
9943 19101 19356 21693 20557 18836 25632 31517 35226 34188 30023 29160 24065 20366 17084 12502 8779
9928 8779 6912 9028 8628 8766 6312 6394 8619 16427 15829 12904 10837 12938 14164 10965 12201 13774
9912A3774j586p35K057l345J34J92m712p458k351J410O237J375l506l508J878
9897a44j423m010k04j988p18L458K175k398L389N239Q430K804q06l679o622M280
9881G783J846K431j334J743j311l093j835j102k917m600L411J793K042J946o560
9866B43l030K17M51k280j644J761J583m24k92K720QL305K904N476K032L450N168
9849B1648Q798O869K921L377K948o704k653J255O66l708r108l495k644K292o14
9834B1848k600K874k325p456k570M148k338k011k164J601N831k007j000K101M260
9819A8192l970m591J59M817O448M554l79L369l045l22K016l823M008Q542J0781
9804D6756P505J5283J3999J9464L4134N5741R6937J73095K45415K81809K17181
$$ plain form
9912 13774 12188 11453 13510 10165 10299 10491 5779 -1679 -4030 -2620 3617 4992 1486 -2022 -144
9897 -144 -1567 -5577 -5781 -7769 -8487 -5029 -2854 -5252 -1863 3376 11806 14610 13804 10125 3503 7783
9881 7783 9629 12060 10726 12469 11158 8065 6230 5128 2211 -2389 1022 2815 4857 6803 243
9866 243 -2787 -2570 -2119 -4399 -6043 -4282 -2699 -3123 -3415 -695 -687 2618 5522 10998 13030 16480 21648
9849 21648 30446 37315 40236 43613 46561 39857 37204 38459 39125 35417 26309 22814 20170 22462 21848
9834 21848 19248 22122 19797 12341 9771 13919 11581 9570 7406 9007 14838 12831 11831 13932 18192
9819 18192 14222 9631 9790 14607 21055 25609 25230 28599 25554 25232 27248 23425 27433 35975 46756
9804 46756 54261 69544 83543 103007 137141 192882 289819 462914 708329 990138 1207319
9793A207319K3465j98490k78988k29053j42418q2746n3068m0875k5858j5320j1373
9782A52595j2587q246r766p533l333o604q095m297m308j577m886l103l635p670
9768F6955j843l860L910l733l83n965m721l292o31j734K04J213l750n174k216
9753C4980Q27K613j038k714j254m651j544j470m516J438M978L021r69J485n92
9738C0594l944j84k845M95J014k984l161J898J358J522N645Q27K311n930o904
9723A9712q950o52K241n8J552K684J264N047J923L887L73J662j563m884m841o
9707A9391M328R62m969k126L253L685k611R76O49j728L007k373k144m236m667
9692A1397L61L887K077J82J456N665n647L23J936j466J019P93j365m436m121J377
$$ plain form
9793 1207319 1230784 1032294 753306 524253 381835 299089 246021 205146 179288 163968 152595
9782 152595 140008 131762 121996 114463 111130 104526 96431 92134 87826 86249 81363 78260 74625 66955
9768 66955 65112 61252 65162 61429 61046 55081 50360 47068 46437 44703 44907 46120 42370 37196 34980
9753 34980 35807 38420 37382 34668 33414 28763 27219 25749 21233 22671 27649 30670 29701 31186 30594
9738 30594 26650 26466 23621 24116 25130 22146 18985 20883 22241 23763 29408 30235 32546 26616 19712
9723 19712 10762 10110 12351 12293 13845 16529 17793 22840 24763 28650 29023 30685 29122 24238 19397 19391
9707 19391 23719 24681 19712 17586 20839 24524 21913 22889 23538 21810 24817 22444 20300 16064 11397
9692 11397 11758 15645 17722 17904 19360 25025 19378 19701 21637 20171 21190 21983 20618 16182 12061 13438
9676A3438K858R97k243L099J595k201L985K193k205l291j6l315M09k15K342K686
9660B0116K496P59L103j431j495l530l98Q67K21j0n533J455K899J945m287l523
9644A3654J870j088M432K139j074L414O53o98p712R3j398m649j53L14M831q51
9628A3777k368M578J724l03m398j112p50n99M28K788N307J370n976j507L015K104
9612A8078K52J803N602k96n11n108k115m974j969L165O249J496J479r17o705j347
9596A4182O81l780j162K838k29j280N982j793l033l182J641k84L135L836M065
9581B1617r14M99J249k470n939j787N001M064p540k099M272N595R61j934j82J124
9565B1517p07k656j997q18K198m37n137K500Q54l545N672Q81m971J754J306J666
$$ plain form
9676 13438 16296 17293 15050 18149 19744 17543 21528 23721 21516 18225 18209 14894 15303 15088 17430 20116
9660 20116 22612 23371 26474 25043 23548 20018 19620 20487 20708 20698 15165 16620 19519 21464 17177 13654
9644 13654 15524 14436 18868 21007 19933 23347 24000 23302 15590 15683 14285 9636 9483 9797 14628 13777
9628 13777 11409 15987 17711 17408 13010 11898 11148 10549 10977 13765 19072 20442 14466 12959 15974 18078
9612 18078 18330 20133 25735 25439 24928 19820 17705 12731 10762 13927 20176 21672 23151 22234 15529 14182
9596 14182 14863 11083 9921 12759 12530 11250 17232 15439 12406 9224 10865 10581 13716 17552 21617
9581 21617 20703 21202 22451 19981 14042 12255 17256 21320 13780 11681 15953 21548 22509 20575 20393 21517
9565 21517 20810 18154 16157 15339 17537 17100 11963 14463 15317 11772 17444 18325 13354 15108 16414 18080
9549A8080L457P69l583n513k385L169K137M402q21p246p586k94L853K469N692
9534A6600L75n520m983M41J947P729K545k883M56k032o08M066O23l381n010O7
9518A0432N660K403o501k564K20M20j013J284M274j904p798Q0J78J26J995N13
9502G805l35j881m537m96P92K975n65k317J237m713M230L515L833J854P839J756
9486B0992p170o135n444j342L638M341J925q33j077P87N920n419j138J156m254
9471E947n667m926N98O54m404M491L212k725J732N602j028l807O219J294k948
9456D244k78J915O59l05J653j709k082k382l592j858j239j736M7k908L168O559
9440A56L521j461k235j529J204L028R35n093j152k743m36J346O225K353L713m01
$$ plain form
9549 18080 21537 22306 18723 13210 10825 13994 16131 20533 19712 12466 4880 4586 8439 10908 16600
9534 16600 16975 11455 6472 6913 8860 16589 19134 16251 16707 14675 14067 18133 18756 15375 10365 10432
9518 10432 16092 18495 11994 9430 9650 10070 9057 10341 14615 12711 4913 4993 5171 5297 7292 7805
9502 7805 7470 5589 1052 556 1348 4323 3758 1441 2678 -2035 2195 5710 9543 11397 19236 20992
9486 20992 13822 7687 2243 901 4539 8880 10805 9972 8895 9682 15602 10183 9045 10201 5947
9471 5947 280 -4646 -4048 -3394 -7798 -3307 -95 -2820 -1088 4514 3486 -321 5898 7192 4244
9456 4244 3966 5881 6540 6235 7888 6179 4097 1715 -1877 -3735 -4974 -6710 -6663 -9571 -6403 156
9440 156 3677 2216 -19 -1548 -344 2684 3619 -1474 -2626 -5369 -5805 -4459 1766 4119 7832 7431
9424G431l148l351k392J608N994j276k03k306l368J858K163j218l716j076l617
9409f617M72J976M083n87K588k33J857L025K822l488K187J2k766m206j179J074
9393A020o87j662j562J212l260k102M810Q421N723j582j346j394k701k599K320
9378D611L540K85m735n571K916Q341P67k341j087K216m030j607M914o55k754j83
9362D627j197l896n0l712N84N369M612j072l615l200K645R45j121k666J080L08
9346c59L649K26O3M744l4L96j150l338l20l36k694m28P34J745L692J186l686l001
9328A089k64J087L91M84k562K471M138J400l286n41K104k318j795j835K063l39
9312B287J53J890K843L152K302l039l445p0j52L350L027j30k727J732K024j475
$$ plain form
9424 7431 4283 932 -1460 148 6142 4866 4663 2357 -1011 847 3010 1792 -1924 -3000 -6617
9409 -6617 -6145 -4169 -86 -673 1915 1682 3539 6564 9386 5898 8085 8097 5331 1125 -54 1020
9393 1020 333 -1329 -2891 -1679 -4939 -7041 -2231 6190 11913 10331 8985 7591 4890 2291 4611
9378 4611 8151 8436 3701 -1870 1046 9387 10154 7813 6726 8942 4912 3305 8219 7564 4810 4627
9362 4627 3430 -466 -516 -4228 -3644 1725 6337 5265 1650 -1550 1095 2040 919 -1747 -667 -359
9346 -359 3290 3516 3579 8323 8289 8685 7535 4197 3877 3541 847 419 1153 2898 6590 7776 4090 1089
9328 1089 825 1912 2303 2787 225 2696 6834 8234 4948 4407 6511 4193 2398 563 2626 2287
9312 2287 2440 4330 7173 10325 12627 9588 6143 6073 5921 9271 12298 12168 9441 11173 13197 11722
9296A1722q7J861J220M469rl92l094m922m518J593L222J946J952L365j490k791
9280A4047m620L352K182l171N663N194j049n524k185L073m17m089K994Q92n012
9265A1330l465j451r5K87L437J1243M248L975K817J073K150l786p668p789kr34
9249A5370K699J20N2L923J533K018j426p0k142j113Jl850R0k08p79P17J968p320
9231A1583m55J49k609j754M534J538M782J434k110R67J976k99K424k21l202l348
9215A5389j937O237M862k430l475l897k471J106Q38l974l505k52M578K500K201
9200A5770L754j386O300J218K436L393Q08m495q66O50k827k086O40j951k139M144
9184B3363P4k845r8L911l91l772j850j564L39P56L772k41l138l906o23K581J005
$$ plain form
9296 11722 11635 13496 14716 19185 19176 18784 15690 10768 6250 7843 11065 13011 14963 18328 16838 14047
9280 14047 9427 12779 14961 11790 17453 22647 21598 16074 13889 16962 16545 12456 15450 16342 11330
9265 11330 7865 6414 6319 6606 10043 21286 25534 29509 32326 33399 35549 31763 24095 16306 16304 15370
9249 15370 18069 18189 18241 22164 23697 25715 24289 24219 22077 20964 20965 17115 17205 16997 16218 16935 18903 11583
9231 11583 11128 11277 8668 6914 11448 12986 17768 19202 17092 18059 20035 19736 22160 21939 18737 15389
9215 15389 13452 19689 24551 22121 18646 14749 12278 13384 14222 10248 6743 6491 11069 13569 15770
9200 15770 19524 18138 24438 25656 28092 31485 32293 27798 26932 27582 24755 22669 23309 21358 19219 23363
9184 23363 23437 20592 20494 24405 24014 20242 18392 16828 17167 17923 21695 21454 18316 14410 13787 16368 17373
9167A7373J907N793k787J340K737m816N78n447j836J880M72K325q62o26J501O85
9151B0217l070J232J792N49K132P1L519j0K797l114k92j67l206k203J51l236l35
9134A6827j94N52P004q12M21k050j175J105M490N992K411l767l581m056N909M14
9118B9490N32K258j213K227J338J156L77n81J019L457l644k376O142M80J550j618
9102D0594n095J53M815Q018M873M773L177m14M68R84l030n382q737o754k451k808
9086C3184m34L266p70l053k74N283j075J359N65k49l827J22o44K541k086l069
9070C0839p60J052L835J050k57j96N254O028p21k672j285M766M039M248j153J784
9054E5851Q309J1588J3967J7390K2331J8726J1392L361o3j4687j6016k0778k0284
$$ plain form
9167 17373 19280 25073 22286 23626 26363 21547 22125 16678 14842 16722 17194 19519 18657 18031 19532 20217
9151 20217 17147 18379 20171 20720 22852 22923 26442 26432 29229 26115 25823 25656 22450 20247 20398 17162 16827
9134 16827 16633 17185 24189 23377 23798 21748 20573 21678 26168 32160 34571 30804 27223 23167 29076 29490
9118 29490 30022 32280 31067 33294 34632 35788 36165 35584 36603 40060 36416 34040 40182 40662 42212 40594
9102 40594 35499 35652 40467 48485 53358 58131 61308 60894 61362 62346 59316 53934 45197 38443 35992 33184
9086 33184 32750 36016 35246 32193 31919 37202 36127 37486 38051 37802 33975 34097 33453 35994 33908 30839
9070 30839 30079 31131 34966 36016 35759 35563 40817 46845 46124 43452 42167 46933 50972 55220 54067 55851
9054 55851 64160 75748 89715 107105 129436 148162 159554 162915 162852 148165 132149 111371 91087
9041I1087j3223j0161j0620j961j612l40J275l858J247j125k199k860j080J824
9027D6394m8N358J961l069N2M82k312K39l0k902L701N122J665M31o215n213J521
9010D7137J0266M677M312N428M126J0912J3365K1776J6552J8438J8193M460j4692
8997A64950k4154j8453j2453j5083j3422o146m874k359j799j765J148j1016m125
8984E0449J671j281J699J529l38k117k913N7J344k900n3q95O56n91l572Q9n108
8967C7726O37N865k94m67L087J026k189L90K471J763J221L843N860J0039J0730
8952H1708O227l364o705j2257o596k616l767J96M195Q2m021o982P0O031K879N59
8936E5639L650N447K852L644L066l981J019k169m837m279p746k878q480o586Q85
$$ plain form
9041 91087 77864 67703 57083 55122 53510 53170 54445 50587 51834 50709 48510 45650 44570 46394
9027 46394 46346 51704 53665 50596 50648 51130 48818 49057 49027 46125 49826 54948 56613 57044 50829 45616 47137
9010 47137 57403 62080 66392 71820 75946 86858 100223 121999 138551 156989 175182 179642 164950
8997 164950 140796 122343 109890 94807 81385 75239 70365 68006 66207 64442 65590 54574 50449
8984 50449 52120 50839 52538 54067 53729 51612 48699 48756 50100 47200 47147 46252 46908 46317 42745 42834 37726
8967 37726 38363 44228 43934 43467 46554 47580 45391 45781 48252 50015 51236 55079 60939 70978 81708
8952 81708 87935 84571 77866 65609 59013 56397 52630 52826 57021 57103 53082 46100 46170 52201 55080 55639
8936 55639 59289 64736 67588 71232 74298 70317 71336 69167 64330 60051 52305 49427 40947 34361 35246
8921C5246R461J3507O981J447m292k536l061l760m666L381m20M709Q086J709k484
8906F3308J80j953l865j2381o333l433n009k318Q90J652l998L499J2747Q709J149
8891E2844m418r92k784o527J136j02K708N602L925l65J230j530k492M94j015q833
8875C8881o088M86j62n694l096L905J096k207L46O308O71R57J328N351N894K08
8859D8184k556m883k609l882m815l691L78M489N653N593l38m848l460l124K936
8844C3027J251k394J594J993J199K310K867J838K02K337J050L864j026o502p463
8829C6147J247L929J814m908l175k925J210J257O691K54k119J038k20K102k99
8814D2043j23K980p19n006j47j927k172n461L071K531k572q88l107Q18K417l845
$$ plain form
8921 35246 44707 58214 65195 66642 62350 59814 56753 52993 48327 51708 51288 55997 64083 65792 63308
8906 63308 63488 61535 57670 45289 38956 35523 30514 28196 29086 30738 26740 30239 42986 51695 52844
8891 52844 48426 47434 44650 38123 39259 39157 41865 47467 51392 51027 52257 50727 48235 48729 47714 38881
8875 38881 32793 33279 33117 27423 24327 28232 29328 27121 27467 33775 34446 35403 36731 42082 47976 48184
8859 48184 45628 40745 38136 34254 29439 25748 26126 30615 36268 41861 41523 36675 33215 30091 33027
8844 33027 34278 31884 33478 35471 36670 38980 41847 43685 43887 46224 47274 51138 50112 43610 36147
8829 36147 37394 41323 43137 38229 35054 32129 33339 34596 41287 41541 39422 40460 40240 42342 42043
8814 42043 41920 44900 44181 39175 39028 37101 34929 29468 32539 35070 32498 31610 28503 29321 31738 27893
8798B7893k443P534K063K325p57k657p383m708L820q77k576J959L669K09J297
8783B9368n921K860L443k315j748l773J75o64J080K384m13k463L84M72J359Q74
8767B5102j569L762J57p108r21M425L071M458k29r704k499R45K719p04J634O436
8751B9975M275M80m293L412R701Q748J852J533N484J0054J4872K2624L4707M1813
8737A85237N2859L8221J3289j7810m0354m9210l9449k8031k0439q104q964m489
8725G2756k799k779m857k697J699K934k962n147l497k39j567Q51m87m47N601L269
8709E9632j8N899O472O815J078n493o439r176P80m113o6L567K91o429N077m96
8693E7381q999p003N149q25m713j734m652n12L044L721K947L212j885o75m110
$$ plain form
8798 27893 25450 32984 35047 37372 36615 33958 26575 21867 25687 24810 22234 24193 27862 28071 29368
8783 29368 23447 26307 29750 27435 25687 21914 22089 21425 22505 24889 24476 22013 22397 22869 24228 25102
8767 25102 23533 27295 27452 20344 19423 23848 26919 31377 31148 21444 18945 19890 22609 21905 23539 29975
8751 29975 34250 34730 30437 33849 43550 52298 54150 55683 61167 71221 86093 108717 143424 185237
8737 185237 238096 276317 289606 271796 231442 182232 142783 114752 94313 86209 77245 72756
8725 72756 69957 67178 62321 59624 61323 64257 61295 56148 52651 52412 50845 51696 51209 50762 56363 59632
8709 59632 59614 65513 71985 78800 79878 74385 67946 58770 59550 55437 55371 58938 59229 52800 57877 57381
8693 57381 48382 41379 46528 45703 40990 39256 34604 34092 37136 40857 43804 47016 45131 44456 40346
8678D0346Q57L301J478j674o68J247k284n030q008J294P546l29k715K812l41l265
8662C4567o93O296M426o12o34j726M512K165L837O925k29l305m650J590j236j438
8646D9795J765k197J79L271k597k140K040K556J593K609M112j015j94l447l286
8631E3044k013l930R59O12K625r37j958o16K051j521M0L358L201q84j523l926
8615D8582q44O63M632J938L815N952L605L98O694L912L530O945P797l620J2188
8600A06187K3109L3908N8087O7004O3595L1211m6099p7752o5793l4814k1742j3328
8588A23573q421m486K8o055l317P7M095J107k54K815Q603M225R03L42L833m28
8572A26640R70L02l503P04m91M699j123l357J484q51n041m070M221P842Q291J4577
$$ plain form
8678 40346 41203 44504 45982 44308 43640 44887 42603 37573 29565 30859 38405 38076 35361 38173 37832 34567
8662 34567 33874 40170 44596 43984 43350 41624 46136 48301 52138 59063 58834 55529 50879 52469 51233 49795
8646 49795 51560 49363 49542 52813 50216 48076 50116 52672 54265 56874 60986 59971 59777 56330 53044
8631 53044 51031 47101 48060 48672 51297 50360 48402 47786 49837 48316 48356 51714 54915 54031 52508 48582
8615 48582 47738 48401 53033 54971 58786 64738 68343 68741 75435 79347 82877 89822 97619 93999 106187
8600 106187 129296 163204 221291 288295 351890 383101 337002 259250 193457 158643 136901 123573
8588 123573 115152 110666 110694 104639 101322 101399 105494 106601 106347 109162 117765 121990 122893 123235 127068 126640
8572 126640 127610 127912 124409 125113 124622 129321 128198 124841 126325 125474 120433 116363 120584 128426 136717 151294
8556A51294J9445L8525O0553R8129J34251J42214R0595o1876j61149j32939q2968
8545B96074n3123l4817k5237k1699j5828r624n999o945p90k914r301j0142o345
8532I3310l884m671k460J075n890n388J012j741m273K971j212q84k140m803N13
8517F1535L248K463J641M575K890K171Q856J6873K3681L6233O0845P1275N1133
8504C47419m996o4693o6566m5902l3104j6775j0100r304p354k997n66k674o085
8491G6303L21M414P158K346l380j704p427n914M40l980n319l961j69N605J0790
8476G5523J0859J7318J3398J0428N731j0396r990j2071r530o157P28o521o00K456
8462H1176m9k316q74O624J1316K0334K5936L2650N4696P3200P6201N0577k069
$$ plain form
8556 151294 170739 209264 269817 367946 502197 644411 735006 673130 511981 379042 296074
8545 296074 242951 208134 182897 161198 145370 135746 129747 122802 122012 119098 109797 99655 93310
8532 93310 89426 84755 82295 83370 77480 72092 73104 71363 67090 70061 68849 67965 65825 61022 61535
8517 61535 64783 67246 68887 73462 76352 78523 87379 104252 127933 164166 225011 296286 347419
8504 347419 342423 277730 211164 165262 132158 115383 105283 95979 88625 85628 85062 82388 76303
8491 76303 76624 81038 88196 90542 87162 85458 78031 72117 72557 68577 63258 59297 59128 64733 75523
8476 75523 86382 103700 117098 127526 133257 122861 112871 100800 91270 85113 85841 79320 78720 81176
8462 81176 81127 78811 77937 84561 95877 116211 142147 174797 229493 302693 378894 429471 427402
8449D27402n9661p4905n9112m3663k9887j4148o770N565O459L090m561j3218j3427
8436A23164r669o671k738L933l548n963o392p908o385m773pj491m856j037k859
8421F2800L020k077n11J9m889J149k552K477q62k11M698J278K830j19p171q913
8405E0966l516j464l681j59o46Q3M014L27j244J138J488M317K668l25o27n092
8389D8247q495l229L777J534N17N37k983k855n161j026O505N750P449O925Q330
8374F5822J7368K1445K023j3335j8042j2952j1587l736m33p948j009J596n433
8361C3779P892O630P434Q617M103J3043R644J826N428j446o734p072n5J2290J9071
8346A14450K5800L5346M6902N4520N4092K7403j2468m1889n4076n4671m1851k5828
$$ plain form
8449 427402 367741 292836 233724 190061 160174 146026 139256 144821 151280 154370 149809 136591 123164
8436 123164 113495 106824 104086 108019 104471 98508 92116 84208 77823 73050 73043 71552 66696 65659 62800
8421 62800 65820 63743 63232 63251 58362 59511 56959 59436 58574 58363 63061 64339 67169 67050 59879 50966
8405 50966 47450 45986 42305 42146 41500 41583 45597 45924 44680 45818 47306 51623 54291 53966 53339 48247
8389 48247 39752 36523 40300 41834 42351 42888 39905 37050 31889 30863 37368 43118 50567 57492 65822
8374 65822 83190 104635 106658 93323 75281 62329 50742 47006 46573 38625 37616 39212 33779
8361 33779 41671 48301 55735 64352 68455 81498 91142 92968 98396 96950 90216 83144 83089 95379 114450
8346 114450 140250 175596 222498 277018 331110 358513 346045 304156 250080 195409 153558 127730
8334A27730j4667j0779j1706j4558r292q329k612N246j705o601J138o48p062o10
8320D5545K364O498n191r810J23P1k747j213K84k425k701k666m94J980M945O551
8304D1114m029n751J108j106k393L898M629n857p30j402l282n019K722L794j623
8289B6073P95K639j897j820m674J864L46k030j352L207K356L924j554k761J146
8274B6262M11J293j183l6K206l233m682q795m633K034R55J222J327l278j368k551
8258E951l567L076P437N532j939o821N84Q169J823j359n284L042N621j391l535
8243A7339j211j426o785j413K24j358q14J999K080L857j734n814k161N639L311
8228A1733M961l277Q254P717k571j906n329n654o986K566R34k057K060j3N94K921
$$ plain form
8334 127730 113063 102284 90578 76020 66728 58399 55787 61033 59328 52727 53865 53217 46155 45545
8320 45545 47909 54407 49216 39406 39529 39600 36853 35640 35924 33499 30798 28132 27638 29618 34563 41114
8304 41114 37085 31334 32442 31336 28943 32841 37470 31613 30883 29481 26199 21180 23902 27696 26073
8289 26073 26868 29507 27610 25790 21116 22980 23326 21296 19944 23151 25507 29431 27877 25116 26262
8274 26262 26673 27966 26783 26747 28953 25720 21038 12243 7610 9644 10599 11821 13148 9870 8502 5951
8258 5951 2384 5460 12897 18429 16490 9669 10253 18422 20245 18886 13602 16644 22265 20874 17339
8243 17339 16128 14702 7917 6504 6728 5370 4556 6555 8635 12492 10758 4944 2783 8422 11733
8228 11733 16694 13417 21671 29388 26817 24911 19582 13928 6942 9508 10442 8385 10445 10432 11026 13947
8212A3947M672L80l113k658K64l05l455J823K667j487n584k3m586p968K526Q172
8196E272N163m932J975M834L235J1k013N631m374m313l231p71K793M708l402k823
8180G763L760J269n532j893L335J482Q09J938K865m39n521n396l510O985J307
8165I222L57J120r87l24J971K634l110l600K962K834J506m88k325m7l834n42K041
8148I390j242o293j378K46P95k658m40J495n15k379Q18K146M66k473j64J882M762
8131D458n97J31P43n16k176Q89j966m81O635L029J692K271m069p095P566N178
8115A5692L709j028n908j246r76J983q53l848J87N162n94j619M683K030l136L480
8099A7718J340J822m98j459Q43k140k337K516K991R5j923o228k702O005n40k875
$$ plain form
8212 13947 18619 18999 15886 13228 13492 13187 9732 11555 14222 12735 7151 7128 2542 -5426 -2900 5272
8196 5272 10435 5503 7478 12312 15547 15558 13545 19176 14802 10489 7258 6487 9280 13988 10586 7763
8180 7763 11523 12792 7260 5367 8702 10184 10993 12931 15796 15357 9836 4440 930 7915 9222
8165 9222 9579 10699 9712 9388 11359 13993 10883 7283 10245 13079 14585 14097 11772 11725 7891 7349 9390
8148 9390 8148 1855 477 723 1518 -1140 -1580 -85 -600 -2979 -2161 -15 451 -2022 -2186 -304 4458
8131 4458 3861 3992 4735 4219 2043 2932 966 485 7120 10149 11841 14112 10043 2948 10514 15692
8115 15692 19401 18373 12465 11219 10243 12226 11373 7525 7712 12874 12280 10661 15344 17374 14238 17718
8099 17718 19058 20880 20382 18923 19766 17626 15289 17805 20796 20891 18968 12740 10038 16043 15503 12628
8083A2628j767J09j535j475l695K719N171R325M021K84j996q694l687m4N558J746
8067A8668k402k515l105r85J569J320j61L418K750M559M827l8K981K262J727N446
8051D0321K147L4J860l442k602L723o291q674k686j137L610l58J389J944L96L842
8035C4076P998J2940Q133P701N206N433R347J727n567m089k26K760J141K38l064
8020H3754n764m833o714n254l130m065l096K165L225L424J447k03R555R222L464
8005H3197l000n24M550L626M356k036n938j847O042P402K859N169N889J0580J0935
7990A31260P953P231M050j132j079J1312J6214O282J713o559l974N33J0219K2810
7976B06833L3117L4759L0437J6283j3499k5495k5351k2936j3731p832n719j6894
$$ plain form
8083 12628 10861 10970 9435 7960 4265 6984 12155 21480 25501 25785 23789 15095 11408 11364 16922 18668
8067 18668 16266 13751 10646 9661 11230 12550 12389 15807 18557 23116 27943 27905 30886 33148 34875 40321
8051 40321 42468 42502 44362 40920 38318 42041 35750 27076 24390 23253 26863 26505 27894 29838 30234 34076
8035 34076 42074 55014 63147 70848 76054 81487 90834 92561 86994 82905 82679 85439 86580 86818 83754
8020 83754 77990 73157 66443 61189 58059 53994 50898 53063 56288 59712 61159 60956 70511 79733 83197
8005 83197 80197 79673 84223 87849 92205 90169 84231 82384 88426 95828 98687 103856 109745 120325 131260
7990 131260 139213 146444 150494 149362 148283 159595 175809 182091 183804 177245 173271 173804 184023 206833
7976 206833 239950 274709 305146 321429 307930 282435 257084 234148 220417 212585 206866 189972
7964A89972j3784j3686j1540q895l879o476m574N436P377N098M242j655q653j0062
7950A28921q434m640J160O807O935J657J853q75J94N94m660n780J183Q78k393
7935A23400l88r17P243J3048K3037M0441N4595O3642O8213N3409K364l3138n1233
7922C63716n0982m1692l2431k8187k2475j6159j0603n721o521q190k240n510j2142
7909A20863j4650m720l731l410k570n673m724m266l40n405j0269l324K621j807
7895E8595L733M765j438l8m927j648J241M880m681M103J4567J0751J2553J8778
7881A21234K2246K2039K1212O453p980r870j9872k0603k2096j2720q983j0836
7869H0224n897m987k212j134K018m288l954n969n416p492p337p28J034N359K32
$$ plain form
7964 189972 176188 162502 150962 142067 138188 131712 127138 132574 139951 145049 149291 147636 138983 128921
7950 128921 120487 115847 117007 123814 130749 132406 134259 133384 133578 134172 129512 123732 124915 125793 123400
7935 123400 123012 122095 129338 142386 165423 205864 260459 324101 392314 445723 448087 414949 363716
7922 363716 312734 271042 238611 210424 187949 171790 161187 155466 148945 140755 138515 133005 120863
7909 120863 106213 101493 97762 94352 91782 86109 81385 77119 76779 71374 61105 57781 60402 58595
7895 58595 62328 67093 65655 65617 60690 59042 60283 65163 60482 64585 79152 89903 102456 121234
7881 121234 143480 165519 186731 193184 185204 175334 155462 134859 112763 100043 91060 80224
7869 80224 74327 69340 67128 65994 68012 63724 59770 53801 48385 40893 33556 32828 33862 39221 39453
7854C9453j512n638j986P091J230m69J867k571k473p399k047K248r73j609n048
7839B0164j221J654K108P257Q432J654m762n531k272n52J118k935j27L560l714
7824B4833n804p47K510P44L538K142K58j499l42k695j097l991k706k799r86K146
7808A3505j978j405L967j891M22j598M785L396K764n93n912j678j652j9M524l898
7792A2739k603j805p81K906L269J818o344k172n361M43N509O176j572L95k686
7777I931K334K068J788P96R87m272k78J627m788m160J138M774m396Q04l214l455
7761A684l642M432Q357j370J033l044j958Q95l611l200k05M416K480K577K927
7746A1771K071n61q002j868O55j986K626J075k934p860j198Q319K000K334M238
$$ plain form
7854 39453 37941 32303 30317 37408 38638 38169 40036 37465 34992 27593 25546 27794 26821 25212 20164
7839 20164 18943 20597 22705 29962 38394 40048 35286 29755 27483 26931 28049 25114 24987 28547 24833
7824 24833 19029 18282 20792 21536 25074 27216 27474 25975 25633 22938 21841 17850 15144 12345 11359 13505
7808 13505 11527 10122 14089 12198 12620 11022 15807 19203 21967 21374 15462 13784 12132 12113 16637 12739
7792 12739 10136 8331 7550 10456 13725 15543 9199 7027 1666 2109 7618 13794 12222 12617 9931
7777 9931 12265 14333 16121 16917 17904 13632 13354 14981 10193 6033 7171 11945 7549 8353 5139 1684
7761 1684 -1958 2474 10831 9461 10494 7450 5492 6387 2776 -424 -629 3787 6267 8844 11771
7746 11771 13842 13281 5279 3411 4066 2080 4706 5781 2847 -5013 -6211 2108 4108 6442 10680
7731A0680J938j343o736l458l44J580M117O18k929k291l825j985N736Q01k762
7716b03K811m29k901L21J757K648l091n414n79J639M084k955j686k911r642J88
7700a6363N312M595N616k26n0K779J866O99K221o30k732p58J734R42n293q86L711
7683B537O74o174p74j353N1L939K148j017o32M533R34K713l216l376J389K066
7667D442J859r74L692k75o576r42l98l96l936L840L43r8k104Q75j714j502j776
7650e640M52O9n423j041L944L656K219J688j545M0P259j772m135K99O13k192m265
7633e774k467k362N619P753J295J66l357k033j248m590J217M174J264k886L827
7618E98J841m681J610J009Q76K620n540j821j010n31p66k399J044n849J083J0208
$$ plain form
7731 10680 12618 11275 4539 1081 737 2317 6434 7052 4123 1832 -1993 -3978 1758 2559 -203
7716 -203 2608 2179 -722 -401 1356 4004 913 -4501 -5080 -3441 643 -2312 -3998 -6909 -16551 -16363
7700 -16363 -11051 -6456 -840 -1066 -1116 1663 3529 4228 6449 5819 3087 2329 4063 5005 -288 -1174 2537
7683 2537 3211 -2963 -3737 -5090 -5039 -1100 1048 31 -601 3932 4866 7579 4363 987 2376 4442
7667 4442 6301 5327 9019 8744 2168 1226 828 432 -3504 336 679 581 -1523 -648 -2362 -3864 -5640
7650 -5640 -5188 -5119 -10542 -11583 -7639 -3983 -1764 -76 -1621 -1581 5678 3906 -229 70 683 -1509 -5774
7633 -5774 -8241 -10603 -4984 2769 4064 4230 873 -1160 -2408 -6998 -5781 -1607 -343 -3229 598
7618 598 2439 -2242 -632 377 1253 3873 -1667 -3488 -4498 -5029 -5795 -8194 -7150 -12999 -11916 -1708
7602a708K065n4qK447n64n213r3R05k540k171p97J19K779l249K191O810k76j338
7584f95n36K689j542l228J23k288k396k09L177M325j991l729L699M183K283k075
7568A790n458k551p89L670M336M118l797m524k32R18l700J292N53J412k584L302
7552b244J892j688r45N31l748n34k779K653R112P69J077j077k518m364l410l23
7536g596L693K066J694J826R929J156q611J112p439O45L247M11l358p97J727j725
7520b020K55Qk300J78j183L873M241k105k247Q32j294k261k7k222l570m40P87
7503i495K03J999o61L716L771L600j223J217N425O671j249j496M445r58n594p796
7487B575n461p801l573n419P22R667J0406Q12o328q92l0k54K183O86J974J069
$$ plain form
7602 -1708 357 303 295 2742 2178 -3035 -3128 -2223 -4763 -6934 -7731 -7612 -4833 -8082 -5891 919 643 -695
7584 -695 -1231 1458 -84 -3312 -3189 -5477 -7873 -8082 -4905 -580 -2571 -6300 -2601 1582 3865 1790
7568 1790 -3668 -6219 -7008 -3338 998 5116 1319 -3205 -3437 -2519 -6219 -4927 -4374 -2962 -5546 -2244
7552 -2244 -352 -2040 -2985 -2454 -6202 -6736 -9515 -6862 2250 3019 4096 3019 501 -3863 -7273 -7596
7536 -7596 -3903 -1837 -143 1683 11612 12768 4157 5269 -2170 -1525 1722 2133 -1225 -2022 -295 -2020
7520 -2020 -1765 -1757 -4057 -3879 -5062 -1189 3052 947 -1300 -468 -1762 -4023 -4050 -6272 -9842 -10282 -9495
7503 -9495 -9292 -7293 -7954 -4238 -467 3133 1910 3127 8552 15223 13974 12478 16923 15965 10371 2575
7487 2575 -2886 -10687 -14260 -19679 -18957 -9290 1116 1928 -4400 -5292 -5322 -5576 -3393 -2707 -733 336
7471C36O93J229p599q09R498Q929J175k997l63j961j140k547l290o316J560K994
7455f08L073j700l868j814O339J038J555o29n696m638L271O963N512o824L621
7440E595Q298L5p41n60j758j413k909m115m036J367K861k761j173k092K531M598
7424C727m573q87J572N691K891j532k869M27Q32k317n646n25M80Q7M237j859n398
7407e662m542k24O054K822j78K278J523n533J944K326k792k324j39L54p580Q237
7391c436L583K143o258l494K64j564m49L775k306J25O904N886J06m742j87K280
7375B630n548p994J193J334N01j473j845K51M921P059o50j751j800l629J840J917
7359c044j858n516J398N41J68K523L431J244P28k792j41k951J921K924J469O31
$$ plain form
7471 336 1029 2258 -5341 -6150 3348 12277 13452 10455 10092 8131 6991 4444 1154 -5162 -3602 -608
7455 -608 2465 765 -3103 -4917 1422 2460 4015 3386 -2310 -6948 -3677 3286 8798 1974 5595
7440 5595 13893 13928 13187 12627 10869 9456 6547 2432 -1604 -237 2624 -137 -1310 -3402 -871 3727
7424 3727 -846 -1733 -161 5530 8421 6889 4020 4447 5279 2962 -2684 -3209 -2729 -2642 1595 -264 -5662
7407 -5662 -10204 -10428 -4374 -1552 -1730 548 2071 -3462 -1518 808 -1984 -4308 -4447 -4093 -11673 -3436
7391 -3436 147 2290 -3968 -7462 -7198 -8762 -9211 -5436 -7742 -7617 -713 5173 5279 537 350 2630
7375 2630 -2918 -10912 -9719 -8385 -7884 -9357 -11202 -10951 -6030 1029 379 -1372 -3172 -6801 -4961 -3044
7359 -3044 -4902 -10418 -9020 -8479 -8311 -5788 -2357 -1113 -385 -3177 -3318 -6269 -4348 -1424 45 676
7343F76n450l637k439J443L728j790o351K420m5j741L643Q385L274j519m2k49
7327C06p18q63Q71l927o816K034P46j920K334L131j759j497M494J006K472l787
7311c893r67m39J393P21K01o002q63Q60L273L514k95k689J457J603m710j137k580
7294a0553Q50M306Q46L602N959J386j290l175k512o76l792l606j960N494j13m26
7278e660l189j503K539r13K009O012l709k990l104K287L157J34k678K457J472
7263c679o08l72K648k48q43R76k719j867L056k247L783M031j835o73j538k385
7247d520n90N062j2k241K205k309q38n300m098J947N944M913j725m86J75M293
7231B420O15k64K635m660n339m534m322P953P693K310L655l093p128n681N561
$$ plain form
7343 676 -4774 -8411 -10850 -9407 -5679 -7469 -13820 -11400 -11445 -13186 -9543 -1158 2116 597 555 306
7327 306 -412 -1275 -404 -4331 -11147 -9113 -8367 -10287 -7953 -4822 -6581 -8078 -3584 -2578 -106 -3893
7311 -3893 -4860 -5299 -3906 -3185 -2984 -8986 -9849 -8989 -5716 -2202 -2497 -5186 -3729 -2126 -6836 -7973 -10553
7294 -10553 -9703 -5397 -4551 -949 5010 6396 5106 1931 -581 -1257 -5049 -8655 -10615 -5121 -5234 -5660
7278 -5660 -8849 -10352 -7813 -8726 -6717 -705 -4414 -7404 -10508 -8221 -5064 -4930 -7608 -5151 -3679
7263 -3679 -4287 -4659 -2011 -2259 -3102 -2126 -4845 -6712 -3656 -5903 -2120 1911 76 -597 -2135 -4520
7247 -4520 -5110 -48 -60 -2301 -96 -2405 -3243 -8543 -12641 -10694 -4750 163 -1562 -2048 -1873 2420
7231 2420 3035 2771 5406 746 -4593 -9127 -13449 -5496 2197 4507 8162 5069 -2059 -7740 -2179
7216b179N233L322j190q0m152J205j957N9O83m207j252j766j682j801M495m029
7200i298k17N796L138l965j867j066j766j198O262P810L920l591J80Q18m575k817
7184b436n102K564N103o456r486O131Q351K372m300l566K693M017k629J942M134
7169C332K616n672o235J830L042K113m598m236k536j31L697K173L597j324k14
7154b546M307n24p010k194J345M543K875L076J083J419j453K594Q99K243q054
7139B603j1777p294l353J33j474J0655P109M439n46L429M485j027l439o235l639
7124e931J692l486k083L20n141l342L077J247J062N706J578K415M139k732n014
7109f493j750l171K272K495J830J347k13k419l921K211J653k689J031M90K447
$$ plain form
7216 -2179 3054 6376 5186 5106 954 2159 202 261 944 -3263 -4515 -6281 -7963 -9764 -5269 -9298
7200 -9298 -9515 -3719 -581 -4546 -6413 -7479 -9245 -10443 -4181 3629 7549 3958 4138 4956 381 -2436
7184 -2436 -7538 -4974 129 -6327 -15813 -9682 -1331 1041 -3259 -6825 -4132 -115 -2744 -802 3332
7169 3332 5948 276 -5959 -4129 -1087 1026 -3572 -7808 -10344 -10475 -6778 -4605 -1008 -2332 -2546
7154 -2546 1761 1237 -5773 -7967 -6622 -2079 796 3872 4955 6374 4921 7515 8414 10657 2603
7139 2603 -9174 -16468 -19821 -19688 -21162 -10507 -3398 1041 495 3924 8409 7382 3943 -2292 -5931
7124 -5931 -4239 -7725 -9808 -9488 -14629 -17971 -14894 -13647 -12585 -6879 -5301 -2886 1253 -1479 -6493
7109 -6493 -8243 -11414 -9142 -6647 -4817 -3470 -3683 -6102 -10023 -7812 -6159 -8848 -7817 -7327 -4880
7094d880p63L240L006j658l047k725J194N608N757K57j272m581k798%j066r93
7078d721K124k245l356j207n29L60M27J524O00O044k06l119J177K707n812m283
7062a0515K581L894j308m413J693K570J319l132k182J546N312m729J773J500n245
7047i336L146L197k208o792K888M455J574l387j203L546L028M76k711l642R49
7032f020L881K671j480j660j171J7J967m038k544J000M527K675J367j628k299
7017b735L385M970K349j740j0870j255j282j44O82L924j745k40K293l661k66J501
7001d834K330Q03J838M401o24p055P6L27K482m916n539K450l994J01L254J665
6985g235m467J352K91j575j57L320N718O022m20o232l494K279J412j730m079k194
$$ plain form
7094 -4880 -5643 -2403 603 -1055 -4102 -6827 -5633 -25 5732 5989 4717 136 -2662 -2662 -3728 -4721
7078 -4721 -2597 -4842 -8198 -9405 -9934 -9574 -9147 -7623 -7023 -979 -1185 -4304 -3127 -420 -6232 -10515
7062 -10515 -7934 -4040 -5348 -9761 -8068 -5498 -4179 -7311 -9493 -7947 -2635 -7364 -5591 -4091 -9336
7047 -9336 -6190 -2993 -5201 -11993 -9105 -4650 -3076 -6463 -7666 -4120 -1092 -616 -3327 -6969 -6020
7032 -6020 -2139 532 -948 -2608 -3779 -3762 -1795 -5833 -8377 -7377 -2850 -175 1192 -436 -2735
7017 -2735 650 5620 7969 6229 -4641 -5896 -7178 -7322 -6640 -2716 -4461 -4701 -2408 -6069 -6335 -4834
7001 -4834 -2504 -1701 137 4538 3914 -3141 -3065 -2738 -256 -5172 -10711 -8261 -12255 -12154 -8900 -7235
6985 -7235 -11702 -10350 -10059 -11634 -11791 -8471 -2753 3269 2849 -3383 -6877 -4598 -3186 -4916 -8995 -11189
6969a1189M118J510J696J464N052J769k644Q71J195k617j663j269K254l082j217
6954c752J359K702L641P90o381J857N276J573K089n412K270M534m07m337q607
6939b805m08j44q23L995N01l797q910k822N337R37q0j417N31L45L407l30n061
6922a1544M167K735K825J871m053K568K236L143J217M017N906j944q919n751l015
6907d541k50n198m59N691L456L841M549j07o011n337l909k108K646k466j695l10
6891a2208J853M597O3l086R71N015M875l198l243M552M400J945J254n11k796k100
6875B383l339L547K994n703l893k574n80j583P08L534J639m230J350J842r2J861
6859b136l11j679Q35N156K715k149N43k151n285l092J747L432K64m272k890K98
$$ plain form
6969 -11189 -7071 -5561 -3865 -2401 2651 4420 1776 2647 3842 1225 -438 -1707 547 -2535 -3752
6954 -3752 -2393 309 3950 4740 -1641 216 5492 7065 9154 3742 6012 10546 10139 5802 -2805
6939 -2805 -3213 -3357 -4180 -185 316 -3481 -12391 -15213 -9876 -8939 -9019 -10436 -9905 -9560 -6153 -6483 -11544
6922 -11544 -7377 -4642 -1817 54 -3999 -1431 805 3948 5165 9182 15088 13144 4225 -1526 -4541
6907 -4541 -4791 -9989 -10448 -4757 -1301 2540 7089 6982 971 -4366 -8275 -10383 -7737 -10203 -11898 -12208
6891 -12208 -10355 -5758 -5695 -8781 -7810 -2795 2080 -1118 -4361 191 4591 6536 7790 7279 4483 2383
6875 2383 -956 2591 5585 -118 -4011 -6585 -7165 -8748 -8040 -4506 -2867 -7097 -5747 -3905 -3997 -2136
6859 -2136 -2447 -4126 -3291 1865 4580 2431 2974 823 -4462 -7554 -5807 -2375 -2111 -6383 -9273 -8975
6843h975L709r00K75j409L92k711k141K990L223K451L838k682J66K138J001p130
6827e765L1J098r60O273J214l089N751k70k010m731o75K49o03j752n45j4L260
6810b538M539L886l08n270n057l534K549l16l364R08K463K375m52j166P430K000
6794D145j302j366K290J174k567l632k833K987P44q297l277P3J049q60L911k13
6778g974L692K973K397j797k214M423M376m717k635l353J406J555N208P10o426
6763b376n911N2P506M481l836j062j277L23M72L187q99n66n392n826K28M137M449
6746b310K353k386M132O720j273k448l805m57N46k527j647J515k149k478k503
6731h717Q315M931n603k710L165K713j412N125Q827L813j491O59L244P564J0816
$$ plain form
6843 -8975 -5266 -6166 -5891 -7300 -6908 -9619 -11760 -8770 -5547 -3096 742 -1940 -1774 364 1365 -5765
6827 -5765 -5734 -4636 -5596 677 1891 -1198 4553 4283 2273 -2458 -3133 -2884 -3487 -5239 -5784 -5798 -2538
6810 -2538 2001 5887 5579 309 -4748 -8282 -5733 -6049 -9413 -8505 -6042 -3667 -4119 -5285 2145 4145
6794 4145 2843 1477 3767 4941 2374 -1258 -4091 -1104 -360 -8657 -11934 -11861 -10812 -11672 -7761 -7974
6778 -7974 -4282 -1309 1088 -709 -2923 1500 5876 1159 -1476 -4829 -3423 -1868 3340 4050 -2376
6763 -2376 -8287 -8235 -729 3752 -84 -1146 -2423 -2100 -1628 1559 660 94 -5298 -11124 -10896 -6759 -2310
6746 -2310 43 -2343 1789 8509 7236 4788 983 526 1072 -1455 -3102 -1587 -3736 -6214 -8717
6731 -8717 -402 4529 -1074 -3784 -619 2094 682 5807 14634 18447 16956 17615 20859 28423 39239
6716C9239J1294J0047M295o142j3434j4738n492q600m259o402k303l106n426M935
6702i2J030k525n09K532jk02k211K184J817L754N228M211m32l240L88m39l025
6685H468n988p24j286m56Q23l072l036K628J483J294J634j086j094K266L114m461
6669E07J488J205o525K298N591K168J370k614Q28k464l087k530Q64n224j662J514
6653f273O47j609J096N581R50j750j296j343K848N773m70l550k005k816j174J937
6637c454J196J597K044p079n829J858L48K965L126M495l391k561M515K438J735
6622D003j681j454M038J16q30k176j024n044J887O301j744j857k050n96P3q4l891
6605f013M861o55m231L168k274l375m128M119M405L573L76K646J363p127m229
$$ plain form
6716 39239 50533 60580 64875 58733 45299 30561 25069 16469 12210 5808 3505 399 -5027 -92
6702 -92 938 -1587 -2096 436 435 233 -1978 206 2023 5777 11005 15216 14784 11544 11932 11493 8468
6685 8468 2480 1756 470 14 837 -2235 -5271 -2643 -1160 134 1768 682 -412 1854 4968 507
6669 507 1995 3200 -3325 -1027 4564 6732 8102 5488 6316 3852 765 -1765 -901 -6125 -7787 -6273
6653 -6273 -5626 -7235 -6139 -558 392 -1358 -2654 -3997 -1149 4624 4154 604 -1401 -4217 -5391 -3454
6637 -3454 -2258 -661 1383 -5696 -11525 -9667 -9319 -6354 -3228 1267 -2124 -4685 -170 2268 4003
6622 4003 2322 868 4906 5022 4192 2016 992 -4052 -2165 4136 2392 535 -1515 -2111 -2038 -2122 -6013
6605 -6013 -1152 -1807 -6038 -2870 -5144 -8519 -12647 -8528 -4123 -550 -174 2472 3835 -3292 -7521
6590g521K850L811j393k005K532Q5l8k211n691J841N716j616n240k443R48M189
6574f186K312L101M888L713O61l492r38n125n429J393L797J388r91m473n025j799
6558a2205L864M728M60M426J306k507L394K776n846n028M981r84o341m598M567
6543g007K689K45r92M10n99L20l165M35l06K860l32l420j125L195L130o71K321
6526b012p56J43k108M154k933o271l936M333N6q1K217M465K421l126j884j190
6510f508J332m40K687K717K341r45j724p28j886k329r86j504l780M828K199Q46
6494c880J008J643K844m650k019M32J590O69k490o63j795k216L638j688l662N15
6478a0724o73L201K097J013J339K965K480k809o094l496M716K813L09j152k52
$$ plain form
6590 -7521 -4671 -860 -2253 -4258 -1726 -1641 -1679 -3890 -9581 -7740 -2024 -3640 -8880 -11323 -10375 -6186
6574 -6186 -3874 -773 4115 7828 8489 4997 4059 -1066 -6495 -5102 -1305 83 -908 -5381 -10406 -12205
6558 -12205 -8341 -3613 -3153 1273 2579 72 3466 6242 396 -4632 349 -635 -6976 -11574 -7007
6543 -7007 -4318 -4073 -5065 -4655 -5254 -4934 -8099 -7664 -7970 -5110 -5442 -8862 -9987 -6792 -3662 -4333 -2012
6526 -2012 -2768 -2625 -4733 -579 -3512 -9783 -13719 -9386 -9330 -9411 -7194 -2729 -308 -3434 -5318 -6508
6510 -6508 -5176 -5616 -2929 -212 2129 1184 -540 -1268 -3154 -5483 -6469 -7973 -11753 -6925 -4726 -3880
6494 -3880 -2872 -1229 1615 -3035 -5054 -4622 -3032 -2363 -4853 -5516 -7311 -9527 -5889 -7577 -11239 -10724
6478 -10724 -11397 -8196 -6099 -5086 -3747 -782 1698 -1111 -7205 -10701 -5985 -3172 -2863 -4015 -4267
6463d267P56k193r65K256O20J876M96j48J30P430l748J998j25p037p522k801J298
6446a1946K788O11k330L764P454M326O07o08k607O000j099n778K027N138j094
6431G253l819k916l964j008J84N99J174k415J67K159j055j016J711M73j535L214
6415g94J356L742M45M099K130M44l64r403n197K241j024l342j648J104N50N24
6399e137N38K289k29L12o48j24j651K794L49j269r279N41K332K988J169Q70K046
6382b109L035K140J087L147R0k908q026l144m18K66L2K054L488M98m977l470P90
6365h425K087Q74O81M548J10j62K579l16l383j869j200j83l192k845M625n38K507
6348d102J576k603J771K014K314Q65j322L749J378l998p368K380k92l158N66R486
$$ plain form
6463 -4267 -3511 -5704 -6669 -4413 -3793 -1917 -1421 -1569 -1439 5991 2243 4241 4116 -2921 -10443 -13244 -11946
6446 -11946 -9158 -8547 -10877 -7113 341 4667 5274 4666 2059 8059 6960 1182 3209 8347 7253
6431 7253 3434 518 -3446 -4454 -4270 -3671 -2497 -4912 -4745 -2586 -3641 -4657 -2946 -2473 -4008 -794
6415 -794 562 4304 4749 8848 10978 11422 11058 1655 -3542 -1301 -2325 -5667 -7315 -6211 -5661 -5137
6399 -5137 -4599 -2310 -2539 -2227 -2875 -2999 -4650 -1856 -1507 -2776 -12055 -11514 -9182 -6194 -5025 -4155 -2109
6382 -2109 926 3066 4153 7300 7390 4482 -3544 -6688 -7106 -6840 -6808 -4754 -1266 -768 -5745 -9215 -8425
6365 -8425 -6338 -5464 -4783 -235 -125 -287 2292 1976 -1407 -3276 -4476 -4659 -7851 -10696 -6071 -6609 -4102
6348 -4102 -2526 -5129 -3358 -1344 970 1835 513 4262 5640 1642 -5726 -3346 -3638 -6796 -6230 3256
6332C256Q573L680p64o378k93J718j758K49m768N92l025r03M304j840o768J113
6316c012J629l858j588n123O21O0R33M91J522m34k109J112L803L313O00J589k357
6299b808K55r05k006R98J436J347N151J086L037m545n916J035M612J646K302k372
6283D353k064o46o02L984l639k456k300k576j657M234R53l680k739L211K354k61
6267c531m738n584K675l280N826R824J4042P257N105L298j21j0909j6331r268
6253e735n958K200P779N481P71J650M216k203m212j640p4J911j278l941l389k368
6237f790k407J74q23J968P161P68n847j227O368M610R04j572m254j022j304J67
6221c126J975N432l351l938n522P76K038N241j428j449J497O956K351K700K929
$$ plain form
6332 3256 11829 15509 14745 8367 8074 9792 8034 8283 3515 4107 1082 179 4483 2643 -4125 -3012
6316 -3012 -1383 -5241 -6829 -11952 -11331 -11271 -10338 -9847 -8325 -8759 -10868 -9756 -5953 -2640 -2040 -451 -2808
6299 -2808 -2553 -3458 -5464 -4466 -3030 -1683 3468 4554 7591 3046 -2870 -1835 2777 4423 6725 4353
6283 4353 2289 1643 1041 5025 1386 -1070 -3370 -5946 -7603 -3369 -2416 -6096 -8835 -5624 -3270 -3531
6267 -3531 -8269 -13853 -11178 -14458 -8632 1192 15234 22491 27596 30894 30773 19864 3533 -5735
6253 -5735 -11693 -9493 -1714 3767 4538 6188 10404 8201 3989 2349 2275 4186 2908 -1033 -4422 -6790
6237 -6790 -9197 -9023 -9846 -7878 -717 51 -5796 -7023 -655 3955 4859 3287 -967 -1989 -3293 -3126
6221 -3126 -1151 4281 930 -3008 -8530 -7754 -5716 -475 -1903 -3352 -1855 5101 7452 10152 13081
6206A3081L557O144j448l293j2792r717m548l731J091K891Q85r44L42K219K76
6191e987j661J929m013J862L853K787O762j454m110k820o37k868K174l615j648
6176i446j492O130Q832K715J76M40p69j327k078n052m958J206L538J771M25n81
6160d70l370o73K373k311j985M275k871l542M611K507J634m111k644p49k531k32
6144a0089J326K077j903J799Q896K723n54n260o665L042l096m011O050M273n47
6129a939K48L48n13k576m1o38N06k55j311Q06Q72M031O043M59j386J117K003k612
6111E162k804p10p09L427n757l824p33J251K20O39Q53K189j394j113j063j361
6095e727j035J013L526L818j352N31L326K448k384o220m639J692K72l780M600
$$ plain form
6206 13081 16638 22782 21334 18041 5249 -4468 -9016 -12747 -11656 -8765 -7880 -8824 -8482 -6263 -5987
6191 -5987 -7648 -5719 -9732 -7870 -4017 -1230 5532 4078 -32 -2852 -3489 -6357 -4183 -7798 -9446
6176 -9446 -10938 -4808 4024 6739 6915 7355 6586 5259 3181 -1871 -6829 -5623 -2085 -314 111 -470
6160 -470 -3840 -4513 -2140 -4451 -6436 -2161 -5032 -8574 -3963 -1456 178 -3933 -6577 -7326 -9857 -10089
6144 -10089 -8763 -6686 -8589 -6790 2106 4829 4275 -985 -7650 -4608 -7704 -11715 -5665 -1392 -1939
6129 -1939 -1691 -1343 -1856 -4432 -4473 -5111 -4605 -4860 -6171 -5365 -4493 -462 5581 6040 4654 5771 7774 5162
6111 5162 2358 1648 939 4366 -1391 -5215 -5948 -4697 -4477 -3838 -2985 -796 -2190 -3303 -4366 -5727
6095 -5727 -6762 -5749 -2223 1595 243 774 4100 6548 4164 -2056 -6695 -5003 -4731 -8511 -3911
6080c911P84rr18n662R16R776K035k755k406m9L27L751L877j847n694L783J402
6063C400K609L339k874m780n014k132Q405J218l043o143j075M019J111J60K516
6048A716K552j190m2k355k806j561J635j809L632J953o046K49j117L962Q403M879
6032A2055m739l497J202J275j476n923j095L55O12M639J90k614j362l174M61O19
6016b472N244J296J122j375j302l242p291l088Q718O901m65m992J450P34l482
6001b244m493J372J614n433K279K031M47l86N07N275K701K42l317p34L441k543
5985G59l650j295k737O321m11p584m013J856l31N16n60L78l285K743M009K765
5969d519K363k336l311K939K405k270j32p32O61o88J617m428j597N480L880m779
$$ plain form
6080 -3911 -3127 -3136 -4054 -9716 -8800 976 3011 256 -2150 -2199 -1872 1879 5756 3909 -1785 1998 3400
6063 3400 6009 9348 6474 1694 -3320 -5452 2953 4171 1128 -5015 -6090 -2071 -960 -800 1716
6048 1716 4268 3078 3036 681 -2125 -3686 -2051 -3860 -228 1725 -4321 -4072 -5189 -1227 7176 12055
6032 12055 7316 3819 5021 6296 4820 -1103 -2198 -1843 -1231 3408 3598 984 -378 -3552 -3091 -2472
6016 -2472 2772 4068 5190 3815 2513 -729 -8020 -11108 -2390 4511 4046 -946 504 1238 -2244
6001 -2244 -6737 -5365 -3751 -9184 -6905 -4874 -4427 -4813 -4306 969 3670 3912 595 -139 3302 759
5985 759 -2891 -4186 -6923 -602 -1013 -8597 -12610 -10754 -11085 -10569 -11129 -10751 -14036 -11293 -7284 -4519
5969 -4519 -2156 -4492 -7803 -4864 -2459 -4729 -4861 -5593 -4932 -5620 -4003 -8431 -10028 -4548 -668 -5447
5953e447M76L693O52L17l741j076L015J449M64k601r50O24L935J610q52m796J257
5936a971J415k767m892O273J321k782j579J332K238q03n862k489M309P360M15
5921A518L425k660j145M714m64m533p27M404R05n208q085m410J851L913J187l587
5905h902J471L436p89l01r06m429J482K005M841O339p46R45r10j711R08k613l065
5888b945m124l030M212M946j659p003k658K238O123P195l545p416j166L846M620
5873c66M356j920l349K050j210P92M294m242k702j90P205n249k564L649K812l510
5857a44p713n808l260O558L682J734N427j908l033L87K01l197L110m698m247K601
5841a0308j7J631N003M894K228K149q74k646k743k030p694r004K01L184M616k364
$$ plain form
5953 -5447 -4971 -1278 -626 -309 -4050 -5126 -2111 -662 -198 -2799 -3749 -3125 810 2420 1568 -3228 -1971
5936 -1971 -556 -3323 -8215 -1942 -621 -3403 -4982 -3650 -1412 -2215 -8077 -10566 -6257 1103 1518
5921 1518 4943 2283 1138 5852 5388 855 128 4532 5437 229 -7856 -12266 -10415 -6502 -5315 -8902
5905 -8902 -7431 -3995 -4784 -5085 -5991 -10420 -8938 -6933 -2092 4247 3501 4446 3536 1825 2733 120 -2945
5888 -2945 -7069 -10099 -5887 -941 -2600 -9603 -12261 -10023 -3900 3295 -250 -7666 -8832 -4986 -366
5873 -366 3990 2070 -1279 771 -439 353 4647 405 -2297 -2487 4718 -531 -3095 554 3366 -144
5857 -144 -7857 -13665 -16925 -10367 -6685 -4951 476 -1432 -4465 -4078 -3877 -7074 -3964 -8662 -12909 -10308
5841 -10308 -10325 -8694 -3691 1203 3431 5580 4706 2060 -683 -2713 -10407 -19411 -19210 -16026 -11410 -13774
5825a3774J410K096O95N942k44J426K775L213j190p21l257j500K304L716j026
$$ plain form
5825 -13774 -12364 -10268 -9573 -3631 -3875 -2449 326 3539 2349 1628 -1629 -3129 -825 2891 1865
$$ [...]
##END NTUPLES=NMR SPECTRUM
##END=
