##TITLE=Analysis number 318915
Compound Code cc 56111
Book Reference 483/10
Project Code adrs
Chemist Name mattw
##JCAMPDX= 6.0         $$ Bruker NMR JCAMP-DX V2.0
##DATA TYPE= NMR SPECTRUM
##DATA CLASS= NTUPLES
##ORIGIN= Bruker BioSpin GmbH
##OWNER= nmr
$$ XWIN-NMR		Version 3.5
$$ Mon Apr 24 15:24:54 2006 GMT Daylight Time (UT+1h)  MAYBRIDGE\nmr@NMR_250MHZ
##.OBSERVE FREQUENCY= 250.131544655141
##.OBSERVE NUCLEUS= ^1H
##.ACQUISITION MODE= SIMULTANEOUS (DQD)
##.ACQUISITION SCHEME= undefined
##.AVERAGES= 16
##.DIGITISER RES= 18
##SPECTROMETER/DATA SYSTEM= dpx250
##.PULSE SEQUENCE= zg30
##.SOLVENT NAME= CDCl3
##.SHIFT REFERENCE= (INTERNAL, CDCl3, 0, 16.522)
##AUDIT TRAIL= $$ (NUMBER, WHEN, WHO, WHERE, WHAT)
$$ ##TITLE= Audit trail, XWIN-NMR		Version 3.5
$$ ##JCAMPDX= 5.01
$$ ##ORIGIN= Bruker BioSpin GmbH
$$ ##OWNER= nmr
$$ C:\u/data/dgb/nmr/ADRS/2870/pdata/1/auditp.txt
$$ ##AUDIT TRAIL=  $$ (NUMBER, WHEN, WHO, WHERE, WHAT)
(   1,<2006-04-24 15:24:29.08 +100>,<MAYBRIDGE\nmr>,<NMR_250MHZ>,
      <created by zg, POWCHK disabled, PULCHK disabled
       configuration hash MD5:
       84 BC 41 DB A1 6E 1D 46 DA 25 12 A5 C1 ED C5 3A
       data hash MD5: 64K
       10 B6 78 2E 97 64 FA CA C5 DB F1 15 FB 2B 6F FD>)
(   2,<2006-04-24 15:24:43.95 +100>,<MAYBRIDGE\nmr>,<NMR_250MHZ>,
      <Start of raw data processing
       ef LB = 0.3 FT_mod = 6 PKNL = 1 SI = 32K 
       data hash MD5: 32K
       8E 1B D9 30 FF 9B 2C F4 AA 4E C4 C5 88 EC DD E5>)
(   3,<2006-04-24 15:24:45.70 +100>,<MAYBRIDGE\nmr>,<NMR_250MHZ>,
      <apk 
       data hash MD5: 32K
       6B 76 99 D0 A2 E6 D7 53 B3 7D 1A 88 F2 13 61 65>)
(   4,<2006-04-24 15:24:46.58 +100>,<MAYBRIDGE\nmr>,<NMR_250MHZ>,
      <abs ABSG = 5 
       data hash MD5: 32K
       70 6F 74 E2 D4 68 25 79 1B 5D 07 19 0C D7 E7 40>)
$$ ##END=
$$ 
$$ hash MD5
$$ 32 48 F7 56 CA 4F 6C 79 75 95 EE F3 27 50 A2 B8
##$RELAX= 
##$RELAX= 
##$RELAX= 
##$RELAX= 
##$RELAX= 
##$RELAX= 
##$RELAX= 
$$ Bruker specific parameters
$$ --------------------------
##$DU= <C:\u>
##$EXPNO= 2870
##$NAME= <ADRS>
##$PROCNO= 1
##$TYPE= <nmr>
##$USER= <dgb>
##$AMP= (0..31)
100 100 100 100 100 100 100 100 100 100 100 100 100 100 100 100 100 100 
100 100 100 100 100 100 100 100 100 100 100 100 100 100 
##$AQSEQ= 0
##$AQ_mod= 3
##$AUNM= <au_zg>
##$AUTOPOS= <46 >
##$BF1= 250.13
##$BF2= 250.13
##$BF3= 250.13
##$BF4= 250.13
##$BF5= 500.13
##$BF6= 500.13
##$BF7= 500.13
##$BF8= 500.13
##$BYTORDA= 1
##$CFDGTYP= 0
##$CFRGTYP= 5
##$CHEMSTR= <none>
##$CNST= (0..31)
1 1 145 1 1 1 1 1 1 1 1 1 1 1 1 1 1 1 1 1 1 1 1 1 1 1 1 1 1 1 1 1 
##$CPDPRG= <>
##$CPDPRG1= <>
##$CPDPRG2= <>
##$CPDPRG3= <>
##$CPDPRG4= <mlev>
##$CPDPRG5= <mlev>
##$CPDPRG6= <mlev>
##$CPDPRG7= <mlev>
##$CPDPRG8= <mlev>
##$CPDPRGB= <>
##$CPDPRGT= <>
##$D= (0..31)
0 1 0 0 0 0 0 0 0 0.06 0 0 0 0 0 0 0.0002 0 0 0 0 0 0 0 0 0 0 0 0 0 0 
0 
##$DATE= 1145888667
##$DBL= (0..7)
120 120 120 120 120 120 120 120 
##$DBP= (0..7)
150 150 150 150 150 150 150 150 
##$DBP07= 0
##$DBPNAM0= <>
##$DBPNAM1= <>
$$ [...]
##$SUBNAM7= <"">
##$SUBNAM8= <"">
##$SUBNAM9= <"">
##$SW= 20.6930455092707
##$SWIBOX= (0..15)
0 0 3 0 0 0 0 0 0 0 0 0 0 0 0 0 
##$SW_h= 5175.983436853
##$TD= 65536
##$TD0= 1
##$TE= 295.16
##$TE2= 300
##$TE3= 300
##$TEG= 300
##$TL= (0..7)
0 120 120 120 120 120 120 120 
##$TP= (0..7)
150 150 150 150 150 150 150 150 
##$TP07= 0
##$TPNAME0= <>
##$TPNAME1= <>
##$TPNAME2= <>
##$TPNAME3= <>
##$TPNAME4= <>
##$TPNAME5= <>
##$TPNAME6= <>
##$TPNAME7= <>
##$TPOAL= (0..7)
0.5 0.5 0.5 0.5 0.5 0.5 0.5 0.5 
##$TPOFFS= (0..7)
0 0 0 0 0 0 0 0 
##$TUNHIN= 0
##$TUNHOUT= 0
##$TUNXOUT= 0
##$USERA1= <user>
##$USERA2= <user>
##$USERA3= <user>
##$USERA4= <user>
##$USERA5= <user>
##$V9= 5
##$VALIST= <valist>
##$VCLIST= <CCCCCCCCCCCCCCC>
##$VD= 0
##$VDLIST= <DDDDDDDDDDDDDDD>
##$VPLIST= <PPPPPPPPPPPPPPP>
##$VTLIST= <TTTTTTTTTTTTTTT>
##$WBST= 1024
##$WBSW= 4
##$XGAIN= (0..3)
0 0 0 0 
##$XL= 0
##$YL= 0
##$YMAX_a= 277384
##$YMIN_a= -471083
##$ZGOPTNS= <>
##$ZL1= 120
##$ZL2= 120
##$ZL3= 120
##$ZL4= 120
##$ABSF1= 16.522
##$ABSF2= -4.171173
##$ABSG= 5
##$ABSL= 3
##$ALPHA= 0
##$AQORDER= 0
##$ASSFAC= 0
##$ASSFACI= 0
##$ASSFACX= 0
##$ASSWID= 0
##$AUNMP= <proc_1d>
##$AZFE= 0.1
##$AZFW= 0.1
##$BCFW= 0
##$BC_mod= 0
##$BYTORDP= 0
##$COROFFS= 0
##$CY= 12.5
##$DATMOD= 1
##$DC= 0
##$DFILT= <>
##$DTYPP= 0
##$F1P= 14.0000005364418
##$F2P= -0.99999901652339
##$FCOR= 0.5
##$FTSIZE= 32768
##$FT_mod= 6
##$GAMMA= 0
##$GB= 0
##$INTBC= 1
##$INTSCL= 1
##$ISEN= 128
##$LB= 0.3
##$LEV0= 0
##$LPBIN= 0
##$MAXI= 10000
##$MC2= 0
##$MEAN= 0
##$ME_mod= 0
##$MI= 0
##$NCOEF= 0
##$NC_proc= -4
##$NLEV= 6
##$NOISF1= 0
##$NOISF2= 0
##$NSP= 0
##$NTH_PI= 0
##$NZP= 0
##$OFFSET= 16.522
##$PC= 1
##$PHC0= 159.5451
##$PHC1= 17.43334
##$PH_mod= 1
##$PKNL= yes
##$PPARMOD= 0
##$PSCAL= 4
##$PSIGN= 0
##$REVERSE= no
##$SF= 250.13
##$SI= 32768
##$SIGF1= 0
##$SIGF2= 0
##$SINO= 400
##$SIOLD= 32768
##$SREGLST= <1H.CDCl3>
##$SSB= 0
##$STSI= 32768
##$STSR= 0
##$SW_p= 5175.98343685301
##$SYMM= 0
##$S_DEV= 0
##$TDeff= 65536
##$TDoff= 0
##$TI= <Analysis number 999999
Compound Code 99
Book Reference 9
Project Code 9>
##$TILT= no
##$TM1= 0
##$TM2= 0
##$TOPLEV= 0
##$USERP1= <user>
##$USERP2= <user>
##$USERP3= <user>
##$USERP4= <user>
##$USERP5= <user>
##$WDW= 1
##$XDIM= 32768
##$YMAX_p= 294411406
##$YMIN_p= -208594
$$ End of Bruker specific parameters
$$ ---------------------------------
##NTUPLES= NMR SPECTRUM
##VAR_NAME=  FREQUENCY,     SPECTRUM/REAL,   SPECTRUM/IMAG
##SYMBOL=    X,             R,               I
##VAR_TYPE=  INDEPENDENT,   DEPENDENT,       DEPENDENT
##VAR_FORM=  AFFN,          ASDF,            ASDF
##VAR_DIM=   32768,         32768,           32768
##UNITS=     HZ,            ARBITRARY UNITS, ARBITRARY UNITS
##FACTOR=    0.157963299565203, 1,           1
##FIRST=     4132.6476996994, 0,             0
##LAST=      -1043.33573715361, 0,           0
##MIN=       -1043.33573715361, -208594,     0
##MAX=       4132.6476996994, 294411406,     0
$$ Real data points
##PAGE= N=1
##DATA TABLE= (X++(R..R)), XYDATA
$$ [...]
20398A9232R139j1312l2400j2611n930J2892J5301J6565o670j410K787l0240j9639
$$ 19232 28371 17059 -15341 -27952 -33882 -20990 -5689 10876 4206 2796 5583 -24657 -44296
20385d4296J3109J8673o125M167j0937j810O04k237k322l13k2716l2388K1261
$$ -44296 -31187 -12514 -18639 -14472 -25409 -27219 -26615 -28852 -31174 -31487 -54203 -86591 -65330
20372f5330K8670P985J9509J8261Q62J0364J3159j0585j8447j8030K728J0485
$$ -65330 -36660 -28675 -9166 9095 9957 20321 33480 22895 4448 -13582 -10854 -369
20360c69l187l21J1237q910k0696J3084m289j5303J9129K8476J525K0604j8817
$$ -369 -3556 -3877 7360 -1550 -22246 -9162 -13451 -28754 -9625 18851 20376 40980 22163
20347B2163j6665j6437j0546k1212O066K3543N854k4932M523K2581M004l564j33
$$ 22163 5498 -10939 -21485 -42697 -36631 -13088 -7234 -32166 -27643 -5062 -1058 -4622 -4755
20334d755m274n015J511k4927j2596L9248N719p693k3099j7043q191J5175J4997
$$ -4755 -9029 -14044 -12533 -37460 -50056 -10808 -5089 -12782 -35881 -52924 -61115 -45940 -30943
20321c0943L925l70K1025K5995j5707n415J3089K1722K155k6758K17K452K5383
$$ -30943 -27018 -27388 -6363 19632 3925 -1490 11599 33321 35476 8718 8935 11387 36770
20308C6770L582r346j5414J6896j0206k1617m0775k676k266J3756K2804J4260
$$ 36770 40352 31006 15592 32488 22282 665 -40110 -42786 -45052 -31296 -8492 5768
20296E768L508L8801K529k6569j0479j838k1944J0637j6764R987K4999j5219j2820
$$ 5768 9276 48077 50606 24037 13558 11720 -10224 413 -16351 -6364 18635 3416 -9404
20283i404l129J4937j0709k4635j2945L6934L5805J8484L881P160R301k8208k4236
$$ -9404 -12533 2404 -8305 -32940 -45885 -8951 26854 45338 49219 56379 65680 37472 13236
20270A3236r032o343K0878m0414J393J1152l883P694M817q556k2641O306L9046
$$ 13236 4204 -2139 18739 -21675 -20282 -9130 -13013 -5319 -502 -9058 -31699 -25393 13653
20257A3653J2884N175j050j7482k3130n549K3822N546j3524N781K3386j2580j0126
$$ 13653 26537 31712 30662 13180 -9950 -15499 8323 13869 345 6126 29512 16932 6806
20244F806J2053J015k4285n58k0896J6719J6050O731k6635k0980J8413L657K4961
$$ 6806 18859 19874 -4411 -4969 -25865 -9146 6904 13635 -13000 -33980 -15567 -11910 13051
20231A3051R942j3604O547o356n502j4142p430j6700J859K2088N390k5133l705
$$ 13051 22993 9389 15936 9580 4078 -10064 -17494 -34194 -32335 -10247 -4857 -29990 -33695
20218c3695J2383J4959J4458J8578L309j8446O616j6048j6953j4364n853J1733
$$ -33695 -21312 -6353 8105 26683 29992 11546 18162 2114 -14839 -29203 -35056 -23323
20206b3323L193j9745K923K4499J2452L047J479M890N17O488L0527n648l7490
$$ -23323 -20130 -39875 -36952 -12453 -1 3046 4525 9415 9932 16420 46947 41299 3809
20193C809k984L127Q361J4319K570j2695K7344K6818j3342k9049j0029k1216r51
$$ 3809 825 3952 12313 26632 29202 16507 43851 70669 57327 28278 18249 -2967 -3918
20180c918J6552J9240J3733n423j5786K1688Q827j9814j8941N685M010j3539o709
$$ -3918 12634 31874 45607 40184 24398 46086 54913 35099 16158 21843 25853 12314 5605
20167E605R16M3816J9339r787k1138O712J9739K863m668p521j6986N924K3459
$$ 5605 6521 50337 69676 59889 38751 45463 65202 68065 63397 55876 38890 44814 68273
20154F8273j0200j2729Q838j5918m6169j0313L5114K3523j6211J777l8572P302
$$ 68273 58073 45344 54182 38264 -7905 -18218 16896 40419 24208 25985 -12587 -5285
20142e285J4899k7916n385J5589J3636J1473K635j7195k0213o153J9220J0165
$$ -5285 9614 -18302 -23687 -8098 5538 17011 19646 2451 -17762 -23915 -4695 5470
20130E470J340j5832J2961r668k4310K5469K8062O701j2425o497Q47J6695J2693
$$ 5470 6810 -9022 3939 -5729 -30039 -4570 23492 30193 17768 11271 12118 28813 41506
20117D1506r160q638J707l6802j4746J3128K961q931K568M250J2134M414R475
$$ 41506 32346 23708 25415 -11387 -26133 -13005 -10044 -18975 -16407 -12157 -23 4391 13866
20104A3866K2586l1579j1489M092K3192m368l2534K572J4116j4030j2827m395
$$ 13866 36452 4873 -6616 -2524 20668 16300 -16234 -13662 454 -13576 -26403 -30798
20092c0798L5284K1535l7243j5907O108J3324J6463j138l959J4323L6838j8247
$$ -30798 4486 26021 -11222 -27129 -21021 -7697 8766 7628 3669 17992 54830 36583
20080C6583k2441P786J8241j2690k029p013J4367P413K1348j8485k2389p403J6185
$$ 36583 14142 21928 40169 27479 25450 18437 32804 40217 61565 43080 20691 13288 29473
20067B9473j0248o308R147j7832N319M536K4712Q05K1564k406J1788J4156n581
$$ 29473 19225 12917 22064 4232 9551 14087 38799 39604 61168 58762 70550 84706 79125
20054G9125k8953k8439k2919k8037o569K3420J0271n112J041L5903J2873j1915
$$ 79125 50172 21733 -1186 -29223 -35792 -12372 -2101 -7213 -6172 29731 42604 30689
20042C0689J6705j1953l045o280j9421j4298L394J3363L140q649J5056M220k13
$$ 30689 47394 35441 32396 26116 6695 -7603 -4209 9154 12294 3645 18701 22921 22708
20029B2708J6236k0539j0874J4273J1809k1816r201R30j7834O255P241L64j6468
$$ 22708 38944 18405 7531 21804 33613 11797 2596 3526 -14308 -8053 -812 -448 -16916
20016a6916K1834Q72k0159q771J8481J2322n563l025Q821K9691J0778J0454j0734
$$ -16916 4918 5790 -14369 -23140 -4659 7663 2100 -925 7896 37587 48365 58819 48085
20003D8085j8531k278j0468j7064k2238p772J3941M0635j1149k241p799j4002
$$ 48085 29554 27276 16808 -256 -22494 -30266 -16325 24310 13161 10920 3121 -10881
19991a0881k1232K1657L085P208L4038n340J930J7785k2935r184l432K825n015
$$ -10881 -32113 -10456 -7371 -163 33875 28535 30465 48250 25315 16131 12699 15524 10509
19978A0509M503J9227J3626l093R621o620o834O969j2406j2502j3916J6094j122
$$ 10509 15012 34239 47865 44772 54393 47773 40939 47908 35502 23000 9084 25178 24056
19965B4056k2243J0651J1258O700j295j8618j2699K199L4720M332k297J0911m416
$$ 24056 1813 12464 23722 30422 29127 10509 -2190 9 34729 39061 36764 47675 43259
19952D3259R862n962j3102m674J2861J6742l3920k384J8381j741J3593K085l1364
$$ 43259 53121 47159 34057 29383 42244 58986 25066 22682 41063 39322 52915 55000 23636
19939B3636j5048j4349j120J2452J1581j0316q007N75J5454M44k940K882J6919
$$ 23636 8588 -5761 -6881 5571 17152 6836 -1171 -596 14858 15302 12362 15244 32163
19926C2163J9431j705j2592k4705J3527j6527r157K0181m57k1284j2017N840n15
$$ 32163 51594 49889 37297 12592 26119 9592 435 20616 20159 -1125 -13142 -7302 -7817
19913g817K8623L4779O699J3596j2065k4508l368l467j9082J6327K4921K111k814
$$ -7817 20806 55585 62284 75880 63815 39307 35939 32472 13390 29717 54638 56749 53935
19900E3935k1777n842K3276q393j1735L0163J403k0573K078K9157R005R483J8183
$$ 53935 32158 26316 49592 41199 29464 59627 61030 40457 42535 71692 80697 90180 108363
19887A08363j3313o423O444j6300j8204j5864j9526J1499Q270p438j4573j966
$$ 108363 95050 88627 95071 78771 60567 44703 25177 36676 44946 37508 22935 20969
19875B0969J9469j1479J463L568O838j3169o612j341K6584j0688K64O649j1713
$$ 20969 40438 28959 30422 33990 40828 27659 21047 19706 46290 35602 35866 42515 30802
19862C0802j0436q44J7869j3204j0417n192O095R389Q731j9706n564J4690J0216
$$ 30802 20366 19522 37391 24187 13770 8578 14673 24062 32793 13087 7523 22213 32429
19849C2429K3536k494k1906K0438Q351j3179K671k1538j1396m23P780q603N374
$$ 32429 55965 53471 31565 52003 60354 47175 49846 28308 16912 16489 24269 15666 21040
19836B1040n440j0328J9136j0582K2969L6414j0022j3119k130n838J000j4547
$$ 21040 15600 5272 24408 13826 36795 73209 63187 50068 47938 42100 43100 28553
19824B8553L1820o462m0629q942J511K6828J2833k5229j4515K0809K7098M530
$$ 28553 60373 53911 13282 4340 5851 32679 45512 20283 5768 26577 53675 58205
19812E8205j4871J3675J3095q231q558m596j2762r523l439k124k41r173j2165
$$ 58205 43334 57009 70104 61873 53315 48719 35957 26434 22995 20871 20630 11457 -708
19799g08J6461j5036J8657J4612r749p17j057L171L7034k019o581J5982j8102
$$ -708 15753 717 19374 33986 24237 23520 22463 25634 62668 60649 54068 70050 51948
19786E1948N931q460k1725J3055O253j724J8321j2320k3379o396J8666M36j7129
$$ 51948 57879 49419 27694 40749 47002 45278 63599 51279 27900 21504 40170 40606 23477
19773B3477Q207L1649J80K2001M737L544j2112j0724R988k2617m7929L5706J6756
$$ 23477 31684 63333 63513 85514 90251 93795 81683 70959 80947 58330 10401 46107 62863
19760F2863K6563J3946L230j5493j3505k1197K2387J2990q486q473L324R91L610
$$ 62863 89426 103372 106602 91109 77604 56407 78794 91784 83298 74825 78149 79140 82750
19747H2750j9758J467K607j2360O612K0881l3036J4435J791o097J2338J5236j3168
$$ 82750 62992 64459 67066 54706 61318 82199 49163 63598 65389 59292 71630 86866 73698
19734G3698m7646r469J4547j926O156K2718L8615J2196L6420K1698q684K4249
$$ 73698 26052 16583 31130 29204 35360 58078 96693 108889 145309 167007 158323 182572
19722A82572M5933M6213N1158K4998j890j6706j890J3937L5678K7634O2416N0271
$$ 182572 228505 274718 325876 350874 348984 332278 330388 344325 380003 407637 470053 520324
19710E20324L3003K1877j3912k9866m0635k9514l5766k3037k8407j3647j1182
$$ 520324 553327 575204 561292 531426 490791 461277 425511 402474 374067 360420 349238
19699C49238k7571k3295j8430j4971l481m3456l8913n678q146j6933M56j1650
$$ 349238 321667 298372 279942 264971 261490 218034 179121 173443 165297 148364 148820 137170
19687A37170j2720k773o510l946Q812k772l5228M003R832J8500K3561R776k2102
$$ 137170 124450 121677 115167 111221 120033 117261 82033 86036 95868 114368 137929 147705 125603
19674A25603m636K7620l915j0186j9107O738m424J494o194l166m969R26N225K90
$$ 125603 120967 148587 144672 134486 115379 122117 117693 119187 112993 109827 104858 105784 111009 111299
19660A11299o154j0034j1190J7137o188o918J689j7055j0708j291j1251K0998
$$ 111299 105145 95111 83921 101058 94870 87952 89641 72586 61878 60587 49336 70334
19648G0334J6305j9202m609K3649k340k5682j315o046M63J2048p700L2487J4899
$$ 70334 86639 67437 62828 86477 84137 58455 57140 51094 51557 63605 55905 88392 103291
19635A03291n102Q832j0854k6043j9943J3954K0212k7770o473L5666J5582k5581
$$ 103291 98189 107021 96167 70124 50181 64135 84347 56577 50104 85770 101352 75771
19623G5771k6538J3535K812K4573K091P551l280n088O573M753J1814l7463j4606
$$ 75771 49233 62768 65580 90153 92244 99795 96515 91427 98000 102753 114567 77104 62498
19610F2498L9126M1950r763j8718N849J0064n06K5552J1814J914O950j9417l3263
$$ 62498 101624 143574 133811 115093 120942 131006 130500 156052 167866 169780 176730 157313 124050
19597A24050n214R692K0430J1085j3528j1053J4118M730n004j7994l148r531l8521
$$ 124050 118836 128528 148958 160043 146515 135462 149580 154310 149306 131312 128164 118633 80112
19584H0112q480K3082J6700O331l366j3434l1689j2283J0791J1447R583J1709
$$ 80112 71632 94714 111414 117745 114379 100945 69256 56973 67764 79211 88794 100503
19572A00503k9238K0805J7319j2684J1476J1188j3819j2168k1283P133L592P017
$$ 100503 71265 92070 109389 96705 108181 119369 105550 93382 72099 79232 82824 89841
19560H9841J8032R833n339p637j0671o166l593J543K0239K4341L8504J7050j0245
$$ 89841 107873 117706 112367 104730 94059 87893 84300 85843 106082 130423 168927 185977 175732
19547A75732j7995p6j0254P624L2778K0561J5638K1811L6716M8314K5502K8489
$$ 175732 157737 157661 147407 155031 187809 208370 224008 245819 282535 330849 356351 384840
19535C84840j148k5669J4721P922M933K9267J2132M8289P1531P9176J720m3408
$$ 384840 383692 358023 372744 380666 385599 414866 426998 475287 546818 625994 627714 584306
19523E84306n0386o5723n0091l3304j4832k0299J7898J1818k102J124M020n0861
$$ 584306 533920 468197 418106 384802 369970 349671 367569 379387 377285 378409 382429 331568
19511C31568l6902m8631p466k014k5781l0964k0292j0634m270J8922n746j3032
$$ 331568 294666 246035 238569 236555 210774 179810 159518 148884 144614 163536 157790 144758
19499A44758r981l444p250J3250j714o053M648j7826r767l672k377J6455N809
$$ 144758 134777 131333 124083 137333 135619 129566 134214 116388 106621 102949 100572 117027 122836
19486A22836J0890j5822n586j1267Q308K331J0360J3046p019J7356K0527L619
$$ 122836 133726 117904 112318 101051 109359 111690 122050 135096 128077 145433 165960 169579
19474A69579J3816o624k5074k7988k0893o686r951k0700L784L573J7284L3727
$$ 169579 183395 176771 151697 123709 102816 96130 86179 65479 69263 72836 90120 123847
19462A23847L509j3012N007l228k0719j8014L044m536n529j2914R813M194j4187
$$ 123847 127356 114344 119351 116123 95404 77390 80434 75898 70369 57455 67268 71462 57275
19449E7275R82K8738R723k1489J1763j827o661j7115r234J7460K2479o01k151
$$ 57275 58257 86995 96718 75229 86992 85165 78504 61389 52155 69615 92094 91493 89342
19436H9342r731jq941J6136L6377j3602j9652J0790k216j5799j428L3412j3112
$$ 89342 79611 79610 70669 86805 123182 109580 89928 100718 98502 82703 81275 114687 101575
19423A01575m058K027L188k1133j982M3128Q708j5616k9291j3961Q846Q6l592
$$ 101575 97517 99544 102732 81599 79617 122745 131453 115837 86546 72585 81431 81517 77925
19410G7925k0461l068J8193J8831k8901O499J0606O732K2377k0610j3016J6353
$$ 77925 57464 54396 72589 91420 62519 69018 79624 86356 108733 88123 75107 91460
19398I1460J7126P377j8561j0834Q567j2169q149K449l3658k7817P919J5464j0993
$$ 91460 108586 115963 97402 86568 95135 82966 74817 77266 43608 15791 23710 39174 28181
19385B8181J4823J7004J5732J308O897J4374J4199j5804J9453J9874L001j0070
$$ 28181 43004 60008 75740 77048 83945 98319 112518 96714 116167 136041 139042 128972
19373A28972l6891r888K6131M4731j0281j1444O566j04j3271l0508k1784J4980
$$ 128972 92081 82193 108324 153055 142774 131330 137896 137792 124521 94013 72229 87209
19361H7209O008k2984L207N788K939K7835J5608n162j4122k8322j111q882L0072
$$ 87209 93217 70233 73440 79228 82167 110002 125610 120448 106326 78004 76893 68011 98083
19348I8083O766j7649P993K7660r300k6066R860J091J2043J1654j2736N305J8792
$$ 98083 104849 87200 95193 122853 113553 87487 97347 98438 110481 122135 109399 114704 133496
19335A33496J0248o505O432L2959k2028l5983k4277J3749M9733j717l6875k1468
$$ 133496 143744 137239 143671 176630 154602 118619 94342 108091 157824 156107 119232 97764
19323I7764K0513L0206J0340j7073k2845l486K2k690j408J533K2500K3117p808
$$ 97764 118277 148483 158823 141750 118905 115419 115441 112751 111343 112876 135376 158493 150685
19310A50685j6397p891l2969k422J8088K7114O836J6502M206k8323r161Q122K0179
$$ 150685 134288 126397 93428 91006 109094 136208 143044 159546 163752 135429 126268 134390 154569
19297A54569j730k1057o012l859M081J9594n359P213L1987j9361k5461R03k9734
$$ 154569 152839 131782 125770 121911 125992 145586 140227 147440 179427 160066 134605 135508 105774
19284A05774r659K7226J4781K9029o334k7458K59J2958j4602k4Q116l3983l490
$$ 105774 96115 123341 138122 167151 160817 133359 133618 146576 131974 131950 140066 106083 102593
19271A02593K5659O196J2629k775j3001J1462J7992J665j1554m41n466N199J2040
$$ 102593 128252 134448 147077 144302 131301 142763 160755 162420 150866 150425 144959 150158 162198
19258A62198K8197k9548l1117k8024k3518K5882L8588P916L450J8155K604J5375
$$ 162198 190395 160847 129730 101706 78188 104070 142658 150574 154024 172179 174783 190158
19246A90158K1233m080J8728K7955L556L6434L1153m471M936K3803J6999K9445
$$ 190158 211391 207311 226039 253994 257550 293984 325137 320666 325602 349405 366404 395849
19234C95849L0083L7604K2091l494K0389K2116j5582L946P072l0425k1259k0058
$$ 395849 425932 463536 485627 482133 502522 524638 509056 513002 520074 489649 468390 448332
19222D48332j2952K1340J6894j4048m9287n2026R053l0149m0396N834N324P527
$$ 448332 435380 456720 473614 459566 410279 358253 367306 337157 296761 302595 307919 315446
19210C15446K8395J3662m0322L848j1181m3922j1130R844l0884o611Q408J5134
$$ 315446 343841 357503 317181 321029 309848 265926 254796 264640 233756 227145 235553 250687
19198B50687J7768K7308Q06J4658L783Q428J6153K3715K3770J2030J2338L5204
$$ 250687 268455 295763 296569 311227 315010 323438 339591 363306 387076 399106 411444 446648
19186D46648M3222K8753P667k679O867J1576K3622j9213m4945K6892L1609o057
$$ 446648 489870 518623 526290 523611 530478 542054 565676 546463 501518 528410 560019 553962
19174E53962J5141j660k423K9925l0900L300J9628L9540K2082L7167L6099K5600
$$ 553962 569103 567443 565020 594945 564045 567345 586973 626513 648595 685762 721861 747461
19162G47461K2315k757m4906m356k168m0224n4172j9446J8585N6129L9613K6453
$$ 747461 769776 767019 722113 717757 715589 675365 621193 601747 620332 676461 716074 742527
19150G42527L0805m111m4724k8502p2251n2351k6957k1468l8515k6276k5542l2712
$$ 742527 773332 769221 724497 695995 623744 571393 544436 522968 484453 458177 432635 399923
19138C99923j1520k6436m1691l819K6986J8852P327n234q180l5500l8931K1896
$$ 399923 388403 361967 320276 316457 343443 362295 369622 364388 356208 320708 281777 303673
19126C03673K9792l1548J907o459J8858P604J8130P722l628l3417q552J8101K0498
$$ 303673 333465 301917 303824 297365 316223 323827 341957 349679 346051 312634 304082 322183 342681
19113C42681l4601j9591N781O576q711J4194j6238j5693J7446j9890j42j3442
$$ 342681 308080 288489 294270 300846 292135 306329 290091 274398 291844 271954 271812 258370
19101B58370q282J0074K5393k4892p925K3156J8125o39L254Q613K6356p773K3409
$$ 258370 250088 260162 285555 260663 252738 275894 294019 293380 296634 305247 331603 323830 347239
19088C47239J7858K9147K9628M4997M3201J268J7670K4708L469K3514L0836q420
$$ 347239 365097 394244 423872 468869 512070 513338 531008 555716 559185 582699 613535 605115
19076F05115j781L8555L9720K1499J1163N8415L3338j7223l3654l2385m489l5536
$$ 605115 603334 641889 681609 703108 714271 772686 806024 788801 755147 722762 718273 682737
19064F82737j3276M253j3117j2943j0953j0665k8473K900j7324k2002m9027m1624
$$ 682737 669461 673714 660597 647654 636701 626036 597563 600463 583139 561137 512110 470486
19052D70486n1574j8839K9744j8181l33N324L625J752l4205k162L5007J759k1494
$$ 470486 418912 400073 429817 411636 411303 416627 420252 422004 387799 385637 420644 422403 400909
19039D00909K9225r81j160m720l0563n2488P273J7330K525J4244J427k6064l5915
$$ 400909 430134 429153 427993 423273 392710 340222 347495 364825 367350 381594 383021 356957 321042
19026C21042j933L43n538q01k1974j4802K337J7624j4898q158m395O687J4451
$$ 321042 319109 319452 313914 313113 291139 276337 278674 296298 281400 273242 268847 275534 289985
19013B89985p145m2134j2244O383J9503J6827J731J3577Q622k253n197j6893J127
$$ 289985 282840 240706 228462 234845 254348 271175 272906 286483 295105 292852 287655 270762 271889
19000B71889K0311J7855q139l0832K604L536n54K1290l510R533R078K2212J1018
$$ 271889 292200 310055 301916 271084 273688 277224 276670 297960 294450 303983 313061 335273 346291
18987C46291L3251q124k7817J3060j2189P223O108l260O153N060k2711k2655j5622
$$ 346291 379542 371418 343601 356661 344472 351695 357803 354543 360696 365756 343045 320390 304768
18974C04768j2745m761K5376L1310L668j8348j1041r495N089p618O98L3417J7040
$$ 304768 292023 287262 312638 343948 347616 329268 318227 308732 313821 306203 306901 340318 357358
18961C57358o167j1022L3093j5678j465R786j9241j6364Q164j3117r988J187L3357
$$ 357358 351191 340169 373262 357584 356119 365905 346664 330300 338464 325347 315359 316546 349903
18948C49903J1910J1332J9068l076K283l552J8763J4395l2969m97J5799j3848
$$ 349903 361813 373145 392213 389137 391420 387868 406631 421026 388057 387560 403359 389511
18936C89511J530r704J3055M3443Q471M1911J2906K5537M5618M010J4309L6799
$$ 389511 391041 381337 394392 437835 446306 488217 501123 526660 572278 576288 590597 627396
18924F27396J0662J9005K7836K5071K5658R244J5336N688J7284L786J4116O1535
$$ 627396 638058 657063 684899 709970 735628 744872 760208 765896 783180 786966 801082 862617
18912H62617O5939O0494L8667N8533K0317k7406k0656k2020m7341n5494o1411
$$ 862617 928556 989050 1027717 1086250 1106567 1079161 1058505 1036485 989144 933650 872239
18901H72239l9639m4890K49M5607P4173P2592N2942P977p221k2243n8799k9086
$$ 872239 832600 787710 787959 833566 907739 980331 1033273 1041250 1034029 1011786 952987 923901
18889I23901m9734r5591k9956n3190n2430k7118r97L041J3633L0767J1394J3576
$$ 923901 874167 778576 748620 695430 643000 615882 614885 617926 631559 662326 673720 687296
18877F87296j7074j2157j6499K797L8625N3263M6387O1443M8913l4066k2237k859
$$ 687296 670222 658065 641566 644363 682988 736251 782638 844081 892994 858928 836691 833832
18865H33832n3N040L550J5766J7999O1475N4029J5377J4171q856k8441J6576K6683
$$ 833832 833779 838819 842369 858135 876134 937609 991638 1007015 1021186 1012330 983889 1000465 1027148
18852A027148M3118K6796K2681Q392J9848M1128O8744O6311P1773M4655M4380
$$ 1027148 1070266 1097062 1119743 1128135 1147983 1189111 1257855 1324166 1395939 1440594 1484974
18841A484974K4013J5883L4476L2158Q574L3763O9158N8869M3884K7993O89n6003
$$ 1484974 1508987 1524870 1559346 1591504 1600078 1633841 1702999 1761868 1805752 1833745 1834434 1778431
18829A778431n8202o017K1603J8585O324j5730n4915m5991j4224k4030k4401j0550
$$ 1778431 1720229 1714212 1735815 1754400 1760724 1744994 1690079 1644088 1629864 1605834 1581433 1570883
18817A570883j2233k9805l7826j6498m6558m5278j7374R221m1013j6502K5831
$$ 1570883 1558650 1528845 1491019 1474521 1427963 1382685 1365311 1374532 1333519 1317017 1342848
18806A342848M948J5074k6809K3649N469l5357k528L1119J9848P42q508J2313
$$ 1342848 1347796 1362870 1336061 1359710 1365179 1329822 1327294 1358413 1378261 1379003 1370495 1382808
18794A382808K9105L7919n507P957L4443L2685K6849N5070P0099P1976M5365K8110
$$ 1382808 1411913 1449832 1444325 1452282 1486725 1519410 1546259 1601329 1671428 1743404 1788769 1816879
18782A816879O220L8306J6488K0750O7395N1598M2487O7428K1744k8777l0311
$$ 1816879 1823099 1861405 1877893 1898643 1966038 2017636 2060123 2127551 2149295 2120518 2090207
18771B090207j3674j8038N094J3514N1203M0134L9620M5533l048j3754l4675n4571
$$ 2090207 2076533 2058495 2063589 2077103 2128306 2168440 2208060 2253593 2250545 2236791 2202116 2147545
18759B147545m7985j6344j6642J6676J1615J4662K6322J8753P543j6029J3781
$$ 2147545 2099560 2083216 2066574 2083250 2094865 2109527 2135849 2154602 2162145 2146116 2159897
18748B159897L338L9450N5844J8004K0121M5261O5677R1093R6677J03019J07225
$$ 2159897 2163235 2202685 2258529 2276533 2296654 2341915 2407592 2498685 2595362 2698381 2805606
18737B805606J05925J17081J16446J25230J48713J40582J83181J95712K10685
$$ 2805606 2911531 3028612 3145058 3270288 3419001 3559583 3742764 3938476 4149161
18728D149161K68092L03416L39454M12581M98827O24777Q05631J096213J553004
$$ 4149161 4417253 4720669 5060123 5472704 5971531 6596308 7401939 8498152 10051156
18719A0051156K233103K758308L071225L636802L430650K175203J987972J509850
$$ 10051156 12284259 15042567 18113792 21750594 25181244 27356447 29344419 30854269
18711C0854269N00476J128795K004105L079442L701465K957727L338128K469641
$$ 30854269 31354745 32483540 34487645 37567087 41268552 44226279 47564407 50034048
18703E0034048q39595j335785j540145l089624k418067j271861m46821K59190
$$ 50034048 49194453 47858668 46318523 43228899 40810832 39538971 39092150 39351340
18695C9351340n90399r41069j206288l306091l897184l198398l127152k761594
$$ 39351340 38760941 37819872 36613584 33307493 29410309 26211911 23084759 20323165
18687B0323165j914320j254966q92835o08771m76581l86804k61367j31691o8317
$$ 20323165 18408845 17153879 16261044 15652273 15175692 14788888 14527521 14395830 14327513
18678A4327513J9724J38714K52801L92060N64725P79545J134957J692284K428352
$$ 14327513 14347237 14485951 14738752 15130812 15695537 16475082 17610039 19302323 21730675
18669B1730675K985391L407318L941652L079188K006378J942978Q46295N09015
$$ 21730675 24716066 28123384 32065036 35144224 37150602 39093580 39939875 40448890
18661D0448890J545462K528301L868795L870776L490938L787976R60537j602857
$$ 40448890 41994352 44522653 48391448 52262224 55753162 59541138 60501675 58898818
18653E8898818j518671l035193l398050j930071r71322K33881J01027r17549j016648
$$ 58898818 57380147 54344954 50946904 49016833 48045511 48279392 48380419 47462870 46446222
18644D6446222k803659m519880m134166l975267l739548k898110k073338j490876
$$ 46446222 43642563 39122683 34988517 31013250 27273702 24375592 22302254 20811378
18636B0811378j099687q35550o02291m03844k77452j96570j82915k90693l98405
$$ 20811378 19711691 18876141 18273850 17870006 17592554 17395984 17213069 16922376 16523971
18627A6523971m96032n33312m38987l89516l18432l01900k96847k59676k25593
$$ 16523971 16027939 15494627 15055640 14666124 14347692 14045792 13748945 13489269 13263676
18618A3263676k06563k06499j94710j52909j16076r0638o8351q6058p4329o3696
$$ 13263676 13057113 12850614 12655904 12502995 12386919 12296281 12227930 12141872 12067543 12003847
18608A2003847j2183J8201M2636P2767J45360K10429K24786K60796L08663L98984
$$ 12003847 11991664 12009865 12052501 12125268 12270628 12481057 12705843 12966639 13275302 13674286
18598A3674286M82686O12298O97462P53947R03731J128734J402226J718215K128798
$$ 13674286 14156972 14769270 15466732 16220679 17124410 18253144 19655370 21373585 23502383
18589B3502383K657193L303570M178384N416247O928949Q382293R114744Q710748
$$ 23502383 26159576 29463146 33641530 39057777 45986726 54369019 63483763 72194511
18581G2194511P520916N877368L813808J833418L07512r60281j984587j720435
$$ 72194511 79715427 85592795 89406603 91240021 91547533 90587252 88602665 86882230
18573H6882230N59162L769562O447906P509044P272210O680248N203893K767858
$$ 86882230 87441392 91210954 97658860 105167904 112440114 119120362 124324255 127092113
18565A27092113M19441j351545l922015o634624n713478l305687k382902j233468
$$ 127092113 127511554 126160009 122237994 115603370 109889892 106584205 104201303 102967835
18557A02967835J577411L342305K601078K122642K574999M18348l338299l402790
$$ 102967835 104545246 107887551 110488629 112611271 115186270 115604618 112266319 108863529
18549A08863529l849578n995682o370620m284454k971883l318859k892106j685050
$$ 108863529 105013951 99018269 92647649 88363195 85391312 82072453 79180347 77495297
18541G7495297k064535l788847l791527m084944n127364n412717m648944m079726
$$ 77495297 75430762 71641915 67850388 63765444 58638080 53225363 48576419 44496693
18533D4496693l883308l244059k520586k002095j674640j421297j237242j106801
$$ 44496693 40613385 37369326 34848740 32846645 31172005 29750708 28513466 27406665
18525B7406665r83207q87940q21757p89676p64791p12177p00438p04606o56797
$$ 27406665 26423458 25535518 24713761 23924085 23159294 22447117 21746679 21042073 20385276
18516B0385276o37542o14173n68269m99761n07681m98767m51181m46411m47437
$$ 20385276 19747734 19133561 18565292 18065531 17557850 17059083 16607902 16161491 15714054
18507A5714054m35138m16798m08302l64578l70165l74086l65983l48131l25174
$$ 15714054 15278916 14862118 14453816 14089238 13719073 13344987 12979004 12630873 12305699
18498A2305699k84578k83211k83263k76726k44278k34828k13404k10618k14313
$$ 12305699 12021121 11737910 11454647 11177921 10933643 10698815 10485411 10274793 10060480
18489A0060480k19180k70139k52026k05536j81035j95812j91634j76560j75807
$$ 10060480 9841300 9571161 9319135 9113599 8932564 8736752 8545118 8368558 8192751
18480H192751j52565j54185j74351j59440j15460j42069j41090j43088j10492
$$ 8192751 8040186 7886001 7711650 7552210 7436750 7294681 7153591 7010503 6900011
18471F900011j23053j07366p4499p6515j27648r8140n6670p0836q1742q2722p7600
$$ 6900011 6776958 6669592 6595093 6518578 6390930 6292790 6236120 6165284 6083542 6000820 5923220
18460E923220l4873m760J4596N312k228k759K3042k2871j7129r298j1247j6035
$$ 5923220 5888347 5883587 5898183 5903495 5901267 5898508 5921550 5898679 5881550 5872252 5861005 5844970
18448E844970j3717m0331o1103l0002n2118o048l5314l6977k5676k6975q272k8843
$$ 5844970 5831253 5790922 5729819 5699817 5647699 5641651 5606337 5569360 5543684 5516709 5508437 5479594
18436E479594o0212q2839p4938n7142q7003r0998o9892p1289o4903o4322n9707
$$ 5479594 5419382 5336543 5261605 5204463 5117460 5026462 4956570 4885281 4820378 4756056 4696349
18425D696349n2591l9113n2257o2601q3877m8670l9059m4912n6780p4988n7964
$$ 4696349 4643758 4604645 4552388 4489787 4405910 4357240 4318181 4273269 4216489 4141501 4083537
18414D083537m6641J211k762n2385m9202M996j0359o5037m4584l8588Q366r567
$$ 4083537 4036896 4038107 4035345 3982960 3933758 3938754 3928395 3863358 3818774 3780186 3788552 3778985
18402C778985m1016k8722k842l321p21k505L5406J7675K2966l998J7536k5972
$$ 3778985 3737969 3709247 3706405 3703084 3702363 3699858 3735264 3752939 3775905 3771907 3789443 3763471
18390C763471m8248r401J969k8619Q831J5735R502j2661l3093n0538l4570k5811
$$ 3763471 3715223 3705822 3707791 3679172 3688003 3703738 3713240 3700579 3667486 3616948 3582378 3556567
18378C556567n2738l8381j4400J5323K0417P093j6881l2606o6210o3871l6615
$$ 3556567 3503829 3465448 3451048 3466371 3486788 3493881 3477000 3444394 3378184 3314313 3277698
18367C277698k7360o678q354m384J7942K5238N7797Q4198Q4129N1095P7155J31777
$$ 3277698 3250338 3243660 3235306 3230922 3248864 3274102 3331899 3416097 3500226 3551321 3628476 3760253
18355C760253J41025J85225K30131K44821K36066K42939K76964K81688K68482
$$ 3760253 3901278 4086503 4316634 4561455 4797521 5040460 5317424 5599112 5867594
18346E867594K74796L11950K87798L13226M38865N11973O85715Q91955J020388
$$ 5867594 6142390 6454340 6742138 7055364 7494229 8006202 8691917 9583872 10604260
18337A0604260J112807J227069J371862J683683K039942K667423L755947N504313
$$ 10604260 11717067 12944136 14315998 15999681 18039623 20707046 24462993 29967306
18329B9967306Q081893J0607673J2039954J1438892R384772O495161K770635k58311
$$ 29967306 38049199 48656872 60696826 72135718 81520490 88015651 90786286 90527975
18321I0527975l046226n460571q066411q969321p069115l382541J033604N231030
$$ 90527975 87481749 82021178 73954767 64985446 57916331 54533790 55567394 60798424
18313F0798424Q405813R616151Q465664O216432K902029o61202l492967o039776
$$ 60798424 69204237 78820388 87286052 93502484 96404513 95743311 92250344 86210568
18305H6210568q559798j1113450j1363060r522889o818547m654750l280358k428435
$$ 86210568 77650770 66537320 55174260 45651371 38832824 34178074 30897716 28469281
18297B8469281j964106j661914j478919j380303j323459j244908j085255r64072
$$ 28469281 26505175 24843261 23364342 21984039 20660580 19415672 18330417 17366345
18289A7366345p94155o06617m93385l49748k43319j52753j35553k05631k56396
$$ 17366345 16572190 15965573 15472188 15122440 14879121 14726368 14590815 14385184 14128788
18280A4128788k92531l81085m25246m99940n30493n27366m76544m28477m01368
$$ 14128788 13836257 13455172 13029926 12529986 11999493 11472127 10995583 10567106 10165738
18271A0165738l62616l33964l37772k85057k49671k18882k19762k18426k32219
$$ 10165738 9803122 9469158 9131386 8846329 8596658 8377776 8158014 7939588 7707369
18262G707369j95710j80731k01333k01455j84888j58043j46489j35264j39372
$$ 7707369 7511659 7330928 7129595 6928140 6743252 6585209 6438720 6303456 6164084
18253F164084j01109q7459r2836p8354q0117q1806p4973o7087j07324j40813j30695
$$ 6164084 6062975 5975516 5882680 5804326 5724209 5642403 5567430 5500343 5393019 5252206 5121511
18242E121511j04368j01325r0406q1648r5424q7769n9195p4400l1308j3570m2898
$$ 5121511 5017143 4915818 4825412 4743764 4648340 4560571 4501376 4426976 4395668 4382098 4339200
18231D339200m1844k3159R24J6613j2252j2669J8239R722K151k7075p0352k9198
$$ 4339200 4297356 4274197 4275121 4291734 4279482 4266813 4285052 4294774 4296925 4269850 4199498 4170300
18219D170300k00K4581K9143J8093L2053Q5759R5088N0773K791m5762o9419j14144
$$ 4170300 4170100 4194681 4223824 4241917 4273970 4359729 4454817 4505590 4508381 4462619 4393200 4279056
18207D279056r0703o9941o4104l2210k4157j2713K1914J0615j0036q6425r5951
$$ 4279056 4188353 4118412 4054308 4022098 3997941 3985228 4007142 4017757 4007721 3921296 3825345
18196C825345r6936r9199j08388q5908q9782r9255n0639m5656k5232k5166m5750
$$ 3825345 3728409 3629210 3520822 3434914 3345132 3245877 3195238 3149582 3124350 3099184 3053434
18185C053434j1630J559l6037k8350j6254l0727m3462r9095p5814k2250m4242
$$ 3053434 3041804 3043363 3007326 2978976 2962722 2931995 2888533 2789438 2713624 2691374 2647132
18174B647132r3258m7104m0821j9051n0579n2033l2623Q8k6802j6223q378k3871
$$ 2647132 2553874 2506770 2465949 2446898 2396319 2344286 2311663 2311751 2284949 2268726 2260348 2236477
18162B236477p404O469J0149j2925l708L171J2934k301J5709o715j7498j3967
$$ 2236477 2229073 2235542 2245691 2232766 2229058 2232229 2245163 2242862 2258571 2251856 2234358 2220391
18150B220391M364O588k4603k3725l4474r578k1332j8205n0920j496q59L763j5391
$$ 2220391 2224755 2231343 2206740 2183015 2148541 2138963 2117631 2099426 2048506 2047010 2046151 2049914 2034523
18137B034523k3039M28K3965K262j3296l943R69j6777Q863K3693M2511L1458M6965
$$ 2034523 2011484 2011912 2035877 2038139 2024843 2020900 2021869 2005092 2013955 2037648 2080159 2111617 2158582
18124B158582L0399j3779K5728L6340K1539M5260Q0784J67133J82580K23355K98904
$$ 2158582 2188981 2175202 2200930 2237270 2258809 2304069 2384853 2551986 2734566 2957921 3256825
18113C256825L97081M69021O67133R60789J556908K610572M538116O478421M446315
$$ 3256825 3653906 4122927 4790060 5750849 7307757 9918329 14456445 20934866 25381181
18104B5381181J675284K33384n431124o663596m070796k324274j433736r70645
$$ 25381181 27056465 27289849 21858725 15195129 11124333 8800059 7366323 6395678
18096F395678o85227n32080m40405l88157l70558l27153k67562k06084j50449
$$ 6395678 5710451 5178371 4737966 4349809 3979251 3652098 3384536 3178452 3028003
18087C028003j18920q0387o7690q8049l3521j7728K4209p617K3182K4362N037
$$ 3028003 2909083 2828696 2761006 2672957 2639436 2621708 2645917 2638300 2661482 2685844 2690881
18076B690881J472l7686r0446q5905o7303n8012l5795n5415l4893j5853l8575
$$ 2690881 2692353 2654667 2564221 2478316 2411013 2353001 2317206 2261791 2226898 2211045 2172470
18065B172470j2846J8874R438K1951M8930P4566P7592N6075N7058M2029L1270
$$ 2172470 2159624 2178498 2187936 2209887 2258817 2333383 2410975 2467050 2524108 2566137 2597407
18054B597407q963p5053q9852j51976j31295j36389q7073m9862k9566J6940J094
$$ 2597407 2588444 2513391 2423539 2271563 2140268 2003879 1916806 1866944 1837378 1854318 1855412
18043A855412k750r177k483K785N639K3353M6995O9306L7618M5066M8301M6854
$$ 1855412 1852662 1843485 1841002 1843787 1849426 1872779 1919774 1989080 2026698 2071764 2120065 2166919
18031B166919P8896M2339O378q637j4279j9500j2381J216J7663k082o714J847
$$ 2166919 2245815 2288154 2294532 2285895 2271616 2252116 2239735 2240951 2258614 2256532 2249818 2251665
18019B251665J0432K4297N3310N0885K8545P1024Q5088J07408J47527K18969K91958
$$ 2251665 2262097 2286394 2339704 2390589 2419134 2490158 2575246 2682654 2830181 3049150 3341108
18008C341108K24575J48811O0040j24541k09495k26475k86521k39528j76627j26304
$$ 3341108 3565683 3714494 3774534 3649993 3440498 3214023 2927502 2687974 2511347 2385043
17998B385043p9641m3292K143k0244L4557M8435K5304O1016Q6946Q7026P7809
$$ 2385043 2305402 2262110 2264253 2244009 2278566 2327001 2352305 2413321 2500267 2587293 2665102
17987B665102P3698L4998J879K3887j805K9598M5379N2601P0580N9675M4695L5293
$$ 2665102 2738800 2773798 2775677 2799564 2797759 2827357 2872736 2925337 2995917 3055592 3100287 3135580
17975C135580N1582P2877R0979J16660J14804J16780J48577K34630L13653M09390
$$ 3135580 3187162 3260039 3351018 3467678 3582482 3699262 3847839 4082469 4396122 4805512
17965D805512N18838P25420J070245J499532J835603J909351K104146K332236
$$ 4805512 5324350 6049770 7120015 8619547 10455150 12364501 14468647 16800883
17957A6800883K039277J492171J602141J551182R05534R71010J788555K062935
$$ 16800883 18840160 20332331 21934472 23485654 24391188 25362198 27150753 29213688
17949B9213688J485416J229183J356261N43568q24606p36663p87218j341329j481749
$$ 29213688 30699104 31928287 33284548 33828116 33003510 32266847 31479629 30138300 28656551
17940B8656551q46994n46730p28338q67807o52540j267040k183615k022221j594004
$$ 28656551 27809557 27262827 26534489 25666682 25014142 23747102 21563487 19541266 17947262
17931A7947262j643731j707775j310477r10688o10243m13192k67004j64166l8588
$$ 17947262 16303531 14595756 13285279 12374591 11764348 11351156 11084152 10919986 10881398
17922A0881398Q0592J80934K50721L72670N29472P41669J009500J490510K194767
$$ 10881398 10961990 11142924 11393645 11766315 12295787 13037456 14046956 15537466 17732233
17913A7732233L042771L620476L761641M362656M727573M002788L057112L467312
$$ 17732233 20775004 24395480 28157121 32519777 37247350 41250138 44307250 47774562
17905D7774562K797045J429369K024284L655594L597758K576845K692465K947278
$$ 47774562 50571607 52000976 54025260 57680854 61278612 63855457 66547922 69495200
17897F9495200P86417j363555j147904k205240l632468l460793k172539k112155
$$ 69495200 70281617 68918062 67770158 65564918 61932450 58471657 56299118 54186963
17889E4186963k492197k306088j851632l209113m359528l844669l262067l512985
$$ 54186963 51694766 49388678 47537046 44327933 39968405 36123736 32861669 29348684
17881B9348684l454022k672903j927494j401475j074312q75773p82703o82191
$$ 29348684 25894662 23221759 21294265 19892790 18818478 17942705 17160002 16477811
17873A6477811n42178m97837m90534m51551m05154l31513k94908l00865k78636
$$ 16477811 15935633 15437796 14947262 14495711 14090557 13759044 13464136 13163271 12884635
17864A2884635k38069k53577k91447k51804k22022k05120j91007j76690j80267
$$ 12884635 12646566 12392989 12101542 11849738 11627716 11422596 11231589 11054899 10874632
17855A0874632j88596j50508j49810j74203j47921q0574l4061l3166q662P2828
$$ 10874632 10686036 10535528 10385718 10211515 10063594 9983020 9948959 9915793 9907131 9979959
17845I979959J29693J90639L14176M65804N86911Q04636J143712J512681K035207
$$ 9979959 10109652 10300291 10614467 11080271 11667182 12471818 13615530 15128211 17163418
17836A7163418K876315M207529O255694Q590685J0303452J0576352R131631N848395
$$ 17163418 20039733 24247262 30502956 39093641 49397093 59973445 69105076 74953471
17828G4953471M84103m439793p733001r847710r885206q148755n758067l912810
$$ 74953471 75437574 70997781 63264780 53417070 43531864 35383109 29625042 25712232
17820B5712232k757421k078778j681245j439294j275039j117712r49512p80949
$$ 25712232 22954811 20876033 19194788 17755494 16480455 15362743 14413231 13632282
17812A3632282o19260m46466l09752j68216p9461j5337M2573O1176J0781k5449
$$ 13632282 13013022 12566556 12256804 12088588 12009127 11993790 12036363 12097539 12108320 12082871
17802A2082871J7784J2757M292J207M0606O7685J15996J93916L08001M63841P27987
$$ 12082871 12100655 12113412 12117704 12118911 12159517 12227202 12343198 12537114 12845115 13308956 14036943
17791A4036943J080655J483189K087198K960436M261907O317565R161666J2048729
$$ 14036943 15117598 16600787 18687985 21648421 25910328 32227893 41389559 53438288
17783E3438288J3850685J3206541J0363214M965975k488776p916568j1601271
$$ 53438288 67288973 80495514 90858728 95824703 93335927 85419359 73818088
17776G3818088j3198947j1970720r226859o320088m306150l143871k498269k071442
$$ 73818088 60619141 48648421 39421562 33101474 28795324 25651453 23153184 21081742
17768B1081742j796378j553393j309983j108508q80093o91834n14442m05507k84119
$$ 21081742 19285364 17731971 16421988 15313480 14433387 13741553 13227111 12821604 12537485
17759A2537485j56041n8969n598l6688J9886l961o5772j35794j85889j81692j83957
$$ 12537485 12381444 12322475 12316877 12280189 12300075 12296114 12230342 12094548 11908659 11726967 11543010
17748A1543010k11973k33942j83282j54091o7354J4612J73715L91897P10356J057793
$$ 11543010 11331037 11097095 10913813 10759722 10692368 10706980 10880695 11272592 11982948 13040741
17738A3040741J565187K419053L509510M467175M949328M398167L093568Q23085
$$ 13040741 14605928 17024981 20534491 25001666 29950994 34349161 37442729 38265814
17730C8265814j796343l490288m658924m846207m116667l051650k104439j464881
$$ 38265814 36469471 32979183 28320259 23474052 19357385 16305735 14201296 12736415
17722A2736415j059344q17555p07687o13407n72650m80453l90138l68220l03739
$$ 12736415 11677071 10859516 10151829 9538422 8965772 8485319 8095181 7726961 7423222
17713G423222k69179k32995j86549j25832o2840j7822o575j973J5148k7925q7193
$$ 7423222 7154043 6921048 6734499 6608667 6545827 6528005 6521430 6519457 6534605 6506680 6419487
17702F419487j29641j57167j86707k12444j78785j89641k12575j71938j49105
$$ 6419487 6289846 6132679 5945972 5733528 5554743 5365102 5152527 4980589 4831484
17693D831484j95907j67318j61690j36197j25761q6101r5148j14695o4509r2995
$$ 4831484 4635577 4468259 4306569 4170372 4044611 3958510 3863362 3748667 3684158 3591163
17683C591163j12830r7928n4485m4179n7614n2751o4976o3692o9005o3705o7793
$$ 3591163 3478333 3380405 3325920 3281741 3224127 3171376 3106400 3042708 2973703 2909998 2842205
17672B842205m8882m4292n1083m2786l6676m0907n6396j2794l6875m3596j2179
$$ 2842205 2793323 2749031 2697948 2655162 2618486 2577579 2521183 2508389 2471514 2427918 2415739
17661B415739R542r329L415P544K4225j7005k286m108m2132p3894o5130o9047
$$ 2415739 2425281 2415952 2419367 2426911 2451136 2434131 2431845 2427737 2385605 2311711 2246581 2177534
17649B177534o8852m7677o5919l8874m0887o1243n3504k9856k6654l7890l2492
$$ 2177534 2108682 2061005 1995086 1956212 1915325 1854082 1800578 1770722 1744068 1706178 1673686
17638A673686l6239l3970k7957l4391l7653k0512m7036j9430K0985l890L2369
$$ 1673686 1637447 1603477 1575520 1541129 1503476 1482964 1435928 1416498 1437483 1433593 1465962
17627A465962R199j3242p1387m2772l6971n457m4427l2083k4596m705j8526k6164
$$ 1465962 1475161 1461919 1390532 1347760 1310789 1305332 1260905 1228822 1204226 1199521 1180995 1154831
17615A154831l0476k6089J7167K5667n179k9972k9145Q991K3191J268k0103l5365
$$ 1154831 1124355 1098266 1115433 1141100 1135921 1105949 1076804 1085795 1108986 1110254 1090151 1054786
17603A054786l7205r852j2337K061J8472j5912q116o5126o3596m2374K825R525
$$ 1054786 1017581 1007729 995392 997453 1015925 1000013 991897 926771 863175 820801 823626 833151
17591H33151j5890q489j2928Q557l6125l6398k858K3193R123K302j6716j2443
$$ 833151 817261 808772 795844 804401 768276 731878 729020 752213 761336 763638 746922 734479
17579G34479j5074k5349k5797j5416J0466j0590k4243k2477k8225K870l4469n3452
$$ 734479 719405 694056 668259 652843 663309 652719 628476 605999 577774 580644 546175 492723
17567D92723j1522j4105L396j535p921j9555j2337L2636j3756m3080l6814R937
$$ 492723 481201 467096 470492 468957 461036 441481 429144 461780 448024 404944 368130 378067
17555C78067K0694L2049k322l9203k0789K346j5287o192j2967R940J1763j8960
$$ 378067 398761 430810 428488 389285 368496 370842 355555 349363 336396 346336 358099 339139
17543C39139J1321K3222p310m052k5107j7525j8086j185p542J3739J0520k3018
$$ 339139 350460 373682 366372 362320 337213 319688 301602 300417 292875 306614 317134 294116
17531B94116j9944p501N414j5979l8724j6139M301l3625L465K118J8040K0065
$$ 294116 274172 266671 272085 256106 217382 201243 205544 171919 175384 177502 195542 215607
17519B15607j5455l4831k185J5248J8170j8459P876J6885j3463K391P047l6128
$$ 215607 200152 165321 163136 178384 196554 178095 185971 202856 189393 191784 198831 162703
17507A62703J5187K227k2858k8125r800K2189J3833k2958j4133O338K1890J2782
$$ 162703 177890 180117 157259 129134 119334 141523 155356 132398 118265 124603 146493 159275
17495A59275l846M711J4844q831k3296m4131J0095J2245J4206K0159j4762j4691
$$ 159275 155429 160140 174984 166153 142857 98726 108821 121066 135272 155431 140669 125978
17483A25978k5562K1927J5074j2878j2763k904M581L4260m922m35p322l014j9413
$$ 125978 100416 122343 137417 124539 111776 108872 113453 147713 142791 142356 135034 132020 112607
17470A12607k8078j5065j1342J0103K7478l429j4332k7592n408N242N308Q817
$$ 112607 84529 69464 58122 68225 95703 92274 77942 50350 44942 50184 55492 64309
17458F4309J0711j5826K1273L526J5134j2158j0294r350L0461K6183m056l966
$$ 64309 75020 59194 80467 83993 99127 86969 76675 67325 97786 123969 119913 115947
17446A15947l332K568M0339K7111L5342N9484N0829P7501O3498M5206M676k9907
$$ 115947 112615 115183 155522 182633 217975 277459 328288 405789 469287 514493 519169 489262
17434D89262n0383m5528r987L2520N238n1751m6214J855o548P224M941k035n580
$$ 489262 438879 393351 383364 415884 421122 369371 323157 325012 318464 325688 330629 328594 323014
17421C23014j8345j8932j7236L576j084j2711l2516m7742l7488j396r430r62j4610
$$ 323014 304669 285737 268501 272077 270993 258282 225766 178024 140536 139140 129710 128748 114138
17408A14138o077j693m080k387J0065J2751L148l4958k2727k940O907K7728K7058
$$ 114138 108061 106368 102288 99901 109966 122717 125865 90907 68180 65240 72147 99875 126933
17395A26933J1533L9319L7396K1712J2804J4284K3240o148J0642J437j4701j2087
$$ 126933 138466 177785 215181 236893 249697 263981 287221 281073 291715 293152 278451 266364
17383B66364J0126Q467j2896k7098J842L1150j5172j7278j5025J5872o55m149
$$ 266364 276490 284957 272061 244963 246805 277955 262783 245505 230480 246352 245697 241548
17371B41548K2039r421o298k6757k9207l7921k0653Q81j3943k9658q543J1690
$$ 241548 263587 254166 247868 221111 191904 153983 133330 134211 120268 90610 82067 93757
17359I3757R106j1463j1753O099K6006q139J129j7728j501r768K7207n259k714
$$ 93757 102863 91400 79647 85746 111752 103613 104742 87014 85513 75745 102952 97693 94979
17346I4979k0643k5655Q541K4047j771j0765k8485L679j0976K6100K4631K4575
$$ 94979 74336 48681 57222 81269 79498 68733 40248 43927 32951 59051 83682 108257
17334A08257J1532o159p958o229r831k8250k2134J4205O059K2235K5615J6397
$$ 108257 119789 113630 105672 99443 89612 61362 39228 53433 59492 81727 107342 123739
17322A23739N385J6473M9018L9450M1844M2974K4562l5389n8638m1755k0943l0011
$$ 123739 129124 145597 194615 234065 275909 318883 343445 308056 249418 207663 186720 156709
17310A56709m0329l650K6512K995j2938K850j2305N690n507l5657k3780m3791
$$ 156709 116380 112730 139242 142237 129299 132149 119844 125534 120027 84370 60590 16799
17298A6799J1938O570j1693J4904J6456j178J6195K8156M2005o651j9622J176
$$ 16799 28737 35307 23614 38518 54974 53796 69991 98147 140152 133501 113879 115055
17286A15055k671j9784k1564j1481k9485j4368p748K1065K5170N7668L6726O024
$$ 115055 112384 92600 71036 59555 30070 15702 7954 29019 54189 111857 148583 154607
17274A54607j3629j0073L5126Q9705R4893P7535L0916K7465k344n2265r3022j02935
$$ 154607 140978 130905 166031 255736 350629 428164 459080 486545 484201 431936 338914 235979
17262B35979n8141k4974j2568n4127j3322J1868q78M225k858j1087J8828j030
$$ 235979 177838 152864 140296 86169 72847 84715 83837 88062 85204 74117 92945 91915
17250I1915l4558k4077q438o733K528J0924j4275P808j251p629j9940L3665L8852
$$ 91915 57357 33280 24842 18109 20637 31561 17286 25094 23843 16214 -3726 29939 68791
17237F8791n347J4517m911k9724Q28l001k852J015L1275K8805l0922J6927K3689
$$ 68791 63444 77961 73050 43326 44154 41153 38301 39316 70591 99396 68474 85401 109090
17224A09090l1968n306K2290M5480N6406L1481K5493M906j4434m7350k8763l4939
$$ 109090 77122 71816 94106 139586 195992 227473 252966 257872 243438 196088 167325 132386
17212A32386n0855l4610J3890k0774k6244K3707j1421j0052j5242k1289J6734
$$ 132386 81531 46921 60811 40037 13793 37500 26079 16027 785 -20504 -3770
17201c770k071O727P678j2604j3267Q89K3169P525q728l7144j3631J2372M8471
$$ -3770 -5841 886 8564 -4040 -17307 -16418 6751 14276 5548 -31596 -45227 -32855 15616
17188A5616J2056l9627j5807j7742O005K1755q053j875k323L904K5693O1659J2922
$$ 15616 27672 -11955 -27762 -45504 -39499 -17744 -25797 -27672 -29995 -26091 -398 61261 74183
17175G4183j9815m4712l8931J1008K4948J2052N585k1530n905j6573j5621J4084
$$ 74183 54368 9656 -29275 -18267 6681 18733 24318 2788 -3117 -19690 -35311 -21227
17163b1227j1460N446J2376J1032K470m960q369J6030N4501N011P82M0616L3237
$$ -21227 -32687 -27241 -14865 -3833 -1363 -6323 -14692 1338 55839 60850 61632 102248 135485
17150A35485N0905L4040K5049J6936n644l179j4149l2814j3550r814Q258N388
$$ 135485 186390 220430 245479 262415 256771 253592 239443 206629 193079 183265 191523 196911
17138A96911N8696Q0692O5832O9523L6149k1417m4423n6162m6126o4979o3479
$$ 196911 255607 336299 402131 471654 507803 486386 441963 385801 339675 274696 211217
17127B11217k9487n097r050L4603M7101N6897K6445M418j2799m1994m2382m8906
$$ 211217 181730 176633 167583 202186 249287 306184 332629 337047 324248 282254 239872 190966
17115A90966m6153k7017l5743o774j1898l755j4073J199j6580j2035j797J2447
$$ 190966 144813 117796 82053 75279 63381 59626 45553 46752 30172 18137 16340 28787
17103B8787j4669J1009Q521j7592K4514j5415L971R535K32R666J924j0036j4074
$$ 28787 14118 25127 33648 16056 40570 25155 29126 38661 38893 48559 50483 40447 26373
17090B6373q730o346J1978r5l5363l1452p056q520J9927L652O524J0707k334L8474
$$ 26373 17643 11297 23275 23180 -12183 -43635 -50691 -59211 -39284 -35632 -29108 -18401 -20735 17739
17076A7739K3564q384j7949n543J4528j6232o912j4996k8278p43J4418q731J7475
$$ 17739 41303 32919 14970 9427 23955 7723 811 -14185 -42463 -43206 -28788 -37519 -20044
17063b0044J57m076J2162N673K0476o72k2664K700j9532q193J0576K5988q70o268
$$ -20044 -19887 -23963 -11801 -6128 14348 13676 -8988 -6288 -25820 -34013 -23437 2551 1681 -4587
17049d587l9557q771n221k2895J1964L4845l3842O219O296J419K0138J1011k638
$$ -4587 -44144 -52915 -58136 -81031 -69067 -34222 -68064 -61845 -55549 -54130 -33992 -22981 -25619
17036b5619j3861J8488j0153l8332j3516j3221k0681L0459M3037o886l1977J4213
$$ -25619 -39480 -20992 -31145 -69477 -82993 -96214 -116895 -86436 -43399 -50285 -82262 -68049
17024f8049J3283j9796j4774J1301K1722o76M827O186K011Q79k3640j26J8166
$$ -68049 -54766 -74562 -89336 -78035 -56313 -56989 -52162 -45976 -43965 -43086 -66726 -66852 -48686
17011d8686k3053K3421q242J6793J6251o571j0232k0292m4774J307K6410M646
$$ -48686 -71739 -48318 -56560 -39767 -23516 -30087 -40319 -60611 -105385 -104078 -77668 -73022
16999g3022K5700J3000J2595k0224m768Q025J8501q361R932n356j4300K452Q067
$$ -73022 -47322 -34322 -21727 -41951 -46719 -38694 -20193 -28554 -18622 -23978 -38278 -35826 -27759
16986b7759k997l7970n832N136J3657p391j316j298j7647J836K4805K1730l534
$$ -27759 -30756 -68726 -74558 -69422 -55765 -63156 -64472 -65770 -83417 -81581 -56776 -35046 -38580
16973c8580J1840j6456j3498K1354J2965q414j9293Q50K7330j566K330Q782k1335
$$ -38580 -26740 -43196 -56694 -35340 -22375 -30789 -50082 -49232 -21902 -23468 -21138 -12356 -33691
16960c3691k1357R07J7898j053o594J9084J6414M272J7190J0529K0319J8117l894
$$ -33691 -55048 -54141 -36243 -37296 -43890 -24806 -8392 -4120 13070 23599 43918 62035 58141
16947E8141k0423l0237j9646k2749k770P01J7478J1312q809k3318l213Q195k233
$$ 58141 37718 7481 -12165 -34914 -37684 -36983 -19505 -8193 -17002 -40320 -43533 -35338 -37571
16934c7571l1087j695J5464K798n10J4482J7966k1807P102J5984p521R777o691
$$ -37571 -68658 -70353 -54889 -52091 -52601 -38119 -20153 -41960 -34858 -18874 -26395 -16618 -23309
16921b3309r043J387L1750M897j3281n5252L00R134K157l429l3399K907j1476
$$ -23309 -32352 -30965 785 5682 -7599 -62851 -62551 -53417 -51260 -54689 -88088 -85181 -96657
16908i6657L0235Q069L0707N0182k620r525j5624m5503k2800j3861N494M1544
$$ -96657 -66422 -58353 -27646 22536 19916 10391 -5233 -50736 -73536 -87397 -81903 -40359
16896d0359Q935j4982l9765p145Q958K2714M858j7287K1455P530j6572J4349N703
$$ -40359 -31424 -46406 -86171 -93316 -84358 -61644 -56786 -74073 -52618 -45088 -61660 -47311 -41608
16883d1608j7508j854L3658j18n1598J3491J7190j2842j063k292j6176j9894j1744
$$ -41608 -59116 -60970 -27312 -27430 -79028 -65537 -48347 -61189 -62252 -64544 -80720 -100614 -112358
16870a12358J5537P497O432J1237J1828J0347j6643L781J2964K1562k803j935
$$ -112358 -96821 -89324 -82892 -71655 -59827 -49480 -66123 -62342 -49378 -27816 -30619 -32554
16858c2554J02l1392k2316K0676J3982j914M443R706Q718J6425L4894K9029k6045
$$ -32554 -32452 -63844 -86160 -65484 -51502 -53416 -48973 -39267 -30549 -14124 20770 49799 23754
16845B3754q312l017k9222P657O178J4574n374k5543J3956J2607K5364K4727J5531
$$ 23754 15442 12425 -16797 -9140 -2962 11612 6238 -19305 -5349 7258 32622 57349 72880
16832G2880l1606j0732J6587l0504j3876J8888N199j1555p400P180N610L8842
$$ 72880 41274 30542 47129 16625 2749 21637 26836 15281 7881 15061 20671 59513
16820E9513K0541k5762k0882K2560K8110o981j7223j5666m0407L046J9828R49
$$ 59513 80054 54292 33410 55970 84080 77099 59876 44210 3803 6849 26677 27626
16808B7626j4583J3327J6927j6556j0972j0586q73j304J266M062l199J7168J8900
$$ 27626 13043 26370 43297 26741 15769 5183 4310 3006 4272 8334 5135 22303 41203
16795D1203o687j2530j1221J5060J5120j3461j687j1058p543O405k481k2700l0255
$$ 41203 34516 21986 10765 25825 40945 27484 25797 14739 7196 13601 11120 -11580 -41835
16782d1835J9908N146M767J7370n602j61L7368N489p13J9730j1839l9978o747
$$ -41835 -21927 -16781 -12014 5356 -246 -407 36961 42450 41737 61467 49628 9650 2903
16769B903J1115J1052j3754j026J310L829P924r26J2854J7156r21J4228k3202
$$ 2903 14018 25070 11316 10290 11600 15429 23353 22427 35281 52437 51516 65744 42542
16756D2542j8620L551J6116R316k1318P206K4554J7592n202j9169J5901J5363
$$ 42542 23922 27473 43589 52905 31587 38793 63347 80939 75737 56568 72469 87832
16744H7832P992j3266j0589K7145K0685K6952N010k9399j2557J5459P637J4662
$$ 87832 95824 82558 71969 99114 119799 146751 151761 122362 109805 125264 132901 147563
16732A47563M800j3787l533r528K1624M2068K3833J1531p587o622M217N9259M6433
$$ 147563 152363 138576 135043 125515 147139 189207 213040 224571 216984 210362 214579 273838 320271
16719C20271K5878L6981L0101j5275j4344N685j637J6937K741M2512O0632N4328
$$ 320271 346149 383130 413231 397956 383612 389297 387660 404597 407338 449850 510482 564810
16707E64810K5964M8907M7408J0755l368j6452k3351q109J8266L2177K306m240
$$ 564810 590774 639681 687089 697844 694476 678024 654673 646564 664830 697007 699313 695073
16695F95073O521k525j79R614P686j3518k6419l3635K4170Q784J0606j7765j5397
$$ 695073 701594 699069 698890 708504 716190 702672 676253 642618 666788 675572 686178 668413 653016
16682F53016J5363R326O204M2702L0022K837K5722N0013M8200N2322Q3395J26644
$$ 653016 668379 677705 683909 726611 756633 759470 785192 835205 883405 935727 1019122 1145766
16670A145766J62638J36801O9907K3800n7430j14506p7852k3682j3509J1053R6678
$$ 1145766 1308404 1445205 1515112 1538912 1481482 1366976 1289124 1265442 1251933 1262986 1359664
16659A359664J37389J75923K49711K32668J53353K5414j27977k50729k36865j57311
$$ 1359664 1497053 1672976 1922687 2155355 2308708 2334122 2206145 1955416 1718551 1561240
16649A561240r0315j7496O82K2028P9734R6515R6906O9105J0362n3464j13483
$$ 1561240 1470925 1453429 1454111 1476139 1555873 1652388 1749294 1818399 1828761 1775297 1661814
16638A661814j34535j14333n9011k2375K1127J5604L4853K6057M0269M4512L6273
$$ 1661814 1527279 1412946 1353935 1331560 1352687 1368291 1403144 1429201 1469470 1513982 1550255
16627A550255K4825K6931Q0820P6831N1656K0256P9330J37741J53842J12878J12100
$$ 1550255 1575080 1602011 1682831 1759662 1811318 1831574 1910904 2048645 2202487 2315365 2427465
16616B427465R8000J18381J36780J45934J86603K37800K73815K57494L02166L33069
$$ 2427465 2525465 2643846 2780626 2926560 3113163 3350963 3624778 3882272 4184438 4517507
16606D517507L76958M29559M97622N84798P16647R15834J205103J539410J893889
$$ 4517507 4894465 5324024 5821646 6406444 7123091 8038925 9244028 10783438 12677327
16597A2677327K409780L224968M553302O781164R667442J0804475Q044182L980480
$$ 12677327 15087107 18312075 22865377 29646541 39313983 50118458 58162640 62143120
16589F2143120j014708o831076q076944n169697j868810R55631L675009P016334
$$ 62143120 61128412 54297336 46220392 41050695 39181885 40137516 43812525 50828859
16581E0828859J0963082J3663048J3397714J1720859O358048l078788q608346
$$ 50828859 61791941 75454989 88852703 100573562 106931610 103852822 95244476
16574I5244476j1737137j3806165j1436230p341282l936121j269539J407650M543017
$$ 95244476 83507339 69701174 58264944 50923662 46987541 45718002 47125652 51668669
16566E1668669P393190P182999L672688l47537n916104j0590273j0031173p119875
$$ 51668669 59061859 66244858 69917546 69570009 63653905 53063632 43032459 35912584
16558C5912584m839818l419215k534656j897498j528033j296098j057556r06375
$$ 35912584 31072766 27653551 25118895 23221397 21693364 20397266 19339710 18433335
16550A8433335p86688o55411n87579n33005n85518o24324o54368o32953n77319
$$ 18433335 17646647 16991236 16403657 15870652 15285134 14660810 14006442 13373489 12796170
16541A2796170m77672l73621l06052k47113j87355j88859k17181k71230l10815
$$ 12796170 12318498 11944877 11638825 11391712 11204357 11015498 10798317 10527087 10216272
16532A0216272l55385l88087m03416l65801l28724k83863k70316k42775j95685
$$ 10216272 9860887 9472800 9069384 8703583 8374859 8090996 7820680 7577905 7382220
16523G382220j65795j58138j65694j83082k08977j93691j69579j43674j74944
$$ 7382220 7216425 7058287 6892593 6709511 6500534 6306843 6137264 5993590 5818646
16514E818646j56816j41937j62765j24907j16217j20556r1311j03089j38100q8441
$$ 5818646 5661830 5519893 5357128 5232221 5116004 4995448 4904137 4801048 4662948 4574507
16504D574507q1060j14225q1383q4895j03031j07982j21660r6630p7583p8345
$$ 4574507 4493447 4379222 4297839 4212944 4109913 4001931 3880271 3783641 3706058 3627713
16494C627713p8662n8472p3181o0527p4220q2393p7947q2045n8104m1110o2460
$$ 3627713 3549051 3490579 3417398 3356871 3282651 3200258 3122311 3040266 2982162 2941052 2878592
16483B878592m7981m1614n9079n0267r8983o2739q568l6010o0954k7111l8856
$$ 2878592 2830611 2788997 2729918 2679651 2580668 2517929 2509361 2473351 2412397 2385286 2346430
16472B346430j6249p074k592K655m298j8550j4812P752q273o8135m1247k6250
$$ 2346430 2330181 2323107 2320515 2323170 2318872 2300322 2285510 2293262 2284989 2216854 2175607 2149357
16460B149357J353J265K1313J0485N232J8362N462l691K359m3834n7760n9289
$$ 2149357 2150710 2151975 2173288 2183773 2189005 2207367 2212829 2209138 2211497 2167663 2109903 2050614
16448B050614n7657r989k0388l0710k0396r218l3912m4681k7823n034j659o1602
$$ 2050614 1992957 1982968 1962580 1931870 1911474 1902256 1868344 1823663 1795840 1790806 1789147 1727545
16436A727545o9422l0752m6383l8237j2338q136j7244m9810o2013k1265k4744
$$ 1727545 1658123 1627371 1580988 1542751 1530413 1522277 1505033 1455223 1393210 1371945 1347201
16425A347201l0010j6995j502k9124k3809l3173m1427r563P030j3587l0422l9437
$$ 1347201 1317191 1300196 1298694 1269570 1245761 1212588 1171161 1161598 1168628 1155041 1124619 1085182
16413A085182j6789j6160j5424k2467l1515j9708k9231j1951q260j0953j4210
$$ 1085182 1068393 1052233 1036809 1014342 982827 963119 933888 921937 913677 902724 888514
16402H88514K6299r221k9719j8133k4507k9271l5971k0357K665L140m1666l8154
$$ 888514 914813 905592 875873 857740 833233 803962 767991 747634 750299 753439 711773 673619
16390F73619J6251k866j7011k2427L0642N855k5178n2645k1474N121l0789r862
$$ 673619 689870 687004 669993 647566 678208 684063 658885 606240 584766 589887 559098 549236
16378E49236J5978j1936j2502R129j4119k3953o272M996j0341j5675Q622k5531
$$ 549236 565214 553278 540776 549905 535786 511833 505561 510557 500216 484541 493163 467632
16366D67632k6894k2338j0591M851J030J0722j2958j3462M941j0255l459k0132
$$ 467632 440738 418400 407809 412660 413690 424412 411454 397992 402933 392678 389219 369087
16354C69087j3739q781N600j20K6560j8905k1720j2367K1698o537j2582j9989
$$ 369087 355348 346567 352167 352047 378607 359702 337982 325615 347313 340776 328194 308205
16342C08205l3783j6491n703k2915J8950J3223l5292k9930K6203j0996k2251m682
$$ 308205 274422 257931 252228 229313 248263 261486 226194 196264 222467 211471 189220 184538
16330A84538j1931J8671R488P534L432R231n618j1986K590J3754L247p042j1122
$$ 184538 172607 191278 200766 208300 211732 220963 215345 203359 205949 219703 222950 215908 204786
16317B04786j4903k5501k424L9134J7104l2245j2227k703l2835j9929j6969J6346
$$ 204786 189883 164382 161958 201092 218196 185951 173724 171021 138186 118257 101288 117634
16305A17634P207m5450l0017J7222K0109M4503J8003R41N244j3136L651M77Q097
$$ 117634 124841 79391 49374 66596 86705 131208 149211 150152 155396 142260 145911 146388 154485
16292A54485n803j384J9582K866k5217j6960j1650P92P706J557j4411p851N643
$$ 154485 148682 147298 166880 169746 144529 127569 115919 116711 124417 125974 111563 103712 109355
16279A09355J844j2961J2673j1276j4972R11L1750M9047m73L665j7861k7832j8847
$$ 109355 111199 98238 110911 99635 84663 85574 117324 166371 165898 169563 151702 123870 105023
16266A05023j2202R069M276o241j4616m259r303m010K024m080k6357o654M835
$$ 105023 92821 101890 106166 99925 85309 81050 71747 67737 69761 65681 39324 32670 37505
16253C7505L615l5377k2606j5272K1703L8213l5j5208J0959K7258J1481J4492
$$ 37505 41120 5743 -16863 -32135 -10432 27781 27746 12538 23497 50755 62236 76728
16241G6728O728M371m711M83k2229j6242j2919j8248l305j2157k455n950M052
$$ 76728 83456 87827 83116 83599 61370 45128 32209 13961 10656 -1501 -3956 -9906 -5854
16228e854L5647N231K003n824o996j4901j0656N38J2930K2066R603k2488k9777
$$ -5854 29793 35024 37027 31203 24207 9306 -1350 -812 12118 34184 43787 21299 -8478
16215h478k7264O828n339K529P173K5180j82r725K973J1748J5566O805m3067l0498
$$ -8478 -35742 -28914 -34253 -31724 -24551 629 447 -9278 -6305 5443 21009 27814 -15253 -45751
16201d5751L4551J4180J0219J2590j7035j8231l0418K2981j1228l7811J2521J9950
$$ -45751 -11200 2980 13199 25789 8754 -9477 -39895 -16914 -28142 -65953 -53432 -33482
16189c3482k611r535P092J4907K3757j3050m243Q074j612J168O360l000J1934
$$ -33482 -36093 -45628 -38536 -23629 128 -12922 -17165 -9091 -10703 -9535 -3175 -6175 5759
16176E759J741k4093K0300L4703n834J317j6725n2004k4340K5272J4621n597q466
$$ 5759 7500 -16593 3707 38410 32576 33893 17168 -34836 -59176 -33904 -19283 -24880 -33346
16163c3346k6592R668j6685k26Q371J8310k4266j7212M4188K4399J4606K851j1771
$$ -33346 -59938 -50270 -66955 -67181 -58810 -40500 -64766 -81978 -37790 -13391 1215 4066 -7705
16150g705j7948J2176M5487K3321k3302l1763l374P183m12j2521j1247l816K3713
$$ -7705 -25653 -13477 32010 55331 32029 266 -3108 4075 3663 -8858 -20105 -23921 -208
16137b08j2607j6096J2785J3699K5952k903l3961N885K1578o726l328N234l9142
$$ -208 -12815 -28911 -16126 -2427 23525 20622 -13339 -7454 14124 7398 4070 9304 -29838
16124b9838p411J8234n429j8581o173K281L518J6096J8602k4828k714n496m656
$$ -29838 -37249 -19015 -24444 -43025 -49198 -46917 -43399 -27303 -8701 -33529 -36243 -41739 -46395
16111d6395q370L10k125m401j8753J936k886Q350j6486l3500O406K3412n126l261
$$ -46395 -54765 -54455 -56580 -60981 -79734 -77798 -80684 -72334 -88820 -122320 -115914 -92502 -97628 -100889
16097a00889J9354j0814K4758L71p709O641k2046P18L3556K8084m192m9417r043
$$ -100889 -81535 -92349 -67591 -67220 -74929 -68288 -90334 -89616 -56060 -27976 -32168 -81585 -90628
16084i0628N7596L855l1882o880K442k0027N4473J4090j1449j7529k1445K007
$$ -90628 -33032 -29177 -61059 -67939 -65497 -85524 -31051 -16961 -28410 -45939 -67384 -65377
16072f5377j9992J639Q295o823L5523p180j3244j204q765k8989P933K0033L456
$$ -65377 -85369 -83730 -75435 -82258 -46735 -53915 -67159 -68363 -77128 -106117 -98184 -78151 -74695
16059g4695m715N821M3309K2984m30n572k158j4719j0884n442k4366m657R774
$$ -74695 -79410 -73589 -30280 -7296 -7726 -13298 -15456 -30175 -41059 -46501 -70867 -75524 -65750
16046f5750K0180N363M461l036j3355K0372K2896j0071k9228J8003J7723j4405
$$ -65750 -45570 -40207 -35746 -38782 -52137 -31765 -8869 -18940 -48168 -30165 -12442 -26847
16034b6847K7608J7300K3349K9049M0016P7434O9447K9583K8266n3780m5311l3883
$$ -26847 761 18061 41410 70459 110475 187909 257356 286939 315205 261425 216114 182231
16022A82231k8918J5751L376J5863M7828Q1304Q4324N5875K9959n16l6925n0733
$$ 182231 153313 169064 172440 188303 236131 317435 401759 457634 487593 487077 450152 399419
16010C99419m9174n7546n9033k8773j8116l962Q542K8170M4834J8654J9476p81
$$ 399419 350245 292699 233666 204893 186777 182815 191357 219527 264361 283015 302491 301710
15998C01710n9738n5326o5975j1268k3490k0546k8250j3949k300Q066J2794j0915
$$ 301710 241972 186646 120671 109403 85913 65367 37117 23168 20868 28934 41728 30813
15986C0813j7581j4706K9046M96j0339R379r023K154K018j2501l7643j9216J3522
$$ 30813 13232 -1474 27572 28068 17729 27108 18085 20239 22257 9756 -27887 -47103 -33581
15973c3581J2760k6812o961J0896L6299J4673j3704j173K65j7522J6509r08j5176
$$ -33581 -20821 -47633 -54594 -43698 -7399 7274 -6430 -7603 -7338 -24860 -8351 -9259 -24435
15960b4435J4812m423o787N107r999q84n285J0771q734J07K0957j493j2734p306
$$ -24435 -9623 -14046 -20833 -15726 -25725 -26609 -31894 -21123 -29857 -29750 -8793 -10286 -23020 -30326
15946c0326J2239J7722k1524J740n600m6374p706P446p570J0705L6494L035J768
$$ -30326 -18087 -365 -21889 -20149 -25749 -72123 -79829 -72383 -79953 -69248 -32754 -29719 -27951
15933b7951J1871l4239j3207O015L761n217p676J1177R661j5776L909J0435P683
$$ -27951 -16080 -50319 -63526 -57511 -53750 -58967 -66643 -55466 -45805 -61581 -57672 -47237 -39554
15920c9554k2154j2880K1559J0930J8032O244j840k453K0193R022m617r604j5652
$$ -39554 -61708 -74588 -53029 -42099 -24067 -17823 -19663 -22116 -1923 7099 2482 -7122 -22774
15907b2774k7255k939Q642n097r94J54K332j3313J9715J2524O424k525j0027J8164
$$ -22774 -50029 -52968 -44326 -49423 -50417 -50263 -47931 -61244 -41529 -29005 -22581 -25106 -35133 -16969
15893a6969K1123j0304m3294J2637J639k8438K1066L5209j4829j6562J5814N535
$$ -16969 4154 -6150 -49444 -36807 -35168 -63606 -42540 -7331 -22160 -38722 -22908 -17373
15881a7373k5463k9536L7100O672m3282J313K9133J5688l0956j5096K0169K3978
$$ -17373 -42836 -72372 -35272 -28600 -71882 -70569 -41436 -25748 -56704 -71800 -51631 -27653
15869b7653j862O789k8301r76J0816j4223m346O401K2564k0033j4322J1569K5868
$$ -27653 -29515 -22726 -51027 -52003 -41187 -55410 -59756 -53355 -30791 -50824 -65146 -53577 -27709
15856b7709j0523j729k1932o763J9883K0627L089j1869l9793k1282J2507K3831
$$ -27709 -38232 -39961 -61893 -68656 -48773 -28146 -25057 -36926 -76719 -98001 -85494 -61663
15844f1663j4266r083Q475J4907k7513J544m23j2200k8967J9957Q769j028J0266
$$ -61663 -75929 -85012 -76537 -61630 -89143 -87599 -88022 -100222 -129189 -109232 -100463 -101491 -91225
15831i1225P047K8108L409p013k803j3079J9213K4758r179j5659K0648J9690j2856
$$ -91225 -84178 -56070 -52661 -59674 -62477 -75556 -56343 -31585 -40764 -56423 -35775 -16085 -28941
15818b8941j05j6750K106J0396K6483j752j3610Q367j6918m114p970K108j7401
$$ -28941 -29046 -45796 -43690 -33294 -6811 -8563 -22173 -13806 -30724 -34838 -42808 -40700 -58101
15805e8101j0813k069P434L2714K6007j428J374n456j0223k9431R306J0579j8637
$$ -58101 -68914 -70983 -63549 -30835 -4828 -6256 -4882 -10338 -20561 -49992 -40686 -30107 -48744
15792d8744j097j5313O689J6231K6946j1386j0648N590R386n682k41p553q404
$$ -48744 -49841 -65154 -58465 -42234 -15288 -26674 -37322 -31732 -22346 -28028 -28269 -35822 -44226
15779d4226j3117q567M919K165J178O179N1k08l1112l2438L2656L6361N1886J026
$$ -44226 -57343 -65910 -60991 -58826 -57648 -51469 -51418 -51626 -82738 -115176 -82520 -46159 5727 6753
15765F753l4040r340k0864r517P639j1537k019J2829P275l0251k5621J6890J9616
$$ 6753 -27287 -36627 -57491 -67008 -59369 -70906 -72925 -60096 -52821 -83072 -108693 -91803 -72187
15752g2187l555j2392j8325J5763R213K1466J9019K3166j0710k023M513j5307
$$ -72187 -75742 -88134 -106459 -90696 -81483 -60017 -40998 -17832 -28542 -30565 -26052 -41359
15740d1359Q32J8766l416k1239O758O666j984l024k1689j8123O052L0101J190
$$ -41359 -40527 -21761 -25177 -46416 -39658 -32992 -34976 -38000 -59689 -77812 -71760 -41659 -40469
15727d0469j0562N433p60n879J9874k7707k2210R441J6562j7007O074j2266j1237
$$ -40469 -51031 -45598 -46358 -52237 -32363 -60070 -82280 -72839 -56277 -73284 -67210 -79476 -90713
15714i0713J9877m977l986R986J6050j226r153L6353K0246k4927k6796K7018j2897
$$ -90713 -70836 -75813 -79799 -69813 -53763 -54989 -64142 -27789 -7543 -32470 -59266 -32248 -45145
15701d5145j209k1269k0045K0861K1283K5310j2487j8903J0923L7163J4663l3654
$$ -45145 -46354 -67623 -87668 -66807 -45524 -20214 -32701 -51604 -40681 -3518 11145 -22509
15689b2509m921Q087j251o137Q025K1018k3158r53k2719l2130q951j1041j5108
$$ -22509 -27430 -19343 -20594 -26731 -18706 2312 -20846 -21799 -44518 -76648 -85599 -96640 -111748
15676a11748J2443K6336M0143L9154j3337P00k5343k7229Q817R60J8564O966n202
$$ -111748 -99305 -72969 -32826 6328 -7009 -6309 -31652 -58881 -50064 -49104 -30540 -23574 -28776
15663b8776j3019O208k1442k409J8866l540r670J393P369L617L26l270J278O478
$$ -28776 -41795 -35587 -57029 -59438 -40572 -44112 -53782 -52389 -45020 -41403 -41077 -44347 -43069 -36591
15649c6591k1836m13K83m108L1883J4388j9216k6574j125K3644J8115J2107O395
$$ -36591 -58427 -58840 -58557 -62665 -30782 -16394 -35610 -62184 -63309 -39665 -21550 -9443 -3048
15636c048o424q008j9641j1291j6417p701K825J7325M8924K6473k689l5030k592
$$ -3048 -9472 -17480 -37121 -48412 -64829 -72530 -69705 -52380 -3456 23017 20328 -14702 -17294
15623a7294K7311M491k628L332j4863j2337j9109J7315L7435O897p239j7229J4305
$$ -17294 10017 14508 11880 15212 349 -11988 -31097 -13782 23653 30550 23311 6082 20387
15610B0387N490o135m0038l4290L4150L4779L5962M766l0363o997P425K2244K6343
$$ 20387 25877 19742 -20296 -54586 -20436 14343 50305 55071 24708 17711 25136 47380 73723
15597G3723k1435p039O851n887k5245k717k5409J7681K1924p925r835M437J6811
$$ 73723 52288 45249 52100 46213 20968 18251 -7158 10523 32447 24522 14687 19124 35935
15584C5935j3447j8129l2539j3313L8655J5770K1229N395k714j66m403J9163N921
$$ 35935 22488 4359 -28180 -41493 -2838 12932 34161 39556 36842 36676 32273 51436 57357
15571E7357J0001j6357m1409m135k5226o482J2332K0818l181J215q105m7020J9501
$$ 57357 67358 51001 9592 5457 -19769 -26251 -13919 6899 3718 4933 -3172 -50192 -30691
15558c0691K4572j4899o378P591p792N590J9788P447l451K0117q118j5440L0803
$$ -30691 -6119 -21018 -27396 -19805 -27597 -22007 -2219 5228 1777 21894 13776 -1664 29139
15545B9139l1973J3298K156L817J1987j9111j6607K8953L2496j4387k2366j0882
$$ 29139 -2834 10464 12620 16437 28424 9313 -7294 21659 54155 39768 17402 6520
15533F520o442J2482k7380N425j961J823M968m069J4073J3821K792J148j4611
$$ 6520 78 12560 -14820 -9395 -11356 -9533 -4565 -8634 5439 19260 22052 23200 8589
15520H589O72J250p804q233K947J0413M470J6271J1691j5917k8393O804P094p725
$$ 8589 9261 10511 2707 -5526 -2579 7834 12304 28575 40266 24349 -4044 2760 9854 2129
15506B129p969j994j5233J0995l321R786k4746k4892K9311J4845m448M173K1020
$$ 2129 -5840 -7834 -23067 -12072 -15393 -5607 -30353 -55245 -25934 -11089 -15537 -11364 9656
15493I656Q588k2322j5482O596P798J3723j2128j2518J1272J1983l039J317k2537
$$ 9656 18244 -4078 -19560 -12964 -5166 8557 -3571 -16089 -4817 7166 4127 5444 -17093
15480a7093J6639j8000j2833K4711j490n044K4670R363K6758j3427j4406k0535
$$ -17093 -454 -18454 -31287 -6576 -8066 -13110 11560 20923 47681 34254 19848 -687
15468f87j0936j5346n875j265J058M368K3138n451K511Q856P20j859o365J1120
$$ -687 -11623 -26969 -32844 -34109 -33051 -28683 -5545 -10996 -8485 371 1091 -768 -7133 3987
15454C987l3751j2826M238o24j6905K0238J6589l1584p651K9935K4672j1749m032
$$ 3987 -29764 -42590 -38352 -38976 -55881 -35643 -19054 -50638 -58289 -28354 -3682 -15431 -19463
15441a9463K1095J7138J0809K4358k0751k49j9794M979k3351l0136o87j69K0849
$$ -19463 1632 18770 29579 53937 33186 32937 13143 18122 -5229 -35365 -36052 -36221 -15372
15428a5372M7231P327k0336J6550j2965o46m798j3961q900L098J5730R402J5087
$$ -15372 31859 39186 18850 35400 22435 21789 16991 3030 -5870 -2772 12958 22360 37447
15415C7447O997k0938j4161q524l767M0098K6466J2621N649m5871l783J2822J0116
$$ 37447 44444 23506 9345 821 -2946 37152 63618 76239 81888 36017 32234 45056 55172
15402E5172J9643m3744j6799k278j9446k9941j084L2262L766k6444r246J032j764
$$ 55172 74815 31071 14272 11994 -7452 -37393 -38477 -6215 -2449 -28893 -38139 -37107 -38871
15389c8871K5740K0189K7144L8168O143j56J9942M8117P4286N7411R9029J04491
$$ -38871 -13131 7058 34202 72370 78513 78357 98299 146416 220702 278113 377142 481633
15377D81633O8519J17569J37194J60955J55400J35478P3206O9228K1498m2235
$$ 481633 550152 667721 804915 965870 1121270 1256748 1329954 1399182 1420680 1378445
15367A378445q7147j18576j58669j41235j26929j20818q3008o5406o9926n5327
$$ 1378445 1291298 1172722 1014053 872818 745889 625071 542063 476657 406731 351404
15357C51404l2867o1754l2921m941k4364j2324j8753k8393k3072r916j0188j2331
$$ 351404 318537 256783 223862 218921 194557 182233 163480 135087 112015 102099 91911 79580
15345G9580K4937L0190k891j9190k2376q326J8151j4132l420k179k0611m878J1636
$$ 79580 104517 134707 131816 112626 90250 81924 100075 85943 82523 80344 59733 54855 66491
15332F6491J2391R53k4836k0186j2037J1959k436J2529J3124L751j9586l4911
$$ 66491 78882 79835 54999 34813 22776 34735 32299 44828 57952 61703 42117 7206
15320G206j6846M035J9153J3808L8314J7382k0811k5877j2706q747R274L0729
$$ 7206 -9640 -5605 13548 27356 65670 83052 62241 36364 23658 14911 24185 54914
15308E4914o815k0701n714K7558N516L61m3362j3169J9649J3969Q196L6982M738
$$ 54914 48099 27398 21684 49242 54758 55119 11757 -1412 18237 32206 40402 77384 82122
15295H2122j9327j9875k2822k7776J0023J7852L305j8397k0353o137n803j1234
$$ 82122 62795 42920 20098 -7678 2345 20197 23502 5105 -15248 -21385 -27188 -38422
15283c8422M350O401o679J9241k0237J2044K757k1255l7450j2199K4900K3209
$$ -38422 -34072 -27671 -34350 -15109 -35346 -23302 -20545 -41800 -79250 -91449 -66549 -43340
15271d3340L4960J633P425J9319r568k5752k7281J377J2029L8663k6990k7022
$$ -43340 -8380 -6747 678 19997 10429 -15323 -42604 -41227 -29198 9465 -17525 -44547
15259d4547K0915J2634K0336N024m2347M709n54j2462P104K421J6175n0588n4792
$$ -44547 -23632 -10998 9338 14362 -27985 -23276 -23830 -36292 -29188 -26767 -10592 -61180 -115972
15246a15972j928j5083k7408M0826L961j4073r790l9954j3376j5797J4227p655
$$ -115972 -117900 -132983 -160391 -119565 -115604 -129677 -139467 -179421 -192797 -208594 -194367 -202022
15234b02022M9701M6390j3567p776r587m018j7024R830J6858j474q090J0103J4626
$$ -202022 -152321 -105931 -119498 -127274 -136861 -140879 -157903 -148073 -131215 -132689 -140779 -130676 -116050
15221a16050L1015J4399Q390J4644J4812p186j0103p101J9877K55j935J4397N2521
$$ -116050 -85035 -70636 -62246 -47602 -32790 -39976 -50079 -57180 -37303 -37048 -38983 -24586 27935
15208B7935j6649l2083O618p7q15j0597R042J0923j1698q518l474M9K8609K0459
$$ 27935 11286 -20797 -14179 -14256 -15071 -25668 -16626 -5703 -17401 -25919 -29393 -29344 -735 19724
15194A9724P42J4758K3222K5107K7547M0250K1465J9493M2524N2114K0751J5762
$$ 19724 20466 35224 58446 83553 111100 151350 172815 192308 234832 286946 307697 323459
15182C23459l931P80J7754n974k7821l2290n1375k8188n8225l9178L174R877l489
$$ 323459 319528 320308 338062 332088 304267 271977 220602 192414 134189 95011 98185 108062 104573
15169A04573l1088k6088j4681j5766m429k485L5220Q356j5865L032K8096j2382
$$ 104573 73485 47397 32716 16950 12521 10036 45256 53612 37747 40779 68875 56493
15157E6493k3648l4302K4354K9675K4090j8332l5954L4059L1639L579k9347j388
$$ 56493 32845 -1457 22897 52572 76662 58330 22376 56435 88074 91653 62306 60918
15145F0918J607N297j6060j9713k4893N176J4119j9190M232J5784k6249l0519
$$ 60918 62525 67822 51762 32049 7156 12332 26451 7261 11493 27277 1028 -29491
15133b9491O790k389J7651n742q600P930k0258k9076k0638J718O37j5186j4561
$$ -29491 -22701 -25090 -7439 -13181 -21781 -13851 -34109 -63185 -83823 -82105 -81468 -96654 -111215
15120a11215n984K2150J4188K6014K4409K6500J8695n65L5216K7181K6944J4292
$$ -111215 -117199 -95049 -80861 -54847 -30438 -3938 14757 14192 49408 76589 103533 117825
15108A17825L239N266O689m459q257J7588P669m844J1223j9060J9980N982J9552
$$ 117825 121064 126330 133019 128560 120303 137891 145560 140716 151939 132879 152859 158841 178393
15095A78393J0332K6929M5275M633l780j0207L764L7536J8459q968l5516m310
$$ 178393 188725 215654 260929 265562 261782 251575 255339 292875 311334 302366 266850 262540
15083B62540n273K977J6457K6382J861k861l864N160J6489J8552L8432J7255M0140
$$ 262540 257267 260244 276701 303083 304944 302083 298219 303379 319868 338420 376852 394107 434247
15070D34247L7866J894M0972M9392Q6025J15900J18956J07041J63223J61001J32957
$$ 434247 472113 474007 514979 564371 650396 766296 885252 992293 1155516 1316517 1449474
15059A449474J16195Q1373N1230K2653p578K0781k0714k0969o0362p8167m3197
$$ 1449474 1565669 1647042 1698272 1720925 1713347 1734128 1713414 1692445 1632083 1553916 1510719
15048A510719o4004p3199q6844l6343m7412q0212m7714j4708l3931l537j5242
$$ 1510719 1446715 1373516 1286672 1250329 1202917 1122705 1074991 1060283 1026352 1022815 1007573
15037A007573o782R660j9435J3088M8010J8289N026J4203m567K0483m263j0025
$$ 1007573 1000791 1010451 991016 1004104 1052114 1070403 1075429 1089632 1085065 1105548 1101285 1091260
15025A091260K360N808M2392K0548M160L1350K1611J080P277j1145K0079J0227
$$ 1091260 1093620 1099428 1141820 1162368 1166528 1197878 1219489 1220569 1227846 1216701 1236780 1247007
15013A247007K7695K5680K3402q294j0169j59j6085j2254K4223K6747r223P214
$$ 1247007 1274702 1300382 1323784 1315490 1305321 1305162 1289077 1276823 1301046 1327793 1318570 1325784
15001A325784q03J5682J0188J6307M2342L6628K8555N8281R4961J06412P5263
$$ 1325784 1324981 1340663 1350851 1367158 1409500 1446128 1474683 1532964 1627925 1734337 1809600
14990A809600J03598J52183J77175J89621K21057K84180M21716N17769N68356
$$ 1809600 1913198 2065381 2242556 2432177 2653234 2937414 3359130 3876899 4445255
14981D445255O59959O92329O55977O44681N48956L71843J82608l3528k12300l52539
$$ 4445255 5105214 5797543 6453520 7098201 7647157 8019000 8201608 8168080 7955780 7603241
14971G603241m25671m53129m07131l33144k75500j93345j00615j1245M5872J13839
$$ 7603241 7177570 6724441 6317310 5984166 5708666 5515321 5414706 5403461 5449333 5563172
14961E563172J64723K37404K94462L60860M51195N56139P02104Q01038R77882
$$ 5563172 5727895 5965299 6259761 6620621 7071816 7627955 8330059 9131097 10108979
14952A0108979J184001J387909J593303J851454K139040K475080K840514L350476
$$ 10108979 11292980 12680889 14274192 16125646 18264686 20739766 23580280 26930756
14944B6930756L981847M899251O351351Q583631J1879229J5998800K0469002K4994083
$$ 26930756 30912603 35811854 42163205 50746836 62626065 78624865 99093867 124087950
14936A24087950K8998064L1575063L1730285K9404573K4481243J6897626P236602
$$ 124087950 153086014 184661077 216391362 245795935 270277178 287174804 294411406
14929B94411406k813453j1762488j9432896k5196837k8277079k8228329k6171571
$$ 294411406 291597953 279835465 260402569 235205732 206928653 178700324 152528753
14922A52528753k3132867j9389692j5301147j1561238q856724p055876n857109
$$ 152528753 129395886 110006194 94705047 83143809 74287085 67231209 61374100
14915F1374100m993994m312700l695103l107157k624734k176335j768029j383754
$$ 61374100 56380106 52067406 48372303 45265146 42640412 40464077 38696048 37312294
14907C7312294j099950q99277p51294o65152o81574p43195q25426q99676r67814
$$ 37312294 36212344 35313067 34561773 33896621 33215047 32471852 31646426 30746750 29778936
14898B9778936j038806j080358j068135j035588j011570r22813q27321p60326
$$ 29778936 28740130 27659772 26591637 25556049 24544479 23621666 22794345 22034019
14890B2034019o82200o34153o30693n93721n48859n21355n39141n55799n26059
$$ 22034019 21351819 20717666 20086973 19493252 18944393 18423038 17883897 17328098 16802039
14881A6802039m86485m84870m87270m65099m46838m23457l96677l68403l69128
$$ 16802039 16315554 15830684 15343414 14878315 14431477 14008020 13611343 13242940 12873812
14872A2873812l22921l25950l17504l00983k79783k57043k45646k42250k49550
$$ 12873812 12550891 12224941 11907437 11606454 11326671 11069628 10823982 10581732 10332182
14863A0332182j97507j58555j99188k10897j79920k01325j85610j36735j25717
$$ 10332182 10134675 9976120 9776932 9566035 9386115 9184790 8999180 8862445 8736728
14854H736728j78512k13340j96115j53294j49568j80021j89949j76963j74894
$$ 8736728 8558216 8344876 8148761 7995467 7845899 7665878 7475929 7298966 7124072
14845G124072j83375j66677j48627j29707j23117j40593j26697j41542j28451
$$ 7124072 6940697 6774020 6625393 6495686 6372569 6231976 6105279 5963737 5835286
14836E835286j43891j12678r5010j08464j03601q0379j17039j05214p5947p2509
$$ 5835286 5691395 5578717 5483707 5375243 5271642 5191263 5074224 4969010 4893063 4820554
14826D820554q0579q3128p3745q0498o3517o327j2810l4055k9348j0349J4511
$$ 4820554 4739975 4656847 4583102 4502604 4439087 4432760 4419950 4385895 4356547 4346198 4360709
14815D360709j0407J7914M4143P0307Q1590O9094O7169Q3671R3878O7398L0345
$$ 4360709 4350302 4368216 4412359 4482666 4564256 4633350 4700519 4784190 4878068 4945466 4975811
14804D975811O900j9670n7644q0456j23884j44284j12754j23918j36186j05823
$$ 4975811 4982711 4963041 4905397 4824941 4701057 4556773 4444019 4320101 4183915 4078092
14794D078092j32303j68027j37079j03676o1451n5426q6691n9387q6358n6467
$$ 4078092 3945789 3777762 3640683 3537007 3475556 3420130 3333439 3274052 3187694 3131227
14784C131227l8862k4493l2766j6967j4173l5056k1198J940k9097o7141o0010
$$ 3131227 3092365 3067872 3035106 3018139 3003966 2968910 2947712 2949652 2920555 2853414 2793404
14773B793404m1933o1069k8101o1579m6471m9721l2829k2340n4550o4308l6885
$$ 2793404 2751471 2690402 2662301 2600722 2554251 2504530 2471701 2449361 2394811 2330503 2293618
14762B293618n1795m7151k0559q3336p1662k3455m7500k5237n5017l3738j3703
$$ 2293618 2241823 2194672 2174113 2090777 2019115 1995660 1948160 1922923 1867906 1834168 1820465
14751A820465k9423m1326m1460m0086j7331j635l4311k3595k8272q95l435k2930
$$ 1820465 1791042 1749716 1708256 1668170 1650839 1649204 1614893 1591298 1563026 1562131 1558696 1535766
14739A535766l3276j6910j0247l2867j2752j4577k090k8273j3615j3659m2186
$$ 1535766 1502490 1485580 1475333 1442466 1429714 1415137 1413047 1384774 1371159 1357500 1315314
14728A315314l5191j8569k5191m0985k2840k4413j7083k2982k7241m0634k8805
$$ 1315314 1280123 1261554 1236363 1195378 1172538 1148125 1131042 1108060 1080819 1040185 1011380
14717A011380l18o116o30k93j7781k1648p769r803k0206j2360k8115j0226k0520
$$ 1011380 1011062 1004946 1004316 1004023 986242 964594 956825 947022 926816 914456 886341 876115 855595
14704H55595j1402k6166O037R33l3772o107j644l0605m487q537J412P205J4436
$$ 855595 844193 818027 824064 824997 791225 785118 783474 752869 748382 739845 741257 748462 762898
14691G62898k1681J1611K0985M997J1740n694l0933l6384j2338O148M0613K5659
$$ 762898 741217 752828 773813 778810 790550 784856 753923 717539 705201 711349 751962 777621
14679G77621K1816K2215L535k9499n6616n2004j4322k6982l1061K2654J6606J2018
$$ 777621 799437 821652 825187 795688 739072 687068 672746 645764 614703 637357 653963 665981
14667F65981K997K5863M8469k019l2170n4706l6749j2836j4494j0998j085p133
$$ 665981 668978 694841 743310 741291 709121 654415 617666 604830 590336 579338 578253 571120
14655E71120j6711k9332k3517j758n6l3495k5629k5855K471J2131n015q8J8147
$$ 571120 554409 525077 501560 499802 499746 466251 440622 414767 417238 429369 424354 424266 442413
14642D42413J1456K2849Q398M0710K2143K0055L0503M2710K1589P707m938o402
$$ 442413 453869 476718 485116 525826 547969 568024 598527 641237 662826 670533 665595 659193
14630F59193K558k5234k5116m249N297k7110k1177J4488K8405K3615J8053J6037
$$ 659193 661751 636517 611401 607152 612449 585339 564162 578650 607055 630670 648723 664760
14618F64760j5889p0704n5403l9306j6532L898k6922l2071r475j8698J2229M0483
$$ 664760 648871 578167 522764 483458 466926 470824 443902 411831 402356 383658 395887 436370
14606D36370k0278k2270k5960l4928l4410J631J4967J2036k5868j3657j2347K985
$$ 436370 416092 393822 367862 332934 298524 300155 315122 327158 301290 287633 275286 278271
14594B78271j1377j0104j8650q757q918L8309K1146O168l4247j8111J6838J0694
$$ 278271 266894 256790 238140 229383 220465 258774 279920 286088 251841 233730 250568 261262
14582B61262J1629k727p853n901m972J1388Q092k0233l0519k5157L190N701m511
$$ 261262 272891 270164 262311 256410 251438 262826 270918 250685 220166 195009 198199 203900 199389
14569A99389j0755j7708J102K0015J0885k1612n742Q35j0542k5434P955K299J2515
$$ 199389 188634 170926 172028 192043 202928 181316 175574 176409 165867 140433 148388 150687 163202
14556A63202O600l189j6454k5634n581J6259j174k8869M113J5396R368k752j519
$$ 163202 169802 166613 150159 124525 118944 135203 134029 105160 109273 124669 134037 131285 129766
14543A29766j8228k9838R992M3641J5983J4332k382P957J1590M778L2536m745
$$ 129766 111538 81700 91692 135333 151316 165648 163266 171223 182813 187591 220127 215382
14531B15382m3958j2470J1635J5396j5528L447k019j9870m302R325O902j4319
$$ 215382 171424 158954 170589 185985 170457 173904 171885 152015 147713 157038 163940 149621
14519A49621l0520Q442L0165K2049n770J6199J6215m9308j6374r139J6294J4567
$$ 149621 119101 127543 157708 179757 173987 190186 206401 157093 140719 131580 147874 162441
14507A62441K4766K5049k950k4846k3122J2759L3786R217o451L5506M5479M8926
$$ 162441 187207 212256 209306 184460 161338 174097 207883 217100 210649 246155 291634 340560
14495C40560O4580R4018Q1372Q9481J07602J61832J47225J79642J61913J35254
$$ 340560 405140 499158 580530 670011 777613 939445 1086670 1266312 1428225 1563479
14485A563479N5685K4123j1517n8325j26615j35969j47060j25869j08462j18053
$$ 1563479 1619164 1643287 1631770 1573445 1446830 1310861 1163801 1037932 929470 811417
14475H11417p5884q8154o4329q2979m7702n7418l0721j7637r283k5926l5067j140
$$ 811417 735533 647379 583050 500071 452369 394951 364230 346593 337310 311384 276317 275177
14463B75177O760m1228j3871Q271l5979l4234j8217J9011J2795J0718j072k1808
$$ 275177 281937 240709 226838 235109 199130 164896 146679 165690 178485 189203 188131 166323
14451A66323p531k579j7791j0475n335j0677O282j4259J4697j1264n664L27J7651
$$ 166323 158792 156213 138422 127947 122612 111935 118217 103958 118655 107391 101727 102054 119705
14438A19705J4928Q624q66K1233J8598k2734k9751m1954n423R586J3697J8611
$$ 119705 134633 143257 142391 163624 182222 159488 129737 87783 82360 91946 105643 124254
14426A24254p528m1911l5844j8276J7425l54q134J8490L0489J5461N998q864l0561
$$ 124254 116726 74815 38971 20695 38120 37766 29632 48122 78611 94072 100070 91206 60645
14413F0645k5830j5181m948J4706K4796M780p763j2886P825J9016j2403J4339
$$ 60645 34815 19634 14686 29392 54188 58968 51205 38319 46144 65160 52757 67096
14401F7096J5204k9910k2613j1952R960j8069l909M669K4293L39R84L1694j1455
$$ 67096 82300 52390 29777 17825 27785 9716 5807 10476 34769 35108 36092 67786 56331
14388E6331j2648o718o887J2211L8706Q995o829m1150k867K2771k0810j6626j2647
$$ 56331 43683 36965 30078 42289 80995 89990 83161 42011 39144 61915 41105 24479 11832
14375A1832k3716L4874K3364r00n884j6518J0599L2698o031k5178k0420J526J6597
$$ 11832 -11884 22990 46354 45454 39570 23052 33651 66349 60318 35140 14720 16246 32843
14362C2843k930N57p060L830m39R7p583J893J8368K0418O144k2954j4710j9283
$$ 32843 29913 30470 23410 27240 26801 26898 19315 21208 39576 59994 66138 43184 28474 9191
14348I191n612j2036j786P001R817L110k7083J920j945P801J6111J6226j7817
$$ 9191 3579 -8457 -10243 -3242 6575 9685 -17398 -15478 -17423 -9622 6489 22715 4898
14335D898j1839L1658N386n505r855j743L489k584J4518j1172l808j202k0340
$$ 4898 -6941 24717 30103 24598 14743 13000 16489 13905 28423 17251 13443 12241 -8099
14322h099M639M987l31J623M129J8765J2629o071j8833l1063O546P893L302J8751
$$ -8099 -3460 1527 1196 2819 6948 25713 38342 32271 13438 -17625 -11079 -3186 116 18867
14308A8867J948j0928R716q961J1818R602J940j1701l3212P810j691k771J0292
$$ 18867 20815 9887 19603 10642 22460 32062 34002 22301 -10911 -3101 -4792 -7563 2729
14295B729J6518J1322q561m968k083n994j5102j922J078j2742J5995J0095j0497
$$ 2729 19247 30569 22008 17040 14957 8963 -6139 -8061 -6983 -19725 -3730 6365 -4132
14282d132N353K8736K6187j0729r180m596m9258j2901p339N385M498K95J4657
$$ -4132 1221 29957 56144 45415 36235 31639 -17619 -30520 -37859 -32474 -27976 -27681 -13024
14269a3024M6165J1779j3299J6957j0206j9826N713J7414J1074J559J6380R322
$$ -13024 33141 44920 31621 48578 38372 18546 24259 41673 52747 54306 70686 80008
14257H0008m1578R26j7245k121K2295K5196K967n322n335l2972j5502j775n828
$$ 80008 38430 39356 22111 19990 42285 67481 70448 65126 59791 26819 11317 9542 3714
14244C714L930P560R977K7082K5668j8577l6150L939J3440J6304n735l6836j2787
$$ 3714 7644 15204 25181 52263 77931 59354 23204 27143 40583 56887 51152 14316 1529
14231A529K2170k960N335n026l368k451J530k1880L900J4155l446j2991K0272
$$ 1529 23699 20739 26074 21048 17680 15229 16759 -5121 -1221 12934 9488 -3503 16769
14218A6769j6290k4348N568k79J297K2008J3771K7660M367j4317m850Q865j4572
$$ 16769 479 -23869 -18301 -18580 -17283 4725 18496 46156 50523 36206 31356 40221 25649
14205B5649j0062j2905J9301k812k266K351P351j2453L317k3800R79m271J0472
$$ 25649 15587 2682 21983 19171 16905 19256 26607 14154 17471 -6329 -5350 -9621 851
14192H51J0386P08M71K1633K3067m025j2031l4127j1112P172j880J5388M312M559
$$ 851 11237 11945 12416 34049 57116 53091 41060 6933 -4179 2993 1113 16501 20813 25372
14178B5372J5046J4188k127j4069k4783j9051J3707j6703Q058N1953j1535j4310
$$ 25372 40418 54606 52479 38410 13627 -5424 8283 -8420 -362 51591 40056 25746
14166B5746J2546J338n703k5813m724m603M190J0162M1347K0542j5997k477J0910
$$ 25746 38292 39630 33927 8114 3390 -1213 2977 13139 54486 75028 59031 56554 67464
14153F7464J2517j4811m441j3178L144K2110m826J2102K569k4374l7375l0524
$$ 67464 79981 65170 60729 47551 50695 72805 67979 80081 82650 58276 20901 -9623
14141i623m340j545J8531L46J1652L2500J1203K4233K1248J6120K3668K2376J7419
$$ -9623 -13963 -15508 3023 3369 15021 47521 58724 82957 104205 120325 143993 166369 183788
14128A83788K3470L1617M9276N7558P0928R9191Q2041P6496M0449M6305O0490
$$ 183788 207258 238875 288151 345709 416637 515828 597869 674365 714814 761119 821609
14117H21609N9945K2525M9853L7989l002J4019J5308l3749n8707m4742Q755j039
$$ 821609 881554 904079 953932 991921 988919 1002938 1018246 984497 925790 881048 889803 888764
14105H88764n0104q8572j05425p8796o5093p8862p4999k8575j9297l7954l4998
$$ 888764 838660 750088 644663 565867 500774 421912 346913 318338 299041 261087 226089
14094B26089m585J2851O14J7186K734l1789l6188k3578L205L405n292k8328P148
$$ 226089 221504 234355 234969 252155 254889 223100 186912 163334 166539 169944 164652 136324 143472
14081A43472p988L39k4860l2386q048K939j0190M224j4339k6894j882L9121L5273
$$ 143472 135484 135823 110963 78577 70529 73468 63278 67502 53163 26269 24387 63508 98781
14068I8781o16J1022j5174n1950K331p269O831J3359J7164o482k1618j7376K0491
$$ 98781 98165 109187 94013 42063 44394 37125 43956 57315 74479 67997 46379 29003 49494
14055D9494o651j0854O59m525J1467J8922K458k7088O45n270N303J576m24K3364
$$ 49494 42843 31989 32648 28123 39590 58512 60970 33882 34527 29257 34560 36136 35712 59076
14041E9076N586k4039k4996J3839K0330j416M862n998J3911Q119j6816k7688k0884
$$ 59076 64662 40623 15627 29466 49796 48380 53242 47244 61155 69274 52458 24770 3886
14028C886K5462L8045j2974j2296r121K5296K1958J0698o555r291J1920N3071
$$ 3886 29348 67393 54419 42123 33002 58298 80256 90954 84399 75108 87028 140099
14016A40099l360R982J2547j299J579j0713k1467M343k8404j0321O997j4631j1779
$$ 140099 136739 146721 159268 157969 159548 148835 127368 131711 103307 92986 99983 85352 73573
14003G3573k2251n878p055j7138m941J9958L6829k1952O441L5199p88j3368O523
$$ 73573 51322 45444 38389 21251 16310 36268 73097 51145 57586 92785 91997 78629 85152
13990H5152L438j2097p156j0591J8812o730P746J3397J2513K58q470K538j4965
$$ 85152 88590 76493 69337 58746 77558 70828 78574 91971 104484 104742 96272 98810 83845
13977H3845K4484M8029L8960J6579o862q553K151j554k6159J405J1086K422m6789
$$ 83845 108329 156358 195318 211897 205035 196482 198633 197079 170920 172325 183411 185833 139044
13964A39044j3825j0397j1329k5592o688R849P443J4796Q131l7538j7891J9673
$$ 139044 125219 114822 103493 77901 71213 81062 88505 103301 111432 73894 56003 75676
13952G5676J4861j0654J6560n985L275K5019M776L3619M1860O193M6732J5341
$$ 75676 90537 79883 96443 90458 93733 118752 123528 157147 199007 205200 251932 267273
13940B67273J0220M4950R1557J40576J12520J30103J40593J42666J52706J18710
$$ 267273 277493 322443 414000 554576 667096 797199 937792 1080458 1233164 1351874
13930A351874Q1520Q870J3134j5670p3730j27099j20566j34442j41796r7083j11322
$$ 1351874 1433394 1442264 1455398 1439728 1365998 1238899 1118333 983891 842095 745012 633690
13919F33690p4744o7604n8505o3476n2537l0667m1531R241j1134k20j5586l2865
$$ 633690 558946 491342 432837 369361 316824 286157 244626 253867 242733 242513 226927 194062
13907A94062j4668K2896O668l2423k2435K6915J3431J6223K2402k0058l5875p948
$$ 194062 179394 202290 208958 176535 154100 181015 194446 210669 233071 213013 177138 169190
13895A69190k0116l8106j8506k0749L3956K4732J5784j6985Q105R838O447j6684
$$ 169190 149074 110968 92462 71713 105669 130401 146185 129200 137305 147143 153590 136906
13883A36906l9592M577K1504L3754l823M88K1631o10J6724J6728J3943j5142J6468
$$ 136906 97314 101891 123395 157149 153326 153814 175445 174835 191559 208287 222230 207088 223556
13870B23556N5481N2241L1711P9049R4906J05208Q1484J03632J21624P7700P668
$$ 223556 279037 331278 362989 442038 536944 642152 723636 827268 948892 1026592 1034260
13859A034260j2006n2989p6307j20767j33963r9085m1567l6888o9655p8928p3813
$$ 1034260 1022254 969265 892958 772191 638228 539143 497576 460688 391033 312105 238292
13848B38292j2515k359j549j9687k2468j3063J5529L4912J2363J023k7267k9368
$$ 238292 225777 223418 221869 202182 179714 166651 182180 217092 229455 230478 203211 173843
13836A73843k613L409j7327p076J7347j1673O5r784l6833k990j7887J9786J9398
$$ 173843 171230 174639 157312 150236 167583 155910 155975 146191 109358 106368 88481 108267 127665
13823A27665k5459l0592R993J3744P486Q340o75k5065Q325K7906K8282J2152k4530
$$ 127665 102206 71614 81607 95351 102837 111177 110502 85437 93762 121668 149950 162102 137572
13810A37572k7223j5017R37j518j1389j6779R520K1088r734k3366J1620J3007
$$ 137572 110349 95332 96269 94751 83362 66583 76103 97191 87457 64091 75711 88718
13798H8718r463K1009J3987J5764j0157k5090j4771j6716o077j6319l605J3202
$$ 88718 79255 100264 114251 130015 119858 94768 79997 63281 57204 40885 37280 50482
13786E0482j1080K1357J1113j9825j3738q71J4838P853m648r240R513J1481J1408
$$ 50482 39402 60759 71872 52047 38309 37438 52276 60129 55481 46241 55754 67235 78643
13773G8643n58j6633k5255j187j1058k2937j620L1750P504j3013J4115k468L004
$$ 78643 78085 61452 36197 35010 23952 1015 -605 31145 38649 25636 39751 37283 40287
13760D0287J4952L7124l026j6736j3848Q356J8624j7272k6076k319N418j453j0289
$$ 40287 55239 92363 89337 72601 58753 67109 85733 68461 42385 40066 45484 44031 33742
13747C3742n755j0864K7339P893l0739k2311L2515P913l369Q934l4080l7130m497
$$ 33742 27987 17123 44462 52355 21616 -695 31820 39733 36364 45298 11218 -25912 -30409
13734c0409L8254J9624R565J6404j2237n08K733K4284o988k8192n114m487M055
$$ -30409 7845 27469 37034 53438 41201 40693 43426 67710 60722 32530 27416 22929 26984
13721B6984Q42j369j3868k710K3761J3906J010n779J5785L123k2438J0465R912
$$ 26984 27826 26457 12589 9879 33640 47546 48556 42777 58562 61685 39247 49712 59624
13708E9624k3338j1354j5538r13K1943K4532J9453J2471K901O625l8053L131O778
$$ 59624 36286 24932 9394 8481 30424 54956 74409 86880 89781 96406 58353 61484 68262
13695F8262n113J6069j4412l9596k4528K1687K6272j0901j1338j0130k625l037
$$ 68262 63149 79218 64806 25210 682 22369 48641 37740 26402 16272 13647 10610
13683A0610j3198j4029k7200R146K7174M733K2643m378n080J7565L1419p798l0898
$$ 10610 -2588 -16617 -43817 -34671 -7497 -2764 19879 15501 10421 27986 59405 51607 20709
13670B0709p75K523J8766J156J0171j0170N197N316p915j5642K3408L0272j5974
$$ 20709 19934 22457 41223 42379 52550 42380 47577 52893 44978 29336 52744 83016 67042
13657F7042l0740R439k907k90j1890l579L3389Q053n818k1676n526L261J6942
$$ 67042 36302 45741 42834 42544 30654 27075 60464 68517 62699 41023 35497 38758 55700
13644E5700L2557o89k9471r10j444o892k5183J667j0105n949j059J5710Q796m601
$$ 55700 88257 87568 58097 57187 55743 48851 23668 25335 15230 9281 8222 23932 32728 28127
13630B8127k4167j1958Q969K2419k310q939M0102J7412m230j1214k6228j0395
$$ 28127 3960 -7998 971 23390 21080 12141 52243 69655 65425 54211 27983 17588
13618A7588L385r257J019J9420r868q477J8850J2959J1015l4420Q739K2318L969
$$ 17588 20973 11716 12735 32155 22287 13810 32660 45619 56634 22214 30953 53271 57240
13605E7240J2998k6378n199r321r833L0611O299j9834j420L0319K6533J7526J960
$$ 57240 70238 43860 38661 29340 19507 50118 56417 36583 35163 65482 92015 109541 111501
13592A11501k2079k3803j5431O759L782k8942j4372O762K6851j0931K2297R276
$$ 111501 89422 65619 50188 56947 60729 31787 17415 24177 51028 40097 62394 71670
13580G1670K0042k8643j9033J8212J2031M148J5856o147J2222J0001j7042Q952
$$ 71670 91712 63069 44036 62248 74279 78427 94283 88136 100358 110359 93317 102269
13568A02269k341j0158M951j1958L562j7419k0033l415P001k336j5268j7637L0300
$$ 102269 99928 89770 94721 82763 86325 68906 48873 45458 52459 50123 34855 17218 47518
13555D7518L5345J0278k3106j4065L951j7240K545K566K4727j1957r650R90K470
$$ 47518 82863 93141 70035 55970 59921 42681 45226 47792 72519 60562 50912 51902 54372
13542E4372j1138o818Q109J226J9562K8096k9899j1134J9954R538j2488N006k1538
$$ 54372 43234 36416 44525 45751 65313 93409 63510 52376 72330 81868 69380 74386 52848
13529E2848j1759K9928L9114J3560l3721l6585Q451K1363j5216k871n597r850
$$ 52848 41089 71017 110131 123691 89970 53385 61836 83199 67983 65112 59515 49665
13517D9665j4397j3088L475k231K625k7803K4375L2502p377L4402L9291o915K119
$$ 49665 35268 22180 25655 23424 26049 -1754 22621 55123 47746 82148 121439 114524 116643
13504A16643J3k896m318J3139J2516N520N676K5957M0524J5002L3631K2466L3682
$$ 116643 116656 113760 109442 122581 135097 140617 146293 172250 212774 227776 261407 283873 317555
13491C17555N6036N6746K2705L0552J8331J1073J2955L9718J4833k6361n1612
$$ 317555 373591 430337 453042 483594 501925 512998 525953 565671 580504 554143 502531
13480E02531k7986m1250j6411m0794l2360j8222k7291m2360m6848L057q48j5200
$$ 502531 474545 433295 416884 376090 343730 325508 298217 255857 209009 212066 211218 196018
13468A96018j1085J1225J1542r269J4369l1590J0764K3558k319j4875J2597O656
$$ 196018 184933 196158 207700 198431 212800 181210 191974 215532 213213 198338 210935 217591
13456B17591K0941K3835L0733L8349M1827K4525O1990L6953O150O423J4719o497
$$ 217591 238532 262367 293100 331449 373276 397801 459791 496744 502894 509317 524036 517539
13444E17539j9429J7345j143o5432n9735j5935J0902n315m7101p4920l2176j8106
$$ 517539 498110 515455 514312 448880 389145 373210 384112 378797 331696 256776 224600 206494
13432B06494l5018j5766K1119r224k9305j7676k925Q968k267l154k4085Q193N6004
$$ 206494 171476 155710 176829 167605 138300 120624 117699 126667 124400 121246 97161 105354 161358
13419A61358J1174k2268j1892k875j3361o397k2559J4824j093p812P44j1955p784
$$ 161358 172532 150264 138372 135497 122136 115739 93180 108004 106911 99099 99843 87888 80104
13406H0104K0623J3089J3324Q462K791k3884l1198M247K117k247j3542K636J0951
$$ 80104 100727 113816 127140 135602 138393 114509 83311 87558 89675 87428 73886 76522 87473
13393H7473O538J9884P009N036j6898k8891Q526J0483k525P353j7316o87k152
$$ 87473 94011 113895 120904 125940 109042 80151 88677 99160 96635 103988 86672 85985 83833
13380H3833l618k4451k577L4106j289k4620K583l142p948k7K0611k512J122p321
$$ 83833 80215 55764 53187 87293 86004 61384 63967 60825 52877 52850 73461 70949 72071 64750
13366F4750K638J9707K3788k5718l7009k0056n553M0596K0384j741N463N910l1599
$$ 64750 67388 87095 110883 85165 48156 28100 22547 63143 83527 81786 87249 93159 61560
13353F1560l246K051k308j5902K652p006j3814r779j3121K5797L0914k161M567
$$ 61560 58314 60365 58057 42155 44807 37801 23987 14208 1087 26884 57798 55637 60204
13340F0204j7694R512M204L2034J6115K4953j4037q559J4936r326j2445k1849
$$ 60204 42510 52022 56226 88260 104375 129328 115291 106732 121668 112342 99897 78048
13328G8048k5886j125p389K4002R321L1595K6618o450J382n984O482J0350N905
$$ 78048 52162 51037 43648 67650 76971 108566 135184 128734 130116 124132 130614 140964 146869
13315A46869r115J2676j3027p046n058O258J1362K5384K0545j0048l704K6934
$$ 146869 137754 150430 137403 130357 125299 131557 142919 168303 188848 178800 175096 202030
13303B02030M1581r776p984o837j218J8726J6076r430k6327N174J0401j2728L5404
$$ 202030 243611 233835 225851 219014 217796 236522 252598 243168 216841 222015 232416 219688 255092
13290B55092K3988J9873Q084j0050Q988M870l3403j5271R667j8872j8475L14j4635
$$ 255092 279080 298953 307037 296987 305975 310845 277442 262171 271838 252966 234491 234805 220170
13277B20170Q329l867m050m45K7837r887r278L9246J7475j1953j9584r987K0830
$$ 220170 228499 224632 220582 220137 247974 238087 228809 268055 285530 273577 253993 244006 264836
13264B64836j5391k9653j9776R065K4993k0301J7127J0989o73n149k666l5529
$$ 264836 249445 219792 200016 209081 234074 213773 230900 241889 241216 236067 233401 197872
13252A97872m4824k4623P076K9751R846L192J0745k848Q527l3071k2076J3677
$$ 197872 153048 128425 135501 165252 175098 178290 189035 186187 194714 161643 139567 153244
13240A53244O914k4765k1130J4209K5701j7225m8279J1154n348j1526P022J2880
$$ 153244 160158 135393 114263 128472 154173 136948 88669 99823 94475 82949 89971 102851
13228A02851j2144J1075q026k8080j3808J3349J7562k2665p494J7048J3097M359
$$ 102851 90707 101782 93756 65676 51868 65217 82779 60114 52620 69668 82765 87124
13216H7124j0393L3805j6314k9500j3059k099J1170O922J3124Q971M137j3100
$$ 87124 76731 110536 94222 64722 51663 49564 60734 67656 80780 89751 93888 80788
13204H0788j7702J288j969J6353M1494j7639k8159o415k2667k578M340j2613Q143
$$ 80788 63086 64374 62405 78758 120252 102613 74454 68039 45372 42794 47134 34521 42664
13191D2664j3193m342J674L540J604K1301N248l615p671j8285j7380L197R168
$$ 42664 29471 25129 26803 30343 31947 53248 58496 54881 47210 28925 11545 14742 23910
13178B3910k1454k8265P848n723j8625j8708R328K6770K0728J3833p618j1018
$$ 23910 2456 -25809 -17961 -23684 -42309 -61017 -51689 -24919 -4191 9642 2024 -8994
13166h994k1916Q14L756j6134n198J1608K7807J6061L0240n249k3699n22K9905
$$ -8994 -30910 -30096 -26340 -42474 -47672 -36064 -8257 7804 38044 32795 9096 8574 38479
13153C8479L0806l4684k3638R026m953j1329J3539p9o659k8450j5919k1310M5624
$$ 38479 69285 34601 10963 19989 15036 3707 17246 17167 10508 -17942 -33861 -55171 -9547
13140i547L3399j3211j1518M964J6683Q235j341n829O471q600j0763M282q881
$$ -9547 23852 10641 -877 4087 20770 29005 27664 21835 28306 19706 8943 13225 4344
13127D344n019K8300l885q05j4930Q406o608J756J74p000J4389J8461n830M00
$$ 4344 -675 27625 23740 22935 8005 16411 9803 11559 11733 4733 19122 37583 31753 32153
13113C2153J415k3125j1778M02p861K5091J0609k302O56J948K246l743k6688j4808
$$ 32153 33568 10443 -1335 -933 -8794 16297 26906 24604 25260 27208 29454 25711 -977 -15785
13099a5785K5370n575k5250K7783k436m839J4205K1685k7220j8010J6017q523
$$ -15785 9585 4010 -21240 6543 4107 -732 13473 35158 7938 -10072 5945 -2578
13087b578j0769R57O763p257L203k6327j4596J357m079j0462K3589L4134Q485
$$ -2578 -13347 -12390 -5627 -12884 -9681 -36008 -50604 -49247 -53326 -63788 -40199 -6065 2420
13074B420O049j73M446j4184P135r816k1573l1566p389L0567M3324R197J1417
$$ 2420 8469 8296 12742 -1442 5693 -4123 -25696 -57262 -64651 -34084 9240 18437 29854
13061B9854j0218O8k1933J3525L3203j0882k3135j0226j5272m7119K370N909N578
$$ 29854 19636 19704 -2229 11296 44499 33617 10482 256 -15016 -62135 -59765 -53856 -48278
13048d8278L4928K7082k6480j1666J577m429J2815L4678j4489l3184j2228n834
$$ -48278 -13350 13732 -12748 -24414 -22837 -27266 -14451 20227 5738 -27446 -39674 -45508
13036d5508r32r227l1015k6518M1851J3790j7199j4933J4929K2223L873p936j1644
$$ -45508 -46440 -55667 -86682 -113200 -71349 -57559 -74758 -89691 -74762 -52539 -48666 -56602 -68246
13023f8246j8829K39j7718q678J3042M8924P1828P594k7280j9327k248K7792K7129
$$ -68246 -87075 -86836 -104554 -113232 -100190 -51266 20562 28156 876 -18451 -20699 7093 34222
13010C4222k3304j8713J9473J5899j3601R73J59j3220j4978J1786p014L3186M924
$$ 34222 10918 -7795 11678 27577 13976 14949 15108 1888 -13090 -1304 -8318 24868 29792
12997B9792j4098j024k0427l3780j9741J3923J6530J3664n589j5884J436J3197
$$ 29792 15694 14670 -5757 -39537 -59278 -45355 -28825 -15161 -20750 -36634 -35198 -22001
12985b2001L398j5716M926K1789j2463J4952m66J5303J9513Q37r870J1966J5562
$$ -22001 -18603 -34319 -29393 -7604 -20067 -5115 -5581 9722 29235 30072 20202 32168 47730
12972D7730k4873j9730J0957j1220j497l865N11k6024R827J6765j194m198r986
$$ 47730 22857 3127 14084 2864 1367 -2498 -1987 -28011 -18184 -1419 -2613 -6811 -16797
12959a6797J4140K7076R737q079j443K057N015k252J3776M959r233n699m99K804
$$ -16797 -2657 24419 34156 26077 24634 26691 31706 29454 43230 48189 38956 33257 32758 35562
12945C5562j253k334j8422j1925O236K959L014j0694J7617K2783K798J414j92
$$ 35562 34309 31975 13553 1628 7864 10823 13837 3143 20760 43543 46341 47755 47563
12932D7563k1125O998R195P387j1489k4298n051j2306k0769K265r139m673K1516
$$ 47563 26438 33436 42631 50018 38529 14231 9180 -3126 -23895 -21630 -30769 -35442 -13926
12919a3926P477n088o744N097j6492p496k930K8020O056j5046k5181j3118J2624
$$ -13926 -6449 -11537 -18281 -13184 -29676 -37172 -40102 -12082 -6026 -21072 -46253 -59371 -46747
12906d6747K8675Q880J3192j3186l9757l897M6790J4944l7902O524N565J7233
$$ -46747 -18072 -9192 4000 -9186 -48943 -52840 -6050 8894 -29008 -22484 -16919 314
12894C14J9072R080k3670k8589l693j5853J839J6096L7343J8331j3051j6136j4435
$$ 314 19386 28466 4796 -23793 -27486 -43339 -41500 -25404 11939 30270 17219 1083 -13352
12881a3352j7890j0056J1247K4786J0454j2649j6673R284k1697N591J4748L619
$$ -13352 -31242 -41298 -30051 -5265 5189 -7460 -24133 -14849 -36546 -30955 -16207 -12588
12869a2588r070l0483k3K5113J4227J275j646J1593K8627j4650l0004k575K591
$$ -12588 -21658 -52141 -52164 -27051 -12824 -11549 -13195 -1602 27025 12375 -17629 -20204 -17613
12856a7613Q15O1369J4758j5558j8708j7510l8213J3731J6985j9461P109N233
$$ -17613 -16798 44571 59329 43771 25063 7553 -30660 -16929 56 -19405 -12296 -7063
12844g063n502R692N797j5735j8638k988j317l836P144K022L996M4138J8526j9228
$$ -7063 -12565 -2873 2924 -12811 -31449 -34437 -35754 -39590 -32446 -30424 -26428 17710 36236 17008
12830A7008k1890l138p299j8344q6O121Q852K8708J5107J567j8835r040K9759
$$ 17008 -4882 -8020 -15319 -33663 -33749 -27628 -18776 9932 25039 26606 7771 -1269 28490
12817B8490o051j1065J6932o854N832p708j4628J609r481j5014M288r553j161
$$ 28490 22439 11374 28306 21452 27284 19576 4948 6557 -2924 -17938 -13650 -23203 -24364
12804b4364K4783N345R872j5065j0217m886j2586J9090n422k1560m958j0247J6782
$$ -24364 419 5764 15636 571 -9646 -14532 -27118 -8028 -13450 -35010 -39968 -50215 -33433
12791c3433l535j9368J7767Q868j3699j2020K034L0633M4406o475j0470L718L848
$$ -33433 -36968 -56336 -38569 -29701 -43400 -55420 -53386 -22753 21653 15178 4708 8426 12274
12778A2274j6095n519p102l584M341o538o336K0515Q687l118j7945J856n003l978
$$ 12274 -3821 -9340 -16442 -20026 -15685 -22223 -28559 -8044 643 -2475 -20420 -18564 -23567 -27545
12764b7545N699J8359l186l8736j3170N647O278N472j0458O526J6313K2026L3237
$$ -27545 -21846 -3487 -6673 -45409 -58579 -52932 -46654 -41182 -51640 -45114 -28801 -6775 26462
12751B6462J9139l499n079k4759k1640p949Q340R939k3432j6913j992J1452j3410
$$ 26462 45601 42102 37023 12264 -9376 -17325 -8985 954 -22478 -39391 -41383 -29931 -43341
12738d3341J3133k5591k0033Q480J0707j9808O909M5607M9044K2752k9899m8232
$$ -43341 -30208 -55799 -75832 -67352 -56645 -76453 -69544 -23937 25107 47859 17960 -30272
12726c0272p668J9750J2108k322j331J0372K3860R80j9865j4510J721m914r104
$$ -30272 -37940 -18190 -6082 -8404 -9735 637 24497 25477 5612 -8898 -7177 -12091 -21195
12713b1195K6445j570j1124J2962j1416J061k8211q002j676j930M8224R682k9294
$$ -21195 5250 3680 -7444 5518 -5898 -4837 -33048 -41050 -42726 -44656 3568 13250 -16044
12700a6044o051l223O969m833k1908J4742J2510J4022l083j4911k5317J1463Q422
$$ -16044 -22095 -25318 -18349 -23182 -45090 -30348 -17838 -3816 -6899 -21810 -47127 -35664 -27242
12687b7242J862j7264K245J3668k749p410j1784J4632J6446K8420K1359o322j7038
$$ -27242 -25380 -42644 -40399 -26731 -29480 -36890 -48674 -34042 -17596 10824 32183 25861 8823
12674H823l1948j6480N04j3965N151J6085O856M606l1551J0458M7007J4000k9059
$$ 8823 -23125 -39605 -39101 -53066 -47915 -31830 -24974 -20368 -51919 -41461 5546 19546 -9513
12661i513r051P495K7665K4690j3101o774q490L35k3240j0984J4197J6000k0631
$$ -9513 -18564 -11069 16596 41286 28185 21411 12921 13256 -9984 -20968 -6771 9229 -11402
12648a1402q776J1707J1813j8636j870J2435l621J8318j258j3974Q932R225r876
$$ -11402 -20178 -8471 3342 -15294 -17164 -4729 -8350 9968 8710 -5264 3668 12893 3017
12635C017j7884j5932j4105L4814L9828K0247K41l2798m6041j3981K2854K3546
$$ 3017 -14867 -30799 -44904 -10090 29738 49985 50226 17428 -28613 -42594 -19740 3806
12623C806J8507j0343j9682J1204n429k5115P131l1144m1766J159L4533J1167
$$ 3806 22313 11970 -7712 3492 -1937 -27052 -19921 -51065 -92831 -91672 -57139 -45972
12611d5972J4663j772j7474R904K3098l717k2890k0702k007Q419j3253N071k013
$$ -45972 -31309 -33081 -50555 -40651 -17553 -21270 -44160 -64862 -66869 -58450 -71703 -66632 -68645
12598f8645O330K497N0066K7600k517O865j5296k3629j1927J064p037J0071L3808
$$ -68645 -62315 -59818 -9752 17848 15331 22196 6900 -16729 -28656 -27592 -34629 -24558 9250
12585I250J3263l6837J275L361j3226j0883M690J2890O561j2104M15j2647l7700
$$ 9250 22513 -14324 -13049 -9688 -22914 -33797 -29107 -16217 -9656 -21760 -21345 -33992 -71692
12572g1692K2893M3539N127J8167k3760m3177n813L4188O037J6201J8723L053
$$ -71692 -48799 -5260 -133 18034 -5726 -48903 -54716 -20528 -14491 1710 20433 23486
12560B3486k744q61M58j0197j1332j2308j0398l4590j1523Q946N354Q384K7769
$$ 23486 20742 19881 20339 10142 -1190 -13498 -23896 -58486 -70009 -61063 -55709 -47325 -19556
12547a9556j1262O107r621n240M95K178r683l3949O913J3251J0634L0612L1595
$$ -19556 -30818 -24711 -34332 -39572 -39077 -36899 -46582 -80531 -73618 -60367 -49733 -19121 12474
12534A2474k0634p372J2641Q831J8147j652j1825j0811J3620l516j8822j0232
$$ 12474 -8160 -15532 -2891 5940 24087 22435 10610 -201 13419 9903 -8919 -19151
12522a9151j438k4714l83k672L5642M428k576m001J0955j2355k1517l583J2559
$$ -19151 -20589 -45303 -45686 -48358 -12716 -8288 -10864 -14865 -3910 -16265 -37782 -41365 -28806
12509b8806L986J6515L187K1838N962q159Q492n624p500j6119N534p5j6545j1179
$$ -28806 -24820 -8305 -5118 16720 22682 14523 23015 17391 9891 -6228 -694 -769 -17314 -28493
12495b8493J626M023K3254j1118J3663M533k9073o680P226K0014j1874k3637j8946
$$ -28493 -26867 -22844 410 -10708 2955 7488 -21585 -28265 -21039 -1025 -12899 -36536 -55482
12482e5482J9196K2213J4492q368k4427M570J3082M50R447J4047k4657j2875J0974
$$ -55482 -36286 -14073 419 -7949 -32376 -27806 -14724 -14274 -4827 9220 -15437 -28312 -17338
12469a7338J8419k92l087J2043m8804j9690K2999P947K4544j6075O866O831J4462
$$ -17338 1081 789 -2298 9745 -39059 -58749 -35750 -27803 -3259 -19334 -12468 -5637 8825
12456H825P327n024n693L607K86L69J066q676j7537j0097k402K5242j0188L5293
$$ 8825 16152 11128 5435 9042 9328 9697 10763 2087 -15450 -25547 -27949 -2707 -12895 22398
12442B2398o95k4570l584M285K2433J4412j8279J4122K4023l2853k4760j1349
$$ 22398 21703 -2867 -6451 -2166 20267 34679 16400 30522 54545 21692 -3068 -14417
12430a4417k2730j1989k1964r248L3448L2553K0867L490k6648N211j5511k061
$$ -14417 -37147 -49136 -71100 -80348 -46900 -14347 6520 10010 -16638 -11427 -26938 -28999
12418b8999r184J679K9652q051k5129R709J5336q152p468L3297L3490J4038l6506
$$ -28999 -38183 -36504 -6852 -14903 -40032 -30323 -14987 -23139 -30607 2690 36180 50218 13712
12405A3712j5821K430N657j4189O013o42Lk0026P4L7151K6897R399J3462l8642
$$ 13712 -2109 321 5978 -8211 -2198 -2840 -2837 -22863 -22789 14362 41259 50658 64120 25478
12391B5478l0145J6659J7516o167m929j1784r355M446M114R945m610J1238J6901
$$ 25478 -4667 11992 29508 23341 18412 6628 -2727 1719 5833 15778 11168 22406 39307
12378C9307p579J3344K8545k6581j2733J52k7634k510J9227K3840k6829l8305
$$ 39307 31728 45072 73617 47036 34303 34455 6821 4311 23538 47378 20549 -17756
12366a7756k3193K2846K9433R143l5102O86J5778J3475m571r606Q924J0863p469
$$ -17756 -40949 -18103 11330 20473 -14629 -13943 1835 15310 10739 1133 10057 20920 13451
12353A3451j8618M246j8311p415J8420K350l9852j8644k20K1679r539j1111Q970
$$ 13451 -5167 -921 -19232 -26647 -8227 -5877 -45729 -64373 -64593 -42914 -52453 -63564 -54594
12340e4594K2874J3916K1980j5104k2514r929J4196O807j7031K6387R751K433
$$ -54594 -31720 -17804 4176 -10928 -33442 -43371 -29175 -22368 -39399 -13012 -3261 -828
12328h28M454k3698R475K106q227O309k2868j2663K3320K2449m32J2599j821m995
$$ -828 3626 -20072 -10597 -8491 -16718 -10409 -33277 -45940 -22620 -171 -603 11996 10175 5180
12314E180J8553k633l4422j0963K7477K5440j2968p293m1794k5655N972K8041
$$ 5180 23733 21100 -13322 -24285 3192 28632 15664 8371 -33423 -59078 -53106 -25065
12302b5065k954l0149j5668L121N510M754K1582J5106K2547k2617q644J9921J4003
$$ -25065 -28019 -58168 -73836 -70715 -65205 -60451 -38869 -23763 -1216 -23833 -32477 -12556 1447
12289A447K2937k6661L06Q21J5559o49o916J9271K0690k4068J355j9794j4895
$$ 1447 24384 -2277 -1971 -1150 14409 13760 6844 26115 46805 22737 24092 4298 -10597
12276a0597j4436M83Q364K677q606O413K2693k9021k5411P498k1962P758K3769
$$ -10597 -25033 -24550 -16186 -13509 -22115 -15702 6991 -22030 -47441 -39943 -61905 -54147 -30378
12263c0378R008K0225R831o690n174j5608j9049Q835L2651J5800k9791m395j685
$$ -30378 -21370 -1145 8686 1996 -3178 -18786 -37835 -29000 3651 19451 -10340 -14735 -16420
12250a6420N276M731J5334j4817J2189j760j7670J2243M2071L889k7752m3381
$$ -16420 -11144 -6413 8921 -5896 6293 4533 -13137 -894 41177 45066 17314 -26067
12238b6067O018J9080K1735K7007L2765k1505k2703l013k0267n050J3157K7871
$$ -26067 -20049 -969 20766 47773 80538 59033 36330 33317 13050 8000 21157 49028
12226D9028k977j8013j8685j3500j3159P100j1949L8905q793m8283Q685J7444
$$ 49028 46051 28038 9353 -4147 -17306 -10206 -22155 16750 7957 -40326 -31641 -14197
12214a4197J0649j925r096j1782k287j95K0052J3583P708N65o987N357o138k0739
$$ -14197 -3548 -5473 -14569 -26351 -28638 -28833 -8781 4802 12510 13075 6088 11445 5307 -15432
12200a5432P962j3374k654n294J4435K3232J9790N614J5690l3659l5483n462r271
$$ -15432 -7470 -20844 -23498 -28792 -14357 8875 28665 34279 49969 16310 -19173 -24635 -33906
12187c3906j744K7170J2161J7425J2261K0540p750r788q154J8706J0916J9399
$$ -33906 -35650 -8480 3681 21106 33367 53907 46157 36369 28215 46921 57837 77236
12175G7236k3296j0778J803n3166j342J713m4989j9651j0578K5916L4742Q135
$$ 77236 53940 43162 44965 -8201 -9543 -7830 -52819 -72470 -83048 -57132 -22390 -14255
12163a4255J4578J0618k3565j5128Q761J3852J969o83J5690O948P690j3110j1238
$$ -14255 323 10941 -12624 -27752 -18991 -5139 -3170 -3853 11837 18785 26475 13365 2127
12150B127P374k6328l446J1051M469J0685K8652j226l4291m1465J5224J7511j215
$$ 2127 9501 -16827 -20273 -9222 -4753 5932 34584 33358 -933 -42398 -27174 -9663 -10878
12137a0878J0370L3619J1935m8012M759L8446K7301o610k3707m441j341o985P603
$$ -10878 -508 33111 45046 -2966 1793 40239 67540 60930 37223 32782 31441 24456 32059
12124C2059n90l5933l0488k394J9258p917O158J2684L209N675J8042J4283k502
$$ 32059 31469 -4464 -34952 -37346 -18088 -26005 -19847 -7163 -3954 1721 19763 34046 31544
12111C1544O138k2848j6565L223L5969P377j0132j7046K0985P239J2243J1190
$$ 31544 37682 14834 -1731 1492 37461 44838 34706 17660 38645 45884 58127 69317
12099F9317J4219j4875j7847J576k8443O107r968j0328K1855L7007J6216M319
$$ 69317 83536 68661 50814 52390 23947 30054 20086 9758 31613 68620 84836 89155
12087H9155J1240M4129O851R764J6494J7845J5836j2260k9805k3294m4881j5602
$$ 89155 100395 144524 151375 161139 177633 195478 211314 199054 169249 145955 101074 85472
12075H5472k745r877l1727l4623p707K7767L0579n505K246j0659k4288j3911J0656
$$ 85472 82727 72850 41123 6500 -1207 26560 57139 51634 53880 43221 18933 5022 15678
12062A5678L1592j872J4520M934j7703k8047j0880O825J0790j4381l1540j6010
$$ 15678 47270 45398 59918 64852 47149 19102 8222 15047 25837 11456 -20084 -36094
12050c6094p447J062K4586J4185l9648m228K0538K6172K2241m038j2527K629M0859
$$ -36094 -43541 -42479 -17893 -3708 -43356 -47584 -27046 -874 21367 17329 4802 7431 48290
12037D8290K9873K7072J0180J9278J5671m2631m4480J4130j520k2738l4701j6478
$$ 48290 78163 105235 115415 134693 150364 107733 63253 77383 75863 53125 18424 1946
12025A946O17m4462j1824J4483K1846P203m2259N303J9704J9071j648k367j139
$$ 1946 2563 -41899 -53723 -39240 -17394 -10191 -52450 -47147 -27443 -8372 -10020 -12387 -13526
12012a3526j9524q559n369k650n127L9193k0865j5920L3812j0676k977O046k5017
$$ -13526 -33050 -41609 -46978 -49628 -54755 -15562 -36427 -52347 -18535 -29211 -32188 -26142 -51159
11999e1159J678R133L465J1070m012J8736J9070q293j6946o275r380k329j0154
$$ -51159 -49481 -40348 -36883 -25813 -29825 -11089 7981 -312 -17258 -23533 -32913 -35242 -45396
11986d5396K5425P231j5426m112L211O615o395L7257l601L677m817N709n177k1764
$$ -45396 -19971 -12740 -28166 -32278 -29067 -22452 -28847 8410 4809 8486 3669 9378 4201 -17563
11972a7563K2816J1017k7807K7538j5633j5443R676p92q56M063J2541k3485l72
$$ -17563 5253 16270 -11537 16001 368 -15075 -5399 -6191 -7047 -2984 9557 -13928 -14300
11959a4300J0594J7196K187j1609r580j5921O051n781n478J653N986L0059R03
$$ -14300 -3706 13490 15677 4068 -5512 -21433 -15382 -21163 -26641 -24988 -19002 11057 11960
11946A1960k5763k9880j2206K5830J2681J3571j4744k3952J9952J8131k6999k314
$$ 11960 -13803 -43683 -55889 -30059 -17378 -3807 -18551 -42503 -22551 -4420 -31419 -33733
11934c3733K2455L1735J2737l1561k9239N601J5976j5852O78p178n665K0569M2557
$$ -33733 -11278 20457 33194 1633 -27606 -22005 -6029 -21881 -21203 -28381 -34046 -13477 29080
11921B9080n818j3493j8644K702j129k1950n49k365M7725K1201P320j1280j0336
$$ 29080 23262 9769 -8875 -6173 -7302 -29252 -29801 -32166 15559 36760 44080 32800 22464
11908B2464j252l540j8437r613k435k946l470m578J9770L9963q091k0163q43L115
$$ 22464 21212 17672 -765 -10378 -12813 -15759 -19229 -23807 -4037 35926 27835 7672 6829 9944
11894I944J9396R820k9270O615L720p479M6119J3035n4203k0715J5243J1937j9484
$$ 9944 29340 39160 9890 16505 20225 12746 58865 71900 17697 -3018 12225 24162 4678
11881D678l4130j3556j5214M549Q739J1500J4697J4192o145o893k995m678J8989
$$ 4678 -29452 -43008 -58222 -53673 -44934 -33434 -18737 -4545 -10690 -17583 -20578 -25256 -6267
11868f267R691L900j2204N740J1260j0741k435J6704l093j3544o626O648J9083
$$ -6267 3424 7324 -4880 860 12120 1379 -1056 15648 12555 -989 -7615 -967 18116
11855A8116J8435k2082j4235J8935q414j144J2816j8199j3322L6493J3983j4201
$$ 18116 36551 14469 234 19169 10755 9611 22427 4228 -9094 27399 41382 27181
11843B7181q625L880L566K4972m933j3609l454n216j6125L3206L8245J3927L1049
$$ 27181 18556 22436 26002 50974 46041 32432 28978 23762 7637 40843 79088 93015 124064
11830A24064j3119r894k0090l8183k0231k5953K0966R647J7538p738k197l2465
$$ 124064 110945 101051 80961 42778 22547 -3406 17560 27207 44745 37007 34810 2345
11818B345m2786J8046N1001p050Q15j07k641p43K0765k680l4180K419J0677k950
$$ 2345 -40441 -22395 28606 21556 22371 22264 19623 18880 39645 36965 2785 5204 15881 12931
11804A2931n99K1824L0330M583K3621N768k2571k9886O581j6259Q696J2010l2460
$$ 12931 12332 34156 64486 69069 92690 98458 75887 46001 52582 36323 45019 57029 24569
11791B4569j1982K3498J3749j1695k005j7461N64r848o749L199j983r9J3848J6973
$$ 24569 12587 36085 49834 38139 36134 18673 19237 9389 2640 5839 3856 3757 17605 34578
11777C4578J848J737J0512L643j815R754R08m242L2864J8925j6323j6404J5820
$$ 34578 36426 38163 48675 52318 50503 60257 61165 56923 89787 108712 92389 75985 91805
11764I1805j9317k1787k4481q353k5173J4132J1916J5111m212J9386J0336J1661
$$ 91805 72488 50701 26220 17867 -7306 6826 18742 33853 29641 49027 59363 71024
11752G1024j8398l3898l7064J839q668L744J4085O665L0834J5526l3840m280J2595
$$ 71024 52626 18728 -18336 -16497 -25165 -21421 -7336 -671 30163 45689 11849 7569 20164
11739B0164J3573J4546m789k5912k5276J03k40K004Q367K9665L144k227J963J2636
$$ 20164 33737 48283 43494 17582 -7694 -7591 -7831 -5827 2540 32205 35349 33122 35085 47721
11725D7721j9182r524o889j922J1985J0992L1019J4870j3250k1325J848L618K619
$$ 47721 28539 19015 12126 10204 22189 33181 64200 79070 65820 44495 46343 49961 52580
11712E2580l446L294k0710j5647k9557K870J7211k6209K907O039K3909L501J4139
$$ 52580 49134 52428 31718 16071 -13486 -10616 6595 -19614 -16707 -10668 13241 16742 30881
11699C0881j6260j2318J2629k3272j4866j3738j9339K81L6526j4517n191L3517
$$ 30881 14621 2303 14932 -8340 -23206 -36944 -56283 -56002 -19476 -33993 -39184 -5667
11687e667O897J4327P757Q009K0301p875q354j488N706N465j5728L030n999O309
$$ -5667 1230 15557 23314 31323 51624 43749 35395 33907 39613 45078 29350 32380 26381 32690
11673C2690k9564k1714P763K9690J3767j3230j1351j5022j1564L1229J5790k5153
$$ 32690 3126 -18588 -10825 18865 32632 19402 8051 -6971 -18535 12694 28484 3331
11661C331j5212j271p579J1169Q230l096m489o023J4691r84J2862j8248J555p006
$$ 3331 -11881 -13152 -20731 -9562 -1332 -4428 -8917 -14940 -249 -1233 11629 -6619 -5064 -12070
11647a2070j1831j3906L2220O371Q207j6181k1684O940J1811J5011k7879j598
$$ -12070 -23901 -37807 -5587 784 8991 -7190 -28874 -21934 -10123 4888 -22991 -24589
11635b4589M813k4715o032m500k1402J4564L8013k1276P965L0591K4039N566Q664
$$ -24589 -19776 -44491 -50523 -55023 -76425 -61861 -23848 -45124 -37159 -6568 17471 23037 31701
11622C1701k7836m705J0675j774m0561j6936M0207N8942L448l0263j6281J4804
$$ 31701 3865 -840 9835 8061 -32500 -49436 -9229 49713 53161 22898 6617 21421
11610B1421o418q191n16j6946k8676k291J6074L9718P027L003L285k2826r698
$$ 21421 15003 6812 6296 -10650 -39326 -41617 -25543 14175 21202 24205 27490 4664 -5034
11597e034M72J4266Ro196m993J1170J6925J5950O799r245l0189k91l1146l4184
$$ -5034 -4562 9704 9713 3517 -1476 9694 26619 42569 49368 40123 9934 9643 -21503 -55687
11583e5687J117K7003N817M521K9087K09m5851P308J2964k1752p439Q806L5717
$$ -55687 -54570 -27567 -21750 -17229 11858 12067 -33784 -26476 -13512 -35264 -42703 -33897 1820
11570A820L0035j0334k6907j560j1545q111m796L926M294J6506l1892j3225J2597
$$ 1820 31855 21521 -5386 -6946 -18491 -26602 -31398 -27472 -23178 -6672 -38564 -51789 -39192
11557c9192J0848R73k7980K6259M4867J8915n406J151o189J451l855j3752k4490
$$ -39192 -28344 -27371 -55351 -29092 15775 34690 29284 30435 24246 25697 21842 8090 -16400
11544a6400L210n574k200j2189J1082L8218K4815K8185P14k7773l3549l3903q075
$$ -16400 -13190 -18764 -20964 -33153 -22071 16147 40962 69147 69861 42088 8539 -25364 -33439
11531c3439J2204j4700j4370m359M0535m089k306J8657n221r547l6439q127K9519
$$ -33439 -21235 -35935 -50305 -54664 -14129 -18218 -20524 -1867 -7088 -16635 -53074 -61201 -31682
11518c1682J5120p623J7542K4852k6385Q688r621j8003J0597q539l267K5187k3450
$$ -31682 -16562 -24185 -6643 18209 -8176 512 -9109 -27112 -16515 -25054 -28321 -3134 -26584
11505b6584l30J2404q050n564J8600K6674J9971j1424l0830r152j7528j0536m487
$$ -26584 -26914 -14510 -22560 -28124 -9524 17150 37121 25697 -5133 -14285 -31813 -42349 -46836
11492d6836R491L2990J6710k505k9450k8622j308J7844o984J639K4014j3721k4088
$$ -46836 -37345 -4355 12355 9850 -19600 -48222 -49530 -31686 -38670 -37031 -13017 -26738 -50826
11479e0826J3587J2653o040K1097P420l364J0980M776J1898j9637r719k1125P906
$$ -50826 -37239 -24586 -30626 -9529 -2109 -5473 5507 10283 22181 2544 -7175 -28300 -20394
11466b0394m843J2041L0871J5029k1445j5435r289L525J8810M558n781p148j0070
$$ -20394 -25237 -13196 17675 32704 11259 -4176 -13465 -9940 8870 13428 7647 499 -9571
11453i571l7056j932Q635K8603K7973J4333n452j6484j3608j9609j3367L710j9026
$$ -9571 -46627 -48559 -39924 -11321 16652 30985 25533 9049 -4559 -24168 -37535 -33825 -52851
11440e2851j9039L1116J7003j5821j2024O070J3929k936j9983K1895J8608k0429
$$ -52851 -71890 -40774 -23771 -39592 -51616 -45546 -31617 -34553 -54536 -32641 -14033 -34462
11428c4462J2873j0538p574N431k251k1891J0946P774L419O491M848o666p224
$$ -34462 -21589 -32127 -39701 -34270 -36521 -58412 -47466 -39692 -36273 -29782 -24934 -31600 -38824
11415c8824k5365k1764J4555n104L367J1165N0646J5960L104q174k2979M875L1967
$$ -38824 -64189 -85953 -71398 -76502 -73135 -61970 -11324 4636 7740 -434 -23413 -18538 13429
11402A3429J710j6056l504l788j0116l455K1617M983j6613j3441L71l757q614
$$ 13429 15139 -917 -4421 -8209 -18325 -21780 -163 4820 -11793 -25234 -24863 -28620 -37234
11389c7234k684j4131J3262L4376Q638l6663j846J3935j3052p527N014N509j731
$$ -37234 -39918 -54049 -40787 -6411 2227 -34436 -36282 -22347 -35399 -42926 -37912 -32403 -34134
11376c4134K9032J0182k4110p890j4988J7815K6984k9365j7508q715J5751K7519
$$ -34134 -5102 5080 -19030 -26920 -41908 -24093 2891 -26474 -43982 -52697 -36946 -9427
11364i427m212j9410j2709j5386J4462L9947J4196k1318k524J3558r324l2985
$$ -9427 -13639 -33049 -45758 -61144 -46682 -6735 7461 -13857 -16381 -2823 -12147 -45132
11352d5132J446Q299j3538L386J4561j2884n008L7383J9481m1174n538N107l855
$$ -45132 -43686 -35387 -48925 -45539 -30978 -43862 -48870 -11487 7994 -33180 -38718 -33611 -37466
11339c7466J820r190J8349P452M849o051Q573j6047m764r981j6463K030k5628
$$ -37466 -35646 -44836 -26487 -19035 -14186 -20237 -11664 -27711 -32475 -42456 -58919 -56889 -82517
11326h2517k927K9405P106L751n434q806N780J5805L2399M5425j0953n1072j8494
$$ -82517 -85444 -56039 -48933 -45182 -50616 -59422 -53642 -37837 -5438 39987 29034 -22038 -40532
11313d0532L1659J1288n961K3210J5524m357l4408m6695o765L7949K5788K2721
$$ -40532 -8873 2415 -3546 19664 35188 30831 -3577 -50272 -57037 -19088 6700 29421
11301B9421J6778J5674l5339m0333k638l193k3702J0571R600J6516k353L1919
$$ 29421 46199 61873 26534 -13799 -16437 -19630 -43332 -32761 -23161 -6645 -8998 22921
11289B2921J9297l0973k3313p441l482p719J9881O163P998K4824n902r263o920
$$ 22921 42218 11245 -12068 -19509 -22991 -30710 -10829 -4666 3332 28156 22254 12991 6071
11276F071j5437K5940K0029r557k8778J1165J5774l719J7761l073j1946j5032
$$ 6071 -9366 16574 36603 27046 -1732 9433 25207 21488 39249 36176 24230 9198
11264I198q304J8439k0842p130J5932J0603j24j2070P81j5748j2878J1486M929
$$ 9198 894 19333 -1509 -8639 7293 17896 17772 5702 6483 -9265 -22143 -10657 -5728
11251e728M0581J1682J914k4375j0433R49P151K3735j0630k0153n851K137j1124
$$ -5728 34853 46535 48449 24074 13641 14590 21741 45476 34846 14693 8842 10979 -145
11238a45R062Q639n422J4898K90l0993j7855j3174j5825o012J2558R981l3314
$$ -145 8917 17556 12134 27032 27322 -3671 -21526 -34700 -50525 -56537 -43979 -33998 -67312
11225f7312k3787J3741L2837J1992J85J5464J9791o636l0632K0865J680j0083
$$ -67312 -91099 -77358 -44521 -32529 -32344 -16880 2911 -3725 -34357 -13492 -11812 -21895
11213b1895K2818L991j370j2083J7912J2107L45K4055M338k0234l5949k0472l310
$$ -21895 923 4914 3544 -8539 9373 21480 21825 45880 50218 29984 -5965 -26437 -29747
11200b9747l627j4320J805r368p406L0990P150j534k8919j2325K3398L3609k888
$$ -29747 -33374 -47694 -45889 -55257 -62663 -31673 -24523 -26057 -54976 -67301 -43903 -10294 -13182
11187a3182j9046o254j3201K2072L8732J829J16J3677j1347k8662j7183J431k468
$$ -13182 -32228 -38482 -51683 -29611 9121 10950 11066 24743 13396 -15266 -32449 -31018 -33486
11174c3486R175J2322K694J0324n71m005j463k861J2214R065M5385j4099q069
$$ -33486 -24311 -11989 -9295 1029 458 -3547 -5010 -7871 4343 13408 58793 44694 36625
11161C6625j572K5438N634Q835j8958m0890k4096Q337J8461j9392p435N687K7152
$$ 36625 35053 60491 66125 74960 56002 15112 -8984 -647 17814 -1578 -9013 -3326 23826
11148B3826r184m0030J2663l832q171m325j624o780K0511M457k8202k0255k2748
$$ 23826 14642 -25388 -12725 -16557 -24728 -29053 -30677 -37457 -16946 -12489 -40691 -60946 -83694
11135h3694q145L8223K2267R974k1191J8602L2102J141l2144m937J3674K248m5558
$$ -83694 -91839 -53616 -31349 -21375 -42566 -23964 8138 9279 -22865 -27802 -14128 -11880 -57438
11122e7438j7720M9458L4323j986k7365l5172K795M53J9028M2299q308k1477p653
$$ -57438 -75158 -25700 8623 6637 -20728 -55900 -53105 -52652 -33624 8675 367 -21110 -28763
11109b8763J4240p689m251J3783J7918K4995R992l207j3117M408p694j7976j0324
$$ -28763 -14523 -22212 -26463 -12680 5238 30233 40225 37018 23901 28309 20615 2639 -7685
11096g685o634J5833J7835k0514n225r85K519j5592j0309p512P162k7054J1272
$$ -7685 -14319 1514 19349 -1165 -6390 -7375 -4856 -20448 -30757 -38269 -31107 -58161 -46889
11083d6889L4348P913L881k3272r644k0291r761n445K5582J6733K8942k1050j2746
$$ -46889 -12541 -4628 -747 -24019 -33663 -53954 -63715 -69160 -43578 -26845 2097 -18953 -31699
11070c1699k1780j5666l646j2516Q024K460K1839J500q634J8259j1508k57j2602
$$ -31699 -53479 -69145 -72791 -85307 -77283 -74823 -52984 -51484 -60118 -41859 -53367 -53624 -66226
11057f6226L508L0778N958K7138J7809q817J9709K0526M889m0016p15k4274j7500
$$ -66226 -62718 -31940 -25982 1156 18965 10148 29857 50383 55272 15256 14541 -9733 -27233
11044b7233J0160o85O088r014j883j6288k5518J3792K0827J3029L0719J3649j0604
$$ -27233 -17073 -17758 -11670 -20684 -22567 -38855 -64373 -50581 -29754 -16725 13994 27643 17039
11031A7039m1863j3183J9057K9080J0096k6734n528L548O911P240j7708K722K1018
$$ 17039 -24824 -38007 -18950 10130 20226 -6508 -12036 -8488 -1577 5663 -12045 -9323 11695
11018A1695J3340J0070j5073l7723l4037J3426j6845J4267K9611m264R585j1539
$$ 11695 25035 35105 20032 -17691 -51728 -38302 -55147 -40880 -11269 -15533 -5948 -17487
11006a7487M241K844J0025o740k2671j3028r840L2661K0073J265p446M444j1904
$$ -17487 -13246 -10402 -377 -7117 -29788 -42816 -52656 -19995 78 1343 -6103 -1659 -13563
10993a3563J7353m662j323J332N947J6038j789j6981j047k0136k133R248O101
$$ -13563 3790 -872 -2195 -863 5084 21122 19333 2352 1305 -18831 -20964 -11716 -5615
10980e615l410K9639J0630r675K1489k432m9059j0240j594J6579o687J968K0260
$$ -5615 -9025 20614 31244 21569 43058 40626 -8433 -18673 -20267 -3688 -10375 -8407 11853
10967A1853j0383l8838l600p48j7637J7977M7865J4353M035o008J9953j5863J6150
$$ 11853 1470 -37368 -40968 -41716 -59353 -41376 6489 20842 24877 18869 38822 22959 39109
10954C9109l5608l7833j8697J6132M1167J4145O75N922O138J721k2405J8551L5307
$$ 39109 3501 -34332 -53029 -36897 4270 18415 19090 25012 31150 32871 10466 29017 64324
10941F4324k2014Q555J75K9491m943k2287k0014o243J0346J2730K3637n174q578
$$ 64324 42310 50865 51040 80531 75588 53301 33287 27044 37390 50120 73757 68583 60005
10928F0005j5292j3532J5597r296j9865J9256L3891O707j6369M0284K7195K6485
$$ 60005 44713 31181 46778 37482 17617 36873 70764 77471 61102 101386 128581 155066
10916A55066K9259J4872K1687K6019N2230Q6372J06885J03200J55235K19199L33888
$$ 155066 184325 199197 220884 246903 299133 385505 492390 595590 750825 970024 1303912
10905A303912M39361M90094L44660J41476j09095l68422m60298l76269k91082
$$ 1303912 1743273 2233367 2578027 2719503 2610408 2241986 1781688 1405419 1114337
10896A114337j88090j15938o4070n7402q0665r1071m5567n8349k9911m2455k9470
$$ 1114337 926247 810309 746239 688837 608172 517101 471534 413185 383274 340819 311349
10885C11349j3441l5641m760P653j9559k3616L702K914R575K9259K8323k3551
$$ 311349 297908 262267 257507 265160 245601 221985 225687 228601 238176 267435 295758 272207
10873B72207m6185k1792R507k6433j3372J0079J8985n383k2121r905n792j6617
$$ 272207 226022 204230 213737 187304 173932 184011 202996 197613 175492 165587 159795 143178
10861A43178r806K518K4845J2778k759j5975j6109m513K0343j544k6398O136k372
$$ 143178 133372 135890 160735 173513 170754 154779 138670 134157 154500 152956 126558 132694 130322
10848A30322q673K3794J7461j2036j8756k0213J3073j0534J969L903r564j3023
$$ 130322 121649 145443 162904 150868 132112 111899 124972 114438 116407 120310 110746 97723
10836I7723j3309j2293J8309j1668j358j2266J773J708K0285k2811m9680N380
$$ 97723 84414 72121 90430 78762 77404 65138 66911 68619 88904 66093 16413 21793
10824B1793L4363L5487k584l566j2452k9248K2558K8936L970q613j0366j4308
$$ 21793 56156 91643 89059 85493 73041 43793 66351 95287 99257 90644 80278 65970
10812F5970j2600O733Q2l3092l8318o919R650J8773M212P55l398J1105K966J322
$$ 65970 53370 60103 60185 27093 -11225 -18144 -8494 10279 14491 15246 11848 22953 25919 27241
10798B7241j0776P720m26K9663j4938j1459j3087J046M180K4765L816K6343O157
$$ 27241 16465 24185 23759 53422 38484 27025 13938 14984 19164 43929 47745 74088 80245
10785H0245k1636m780m328k1442L881J0120l910j1704j8610M219J0317N699O592
$$ 80245 58609 53829 49501 28059 31940 42060 38150 26446 7836 12055 22372 28071 34663
10772C4663j2918j0340k3192j2261J1105K4070l4167j1249K3526k6368j9205K5338
$$ 34663 21745 11405 -11787 -24048 -12943 11127 -23040 -34289 -10763 -37131 -56336 -30998
10760c0998m22j856M139K7050K8850M618j9851m720j1208J1356j552j4161K4565
$$ -30998 -31420 -33276 -29137 -2087 26763 31381 11530 6810 -4398 6958 5406 -8755 15810
10747A5810j4954J3192L6853k2097p395m52J1875j7375j3158J1230K1721J7904
$$ 15810 856 14048 50901 28804 21409 20957 32832 15457 2299 13529 35250 53154
10735E3154M004k7610l9618O95K3332L0044l89q20j976n020k2681k4770k1205
$$ 53154 57158 29548 -10070 -9375 13957 44001 43612 42792 40816 35796 13115 -11655 -32860
10722c2860K015J8279K5089J3045j9510j4063l6867M606K277J1755J9537J1402
$$ -32860 -30845 -12566 12523 25568 6058 -8005 -44872 -40266 -37989 -26234 -6697 4705
10710D705o037J5204j5777k8309J9470L97k099Q067J8783J4788k044j3349l863
$$ 4705 -1332 13872 -1905 -30214 -10744 -10347 -12446 -4379 14404 29192 27148 13799 9936
10697I936K84j0003j3104l2041k3401K1702N808n55Q251N6278J9469k3279m3632
$$ 9936 10220 217 -12887 -44928 -68329 -46627 -40819 -41374 -33123 23155 42624 19345 -24287
10684b4287k793k642K4197J5853P149r497O650K323r376j4798P824j964J1855
$$ -24287 -27080 -29722 -5525 10328 17477 7980 14630 16953 7577 -7221 603 -1361 10494
10671A0494Q236j7505M618j0665k1129K6263J5172j5661r830j5390K0283l179
$$ 10494 18730 1225 5843 -4822 -25951 312 15484 -177 -10007 -25397 -5114 -8293
10659h293j1764m066J0471J5636K4071Q413k0875l2149L3639L7676j4873k6334
$$ -8293 -20057 -24123 -13652 1984 26055 34468 13593 -18556 15083 52759 37886 11552
10647A1552K5684J7461j1608q040o966n281p262m772R943L400j9360k5246n014
$$ 11552 37236 54697 43089 35049 28083 22802 15540 10768 20711 24111 4751 -20495 -25509
10634b5509N591j2167J3834L0665j6048M552j4737k3392j5291J9118K3204J8581
$$ -25509 -19918 -32085 -18251 12414 -3634 918 -13819 -37211 -52502 -33384 -10180 8401
10622H401P193J917l220q470m690p60p611K3295J9350k0821j0348j4948n626o771
$$ 8401 15594 17511 14291 5821 1131 371 -7240 16055 35405 14584 4236 -10712 -16338 -23109
10608b3109k0948j121J738j4321J8417N0005O975L510K0360k3447j2671p303j890
$$ -23109 -44057 -45178 -43440 -57761 -39344 10661 17636 21146 41506 18059 5388 -1915 -3805
10595c805R005l218J5383K882j0769j0118k0723q092j858J6009J4851P469k4885
$$ -3805 5200 1982 17365 20247 9478 -640 -21363 -29455 -31313 -15304 -453 7016 -17869
10582a7869O68K7186K2339q799j6886N735n068k3438R815L6380p347l6457l363
$$ -17869 -17201 9985 32324 23525 6639 12374 7306 -16132 -6317 30063 22716 -13741 -17104
10569a7104j492n00l26O240m18M190J6192k6146O531M8226K8961o810k3805j0425
$$ -17104 -18596 -19096 -19422 -13182 -13600 -9410 6782 -19364 -12833 35393 64354 57544 33739 23314
10555B3314n454m991j4216l4103K2580Q184R883j0332K0628L608l5583K1446q828
$$ 23314 17860 12869 -1347 -35450 -12870 -4686 5197 -5135 15493 19101 -16482 4964 -3864
10542c864j3950J6432J8598o131J1163j6584n845Q632M529N287k4594j4151j3594
$$ -3864 -17814 -1382 17216 11085 22248 5664 -181 8451 12980 18267 -6327 -20478 -34072
10529c4072j6806K4086R13j2897J8813j6246K745n56K2513L362k631L865r230
$$ -34072 -50878 -26792 -25879 -38776 -19963 -36209 -33464 -34020 -11507 -8145 -10776 -6911 -16141
10516a6141k266J0160L3869P742r076k1925j6857Q182j850K7079m729k9151l245
$$ -16141 -18407 -8247 25622 33364 24288 2363 -14494 -6312 -8162 18917 14188 -14963 -18208
10503a8208o161R700k5992J735J0561L218P732L1623M501j5362j8979k4880J7950
$$ -18208 -24369 -14669 -40661 -38926 -28365 -25147 -17415 14208 18709 3347 -15632 -40512 -22562
10490b2562J6270j0477R524L6282k5138l9117o16K5232l458q661R069K1059J5067
$$ -22562 -6292 -16769 -7245 29037 3899 -35218 -35834 -10602 -14060 -22721 -13652 7407 22474
10477B2474M309j036k3301k210K1230P737R118k4903j6858o078j1895J2175L3078
$$ 22474 26783 25747 2446 236 21466 29203 38321 13418 -3440 -9518 -21413 -9238 23840
10464B3840R511k2433k1727J4437k795j1091J4574M489j3796k442K4458k1386
$$ 23840 33351 10918 -10809 3628 833 -10258 4316 8805 -4991 -7433 17025 -4361
10452d361R374J2184k687m450j6528P745R170j7162j1031O172J9114J8080o828
$$ -4361 5013 17197 14510 10060 -6468 1277 10447 -6715 -17746 -11574 7540 25620 18792
10439A8792j3016j488j3936j7372J2683j0975j3125P234J5697K8540K257k2476
$$ 18792 5776 4288 -9648 -27020 -14337 -25312 -38437 -31203 -15506 13034 15291 -7185
10427g185n725q040J6099K5206K4445k4224k4625l341J4543N780J026J4949r806
$$ -7185 -12910 -20950 -4851 20355 44800 20576 -4049 -7390 7153 12933 13959 28908 19102
10414A9102k3229m080L073j959J7155o047K3136j0304j2897l622R635J7554M194
$$ 19102 -4127 -8207 -5134 -7093 10062 4015 27151 16847 3950 328 9963 27517 31711
10401C1711n851j6440P985k76K8455j5329l4584k2230j5763L9931K618m916J4843
$$ 31711 25860 9420 17405 17129 45584 30255 -4329 -26559 -42322 -2391 227 -4689 10154
10388A0154l796j4471p448K418m001K8753N59o540J251j3762n770K3223J5849
$$ 10154 6358 -8113 -15561 -13143 -17144 11609 12168 5628 6879 -6883 -12653 10570 26419
10375B6419j6227j2539R173R098l4622L20K7311k9815k3850J0779L636q966J3136
$$ 26419 10192 -2347 6826 15924 -18698 -18378 8933 -20882 -44732 -33953 -30317 -39283 -26147
10362b6147L244J9146J1680j1598L349k3778l5760M859K8230J4263L4394M897
$$ -26147 -22903 -3757 7923 -3675 -326 -24104 -59864 -55005 -26775 -12512 21882 26779
10350B6779M31p326o782j5271R836j3986K1407r522j5945J0296j7523J764n255
$$ 26779 27210 19884 13102 -2169 7667 -6319 15088 5566 -10379 -83 -17606 -15842 -21097
10337b1097k93N276K5733J0293J5224M163J2238j4762l5962j4194K3249J0372
$$ -21097 -21390 -16114 9619 19912 35136 39299 51537 36775 813 -13381 9868 20240
10325B0240J3072K3204k1634r976m5157k5102J6882m075J0106r242K896K5092
$$ 20240 33312 56516 34882 24906 -20251 -45353 -28471 -32546 -22440 -31682 -28786 -3694
10313c694k9162q830M5087O7658J8641P770l3428j2047j3843j7653j5520O462
$$ -3694 -32856 -41686 3401 71059 89700 97470 64042 51995 38152 20499 4979 11441
10301A1441J3724R968M795j0575j0328o576K8417J7978j891n427j0692p083P482
$$ 11441 25165 35133 39928 29353 19025 12449 40866 58844 56953 51526 40834 33751 41233
10288D1233Q17k3149j9669m6343J1033K9489K3624L717l3832N996n324j4723p179
$$ 41233 42050 18901 -768 -47111 -36078 -6589 17035 20752 -13080 -7084 -12408 -27131 -34310
10275c4310j258J7668n22J4454j9017j1776p456j1302P814K9310M6789m945p487
$$ -34310 -35568 -17900 -18422 -3968 -22985 -34761 -42217 -53519 -45705 -16395 30394 25449 17962
10262A7962N969k9574m1817k0675K8126J4638J5550K1015N2J1943J645k2040P552
$$ 17962 23931 -5643 -47460 -68135 -40009 -25371 -9821 11194 11246 23189 24834 2794 10346
10249A0346J8096O458N988L5675L5405J4519K7635K5005J1138M378Q466J0947
$$ 10346 28442 34900 40888 76563 111968 126487 154122 179127 190265 194643 203109 214056
10237B14056J2265j7752k6800k4915k8670j5740j3955o85k4068P262K1360j4214
$$ 214056 226321 208569 181769 156854 128184 112444 98489 97804 73736 80998 102358 88144
10225H8144k3288K1044Q888k2389o2534J2571r05n054J2123J0275j2257P920k7058
$$ 88144 64856 85900 94788 72399 9865 22436 21531 16477 28600 38875 26618 34538 7480
10212G480n418j0557J086J6644Q92l667K2187P099r616M663J3329q145J0713O988
$$ 7480 2062 -8495 -7409 9235 10127 6460 28647 35746 26130 30793 44122 35977 46690 53678
10198E3678k6079K260P282o076o227K4204J0628J969K71J875k4940l5987J1537
$$ 53678 27599 29859 37141 31065 24838 49042 59670 61639 61910 63785 38845 2858 14395
10185A4395m00L934O784n563R30K9582p913k4568q14j3415L3529j3352r472q710
$$ 14395 13995 17929 24713 19150 20080 49662 41749 17181 16367 2952 36481 23129 13657 4947
10171D947J2569m659l887L1035J668j1628n391K1257k4198o980J272L0604J2712
$$ 4947 17516 12857 8970 40005 41673 30045 24654 45911 21713 14733 16005 46609 59321
10158E9321m096M986J5195j1884k2392j8835j7179J3024Q809N428k5450R813J2549
$$ 59321 55225 60211 75406 63522 41130 22295 5116 18140 26949 32377 6927 16740 29289
10145B9289N642j2007j6187J213J2361N893K674K14j5625K4963K2662k1100j6276
$$ 29289 34931 22924 6737 7950 20311 26204 28878 29092 13467 38430 61092 39992 23716
10132B3716j1892k604j8390J1167J6905J3857M364n904K09j6252r107j7832m05
$$ 23716 11824 9220 -9170 1997 18902 32759 37123 31219 31428 15176 6069 -11763 -12168
10119a2168k798j4380K633j671r98J91K2903L0652J3286M031j0966k0425J8556
$$ -12168 -14966 -29346 -26713 -28384 -29382 -29191 -6288 24364 37650 41681 30715 10290 28846
10106B8846J1798L2662O211j1400k6161l7119Q873m880J4672K4051k725k140J9055
$$ 28846 40644 73306 79517 68117 41956 4837 13710 8830 23502 47553 44828 42688 61743
10093F1743j4640J926j6922q252J8993N492r436k1070K254m76j9027m3K6708K6955
$$ 61743 47103 49029 32107 23855 42848 48340 38904 17834 20088 19612 585 542 27250 54205
10079E4205J559l1402j2507j3555n78Q355l810r110J1574L6R142q945K0994K7876
$$ 54205 55764 24362 11855 -1700 -2278 6077 2267 -6843 4731 4767 13909 4964 25958 53834
10065E3834j8011l7197J460J8795J2939m021m657J7147o740l4172K1671L8538
$$ 53834 35823 -1374 86 18881 31820 27799 23142 40289 33549 -623 21048 59586
10053E9586J9561o67k6321k6420k8216o41r025K0446J5791J0203l3269k3952K7644
$$ 59586 79147 78480 52159 25739 -2477 -3118 -12143 8303 24094 34297 1028 -22924 4720
10040D720J1790r332J181J0642Q531K468J357j0084o85J9139p653k2344K599L0367
$$ 4720 16510 7178 8359 19001 27532 30000 31357 21273 20588 39727 32074 9730 12329 42696
10026D2696o893k1620J9457L3107n703j4585j2404j7929L266O816j3828j7406
$$ 42696 35803 14183 33640 66747 61044 46459 34055 16126 19392 26208 12380 -5026
10014e026j139J0087L2226K7483q567j7538L8798J873p917l5113J011O672l0434
$$ -5026 -6165 3922 36148 63631 55064 37526 76324 78197 70280 35167 36178 42850 12416
10001A2416K2896M713J0047L8840j0195k7688n912l521j3805J6745K411p11j7651
$$ 12416 35312 40025 50072 88912 78717 51029 45117 41596 27791 44536 46947 46236 28585
9988B8585l9586k0092n290Q608M8789L8479K4203k1575m0647o284K709J2932j8307
$$ 28585 -11001 -31093 -36383 -27775 21014 59493 83696 62121 21474 15190 17899 30831 12524
9975A2524j3067R532p557K6444r930j8101M443K472q591L1884L8542n92k9592
$$ 12524 -543 8989 1432 27876 17946 -155 4288 6760 -1831 30053 68595 68003 38411
9962C8411J883j7816j2137O59O375J4098N160L822p338j6028P123J790r502j624
$$ 38411 40294 22478 10341 11000 17375 31473 36633 40455 33117 17089 24212 26002 16500 14876
9948A4876K4232O692m3250R172L8389L4409l5316l854J8090R223K3197M909m0964
$$ 14876 39108 45800 2550 11722 50111 84520 49204 45350 63440 72663 95860 100769 59805
9935E9805j8397P123j0376J1815k452R217N592l9181j3979L1197J5062j0104n62
$$ 59805 41408 48531 38155 49970 47518 56735 62327 23146 9167 40364 55426 45322 44760
9922D4760K721J9330N322j7648N792k528L640P721J4646p135j4566j0013L690
$$ 44760 47481 66811 72133 54485 60277 57749 61389 69110 83756 76621 62055 52042 55732
9909E5732k8014q231j5087l330Q323k664M9909L2115r756j5070M63o859m045n152
$$ 55732 27718 19487 4400 1070 9393 6729 56638 88753 78997 63927 64390 57531 53486 48334
9895D8334k6962o186J2089L1826Q105j7868R017q320k21L3090J9933Q729l751
$$ 48334 21372 15186 27275 59101 67206 49338 58355 50035 49814 82904 102837 111566 107815
9882A07815j7485L421J5542K2965J7052Q574k7852r089m662L844L586j5253k2103
$$ 107815 90330 93751 109293 132258 149310 157884 130032 120943 116281 120125 123711 108458 86355
9869H6355N467n492k294j0612n556q145k3185j1950L1379M9945n58j2095j0803
$$ 86355 91822 86330 84036 73424 67868 59723 36538 24588 55967 105912 105354 93259 82456
9856H2456q862L3823P198k1524m2340J4921q520r520M517N758l1697p854K0040
$$ 82456 73594 107417 114615 93091 50751 65672 57152 47632 52149 57907 26210 18356 38396
9843C8396J071K297L2221J8178l2075l3211o832o748m792R307K2045M101K4654
$$ 38396 39467 41764 73985 92163 60088 26877 20045 13297 8505 17812 39857 43958 68612
9830F8612l412L622j8806J0647J151j6702J8403L5214o582N274j5182k0955p46
$$ 68612 65200 68822 50016 60663 61814 45112 63515 98729 92147 97421 82239 61284 60538
9817F0538j2233M0336L0875l0644l3534O100L8243J1653l7110j8807m06j2127
$$ 60538 48305 88641 119516 88872 55338 61438 99681 111334 74224 55417 55011 42884
9805D2884k454k3310j0098L3986K881r59J1780K1112J1465n2694j5510K9881R595
$$ 42884 40430 17120 7022 41008 43889 42930 54710 75822 87287 34593 19083 48964 58559
9792E8559k0503J9561n88n747j0829K2350K1048K2755L801l014p017k1233L3078
$$ 58559 38056 57617 57029 51282 40453 62803 83851 106606 110407 107393 100376 79143 112221
9779A12221Q99k6337n6333m1641J2677N1916q819J9119K2899K118n85j0655J6709
$$ 112221 113120 86783 30450 -11191 1486 53402 44583 63702 86601 88719 88134 77479 94188
9766I4188J7255j2332O338J1747k0693k9823k7385p890j101J0676K5973O297N829
$$ 94188 111443 99111 105449 117196 96503 66680 39295 31405 30304 40980 66953 73250 79079
9753G9079J1942N873K67j0799O496j066k0743j4468j9564K1322K3111J1357J5963
$$ 79079 91021 96894 97161 86362 92858 91792 71049 56581 37017 58339 81450 92807 108770
9740A08770j5160k2662M734R672l8329j0466J3828J8234k9953K718J5839k428
$$ 108770 93610 70948 75682 85354 47025 36559 50387 68621 38668 41386 57225 54797
9728E4797j325K1292j7674q77P402m852j4786k1826N405M828J1629K3016m207
$$ 54797 53472 74764 57090 56213 63615 58763 43977 22151 27556 32384 44013 67029 62822
9715F2822l641K0939K432k0805p066L136J6032K1692n029M638l4797j7549K60
$$ 62822 59181 80120 82552 61747 54681 57817 73849 95541 90512 95150 60353 42804 43064
9702D3064m258L5360L1464L1863p21j0444p273k8573j3949J9444l5800j0767R708
$$ 43064 38806 74166 105630 137493 136772 126328 119055 90482 76533 95977 60177 49410 59118
9689E9118K700K256n207k0638J3649p997o847K5370J2370N78r365K405K0752K6701
$$ 59118 61818 64074 58867 38229 51878 43881 37034 62404 74774 75352 65987 68392 89144 115845
9675A15845k6835j0616j4632J05L3892J1898k3041l1492o703j2894j4119J0004
$$ 115845 89010 78394 63762 63867 97759 109657 86616 55124 48421 35527 21408 31412
9663C1412J9548M3085k6238l0733R982l4648L908O543k3557L4940L7551j2792
$$ 31412 50960 94045 67807 37074 47056 12408 16316 22859 -698 34242 71793 59001
9651E9001L8586L5088j7178k5046J2340O139r209K3710R00k6740j9771O114L320
$$ 59001 97587 132675 115497 90451 102791 108930 99721 123431 124331 97591 77820 83934 87254
9638H7254Q659J562j4446L19j0319l716j242N263M492N006q312n698J763J9732
$$ 87254 95913 97475 83029 83348 73029 69313 68071 73334 77826 82832 74520 68822 70585 90317
9624I0317q6J0423j4112m758j575L7354P950p033J9774o658j9537j0234j782p831
$$ 90317 90231 100654 86542 81784 80209 117563 125513 118480 138254 131596 112059 101825 100043 92212
9610I2212N033j1310j3696l1545l0971J4057M7236M9775j6712q49r03k0030O991
$$ 92212 97245 85935 72239 40694 9723 23780 71016 120791 104079 103230 102327 82297 89288
9597H9288J442j471K023L465j5763M443J1447j0860k414j6213j3100l945J1323
$$ 89288 90730 89259 91282 94747 78984 83427 94874 84014 81600 65387 52287 48342 59665
9584E9665L0321j5196M66P224J3381j100K238k199j4053R790K3803J1350j8070
$$ 59665 89986 74790 75256 82480 95861 94761 96999 94800 80747 90537 114340 125690 107620
9571A07620j6953n640j9995j2228K2968q823J2814P239K4883r847j5434j6159
$$ 107620 90667 85027 65032 52804 75772 66949 79763 87002 111885 102038 86604 70445
9559G0445j0099J4491K1335l151j424j0650l0151J0541M254k750L4064K1567j9393
$$ 70445 60346 74837 96172 93021 91597 80947 50796 61337 65591 62841 96905 118472 99079
9546I9079l647j6508j1107j8683l0280j0545J7608n13K3696K2697J5926J0260
$$ 99079 95432 78924 67817 49134 18854 8309 25917 25404 49100 71797 87723 97983
9534I7983l373j2917j9797j1894K1742J5513j1708j802J6664q476K1283L123L827
$$ 97983 94610 81693 61896 50002 71744 87257 75549 73747 90411 81935 103218 106341 110168
9521A10168l128j1467l182j3881O76k0137r967K9596K070l2015K3782M1037K66
$$ 110168 107040 95573 92391 78510 79186 59049 49082 78678 80748 48733 72515 113552 113818
9508A13818L83k1308m0148K42k345J602Q329J4347j6513j4757j1107L060r953
$$ 113818 114201 92893 52745 52987 50642 52244 60573 74920 58407 43650 32543 35603 25650
9495B5650J2483L3050j48k0023P886M592l096n34p642m235R354N114J0190J9936
$$ 25650 38133 71183 71035 51012 58898 63490 60394 59860 52218 47983 57337 62451 72641 92577
9481I2577J0605j7423j460K8395r659n2687j5953R783L5714K7377Q797r224k9594
$$ 92577 103182 85759 84299 112694 103035 50348 34395 44178 79892 107269 116066 106842 77248
9468G7248L659j9900k5762R143K4140N750j09j6109R228J7741j6610j912L167
$$ 77248 80907 61007 35245 44388 68528 74278 74169 58060 67288 85029 68419 66507 69674
9455F9674o927N969k780J3865m00j351J5960L4667O783l4695l4610k1411j0298
$$ 69674 62747 68716 65936 79801 79401 78050 94010 128677 135460 100765 66155 44744 34446
9442C4446J9501K9514J5151n547k5971R778Q741L451K9722L569k4642l2057o032
$$ 34446 53947 83461 98612 93065 67094 76872 85613 89064 118786 122355 97713 65656 59624
9429E9624J18j8328k1842J5697K803J0775J0695K4936p866L385l28l2808n483
$$ 59624 59742 41414 19572 35269 38072 48847 59542 84478 76612 79997 79669 46861 41378
9416D1378K3572J5071p14J9953j0893o651j310J1356K122J1627K0587M281k4167
$$ 41378 64950 80021 79307 99260 88367 81716 80406 91762 93884 105511 126098 130379 106212
9403A06212j6249j1619j229k5661l7834n23L1817K5857n99j1233o789J0514K0201
$$ 106212 89963 78344 77115 51454 13620 13097 44914 70771 70172 58939 52150 62664 82865
9390H2865J1371k4406r786j2186o8L2284K1890o45j3929j2896j9382k4680J1072
$$ 82865 94236 69830 60044 47858 47790 80074 101964 101319 87390 74494 55112 30432 41504
9377D1504K5584J2915j0341j1346M0994n011k4912J9275r646r048o224K1749r673
$$ 41504 67088 80003 69662 58316 99310 94299 69387 88662 79016 69968 63744 85493 75820
9364G5820j5046P079p7r997j7867j8239M335K3462K5114l971J4818L041j4062
$$ 75820 60774 67853 67776 57779 39912 21673 26008 49470 74584 70613 85431 88472 74410
9351G4410j9598N089P629p763l142j0692k2781j0168O136P612l2979j9089L2628
$$ 74410 54812 59901 67530 59767 56625 45933 23152 12984 19120 26732 -6247 -25336 7292
9338G292L0441J6502J6087K629J4459L484j4004P314q994k304l6345J492K1856
$$ 7292 37733 54235 70322 72951 87410 90894 76890 84204 75210 72906 36561 38053 59909
9325E9909l039j3758k0155j2584K7790L1874j2032n343J8886L291n1723j9443
$$ 59909 56870 43112 22957 10373 38163 70037 58005 52662 71548 74839 23116 3673
9313C673L2799J6017o97P90k1322N590J5825j684O716J53j5599o961m774j0418
$$ 3673 36472 52489 51792 52582 31260 36850 52675 50991 57707 57860 42261 35300 30526 20108
9299B0108k1585j4934K4291K8584k563q361j7505N298j9481J6392J4923M562p581
$$ 20108 -1477 -16411 7880 36464 33901 25540 8035 13333 -6148 10244 25167 29729 22148
9286B2148J4943J2784j5463k1456j3099M315J7554L2797k2175j0061K0115m494
$$ 22148 37091 49875 34412 12956 -143 4172 21726 54523 32348 22287 42402 37908
9274C7908n693J1928j5290j974O1n583l8021J1760L7089N659J1006j5907J6370
$$ 37908 32215 44143 28853 26879 26940 21357 -16664 -4904 32185 37844 48850 32943 49313
9261D9313R564K5805j2126k1513L040r089P291n208j6566o86k860L6J083K588
$$ 49313 58877 84682 72556 51043 54083 44994 52285 47077 30511 29825 26965 27001 28084 30672
9247C0672R209L0885K327j9587J2324k4227j4968r604K1744K3734J3976k677j9409
$$ 30672 39881 70766 73093 53506 65830 41603 26635 17031 38775 62509 76485 73808 54399
9234E4399j2913j8520r938L264O045j5195q441K4106K4889J5718L31l474J3698
$$ 54399 41486 22966 13028 16292 22337 7142 -1299 22807 47696 63414 63745 60271 73969
9221G3969M684j4326m8635J5103j4818k2355J7299k537k865n944J2202J9917K4970
$$ 73969 78653 64327 15692 30795 15977 -6378 10921 8384 5519 -425 11777 31694 56664
9208E6664J991J429k6646j3440J2081j369j1839j2672j6986k0168K0567K4837
$$ 56664 58655 60084 33438 19998 32079 30710 18871 6199 -10787 -30955 -10388 14449
9196A4449j3654q141Q855K7515q196n389K3156j237M304J3637J1006o082R694
$$ 14449 795 -7346 1509 29024 20828 15439 38595 37358 41662 55299 66305 60223 69917
9183F9917R02m6821P144J3527K1153l4242k1341J6874L2877l184j6230R304j127
$$ 69917 70819 23998 31142 44669 65822 31580 10239 27113 59990 56806 40576 49880 48753
9170D8753K3547j6121j2061q436j0849L1332K0976n931j1930K5569J3244l8065
$$ 48753 72300 56179 44118 35682 24833 56165 77141 71210 59280 84849 98093 60028
9158F0028j3274j3413k4766P473M350j2650L615L0983J2536J6500J3537k4660
$$ 60028 46754 33341 8575 16048 20398 7748 11363 42346 54882 71382 84919 60259
9146F0259l1076R058R133r13j0989N506R267j8232r104J8544J1750l845j4300
$$ 60259 29183 38241 47374 46461 35472 40978 50245 32013 22909 41453 53203 49358 35058
9133C5058M578K458j9036J7973M9475J6354j1135r011O716j5572k2493j3654j8628
$$ 35058 39636 42094 23058 41031 90506 106860 95725 86714 93430 77858 55365 41711 23083
9120B3083J6767K3247J0772L367k0151j5499K900R522J6046J6694J5879r731M50
$$ 23083 39850 63097 73869 77236 57085 41586 44486 54008 70054 86748 102627 92896 93346
9107I3346j3511k8844P798K0628k4510l0413L040j2247J2466K3456K33k1118j9491
$$ 93346 79835 50991 58789 79417 54907 24494 27534 15287 27753 51209 51442 30324 10833
9094A0833L866j5221p341R016o683p910K1948J7587k5530M632L1965K3969o366
$$ 10833 14699 -522 -7863 1153 -5530 -13440 8508 26095 565 5197 37162 61131 54765
9081E4765j0378j4339m3228m636P502K2380J9492K902j5104Q790J9563J2913K1535
$$ 54765 44387 30048 -13180 -17816 -10314 12066 31558 34460 19356 28146 47709 60622 82157
9068H2157k159j2980j466j6916O306p610K2621j527j2893k7581n7334j5227M2033
$$ 82157 79998 67018 65552 48636 54942 47332 69953 68426 55533 27952 -29382 -44609 -2576
9055b576J0885O813L741J790j1369k8303p53L8419K1000R116n614p394R094n571
$$ -2576 8309 15122 18863 20653 9284 -19019 -19772 18647 39647 48763 43149 35755 44849 39278
9041C9278k0225j5901p78J7650J4355J857j7490Q845K1849L2602k1194k0119k439
$$ 39278 19053 3152 2374 20024 34379 36236 18746 27591 49440 82042 60848 40729 38290
9028C8290J9205N273l7397m6093R637K4093K3211J2691j3625J6L939r983j4917
$$ 38290 57495 62768 25371 -20722 -11085 13008 36219 48910 35285 35301 39240 29257 14340
9015A4340J3600p979J7187j8656k9232k0246R522L2468j022j4267r51K811R756
$$ 14340 27940 19961 37148 18492 -10740 -30986 -21464 11004 9982 -4285 -5236 -2425 7331
9002G331k801k1344j1265o165P437K735J8726j0410O40P856K8759k4534l079K7874
$$ 7331 4530 -16814 -28079 -34244 -26807 -24072 -5346 -15756 -15116 -7260 21499 -3035 -6114 21760
8988B1760J2931J2209J0051j2003k8399O109J3943k7161j6345L9691K4241q104
$$ 21760 34691 46900 56951 44948 16549 22658 36601 9440 -6905 32786 57027 48923
8976D8923m622O835J576j1612p624n584k2513j1042J2676j2411o748Q865O038
$$ 48923 44301 51136 52712 41100 33476 27892 5379 -5663 7013 -5398 -12146 -3281 2757
$$ [...]
##END NTUPLES=NMR SPECTRUM
##END=
