##TITLE=Analysis number 319788
Compound Code cc 56122
Book Reference 458/132
Project Code adrs
Chemist Name stevem
##JCAMPDX= 6.0         $$ Bruker NMR JCAMP-DX V2.0
##DATA TYPE= NMR SPECTRUM
##DATA CLASS= NTUPLES
##ORIGIN= Bruker BioSpin GmbH
##OWNER= nmr
$$ XWIN-NMR		Version 3.5
$$ Tue May 30 10:40:21 2006 GMT Daylight Time (UT+1h)  MAYBRIDGE\nmr@NMR_250MHZ
##.OBSERVE FREQUENCY= 250.131544655141
##.OBSERVE NUCLEUS= ^1H
##.ACQUISITION MODE= SIMULTANEOUS (DQD)
##.ACQUISITION SCHEME= undefined
##.AVERAGES= 16
##.DIGITISER RES= 18
##SPECTROMETER/DATA SYSTEM= dpx250
##.PULSE SEQUENCE= zg30
##.SOLVENT NAME= CDCl3
##.SHIFT REFERENCE= (INTERNAL, CDCl3, 0, 16.522)
##AUDIT TRAIL= $$ (NUMBER, WHEN, WHO, WHERE, WHAT)
$$ ##TITLE= Audit trail, XWIN-NMR		Version 3.5
$$ ##JCAMPDX= 5.01
$$ ##ORIGIN= Bruker BioSpin GmbH
$$ ##OWNER= nmr
$$ C:\u/data/dgb/nmr/ADRS/5380/pdata/1/auditp.txt
$$ ##AUDIT TRAIL=  $$ (NUMBER, WHEN, WHO, WHERE, WHAT)
(   1,<2006-05-30 10:39:51.09 +100>,<MAYBRIDGE\nmr>,<NMR_250MHZ>,
      <created by zg, POWCHK disabled, PULCHK disabled
       configuration hash MD5:
       B5 A6 C7 38 BA 16 E7 09 FD 8C 39 C2 85 6D FD 14
       data hash MD5: 64K
       5A 9F F2 6C 48 2A C7 9F C8 F5 14 3B 3A 86 F7 C2>)
(   2,<2006-05-30 10:40:05.25 +100>,<MAYBRIDGE\nmr>,<NMR_250MHZ>,
      <Start of raw data processing
       ef LB = 0.3 FT_mod = 6 PKNL = 1 SI = 32K 
       data hash MD5: 32K
       6E C0 32 3C 51 DA E9 6E 95 CD 8A 30 EC 7E 39 C8>)
(   3,<2006-05-30 10:40:09.48 +100>,<MAYBRIDGE\nmr>,<NMR_250MHZ>,
      <apk 
       data hash MD5: 32K
       B8 1D 3A 40 71 E3 00 C5 4F 91 0E 5A 0D 98 67 7C>)
(   4,<2006-05-30 10:40:10.98 +100>,<MAYBRIDGE\nmr>,<NMR_250MHZ>,
      <abs ABSG = 5 
       data hash MD5: 32K
       92 10 B1 23 36 F8 5A 22 46 76 20 49 46 1F F2 28>)
$$ ##END=
$$ 
$$ hash MD5
$$ 84 0F F7 C7 EF 3D 5B EB A0 61 E5 64 FB 03 E8 EF
##$RELAX= 
##$RELAX= 
##$RELAX= 
##$RELAX= 
##$RELAX= 
##$RELAX= 
##$RELAX= 
$$ Bruker specific parameters
$$ --------------------------
##$DU= <C:\u>
##$EXPNO= 5380
##$NAME= <ADRS>
##$PROCNO= 1
##$TYPE= <nmr>
##$USER= <dgb>
##$AMP= (0..31)
100 100 100 100 100 100 100 100 100 100 100 100 100 100 100 100 100 100 
100 100 100 100 100 100 100 100 100 100 100 100 100 100 
##$AQSEQ= 0
##$AQ_mod= 3
##$AUNM= <au_zg>
##$AUTOPOS= <9 >
##$BF1= 250.13
##$BF2= 250.13
##$BF3= 250.13
##$BF4= 250.13
##$BF5= 500.13
##$BF6= 500.13
##$BF7= 500.13
##$BF8= 500.13
##$BYTORDA= 1
##$CFDGTYP= 0
##$CFRGTYP= 5
##$CHEMSTR= <none>
##$CNST= (0..31)
1 1 145 1 1 1 1 1 1 1 1 1 1 1 1 1 1 1 1 1 1 1 1 1 1 1 1 1 1 1 1 1 
##$CPDPRG= <>
##$CPDPRG1= <>
##$CPDPRG2= <>
##$CPDPRG3= <>
##$CPDPRG4= <mlev>
##$CPDPRG5= <mlev>
##$CPDPRG6= <mlev>
##$CPDPRG7= <mlev>
##$CPDPRG8= <mlev>
##$CPDPRGB= <>
##$CPDPRGT= <>
##$D= (0..31)
0 1 0 0 0 0 0 0 0 0.06 0 0 0 0 0 0 0.0002 0 0 0 0 0 0 0 0 0 0 0 0 0 0 
0 
##$DATE= 1148981989
##$DBL= (0..7)
120 120 120 120 120 120 120 120 
##$DBP= (0..7)
150 150 150 150 150 150 150 150 
##$DBP07= 0
##$DBPNAM0= <>
##$DBPNAM1= <>
$$ [...]
##$SUBNAM7= <"">
##$SUBNAM8= <"">
##$SUBNAM9= <"">
##$SW= 20.6930455092707
##$SWIBOX= (0..15)
0 0 3 0 0 0 0 0 0 0 0 0 0 0 0 0 
##$SW_h= 5175.983436853
##$TD= 65536
##$TD0= 1
##$TE= 294.16
##$TE2= 300
##$TE3= 300
##$TEG= 300
##$TL= (0..7)
0 120 120 120 120 120 120 120 
##$TP= (0..7)
150 150 150 150 150 150 150 150 
##$TP07= 0
##$TPNAME0= <>
##$TPNAME1= <>
##$TPNAME2= <>
##$TPNAME3= <>
##$TPNAME4= <>
##$TPNAME5= <>
##$TPNAME6= <>
##$TPNAME7= <>
##$TPOAL= (0..7)
0.5 0.5 0.5 0.5 0.5 0.5 0.5 0.5 
##$TPOFFS= (0..7)
0 0 0 0 0 0 0 0 
##$TUNHIN= 0
##$TUNHOUT= 0
##$TUNXOUT= 0
##$USERA1= <user>
##$USERA2= <user>
##$USERA3= <user>
##$USERA4= <user>
##$USERA5= <user>
##$V9= 5
##$VALIST= <valist>
##$VCLIST= <CCCCCCCCCCCCCCC>
##$VD= 0
##$VDLIST= <DDDDDDDDDDDDDDD>
##$VPLIST= <PPPPPPPPPPPPPPP>
##$VTLIST= <TTTTTTTTTTTTTTT>
##$WBST= 1024
##$WBSW= 4
##$XGAIN= (0..3)
0 0 0 0 
##$XL= 0
##$YL= 0
##$YMAX_a= 407569
##$YMIN_a= -522979
##$ZGOPTNS= <>
##$ZL1= 120
##$ZL2= 120
##$ZL3= 120
##$ZL4= 120
##$ABSF1= 16.522
##$ABSF2= -4.171173
##$ABSG= 5
##$ABSL= 3
##$ALPHA= 0
##$AQORDER= 0
##$ASSFAC= 0
##$ASSFACI= 0
##$ASSFACX= 0
##$ASSWID= 0
##$AUNMP= <proc_1d>
##$AZFE= 0.1
##$AZFW= 0.1
##$BCFW= 0
##$BC_mod= 0
##$BYTORDP= 0
##$COROFFS= 0
##$CY= 12.5
##$DATMOD= 1
##$DC= 0
##$DFILT= <>
##$DTYPP= 0
##$F1P= 14.0000005364418
##$F2P= -0.99999901652339
##$FCOR= 0.5
##$FTSIZE= 32768
##$FT_mod= 6
##$GAMMA= 0
##$GB= 0
##$INTBC= 1
##$INTSCL= 1
##$ISEN= 128
##$LB= 0.3
##$LEV0= 0
##$LPBIN= 0
##$MAXI= 10000
##$MC2= 0
##$MEAN= 0
##$ME_mod= 0
##$MI= 0
##$NCOEF= 0
##$NC_proc= -3
##$NLEV= 6
##$NOISF1= 0
##$NOISF2= 0
##$NSP= 0
##$NTH_PI= 0
##$NZP= 0
##$OFFSET= 16.522
##$PC= 1
##$PHC0= 171.3734
##$PHC1= 11.64666
##$PH_mod= 1
##$PKNL= yes
##$PPARMOD= 0
##$PSCAL= 4
##$PSIGN= 0
##$REVERSE= no
##$SF= 250.13
##$SI= 32768
##$SIGF1= 0
##$SIGF2= 0
##$SINO= 400
##$SIOLD= 32768
##$SREGLST= <1H.CDCl3>
##$SSB= 0
##$STSI= 32768
##$STSR= 0
##$SW_p= 5175.98343685301
##$SYMM= 0
##$S_DEV= 0
##$TDeff= 65536
##$TDoff= 0
##$TI= <Analysis number 999999
Compound Code 99
Book Reference 9
Project Code 9>
##$TILT= no
##$TM1= 0
##$TM2= 0
##$TOPLEV= 0
##$USERP1= <user>
##$USERP2= <user>
##$USERP3= <user>
##$USERP4= <user>
##$USERP5= <user>
##$WDW= 1
##$XDIM= 32768
##$YMAX_p= 342828303
##$YMIN_p= -161220
$$ End of Bruker specific parameters
$$ ---------------------------------
##NTUPLES= NMR SPECTRUM
##VAR_NAME=  FREQUENCY,     SPECTRUM/REAL,   SPECTRUM/IMAG
##SYMBOL=    X,             R,               I
##VAR_TYPE=  INDEPENDENT,   DEPENDENT,       DEPENDENT
##VAR_FORM=  AFFN,          ASDF,            ASDF
##VAR_DIM=   32768,         32768,           32768
##UNITS=     HZ,            ARBITRARY UNITS, ARBITRARY UNITS
##FACTOR=    0.157963299565203, 1,           1
##FIRST=     4132.6476996994, 0,             0
##LAST=      -1043.33573715361, 0,           0
##MIN=       -1043.33573715361, -161220,     0
##MAX=       4132.6476996994, 342828303,     0
$$ Real data points
##PAGE= N=1
##DATA TABLE= (X++(R..R)), XYDATA
$$ [...]
18598C889856L59760M21406N35563O81095Q56419J137347J500909K001756K724242
18589A4108353L566186M218624M413794M373671M299151L754551K289041M73449
18581D1496820m79415p44651j118034j483632r78832K62870J280550J910475K281901
18572D2428052K001291O78863j156538k258891k746785l533074m481236m724552
18564B6207130m101687l179157k383490j798598j383977j093623r02191p40280
18556A0624127o32710n51918m88330m53828l87851l51723l58454l36928k93573
18547F768812k47035j86153j67653j54266j49968j33508j27498j62886j66467
18538E273378j86400j69790j39715j40781j45263j48593j61227j34274j46663
$$ plain form
18598 3889856 4249616 4671022 5206585 5887680 6744099 7881446 9382355 11384111 14108353
18589 14108353 17674539 21893163 26306957 30680628 34979779 38734330 41023371 41496820
18581 41496820 41017405 40272754 39154720 37671088 36692256 36955126 38235676 40146151 42428052
18572 42428052 44429343 45108206 43951668 41692777 38945992 35412918 30931682 26207130
18564 26207130 22105443 18926286 16542796 14744198 13360221 12266598 11364407 10624127
18556 10624127 9991417 9439499 8951169 8497341 8109490 7757767 7399313 7062385 6768812
18547 6768812 6521777 6335624 6167971 6013705 5863737 5730229 5602731 5439845 5273378
18538 5273378 5086978 4917188 4777473 4636692 4491429 4342836 4181609 4047335 3900672
18529C900672j69315j69530j58913j35701j15175j12769j33022j22801p3105p7635
18519B632706r8774q5244p8826o6014q0793q3537o2896n3359m5204k8237n4526
18508A895296o6808l3462l7971m8869l5842k8273j6089l0073k6588j9269k4381
18497A527671j8983j0057J1656J6660O403k4007o205P950n243j5824k7114m803
18485A458104J180j3175M352O130l0297j2639L517o571l607l6864l1407k3966
18473A314757l6493m6356o0435n1994P223p438l8057m6459l4978k2391l5567k6118
18461I15694j6269j0697m249j7731m5803k9890k4465j8419M249L710p019j5531
18449G33580O381K3812L8058K4419M794J4206K8591L8926K5680M4504N6194O3758
$$ plain form
18529 3900672 3731357 3561827 3402914 3267213 3152038 3039269 2906247 2783446 2710341 2632706
18519 2632706 2533932 2448688 2369862 2303848 2223055 2139518 2076622 2023263 1978059 1949822 1895296
18508 1895296 1828488 1795026 1757055 1708186 1672344 1644071 1627982 1597909 1571321 1552052 1527671
18497 1527671 1508688 1498631 1510287 1526947 1533350 1509343 1503138 1511088 1505845 1490021 1462907 1458104
18485 1458104 1459284 1446109 1450461 1456591 1426294 1413655 1417172 1410601 1406994 1370130 1338723 1314757
18473 1314757 1278264 1231908 1171473 1119479 1126702 1119264 1081207 1034748 999770 977379 941812 915694
18461 915694 899425 888728 884479 866748 820945 791055 766590 748171 752420 756130 749111 733580
18449 733580 739961 763773 801831 826250 831044 845250 873841 912767 938447 982951 1039145 1102903
18437A102903P7966R0983Q4183L6615M4546M7908O0108J0885l0595n7624n6913
18426A410965l4843k2451k8877o778l0100k9275j6180r517J3050K4548J9630K8311
18414A318483L7108L3938J4762J6287L4920N2764P4633Q4949J14178J84882K37024
18403B203928L41200N26041Q02485J141501J361744J347646J339257J392146J158533
18394A1614481M86346k57378n17001o33668r57772j362503j397968j103374p10867
18385E160296m35408k66868j95873j70803j55699r2839o0920k8791j8083J2206
18375C747218O1865P6973Q2150J04126Q6523O4457J13075J29497J51076K23455
18365D840415K97439L89599M66612N92301P41684R15001J173737J547768K197571
$$ plain form
18437 1102903 1180869 1271852 1356035 1392650 1437196 1485104 1545212 1556097 1525502 1467878 1410965
18426 1410965 1376122 1353671 1324794 1318016 1287916 1258641 1242461 1232944 1245994 1270542 1290172 1318483
18414 1318483 1355591 1389529 1404291 1420578 1455498 1508262 1582895 1667844 1782022 1966904 2203928
18403 2203928 2545128 3071169 3873654 5015155 6376899 7724545 9063802 10455948 11614481
18394 11614481 12100827 11843449 11326448 10692780 9735008 8372505 6974537 5871163 5160296
18385 5160296 4724888 4458020 4262147 4091344 3935645 3842806 3781886 3753095 3735012 3747218
18375 3747218 3809083 3886056 3968206 4072332 4158855 4223312 4336387 4465884 4616960 4840415
18365 4840415 5137854 5527453 5994065 6586366 7328050 8243051 9416788 10964556 13162127
18356A3162127L160273M448545N995295P599802Q823040R724045R796183Q382715
18348G1092025N992724L173517N51386k920588n704844o903799o758432n880846
18340E2641143m233144j668219O88805K072611K973012L070802J853357p57937
18332E6640430k763411l498464m117260n190205o074098n555732m228065k809986
18324B2403209j854176j310902r26449o06938l52112j20852J82941O35999J195338
18315A9246058J625426K035899K768334L323122L026008K749632L520556M663762
18307D2958797M586008L091972K995926L989547M081843L069127J871581J854623
18299F8499424K555795K433856j14976m306593o992994o750346o116281n095143
$$ plain form
18356 13162127 16322400 20770945 26766240 34366042 43189082 52913127 62709310 71092025
18348 71092025 77084749 80258266 80809652 77889064 72184220 65280421 58521989 52641143
18340 52641143 48407999 46739780 47428585 49501196 52474208 55545010 57398367 56640430
18332 56640430 53877019 50378555 46261295 41071090 34996992 29441260 25213195 22403209
18324 22403209 20549033 19238131 18311682 17704744 17352632 17231780 17414721 18050720 19246058
18315 19246058 20871484 22907383 25675717 28998839 32024847 34774479 38295035 42958797
18307 42958797 47544805 50636777 53632703 57622250 61704093 64773220 66644801 68499424
18299 68499424 71055219 73489075 73374099 69067506 62074512 55324166 49207885 44112742
18291D4112742l781712k521246q88729K57147J26548l25906q56270j744431l036015
18282C1342128l550404l175775k920773k574031j968802j448703j088825q78742
18274A3736073p43249n96594n14444m21504l45771k35438r9459L7209J33730K70334
18264A1220887M46206M63647K32566J16671J29964p0546m54607m87959k50663
18255A1346166j40682j09242K22428N06581L84976K67827K78915J11982l67273
18246A2501678p70579p89163q10296p97491o92008m40832j84239q0517j05958
18237G830595j19690j56519l05721n07891n39093m83385m85024m31399l49345
18228D452528k59879j91884j91285j82680j48014j52138j44367j21123j11104
$$ plain form
18291 44112742 40331030 37809784 36921055 37178202 37304750 36978844 36122574 34378143 31342128
18282 31342128 27791724 24615949 21695176 19121145 17152343 15703640 14614815 13736073
18274 13736073 12992824 12396230 11881786 11460282 11114511 10879073 10779614 10816823 10950553 11220887
18264 11220887 11667093 12130740 12363306 12479977 12609941 12539395 12084788 11596829 11346166
18255 11346166 11205484 11096242 11318670 11825251 12210227 12478054 12756969 12868951 12501678
18246 12501678 11731099 10941936 10131640 9334149 8642141 8201309 8017070 7936553 7830595
18237 7830595 7710905 7554386 7248665 6740774 6201681 5718296 5233272 4801873 4452528
18228 4452528 4192649 4000765 3809480 3626800 3478786 3326648 3182281 3061158 2950054
18219B950054r9868j00319q3261r2375p2820q0577q1058p2353p7822o2210p3227
18208B054164p0470o2902l1819l7071m9601n2523n0379k7732l753l5458l8790
18197A593666l0560l7689m8857k2412k5883l4481l2817l5501m2228m6767l4790
18186A201681j8583l2612m4792n0142n8162m4527m7097k3433j6579k5289k4919
18175H15546k3349l3505j6536j6277j9594r589j2898j6633O509J953l9372j1329
18163F24926O087j5907k5814j4888L09o840j2882J659N107j1609j9713J5517J066
18150E47018n284l713J0982j1456o727N691l595k8312k5865J580J7948K461k5331
18137D75397k5910J618j0326k1110J2489K9626K1739n830n026K3465K7194K3797
$$ plain form
18219 2950054 2850186 2749867 2666606 2574231 2501411 2420834 2339776 2267423 2189601 2127391 2054164
18208 2054164 1983694 1920792 1888973 1851902 1802301 1749778 1699399 1671667 1667914 1632456 1593666
18197 1593666 1563106 1525417 1476560 1454148 1428265 1393784 1360967 1325466 1283238 1236471 1201681
18186 1201681 1183098 1150486 1105694 1055552 997390 952863 905766 882333 865754 840465 815546
18175 815546 792197 758692 742156 725879 706285 696696 683798 667165 673674 675627 636255 624926
18163 624926 631013 615106 589292 574404 574713 567873 554991 556650 561757 550148 530435 545952 547018
18150 547018 541734 538021 549003 537547 530820 536511 532916 504604 478739 480319 498267 500728 475397
18137 475397 449487 451105 440779 419669 432158 461784 483523 477693 472667 496132 523326 547123
18125E47123L586J4920M3383M9725K4991M1873P8996N9770P7554J15514J49775
18114A207210J89974K54746L64758N32518Q36155J437852K700790M129350L045123
18105A4698476J618769J836210J079795j759740n179190m111461k221387j255790
18097D705682p90571n48047l90616k82105k25759k09449j65810j33228j24277
18088A835820j02409j04546o3045o2372p1088n9467n6280m8634m7930l3054l9625
18077A147370n8154m0216l7389m0286k2459m0396k1318N936l726l5490j5922j2768
18065H25182k8299k4166L205j2769j6857k4371k3080k0073j2203j5179k6680l2159
18053E92551k0474j6131k5734l22l1661k9407j2446q183K893q370k7525k178J1689
$$ plain form
18125 547123 550709 565629 609012 658737 683728 725601 804597 864367 941921 1057435 1207210
18114 1207210 1397184 1651930 2016688 2549206 3385361 4823213 7524003 11653353 14698476
18105 14698476 16317245 18153455 19233250 17473510 12294320 8182859 5961472 4705682
18097 4705682 3915111 3367064 2976448 2694343 2468584 2259135 2093325 1960097 1835820
18088 1835820 1733411 1628865 1565820 1503448 1432360 1372893 1316613 1267979 1220049 1186995 1147370
18077 1147370 1089216 1049000 1011611 971325 948866 908470 887152 893088 889362 853872 837950 825182
18065 825182 796883 772717 775922 763153 746296 721925 698845 678772 666569 651390 624710 592551
18053 592551 572077 555946 530212 529890 498229 468822 456376 448193 451086 442716 415191 413013 424702
18040D24702j3980k687j610j3827j3677l286P692J555k412J1880l341k0565o647
18027C63797P13m889N794P872p972p321j5100j4077j1185p994Q239J2880j5076
18014C15681q342j2363J4102J6567k5366n678j252l886O272L13k0542k578P12
18001B73640L439r716L555L4002M4873J5970O384K5350K4464J4196O463k8882
17989D13738j5055p610j384L1143K5543J13R78k889k673L473j1530j2357k8969
17976C92521m0417r211k226l9067k8636P9M516j3973q150j4891k4251k9805j1242
17963A75247J3316K45j1004m505O317P081j5459K319q953j853J4796J3986k0376
17950A71157k5396j8927k4441Q640J8713K0854o403j8111j6405m33K2732Q134
$$ plain form
18040 424702 410722 408035 406425 392598 378921 375635 383327 384882 382470 394350 391009 370444 363797
18027 363797 364510 359621 365415 373287 365315 357994 342894 328817 317632 309638 317877 330757 315681
18014 315681 307339 294976 309078 325645 300279 294601 293349 289463 295735 296048 275506 272928 273640
18001 273640 277079 267363 270918 304920 349793 365763 372147 397497 421961 436157 442620 413738
17989 413738 398683 391073 389689 420832 446375 446488 447466 444577 441904 445377 433847 421490 392521
17976 392521 352104 342893 340667 301600 272964 273043 277559 263586 255436 240545 216294 186489 175247
17963 175247 188563 188808 177804 173299 179616 186697 171238 173557 164604 162751 177547 191533 171157
17950 171157 145761 126834 102393 111033 129746 150600 144197 126086 109681 109248 131980 140114
17938A40114o290j5056n500l572j746Q980l230n838k134Q782k557k4956r022M482
17924H2457p266j3801L0798k42j4766Q318K444k22j416k6415j4189n522K0158
17911F0336L794J1409j793n801n109j0749k0845K1488K9783Q176o082O897J9253
17898A10757m898l1847j113N132p488m886J0124J5100j7872J630K6405j5965k6876
17885E8203j985R610J6870m601j5270K1172M687j5044M298K3388k3233P677K2894
17872A08666J6832R307J3503O666K732J8488r133j6080j2684l5595j7636j8787
17860F6279R500J3184J018j4737o584j1453K941J0351O328J7692L329m37j2785
17847H4626j0223j2411j9803P00K0408P777k4484M253K628J59K0801j9804j217
$$ plain form
17938 140114 133824 118768 113268 109696 107950 116930 113700 107862 105728 114510 111953 86997 77975 82457
17924 82457 75191 61390 92188 91946 77180 85498 87942 87720 86304 59889 45700 40178 60336
17911 60336 64130 75539 73746 67945 62836 52087 31242 52730 82513 90689 84607 91504 110757
17898 110757 105859 74012 72899 78031 70543 65657 75781 90881 73009 74639 101044 85079 58203
17885 58203 56218 65828 82698 78097 62827 83999 88686 73642 77940 101328 78095 85772 108666
17872 108666 125498 134805 148308 154974 157706 176194 167061 150981 138297 102702 85066 66279
17860 66279 75779 88963 89981 75244 68660 57207 60148 70499 76827 94519 97848 97411 84626
17847 84626 74403 61992 42189 42889 63297 71074 46590 50843 53471 53630 74431 54627 53410
17834E3410Q849O329R908J48J4127p346J174K8763L2644K335m042M4308K9773
17821B20380K7468J5489Q201j8869j6166k4076k2295j4333k3520j5632j123p444
17809A28080N726l620m190J3908K590n065J30R673J4750m381n026j020M346o135
17795A49766j1P528M385j4501n691n875o013J3790l757q878o159k244k497q063
17781A11780j0562k0658k0629K051K4113K7761j699O299K2390J5665j4160j5990
17769A26361J3213J2182J5647k764r221L055J3319M9098L5371L5122J7822K3739
17757C32944K7615J3011P162r6J2712j3634l0830k7619j5457j063k003n018K2134
17744C19858J4157K2743K4535j6556k5138k4622j2298l5938l8780k0971j0783
$$ plain form
17834 53410 62259 68588 78496 78644 92771 85425 86599 115362 148006 150341 146299 190607 220380
17821 220380 247848 263337 271538 252669 236503 212427 190132 175799 152279 136647 135524 128080
17809 128080 133806 130186 125996 139904 142494 137429 137559 147232 161982 157601 152575 151555 155901 149766
17795 149766 149755 157283 161668 147167 141476 135601 129588 143378 139621 130743 124584 122340 119843 111780
17781 111780 101218 80560 59931 61982 86095 113856 112157 118456 140846 156511 142351 126361
17769 126361 139574 151756 167403 164639 155418 158473 171792 220890 256261 291383 309205 332944
17757 332944 360559 373570 380732 380636 393348 379714 348884 321265 305808 304745 302742 297724 319858
17744 319858 334015 356758 381293 364737 339599 314977 302679 266741 227961 206990 196207
17733A96207j6377j3654j9994k765J353J330j3638r889j4426k1725m047R275j5344
17720G6306k452j9093R050J5391l062q56j2015k1651m695R509J581O289J404j3422
17706D2284K798O64j3682j6008l038o630N242J7772k95K0331P720p529k4868n041
17692A9720O190M463k189O916j2467j9868J14M381J7784N641P907Q998J486k8817
17678B0259l1225P205K3428r730M889R109l565K2547K5258m142k2990j7855Q570
17665C1758j1159j4835j2916P368K6116R130O83p351k3782m161J4371o762L773
17652A2233R995q159j0991j3319j4554K7352K6315J229N044n31k1589m660k3697
17639a5332j09J3408Q746k865J2627M346l098K99k0895P06O649J8415R449K063
$$ plain form
17733 196207 179830 166176 146182 143417 144770 146100 132462 122573 108147 86422 82375 91650 76306
17720 76306 73854 54761 63811 79202 76140 75284 63269 41618 36923 46432 48013 54302 55706 42284
17706 42284 45082 45746 32064 16056 13018 6388 11630 29402 29107 49438 57158 49629 24761 19720
17692 19720 25910 30373 28184 35100 22633 2765 2879 7260 25044 30685 38592 47590 49076 20259
17678 20259 -10966 -3761 19667 9937 14826 23935 20370 42917 68175 64033 41043 23188 31758
17665 31758 20599 5764 -7152 216 26332 35462 36145 28794 5012 851 15222 8460 12233
17652 12233 22228 14069 3078 -10241 -24795 2557 28872 30101 35145 34614 13025 8365 -15332
17639 -15332 -15441 -2033 6713 3848 16475 20821 17723 18022 -2873 -2167 4482 22897 32346 34409
17625C4409j002j6395n312n329k2804K374Q188R035n216q969L728R448p111N451
17611D95J2549m254q6k3419K604J5492N104j823j3404n225L190J1385J3674N720
17597B2002R694j7251j2889k849q290j6855J7085J5492j812J4039r074k0570R013
17584b265K1350J3479k023l941p298k1840O184j7669J971Q650n900j4526J2827
17571a1001K0565P278J9695R568l774k7553j6894P007O281j192O14K659o482k283
17557D488j3403k212j1346l19K4307J4683J7299Q250q548j6425l1772j6787J3047
17544a8738Q83J5833L132O993j0244l020l522n023o492M230K3931J9938R985j5485
17530B2401j5523r224J1971O791j576j5574r42J0624j6955k6361J0662K618J4322
$$ plain form
17625 34409 33407 17012 11700 6371 -16433 -14059 -5871 3164 -2052 -11021 -7293 2155 -4956 495
17611 495 13044 8790 8704 -14715 -12111 3381 8485 6662 -6742 -11967 -8777 2608 16282 22002
17597 22002 31696 14445 1556 -1293 -9583 -26438 -9353 6139 4327 18366 9292 -11278 -2265
17584 -2265 19085 32564 30541 26600 19302 -2538 3646 -14023 -12052 -3402 -9302 -23828 -11001
17571 -11001 9564 16842 36537 46105 42331 14778 -2116 4891 11172 9980 10594 13253 6771 4488
17557 4488 -8915 -11127 -22473 -22792 1515 16198 33497 41747 33199 16774 -14998 -31785 -18738
17544 -18738 -17855 -2022 1110 8103 -2141 -5161 -8683 -13706 -20198 -15968 7963 27901 37886 22401
17530 22401 6878 -2346 9625 16416 14840 -734 -1676 8948 -8007 -34368 -23706 -21088 -6766
17517f766J162o704o511j7770R532L174N352l975q7J1099Q685J1975o494j1209
17503h537r711M15j078p130n111J2891N656L0171K190l462j2836r302L470Q840
17489F466j9431r355j759Q079k336K96J0190J6011K705k8228j3829P537K1672
17476a982J7999j0455j3597k106P37K510K856j1706m808n160q42Q445N549k340
17462a4900q685P394n785o394n648m180j5539R438J0089J6115p948m4K0750R011
17448C674J5288M033p473m79M539L110J398L6068L2105J5025K2499J6794J6078
17435A62659m3956n0409l9579N220n540Q091q863j6648L075L9N968Q077K0426
17422D8560l728m36J992m871o22N740k4469j9476o240o717n556K4912m52N229
$$ plain form
17517 -6766 -5604 -12308 -18819 -36589 -27057 -23883 -18531 -22506 -22593 -11494 -2809 9166 2672 -8537
17503 -8537 -18248 -17833 -18911 -26041 -31152 -18261 -12605 17566 19756 16294 3458 -5844 -2374 6466
17489 6466 -12965 -22320 -24079 -16000 -18336 -18040 -7850 8161 10866 -17362 -31191 -23654 -1982
17476 -1982 16017 5562 -8035 -10141 -9404 -6894 -4038 -15744 -20552 -25712 -26554 -18109 -12560 -14900
17462 -14900 -23585 -16191 -21976 -28370 -34018 -38198 -53737 -44299 -34210 -18095 -26043 -26087 -5337 3674
17448 3674 18962 22995 15522 15043 19582 22692 24090 60158 92263 107288 129787 146581 162659
17435 162659 118703 68294 28715 33935 28395 36486 27623 10975 14050 14089 20057 28134 48560
17422 48560 44832 44396 46388 41517 40895 46635 22166 2690 -3550 -10267 -15823 9089 8637 13866
17408A3866o721l507j9963J1840l493j457j2004K113K2053J2630j349k4393M83
17395i902J9864j1715j4428n154J8536R754j1381o355J3425R542K608l887l1530
17382b0623n387J0468J0880l38J1088j613J6190J3108J5724M071M249k4763k3645
17369I409r04J6547n034R871l393o393j371r4k1012j4051p281j3157R127K5791
17355a945K7822l3k3430j9610J3064J7070n428j8191k526J2690j616O78p777J9169
17341I937L330n573Q824M269j0720m455j4261k0541L668K8415L440k1895K156
17328a3406P975L325r56n945j2528o903K9477K2394q507k3537j4553l447R33j2283
17314c7961k450K0070J153M331K382J323p794j8910j139p029K2060J9341j4618
$$ plain form
17408 13866 7145 3638 -16325 -4485 -7978 -9435 -21439 -19326 2727 15357 14008 -10385 -9902
17395 -9902 9962 -1753 -16181 -21335 -2799 6955 -4426 -10781 2644 12186 14794 10907 -20623
17382 -20623 -26010 -15542 -4662 -5000 6088 4475 20665 33773 49497 53568 57817 33054 9409
17369 9409 8505 25052 20018 29889 26496 20103 18732 18638 -2374 -16425 -23706 -36863 -27736 -1945
17355 -1945 25877 25844 2414 -17196 -4132 12938 7510 -10681 -13207 -517 -2133 -1455 -9232 9937
17341 9937 13267 7694 16518 20787 10067 5612 -8649 -29190 -25522 2893 6333 -15562 -13406
17328 -13406 -5431 -2106 -3062 -9007 -21535 -28438 1039 23433 14926 -8611 -23164 -26611 -25678 -37961
17314 -37961 -40411 -20341 -19188 -14857 -12475 -11152 -18946 -37856 -38995 -46024 -23964 -4623 -19241
17301a9241K3747K1254j7088l5069j0895j815k532J5289K369r48R539P995O757
17288f38J1460P436K765j7676j6561p504J3950J0567K2700j0226j6728J123k51
17275D17N702J056p465j4999Q79J5270o182J1447J6655O836R821l93l0263r678
17261h97n675J1042L025K619J3906m256J045j813j2951j4752n967Q014r758p558
17247b3976N198J0149K2404K1693k2360j0009J1781N624j0175k0177N307j2913
17235a7454k215J7172N759P051o706J1534o880K369q4J0793q094j4487o921J8054
17221I891R251j6602n748K1799O572Q555m994L353m323j0737j4828J1138Q373
17208B1700j3572j3363J3312J4257L219n974k6495j827j3724k2219R238J0739
$$ plain form
17301 -19241 4506 25760 8672 -26397 -37292 -39107 -41639 -26350 -23981 -24929 -15390 -7395 -638
17288 -638 10822 18258 21023 3347 -13214 -20718 -6768 3799 26499 16273 -455 668 417
17275 417 6119 7175 -290 -15289 -14410 860 -5322 6125 22780 29616 39437 39044 8781 -897
17261 -897 -6572 4470 7495 10114 24020 19764 20809 18996 6045 -8707 -14674 -6660 -16418 -23976
17247 -23976 -18778 -8629 13775 35468 13108 3099 14880 20504 10329 -9848 -4541 -17454
17235 -17454 -19669 -2497 3262 10313 3607 15141 8261 10630 10546 21339 13245 -1242 -8163 9891
17221 9891 19142 2540 -3208 18591 25163 33718 28724 32077 27754 17017 2189 13327 21700
17208 21700 8128 -5235 8077 22334 25553 19579 -6916 -8743 -22467 -44686 -35448 -24709
17196b4709Q43K4062J1589K0856N603j7180k1811K0649Q071j064m989N947l052
17183B4815Q390K6169K9174K7557K8332N7390P3484O4329N3228J7198j250m0727
17171C68089l5684m1823n6129l0844l3742l2087k5021l0299l2237J2430J4643
17160G7296n833l12J3886k477k6195J858q775k4094j5931J2024K2510K4609L1072
17147I9638J8902J3438J3097K5281J6023N159j4962m6324l0830j2260k810K0226
17135A04578L5132L3864J7470K6525L1275K9593o15l1805k7288m6794j4714o390
17123A50831j2181K751j7026p261L2458J9132J828J2914m993j7315p136n292k8645
17110A20065j5530l028k9153k1575m441k1136k6172L905J2344m380J1082J2656
$$ plain form
17196 -24709 -23866 196 11785 32641 38244 21064 -747 19902 27973 26909 21920 27867 24815
17183 24815 33205 59374 88548 116105 144437 201827 275311 339640 392868 410066 408816 368089
17171 368089 332405 290582 234453 203609 169867 137780 112759 82460 50223 62653 77296
17160 77296 71463 71151 85037 82560 56365 58223 49448 25354 9423 21447 43957 68566 99638
17147 99638 118540 131978 145075 170356 186379 191538 176576 130252 99422 87162 84352 104578
17135 104578 139710 173574 191044 217569 248844 278437 277822 246017 218729 171935 157221 150831
17123 150831 138650 141401 124375 117114 149572 168704 170532 183446 178453 161138 154002 148710 120065
17110 120065 104535 101507 72354 50779 46338 25202 -970 2935 15279 10899 21981 34637
17098C4637L971k984j6062k637k133m06Q50N274k514J316j376l260J1684J7745
17084D4105k4231j8672l639J435R644K0216k19K984q318j807J0j1412K578j8636
17070e962K827l607k4369q381j1182J8724J5725R231Q599o825Q324J3578j9085
17057b403l13O410Q558j8805j3240M73K828N173J9366k247k3736o116K723L334
17043a7995j7256K923J764J6825K2576J1227n847j5358k318J0173o21o14k6852
17030b1373o383J7287J4272N304k587m023p910j9088k671j9546J125R480J4758
17017b1355J5524P443j4187j4248J0471m184P638R025j648J1248j608j3825R92
17004h714n406j1615K966J1698k744J221k607j9600M026J7023P86J1968M186j0576
$$ plain form
17098 34637 38608 35624 19562 16925 14792 14386 15236 20510 17996 19312 17936 14676 26360 44105
17084 44105 19874 1202 -2437 -1002 8642 28858 28639 31623 23305 21498 21508 10096 12674 -5962
17070 -5962 -3135 -6742 -31111 -39492 -50674 -31950 -16225 -6994 1605 -5220 3104 16682 -2403
17057 -2403 -2716 3694 12252 -6553 -19793 -19320 -16492 -11319 8047 5800 -17936 -24052 -21329 -17995
17043 -17995 -35251 -32328 -30564 -13739 8837 20064 14217 -1141 -3459 6714 6093 5479 -21373
17030 -21373 -27756 -10469 3803 9107 6520 2497 -5413 -24501 -27172 -46718 -45593 -36113 -21355
17017 -21355 -5831 1612 -12575 -26823 -16352 -20536 -12898 -3873 -5521 5727 4119 -9706 -8714
17004 -8714 -14120 -25735 -22769 -11071 -13815 -12594 -15201 -34801 -30775 -13752 -12966 -998 3188 -7388
16990g388L393k4775p276Q009O077q75K40j7063l232l355m986r239J0758K0963
16976b8749J5922J5179j2852k0430L304K6316J992k1653m009J2724J9177L384
16964A0305K698r660J927j198p111j4296L287J2815M195j0816j7893K0983n876
16951a0640J8026P90p975K286r189M435L984M92P777k4252o034J7318n517R072
16937E73M431q314Q68L1615j0196k5850m400J0R629J3233N179q061K069j0366
16923D20j2967j3424n39K233j3784P46P397R395J3389R38j6668M609K7930J3388
16909B3063j0870j9583m015q170n618j238L718j210j8585j2763J4713M751P538
16896b8269J0646j7110R995R536j2464L551M260J9253J8667j2805o151J3464j4387
$$ plain form
16990 -7388 -3995 -28770 -36046 -28037 -21960 -22835 -22595 -39658 -42890 -46245 -51231 -60470 -49712 -28749
16976 -28749 -12827 2352 -10500 -30930 -27626 -1310 682 -20971 -24980 -12256 6921 10305
16964 10305 13003 3343 5270 4072 -3039 -17335 -14048 -1233 2962 -7854 -25747 -4764 -10640
16951 -10640 7386 8176 201 2487 -6702 -2267 1717 2209 9986 -14266 -20300 -2982 -8499 573
16937 573 5004 -3310 -2442 29173 18977 -6873 -11273 -11263 -1634 11599 16778 8717 10786 420
16923 420 -12547 -25971 -26510 -24277 -38061 -37315 -29918 -20523 -7134 -6196 -22864 -18255 9675 23063
16909 23063 12193 -7390 -11405 -19575 -25193 -26431 -22713 -23923 -42508 -55271 -40558 -35807 -28269
16896 -28269 -17623 -34733 -24738 -15202 -27666 -24115 -19855 -602 18065 5260 -891 12573 -1814
16883a814j5231P499J895j6844o901J380J0816L035j9834p43K5942K6958R313
16870B5471r07j0700p651j3847j571n117R35J7990M860J021p682M434J6761j133
16856B2864j9715m438j9342k0014Q414P490J2871N215R586N810j3602J8053J3562
16843B6754O488j85j0233j5984J041N219J2877J4652N799k610j0168M555R397
16830D7602o576j3356K388p213k352R290Q12j283N960R508j175r718j8802M408
16816A9493Q520P696J7047J5584j1755k3826n883J8531J2092p033j4798l612r303
16803B2753J1676O974O060k279J2022K0487o049M396N537j7284j5835l619M648
16790D9487P842J7566J2140K318J0736J4019J293Q542K3530K5226M2984M6441
$$ plain form
16883 -1814 -17045 -9546 -7651 -24495 -31396 -30016 -19200 -16165 -35999 -36742 -10800 16158 25471
16870 25471 24564 13864 6213 -7634 -9205 -14322 -13387 4603 9463 10484 2802 7236 23997 22864
16856 22864 3149 -1289 -20631 -40645 -32231 -24741 -11870 -6655 2931 8741 -4861 13192 26754
16843 26754 33242 33057 22824 6840 7881 13100 25977 40629 46428 43818 33650 38205 47602
16830 47602 41026 27670 30058 22845 20493 29783 30595 29312 35272 44780 43605 33887 15085 19493
16816 19493 28013 35709 52756 68340 56585 32759 26876 45407 57499 50466 35668 32056 22753
16803 22753 34429 41403 47463 45184 57206 77693 71644 76040 81577 64293 48458 44839 49487
16790 49487 57329 74895 87035 89353 100089 114108 115401 123943 147473 172699 215683 262124
16778B62124N1833N8253N3082M6054L9439J5624j2461k1014k3512k6917l733M4852
16766D83624P1049O4197P3397Q1626O9258M8111K6538k2291o9777p7657q5950
16755F62125o6039o1575l5209j4973J8515L0969M1899J6317K759j7647k6155m1478
16743E09508n8692n0531m1051m0520k7371l4865l0051j2994l2831k0398j2068
16732A48136J2621J5674k6596j4219J6371j433k3762j543J8626q682P312j8371
16720A24134k7202q553M148J1710R366J9865R307m092J6173N685m654l3811k3257
16707I8819L5326J8413M80L579O79Q386j733R586K1710J3776j473r974j2896j4686
16693A69992q683K7465O128j0379p63J7152L1148J3725K8835j438m094j1416k2735
$$ plain form
16778 262124 313957 372210 425292 471346 510785 526409 513948 492934 469422 442505 438772 483624
16766 483624 554673 618870 692267 773893 843151 891262 917800 895509 825732 748075 662125
16755 662125 596086 534511 499302 484329 502844 533813 575712 592029 594788 577141 550986 509508
16743 509508 450816 400285 359234 318714 291343 256478 226427 213433 180602 160204 148136
16732 148136 160757 176431 149835 135616 151987 150554 126792 125249 143875 135193 142505 124134
16720 124134 96932 88379 92527 104237 113603 133468 142775 138683 154856 160541 155887 122076 98819
16707 98819 134145 152558 153038 156617 157296 165682 163949 173535 195245 209021 207548 197574 184678 169992
16693 169992 161309 188774 194902 184523 183760 200912 232060 245785 274620 273182 269088 257672 234937
16680B34937k1383l827P180K2300R152j837J3558M1079K8780Q945r502o383J5893
16667C38892Q674l6161m2944k1360j5184J7993L408p100K4501L5033J6925M669
16655C27346l261k297l7301m1341k4213O733K3184Q923k0863k9919j322J6177
16643B21846L868Q809J775J9580J3131P656j843P599J0836j3130L501J924J0066
16630B95618J7247K1945Q404k22J1484K8751K1177J5787J9319K6577N1060K7795
16618E44942M4025M3326L7695M3006L8872L3561M0389K3527M4856P6643P8885
16607A049727Q5888J12993J29717J57191J59760J67230J74299J96740K28820K63323
16597B725688L42031M67888O15570Q80265J288330J951420L055420M451766M960563
$$ plain form
16680 234937 213554 209727 216907 239207 248359 246522 260080 301159 329939 338884 329382 322999 338892
16667 338892 347566 311405 268461 247101 231917 249910 253318 246218 270719 305752 322677 327346
16655 327346 324085 321788 284487 243146 218933 225666 248850 257773 236910 206991 205669 221846
16643 221846 225714 234523 236298 255878 269009 276665 274822 282421 293257 280127 283628 285552 295618
16630 295618 312865 334810 343214 342992 354476 383227 404404 420191 439510 466087 517147 544942
16618 544942 588967 632293 669988 712994 751866 785427 825816 849343 894199 970842 1049727
16607 1049727 1135615 1248608 1378325 1535516 1695276 1862506 2036805 2233545 2462365 2725688
16597 2725688 3067719 3535607 4151177 5031442 6319772 8271192 11326612 15778378 20738941
16588B0738941L873114K897227K190009K76425k946178m588743l331702j303759
16580A7805334N45675K495507M619834O073570O377486O700411N792542K638348
16572E3048707j302074m128392n702863p109659o540017m299237k139714l15402
16564B1511349J518596L105920L230124K150585J515659N61940j912247m967546
16556B6714380n581275m135384k696859j853036j353481j023565q34968o69739
16548H566073n45113m48659l62155l15688k92972k80879k82471k80047k52930
16539E505159k24571k27421k46437k14211j49462j42562j22434j15715j32835
16530C929511j36398j50507j41899j54712j41415j32311j05592r7049q6268n5487
$$ plain form
16588 20738941 24612055 27509282 29699291 29975716 27029538 22440795 19109093 17805334
16580 17805334 18351009 20846516 25466350 31539920 37917406 44617817 50410359 53048707
16572 53048707 51746633 47618241 41915378 34805719 28265702 23966465 21826751 21511349
16564 21511349 23029945 26135865 29365989 31516574 33032233 33594173 31681926 26714380
16556 26714380 21133105 16997721 14300862 12447826 11094345 10070780 9235812 8566073
16548 8566073 8020960 7572301 7210146 6894458 6601486 6320607 6038136 5758089 5505159
16539 5505159 5280588 5053167 4806730 4592519 4443057 4300495 4178061 4062346 3929511
16530 3929511 3793113 3642606 3500707 3345995 3204580 3072269 2966677 2869628 2783360 2727873
16520B727873p8821q1141q2974q8609r9017q3209p0371n0995n7673o8746p6723
16509A889594q4002n3526j6480m5088p1744n3921k4617m1151m4015l9891o2711
16498A352448m0908j4609k3968l6034l0327k3244k8323k2350l3328k5726q236
16487A065395k7127l8867k7726l1445k3830k9239k7361j4111j1037j2149k2456
16476H00047p993j3415l3443k3952j1266k5301k5753j1140l5268j7584j1704k1489
16464E61739k9356j7919j8026K165l526l1657p674j6934O00O068o828l1091k8346
16451C79215k5656k4570k8960k3812j0652o344m182Q787R477q698j6732r932j4867
16438B23074j2507j2237l0214m492p333j464m916k685K1847J2681P42K182K2797
$$ plain form
16520 2727873 2649052 2567911 2484937 2396328 2297311 2214102 2143731 2092736 2035063 1966317 1889594
16509 1889594 1805592 1752066 1735586 1690498 1618754 1564833 1540216 1499065 1455050 1415159 1352448
16498 1352448 1311540 1296931 1272963 1236929 1206602 1183358 1155035 1132685 1099357 1073631 1065395
16487 1065395 1038268 999401 971675 940230 916400 887161 859800 845689 834652 822503 800047
16476 800047 792054 778639 745196 721244 709978 684677 658924 647784 612516 594932 583228 561739
16464 561739 532383 514464 496438 498603 495077 463420 455746 438812 439412 445480 438652 407561 379215
16451 379215 353559 328989 300029 276217 265565 259221 255039 263826 273303 264605 247873 237941 223074
16438 223074 210567 198330 168116 163624 156291 154827 149911 147226 169073 181754 182496 184678 207475
16425B07475j1749M024J242p726L97R630k3041l489j0521p964o308M830O973K5065
16411A88838J4417N741M37k308J7860j128p534n928m735J0326L0273r445j0227
16398B26587j209r745j2577j3953O957Q757j1946k5148j8249N45n849o570J7932
16385A55532l71J0311J7276l098m3614m3245K3947J4846q788J878L042j7920o396
16372A03400l310Q007N07m153J0J3400j0122J738J2104P370k43k1012j0270R093
16358A06519L530j9440k0071j1016P55O218Q850j3508l082N851K6635J0836k3978
16345G8099r304P039q837k2689r086J0202L581OO348P737k140J9944K571P908
16331I1379K14m576q795J1379l820j3803j4785q876J8353J367n739k656l68j728
$$ plain form
16425 207475 195726 199750 200992 193266 193663 203293 180252 176763 166242 158278 151970 156800 163773 188838
16411 188838 203255 208996 209433 207125 224985 223857 216323 210395 205660 215986 246259 236814 226587
16398 226587 225378 215633 203056 189103 196060 204817 192871 167723 149474 150019 144170 137600 155532
16385 155532 155161 165472 182748 179650 136036 92791 116738 131584 122796 124674 127716 109796 103400
16372 103400 100090 108097 108604 104451 104461 117861 107739 109477 121581 128951 128708 107696 97426 106519
16358 106519 110049 90609 70538 59522 60277 66495 75345 61837 58755 64606 91241 102077 78099
16345 78099 68795 75834 66997 44308 35222 45424 49005 49011 55359 63096 60956 80900 83471 91379
16331 91379 91593 87017 78222 89601 85781 71978 57193 48317 66670 68037 62298 59642 59274 57546
16317E7546j186J453K126q7o242n050J2513O096o696j399j5918J90J1944Q981
16303F4271k326n249o152j5005J0527J7808r418o335p713N36N293J3545r335l517
16289D6930l749k6788j264K0230o160j8692k682j0648q65P839N964l135J998Q684
16275A7662M399J674k0278Q715J3518m836p639j694N345O356J3082L922j5106
16262B5120o656P432l338J5799J0864n127k2636J0165R407k0238j7054J3898K00
16249A7836m756M62R384J5217j1742j9645L2209K4137J8356k2193k1739r366K5309
16236E3469K2252J604k504k5098k8993R579O788o374j4990j5932q329K138J6608
16223A0218n150j412j1431K791J0302L1529q192k4846J553K9690l086k4597j2647
$$ plain form
16317 57546 56360 57813 59939 59852 53610 48560 61073 67169 60473 59074 43156 43346 55290 64271
16303 64271 61945 56696 50544 35539 46066 63874 54456 48121 40408 40944 46237 59782 50447 46930
16289 46930 43181 16393 15129 35359 29199 10507 7825 -2823 -3688 4151 10115 6980 8978 17662
16275 17662 22061 23735 3457 12172 25690 20854 13215 11521 16866 23222 36304 40226 25120
16262 25120 18464 25896 22558 38357 49221 44094 21458 31623 41030 20792 3738 17636 17836
16249 17836 13080 13542 22926 38143 26401 6756 38965 63102 81458 59265 37526 28160 53469
16236 53469 75721 77325 74821 49723 20730 30309 37097 30723 15733 -199 -8528 -6390 10218
16223 10218 5068 3656 -7775 -4984 5318 36847 28655 3809 5362 35052 31966 7369 -5278
16210e278O589J9221q933K426J4124q317k269j2435K403N339j1131k940J7166
16197A5965J8865J1949q668j7094k1751j6138n21J5169K2147O481R884M414L451
16184D4153k4652o029r210j0264J3509J4379n234p069m796j2870J3717O529j8138
16171e975k4345j4531J9654K7235J0892j2320R924l983o235l452O217J4327P594
16158B5002m000j4468o017q322k460R751J1262n105N160j3001J4244J0155k5438
16145c237j8970O788j7845R663K8664Q267k3605j5310j896Q485K1267N531j1642
16132c840j3782K260o153k1271J5599J6651K3581K3778k522j8062r790q211m620
16119f382k112r167J1803J7541M447j5835J73K956n751N413l329N566L0412m6
$$ plain form
16210 -5278 1311 20532 11599 14025 28149 19832 17563 5128 7531 12870 1739 -1201 15965
16197 15965 34830 46779 38111 21017 -734 -16872 -17393 -2224 19923 26404 36288 40702 44153
16184 44153 19501 13472 4262 -6002 7507 21886 16652 9583 4787 -8083 5634 12163 -5975
16171 -5975 -30320 -44851 -25197 2038 12930 610 10534 6551 316 -3136 3081 17408 25002
16158 25002 21002 6534 517 -7805 -10265 -514 10748 5643 10803 -2198 12046 22201 -3237
16145 -3237 -22207 -15419 -33264 -23601 5063 13330 -10275 -25585 -27481 -18996 2271 7802 -3840
16132 -3840 -17622 -15362 -21515 -42786 -27187 -10536 13045 36823 34301 16239 6449 -1762 -6382
16119 -6382 -8494 -17661 -5858 11683 16130 295 468 3424 -2327 3086 -243 5323 35735 35689
16105C5689p554m077r10j7620j2734J1747N58k936j3543K1393J4364N902K962
16092C3241k49o294n096J2142k320j6340K3923J0182K908l2556k0054q523K818
16079f218j00r395p909R402O937O333M205m780L185L925J508R467m333n219M777
16064A1785l317L726L282j5100R28K5681K1594J4329r777j1010k6964l888O169
16051A7438q987m075O692N8j325j0946j6740Q261q978J2159K4381O647K306R154
16037C6045j7530j463J1084n08l084k417K852J1299R499J6636J6468L8945L9730
16024A57556K3755r48K245n509q671l6128j7091P703k4378n039L4709N4019M7092
16011B29315L1981Q149N041o459q765m9272k8861l3252k2347k0259L940K9504
$$ plain form
16105 35689 28135 24058 23148 5528 -7206 4541 5099 2163 -11380 10013 24377 30279 33241
16092 33241 32992 26698 21602 33744 31424 15084 39007 49189 52097 19541 -513 -9036 -6218
16079 -6218 -6318 -15713 -23622 -14220 -7283 -950 3255 -1525 1660 5585 7093 16560 12227 7008 11785
16064 11785 8468 12194 15476 376 1304 26985 48579 62908 53131 42121 15157 11269 17438
16051 17438 8451 4376 11068 11126 9801 -1145 -17885 -9624 -18602 -6443 17938 24585 26891 36045
16037 36045 18515 17052 28136 27628 24544 22127 24979 36278 45777 62413 78881 117826 157556
16024 157556 181311 180363 182608 177099 168428 132300 115209 122912 98534 93495 128204 182223 229315
16011 229315 261296 269445 274486 268027 259262 209990 181129 147877 125530 105271 109211 138715
15999A38715L0779K133R480k142j9921n491k8207l9383k6024j6664M205O971R183
15986F3634r47k7397j1515j1881J2229j24J633K4049R221j3481j4830J2278J9035
15973F1904J330j3015k0436p758j1215P006P739m595o886j213p309L539o950K665
15959D806r524Q30k638J0998p084O693J1747k780K330J5390j2498J88n348j2398
15945G12j9284j6720Q674K6352k482j3798k0704M182J3369j201R598K7656j076
15932A5278J924q01o968N189K235j1660J603J2651j3197j3002j1632j6457K0588
15919a4249N167j0445K167K928R491k537k7661p317N966O702K8629R952J190J633
15905A1616r088j5439o023l718J024Q348J1381L146j6687j7311K016N638J6471
$$ plain form
15999 138715 169494 171627 181107 178965 159044 153553 125346 85963 59939 43275 47480 54451 63634
15986 63634 62687 35290 23775 11894 24123 23999 25632 49681 58902 45421 30591 42869 61904
15973 61904 63234 50219 29783 22025 10810 17816 25555 20960 14074 12861 5552 9091 2141 4806
15959 4806 -4718 -3888 -6526 4472 -2612 4081 15828 13048 15378 30768 18270 18458 13110 712
15945 712 -18572 -35292 -26618 -266 -2748 -16546 -37250 -33068 -19699 -20900 -11302 16354 15278
15932 15278 17202 16401 9433 14622 16857 5197 6800 19451 6254 -6748 -18380 -34837 -14249
15919 -14249 -9082 -19527 -17360 -14432 -4941 -7478 -35139 -42456 -36490 -29788 -1159 8793 9983 11616
15905 11616 2528 -12911 -18934 -22652 -21628 -13280 -1899 1247 -15440 -32751 -30735 -25097 -8626
15892h626K0621k069q829k1567R083L318n174J042L266j0442j2631J3985J3111
15879d912J0307o23j971k97K453K800j5453m138n976p737j712K357n235J6325
15865a3812n106J7787r337k746n265J8996J6758k976k853q886n122j1385j5546
15852b9493m99q848j0680n020R805K1267P079K51j3901q768j032K021O904J7054
15838a3860J076P719J5725p798k0284j4983n738J9066J43p571J9377n545k8616
15825d1289J1788J0248j333k956P310o841R11J0995J9671m211k916N410J152m387
15811C552N737P900j1939j0677j852J0694K319j2204l450J2979J6865o894j8629
15798e599k825j3496J1432K9082M380m792o978j1779k579L091J725k949M147l402
$$ plain form
15892 -8626 11995 9926 1097 -20470 -11387 -8069 -13243 -12201 -8935 -19377 -32008 -18023 -4912
15879 -4912 5395 4772 2801 2504 4957 7757 -7696 -11834 -17810 -25547 -27259 -24902 -30137 -13812
15865 -13812 -18918 -1131 -10468 -13214 -18479 517 17275 14299 11446 2560 -2562 -13947 -29493
15852 -29493 -29992 -38840 -49520 -54540 -44735 -23468 -16389 -16138 -30039 -38807 -39839 -37818 -30914 -13860
15838 -13860 -12784 -5065 10660 2862 -17422 -32405 -38143 -19077 -18934 -26505 -7128 -12673 -41289
15825 -41289 -29501 -19253 -20586 -23542 -16232 -23073 -22162 -11167 8504 4293 1377 6787 7939 3552
15811 3552 9289 17189 5250 -5427 -7279 3415 5734 -6470 -9920 3059 19924 13030 -5599
15798 -5599 -8424 -21920 -10488 18594 22974 18182 11204 -575 -3154 -63 1662 -1287 2860 -542
15784e42j4567l311J4750J5983n088r724k256N049K8260L593j0239k810L0606
15771D9704j2435k7618j892J5065J0659J0874J4385J9615L68J0335K001j7080
15759G3981k4042j1592M705j3198k1327J4541J4221n33m055k6073q518J9M769
15746B898J7499J4986p121j3604j3595k7762k610Q549J0321K1633L091j4217j0713
15733a0645J0531J1526K1096k0687k5490K5234L3107o150k4158j7934O953N095
15721H478or098p265j4746K80O093j270k4135p533J0543J3512j6443j8608l444
15707f3642p040N32K1039L9202J5949q409J1353n984l15J2392j6501o757J126
15694g055m932k400m890p574q499N018K1472K0905J4031m351m468l1324j4222
$$ plain form
15784 -542 -15109 -18420 -3670 12313 7225 -2499 -4755 294 28554 32147 21908 19098 49704
15771 49704 37269 9651 7759 22824 33483 44357 58742 78357 78725 89060 91061 73981
15759 73981 49939 38347 43052 29854 8527 23068 37289 36756 32701 6628 -1890 -1871 2898
15746 2898 20397 35383 28262 14658 1063 -26699 -29309 -20760 -10439 11194 14285 68 -10645
15733 -10645 -114 11412 32508 11821 -13669 11565 44672 38522 14364 -3570 3383 8478
15721 8478 8472 -626 -7891 -22637 -22357 -16264 -17534 -41669 -49202 -38659 -25147 -41590 -60198 -63642
15707 -63642 -70682 -70150 -49111 -9909 6040 -2369 8984 3000 2685 15077 -1424 -8181 -7055
15694 -7055 -11987 -14387 -19277 -26851 -35350 -30332 -8860 12045 26076 21725 17257 -14067 -28289
15681b8289J211J3222J385n920q430P849O019q150m747J1599Q491J378p531k397
15667a4310N181j665j1362M245o341Q485L0636L188J1748q235j4204P357P487
15654B2210J0338l425k7111n461K247m630j2053L13K0404k352O323p237M201J1547
15640A5314j6838l135K379Q71j0981R299j94J7309M156J884L228o176j7219j5066
15626a5169K418J4087J9173J2077J2427p742m910j3226j5544o635n086l694p773
15613a9597o903J4931K231R822K822o854q458l472J0332J6523L49J3908j0176
15600A5458r454j0220k1075l578J3362P017J4428p63N603J1990o471o390k0595
15587a0688n616Q522q332n060K4014O0j2015l763M511J1786j2327k1462J5096
$$ plain form
15681 -28289 -27078 -13856 -12471 -18391 -26821 -18972 -12953 -21103 -25850 -14251 -5760 -4382 -11913 -14310
15667 -14310 -9129 -10794 -22156 -17911 -24252 -15767 14869 18057 29805 21570 7366 14723 22210
15654 22210 32548 29123 2012 -3449 -1202 -5832 -17885 -17572 2832 480 6803 -434 3767 15314
15640 15314 -1524 -4659 -2280 -1409 -12390 -3091 -3285 14024 18180 20064 23292 17116 -103 -15169
15626 -15169 -12751 1336 20509 32586 45013 37271 32361 19135 3591 -3044 -8130 -11824 -19597
15613 -19597 -26500 -11569 -9338 484 3306 -3548 -12006 -15478 -5146 11377 11726 25634 15458
15600 15458 6004 -4216 -25291 -28869 -15507 -8490 5938 5175 10778 22768 16297 9907 -10688
15587 -10688 -16304 -7782 -16114 -21174 2840 2900 -9115 -12878 -8367 3419 -8908 -30370 -15274
15574a5274O955j148J0624K0849j2473M68j000Q53N02P612j0980k9540l594J4089
15560a2057K806m783P160k877L3313N1497J3029k024J3994J0653l877P058K9031
15547A42923O5748P5356Q6520J08829Q8498R4505N2328M5658K396j2528j6557
15536G33676o7045r2059r8559p0080n2240m6416n5345m3319j8416o679j9531j5927
15524A48060n617j1149k0526l1234k397J8522j0046n34k2593k5091o801J8319
15512D8913R446K2598Q954M549l3836l1540j311l645L860K706Q841J2385N18j7641
15498C4797j1056N996O289k3588l792J0932N651k2466n616j0860Q099j9631k2837
15485d8082L0750L2899m160l920k107j3087l7130K306K0471J1023p971r125K652
$$ plain form
15574 -15274 -8319 -9467 1157 22006 9533 10001 9001 9854 10356 17968 6988 -22552 -26146 -12057
15560 -12057 -9251 -14034 -6874 -9751 23562 75059 88088 86064 100058 110711 106834 113892 142923
15547 142923 208671 284027 370547 479376 567874 662379 714707 760365 762761 750233 733676
15536 733676 666631 574572 476013 405933 353693 307277 251932 208613 190197 183518 163987 148060
15524 148060 142443 131294 110768 79534 77137 95659 85613 85079 62486 37395 30594 48913
15512 48913 58359 80957 89911 94460 60624 29084 27773 24128 27988 30694 39535 51920 52438 34797
15498 34797 23741 29737 36026 12438 8646 19578 25229 2763 -2853 -13713 -5614 -25245 -48082
15485 -48082 -17332 15567 11407 7487 5380 -7707 -44837 -42531 -22060 -11037 -19008 -28133 -25481
15472b5481Q470m863N691J3090M556O401k4185O197J1860l294k1953K376J9263
15459a872J4438J3845q474k2479m796J4066j6429J1506L871l2396n791J4043j2683
15446c3151M168k817j9936j6824K5085R304R681j1704k1399r24L3882J1284l119
15433a6470j0202K5439r931r344M951R108N755j7109j5642L529O939j7304o575
15420d6856o564J0582J2777M96j4966k443R083o647j4589j0403k988L333N800
15407f3385K5675J8623R526k631J4760j9242n416P152J7033J2324O390j4558j0019
15394c768K1519k848j4323j32K3105j3876j6611K3629J2138j2456J6k256j1522
15381B615R996p791r81P648j432L033j1259N390J1442n5j2737K1163j9337Q104
$$ plain form
15472 -25481 -17011 -21874 -16183 -3093 1463 7864 -16321 -10124 1736 -1558 -23511 -21135 -1872
15459 -1872 12566 26411 17937 -4542 -9338 4728 -11701 -195 3676 -28720 -34511 -20468 -33151
15446 -33151 -28983 -31800 -51736 -68560 -43475 -34171 -24490 -36194 -57593 -58517 -24635 -13351 -16470
15433 -16470 -26672 -1233 -11164 -20508 -15557 -6449 -694 -17803 -33445 -29916 -22977 -40281 -46856
15420 -46856 -53420 -42838 -30061 -29565 -44531 -46974 -37891 -44538 -59127 -69530 -72518 -69185 -63385
15407 -63385 -37710 -19087 -9561 -12192 2568 -16674 -22090 -14938 2095 14419 20809 6251 -3768
15394 -3768 17751 14903 580 448 23553 9677 -6934 16695 28833 16377 16393 14137 2615
15381 2615 12611 4820 3839 11487 10055 13088 1829 7219 18661 18606 5869 27032 7695 15799
15367A5799R453n558r861R0r199k3018L374J6668K343J6848K5656J0156j3928
15354C8823q280Q431R533j5070k2520o422J2136O32J1429Q305n468N153j253J1006
15340D6435K017m426J0541P603j9921k1220J3330O614J343q685p437P836k1117
15327A2913j9532j0416J8856N637m711J2828J359Q334J31j7840n528j8510k0014
15314c6493J2911L412P908o167J4394J4989j2647R417J588Q135L511l247q0j646
15300A5985l232k415N323j334N800J8453j453j582l640k3435K441j934m887j3560
15286i470M286J6459j821n701J2505O113L059J6812k649j5047j2117n276n637
15273A516Q581J1361J662O928r275R14r138n257L103L509O182J1209N036O99o024
$$ plain form
15367 15799 25252 19694 9833 9923 724 -22294 -18920 -2252 91 16939 42595 52751 38823
15354 38823 30543 38974 48507 33437 10917 4495 16631 17263 28692 36997 31529 36682 35429 46435
15340 46435 48452 44026 54567 62170 42249 21029 34359 40973 42316 33631 26194 34030 12913
15327 12913 -6619 -17035 1821 7458 2747 15575 16934 25268 25399 7559 2031 -16479 -36493
15314 -36493 -23582 -20170 -12262 -18429 -4035 10954 -1693 7724 9312 17447 20958 17711 17631 15985
15300 15985 12753 10338 15661 14327 20127 38580 37127 35545 31905 8470 10911 8977 4090 -9470
15286 -9470 -5184 11275 9454 3753 16258 22371 25430 42242 39593 24546 12429 7153 1516
15273 1516 10097 21458 23120 30048 20773 21687 12549 7292 10395 13904 20086 31295 36331 37030 31006
15258C1006k0300J521R131n491n967k370Q109m775j289J1415r086J0970J6961
15245C9835l190n659K9171P189q412n237P458K3658r178k189J6241J8506L4382
15232A42575L6088O548J2255P490L2773J2913r318K7430K2921o318O034J0934
15220C02325p045j2562j6196j7494j2059l3233k9099k3263J1152J8875K5027n876
15208B00552O946P228k67k684p346q933J0039k0678R279J2747l620K2755J8865
15195B44883J2386K4038j0395j5599J6622K3968j5228j2754J4372O185r031j878
15183B77569M429k523P807j1384r684L2116K5800L0607j469P256k409L8538M1594
15170D38247Q539L150J6059K9500N2533M0959M4834N1059O0732P1262J02537J29433
$$ plain form
15258 31006 10706 12227 21358 15867 9900 7530 15639 10864 9575 20990 11904 22874 39835
15245 39835 36645 30986 60157 67346 58934 53697 61155 84813 75635 73446 89687 108193 142575
15232 142575 178663 185211 197466 204956 237729 250642 241324 268754 291675 285357 291391 302325
15220 302325 295280 282718 266522 249028 236969 203736 174637 151374 162526 181401 206428 200552
15208 200552 207498 214726 214459 211775 204429 195496 205535 184857 194136 206883 203263 226018 244883
15195 244883 257269 281307 270912 255313 271935 295903 280675 267921 282293 288478 279447 277569
15183 277569 281998 279475 287282 275898 266214 298330 324130 354737 353268 360524 358115 396653 438247
15170 438247 446786 449936 465995 495495 548028 588987 633821 684880 745612 816874 919411 1048844
15158A048844J36108J42399J70198J48387R9911N1303J0037k6361n7862r1246
15148A631718q3314p2418q2984m5995n1663k6674K0775K9713J9923L7846L5414
15137A412341P1703N5457P2992O8340Q2317J12008J22260J29751J70300K04995
15127B502464K15874K48135L30727M04307N14023O08152P06001P97236Q88164
15118G215083R96999J095034J214817J332516J539821J858836K349263L236442
15110B0838811M657808O737901R283085J1995617J4692937J6934443J7989604
15103A03130206J7322396J5152040J1433718O265945M14122n059138r671788j3652646
15095A25334855j6181641j6410875j4691822j2520796j0498804q454672o372627
$$ plain form
15158 1048844 1184952 1327351 1497549 1645936 1745847 1797150 1807187 1780826 1722964 1631718
15148 1631718 1548404 1475986 1393002 1347007 1295344 1268670 1289445 1319158 1339081 1376927 1412341
15137 1412341 1484044 1539501 1612493 1680833 1763150 1875158 1997418 2127169 2297469 2502464
15127 2502464 2718338 2966473 3297200 3701507 4215530 4823682 5529683 6326919 7215083
15118 7215083 8212082 9307116 10521933 11854449 13394270 15253106 17602369 20838811
15110 20838811 25496619 32234520 41517605 53513222 68206159 85140602 103130206
15103 103130206 120452602 135604642 147038360 153304305 153718427 148659289 138987501 125334855
15095 125334855 109153214 92742339 78050517 65529721 55030917 46576245 40203618
15088D0203618m647466l470435k753293k299720j988166j718370j539355j436653
15080B0350160j290010j157526j045982r26804q21108p58835p08673o44085n83533
15071A2413604n58523n11416m74310m48528m04886l58115l19558k94313k70773
15062H773182k58038k17941k43556k11909k12938k39995k42167k34901k33462
15053F678275j98571j91923j86755k02639j75947j60772j45914j48016j49861
15044E117877j35884j50868j34257j04768r7658p2832p1248o5922o1042q0951
15034D142447n2857m7073o2917o3363r6049j25850j27884j46679j41174j20451
15024C158150j23723j25438j27771j35037j00210r3639q2689o5132o5860n0073
$$ plain form
15088 40203618 35556152 32085717 29332424 27032704 25044538 23326168 21786813 20350160
15080 20350160 19060150 17902624 16856642 15929838 15108730 14349895 13641222 12997137 12413604
15071 12413604 11855081 11343665 10869355 10420827 10015941 9657826 9338268 9043955 8773182
15062 8773182 8515144 8297203 8053647 7841738 7628800 7388805 7146638 6911737 6678275
15053 6678275 6479704 6287781 6101026 5898387 5722440 5561668 5415754 5267738 5117877
15044 5117877 4981993 4831125 4696868 4592100 4494442 4421610 4350362 4284440 4223398 4142447
15034 4142447 4089590 4042517 3979600 3916237 3820188 3694338 3566454 3419775 3278601 3158150
15024 3158150 3034427 2908989 2781218 2646181 2545971 2452332 2369643 2304511 2238651 2188578
15014B188578m3468l6640m4164m7183l3770j5312k1689n1076n3348n2476l7263
15003A752189k7619l2893k2131k9517l2022l9931j9894k974j4132j6661n465j7621
14991A491329j7546k4410n3159l3399l1562n0940n2336p1422o1184n9945o1513
14980I73913o6363o5173l6569n1426m1349k1284j8204k1379k3318k860l4230j1083
14968E80675j5918j9716o498p996j818r577l4832k2449r559k0210q633R960r167
14955D24262L846J3148J0193m952j6114o149o774p740j0867o899m711N902j38
14942C93007l1576k8309J730J2122J2145k183l4924k3398k1203L97J0046L2336
14930C20190L913l1949j0133K229j8848p825n238p557L2045J735L734r236l874
$$ plain form
15014 2188578 2145110 2108470 2064306 2017123 1983353 1968041 1946352 1895276 1841928 1789452 1752189
15003 1752189 1724570 1691677 1669546 1640029 1608007 1568076 1548182 1545208 1531076 1514415 1508950 1491329
14991 1491329 1473783 1449373 1396214 1362815 1331253 1280313 1227977 1156555 1095371 1035426 973913
14980 973913 907550 842377 805808 754382 713033 691749 673545 652166 628848 625988 591758 580675
14968 580675 564757 545041 538543 530547 528729 519152 484320 461871 452312 432102 423469 433429 424262
14955 424262 428108 441256 451449 446497 430383 424234 417460 409720 398853 391954 387243 393145 393007
14942 393007 361431 333122 334852 346974 359119 356936 322012 298614 277411 277808 287854 320190
14930 320190 324103 292154 282021 284250 265402 257577 252339 244782 276827 278562 282296 273060 269186
14917B69186j3780p381N610J2278n614j3205q073j0816P113L2608J6638l834j5733
14904B64997j1460j3860j6008j2827O727J5420j739J0358m37P200P74j1741J4555
14891B51959k630j2443n420k246p135j3410J0289K4024j4945j7174j2762p496
14879A90611N006k383p191K5190q50L380L954j975O454M264r664r859r029q106
14865A89802J472L065J6095l0585j2403M408K4659N096j3568j2073n403j4929
14853A55636n829P307o142J0304Q954J1972O501l1506j1703N804l269j2789k0188
14840A15052l825J9091j8517L590P563l05R054m103p609Q14J0420j0008M765m068
14826A21914O855Q900N406k5302P299l40j2358l423M18K4606N673j8816l5090
$$ plain form
14917 269186 255406 248025 253635 265913 260299 247094 239021 228205 235318 267926 284564 280730 264997
14904 264997 253537 239677 223669 210842 217569 232989 231250 241608 241171 248371 249145 237404 251959
14891 251959 249329 236886 231466 229220 222085 208675 218964 242988 228043 210869 198107 190611
14879 190611 195617 193234 186043 211233 210383 213763 217717 215742 222196 226460 216796 206937 197908 189802
14865 189802 191274 194339 210434 179849 167446 171854 196513 201609 188041 175968 170565 155636
14853 155636 149807 157114 150972 161276 170230 182202 188703 157197 145494 151298 148029 135240 115052
14840 115052 111227 130318 111801 115391 122954 122649 131703 127600 119991 120805 131225 121217 125982 121914
14826 121914 128769 137669 143075 117773 125072 124732 112374 108951 109369 133975 139648 120832 85742
14813H5742j2886K4370p561J39J991m370j982j905J3895R798O563J6570l388l4206
14799I2770l8606R512K1290N995r444K09r490J5593J5406J2164J1366p337Q382
14786A27810K399j2567j0330P840O942J172p371P892J3724l019j1352j1252M473
14773A16361P957K968j0338j5123k6452m851k300L0730J1749p43p785r03J624
14760A02894k855P661J4351J0827j1357j7806j8306Q854J4954k2829j6467k2381
14748D7540m844K6101K0711L617M716R570j6776p549k763n119J8694K1994j5945
14735I9947k2119j6189j6009k1024J1331K3280p002l37l469J242J1114L317J7358
14722H1440Q895p038m294q248J0176J6108J002j5831l159r517J4219o929j1970
$$ plain form
14813 85742 72856 97226 89665 89804 91795 87425 85443 83538 97433 107231 113794 130364 126976 92770
14799 92770 54164 63676 84966 90961 81517 81726 72236 87829 103235 115399 126765 119428 127810
14786 127810 130209 117642 107312 115152 122094 123266 115895 123787 137511 134492 123140 111888 116361
14773 116361 124318 127286 116948 101825 75373 70522 68222 98952 110701 109958 102173 101270 102894
14760 102894 100039 107700 122051 132878 121521 103715 85409 94263 109217 86388 69921 47540
14748 47540 42696 68797 89508 93125 97841 107411 90635 83086 80323 75204 93898 115892 99947
14735 99947 77828 61639 45630 24606 35937 59217 52215 51878 48409 49651 60765 64082 81440
14722 81440 90335 83297 79003 70755 80931 97039 98041 82210 79051 69534 83753 76824 64854
14709F4854r027O740l278J3383J1347M895j4085o731N274n686j979J4630p024
14696G3313j1337L813Q717R493Q213j6884j066k842m516o705K3784O716J6040
14683A06739L097j2196N064J1888m220j0999o67j5770J067J0349P062j0136J4075
14670A05353J9174P103J1555J5113L8058L1032K5561M2189N2947Q8158Q9058P4121
14658E99422O7020P4745M3122M8557K3781o225l0332o6250p7185p9508p5032r1463
14646D30652n9844o0381m7099j4924j5320j5756k1715k825n118j3404r107k118
14634A63041j8201l340l896j2685j4519o884K1771j4581j7221J44J1962J0589
14622A16180J1509R01q506l165J1134J5758m436j1761p945r988J624k2806r086
$$ plain form
14709 64854 55827 62567 59289 72672 84019 88914 74829 68098 73372 67686 65707 80337 73313
14696 73313 61976 65789 74506 83999 92212 75328 74262 71420 66904 60199 83983 90699 106739
14683 106739 109836 97640 102704 114592 110372 99373 98706 82936 84003 94352 101414 91278 105353
14670 105353 124527 131630 143185 158298 196356 227388 252949 295138 348085 436243 525301 599422
14658 599422 666442 741187 784309 832866 856647 850422 820090 753840 676655 597147 522115 430652
14646 430652 370808 310427 263328 248404 233084 217328 195613 192788 187670 174266 165159 163041
14634 163041 144840 141500 137604 124919 110400 103516 125287 110706 93485 93629 105591 116180
14622 116180 127689 128590 120084 116919 128053 143811 139375 127614 119669 109681 111305 88499 79413
14609G9413J132N980N650n36N44J321m701q386n443j5863m397R641K2546p112
14595G9789Q90J2281r275j2379J387J1912J1723j6045K687p270N014R776J430
14582I1920K333K381j0603j446j924J0563m475j0220k688O884K1206l06k7421
14569G6204l156J4728K3250J1478j2359k3349J281r311O805K943j4519j2078K1752
14556H3669R021m057m629m120l697l894R050J6660N866j6943k5014k6235K8572
14543F4249K6139j6099j2639P676J5519K3596r594k6448J1906M108M481J4369
14531A07263k55j4072K395J1222J449J0777J3371j1501n502M537q732j5913q085
14518H6954j6284L626P72K3597J3486P227k5719j5743J3570p070J9221l562l569
$$ plain form
14609 79413 80545 86525 92175 91639 92183 93504 88803 80417 74974 59111 54714 64355 86901 79789
14595 79789 80679 92960 83685 71306 72693 84605 96328 80283 82970 75700 80714 90490 91920
14582 91920 94253 96634 86031 84585 82661 93224 88749 78529 75841 82725 103931 103625 76204
14569 76204 73048 87776 111026 122504 110145 86796 88077 78766 85571 88514 73995 61917 83669
14556 83669 92690 88633 84004 79884 76187 72293 81343 98003 103869 86926 61912 35677 64249
14543 64249 90388 74289 61650 69326 84845 108441 98847 72399 84305 88413 92894 107263
14531 107263 107008 92936 95331 106553 108002 118779 132150 120649 115147 119684 110952 95039 86954
14518 86954 70670 74296 75068 98665 112151 119378 93659 77916 91486 84416 103637 100075 96506
14505I6506K0961L0181n456k2861o626l314k4939l431r905M568k733N200K3035
14492A01186m556l817K498J0266J0779r377k3943L830j13j0358j3422R02J6843
14479H0718K1547J2904j8123j121j521L398l765J1591J2346Q835j0697R778j832
14466A24058k453R731K554N519j6641l1483k0018K8034J0700j2412k384K743L879
14453A01827L359J4792L24n938L798J1785o374J3878L765J343o53k173r34J9638
14439A58437j81N167J765Q81k875l294o030k6258p739M112K031k50M599N821L529
14424A39715m979J1600K1417j4590k296J6256q064j6386P839R636J2155M289N440
14411A82032j9728j164K148M460J4544J6609j7597l96M111M953P166Q701L782
$$ plain form
14505 96506 117467 147648 142192 119331 112705 109391 84452 81021 71116 75684 72951 78151 101186
14492 101186 96630 92813 95311 105577 116356 106979 83036 86866 86753 76395 62973 63875 80718
14479 80718 102265 115169 97046 95925 94404 97802 94037 105628 117974 126809 116112 125890 124058
14466 124058 121605 131336 133890 139409 122768 91285 71267 99301 110001 97589 95205 97948 101827
14453 101827 105186 119978 120302 114364 118162 129947 123573 137451 141216 142559 141906 139733 138799 158437
14439 158437 158256 163423 165188 166069 163194 159900 153870 127612 119873 123985 126016 125766 130365 136186 139715
14424 139715 134736 146336 167753 153163 150867 167123 159059 142673 150512 160148 172303 176592 182032
14411 182032 162304 161140 163288 167748 182292 198901 181304 180908 185019 189972 197138 205839 209621
14398B09621k827o832P951J3613j2754j8656n543J1040N123J4893P348J8093j6443
14385B24627j3187M652r59K736j893j6416K822J329j6407R605J8904J3826k55
14372B29384J2171M744j0556J3964K0699k843p401J8803J6197o591j132M233l1971
14359B59701j4508J5087K6776J2557j3983j1967m264o820J2054J2077p637L818
14347B82891J6274M621Q25P937O187J525J0371p635r656j0699R183K4984Q027
14334C44835k222J3687K087J1702j2370j1301P021j802o763P574O829j0355r63
14321C47959K0713K1756J5572L719o673m08n322Q447P081O012J7087M035j1632
14308D28346J1880q581k80M1541N292r992n430Q889J4937m316p643l80k0013n899
$$ plain form
14398 209621 206794 199962 207913 221526 208772 190116 184573 195613 200736 215629 222977 241070 224627
14385 224627 211440 216092 215133 217869 215976 199560 202382 203711 187304 196909 215813 229639 229384
14372 229384 241555 246299 235743 249707 270406 267563 260162 278965 295162 288571 287439 291672 259701
14359 259701 245193 260280 287056 299613 285630 273663 269399 262579 274633 286710 279073 282891
14347 282891 299165 303786 304611 312548 318735 320260 330631 322996 313340 302641 311824 336808 344835
14334 344835 342613 356300 358387 370089 357719 346418 353439 351637 344874 352448 359277 348922 347959
14321 347959 368672 390428 406000 409719 403046 402638 397316 405763 412844 418856 435943 439978 428346
14308 428346 440226 431645 431365 472906 478198 468206 462776 471665 486602 482286 474643 474263 454250 448351
14294D48351K7336Q067o089N454J5343P90K960Q252n338o837Q696J3660P366J4893
14280E42904K1738j2259k9436M472J918J1658J1688J6981l013j926R331J2250
14268E86306R951J0006j3209j3574r889L873K2558M845j1531k821j3806j8552
14256E54157Q614K3247L793J1179j537n2J8673J6669J908p073k5807J712R995
14243F15478j7679j8511l108P575L3797M277o327j8827j3008N005o017N65n047
14230E78173L305L543J4901o784j2517Q840j1236j1949m028j723J8361K8403O984
14217F14273j5411P671j7465k7886k2544n133l884O584K0991l873O809J6702n369
14204E71465j1019j5657J617M374r388M719k4747k6707j3056j1659J0149p99j567
$$ plain form
14294 448351 475687 483754 477665 483119 498462 499252 502212 510464 505126 498289 506985 520645 528011 542904
14280 542904 564642 552383 522947 527419 529337 540995 552683 569664 566651 564725 574056 586306
14268 586306 596257 606263 593054 579480 569591 573464 596022 600867 589336 586515 572709 554157
14256 554157 562771 586018 589811 600990 599453 599401 618074 634743 636651 629578 603771 605483 615478
14243 615478 597799 579288 576180 583755 617552 621829 615502 596675 583667 588672 582655 583220 578173
14230 578173 581478 585021 599922 593138 580621 589461 578225 566276 562248 560525 578886 607289 614273
14217 614273 598862 606533 589068 561182 538638 533505 529621 536205 557196 553323 560132 576834 571465
14204 571465 560446 544789 546406 550780 541392 546111 521364 494657 481601 469942 480091 479292 477725
14191D77725J3031r47l9880n061J3458J2381M966q711N075o969j2824O292J2297
14178D70833j4779j1463r755J112J0093M752n819j2065q836k854n012J162k567
14165D14802J630P20O507k4527m5L550L644j842N961j6058j9211L916P689J519
14151C88255P656p398q672j6659j6316K930r044k0718R45m603j4059N100K4973
14138C32390J682O299m680k4942q071n494M076j8148j092J1045L470k425Q122
14125C02232p344j1856j8015n410K8593L4809J7191R827J4098J4672P060J2910
14113C98767q77m713J4467J4575j0764k8134j8425j3508k3767l3577l859l970
14101B86215j6267o330m782j7401j882q185j088N137K366j8229N9p73R649j329
$$ plain form
14191 477725 490756 489809 449929 444868 458326 470707 475673 466962 472037 465068 452244 458536 470833
14178 470833 456054 444591 434836 435948 446041 450793 444974 432909 424073 421219 416207 417369 414802
14165 414802 416432 417152 423659 399132 399087 402637 406281 404439 410400 394342 375131 379047 386736 388255
14151 388255 395911 388513 379841 363182 346866 349796 340752 320034 320979 316376 302317 307417 332390
14138 332390 334072 340371 335691 310749 302678 297184 301260 283112 282020 293065 296535 294110 302232
14125 302232 294888 283032 265017 259607 288200 323009 340200 350027 364125 378797 385857 398767
14113 398767 397890 393177 407644 422219 411455 383321 364896 351388 327621 294044 290185 286215
14101 286215 269948 263618 258836 241435 239553 231368 230280 235417 237783 219554 219613 218840 228489 227160
14087B27160n9n421L494q987K283j0440k8283J2548J8205M322q677k20p567J3274
14073B11632K067j8301k6224N49J1224J7400J5132l91j7734l165l025O324o101
14060A89387q448R475J8861R611j4603j3684j1438j8310j834r882M329L243q870
14047A47837m8L252j072q905k090K3687J6710k2335k6437Q31Q704n912J2076j903
14033A44395m724l366L533o008K146j4552L584j6636p766p625O911J4061J3554
14020A27507J2250k0835l995m849j0386J3921L715l353P262J783K455j4848L776
14007A14403k387j2040p020R041N962L970j2574M311o902L978m100o247j5168
13994G5227n36j6924J3078J3255J0326j0572j885J933q92j9208J3260J6813o511
$$ plain form
14087 227160 227101 221680 225174 216187 218470 208030 179747 192295 210500 214822 206145 205925 198358 211632
14073 211632 213699 195398 169174 169723 180947 198347 213479 213088 195354 192189 189164 195488 189387
14060 189387 180939 190414 209275 218886 204283 190599 179161 160851 159017 149135 153464 156707 147837
14047 147837 147789 151041 149969 141064 138974 162661 179371 157036 130599 131430 140134 134222 146298 144395
14033 144395 139671 136305 139838 133830 135976 121424 125008 108372 100606 92981 99892 113953 127507
14020 127507 139757 118922 114927 110078 99692 113613 117328 113975 121237 123020 125475 110627 114403
14007 114403 112016 99976 92956 101997 107959 111929 99355 103666 96764 100742 96642 90395 75227
13994 75227 74691 57767 70845 84100 94426 83854 81969 83902 83010 63802 77062 93875 87364
13981H7364n537J4276j625k1008o619K733P442R460Q58j6260j2422k7657J889
13968C2894L3924K0315o638l811R128j147m885J4112Q93l623M61J943j3041l917
13954G6608N479J2718J1277k4015k366M131k1693n525n746O785J6961p165Q712
13941G6161j2683J3585n038p727r818K154P83j953q602K216Q126k645l955M265
13927E4869q750p216P998j934J015p519Q230l441J7830M043N72p703r762k625
13913D5607P499P73n867R172n402m218j8575l081K2088k549k14o428j5344Q078
13899C1539k590q486J2016J9740N747N50j21m845m726j0839J1933k3979k5543
13886C96Q972N439R70J739P758k192m16M902p007j1095J576J548m688m818R816
$$ plain form
13981 87364 81827 96103 94478 73470 66851 69584 77026 86486 87344 71084 58662 31005 32894
13968 32894 66818 87133 80495 76684 85812 84665 79780 93892 94785 91162 91623 93566 80525 76608
13954 76608 82087 94805 106082 82067 79701 83832 62139 56614 50868 57653 74614 67449 76161
13941 76161 63478 77063 72025 64298 54480 56634 57417 55464 46862 49078 57204 54559 50604 54869
13927 54869 46119 38903 46901 44967 45982 38463 46693 43252 61082 65125 65697 57994 48232 45607
13913 45607 53106 53879 48012 57184 51782 47564 28989 25908 47996 45447 45233 38805 23461 31539
13899 31539 28949 20463 32479 52219 57966 58516 58395 53550 48824 37985 49918 25939 396
13886 396 9368 14807 15777 17516 25274 23082 22666 27568 20561 9466 11042 12590 7902 3084 12900
13871A2900K409j651l532m475j7817K2560L6454r869Q495Q258o601j4764j791
13858C0576R494r896k795J3378k701r437m826K0095o988K515R861k0069j084J8026
13844D6149p694k0064M802J480J2671K434j8508m338N919o141O683k126j0184
13831A1083j808O735J3235J2324O798p639J0509M340j1065j368j8135j0601j850
13818A2558o576K2704M696k0032m826j2575p555O059J4596J014p96p094J0981
13805A3154o112j2999p771n615L819O805J8575P548J0586j403k773J0653p312
13792B7155k2224M065J4340o749j6418Q129J0707O276J5976l528l2979q360j333
13779d943j4129o662J8197Q550M328J916Q558K959J2994p670L209l387J9221p018
$$ plain form
13871 12900 15309 13658 10126 5651 -12166 10394 46848 36979 45474 53732 47131 32367 30576
13858 30576 40070 30174 27379 40757 38056 28619 23793 43888 36900 39415 49276 29207 28123 46149
13844 46149 38455 18391 23193 24673 37344 39778 21270 16932 22851 16710 23393 21267 11083
13831 11083 9275 16010 29245 41569 48367 40728 51237 55577 44512 43144 25009 14408 12558
13818 12558 5982 28686 33382 13350 8524 -4051 -11606 -5547 9049 10063 9267 2173 13154
13805 13154 7042 -5957 -13728 -19343 -15524 -8719 9856 17404 27990 26587 23814 34467 27155
13792 27155 4931 8996 23336 16587 169 8298 19005 25281 41257 37729 4750 -3610 -4943
13779 -4943 -19072 -25734 -7537 1013 5341 7257 15815 18774 31768 24098 27307 23920 43141 36123
13765C6123J1828j225M123k1283k4949N433K9307K5570K2312L154J6087P913J6097
13752A30490N4150L0373K4367P645k1105m0479j4090j9474j9149l9716k924m881
13740H5207j8042P91j2305l929j597J806n565J617j2080J5392k419Q50j1668o956
13726C1102L083j6100M149o607o060J4361l041o993m69O786r880J139J2782l889
13712B0363R87J9976Q932j1931j4491j0991M041N661j5542l799k523M739k667
13699B755p656k1237Q435J6514O67k137J0843K1062J533r252q349O825n52L033
13685B2484L036n594P887m039J713L957l161j892k097l292j1159R31o335L847
13671F286J3957O140n694k309q687N373P46p376j0344q531J1675n159O385L621
$$ plain form
13765 36123 47951 46726 50849 29566 4617 10050 39357 64927 87239 90393 106480 114393 130490
13752 130490 184640 215013 239380 247025 225920 185441 171351 151877 132728 93012 90088 85207
13740 85207 67165 67956 55651 51722 50125 51931 46366 47983 35903 51295 48876 49726 38058 31102
13726 31102 34185 18085 22234 15627 9567 23928 20887 13894 13425 20211 10331 11470 24252 20363
13712 20363 21350 41326 50258 38327 23836 12845 16886 22547 7005 3206 683 5422 2755
13699 2755 -4901 -26138 -17703 -1189 -522 -2659 8184 29246 30779 21527 13178 20003 19451 22484
13685 22484 25520 19926 27813 23774 25487 29444 26283 24391 22294 19002 7843 8774 2439 6286
13671 6286 20243 26383 20689 18380 9693 15066 15812 8436 -1908 -10439 1236 -3923 2462 6083
13657F083J2829p274j1824q477o985l667N263J661m870K8816Q601j7249k4343
13644b1436j2138j1243P593K2172J6487K246o475M688J0541J4624q937k533J141
13631A6730j0416j8819J7731M900lR96q110k3565N553J151P763K743J8O915J809
13616E396l848j1315j355J0817q089j1712P876J4157J6874J6938j2802j7757q08
13603D372K164L103j3350R273J4858r24K4912J279p861k0107k772j400j3722p465
13589g640J0414J9959j4100J437J3246j1504k0177m37j1936M234K2240J0842n412
13576A1166J6853J7725m170j7065p581o197k523r559J518nK329j6026r154j5981
13562c8670M897J1895m379r487J8823K0777N742j1898j1954l286k823P285Q507
$$ plain form
13657 6083 18912 11638 -186 -8663 -15648 -19315 -14052 -12391 -17261 11555 20156 2907 -21436
13644 -21436 -33574 -44817 -37224 -15052 1435 3681 -2794 1894 12435 27059 18122 15589 16730
13631 16730 6314 -12505 5226 10126 10123 11119 3009 -20556 -15003 -13852 -6089 -3346 -3328 3587 5396
13616 5396 1548 -9767 -11122 -305 -8394 -20106 -12230 1927 18801 35739 22937 5180 4372
13603 4372 6536 9639 -3711 5562 20420 19496 44408 45687 37826 17719 14947 13547 -175 -7640
13589 -7640 2774 22733 8633 10070 23316 11812 -8365 -8802 -20738 -16504 5736 16578 11166
13576 11166 28019 45744 41574 24509 16928 10731 8208 -1351 167 162 2491 -13535 -22689 -38670
13562 -38670 -33773 -21878 -26257 -35744 -16921 3856 9598 -2300 -14254 -17540 -20363 -13078 -4571
13549d571J7150r199q679r469M245j1227R300P557r457o456N336Q67r216n840
13535b9659M197K87K025j1269M408J1844m471J4290J1639j122l302J7281L567
13522A9715j6122j5453j1261o134p287O759l06q063J5220O316P027j9380k1610
13509e0579M625K55l754j3537L3188J7346P940K6010R131j7188l2634o101J2010
13496a3288O485k3519J4376K8412p118k0625N814P895M793m162k415j9893L044
13483b0201k224J416J0173p560n654P087J1337j4998p895J7032R636K5803N796
13470B9748k0760l138L810q610q900q428j4718p182J0519J3423o286O645Q909
13457d968k048N264K148n688j6626j3786m921P456K0826j2832j7965K662L0930
$$ plain form
13549 -4571 12579 3380 -5299 -14768 -10523 -21750 -12450 -4893 -14350 -20806 -15470 -14603 -23819 -29659
13535 -29659 -25462 -25175 -23150 -34419 -30011 -18167 -22638 -8348 3291 2169 -1133 16148 19715
13522 19715 3593 -11860 -23121 -29255 -36542 -29783 -30089 -38152 -22932 -16616 -9589 -28969 -50579
13509 -50579 -45954 -45699 -49453 -62990 -29802 -12456 -4516 21494 30625 13437 -19197 -25298 -13288
13496 -13288 -6803 -30322 -15946 12466 5348 -15277 -9463 -1568 3225 -937 -3352 -23245 -20201
13483 -20201 -22425 -21009 -10836 -18396 -24050 -16963 -5626 -20624 -28519 -11487 -1851 23952 29748
13470 29748 8988 5850 9660 1050 -7850 -16278 -30996 -38178 -27659 -14236 -20522 -13877 -4968
13457 -4968 -7016 -1752 396 -5292 -21918 -35704 -40625 -33169 -12343 -25175 -43140 -40478 -9548
13444i548J6609r664j0994nJ771N139j1498L145l50J3806N245N729r108j9757
13430a9480M581j711J3707J4953m063j8949j1828m828K8538l483k4345K023J9470
13417e415j259J3148J3884j2336l5222j7897l618Q473J363J0955k080J2658P571
13404i775k5574q64K3631l781n657J2973J639j7036J0561J0673n92m097p837p191
13390b2927l0o453k34l045J0229M008m761J837Q112L946r055j1289M964k7495
13376e2193n317M304q516J0592J3653J0923M927Q188N481j2596k073p340k0457
13363e0424N424N258K6863K1554J712L544m210j5226j4245j5401j0063k84J2206
13350c3292n364n903j6940R76P634J3587Q084L211j239K97M30K455l10k1337j043
$$ plain form
13444 -9548 7061 -2603 -13597 -13602 -11831 -6692 -18190 -15045 -15395 -1589 3656 9385 277 -19480
13430 -19480 -14899 -16610 -2903 12050 7987 -10962 -22790 -27618 920 -2563 -26908 -24885 -5415
13417 -5415 -6674 6474 20358 8022 -27200 -45097 -48715 -40242 -38879 -27924 -30004 -17346 -9775
13404 -9775 -35349 -36213 -12582 -16363 -22020 -9047 -7408 -24444 -13883 -3210 -3802 -7899 -15736 -22927
13390 -22927 -22957 -29410 -29644 -32689 -22460 -18452 -23213 -21376 -13264 -9318 -18373 -29662 -24698 -52193
13376 -52193 -57510 -53206 -61722 -51130 -37477 -26554 -21627 -13439 -7958 -20554 -22627 -29967 -50424
13363 -50424 -45000 -39742 -12879 8675 10387 13931 9721 -5505 -19750 -35151 -45214 -45498 -33292
13350 -33292 -38656 -44559 -61499 -60523 -52889 -39302 -31218 -28007 -29246 -28949 -28519 -26064 -26374 -47711 -48754
13335d8754K7014K3186n931j6971j7024K919m436L361J1041O046K1385n545l004
13322f713n586K320J4107o909j2083n043j4213M401l637K0445J983r770q203J362
13308b7539J004k657K2210L103J0212m343o781j0113p892J6806o188q329p586
13295b8093M619q506P91l0j3576K765L492J0621L4172O771k9442p87O075k5593
13281c6721m003J7601J323J0447J7075M732j1688M273J2351k231k462k1526j6420
13268b7249R322M871J274M772N600M454J341J2488M388O146q634n926J418K0691
13254C4956K9015J4616K4110Q490N403L1546M6878O6143Q6973J07229K10457L17682
13242I83498L15241K06609J58738R7804o1660l29784m09065l06691j71632r4438
$$ plain form
13335 -48754 -21740 1446 -4485 -21456 -38480 -35561 -39997 -36636 -25595 -19549 1836 -3709 -6713
13322 -6713 -12299 -9979 4128 -2781 -14864 -19907 -34120 -29719 -33356 -12911 -10928 -20698 -28901 -27539
13308 -27539 -26535 -29192 -6982 -3879 6333 1990 -4791 -14904 -22796 -5990 -12178 -20507 -28093
13295 -28093 -23474 -31980 -31189 -31219 -44795 -42030 -38538 -27917 6255 13026 -16416 -17203 -11128 -36721
13281 -36721 -40724 -23123 -21800 -11353 5722 10454 -1234 3039 15390 13159 10697 -10829 -27249
13268 -27249 -17927 -13056 -11782 -7010 -1410 3044 4385 16873 21261 27407 18773 12847 14265 34956
13254 34956 63971 78587 102697 111187 116590 148136 195014 261157 348130 455359 665816 983498
13242 983498 1298739 1505348 1664086 1761890 1700230 1370446 961381 654690 483058 388620
13232C88620n6832n7864m2860j7880j5336k2832j3952k4112j7515K534p283j0034
13220A04654q192k474q338p0k0822j7061J2454p037P720m224o533r862p591J2622
13206D5246K1124j3363n63J5836j0724r384L659N084j5840J718L03J2312j602
13193E3806Q46k3405j593N488k4887q095J0043J708j6963L08j0814k6669N568
13180c4659J3744r070j7150j8376j6414K4693J8516m635K258p37m152J2598R783
13167b3601L92j0703J536O999O497j3794l1629k9887K0863J0479m320R030Q531
13154d9607j864N915k98K447J2990q530J2760r109O450O562o545k8411j1569J4745
13140e4064L2798m243j5575J9786K117n308J4431j12n620k3834O741J9306j061
$$ plain form
13232 388620 331788 273924 231064 213184 197848 175016 161064 136952 119437 121971 114688 104654
13220 104654 96462 93988 85650 85580 64758 47697 60151 53114 60834 56610 50077 40215 32624 45246
13206 45246 66370 53007 52444 68280 57556 48172 51831 56915 41075 42793 43096 55408 53806
13193 53806 54652 31247 29654 35142 10255 2160 12203 13911 -3052 -2744 -13558 -40227 -34659
13180 -34659 -20915 -29985 -47135 -65511 -81925 -57232 -38716 -43351 -41093 -41830 -45982 -33384 -23601
13167 -23601 -23209 -33912 -32376 -25377 -18880 -32674 -64303 -94190 -73327 -62848 -67168 -58138 -49607
13154 -49607 -51471 -45556 -45854 -43407 -30417 -38947 -26187 -35296 -28846 -22284 -28829 -57240 -68809 -54064
13140 -54064 -21266 -25509 -41084 -21298 -19181 -24489 -10058 -10170 -15790 -39624 -32883 -13577 -14638
13127a4638k0818j9640k0687O373p074p59o121M374J930M795J1636M456m465j1655
13113g2293n700j800J419R938Q527L4780O931p176k1666m884O148o382k1671J195
13099g2634R077j0658N846N415j0360M847O511j3170L419L431M747l359l4816
13086a01704J2287K6832k193J3400J5500M477j1653J0779K908p262k2488Q033
13074e1084J4183j561K947q531J0431j421k6265O741J8061K8676J2612J0561m833
13061A0517j5796r164J254O818l405j3621R545m287M036p336O535K2581J2519
13048B0196J2376P737o875q685L121o633L3089O146n698j9738n630J659L008M526
13034C8599j5714k1106M811J958r972m471l018p156P759L995R653P231J6472J166
$$ plain form
13127 -14638 -35456 -55096 -75783 -69410 -76484 -77243 -83364 -78990 -77060 -72265 -60629 -56173 -60638 -72293
13113 -72293 -77993 -79793 -78374 -68436 -59909 -25129 -18198 -25374 -47040 -51924 -45776 -52158 -73829 -72634
13099 -72634 -63557 -74215 -68369 -62954 -73314 -68467 -61956 -75126 -71707 -68276 -63529 -66888 -101704
13086 -101704 -89417 -62585 -64778 -51378 -35878 -31401 -43054 -32275 -29367 -36629 -59117 -51084
13074 -51084 -36901 -38462 -35515 -44046 -33615 -35036 -61301 -54560 -36499 -7823 4789 15350 10517
13061 10517 -5279 -14443 -13189 -6371 -9776 -23397 -13852 -18139 -14103 -21439 -14904 7677 20196
13048 20196 32572 40309 33434 24749 27870 21237 54326 60472 54774 35036 29406 31065 34073 38599
13034 38599 22885 1779 6590 8548 -1424 -5895 -8913 -16069 -8310 -4315 5338 12569 29041 30207
13020C0207q489n609k695N805j5408J0041J3927J3900K906k6758l8834j2720j4496
13007d8223N368L300J1518J604M18N420j213q189K382j4991j8772J4028J3056
12994c4294J0598p808j7636K0042R576o104R097J6910j240q224k7568k7044q657
12981g2352P180O896O256L2704K7906j227J3929K9676L372K368k9156n8416m0133
12968g0997p532K5490J2357K6772O711j4520J3260o503j3286L741N839q581j0190
12955c7439J1409J1348q508K195j4554J7162n12j5407p582J977j1570J0500J8206
12942b2775Q3k1306k1279R977O851o083j5796j3790J977r983k7615j8220n550
12929a43509j7711O588M113J5875N1692M2251k052p72K3224K4868K7025J6117
$$ plain form
13020 30207 21718 16109 13414 19219 3811 13852 27779 41679 44585 17827 -21007 -33727 -48223
13007 -48223 -42855 -39555 -28037 -26433 -26015 -20595 -21808 -29997 -27615 -42606 -61378 -47350 -34294
12994 -34294 -23696 -31504 -49140 -29098 -19522 -25626 -16529 381 -859 -9083 -36651 -63695 -72352
12981 -72352 -65172 -58276 -52020 -19316 8590 7363 21292 50968 54340 56708 27552 -30864 -70997
12968 -70997 -78529 -53039 -40682 -13910 -7199 -21719 -8459 -14962 -28248 -24507 -18668 -27249 -37439
12955 -37439 -26030 -14682 -23190 -20995 -35549 -18387 -18899 -34306 -41888 -39911 -51481 -40981 -22775
12942 -22775 -22692 -43998 -65277 -55300 -48449 -54532 -70328 -84118 -82141 -92124 -119739 -137959 -143509
12929 -143509 -161220 -154632 -150519 -134644 -82952 -40701 -42753 -43525 -20301 4567 31592 47709
12917D7709P553n544j0694N692J5617J0049n18L8823N0776M3435L1666P0045N4991
12904C59600L6139N8961L1969n812N831l3712k8810l3101n616j5634j6746l1950
12892C21119R283J8036L047M4615P1529J27553K49697L22185K63640J66475J32935
12881A730114N7506j60729l87165l35101j91473j01208n8047l7821k2366j327
12871D92383j6481l524K1505j0215m457J8646q517k189j1705k1523n197j0600
12859D38126Q441j4518o40L1003O3255P7837N1652M5030L0756R568J9379M3828
12847H03717P1762J14433J73451K85545K74481J59208J51596Q2110r5958l50248
12837A670097l49195k07545q1329m6947k5442J9340K9952K5747M4334O8096R1056
$$ plain form
12917 47709 55262 49718 39024 44716 60333 70382 69864 108687 159463 202898 234564 304609 359600
12904 359600 395739 454700 486669 480857 486688 452976 424166 391065 385449 369815 353069 321119
12892 321119 330402 348438 351485 396100 467629 595182 844879 1167064 1430704 1597179 1730114
12881 1730114 1787620 1626891 1239726 904625 713152 611944 553897 516076 493710 492383
12871 492383 475902 472378 493883 483668 479211 497857 489340 487151 475446 453923 448726 438126
12859 438126 446567 432049 431409 462412 525667 603504 655156 700186 730942 740510 759889 803717
12847 803717 875479 989912 1163363 1448908 1723389 1882597 2034193 2116303 2020345 1670097
12837 1670097 1320902 1113357 1032028 985081 959639 978979 1008931 1034678 1079012 1147108 1238164
12826A238164J04153J58382K04368L10335M84478O32302N44576L61293L59813
12817D397864K43640j36365n54062m67473k77325j81121j36174o0589L6918J43533
12807C008846J79238J79204J95364K46369K81127L27767M32842N30440O32314
12798F013511O87374P06803P45194Q69493J083673J347984J644582J877667K400430
12789A7376711L015678L803140M799934O575752R762625J4859639K4079325M1346674
12781A25619478O4630474O2645713L6115555L1025705K2791378j0130244o8934083
12774B63763976p8724715n1209390l0226643j9165616j3131951r311311o656969
12767E5337381n073724m209306l519849l058388k849048k783094k429407k043404
$$ plain form
12826 1238164 1342317 1500699 1705067 2015402 2499880 3132182 3676758 4038051 4397864
12817 4397864 4641504 4505139 3951077 3483604 3206279 3025158 2888984 2828395 2865313 3008846
12807 3008846 3188084 3367288 3562652 3809021 4090148 4417915 4850757 5381197 6013511
12798 6013511 6700885 7407688 8152882 9022375 10106048 11454032 13098614 14976281 17376711
12789 17376711 20392389 24195529 28995463 35571215 45333840 60193479 84272804 125619478
12781 125619478 190249952 252895665 289011220 320036925 342828303 332698059 263763976
12774 263763976 185039261 133829871 103603228 84437612 71305661 61994350 55337381
12767 55337381 50263657 46054351 42534502 39476114 36627066 33843972 31414565 29371161
12759B9371161j691610j376379j155971j054679j034415j032262r86003r20537
12751B0119305q96243q58933q03161p21103o29382o26247n34185l81036l52959
12742A4316056l46231k85272k72996l30529m33187m50350m16388m01499m14183
12733A0965421m08034l74628l27293l01889k91886k80980k60520k45177k23235
12724H251779k34841k58548k76307k45192k59072k73070k48577k47739k51656
12715E956777j72320j66400j74582j71359j50649j37458j21273j41815j39893
12706D581028j27461j10219q6786q4862j05180j05146j12539r2462r2134j01090
12696C563149p5124j09737j04508q6428q1860n2912n6909m3443o4971o2456m7879
$$ plain form
12759 29371161 27679551 26303172 25147201 24092522 23058107 22025845 21039842 20119305
12751 20119305 19223062 18364129 17560968 16839865 16210483 15584236 15050051 14669015 14316056
12742 14316056 13969825 13684553 13411557 13081028 12647841 12197491 11781103 11379604 10965421
12733 10965421 10557387 10182759 9855466 9553577 9261691 8980711 8720191 8475014 8251779
12724 8251779 8016938 7758390 7482083 7236891 6977819 6704749 6456172 6208433 5956777
12715 5956777 5784457 5618057 5443475 5272116 5121467 4984009 4862736 4720921 4581028
12706 4581028 4453567 4343348 4256562 4171700 4066520 3961374 3848835 3756373 3664239 3563149
12696 3563149 3488025 3378288 3273780 3187352 3105492 3052580 2995671 2952228 2887257 2824801 2776922
12685B776922o5905o8042n0601o5451o6928k2179l4131o2834p0915m1322k7843
12674B200771l9212l5815m1780k7378l6343o4789o2711m8135l7833o0517o2668
12663A683590p6623p0791o1337q5344r1693j01698r6460r7214p9081o3707n5482
12652H04160m6351k810K3383Q962k0939p757p352K4266m656j888k6931l8989j3238
12639F89860K759o771n943q162k3227m056L870n132K049K995J1978N466J3277
12626F78963O566J987k6119l5209k2815j2520r223r456n276q018o225j8039j5108
12613E19508J3805j7588j5543M196Q631j254O682m075l2520k6736J310J0336N90
12600D67342k4853k2416j1898L726L4650n398k7388j4327L707L6532L5835j0217
$$ plain form
12685 2776922 2711017 2642975 2592374 2526923 2459995 2437816 2403685 2340851 2269936 2228614 2200771
12674 2200771 2161559 2125744 2083964 2056586 2020243 1955454 1892743 1844608 1806775 1746258 1683590
12663 1683590 1606967 1536176 1474839 1389495 1297802 1196104 1099644 1002430 923349 859642 804160
12652 804160 757809 754999 778382 787344 766405 758648 751296 775562 770906 769018 742087 703098 689860
12639 689860 692619 685848 679905 671743 648516 644460 648330 643198 645247 648242 660220 665686 678963
12626 678963 685529 687516 661397 626188 603373 590853 581630 572174 566898 558880 552655 534616 519508
12613 519508 533313 515725 500182 504378 513009 511755 518437 514362 481842 455106 456416 466752 467342
12600 467342 442489 420073 408175 411901 446551 441153 413765 399438 403145 439677 475512 465295
12588D65295R404j6547r410k0921l7417m4237l3002r278K511J7477L0340L6568
12576C90783K5474J2923J487j0462j6812J165j5452j295K3636L641k3741k3391
12564C67956k0312J3075j1655r975R30K1471K928p34O389p165k94k4785N800K0518
12550C64147K3688k0501j3657m364o007p003j2131k7434o904J8828K7078O438
12538C42178j4191j9170j3886N680k053R755q943k999r082p123j0409P677L255
12525B80689P645R36Q384j4283l4745L295J0566J7967k643j6711k3101j6544J5204
12512B36659M352J756r953k7587J945Q041o844j259j4174o057n07R275N829N667
12498B07143j4792L836p371l333o908j5036n116k085J4557k175l8908l437L674
$$ plain form
12588 465295 474699 458152 448742 427821 390404 346167 313165 303887 306398 323875 354215 390783
12576 390783 416257 429180 430667 420205 403393 404558 389106 387811 411447 415088 391347 367956
12564 367956 347644 360719 349064 339089 340019 361490 364418 363684 370073 362908 362614 337829 343629 364147
12550 364147 387835 367334 353677 349313 343306 336303 324172 296738 289834 308662 335740 342178
12538 342178 327987 308817 294931 300611 298558 308313 299370 296371 287289 280166 269757 277434 280689
12525 280689 288334 289270 297654 283371 248626 251921 262487 280454 277811 261100 237999 221455 236659
12512 236659 241011 242767 232814 205227 207172 215213 208369 207110 192936 186879 186372 195647 201476 207143
12498 207143 192351 196187 188816 185483 178575 163539 158423 156338 170895 168720 129812 126375 130049
12485A30049K429J7145o621j8961j550K0867K1218O769n213L608l647n584J913
12472A62422J161J036R346l874P302J6008Q04k458j9231k8025L345m986L03O880
12458A50033l470O485q713j384J7667N048l246O918M907k6142m704m87q481R700
12444A44131J0363q697j5744m106J696n80J6796j593K700M734n084m589M052J5999
12430A60078j1415k8264j0280J6315J5035j3006j7098o477j4561J000J7502K0365
12418A29194o418k5755Q760Q674R114j1071R511J8871N349q544k1624j5680l211
12405I7170J1460l006J0978J7104p801n968l882J552J3793J4533M315m770j5948
12392A29530k4993J3231K520j6254N273K0641K623m108J83j4097Q099J923J386
$$ plain form
12485 130049 132478 149623 143002 124041 122491 143358 164576 171345 166132 169740 166093 160509 162422
12472 162422 163583 164619 173965 170091 177393 193401 194205 191747 172516 144491 147836 142850 143153 150033
12458 150033 146563 153048 144335 142951 160618 165666 162420 169338 174245 148103 143399 142912 134431 144131
12444 144131 154494 145797 130053 125947 127643 127063 143859 142266 144966 149700 144616 140027 144079 160078
12430 160078 148663 120399 110119 126434 141469 128463 111365 104888 90327 91327 108829 129194
12418 129194 122776 97021 105781 114455 123569 112498 122009 140880 146229 137685 116061 100381 97170
12405 97170 108630 105624 116602 133706 125905 119937 116055 117607 131400 145933 150248 145478 129530
12392 129530 104537 117768 120288 104034 109307 129948 132571 128463 128646 114549 122648 124571 125957
12379A25957j0220j3016N102L782j5912R268K2107J0490q898M591J726l123J857
12366A33711n159m065j3830r596j2741j8637R308L191M337k805j858R102J2963
12353A03921J7878R69R92q867j8918O23k864K2965j0065n116p481j348K0483J4749
12339A27921k476p852L490k724k1756K592P507n599J4494K1283k562k3575J0899
12326A21642J7621N782J3036R882J0501q377L0781M3570N759J6630P710N2824
12314C27361R3968J42689K22501L22361L16425J85186J41056J03777q0133l71824
12304A403367l94561k33736j42399r1213o9778l7756k3794k3679k6700k1190l8043
12293C00518l0187R11j7262j9908k2998j3189R640R388r590j2890R3M18m356q775
$$ plain form
12379 125957 115737 102721 107823 111605 95693 104961 127068 137558 128660 133251 134977 131854 133711
12366 133711 128552 124487 110657 101061 88320 69683 78991 82182 86519 83714 81856 90958 103921
12353 103921 121799 122768 123760 114893 95975 96598 93734 116699 106634 101518 94037 92689 113172 127921
12339 127921 125445 117593 121083 118359 96603 99195 106702 101103 115597 136880 134318 110743 121642
12326 121642 139263 145045 158081 167963 178464 170087 200868 244438 250197 266827 274537 327361
12314 327361 421329 564018 786519 1108880 1425305 1610491 1751547 1855324 1775191 1403367
12304 1403367 1008806 775070 632671 541458 471680 433924 410130 386451 359751 338561 300518
12293 300518 270331 271242 253980 234072 211074 197885 207525 216913 207323 194433 194526 194944 190588 181813
12279A81813k3597L010o147j1666R508J1091k5905L90q944l832k6296l664K6025
12266A21786Q553l3037O373j54L37K7844J0182n092K518K245r156K228l01q705
12252A25621O679q174m103J0793P676O358p638q747k6797j6020K04J159q548q421
12238G0042O582J6736L0956R515M238l0094l0394R073J3570J9109o948j1752O291
12225A06924K2013j4726j8691R903o045q921N643j281k3658J5158r450Q283K2397
12212A07549j708L488o416j1450j2308k313P667P074j5526j8148l255k40P473
12199F1887K484j0749O440N363J5236n702P797j947k911J3964O019j579n639k044
12185H8619r431N968P440n47k4603j3490j1706M756J0460L265J219J2524J4002
$$ plain form
12279 181813 158216 161226 155079 143413 152921 164012 138107 138497 129553 125721 99425 95761 121786
12266 121786 130339 97302 103675 103521 103858 131702 141884 136792 139310 141555 132399 134627 134326 125621
12252 125621 132300 124126 120023 130816 138492 144850 137212 128465 101668 85648 85852 87011 78463 70042
12238 70042 76624 93360 124316 133831 138069 107975 77581 86654 100224 119333 112385 100633 106924
12225 106924 128937 114211 95520 105423 99378 90457 96100 94819 71161 86319 76869 85152 107549
12212 107549 105841 109329 102913 91463 79155 76842 84509 91583 76057 57909 54654 54414 61887
12199 61887 64371 53622 60062 65425 80661 74959 82756 80809 77898 91862 97881 96302 90663 88619
12185 88619 79188 85156 92596 92049 67446 53956 42250 47006 57466 60731 61950 74474 88476
12172H8476j5912l0159l709J9176N02r947r956o910J1618R610J0392K147R267
12159G4595J2832J2704q325o402p463L223q911j6119M436q758q44L2940r65k1681
12145F1262K408k0131j356P927N889K983M34j7838j9673k6199O729J2787R084
12132B4306M712R394J5849k216o965J1787m39r232J0795j3117p935P482N059P435
12118E6915j1941J0598J858k1700k952N407J3926J8286j2667J5806r984k232J1830
12105G3150J447j0586n174O183j0137k625j2722R75J0340J326o135p718r679P289
12091C5934k969K1333J2070j2411K517j392j0095p583j2465K5604J826l822r299
12078C9248J5989N725j3068p949l17K482K80Q678J8009J1911j3266j4970j2302
$$ plain form
12172 88476 72564 42405 38696 57872 58374 48427 38471 31561 43179 52789 63181 65328 74595
12159 74595 87427 100131 91806 85404 77941 81164 72253 56134 60570 51812 50968 83908 82943 61262
12145 61262 63670 43539 42183 50110 55999 58982 59416 41578 21905 -4294 2435 15222 24306
12132 24306 29018 38412 54261 52045 45080 56867 56428 47196 57991 44874 36939 44421 49480 56915
12118 56915 44974 55572 57430 35730 32778 38185 52111 70397 57730 73536 63552 61320 73150
12105 73150 74597 64011 58837 65020 54883 52258 39536 40511 50851 52177 46042 38324 28645 35934
12091 35934 32965 54298 66368 53957 56474 55082 44987 37404 24939 50543 52369 48547 39248
12078 39248 55237 60962 47894 39945 39628 42110 42390 51068 69077 80988 67722 52752 40450
12065D0450n22R531j5215m236J2761j047k252O389L101j0108J915R131l478j1661
12051C4759k23j4028p754J9171P524o288J8685O691k0030j5960M887j026r609
12038A6799N742J5066j1707j5985Q819M099L464K456p033J0292R500K4174n190
12025F0496p815J1174L4j0354K651Q059P568o539J616K778j0797j1286k612l757
12011D1216J3559J367J9632m849j1708m261r483O902M02Q823q411n981l426N448
11997D9230m384j4085L00N0J3403M480k9519m173R056J316J0751J3371j4152j2721
11983B2923r862J0J0789j6329J293j501J2744n39J7842J236J0505J028j3757r772
11969B6610M33J074p53j914p295O903K19J8159n199j4553q689l323K5494J590
$$ plain form
12065 40450 39928 49459 34244 30008 42769 41722 39470 45859 48960 38852 40767 49898 46420 34759
12051 34759 34536 20508 12754 31925 39449 33161 51846 58537 38507 22547 27434 26408 16799
12038 16799 22541 37607 25900 9915 18734 22833 26297 28753 21720 32012 41512 65686 60496
12025 60496 52681 63855 63889 53535 56186 64245 71813 65274 66890 69668 58871 47585 44973 41216
12011 41216 54775 56142 75774 70925 59217 54956 45473 52375 52777 61600 53189 47208 43782 49230
11997 49230 44846 30761 31061 31111 44514 48994 19475 15302 24358 25674 36425 49796 35644 22923
11983 22923 13061 13071 23860 7531 8824 7323 20067 19528 37370 38606 49111 50139 36382 26610
11969 26610 27043 28117 27364 25450 18155 25058 25277 43436 38237 23684 14995 11672 37166 38756
11955C8756k8946p194L949l460p719J9908K4595M434q794L621K9969j1005k5826
11942C2288J7119K716j3463j5855k3908L736K3695J1339J0144j4692j8728R346
11930B3737J6440J301o20L200P576P100k309j3717m599N926j3037k0717J1576
11917B1857K6149q53J2600L240k2690O227Q724j2757q407j084n293j2278q620
11904F815n463J4850j634j2836N443O189K937M497R947n018N741l63R15l081j1250
11889A7689j9835l012J2402J9633p304j803K617J0581J4253J2628J1617o756l226
11876E9484j1316k938j1695p811R177m575j8743J3540R193J8530J6731k240j4759
11863E2578j5002n950J2252R096P890n438j7730l7849l2329Q90J1726K5902J8568
$$ plain form
11955 38756 9810 2616 6565 3105 -4614 15294 39889 44323 35529 39150 69119 58114 32288
11942 32288 49407 52123 38660 22805 -1103 2633 26328 37667 47811 33119 14391 23737
11930 23737 40177 41478 40858 44058 51634 58734 56425 42708 38109 44035 30998 10281 21857
11917 21857 48006 47153 59753 62993 40303 46530 55254 42497 34090 33006 27713 15435 6815
11904 6815 1352 16202 14568 1732 7175 13364 16301 20798 30745 25727 31468 31105 32020 28939 17689
11889 17689 -2146 -5158 7244 26877 19573 17770 20387 30968 45221 57849 69466 62710 59484
11876 59484 48168 45230 33535 25724 34901 30326 11583 25123 34316 52846 69577 67337 52578
11863 52578 37576 31626 43878 52974 60864 55426 37696 -153 -32482 -31592 -19866 6036 24604
11850B4604M155N334J935M603L09j2431p897q98j1101K789P583n076n55O416r754
11835A0016n136K3906J3715O501j3149k5842o7K5078k231j8682q064r174J4193
11822A1064P412n47K5382J0345j4805j3154J9560Q062j0970j1564J2021J876j5112
11809B9570J6008j4736k3125l994M173J7944m908N547q51j9459K2154k408m358
11796B1557N287J1698R695O110o180j5965j6719L968j957j493R231R778M384q406
11782C0988l170l806O36P371j667j8375j6930P016J3051Q944M453m467J4264j382
11768C6926l832m776j296M831N290J620k2103j3247M577K8955l765j720M293n159
11754C0594O29J1608m578o425j0998j2823K1600J0024q535K49q625q664N017K122
$$ plain form
11850 24604 28759 34093 36028 40631 40940 28509 20612 19714 8613 11402 18985 13909 13354 19770 10016
11835 10016 4880 28786 42501 49002 35853 10011 9944 35022 32791 14109 6045 -3129 11064
11822 11064 18476 17929 43311 53656 38851 25697 45257 53319 42349 30785 42806 44682 29570
11809 29570 45578 30842 7717 3723 7896 25840 20932 26479 25628 6169 28323 25915 21557
11796 21557 26844 38542 48237 54347 48167 32202 15483 19451 17494 16001 25232 35010 39394 30988
11782 30988 27818 24012 24648 32019 30352 11977 -4953 2063 15114 24058 28511 24044 38308 36926
11768 36926 33094 28318 27022 31853 37143 38763 16660 3413 7990 36945 33180 31460 35753 30594
11754 30594 31223 42831 38253 31828 20830 8007 29607 39631 31096 31345 22720 14056 19073 21195
11740B1195N712p135j3479N179J9749J3090Q662j3704j2708Q31O627J4252j4791
11727C3480Q01N778K6214j8870j9206n786J5273J0537j0330j5847J1961J0717
11715D4722k6132k1118N468j9114Q476J2858K4664N520j078J6204l950p814n580
11702C3126k236O118J708k859J7594J0485j4202j6450j1406P731j0104j6367n383
11689b245J2447L81q480p492J6300K2600K7953j7233k6423j1266K507O530R651
11676B5230J4475j311R564L684K832k9900j8045j4239m552j3817K4856L2610l8
11663C1349j6808O000l893K977p754J7534J2742J2713l146k1875p293k012Q623
11650B9157L847M002K288j3483R789R818n117j496J9599j444k6782k362L293j6086
$$ plain form
11740 21195 26907 19772 6293 11472 31221 44311 52973 39269 26561 27392 34019 48271 33480
11727 33480 34281 40059 66273 47403 28197 22411 37684 48221 37891 22044 34005 44722
11715 44722 18590 -2528 2940 -16174 -7698 5160 29824 35344 34266 50470 46520 38706 33126
11702 33126 30890 37008 38716 35857 53451 63936 49734 33284 21878 29609 19505 3138 -2245
11689 -2245 10202 10583 2103 -5389 10911 33511 61464 44231 17808 6542 9049 15579 25230
11676 25230 39705 38394 47958 51642 54474 24574 6529 -7710 -12262 -26079 -1223 31387 31349
11663 31349 14541 20541 16648 19625 11871 29405 42147 54860 51714 29839 22546 20534 29157
11650 29157 33004 37006 39294 25811 35600 45418 40301 38805 58404 56960 30178 27816 31109 15023
11636A5023J994O360j1157m692Q627J1394M972J080k3849M20J4227J5795m080
11623C6114n465q125j7551L215L98j0027N409J6462R137P554k2k3001j1390J1369
11609A4077p377j7966K637J4712J3053R83J132j0723n731k582p0q91P384m030
11595D608L157R178p740m812k854q417m038J3874R327j4047j11n632J2379J4382
11581A9254J8498K918k919j1929j5701k382P6O883j9057j7529J9683K2809R863
11568C0467j8794r409J9006m124j8052m960J9139J1760k606j311K161j3117J4964
11555B5124j3385O273J0530j878J0563Q932l1155J525J1252J7022J9035J48q437
11542E5549o014j6000Q562N400p628q698m654Q73j875O227J1739J54o985O966
$$ plain form
11636 15023 17017 23377 12220 7528 16155 27549 32521 33601 9752 10172 24399 40194 36114
11623 36114 30649 22524 4973 8188 8586 -1441 3968 20430 29567 37121 37099 14098 2708 14077
11609 14077 6700 -11266 -8629 6083 19136 20119 21251 10528 4797 2215 2145 1254 8638 4608
11595 4608 7765 16943 9203 4391 1537 -6880 -10918 2956 12283 -1764 -1875 -7507 4872 19254
11581 19254 37752 40670 37751 25822 10121 7739 7815 14698 -4359 -21888 -2205 20604 30467
11568 30467 11673 2264 21270 17146 -906 -5866 13273 25033 22427 21116 23277 10160 25124
11555 25124 11739 18012 28542 26664 37227 46159 15004 16529 27781 44803 63838 63986 55549
11542 55549 49535 33535 42097 47497 39869 31171 26517 27390 25515 31742 43481 43635 36650 43616
11528D3616j631n488N511M685m930q224J6702Q874j0491j7566m677k802n877P611
11514B5313o195r722j8190p561n281o807P719J2715K1604O603j0449J2417Q349
11501C0515M457Q987o97j7880j6888o174j4709O067Q739K6042q774P408K3287
11488E0380j2628p640j5783j319L633P411o33j3563k3547p129O572J1325M520
11475A599o845k82P887j4926j5192J0374J3965q919M044M503K4456J7292j4146
11462B3810k6077Q541o638j07R345J6250k2486j4173o006j992n270O535J5296
11449b972J3160J3835j370k406j0358j0316k2283J924K9509L410J2798p225J0673
11436B8379K3730j503n949q579q236M465m056R104J5000P297q95j3005L774j8818
$$ plain form
11528 43616 41985 36497 42008 46693 41763 33539 50241 59115 48624 31058 26381 23579 17702 25313
11514 25313 19118 9396 -8794 -16355 -21636 -28443 -20724 -8009 13595 20198 9749 22166 30515
11501 30515 34972 43959 43262 25382 8494 2320 -12389 -6322 2417 28459 19685 27093 50380
11488 50380 37752 30112 14329 13010 16643 24054 23421 9858 -13689 -20818 -14246 -2921 1599
11475 1599 -5246 -5528 2359 -12567 -27759 -17385 -3420 -12339 -8295 -3792 20664 37956 23810
11462 23810 -2267 6274 -364 -471 8874 25124 2638 -11535 -17541 -19533 -24803 -18268 -2972
11449 -2972 10188 24023 22653 20247 9889 -427 -22710 -20786 8723 12133 24931 17706 28379
11436 28379 52109 50606 44657 36078 27842 32307 28251 37355 52355 59652 58757 45752 49526 30708
11422C0708q532m824J3925m611Q27M949n173J020j4994p789K9936J4447j3021
11409C6868l2704q390K1212J0057k299j5089j034P480J6547J4135j2432n939j1645
11396A6767j1797J2715R529n181n802o493O84R842o891j0895J5099J7541k057
11383C3061j0484l971M860p002j6237J0023J386n558J1022l53K3302L945o345
11370C7649m350J0441P557j8407j1234j0504q747o00M965J5717N950j8265p668
11357B504J6273M860q621j8535o903N966K1506K6460l735q741N713P416j9744
11344B4419j7249M724J3304j4940p239J6643K049o387j550r344Q759r322l542
11331C25J4898j3789k5100K5262J5572L509J6562K2018Q827O24l8520J625J5161
$$ plain form
11422 30708 22176 17352 31277 26666 27493 32442 27269 28289 13295 5506 35442 49889 36868
11409 36868 4164 -4226 16986 27043 24744 9655 8621 16101 32648 46783 34351 28412 16767
11396 16767 4970 17685 27214 22033 16231 9738 10422 20264 13373 2478 17577 35118 33061
11383 33061 22577 18606 23466 16464 227 10250 11636 6078 17100 16747 40049 43994 37649
11370 37649 33299 43740 51297 32890 21656 11152 2405 1805 6770 22487 28437 10172 2504
11357 2504 18777 23637 15016 -3519 -10422 -4456 17050 43510 39775 31034 36747 44163 24419
11344 24419 7170 11894 25198 10258 3019 19662 21711 15324 13774 4430 13189 3867 325
11331 325 15223 1434 -23666 1596 17168 20677 37239 59257 68084 68708 30188 31813 46974
11318D6974j8470l1788j2841P357O183M234K2541J970k903O15R969j8155n539
11305A0147J4464p853j1074o700J743m481l546M008J705J6990j0047j2619J6892
11292I629J1550q717K44J2849Q386j3373j9143j6614J2702l322j606R819M617
11279G021o444l959P169j1428o98P017K0012K0267J0831j8959j0621p509m061
11266H638k693M762N577J0151o585R07j2123j4419r27N2j7852r813l891J2533
11252b5683K2264J075P289Q045n142k356O305N488P164K2158o078k4489j2153
11239C887j9390J618l846J397o117J4431K7150o524j5390j8993P835J5820Q69
11226B747J0262J9194J275o266q117k0800K858J6626j1830l215Q348O657j4567
$$ plain form
11318 46974 28504 -3284 -16125 -8768 -2585 1649 24190 26160 23257 23872 33841 15686 10147
11305 10147 24611 16758 5684 -1016 727 -3754 -7300 -3292 -1587 15403 5356 -7263 9629
11292 9629 21179 12462 12706 25555 33941 20568 1425 -15189 -2487 -5809 -7415 2404 7021
11279 7021 577 -3382 3787 -7641 -8339 -1322 18690 38957 49788 30829 20208 12699 8638
11266 8638 5945 10707 16284 26435 19850 20757 8634 -5785 -6712 -6660 -24512 -34325 -38216 -25683
11252 -25683 -3419 -2344 4945 12990 7848 5492 11797 17285 24449 46607 40529 16040 3887
11239 3887 -15503 -13885 -17731 -16334 -22451 -8020 19130 12606 -2784 -21777 -13942 1878 2747
11226 2747 13009 32203 33478 27212 19095 -1705 1153 17779 5949 2734 11082 17739 3172
11213C172j2280J3004J7603J5607Q043j6174Q843J242j0159J8527L098k1744j6215
11200A2567L742P179n206n378q674j1345j6063J0524K0817K0334l582p454J336
11187A8797J3737j2847L165J704l593J1807j0177J288P363q619l3059K174R433
11174A173q175j1548J303j0114P606O686J5042m440O275l052j4923o355J802J9434
11160G14O812P003l590Q082K485j1069k5028j596J1912J3543j0944j2674N150
11147i200J791j3493P838Q829N223j2032Q543o60q00J6906K3444j3909l5903n447
11133a8870K2063J0209R935j2459q333J0230j4762J2897M942n656o23P030J790
11120A8393n322n957J0131n05k429L981k2902R331K9727q382j0914P87Q137j7063
$$ plain form
11213 3172 -9108 3896 21499 37106 45149 28975 37818 39060 28901 47428 50526 28782 12567
11200 12567 16309 23488 18282 12904 4230 -7115 -23178 -12654 8163 28497 24915 17461 18797
11187 18797 32534 19687 22852 24556 20963 32770 22593 23881 31244 22625 -10434 -8260 1173
11174 1173 -7002 -18550 -17247 -27361 -19755 -13069 1973 -2467 3808 756 -14167 -20522 -18720 714
11160 714 7526 14529 10939 19021 21506 10437 -14591 -16187 -4275 9268 -1676 -14350 -9200
11147 -9200 -7409 -20902 -13064 -4235 988 -11044 -2501 -3161 -3961 12945 36389 22480 -13423 -18870
11133 -18870 3193 13402 23337 10878 2545 12775 -1987 10910 15852 10196 9573 16603 18393
11120 18393 13071 7114 17245 16740 14311 18292 -4610 4721 34448 26066 15152 15939 24076 7013
11106G013k7003j1803J1438O746J8876n063n358R737R983j561q060J6382K323
11093B3650j5497j5116P61k1424K33j1243J0164K2648J9252o847m340J1198M066
11080A7505O09R066L900K704j8579k2376N23Q865R921k02m053o77K040Q437N397
11065B3080K218L585J1972P954j5772r351k3221m382J4906Q892j3275j6110J3027
11052C523J7025n865o751O688J138l806Q375K3048j0862k8127j6324k4317m624
11039d0879J9564Q500k34N63J4918N287J4029j1287n208r862J2261j4849j0332
11026a7529Q653N765Q64j6209K0160R638k136k2441P585O166K578J0349j7720
11013d277j7395N874J2704J100p882N448j471J7122Q453j695K972L968k1053j2242
$$ plain form
11106 7013 -19990 -31793 -20355 -13609 5267 204 -5154 4583 14566 13005 4945 21327 23650
11093 23650 8153 -6963 -6202 -27626 -27393 -38636 -28472 -5824 13428 6581 2241 13439 17505
11080 17505 18114 27180 31080 33784 15205 -7171 -6648 2217 12138 11936 7883 7206 9246 17683 23080
11065 23080 25298 28883 40855 48809 33037 23686 465 -3917 10989 19881 6606 -9504 3523
11052 3523 20548 14683 7932 14620 15758 11952 20327 43375 32513 4386 -11938 -36255 -40879
11039 -40879 -21315 -12815 -13049 -12486 2432 7719 21748 10461 5253 -4609 7652 -7197 -17529
11026 -17529 -8876 -3111 -2247 -18456 1704 11342 9206 -13235 -5650 516 3094 13443 -4277
11013 -4277 -21672 -15798 -3094 -1994 -9876 -4428 -5899 11223 19676 17981 20953 24921 3868 -8374
10999h374O929J3248j0108Q616M782j3791N488M489J778n632O384l259j5849O009
10985G10J3744J998J2726Q736o002j1444j0216j8600qN904N575J724p852N201
10971B196p076k698J9526j0417k392J3618J0223J17l867k559P698J322j5033J5981
10957B6639O323k1145q815J7254j1753j2487n552R467R549R496Q457p361j2145
10944G927J3823n209j5056j6258o768R697K6804k0795N702j652M343L486j6619
10931a0575J2893M5509J1972j7146k2694j6625J1232J1637K4727J6586j953q595
10919E6968k9547j5736L197K299K148p727j0169J338K211Q060l468K601K0114
10906C2289J7097P215m915n196Q946m950k8645j2713L337m114l348o40n014J1406
$$ plain form
10999 -8374 -1445 11803 1695 10311 15093 1302 6790 11279 13057 7425 13809 10550 -5299 710
10985 710 14454 16452 29178 37914 31912 20468 10252 -8348 -8356 -2452 3123 4847 -3005 2196
10971 2196 -4880 -7578 11948 1531 -861 12757 22980 23097 19230 16671 24369 25691 10658 26639
10957 26639 32962 11817 3002 20256 8503 -3984 -9536 -69 9480 18976 27433 20072 7927
10944 7927 21750 16541 1485 -14773 -21541 -11844 14960 -5835 -133 -1785 2558 6044 -10575
10931 -10575 2318 47827 59799 42653 19959 3334 14566 26203 50930 67516 65563 56968
10919 56968 27421 11685 14882 17181 19329 11602 1433 2771 4982 13042 9574 12175 32289
10906 32289 49386 56601 51686 46490 55436 50486 21841 9128 12465 8351 5003 4363 -651 10755
10892A0755J6251j4793j497j1415J2499L316M383M279j1353j479J796K400j725
10879A3417j6185J733k494J5778O217q32p818N035j644J1522j0443K49J2719J0758
10865C8012j296l874n244j0372P386M078j5889R338P05J1833o858m52j3506P058
10851B0919m895k723p146K341R285j131Q954J9495J0116n8q373k3885k5574k251
10837d926j6023m931J4376Q873M160r40j1485k654J1039J6861j0075k3688J982
10824a7431L6233J0054j0516J1351O781j3441N226j1958j859l502k4230K401J0623
10811b68M961q85k345j668J0773J0785r800o597m812k305K8708Q99P646L394r331
10796B9155p43N953P496k3945q197P108N924J2984o540O593N289l4J659k4664
$$ plain form
10892 10755 27006 12213 10716 -699 11800 15116 19499 23778 12425 10946 12742 15142 13417
10879 13417 -2768 -1035 -3529 12249 18466 17634 9816 14851 13207 24729 14286 14535 27254 38012
10865 38012 36716 32842 27598 17226 24612 28690 12801 22139 22844 34677 27819 27367 13861 20919
10851 20919 16024 13301 6155 8496 17781 16650 25604 45099 55215 55157 46784 22899 -2675 -4926
10837 -4926 -20949 -25880 -11504 -2631 1529 589 -10896 -13550 -2511 14350 4275 -19413 -17431
10824 -17431 18802 28856 18340 29691 36472 23031 28257 16299 14440 10938 -13292 -10891 -268
10811 -268 4693 3808 1463 -205 10568 21353 11553 4956 144 -2161 26547 27446 35092 38486 29155
10796 29155 28412 34365 41861 17916 9719 16827 22751 35735 29195 35788 41077 41043 42702 18038
10782A8038O039L48k945o311j9434P540N295j1406Q34J3529j997N856o763o072
10768B551N219J0461Q151M632k978j9557j9254p481N320k1183k703L4091R424
10755F693p230p160N34J085R481R814N844j0100j4146l607N187l552O661K3790
10741B3294j2764k1731j8729O394J5339L595N949J383r603j0402P533M533J0741
10728E532p044j9075n837Q033J9968j3136J578J763J490R657o994j165N296k13
10714a47n365J04L053l543R712J4023P981r336k4479q668J2832j0838l269K9860
10700A1920J0250J2634q013J060j1034n813j4261J1403p3R693L959l36J4632k655
10686C3366j7252k927j2865P648J9799L971j1649r202k5106m276j0735M705J6387
$$ plain form
10782 18038 24077 24425 21480 15169 -4265 3275 8570 -2836 -2002 11527 9530 15386 8623 2551
10768 2551 7770 18231 26382 31014 28036 8479 -10775 -18256 -12936 -34119 -36822 -2731 6693
10755 6693 -537 -7697 -7163 -6078 3403 13217 19061 8961 -5185 -8792 -3605 -7157 -496 23294
10741 23294 10530 -11201 -29930 -23536 -8197 -4602 1347 2730 -6873 -17275 -9742 -5209 5532
10728 5532 -1512 -20587 -26424 -18391 1577 -11559 -9981 -8218 -6728 2929 -4065 -5230 66 -147
10714 -147 -5512 -5408 -2355 -5898 3814 17837 25818 16482 -7997 -16665 -3833 -14671 -17940 11920
10700 11920 22170 34804 26791 27851 16817 11004 -3257 8146 8073 17766 21725 21389 36021 33366
10686 33366 16114 13187 322 7970 27769 31740 20091 10889 -14217 -18493 -29228 -24523 -8136
10673h136N44Q56J0978M441K4724J3156j5696k8608p698J2129n119k147j1902
10660a2478o212Q126R730M786J1111K800Q863R731p586R33K280j6117j5770L214
10646C411J1593J470r790l241m607k1443n873R625K7497K4697n60J0888j9862
10633B3805k636J4952j5047l713k2661K201j984R632J164L088l09j650J1118L281
10619B1241o921m33Q74N635N878k3582j7388J114J2175K3890J2652q456J5256
10606D1935M313r958R90r006P032o602q52p328J698M395j041N885l1j588J9681
10591D9523M615j6114k4031p21j3228j3527O874l75q869p562J6655J5030M013
10578A2283j9989J3732r144j8902O850J5863K6K0516O089m408Q62k3935k5632
$$ plain form
10673 -8136 -7592 -6736 4242 8683 33407 46563 30867 2259 -5439 6690 1571 -576 -12478
10660 -12478 -18690 -10564 -834 3952 15063 17863 26726 36457 28871 29804 32084 15967 197 3411
10646 3411 15004 16474 6684 3443 -1164 -22607 -28480 -18855 8642 33339 32779 43667 23805
10633 23805 21169 36121 21074 17361 -5300 -3099 -5083 4549 5713 8801 8492 6842 17960 21241
10619 21241 14320 13887 14761 20396 26274 2692 -14696 -13582 -1407 22483 35135 26679 41935
10606 41935 46248 36290 37280 28274 35306 28704 27852 20524 22222 26617 25576 31461 31430 29842 49523
10591 49523 54138 38024 13993 13272 44 -13483 -6609 -6984 -15853 -23415 -6760 8270 12283
10578 12283 -7706 6026 -3118 -22020 -15170 693 719 21235 27324 22916 23778 -157 -25789
10565b5789K6695J5770k4079p560J9672M482J187j1992J5799N170J0063J6331
10553D5749M886J7609Q137j0278Q54J4785o976r772p868j0232K795J092K311j0346
10539D2746J8096q795j2320j0886j1700j5007j450K704k866R79l350J4166J2838
10526B5155L4264j4845k0619j0935j6768K668n301j0166O848L351o23o902j957
10513a5830J6949m513k76L6104J5815k6645Q182R757J9848J4369M065J5055q226
10500H4654j3864j1605j8969K284K884j8993k9658q715R653O222j237J1543q96
10487A3303m066j0764J0205j2981J7695Q852j5288o125o231j787N968j6645R403
10474h461p333J1259R379n563o81j843o721m979R047J1799J1951Q444m590R995
$$ plain form
10565 -25789 906 16676 -7403 -14963 4709 9191 10378 -1614 14185 19355 29418 45749
10553 45749 50635 68244 76381 66103 66957 81742 74766 64994 57126 46894 49689 50781 53092 42746
10539 42746 60842 52047 39727 28841 17141 2134 684 3388 522 1501 -1849 12317 25155
10526 25155 59419 44574 23955 13020 -3748 -1080 -6381 -16547 -9699 -6348 -6971 -13873 -15830
10513 -15830 1119 -3394 -3670 32434 48249 21604 29786 39543 59391 73760 77825 92880 84654
10500 84654 70790 59185 40216 42500 45384 26391 -3267 -11982 -2329 3893 2656 14199 13303
10487 13303 9237 -1527 8678 -4303 13392 22244 6956 831 -5400 -7187 -1219 -17864 -8461
10474 -8461 -15794 -4535 4844 -719 -1400 -3243 -9964 -14943 -5896 5903 17854 26298 21708 31703
10460C1703J1745Q270o308K0444k409q297N870l673O322l987l9004k0533m425
10447d282q021J027J6195K377o969J0071N27J2260P42j8726L786n972K0624O334
10433B9973j3897j4690J6675L414K473r639k093J5975Q572j6656L625J5978k9514
10420A0196k1151J0405j2155r66M359J985R262j1399O234j8454L05K6706M236
10407I563M825N204K2892J9574J1304O24J0906K4065L5669L4087J4799J4004j649
10394B05867p600q892n911l3910k5500j598q360k0093j5042j3225j6702l930n196
10381C9908M136j2874k0575r185L168R464P275J043j0735n794k6401K8941J0605
10368A8976J205j1489o965m4m840R889R934J2333M900M142Q849J3167J5353J2216
$$ plain form
10460 31703 43448 51718 45410 65854 63445 55148 61018 57345 63667 59680 20676 143 -4282
10447 -4282 -12303 -11276 4919 7296 327 10398 10925 23185 23927 5201 8987 3015 23639 29973
10433 29973 16076 1386 18061 21475 23948 14309 12216 28191 36763 20107 23732 39710 10196
10420 10196 -10955 -550 -12705 -13671 -9312 -7327 1935 -9464 -3230 -21684 -21379 5327 9563
10407 9563 14388 19592 42484 62058 73362 73986 84892 108957 144626 178713 193512 207516 205867
10394 205867 198267 189375 183464 149554 124054 122456 114096 94003 78961 65736 49034 45104 39908
10381 39908 44044 31170 10595 1410 4578 14042 21317 22360 11625 5831 -20570 8371 18976
10368 18976 20181 8692 1727 1683 -3157 6732 16666 28999 33899 38041 46890 60057 75410 87626
10354H7626N231J2517J1549R275R625R521k1528l2342k1040j4122K546k2107k1256
10341A5495J917K9748P495n268j6167j4607Q764J3127M144o195j8849j3907q212
10328b515j3801l686K2184L8073j2343k2917K866K5926j6830L041L72j3820j3556
10315g006n432J2739J8877l50J601P155j207l1462j3632J1062J1986j1978O086
10302a561J6067k2244k366J4859n984O744K230J7499J0201k6837m1973L514J738
10289b8113L885K8756J482k29K6612J5234j4866j8046P531r007k9286m647J8577
10276b117L759j61J0781J3689k000J635L329K485n369J0338j6833j519j04j837
10262A6076J591N824J8985J4945j388j094J9761M8017K5493r015n299j5188j1925
$$ plain form
10354 87626 92857 105374 116923 126198 135823 145344 123816 91474 70434 56312 58858 36751 15495
10341 15495 17412 47160 54655 49387 33220 18613 27377 40504 44648 38453 19604 5697 -2515
10328 -2515 -16316 -20002 2182 40255 27912 4995 7861 33787 16957 19998 20370 6550 -7006
10315 -7006 -12438 301 19178 18828 20429 27584 26377 -5085 -18717 -7655 4331 -7647 -1561
10302 -1561 14506 -7738 -10104 4755 -1229 5515 7745 25244 35445 8608 -33365 -29851 -28113
10289 -28113 -24228 4528 6010 5781 32393 47627 32761 14715 22246 13239 -16047 -20694 -2117
10276 -2117 1642 1481 12262 25951 23951 25586 28915 31400 26031 36369 19536 18017 17913 16076
10262 16076 17667 23491 42476 57421 56033 54939 74700 122717 148210 139195 133896 118708 106783
10249A06783k3850j6643j7890p547m379k0860l141P958P750J239j155R220k54
10236C7231j7910r650K74n988p96r738j317N783j634j488M5n1N144O080M319J2352
10220B2656j2993J3455n208k5425l13Q070P24j3924J6874N577K3421J2496n55
10207D4855Q678J945k6014j0858K93m270L943M849j5336J6927J2105j0891P875
10194C4101j0085j0561N527R047J0927Q996L677J0588R61O353m16O444O613n809
10180G6363j0237k7440l7249k766R540l738m513j956j184O598m48k024j1617j1594
10166b2265K0190O13N754m776n419m932p604k9737J4481J9848J1140O473o035
10153b269m383K795K713J0119O696R430L081j9850p186K964n646N3M329r130M677
$$ plain form
10249 106783 82933 66290 48400 40853 36474 15614 12473 20431 28181 29420 28265 37485 37231
10236 37231 19321 9671 9945 3957 3161 -6577 -7894 -2111 -3745 -5233 -5188 -5239 -95 5985 10304 22656
10220 22656 9663 23118 17910 -7515 -7828 242 966 -12958 3916 9493 32914 45410 44855
10207 44855 53533 55478 29464 18606 18899 14629 18572 23421 8085 25012 37117 26226 34101
10194 34101 24016 13455 18982 28029 38956 47952 51629 62217 63178 69531 69115 75559 82172 76363
10180 76363 66126 38686 1437 -1329 8211 4473 -40 -1996 -3180 3418 2970 946 -10671 -22265
10166 -22265 -2075 -1462 4292 -484 -5903 -10835 -18439 -48176 -33695 -13847 -2707 3766 -2269
10153 -2269 -6652 -3857 -1144 8975 15671 25101 28182 8332 1146 4110 -1536 -1483 2846 -6284 -1607
10138a607O569j033o680J2808M669j125j5380k3143O969K1345L0856K9262J0784
10125G4294J7432J5553J4605P815O00l942k9150k4423J0339J4094R636r034Q648
10112A06467m895l035k837j6407j8420j3935l472k326q725j1733k2887J4281J3023
10099B5099Q658k3489J0296Q628p677m118m270M898Q011l41k5059J844O788j5125
10085e857O248J5464K5199O442M791q509o006M374j5497j1699j2737j676r026
10072h489J2987P429K807L795Q08J4654J2834j0361j5413m655K143n6k149m8m534
10057A1752j6329j636r387J4595Q858P249N217k998r721R03j582N568N653J3582
10043C1724j3660j3335R338n866J0562J6395N346n149j5646l310j8743O971j8768
$$ plain form
10138 -1607 4962 3929 -2751 10057 14726 13601 -1779 -24922 -17953 3392 34248 63510 74294
10125 74294 91726 107279 121884 129699 130299 126357 97207 72784 83123 97217 106853 97819 106467
10112 106467 101572 98537 95700 79293 60873 46938 43466 41140 32415 20682 -2205 12076 25099
10099 25099 33757 10268 20564 29192 21515 17397 13127 18025 26036 25695 636 2480 9268 -5857
10085 -5857 391 15855 41054 47496 52287 43778 37772 42146 26649 14950 2213 537 -8489
10072 -8489 4498 11927 14734 18529 19337 33991 46825 36464 21051 16396 18539 18483 16334 16286 11752
10057 11752 -4577 -6213 -15600 -1005 7853 15102 20319 17321 7600 8503 6921 12489 18142 31724
10043 31724 18064 4729 14067 8201 18763 35158 40504 35355 19709 16399 -2344 4627 -14141
10030a4141k3459P989K2580J7347K013j5697J935L167j865j1856m138J0239J7779
10017A1893j161m946m794K1651k083p660L203j0007j0630O23L152P884j5257R095
10003I63K1068j8031j2992m291O786K1217N511N428q056j8791p722p478L802k3739
9989c6325M488J7229N934R115L892J453J2014n123k403O07J6474M222q787k9706
9975f916j0259O497J7963q673j1764p082P335M823P764J1509M433J0822J8774
9962D5226n97n829q777k1491n156m569M323k258M26J1867j0534o249K5664J0466
9948C2512o051j0784r659j0645R291o826j1445O562L853P321J3445m924j755o947
9934C948r272O810m825j007k067o935O090j1277M450K2028J2079Q902j0427j5206
$$ plain form
10030 -14141 -37600 -29611 -7031 10316 12329 -3368 -1433 1734 -131 -11987 -16125 -5886 11893
10017 11893 10732 5786 992 22643 20560 12900 16103 6096 -4534 -3911 -759 7125 -8132 963
10003 963 22031 4000 -8992 -13283 -6497 14720 20231 25659 17603 -1188 -8910 -16388 -12586 -36325
9989 -36325 -31837 -14608 -8674 441 4333 5786 17800 12677 10274 10881 27355 31577 22790 -6916
9975 -6916 -17175 -10678 7285 -1388 -13152 -20234 -12899 -8076 -312 11197 15630 26452 45226
9962 45226 44629 38800 30023 8532 3376 -1193 3130 872 1298 13165 2631 -3618 22046 32512
9948 32512 26461 15677 6018 -4627 4664 -2162 -13607 -7045 -3192 4129 17574 12650 10895 3948
9934 3948 -5324 1486 -3339 -4346 -6413 -13348 -7258 -18535 -14085 7943 20022 28924 18497 3291
9920C291P406j2063L584j4104n834O159R975J0662KJ972q968j1953J814J5112
9906G055K2591k837N721O571k2756q882j198l0362p160n196J3077K1195L498P323
9892H640J1050n670j2339J89j4740J637j0105m010J6741J053J3925J7491m270
9879A9592J3975J8463R823J8897J1599L1790J0125M288J8047L716J7053r660Q60
9866A68568O024j0310j0126j7807m201k5572k7646q564r242j1995j2211k7566
9854I352m742m803o602L866L212P305k692k0953r01R700K1189J6575l582K53j68
9839B7009j4321Q734Q541l333P860K906j8933k6064j4078k606N688J6997R149
9826G549k0406k7170J2611J6730Q872o894n999J9561K293k2376q9L027M255J589
$$ plain form
9920 3291 10697 -1366 2218 -11886 -17720 -11561 -1586 9076 9078 11050 2082 -9871 -8057 7055
9906 7055 29646 26809 32530 39101 16345 7463 6265 -24097 -31257 -36453 -23376 -2181 1317 8640
9892 8640 19690 14020 1681 1870 -12870 -11233 -21338 -25348 -8607 -7554 6371 23862 19592
9879 19592 33567 52030 61853 80750 92349 124139 134264 138552 156599 160315 177368 167708 168568
9866 168568 174592 164282 154156 136349 132148 106576 78930 70366 61124 49129 36918 9352
9854 9352 4610 -193 -6795 -2929 283 7588 4896 -16057 -16958 -7258 13931 30506 26924 27177 27009
9839 27009 12688 21422 29963 26630 34490 37396 18463 -7601 -21679 -24285 -18597 -1600 7549
9826 7549 -12857 -40027 -27416 -10686 -1814 -8708 -14707 4854 7147 -15229 -15318 -12291 -8036 -6447
9812f447N714K1411K9230j6581j1353o15o076M569j5508j1922r840n260k370l23
9798b5371j0973K321J8312K6020k752n843k2832m857N709J8274l804p138K0712
9785G778J2374j5282k6942r564K0718K6422J7423j1296Q021Q470r014j2934R104
9772B5278k519J4807K918k2433n477k946j2221J229J6688P544J2797p001j9239
9759I425m297N014o437l952N302Q890K7835K1484j9128j3063l807Q453L3147k3037
9745D5829j0862L873O567R43o541j3963N379J473J0q820k2984M337J3912m427
9731A4726L257m215J7282n698n255J2322j1200j1997Q12j8083j3016K2187L1056
9718C2178J8106k9298j4868K0246J9183M658p441Q48j0096l7568k503J7509L686
$$ plain form
9812 -6447 -733 20678 49908 33327 21974 21359 15283 19852 4344 -7578 -17418 -22678 -25048 -25371
9798 -25371 -36344 -34023 -15711 10309 7557 1714 -21118 -25975 -20266 -1992 -5796 -12934 7778
9785 7778 20152 4870 -22072 -31636 -10918 15504 32927 21631 29652 38122 29108 16174 25278
9772 25278 22759 37566 40484 18051 12574 9628 -2593 -1364 15324 22868 35665 28664 9425
9759 9425 5128 10142 3705 -247 5055 13945 41780 63264 44136 31073 27266 35719 68866 45829
9745 45829 34967 38840 45407 46350 39809 25846 31225 32698 32708 23888 904 5241 19153 14726
9731 14726 17983 13768 31050 25352 20097 32419 21219 9222 10034 -8049 -21065 1122 32178
9718 32178 50284 20986 6118 26364 45547 50205 42764 43612 33516 -4052 -6555 10954 14640
9705A4640r524r841r1r455J789p352p20P562R706R977R134o465m305N653m235
9690F473o351l395r482L679J211j3917l206m871K3449J8515m993n839M910m352
9676A831R652q015j3919j4074J7618J3702q089q38K8835j918k1477Q076J0556
9663B1940k1141o298J2057J2573K2981j47l6197k7329n937Q018J2923J14L46J13
9649e984J748r40r162Q823K3308J2418j5177n884N905l224l346J270L653r047
9635D361n05K2639j4222j2122J9938K4979j7470j0175j5856J803J8922N819j6838
9622A1273k0416m696l433R922Q16n494Q7j4068J6960L5154K111l1315J1427n474
9608B854P045q35j6937r940n933J2132J4279J1305q042l4522n539j768K667P350
$$ plain form
9705 14640 5116 -4725 -4816 -14271 -12482 -19834 -20554 -12992 -3286 6691 15825 9360 5055 10708 6473
9690 6473 122 -3273 -12755 -9076 -7865 -21782 -24988 -29859 -6410 12105 7112 1273 6183 1831
9676 1831 11483 3468 -10451 -24525 -6907 6795 -1294 -2132 26703 24785 3308 11384 21940
9663 21940 799 -5499 6558 19131 42112 41965 5768 -21561 -27498 -19480 -6557 -6443 -6097 -5984
9649 -5984 -4236 -5176 -14338 -5515 17793 30211 15034 9150 15055 11831 8485 9755 13408 4361
9635 4361 3856 26495 12273 151 20089 45068 27598 17423 1567 3370 22292 28111 11273
9622 11273 -9143 -13839 -17272 -7350 -6534 -12028 -11941 -26009 -9049 26105 28216 -3099 8328 2854
9608 2854 9899 9064 -7873 -17813 -23746 -11614 2665 13970 5928 -28594 -34133 -35901 -33234 -25884
9594b5884N125J928l091N625R649J0405n077j2452k1443O010J1408P604q893L002
9580a6084J2157r513n460J526p522Q648J4297J5024r907n158J0613P418o449k6300
9566a6710j1096k677j5719J7667J2909p550J0410J3778L309L70O621k1090j3742
9553b3520O321J3563n910k912M65O471K4511q973l070J0745j3657Q439k850r98
9539H625L005p247r274j921o84j0398J8803J7809R863l692P216k2190j2387J6864
9525A4392K3812J629j4140j3640k1230O950O911j5612Q016M608j985o64R651l227
9511E471j9988R278o624j1135j5035l057K5848J3179J7010j6623n412J1766j1675
9498f997Q583K4784j623k3553j347J253j0615J3012K296n308L657P512n723n424
$$ plain form
9594 -25884 -20759 -18831 -21922 -16297 -6648 3757 -1320 -13772 -35215 -29205 -17797 -10193 -19086 -16084
9580 -16084 -3927 -13440 -18900 -17374 -24896 -16248 -1951 13073 3166 -1992 8621 16039 9590 -16710
9566 -16710 -27806 -30483 -46202 -28535 -15626 -23176 -12766 1012 4321 4691 11312 -9778 -23520
9553 -23520 -17199 -3636 -9546 -12458 -11993 -5522 18989 10016 6946 17691 4034 12473 9623 8625
9539 8625 11630 4383 -4891 -6812 -7496 -17894 909 18718 28581 24889 32105 9915 -2472 14392
9525 14392 38204 39833 25693 12053 -9177 -2227 4684 -10928 -2912 1696 -289 -953 8698 5471
9511 5471 -14517 -5239 -11863 -22998 -38033 -41090 -15242 -2063 14947 -1676 -7088 4678 -6997
9498 -6997 1586 26370 24747 1194 -153 1100 -9515 3497 5793 485 4142 11654 5931 507
9484E07k3170k4982m066J7262N408j3160N438O460J53J4273N784R759K1854k983
9470A8537j4248n373Q158q052p139j4777J1752N994J7433K91O16m490j854P62
9456G610j9190J108J1635k5836L781K5062L901q2L816j0112O11J3459Q862j6774
9442G851k458Q388k1046p250r615j1233J9378Q316j4555J7722p845p256R555J2950
9428B902M701J706m173o883j2611j6398J2964p754J1441j803J7609P068j7411
9415h642k0284J2397K0704J5237N389j771j8659k0790j956L358P450r331R645
9402g253L785K221J064K569K753Q62j2350M413N176k5444l991M1978Q884k176
9388B2491R18K316r410j3840R925l642q720r56Q664J8562j1505j8185q726J4809
$$ plain form
9484 507 -22663 -47645 -51711 -34449 -29041 -42201 -36763 -30303 -30150 -15877 -10093 -334 21520 18537
9470 18537 4289 -1084 7074 -978 -8117 -22894 -11142 -5148 12285 12576 13192 8702 6848 7610
9456 7610 -11580 -10472 1163 -24673 -20892 4170 8071 7989 11805 1693 2304 15763 24625 7851
9442 7851 5393 13781 -7265 -14515 -24130 -35363 -15985 -7669 -22224 -4502 -12347 -19603 -10048 2902
9428 2902 7603 9309 5136 -1747 -14358 -30756 -17792 -25546 -14105 -15908 1701 8769 -8642
9415 -8642 -28926 -16529 4175 19412 24801 23030 4371 -16419 -18375 -15017 -7567 -16898 -7253
9402 -7253 -3468 -1247 -183 2386 5139 6001 -6349 -1936 3240 -22204 -26195 15783 24667 22491
9388 22491 23409 25725 16315 2475 12400 8758 38 -918 7746 26308 14803 -3382 -12108 2701
9374B701K2583O855j59k743j2480O489j033j6122j0043P175R493M018j9869j3652
9360a6787J4175M054o48n067r23L910K2363K277j164q514j5544j332j0801Q139
9346e862j0864N453K586L644o534o128L40J2879m329M08p084M164J6218R871K387
9331A7149L154k335j1389j7506k082N583J9676J2063p834j6816j3658r669l934
9318b7598J8284Q020j6903l2230j0258K9793M1679r667Q229L431J0388K2497R901
9305E5566r319k3354j4862R52k3699K259J4117p385n970R364K1159N570K189P024
9291C3611r604l4711O971n27m770O01R381k3332m677N751J1613K4741M132j9367
9277a87r551N805k994q574m270j023K246J7776K1736k448j6983J3555N512j1735
$$ plain form
9374 2701 25284 32139 31980 29237 16757 23246 22213 6091 -3952 3223 12716 16734 -3135 -16787
9360 -16787 -2612 1442 794 -4273 -5196 -1286 21077 23354 22190 13676 -1868 -3200 -14001 -5862
9346 -5862 -16726 -11273 -8687 -5043 -11577 -17705 -17365 -4486 -8815 -8407 -15491 -11327 4891 14762 17149
9331 17149 20303 17968 6579 -10927 -13009 -7426 12250 24313 16479 -337 -13995 -23664 -27598
9318 -27598 -9314 -1294 -18197 -50427 -60685 -30892 10787 1120 9349 12780 23168 45665 55566
9305 55566 46247 22893 8031 8983 -14716 -12457 1660 -5725 -11695 -2331 18828 24398 26587 33611
9291 33611 24007 -10704 -3733 -4260 -9030 -8429 952 -22380 -27057 -21306 -9693 15048 19180 -187
9277 -187 -9738 -3933 -6927 -15501 -19771 -20794 -18548 -772 20964 18516 1533 15088 20600 8865
9263H865l1180j0701J7957J4711r542q391n246J5737K841K6106J1541O053K320
9250D1071j9045k5420j8379O210k61J038P590K729j0296N872N300R189O38J552
9236G788j5996k958J2933l688j1264r123K7242J3013k364o13p725J997l032k0259
9222a4049K1580J7143o74k1890j700J3665L491o262k5224r143j94J6425J6194
9209I362O508p148J3632J5089J1988j5559j3178k2075J0596K9355J8393j0453
9197D6510k5430j9639j049K331P157n81j4838q833j364k960j0121M220o730J7219
9183a4108J4914J6657k1403j7764N055J4065J2835p785k0276J1998K8048l057
9171A9179J0183j0114l1841j3263m254m267r01L888m924R815O208K6749J5141
$$ plain form
9263 8865 -22315 -33016 -15059 -348 -9890 -18281 -23527 -7790 -4949 21157 32698 38751 41071
9250 41071 22026 -3394 -21773 -15563 -15824 -14786 -7196 -4467 -14763 -8891 -3591 5598 6236 7788
9236 7788 -8208 -11166 1767 -1921 -13185 -22308 4934 17947 15583 14970 7245 9242 6210 -14049
9222 -14049 7531 24674 24000 2110 410 14075 17566 11304 -13920 -23063 -23257 -6832 9362
9209 9362 15870 8722 22354 37443 49431 33872 20694 -1381 9215 38570 56963 46510
9197 46510 21080 1441 392 2723 9880 9299 -5539 -14372 -15736 -18696 -28817 -24597 -31327 -14108
9183 -14108 806 17463 -3940 -21704 -16649 -2584 10251 2466 -17810 -5812 22236 19179
9171 19179 29362 19248 -12593 -25856 -30110 -34377 -35278 -31390 -36314 -26499 -20291 6458 21599
9158B1599k344j3176n953J855K0964j6921j8124Q318j198Q051m55o474o261l811
9144a3930n585O103O801j9614O109J6125O830J332j108N170J2550p585j1340J0508
9130A2366J8209l681l8635k3496R421P452J2759J377q632K642N292p152J1706
9117c72R731k20P025q658j4918K258o340l765l254m103J113L1833j285j956n043
9102B046J2518K094O61K1707K3952J0409l2864l8377j5965n920J026j0639Q071
9089b1281K0312j764j0082M564J9267l031L059p25J0543L33p748k95l197k8399
9075a8444j0981Q578K931o132k930j1846O615J8773K568j2449L2L6519j3425o569
9061f760J4743j5029j2451J6060n756L939p041q273M123R858o586p014J8835j381
$$ plain form
9158 21599 19255 6079 126 1981 22945 6024 -12100 -3782 -4980 3071 2616 -3858 -10119 -13930
9144 -13930 -19515 -13412 -6611 -26225 -20116 -3991 2839 4171 3063 8233 20783 13198 1858 12366
9130 12366 30575 26894 -11741 -35237 -25816 -18364 -5605 -4228 -12860 -10218 -4926 -12078 -372
9117 -372 9359 9139 16164 7506 -7412 -5154 -11494 -15259 -18513 -22616 -21503 10330 9045 7089 2046
9102 2046 14564 16658 17319 39026 62978 73387 40523 2146 -13819 -19739 -18713 -29352 -21281
9089 -21281 -969 -2733 -12815 -8251 11016 7985 11044 10319 20862 21195 13447 13152 9955 -18444
9075 -18444 -29425 -20847 -17916 -24048 -26978 -38824 -32209 -13436 -10868 -23317 -23285 13234 -191 -6760
9061 -6760 7983 -7046 -19497 -3437 -9193 -5254 -12295 -20568 -16445 -6587 -13173 -20187 -1352 -2733
9047b733l905K093J6962O901k9821j3973j0941J382J9679K4638J1056R820o047
9034B5111l178q734j8854j1499r804l421o537J6870J4542J2296n212j4928P000
9021f348J929p527m515m578j4928J452M447J5631J4959j2291J2342K306k22j740
9007I17M383J8542j7291j5714p111L496p560M613J4001J8162J4145q797j8972
8994B814k8560q367R470J4155K3039o401j857Q296o388j9963M914J395J0099J4607
8980A7253q330k228j7325J3429Q675Q179j3026K859R541M639k141Q353m109K69
8966B6038L688j893j68j3061j8629Q53J0610J4849k0546P400j7614p925j1010
8953b7408j9376q188J2488J4183k245K0818j0185k0937K790M0670J0926J780j5643
$$ plain form
9047 -2733 -6638 -4545 12417 19318 -10503 -24476 -35417 -34035 -14356 10282 21338 31158 25111
9034 25111 21933 13199 -5655 -17154 -26958 -30379 -36916 -20046 -5504 6792 1580 -13348 -6348
9021 -6348 -4419 -11946 -16461 -21039 -35967 -34515 -30068 -14437 522 -11769 573 2879 2657 917
9007 917 5300 23842 6551 -9163 -16274 -12778 -20338 -15725 -1724 16438 30583 21786 2814
8994 2814 -25746 -34113 -24643 -10488 12551 6150 4293 12589 6201 -13762 -8848 -7453 2646 17253
8980 17253 8923 6695 -10630 2799 11474 19653 6627 9486 19027 23666 21525 29878 25769 26038
8966 26038 29726 27833 27665 14604 -4025 -3172 7438 22287 1741 9141 -8473 -16398 -27408
8953 -27408 -46784 -54972 -42484 -28301 -30546 -9728 -19913 -40850 -38060 2610 13536 15316 -327
8940c27q046N872N584K1000K1470k0123k3841Q069K7327m069k3691j8468M773
8927d470j2334j2130J2605L69r585o127j1109l351J9143L7773L873j8614n421
8914i378P595J1543N144j3283J618m483j5886k54L178j1166l895K1031J2517r452
8900e171M697J335K683j3873q433j827j931p966L282J1529K0005p746Q698o670
8886a388j6170l18j0264j6140J1984J6580L9243J7141j5655k4347j3499l882K7588
8873A0873K619J7094J405j3469k7646o480O540J0332j4056J172P503j3582j0970
8860b8665L990J2056K0580M225P872q306j2080m0814O40K0021J1831m42k0919
8847c0011K9J6141J2689p181o608J8629K723j6039j1162O982K0781k4270j9152
$$ plain form
8940 -327 -8373 -2501 3083 24083 45553 25430 1589 9658 36985 32916 9225 -9243 -4470
8927 -4470 -16804 -28934 -16329 -15960 -25545 -31672 -42781 -46132 -26989 10784 14657 -3957 -9378
8914 -9378 -1783 9760 14904 1621 3239 -1244 -17130 -17384 -14206 -25372 -29267 -8236 4281 -5171
8900 -5171 -474 861 3544 -10329 -18762 -20589 -22520 -30486 -27204 -15675 4330 -3416 5282 -1388
8886 -1388 -17558 -17876 -28140 -44280 -32296 -15716 23527 40668 25013 666 -12833 -16715 10873
8873 10873 13492 30586 31991 18522 -9124 -15604 -9064 1268 -12788 -11616 -4113 -17695 -28665
8860 -28665 -24675 -12619 7961 12186 20058 11752 -328 -41142 -40502 -20481 -8650 -9092 -30011
8847 -30011 -29982 -13841 -1152 -8333 -14941 3688 6411 -9628 -20790 -13808 6973 -17297 -36449
8834c6449K0496K6467O627K696K415K099J169m4107j1602J2016q861J1643J0322
8821e069J5138M080M788q078m208R80n414J6733j155r434o500Q44j4061j4786
8807b6142R807j5625P514J6416r458J082pl151J943K794j5950n110P875Q572J0130
8792i310j0917j320Q14o330J5672J6748L669j2003N124r590j3489R724N873j5804
8778b1139m694J730J8575O547N773k2130L142N051J061O144o285J1122J5458J0548
8764C0903J459L998j2149p251k571r998j6258j6000K059J503K7091R439k5784
8751a3559p913q957P141j2788q726R922M286J4699N423J573K733N35j0380K16
8737a5795K3867J8384k990k4738n310l4959J0449J1662K4548R462o047j270M488
$$ plain form
8834 -36449 -15953 10514 17141 19837 22252 24351 25520 -18587 -30189 -18173 -27034 -15391 -5069
8821 -5069 10069 14149 18937 10859 6651 7631 2217 18950 17795 8361 1861 2705 -11356 -26142
8807 -26142 -16335 -31960 -24446 -8030 -17488 -16406 -16413 -19564 -17621 -14827 -30777 -35887 -28012 -19440 -9310
8792 -9310 -20227 -21547 -20733 -27063 -11391 5357 9026 -2977 2147 -7443 -20932 -11208 -5335 -21139
8778 -21139 -25833 -24103 -5528 1019 6792 -15338 -12196 -7145 -6084 60 -6225 4897 20355 30903
8764 30903 32362 36360 24211 16960 14389 4391 -11867 -27867 -25808 -24305 2786 12225 -13559
8751 -13559 -21472 -30429 -23288 -36076 -44802 -34880 -30594 -15895 -10472 -8899 -6166 -5631 -16011 -15795
8737 -15795 8072 26456 23466 -1272 -6582 -41541 -31092 -19430 5118 14580 8533 7263 11751
8724A1751K0131J50o978J3531j3992q904J820J4363j4859j2250J0776l43N765
8711B0961J386j129l622r643j0383q477j0040R676n468M840l545K2615O477m948
8697H700N072Q416L417N799j2269l069k193j5537r16J8734L879K602Q011J1937
8683D2583j0251n350j4413j8661J3617Q727N75j0045K6065k592k3129k1418q661
8670b2953R715N03O837J848o720K4311P875j7091q082J4897J1197N619p166j1112
8656I678R727l516j1991J1481K1687p81r555j2890k640n146j7706J3640K2156
8643B4144J7639m85q060L723m438j827j3922J0493P259n469j1602J0705Q518Q370
8629D5048L494l019M723p4l63l2117k5376n448p010k130J0858K2859P022n7M951
$$ plain form
8724 11751 31882 32032 25054 38585 24593 15689 17509 31872 17013 4763 15539 15196 20961
8711 20961 22347 21218 17596 7953 -2430 -10907 -20947 -11271 -16739 -11899 -15444 7171 13648 8700
8697 8700 13772 22188 25605 31404 19135 16066 13873 -1664 -2580 16154 20033 22635 30646 42583
8683 42583 32332 26982 12569 -6092 7525 16252 16827 6782 32847 30255 7126 -14292 -22953
8670 -22953 -13238 -12735 -5898 -4050 -10770 13541 21416 4325 -3757 11140 22337 27956 20790 9678
8656 9678 19405 15889 3898 15379 37066 36285 26730 13840 11200 6054 -11652 1988 24144
8643 24144 41783 41298 33238 36961 32523 30696 16774 27267 34526 29057 17455 28160 36678 45048
8629 45048 48542 45523 50246 50172 49809 17692 -7684 -13132 -20142 -22272 -11414 11445 18467 18410 23361
8614B3361n025p243k2620P244Q389M443J7840K361o481J8449N784n787K566K7093
8600G0374J277k1496N508q021j828K2905N240R887J908L520N330P691q877j0637
8586H2781J0100L2846P825J93j0164k212j1511k9571k2733L325K4825J1380M611
8573A01695k8608j9170p192n135R02q037N920K1905k889l845J484Q103j7151k3370
8559B4612q771J2125p374M84j5972l416j5303m649J7408J6311L530j474l847J0127
8545B3791J349o996J7364K8348k2053k2309j6047j1493J4774o557r58k257j1327
8532a4371N907K9035K0597o76k9213r325j0907L890Q013J1388J3320M184j3830
8519A8012o736l34J080K6369K2157K9392Q427R502J204J5866N49k6744k7545j8672
$$ plain form
8614 23361 18336 11093 -11527 -4283 4106 8549 26389 28750 22269 40718 46502 40715 43281 70374
8600 70374 71651 50155 55663 47642 45814 68719 73959 83846 85754 89274 94604 102295 93418 82781
8586 82781 92881 125727 133552 133745 123581 121369 109858 80287 57554 60879 85704 97084 101695
8573 101695 73087 53917 46725 41590 42492 34455 40375 62280 59391 55546 57030 65133 47982 24612
8559 24612 15841 27966 20592 21076 5104 1688 -13615 -18264 -856 15455 18985 17511 13664 23791
8545 23791 25140 18144 35508 63856 41803 19494 3447 -8046 6728 171 -787 -3044 -14371
8532 -14371 -8464 20571 41168 40492 11279 1954 -8953 -5063 2950 14338 27658 31842 18012
8519 18012 11276 10942 12022 38391 60548 89940 98367 107869 109073 124939 125488 98744 71199 52527
8505E2527j3275j278K4382j5093k5588J1480J0423M415J6995j931o205P847l239
8492F1460j8656k800j2090j752o44j8537p187Q184N292n938k2014J8488R314P09
8478A3829J9252J7922j579j1283K186K3269L253l860j8654p314N985L3092M7701
8465A23799K6328K6917K7232P003j8396k9789l4144k9243j5606m13j4362l4589
8453C4737R091K2052l382l3611j5317n550m684R442O71K202M098j923j504k0815
8439d493K519L017K0149J6571j4291j8415j8723r479Q87J1856O483P574O363r47
8425I071m256m851J4142P201j557O452j2790L6902L7209N495R207R630j5286j4767
8411H1802j5661m587j109k236l6109k3728J849K2196l774j2848j4796j1091K6830
$$ plain form
8505 52527 39252 37974 62356 47263 21675 33155 43578 47993 64988 63057 56852 64699 61460
8492 61460 42804 40004 27914 26162 25518 6981 -206 7978 13270 7332 -14682 3806 13120 13829
8478 13829 33081 51003 49424 38141 40327 63596 66849 62989 44335 37021 43006 76098 123799
8465 123799 150127 177044 204276 211279 192883 163094 128950 99707 84101 83688 69326 34737
8453 34737 43828 65880 62498 28887 13570 8020 3336 12778 13449 15651 19749 17826 16322 -4493
8439 -4493 -1974 1043 21192 37763 23472 5057 -13666 -23145 -22258 -10402 -3919 3655 10018 9071
8425 9071 4815 -36 14106 21307 19750 26202 13412 50314 87523 93018 102225 111855 96569 81802
8411 81802 66141 61554 60445 58209 22100 -1628 221 22417 18643 5795 -9001 -20092 6738
8398F738Q101K025j920j544P48L576j1285j3958q494J1177R219Q065m177M723
8384A2994o62j0247M970q999J0744O36j2164L741K0228p080j9501J1689K7312
8371C3661O222j8651k1726j1088K5205J7277j3589q189j4568j3020j2517n853
8359c6836J7910K2906K953l3K693j4856L072J0654M417p772j0952J232Q313J2942
8345A6643J5077L708k8387k7343M950K2083J4364m806j1729n873J993j027o459
8332f806j0909K633j6182K0464K4327m423L411j91j4272J533o198o358R313j2922
8318a6580P807R094j0748k5592j1562M743J8957J187J1442K6483P156J4207J3131
8305D9725l2823l4958k8399J7133p776L902Q1Q533q419K6332J5453k514q982K8052
$$ plain form
8398 6738 14839 16864 14944 13400 14148 17724 6439 -7519 -16013 -4836 4383 12448 8271 12994
8384 12994 12332 2085 7055 -1944 8800 9436 -2728 1013 21241 14161 -5340 6349 33661
8371 33661 39883 21232 -494 -11582 13623 30900 17311 9122 -5446 -18466 -30983 -36836
8359 -36836 -18926 3980 6933 6900 9593 -5263 -2191 8463 12880 5108 -5844 -4612 3701 16643
8345 16643 31720 35428 7041 -20302 -15352 6731 21095 16289 4560 -1313 680 -347 -6806
8332 -6806 -17715 -15082 -31264 -10800 13527 9104 12515 12324 -1948 -415 -6613 -12971 -3658 -16580
8318 -16580 -8773 321 -10427 -36019 -47581 -42838 -23881 -22694 -11252 15231 22387 36594 49725
8305 49725 16902 -18056 -46455 -29322 -37098 -33196 -33115 -24582 -33001 -6669 8784 6270 -2712 25340
8291B5340l172l2284p450J5647P967J1256l885k948K480j1359m502R266K0900
8278B7256j085j8732j3095M427M710j4757o293J0787J0656J059j3040j2970j597
8265b2674J1303k678M237J3622j890Q882J5339K707k1125j6930r464p666L22P259
8251a8756J5608K621j382j0078K8316k600j1434O687l0089j5018J9301j5549M691
8238b7682p468O119L837J2103J5012r99o895k157J8015j2942p898J4498L339J24
8224G006L811P682m742o637j2414r768j514O538R998K7676q654r782J8673R342
8210C7215p559p933O363P766n06j4674l438N01L826p27J6141j9691m81o436o116
8195D251j512L367Q05l886O747J8642k3113l12M453M98Q675n47q075J1501J2991
$$ plain form
8291 25340 22168 -10116 -17566 -1919 6048 17304 13419 10471 12951 1592 -2910 6356 27256
8278 27256 26171 7439 -5656 -1229 3481 -11276 -17569 -6782 3874 4933 -8107 -21077 -22674
8265 -22674 -11371 -14049 -9812 3810 1920 10802 26141 28848 7723 -9207 -18671 -26337 -26015 -18756
8251 -18756 -3148 -527 -1909 -11987 16329 13729 2295 8982 -21107 -36125 -16824 -32373 -27682
8238 -27682 -35150 -29031 -25194 -13091 1921 922 -5973 -8130 9885 -3057 -10955 3543 6882 7006
8224 7006 10817 18499 13757 7120 -5294 -15062 -16576 -10038 -40 27636 18982 9200 27873 37215
8210 37215 29656 21723 28086 35852 35346 20672 17234 17735 21561 20834 36975 17284 16803 10367 4251
8195 4251 2739 6106 6911 3025 9772 28414 5301 4989 9442 9940 18615 18068 9993 21494 34485
8180C4485j3365k1202k2934k1197L2051J2401J1583M838j0229j0151q054R895
8168a879n795q285m556J3971J2391N641K648L039M982q103J6883n888j930j1497
8154A1622o298R708k938j9882J755j2351o639Q12M498K9805O656j0753k9940M118
8140a9827o491p92J7719K1065J852k1431j6319J1150o630j0082J0573j2486J0891
8127b0808J0958J4175K336j1227K0817J4565Q306q041j6430p175q057j2467M187
8114h861r174J681j7224n993K5917K0592J8520J8394j1964l592Q45L444k2077
8101A0508K522P163J305K2328P061l1679l0408j1092j1779P107J3341j2865j319
8088b7807L8076K799j7688j5062J1434J470j42j4033L39j694M091J5663K7351
$$ plain form
8180 34485 21120 -82 -23016 -44213 -12162 239 11822 16660 6431 -3720 -11774 -1879
8168 -1879 -7674 -15959 -20515 -6544 5847 11488 14136 17175 22157 14054 30937 25049 23119 11622
8154 11622 5324 15032 12094 -7788 -6033 -18384 -25023 -24211 -19713 10092 16748 5995 -23945 -19827
8140 -19827 -26318 -27110 -9391 11674 13526 -7905 -24224 -13074 -19704 -29786 -19213 -31699 -20808
8127 -20808 -9850 4325 6661 -4566 16251 30816 39122 31081 14651 7476 -581 -13048 -8861
8114 -8861 -18035 -16354 -33578 -39571 -13654 6938 25458 43852 31888 28296 29141 32585 10508
8101 10508 13030 20193 21498 43826 50887 19208 -11200 -22292 -34071 -26964 -13623 -26488 -27807
8088 -27807 10269 13068 -4620 -19682 -8248 -6778 -6920 -20953 -20614 -22308 -18217 -2554 24797
8075B4797J0932q807J2420K0405j7498k1818o205k0206r558J4881p710j7258J1227
8062a4398R803N62P030K094j4204o054J4884J0774L007J1923J5370M67k8162k992
8048A0104R958o791j1861l367O904j1391J3205K078o501N78K298K136k836K214
8034F728k1281M380J5149j2051l613P169J1552q644j1312j5579P42J0110J2752
8021c898M8J4978J1171R282j8853j9331n54R913N11j6530p108J98J9468J7517
8007A6812J5225L816k3216r212o491J1320J004j1932L893J0295Q722n992j265
7994A2979J7697k277K1705j1100j8498j3232O002o513Q767M467J1814K474K7598
7981F1883J1705j0508L100P062j3225r373n914j0859q650j5203j0081J0820K3300
$$ plain form
8075 24797 35729 26922 39342 59747 42249 20431 14226 -5980 -15538 -657 -8367 -25625 -14398
8062 -14398 -4595 -4033 2997 5091 -9113 -15167 -283 10491 13498 25421 40791 41258 13096 10104
8048 10104 20062 13271 1410 -1957 4947 -6444 6761 8839 2338 2916 5214 7350 4514 6728
8034 6728 -14553 -10173 4976 -7075 -10688 -3519 8033 -611 -11923 -27502 -26760 -16650 -3898
8021 -3898 -3850 11128 22299 31581 12728 -6603 -7157 2756 3267 -13263 -20371 -20173 -705 16812
8007 16812 32037 35853 12637 3425 -3066 8254 9258 -2674 1219 11514 20236 14244 12979
7994 12979 30676 28399 50104 39004 20506 7274 13276 6763 15530 19997 31811 34285 61883
7981 61883 73588 63080 66180 73242 60017 50644 44730 33871 25221 10018 -63 10757 34057
7968C4057o618m688j1445j933J7024O137j4476j9077l672J2953Q579J4244J2575
7955D3660r878l6491k668j166l305n491L009P849K1886P352L928O923J4865k3333
7941B7140j8413R480L94Q453J1360j2147r426J8323K6771j0587k0764r731j4342
7928F511k0584N047K1184J4244j2491J2587j37j7083m252L639j8759j9675Q904
7915b0865K6085K0857K3707M042o843q035q768k348J2801l065j1676q020l946
7902A3926J505J842M573j2018p998M346j671K0873P02j066P675o81j7268O11M504
7887A9855J1903J3244o200j5201N037l493j278p312N844q363j8618J84K1138J5304
7873C2044o800R676L498n550j101O470J2927P241K085l5582j3985J3216K199K220
$$ plain form
7968 34057 27439 22751 11306 9373 26397 32534 18058 -1019 -4691 8262 16841 31085 43660
7955 43660 33782 -2709 -5377 -6543 -9848 -15339 -12330 -4481 17405 24757 28685 35608 50473 27140
7941 27140 8727 18207 18601 27054 38414 26267 16841 35164 61935 51348 30584 20853 6511
7928 6511 -14073 -9026 12158 26402 13911 26498 26361 9278 5026 8665 -10094 -29769 -20865
7915 -20865 5220 26077 49784 53826 46983 38948 30180 27832 40633 37568 25892 17872 13926
7902 13926 15431 17273 21846 9828 1830 6176 4505 25378 26080 25014 32689 32008 14740 15351 19855
7887 19855 31758 45002 38802 23601 28638 25145 23867 16555 22399 14036 -4582 -4398 16740 32044
7873 32044 25244 34920 38418 32868 31767 38237 51164 58405 60490 24908 10923 24139 26338 28558
7859B8558j1925M023J3358l0990j0816P413M2205M933k1302j5388j8788J390J4069
7846F740L813l015K08j3026n735n12K867L627n267L966L054J068j0632n270n450
7831b3564m116Q104j665K06K664J7546l365J859J692N00m812J6406K5313J0381
7817D7149q15j2652k2547m086J5496L8602J471k7255j6223j6857j6868l685J8272
7804BK1416O073j0319l96K234j565m845Q956l4532j7558j3247j4808K6654L7602
7790E667K816K953j9075P293K9787o045m523j9738j233O034P271M482k963r613
7776C113k2085p126j1229J3846O391K938O986K976j0065J1577J0959O92k8212
7763a9239j4719K1715M341J8125k542N177O743K856l253j8772k2544p789m438
$$ plain form
7859 28558 16633 20656 34014 3024 -7792 -379 41826 46759 25457 10069 -8719 -7329 6740
7846 6740 10553 7538 7746 -5280 -11015 -11527 -8660 -5033 -10300 -6334 -3280 -2212 -12844 -18114 -23564
7831 -23564 -27680 -19576 -21241 -21035 -18371 -825 -4190 -2331 -639 -139 -4951 11455 36768 47149
7817 47149 46334 33682 11135 7049 22545 61147 62618 35363 19140 2283 -14585 -18270 2
7804 2 21418 27491 17172 16776 19010 17445 12600 21556 -12976 -30534 -43781 -58589 -31935 5667
7790 5667 8483 11436 -7639 -346 29441 23396 18873 -865 -2098 3936 11207 15689 12726 3113
7776 3113 -18972 -26098 -37327 -23481 -17090 -14152 -7166 -4190 -14255 -2678 8281 8973 -19239
7763 -19239 -33958 -12243 -7902 10223 7681 12858 19601 22457 19204 432 -22112 -29901 -34339
7750c4339P903N383J7387J2291J2004o286q033k9030r665R289j9500R25J1223
7737c0448Q971J9616J2597Q776r634K92R317j5650j5320m865j263L048j1427Q70
7723b5120J5529j5736L905l31j001M832R494j2568j5223J311J3931J3989R896
7710B908k566N103N721K324n360r571O375j8265m718K4520j2364j6612J7986K0109
7696A5590j45l0780j3895R705J4019Q66K844R079r20k6334j1262J7125Q909M803
7682c96J06k380R801r32j540J2083N202j6058k7589k0494k362L1573Q938M169
7668A21n26j3392J2720K927j6758K7069l431k4095L328O837j1220m570j3177L693
7654c0474J3953J5745M942J0450O403k0644o029P911j4629j2704R877P247K9960
$$ plain form
7750 -34339 -26436 -21053 -3666 8625 20629 14343 6310 -22720 -32385 -23096 -42596 -41671 -30448
7737 -30448 -21477 -1861 10736 19512 9878 10170 19487 3837 -11483 -16348 -17611 -14563 -25990 -25120
7723 -25120 -9591 -25327 -21422 -21753 -22754 -17922 -8428 -20996 -36219 -34908 -20977 -6988 2908
7710 2908 342 5445 11166 13490 8130 -1441 4934 -13331 -18049 6471 -5893 -22505 -4519 15590
7696 15590 15445 -15335 -29230 -19525 -5506 -4640 -1796 7283 6363 -19971 -31233 -14108 -5199 -396
7682 -396 -290 -2670 7131 6199 4659 16742 21944 5886 -21703 -42197 -44559 -12986 -4048 121
7668 121 -405 -13797 -1077 1850 -14908 12161 8730 -15365 -12037 -5200 -16420 -20990 -34167 -30474
7654 -30474 -16521 -776 4166 14616 21019 375 -5654 2257 -12372 -25076 -15199 -7952 22008
7641B2008N905l4544k5490P555n719M87K6923R905k098q108j4845J669m413j2116
7627c2881l822j6932Q402N538J1687J2759J4679N627L95L047j2762O859Q650j8446
7613g200p064J3887m227M792J4758K4n032r342l081O9m117J4492k497n126O405
7598F741J1079j9159j7126O829J6061j0581r387N428N474O976K367j2182J0423
7585B943q204j3599J979J3112p239j4273K935N950J199n001l208N58j5338p549
7571d5735K9130P206j2620j6517P523K3441r115L132m726K578Q190l259o374j4187
7557c1333K021M5544K2372r193j2849k2065J1026J826j2040K948O866l222o958
7544e057k3000p359j893L0784J9100r962Q730J694j7175j2337m107J3130O487
$$ plain form
7641 22008 27913 -6631 -32121 -24566 -30285 -29798 -2875 7030 4932 -3176 -18021 -16352 -20765 -32881
7627 -32881 -36703 -53635 -45233 -39695 -28008 -15249 -570 5057 5452 8499 -4263 2596 11246 -7200
7613 -7200 -14264 -377 -4604 188 14946 14970 9938 596 -2485 -2416 -6533 7959 5462 336 6741
7598 6741 17820 -1339 -18465 -11636 4425 -6156 -15543 -10115 -4641 2335 4702 -7480 2943
7585 2943 -5261 -18860 -16881 -3769 -11008 -25281 -22346 -16396 -15197 -20198 -23406 -22848 -38186 -45735
7571 -45735 -16605 -9399 -22019 -38536 -31013 -7572 -16687 -13555 -18281 -15703 -7513 -10772 -17146 -31333
7557 -31333 -29312 16232 38604 29411 16562 -5503 5523 7349 -4691 -1743 5123 1901 -5057
7544 -5057 -28057 -35416 -37309 -6525 12575 2613 11343 13037 -4138 -16475 -20582 -7452 -965
7531i65j1830O143K0347j86k8012l096p064J1721K6164m992o545O521J9898m814
7517B3290P80n239j0596j0133K602l80n092j1244m684M612O914r060l183M53P546
7502a3414K312j1958j8904J6200J0721j8773j195J7774R715n499K939n460J2381
7489c161Q824j511o374j0446O637J190k1086O797J0565L671m378N88q971L00M26
7474a6929J4273Q501q954Q584r584j6291p444j1117R413M793j2363k1351L2098
7461b6371J7132P412M742j6469k2241P412P290r61p693P145Q218K72r510K966
7447b0656l511J1559J2533J6568P171M746k794K1695J6984j6732j7533r539j1346
7434I145j0792J6271P475m449Q314J6996j4113k4905k835n393n342J4834J5066
$$ plain form
7531 -965 -12795 -6652 13695 13509 -14503 -17599 -24663 -12942 13222 8230 1685 8206 28104 23290
7517 23290 24070 18831 8235 -1898 704 324 -4768 -16012 -20696 -16084 -9170 -18230 -21413 -20960 -13414
7502 -13414 -11102 -23060 -41964 -25764 -15043 -33816 -35011 -17237 -7522 -13021 -10082 -15542 -3161
7489 -3161 5663 4152 -2222 -12668 -6031 -4841 -25927 -19130 -8565 -4894 -9272 -8684 -17655 -17355 -16929
7474 -16929 -2656 5845 -3109 5475 -4109 -20400 -27844 -38961 -29548 -24755 -37118 -58469 -26371
7461 -26371 -9239 -1827 2915 -13554 -35795 -28383 -21093 -22054 -29747 -22602 -14384 -14112 -23622 -20656
7447 -20656 -24167 -12608 -75 16493 23664 28410 25616 47311 64295 47563 30030 20491 9145
7434 9145 -1647 14624 22099 17650 25964 42960 28847 3942 1107 -4286 -9628 5206 20272
7421B0272j54l820o844r903r689M081Q216J3297j4729k6441K133j1737R354J5364
7407a0600R506n713j6200n194L450k746J8771l742r627K422L160n769J3920J6458
7393H096j3632j0707M047r570J1832J3656J5634M223k4654j3538K177K448N732
7380d256L887o69j2089j669q790l949J7686o259K066O744k283J1083K3018P567
7366C2087j2701j5722j2797p11N544l498l744J326L553Q963j5366N734M106J2582
7352I356Q981J0495q672j0007q936j7053J0693K0715L924j5918j7123j7878J0011
7339b1412L946k245k083j3101J1325P325p113q101J1922J1879k927q354k1356
7326d0295k10N261R967L205P82k620o757K606J9455J8378K0894l23k948n007J4127
$$ plain form
7421 20272 20118 16298 9454 -449 -10138 -6057 2159 15456 727 -25714 -23581 -35318 -25964 -10600
7407 -10600 -1094 -6807 -23007 -28201 -24751 -27497 -8726 -12468 -22095 -19673 -16513 -22282 -8362 8096
7393 8096 -5536 -16243 -12196 -21766 -9934 3722 19356 23579 -1075 -14613 -12436 -9988 -4256
7380 -4256 -369 -1038 -13127 -14796 -23586 -27535 -9849 -16108 -14042 -7298 -9581 1502 24520 32087
7366 32087 19386 3664 -9133 -9844 -4300 -7798 -11542 -10216 -6663 2300 -13066 -7332 -3226 9356
7352 9356 18337 28832 20160 10153 1217 -15836 -5143 15572 19496 3578 -13545 -31423 -21412
7339 -21412 -17466 -19711 -21794 -34895 -23570 -16245 -23358 -31459 -19537 -7658 -10585 -18939 -40295
7326 -40295 -40505 -35244 -25277 -22072 -21290 -23910 -30667 -28061 -8606 9772 30666 30343 27395 22388 36515
7311C6515j6152k3395j7104p802q790J0557O883j5205m007l428m431K20J4756
7298c1383K942k396O489O789J4153J5014R943J972r001O037J4736k6631j9273
7285a0609j3889o816O7R461J7902M775j1092o328L971L238m916j587J4475l185
7271d533p258Q031J0948m649j3128j1163j0543N225J6693K6097R098p448P819
7258B5189J2640j3383j1846j6696j3745o59k371K2327J8943j7262j9450J7393
7246A080L028m7611P114L8899J0067M226r449j5196j0770N16P272m497j245r929
7232b6495n538p517P11L259O728J4128r793K127J7856R953j913p977r15P762o439
7217d063k6321j097K0164L040L275N523K3452Q978j8251j9057k8468P968J1448
$$ plain form
7311 36515 20363 -3032 -20136 -27938 -36728 -26171 -19288 -34493 -38500 -41928 -46359 -46139 -31383
7298 -31383 -28441 -30837 -24348 -17559 -3406 11608 21551 23523 14522 20559 35295 8664 -10609
7285 -10609 -24498 -31314 -31247 -21786 -3884 891 -10201 -16529 -12558 -9320 -14236 -15823 -1348 -4533
7271 -4533 -11791 -3760 7188 2539 -10589 -21752 -32295 -27070 -10377 15720 24818 17370 25189
7258 25189 37829 24446 12600 -4096 -17841 -18500 -20871 1456 20399 3137 -16313 1080
7246 1080 4108 -43503 -36389 2510 12577 16803 7354 -7842 -18612 -18096 -10824 -15321 -16566 -26495
7232 -26495 -32033 -39550 -38839 -35580 -28852 -14724 -24517 -22390 -4534 5419 3506 -4471 -5386 2376 -4063
7217 -4063 -30384 -31481 -11317 -8277 -5002 521 23973 32951 14700 -4357 -32825 -24857 -13409
7204a3409j0379K622m382k2416l114J4269L4394J3543Q314k759l2971K303K2070
7191H085J2708j1049j1870j4977K54l090l424O067J3991J1433j7148j3044J4756
7178g308N986r694j3128N336j4139q844K2989K5930k735r962J5221j2815j7648
7165b0811O269P798N497j0094n914K0261R347K0958j2247j711L330N012j0290
7152A7405N3j6335j0047J0060k807R614L99o584j3008K4230J3351m621j4843j8424
7138a1557n243O117p855j258j4000l13J7127j64j5689L203R778J796p339J5075
7124a0322O592j2115O816J2003P399J7709l053k0561j2292j90n596N415Q091j3206
7110a3310k7108k608r194Q137J7417J4214N912m479O254r727o072K3557J0063
$$ plain form
7204 -13409 -23788 -21166 -25548 -47964 -51078 -36809 -2415 11128 19442 16683 -16288 -13985 8085
7191 8085 20793 9744 -2126 -17103 -16849 -19939 -23363 -17296 -3305 8128 -9020 -22064 -7308
7178 -7308 -1322 -11016 -24144 -18808 -32947 -41791 -18802 7128 4393 -5569 9652 -3163 -20811
7165 -20811 -14542 -6744 -1247 -11341 -17255 3006 12353 33311 21064 19353 22683 27695 17405
7152 17405 17458 1123 -8924 1136 -1671 7943 8342 1758 -11250 12980 26331 21710 6867 -11557
7138 -11557 -16800 -10683 -18538 -19796 -33796 -34109 -16982 -17146 -32835 -29632 -19854 -18058 -25397 -10322
7124 -10322 -3730 -15845 -9029 2974 10373 28082 25029 4468 -7824 -8014 -13610 -8195 -104 -13310
7110 -13310 -40418 -43026 -52220 -44083 -26666 -12452 -6540 -11019 -4765 -14492 -20564 2993 13056
7097A3056j5925k742j5518j4761n570n394K2926K6025p486J531K2323n719N37
7084A3283P563j7331j2640j1158j7957J7297K3783k204q643k307j9173J7962K4346
7071A2821p902j875O94k934O064j236k7949o536K2085n354j3701J527k307j0511
7057c7114p80J2096J0744r271q885N032k128p84K1943k476j2863l406K0396J2415
7043D919Q916k425l674M433J0633p737j2847n881o460j2766J2869L328j1936n833
7029b4461l841j573K6934L988j1159j8705J5250J6300n351j5363R053J6614j7344
7016i658k1889J814J5007L406P391K996L990o255j3520j2868J646J8304k733m791
7002a7160j0770m624M823J0439R904J6630R389j1110j2173J6383J7860n67Q166
$$ plain form
7097 13056 -2869 -5611 -21129 -35890 -41460 -46854 -23928 2097 -5389 -3858 18465 12746 13283
7084 13283 20846 3515 -9125 -20283 -38240 -20943 2840 636 -8007 -10314 -29487 -11525 12821
7071 12821 4919 3044 3738 804 6868 5632 -22317 -28853 -6768 -12122 -25823 -24296 -26603 -37114
7057 -37114 -37894 -25798 -15054 -24325 -33210 -28178 -30306 -31090 -9147 -11623 -24486 -27892 -7496 4919
7043 4919 13835 11410 7736 12169 22802 15065 2218 -3663 -10123 -22889 -10020 -6692 -18628 -24461
7029 -24461 -28302 -29875 -2941 1047 -10112 -28817 -13567 2733 -2618 -17981 -8928 7686 -9658
7016 -9658 -31547 -29733 -14726 -11320 -3929 -933 3057 -3198 -16718 -29586 -27940 -9636 -12369 -17160
7002 -17160 -27930 -32554 -27731 -17292 -7388 9242 18631 7521 -4652 11731 29591 29024 37190
6989C7190P659N515l1058k2510k220Q300M190j945l891p498J5380J761j641j2381
6975c149m905P863P179J35n952M056o045J4147l836r034O517o270j6765J0070
6961e989k916k854j3177q471K459q510j399J4305M303q794M313J6327O792j8077
6947b1688O163J003J7746P994o406n756L907o992k1959J1564R245j1569n188L991
6933a7945J0896O02M855J893j5781k933R093l969n811J5276R176L031l432j8180
6919a3229k4588J8720J1820J4582R729P258r770j660l989J972M712J4406j1296
6906A8667J818m623j0463L469M18j6018j3076O156K56k728M094Q075P032j36j0717
6891g776R959r44j5969J0885R826M958j4518l243N169p823J3065J882L528J8809
$$ plain form
6989 37190 44849 50364 19306 -3204 -5424 2876 7066 5121 1230 -6268 9112 10873 9232 -3149
6975 -3149 -8054 -191 6988 7123 1171 5227 -818 13329 9493 459 6976 706 -16059 -5989
6961 -5989 -8905 -11759 -24936 -33407 -30948 -39458 -40857 -26552 -22249 -31043 -26730 -10403 -3611 -21688
6947 -21688 -15525 -14522 3224 11218 4812 -944 2963 -4029 -25988 -14424 -5179 -16748 -21936 -17945
6933 -17945 -7049 -6447 -1592 301 -15480 -18413 -9320 -13289 -19100 -3824 5352 8383 4951 -13229
6919 -13229 -37817 -19097 -7277 7305 17034 24292 14522 12862 8873 10845 15557 29963 18667
6906 18667 20485 15862 5399 8868 9286 -6732 -19808 -13652 -13396 -16124 -12030 -3955 3077 2941 -7776
6891 -7776 2183 1239 -14730 -3845 5981 10939 -3579 -6822 -1653 -9476 3589 5471 8999 27808
6877B7808K143j3280j780j8368p440O629K2257O874p730l0106k3521O383J1157
6864a8974M992K218M589L750J2894n692M998r139p568k275K783J1222N754J027
6850A0579j1669j0175q339l50j0409k343n334L0046M151p428m512K2760K0444
6837B7421j2882J312j4824n669J3880k774Q122j721j512q726j9992k156n473k690
6823b7684j4708Q08K1024J6012R24m900j2Q159K444L956l759n865j4069N438M133
6808h099j0879r359j0488L667Q718p385J3690o392K953K942j3014J1940R523N433
6794f750O296j349J4169j3329l1125r427k935J9856k649K445P599r536M279J5972
6780f484J3558k232n052q53j2833m728O941K8027O595j9961J869R01L559n857
$$ plain form
6877 27808 29951 16671 14891 -3477 -10917 -4288 17969 24843 17113 -12993 -36514 -30131 -18974
6864 -18974 -13982 -11764 -7175 -3425 9469 3777 8775 -364 -7932 -10207 -7424 3798 9552 10579
6850 10579 -1090 -11265 -19604 -19954 -30363 -32706 -38040 -7994 -3843 -11271 -15783 6977 27421
6837 27421 14539 15851 1027 -4642 9238 6464 14586 12865 11353 2627 -17365 -19521 -24994 -27684
6823 -27684 -42392 -41584 -20560 -4548 -3624 -8524 -8536 -377 2067 6023 2264 -3601 -17670 -12232 -8099
6808 -8099 -18978 -28337 -38825 -35158 -26440 -33825 -20135 -26527 -23574 -20632 -33646 -21706 -12183 -6750
6794 -6750 -454 -1803 12366 -963 -32088 -41515 -44450 -24594 -27243 -24798 -17199 -26735 -22456 -6484
6780 -6484 7074 4842 -210 -1063 -13896 -18624 -11683 16344 22939 2978 4847 5748 9307 3450
6766C450k2261o859K914j3637j4478Q604J9862j830n790M613K100R790m498j826
6752a9846J1008R672K4257j766k2081n373o428m117j6043r167K4504l118K358
6739a6140l89J1810K0613J1511L842J2786n492p35k8307n457m590J2065K2034
6726C3551j8031l634q155p756p008J0100l939n070k223p209J599j1440n092J3162
6712b1145N67J6965L368n908l728n323J6997l222j0049j1907j347r091J121N106
6698b7596J7185J5425K605p786j3549j487n821K508O758q460j0619L311L717n56
6684b4365J6067k199P185P700R54j381k4936j3791k548J6215N014J0878J1737
6671F530j2857q276r167J1146J6280o183k5839l8K1519n78J2901J7249j8200j5151
$$ plain form
6766 3450 -18811 -25670 -22756 -36393 -50871 -42267 -22405 -24235 -30025 -25412 -23312 -13522 -18020 -19846
6752 -19846 -8838 834 25091 23325 1244 -4129 -10557 -14674 -30717 -39884 -15380 -18498 -16140
6739 -16140 -16529 -4719 15894 27405 31247 44033 38541 37806 9499 4042 -548 11517 33551
6726 33551 15520 11886 3731 -4025 -11033 -933 -4872 -9942 -12165 -19374 -17775 -29215 -34307 -21145
6712 -21145 -20578 -3613 -245 -6153 -9881 -15204 1793 -1429 -11478 -23385 -24732 -33823 -32702 -27596
6698 -27596 -10411 5014 7619 -167 -13716 -15203 -21024 -18516 -11758 -20218 -30837 -27526 -23809 -24365
6684 -24365 -8298 -10497 -3312 4388 5342 3961 -20975 -34766 -37314 -21099 -16085 -5207 6530
6671 6530 -6327 -14603 -23770 -12624 3656 -2527 -28366 -28404 -6885 -7463 5438 22687 4487 -10664
6657a0664p324M556L979J0426K36r810N129n381k6405K3854L658k428m408j7371
6643c1953R737J8302L176J7849J5733k1893n853o241r838k795L047K1222J0233
6630B0726l6167q006R234J2726J1332j9356r793p977J5497N179O73Q525J3663
6617A6256j1698k4481n6J8580J3499j3925k2121L256j4294j962K5323Q531j2150
6604a5242o824J3512K9j586L995J073j2823O094K675M989J8442k0248j1947j4306
6590c2167O116P130K955r417j525K1146m963J321m014k165O042N362j6867N709
6576a5337K0545J7597n814k27k1895k4900p725Q139J8952R349k048O259k973q809
6562h887Q141K3945J7235j8082l1381j6534J4416o726j2424R74R506O34J5407
$$ plain form
6657 -10664 -17988 -13432 -9453 973 1209 -8601 -3472 -8853 -35258 -11404 -7746 -10174 -14582 -31953
6643 -31953 -22216 -3914 -738 17111 32844 10951 5098 -1143 -10981 -13776 -10729 10493 20726
6630 20726 -15441 -23447 -14213 -1487 9845 -9511 -19304 -27281 -11784 -6605 -5932 2593 16256
6617 16256 4558 -19923 -19979 -1399 12100 -1825 -23946 -20690 -34984 -36946 -11623 -3092 -15242
6604 -15242 -22066 -8554 -8525 -10111 -6116 -5043 -17866 -11772 -9097 -4108 14334 -5914 -17861 -32167
6590 -32167 -26051 -18921 -15966 -25383 -26908 -5762 -10725 -9404 -13418 -15583 -9541 -4179 -21046 -15337
6576 -15337 5208 22805 16991 16764 -5131 -30031 -37756 -29617 -10665 -1316 -3364 2895 -78 -8887
6562 -8887 -746 23199 40434 22352 -9029 -25563 -11147 -17873 -30297 -29323 -19817 -19183 -3776
6549c776J3961r30N88K85q801k329j2102p674r774N199j9816j4836k245K4740
6535c7510L0840Q042L396j4471q039J7641L820k183j2121R348R779j5169r914
6522a6541J6436J1680r365k753Q906J1773J296r126r582J8230N260k2619k4903
6509b1308j1018j63J9446J9480J0991L221k0089O410k928j4388m503O999N260
6496b590o034K7676M838j9219j1582M012j1660n450L621l140J2471J1597K799
6483G339j7673n116j398K769L789r847J271r333j1831P592P562K7805K5559j1488
$$ plain form
6549 -3776 10185 9255 9843 10128 1327 -1002 -13104 -20778 -30552 -25353 -45169 -60005 -62250 -37510
6535 -37510 -6670 1372 4768 -9703 -17742 -101 3719 1536 -10585 -1237 8542 -6627 -16541
6522 -16541 -105 11575 2210 -543 8363 20136 21432 12306 2724 20954 26214 3595 -21308
6509 -21308 -32326 -32489 -13043 6437 17428 20649 560 6970 4042 -10346 -14849 -7850 -2590
6496 -2590 -8624 19052 23890 4671 -6911 -2899 -14559 -20009 -16388 -19528 -7057 4540 7339
6483 7339 -10334 -15450 -16848 -14079 -10290 -20137 -18866 -28199 -40030 -32438 -24876 2929 28488 17000
$$ [...]
##END NTUPLES=NMR SPECTRUM
##END=
