##TITLE=Analysis number 307971
Compound Code cc 19414
Book Reference 300/186
Project Code adrs
Chemist Name howarde
##JCAMPDX= 6.0         $$ Bruker NMR JCAMP-DX V2.0
##DATA TYPE= NMR SPECTRUM
##DATA CLASS= NTUPLES
##ORIGIN= Bruker BioSpin GmbH
##OWNER= NMR
$$ XWIN-NMR		Version 3.5
$$ Wed May 18 10:57:40 2005 GMT Daylight Time (UT+1h)  MAYBRIDGE\NMR@NMR_250MHZ
##.OBSERVE FREQUENCY= 250.131544655141
##.OBSERVE NUCLEUS= ^1H
##.ACQUISITION MODE= SIMULTANEOUS (DQD)
##.ACQUISITION SCHEME= undefined
##.AVERAGES= 16
##.DIGITISER RES= 18
##SPECTROMETER/DATA SYSTEM= dpx250
##.PULSE SEQUENCE= zg30
##.SOLVENT NAME= CDCl3
##.SHIFT REFERENCE= (INTERNAL, CDCl3, 0, 16.447)
##AUDIT TRAIL= $$ (NUMBER, WHEN, WHO, WHERE, WHAT)
$$ ##TITLE= Audit trail, XWIN-NMR		Version 3.5
$$ ##JCAMPDX= 5.01
$$ ##ORIGIN= Bruker BioSpin GmbH
$$ ##OWNER= NMR
$$ C:\u/data/dgb/nmr/ADRS/3090/pdata/1/auditp.txt
$$ ##AUDIT TRAIL=  $$ (NUMBER, WHEN, WHO, WHERE, WHAT)
(   1,<2005-05-18 10:57:21.01 +100>,<MAYBRIDGE\NMR>,<NMR_250MHZ>,
      <created by zg, POWCHK disabled, PULCHK disabled
       configuration hash MD5:
       62 19 C7 07 E1 42 D1 B7 37 6C 3D D0 77 39 F9 E6
       data hash MD5: 64K
       11 E3 08 13 24 79 8A FA C1 FC 72 92 2A 50 CE 0B>)
(   2,<2005-05-18 10:57:31.74 +100>,<MAYBRIDGE\NMR>,<NMR_250MHZ>,
      <Start of raw data processing
       ef LB = 0.3 FT_mod = 6 PKNL = 1 SI = 32K 
       data hash MD5: 32K
       A7 0C D6 70 8D 14 43 51 21 0E 2C 4F 0D 96 26 1D>)
(   3,<2005-05-18 10:57:33.38 +100>,<MAYBRIDGE\NMR>,<NMR_250MHZ>,
      <apk 
       data hash MD5: 32K
       86 C4 86 8E 6A 81 3F 2B 51 CD C7 18 6B 0F F6 7D>)
(   4,<2005-05-18 10:57:34.04 +100>,<MAYBRIDGE\NMR>,<NMR_250MHZ>,
      <abs ABSG = 5 
       data hash MD5: 32K
       6A ED F8 0E A3 66 A6 F2 9B 8C 43 E5 91 17 90 0A>)
$$ ##END=
$$ 
$$ hash MD5
$$ 4E BB 9B 4B DE E5 A9 05 88 08 9A 6F B6 67 A7 18
##$RELAX= 
##$RELAX= 
##$RELAX= 
##$RELAX= 
##$RELAX= 
##$RELAX= 
##$RELAX= 
$$ Bruker specific parameters
$$ --------------------------
##$DU= <C:\u>
##$EXPNO= 3090
##$NAME= <ADRS>
##$PROCNO= 1
##$TYPE= <nmr>
##$USER= <dgb>
##$AMP= (0..31)
100 100 100 100 100 100 100 100 100 100 100 100 100 100 100 100 100 100 
100 100 100 100 100 100 100 100 100 100 100 100 100 100 
##$AQSEQ= 0
##$AQ_mod= 3
##$AUNM= <au_zg>
##$AUTOPOS= <16 >
##$BF1= 250.13
##$BF2= 250.13
##$BF3= 250.13
##$BF4= 250.13
##$BF5= 500.13
##$BF6= 500.13
##$BF7= 500.13
##$BF8= 500.13
##$BYTORDA= 1
##$CFDGTYP= 0
##$CFRGTYP= 5
##$CHEMSTR= <none>
##$CNST= (0..31)
1 1 145 1 1 1 1 1 1 1 1 1 1 1 1 1 1 1 1 1 1 1 1 1 1 1 1 1 1 1 1 1 
##$CPDPRG= <>
##$CPDPRG1= <>
##$CPDPRG2= <>
##$CPDPRG3= <>
##$CPDPRG4= <mlev>
##$CPDPRG5= <mlev>
##$CPDPRG6= <mlev>
##$CPDPRG7= <mlev>
##$CPDPRG8= <mlev>
##$CPDPRGB= <>
##$CPDPRGT= <>
##$D= (0..31)
0 1 0 0 0 0 0 0 0 0.06 0 0 0 0 0 0 0.0002 0 0 0 0 0 0 0 0 0 0 0 0 0 0 
0 
##$DATE= 1116410239
##$DBL= (0..7)
120 120 120 120 120 120 120 120 
##$DBP= (0..7)
150 150 150 150 150 150 150 150 
##$DBP07= 0
##$DBPNAM0= <>
##$DBPNAM1= <>
$$ [...]
##$SUBNAM7= <"">
##$SUBNAM8= <"">
##$SUBNAM9= <"">
##$SW= 20.6930455092707
##$SWIBOX= (0..15)
0 0 3 0 0 0 0 0 0 0 0 0 0 0 0 0 
##$SW_h= 5175.983436853
##$TD= 65536
##$TD0= 1
##$TE= 295.16
##$TE2= 300
##$TE3= 300
##$TEG= 300
##$TL= (0..7)
0 120 120 120 120 120 120 120 
##$TP= (0..7)
150 150 150 150 150 150 150 150 
##$TP07= 0
##$TPNAME0= <>
##$TPNAME1= <>
##$TPNAME2= <>
##$TPNAME3= <>
##$TPNAME4= <>
##$TPNAME5= <>
##$TPNAME6= <>
##$TPNAME7= <>
##$TPOAL= (0..7)
0.5 0.5 0.5 0.5 0.5 0.5 0.5 0.5 
##$TPOFFS= (0..7)
0 0 0 0 0 0 0 0 
##$TUNHIN= 0
##$TUNHOUT= 0
##$TUNXOUT= 0
##$USERA1= <user>
##$USERA2= <user>
##$USERA3= <user>
##$USERA4= <user>
##$USERA5= <user>
##$V9= 5
##$VALIST= <valist>
##$VCLIST= <CCCCCCCCCCCCCCC>
##$VD= 0
##$VDLIST= <DDDDDDDDDDDDDDD>
##$VPLIST= <PPPPPPPPPPPPPPP>
##$VTLIST= <TTTTTTTTTTTTTTT>
##$WBST= 1024
##$WBSW= 4
##$XGAIN= (0..3)
0 0 0 0 
##$XL= 0
##$YL= 0
##$YMAX_a= 356544
##$YMIN_a= -325524
##$ZGOPTNS= <>
##$ZL1= 120
##$ZL2= 120
##$ZL3= 120
##$ZL4= 120
##$ABSF1= 16.44698
##$ABSF2= -4.246193
##$ABSG= 5
##$ABSL= 3
##$ALPHA= 0
##$AQORDER= 0
##$ASSFAC= 0
##$ASSFACI= 0
##$ASSFACX= 0
##$ASSWID= 0
##$AUNMP= <proc_1d>
##$AZFE= 0.1
##$AZFW= 0.1
##$BCFW= 0
##$BC_mod= 0
##$BYTORDP= 0
##$COROFFS= 0
##$CY= 12.5
##$DATMOD= 1
##$DC= 0
##$DFILT= <>
##$DTYPP= 0
##$F1P= 14.0000005364418
##$F2P= -0.99999901652339
##$FCOR= 0.5
##$FTSIZE= 32768
##$FT_mod= 6
##$GAMMA= 0
##$GB= 0
##$INTBC= 1
##$INTSCL= 1
##$ISEN= 128
##$LB= 0.3
##$LEV0= 0
##$LPBIN= 0
##$MAXI= 10000
##$MC2= 0
##$MEAN= 0
##$ME_mod= 0
##$MI= 0
##$NCOEF= 0
##$NC_proc= -3
##$NLEV= 6
##$NOISF1= 0
##$NOISF2= 0
##$NSP= 0
##$NTH_PI= 0
##$NZP= 0
##$OFFSET= 16.44698
##$PC= 1
##$PHC0= -71.20698
##$PHC1= 6.88163
##$PH_mod= 1
##$PKNL= yes
##$PPARMOD= 0
##$PSCAL= 4
##$PSIGN= 0
##$REVERSE= no
##$SF= 250.13001876378
##$SI= 32768
##$SIGF1= 0
##$SIGF2= 0
##$SINO= 400
##$SIOLD= 32768
##$SREGLST= <1H.CDCl3>
##$SSB= 0
##$STSI= 32768
##$STSR= 0
##$SW_p= 5175.98343685301
##$SYMM= 0
##$S_DEV= 0
##$TDeff= 65536
##$TDoff= 0
##$TI= <Analysis number 999999
Compound Code 99
Book Reference 9
Project Code 9>
##$TILT= no
##$TM1= 0
##$TM2= 0
##$TOPLEV= 0
##$USERP1= <user>
##$USERP2= <user>
##$USERP3= <user>
##$USERP4= <user>
##$USERP5= <user>
##$WDW= 1
##$XDIM= 32768
##$YMAX_p= 466725962
##$YMIN_p= -159976
$$ End of Bruker specific parameters
$$ ---------------------------------
##NTUPLES= NMR SPECTRUM
##VAR_NAME=  FREQUENCY,     SPECTRUM/REAL,   SPECTRUM/IMAG
##SYMBOL=    X,             R,               I
##VAR_TYPE=  INDEPENDENT,   DEPENDENT,       DEPENDENT
##VAR_FORM=  AFFN,          ASDF,            ASDF
##VAR_DIM=   32768,         32768,           32768
##UNITS=     HZ,            ARBITRARY UNITS, ARBITRARY UNITS
##FACTOR=    0.157963299565203, 1,           1
##FIRST=     4113.88329662173, 0,            0
##LAST=      -1062.10014023128, 0,           0
##MIN=       -1062.10014023128, -159976,     0
##MAX=       4113.88329662173, 466725962,    0
$$ Real data points
##PAGE= N=1
##DATA TABLE= (X++(R..R)), XYDATA
$$ [...]
21254 -54398 -57139 -59221 -48352 -42268 -30938 -51668 -69119 -41969 -16638 -6357 6327 11658
21242 11658 -21798 -22298 -11888 -1674 8668 26746 745 -25418 -20883 18197 45026 62134
21230 62134 52308 30764 41678 41376 40164 34667 31961 34731 30772 34812 25831 8186 24172 45735
21216 45735 30566 38557 30135 33782 3029 1163 23468 36534 -1493 -24059 -27532 -3911 21201
21203 21201 27337 14032 -6714 -17308 -8738 -22629 -5379 2993 -8208 -8911 5449 27525 36338
21190 36338 37656 -2503 -15461 -6424 1535 4629 -6126 -8289 4816 20645 34912 51505 43031
21177 43031 18668 2779 17826 42386 36467 21814 13718 36687 40404 10376 4485 32427
21165 32427 25806 -10501 -43724 -5114 3385 5607 -20065 -38545 -42253 -44542 -16053 22051 18570
21152 18570 30393 53035 71070 38905 13871 17944 3795 -7083 2866 -1954 -5384 5807
21140 5807 30442 22808 46215 58529 35844 14606 3611 7153 4487 -10185 -8827 28190 26287
21127 26287 25547 13483 15467 19388 27058 33431 21481 20673 1408 -841 4546 218 -15719 -8712
21113 -8712 1954 9325 27278 37752 35747 28551 8775 -22595 -17534 -28969 -41356 -22374 -508
21100 -508 -3525 -8944 -39252 -14628 -24425 -50440 -31326 8416 6476 10622 3876 -15697 -14891 -14492
21086 -14492 -101 23717 37678 35894 27928 29896 20861 18130 27428 20906 22573 42236 55322
21073 55322 46574 -1414 -17999 -45572 -66572 -59791 -35239 -24528 -25706 -11357 -15469 -13475 16521
21060 16521 10227 -193 -7730 -23156 -20181 -31692 -11909 -5664 18799 8818 -26990 -21151 -15457
21047 -15457 -20156 -45638 -35833 -997 2738 -15369 -27094 -32542 -42132 -31592 3781 -447 27918
21034 27918 35515 22132 -9547 -28432 -49327 -69383 -47196 -11003 9035 19250 29344 24058
21022 24058 -5521 -9307 17974 51299 47893 52477 45148 34593 42884 35756 9554 -15351 -5468
21009 -5468 -8135 -5642 -15798 -33021 -25796 -29898 -21303 1443 16622 -8862 -13819 -13339 -21800 1293
20995 1293 9435 9224 8561 1349 509 8717 16606 3660 -10157 7152 21005 36662 25987 27487
20981 27487 38835 26677 -16630 -12218 -5979 -5101 -6827 -24739 4704 26086 10758 -24014 -23022
20968 -23022 7419 -693 -19635 -46261 -43182 -22201 -26741 -21520 -19672 -7663 2742 -13609 -35441
20955 -35441 -20199 949 -10505 -19083 -38280 -39867 -43642 -27858 -25192 -17496 -22352 -47276 -14982
20942 -14982 3663 12593 15435 15186 15610 -2187 -8379 5929 1812 30317 27202 -11247 -36064
20929 -36064 -56936 -53550 -35749 -47825 -38517 -13386 -11370 -14611 -4444 3688 -26047 -28635 -13272
20916 -13272 -27298 -42939 -41010 -20495 -27050 -20461 -29158 -30099 -24869 -13736 -10724 -30136 -26615
20903 -26615 -15404 -15793 -7818 -16220 -22264 4122 22966 12324 -22203 -40222 -50019 -65412 -55597
20890 -55597 -41581 -37610 -40733 -24260 -21912 3725 12092 7536 -13718 -10825 -9338 -1538 8767
20877 8767 11247 -7585 -23941 -10057 787 -16281 -46195 -66856 -70162 -68502 -78958 -73567 -59019
20864 -59019 -41851 1145 7818 -13781 -32442 -39628 -37335 -45105 -18208 11349 9035 -25250 -33756
20851 -33756 -50592 -48041 -47365 -46938 -72222 -88211 -70747 -39876 -32849 -12794 38399 33615 1309
20838 1309 15871 7761 5858 6842 14509 -5696 -293 -3936 -18549 -20948 -7458 -657 -29487 -44584
20824 -44584 -65287 -64011 -35108 -22620 -7124 2600 18784 28327 16045 -7736 -21459 -28313
20812 -28313 -46432 -49795 5792 50266 48650 26098 28509 25965 -538 -2685 31367 29419 11651
20799 11651 -7387 -15768 8009 28344 6064 -14950 -28368 -16921 -33852 -29383 -27188 3551
20787 3551 -12496 -10263 -16574 -4115 5185 29210 50353 37502 13164 -4243 -12566 5065 27139
20774 27139 43202 15522 16504 -9497 -40600 -47756 -35348 -24449 -18885 -1922 -1535 -3364 -7061
20761 -7061 -22338 -27542 -9935 11469 25502 53224 49691 21245 -4455 -21624 -39835 -41153
20749 -41153 -50555 -67180 -41308 -10584 -15164 -32575 -32074 -47698 -50519 -58993 -57922 -59684 -41845
20736 -41845 -2312 22070 11656 24888 26098 24771 7403 19890 9869 -10964 -42822 -52599
20724 -52599 -44227 -19437 847 -23053 -34105 -39218 -48273 -43088 -11252 18478 18274 -29337 -14046
20711 -14046 4753 2085 -8058 -10957 -19700 -16966 -12777 -34978 -41439 -25839 -34513 -36581 -785
20698 -785 38971 33519 21148 -6699 -43199 -25743 5946 6550 13601 24432 24969 -168 -44045
20685 -44045 -45768 -23219 9508 15593 1081 -2592 11082 219 -23199 -61201 -54932 -34046
20673 -34046 -34805 -26097 3850 10672 -14186 -11462 -24930 -40449 -33387 -8324 -20609 -31709 -38686
20660 -38686 -7197 -3975 3960 -16063 -9506 -13820 -31370 -21652 -32538 -51396 -37413 -29478 -61649
20647 -61649 -77088 -68710 -39417 -34812 -15493 -24559 -48737 -60014 -41428 -38775 -27968 -49651
20635 -49651 -47099 -25447 -19050 -43431 -74281 -72588 -35225 -21952 -33318 -21838 -18755 -31444
20623 -31444 -16133 -2652 4341 8553 27331 24004 16719 1347 -52976 -64620 -43110 -17246
20611 -17246 -26458 -63580 -60703 -87935 -109911 -85030 -64822 -42714 -6181 -11280 -20637 -20351 -5480
20598 -5480 4208 8333 3747 -26987 -11944 -34070 -28391 -25118 -15916 -8107 -9849 -35573 -51994
20585 -51994 -34087 -22887 -6302 -11867 -21314 -24944 -8098 14368 7534 -20532 -28618 -33720 -39658
20572 -39658 -74868 -94070 -52488 -35382 -30391 -23279 -7391 20199 -6857 -43775 -38335 -27885
20560 -27885 -37817 -21468 26944 31846 30861 18394 -10503 -34699 -16127 -3147 7247 -5923
20548 -5923 -920 -9487 -18893 -10874 -4270 -20314 -8524 -6791 11855 -9825 4775 14589 -3968
20535 -3968 19406 23598 19252 7803 233 3121 -22619 -29894 -16037 -27370 -14771 11929 -15589
20522 -15589 -2700 15050 39190 53551 88440 74673 52151 52355 47314 22528 -192 -2810
20510 -2810 33617 11132 -15864 8309 21853 -15310 -24162 -28096 -27879 -14905 -10654 -5637 11879
20497 11879 47397 40851 5271 -3285 -12352 -8898 -1852 -23854 -24821 -6535 11166 2611 -14162
20484 -14162 -4026 -30519 -40882 -28681 -8219 21031 39428 4984 -21395 -38764 -31203 -4189
20472 -4189 -10766 -42320 -44525 -213 -9519 -41592 -58134 -63241 -66663 -61939 -33418 24026 11321
20459 11321 15975 16999 -18384 -16245 3389 21367 41176 41025 45850 41513 51398 63661 26946
20446 26946 3123 7242 14458 12125 20717 17878 13335 856 1373 24935 17985 -6096 -16322
20433 -16322 -14190 7923 -13619 -30102 -58439 -52187 -42560 -17321 -7250 -33517 -59091 -62748
20421 -62748 -26913 14163 34692 34020 19220 9162 1220 -9887 18222 37835 10793 -9702
20409 -9702 28844 12105 -18301 -1046 -3628 -20353 -1340 5936 -7588 1514 -9522 -18079 -25658
20396 -25658 -29545 -13190 -30152 -10118 -21601 -28150 -4503 22044 16004 2783 -19699 -15932
20384 -15932 24635 40557 6575 5397 18879 16442 -298 -17608 16727 49086 71891 54582
20372 54582 29871 30766 30372 -2254 -36161 -33583 -37140 -40287 -35447 -31631 -30206 -38545 -27569 -38628
20358 -38628 -32816 -33185 -632 40550 68610 48167 -2798 -28306 -40844 -36457 -31591 -27104 -22174
20345 -22174 -12885 -44209 -80505 -51062 -23391 -10915 -11206 -8656 6869 34846 -4719 -23155
20333 -23155 -23787 -23558 -5538 5872 39617 45207 26121 -8698 -4337 10849 1869 -18453 -494
20320 -494 -2979 -31518 -3709 18129 -13262 -36647 -21858 4252 20119 13089 648 27078
20308 27078 27601 -5059 -37333 -28552 -40630 -87293 -55858 -30882 -18305 16204 28604 17270
20296 17270 -11057 -24789 -22275 -19505 -6729 1105 -5537 -27470 -68874 -71835 -62936 -56123 -55106
20283 -55106 -30205 -17671 -44542 -48156 -34164 -27671 -56469 -76242 -64162 -48459 -57393 -21263
20271 -21263 -14634 -49861 -41298 -28741 -36445 -12967 13970 2963 7030 -7385 -4088 -8514 -14664
20258 -14664 2854 3135 22904 29935 3459 -2806 6711 -4185 7907 -1994 -7340 8199 2777
20245 2777 -21877 -513 20625 35832 31065 6435 -21787 -24517 -42328 -55518 -21062 1508
20233 1508 19381 12694 -4137 -5193 -21549 -45037 -42059 -23877 -2719 3355 -7172 -36003 -57297
20220 -57297 -56735 -33792 -46224 -47840 -38055 -34881 -19109 -16821 -18665 -11282 -76 -155 12620 -9727
20206 -9727 -29910 -13051 -10220 -15879 -20241 -36963 -31511 -12690 -21113 -23763 -8351 -3155 -16710
20193 -16710 -11112 -17248 -17630 5396 -634 11502 32696 31529 -6834 -18218 -6012 5384 232
20180 232 -39971 -56199 -57976 -20337 -22992 -38571 -20497 -20028 -7338 30023 20763 7225 14458
20167 14458 39966 43946 71829 41476 -27388 -67467 -88955 -79978 -55376 -32323 -1041 33817
20155 33817 24062 54895 56990 16304 -21425 -48657 -46607 -33083 -61316 -38937 -32024 -23478 10781
20142 10781 -5811 -24638 -30586 -9463 17000 1917 -4885 10743 5222 -14381 -19824 -3363
20130 -3363 2355 -22448 -17978 -12011 10771 3361 -8031 8113 26991 10111 19938 45582 31334
20117 31334 13254 23306 22833 -5799 -3827 -5067 -5815 -18456 -30662 -34705 -45121 -64128 -66259
20104 -66259 -35943 -15822 -4656 -551 2030 -1142 5700 5913 4890 -5610 1175 -12587 -37834
20091 -37834 -22776 305 -14914 -45454 -13716 -1675 -20929 -32791 -29398 -24495 -19001 -28073
20079 -28073 -36991 -17464 -2663 -19513 -34196 -39066 -22534 -34677 -45128 -46632 -37203 -30936 -23500
20066 -23500 -15727 -45521 -90179 -78044 -39014 -28477 -45893 -46360 -31319 -46010 -45875 -14448 -10986
20053 -10986 -14698 -3304 -11644 -34902 -57492 -27937 1403 1748 -19037 -38562 -48295 -51706 -42492
20040 -42492 -19173 -6558 18649 10776 -10560 -37982 -29751 -25773 -13759 9293 23240 23062 44475
20027 44475 19584 -18486 -4780 30576 46869 21162 4027 -3664 -3411 -2682 -9847 -19505 -9122
20014 -9122 -17507 -15281 -3324 -512 -12324 -16720 -17179 -6463 35945 24279 -3649 -25105 1318
20001 1318 32759 68412 71553 38309 9081 -15005 4937 -13754 -39351 -38251 -32548 -4389
19989 -4389 38391 26442 -24925 -35529 -10543 22814 12202 -12575 1514 31602 18479 17263
19977 17263 18565 10976 25578 14113 -4456 -12780 -3881 -19510 -52160 -48653 -44186 -32802 -23092
19964 -23092 -10042 733 -15275 -28978 -18785 -19834 -20352 -8610 9336 3220 29870 22621 15658
19951 15658 39191 43642 38523 9208 3862 7078 -11847 -29305 -57643 -63883 -41291 -15940 -12503
19938 -12503 10828 33033 28706 11250 -29 971 36890 33641 10928 -1319 -15681 -37290
19926 -37290 -36491 -33905 -39528 -30069 -40666 -58428 -32694 -27051 -63055 -76881 -52932 -36438 -36292
19913 -36292 -35147 -27151 -20594 -15448 -14306 -21975 -33865 -34867 -36246 -47314 -51314 -40475 -2091
19900 -2091 53063 50738 48167 53742 21834 -8000 -10639 23434 29876 31235 14232 -10009 17977
19887 17977 11304 11892 43070 59057 60774 60703 73180 53944 49628 54222 21346 29820 38822 44618
19873 44618 65836 49091 25696 15792 26508 41481 29270 15783 6808 -1998 22376 36071
19861 36071 15204 -4708 27918 28515 28089 13965 497 19461 52348 49553 37918 29375 15589
19848 15589 -1802 -6043 -34658 -18825 1395 3541 -2111 -21558 -13901 -17179 -1605 12661 -953
19835 -953 2120 6616 -19786 -30898 -10138 -11622 -20893 -26146 -51951 -57629 -8012 24727 17080
19822 17080 8828 37097 8323 -11437 -55285 -67704 -46644 -24728 -13237 3873 33479 34087
19810 34087 2525 -31069 -41428 -22719 -4562 -10261 -14780 -34019 -59701 -15825 7604 5767
19798 5767 29977 26270 -23 -31491 -28896 -11101 -9413 -27505 -39719 -63046 -20758 7094
19786 7094 5604 -28185 -39473 -14712 -18656 -38618 -40850 -27802 -34471 -26447 -24865 -29853 -34566
19773 -34566 -11368 -4485 -5419 -1933 -8581 -35281 -41627 -20993 -20197 12009 40591 19192 -9725
19760 -9725 -22203 -9098 -19109 -41704 -46223 -40127 -33157 -37417 -45713 -29791 -1858 40 915
19747 915 3249 -16788 8673 10660 -7338 -25877 -34819 -27517 -13900 11763 48435 41223 15470
19734 15470 11824 -9359 -33522 -2214 27470 10825 4276 -6532 22202 40379 7188 8208
19722 8208 -9476 -41652 -58532 -57716 -40581 -19462 18805 9826 -20455 5814 16210 6067
19710 6067 -11101 -20069 -6273 -2511 -35474 -47977 -22936 11555 7732 10856 17127 40960 40455
19697 40455 11737 -4222 -24005 -61990 -29854 19336 9577 20358 9267 4499 -3967 -18816
19685 -18816 -9408 -775 -22460 -58384 -71882 -53975 -56311 -52152 -48461 -31200 -23988 -16975 11443
19672 11443 12592 -1658 7612 -12522 -33975 -63538 -34249 -15316 -19645 -7586 8814 8157 -15604
19659 -15604 -26242 -23645 2360 2596 7888 2444 -2426 -9417 -2807 -19005 -31805 -27027 -34573 -20294
19645 -20294 -11793 -3673 -26994 -26217 403 6276 -8498 -11131 -23499 -11016 14419 -4964 -18566
19632 -18566 3273 21302 35582 32701 35801 41173 31117 8649 13180 27290 30250 4955 -122
19619 -122 -2281 -19164 -38410 -42807 -44695 -63090 -77423 -77078 -68595 -68716 -85607 -98021 -83793 -50550
19605 -50550 -13395 -342 -7656 1516 8910 -16626 -44390 -69768 -68657 -61736 -54408 -35506 -11544
19592 -11544 -4170 19950 37197 5683 -14239 -21494 6566 -1481 -16618 -12315 -9174 5198 -11437
19579 -11437 -12421 13086 -3131 2461 12866 4664 -4262 -17656 -19469 -13909 -23964 14655 14686 -5748
19565 -5748 1861 -6599 -33513 -64486 -68098 -34970 -25273 -19237 -19352 -22026 -9612 -22215 -25220 -10641
19551 -10641 -2978 -26836 -36928 6473 1827 -11476 -2729 -10735 -36886 -35083 -24835 -24689 -28826
19538 -28826 -35484 -51369 -16791 -13323 -7790 -9276 -26428 -23352 5519 4883 -14250 -2930 29822
19525 29822 27011 2636 -36787 -39332 -22759 -17595 -414 -9818 -19092 -8283 -33594 -24200 19167
19512 19167 33441 28753 24516 8998 39704 34658 16022 4884 -18055 -15029 -6877 -21754 -7909
19499 -7909 13458 14247 -9246 -16114 -28850 -20916 116 37590 31416 7667 -13025 -37413 -63752
19486 -63752 -52398 -34535 -31468 -36527 -20703 0 -24696 -29533 -2643 -17198 -32987 -4846
19474 -4846 282 -25816 -47311 -55144 -41900 -28910 -24101 -47110 -78636 -73832 -42568 -16300 -19743
19461 -19743 -38369 -43748 -41577 -35535 -38733 -51830 -33131 -24186 -24221 -13806 -16955 -4862 -4562 -3679
19447 -3679 -39814 -75350 -80094 -63000 -36281 -20832 -1081 2086 -20932 -27338 -52345 -63486
19435 -63486 -8739 -2884 -38409 -38839 -47107 -51967 -69283 -78757 -52953 -18749 -12006 -11705 6221
19422 6221 -2231 -10653 -11360 -1373 23089 -16860 -51890 -44821 -34098 -21836 -25915 -6954 12769
19409 12769 1455 3748 -12236 -7044 -36223 -48222 -37463 -18449 -5144 -20237 -69208 -33949
19397 -33949 6698 3853 -8783 -31436 -50192 -36274 -32969 -22368 -29425 -15556 3075 -8122
19385 -8122 -19041 -3558 3174 -838 -14300 -36012 -15426 -16057 -11872 14714 37532 49605 29280
19372 29280 5075 -10497 -26853 -13929 -11870 6911 -2852 -11191 -13888 8676 -20893 -25580 -12714
19359 -12714 -9121 4231 10988 16273 11328 3584 32018 8124 -18057 -28006 -18715 -2974 7622
19346 7622 35460 29011 26139 11338 6378 6604 24319 52177 31896 -23580 -30382 -55141 -46388
19333 -46388 -30287 -39083 -40291 -2463 26596 28460 28227 39196 33082 32846 51960 47025 31654
19320 31654 1233 11445 38260 29070 28798 23683 -6084 -9840 -888 -13819 -21913 -8155 927
19307 927 500 18071 21421 18706 -7183 -11713 -14611 -7682 -11941 892 -3149 -4374 12774 1211
19293 1211 -3431 -17381 -25248 -9033 -25581 -38439 -21424 -1429 -11201 -13095 -27277 -34546 -41548
19280 -41548 -7437 18486 51204 55241 48688 4684 -30619 -27531 -6384 -16740 -26900 -26571 -6522
19267 -6522 -2200 -3114 11615 17675 20592 18351 2351 -12607 -16890 25268 34940 -5371 -25013
19254 -25013 -31261 -17608 -14906 -17368 -14933 -6046 465 2411 -17744 -1243 2144 -9393 -19777
19241 -19777 -19932 -27445 -15991 43688 64079 60064 61790 49988 52415 23603 11915 33173 78300
19228 78300 82182 74042 75509 74663 60385 71620 84852 96973 74107 25282 9655 15389 44274
19215 44274 38558 34801 11973 -6294 12854 41137 38179 26388 27703 43622 13248 -17008
19203 -17008 -15140 7264 29071 44136 26735 17873 29779 60742 48719 34081 32926 31586
19191 31586 33583 50191 49789 47426 20056 18157 32034 57484 51204 25032 -3739 10151 16641
19178 16641 8223 14837 9828 5793 14367 25673 19871 16962 10551 -8892 -1978 -8797 -4484 3187
19164 3187 2898 18445 8827 7118 -5638 -8196 -18444 3143 21203 -3508 1170 4004 12792
19151 12792 42070 59353 65488 46348 36135 17376 4867 25057 38761 9735 14874 16560
19139 16560 20835 52367 62041 58820 26382 5036 14467 31352 16786 2057 3061 -2414 -18768
19126 -18768 9736 14434 -1266 -10033 -43289 -15304 18870 21032 -2739 -22094 -33110 -29869
19114 -29869 2381 10938 7812 9901 28715 59693 66540 34107 30353 27161 25217 3818 -28685
19101 -28685 -27131 -6688 6300 14547 12087 34672 57565 53313 37178 52880 41113 44487 52338
19088 52338 36333 32355 15115 11661 16286 1452 -10060 -20521 9619 12767 -845 3962 -2799
19075 -2799 17011 31281 7770 -23590 -47203 -28619 -3386 -16060 -18955 21306 10524 42292
19063 42292 49529 32764 14887 30330 24241 -10563 10398 34084 34182 17044 5811 8798 -4587
19050 -4587 -10006 -5021 7702 -3801 -12887 12516 18658 44093 46566 34302 -14442 -31724 -40089
19037 -40089 -4592 42280 34194 12325 -6274 -14148 -37942 -46976 -47098 -26732 -29403 -17835 5348
19024 5348 5202 34358 51449 46193 27641 3286 12722 16987 9964 18279 42471 15509 -30370
19011 -30370 -28085 -14883 220 1534 17406 8133 6147 18572 23221 14667 -2189 -22204 -15258
18998 -15258 -15250 -25242 -9794 -5750 -41106 -19356 -15444 -19436 -17574 -2426 36976 48545 51090 44063
18984 44063 50289 45155 7246 -10522 1949 4711 -12685 23271 37600 7318 -21937 22897
18972 22897 49496 51686 80316 50614 21501 18909 16102 24676 26076 16148 3213 -29180 -31545
18959 -31545 -29326 -12461 -4023 -3282 -2865 3429 807 2953 36261 49647 39289 22600 19435 26293
18945 26293 11004 -19414 -201 32159 36598 24943 46566 28593 31549 78105 61994 65678
18933 65678 63914 44725 41875 42833 11974 40069 59278 70709 85531 54592 41135 38991 29991
18920 29991 7514 8562 35605 52855 57727 43855 14171 -42639 -57681 -56077 -30960 -8968
18908 -8968 25563 45490 37854 24134 46111 22733 1415 10160 16458 15566 12198 37846 39863
18895 39863 17210 13552 33426 41753 46138 42563 18269 -3483 -27119 -115 -19326 -33165
18883 -33165 -20111 -21145 -17407 17276 24395 31599 26783 21659 25328 50971 57963 58075 58417 37243
18869 37243 35200 14143 35610 32508 33827 23653 -2392 -12967 -10660 -25166 -10691 -157
18857 -157 1195 1192 6375 45365 68979 81645 55754 31474 28128 31599 20846 39323 29571 -4730
18843 -4730 11413 21563 17006 17612 21510 -485 -966 -22224 -26467 -24652 19221 37613 16700
18830 16700 -4555 1309 -740 -7762 -10094 38141 62170 47154 46170 1307 -26343 -44948 -20572
18817 -20572 -41729 -69055 -71793 -54563 -48832 -38997 -22741 -22980 15975 28929 12706 45223 60741
18804 60741 43403 23957 36226 43214 33539 21296 9832 3538 24479 38805 42256 6993
18792 6993 20601 35178 38854 36399 5163 -19469 -7410 -31865 390 18163 19495 7458
18780 7458 305 27114 40486 34028 16137 23081 42559 61800 80059 107096 125149 162441
18768 162441 219307 319063 345851 331506 289188 238609 197828 113779 105684 96755 77119 34192
18756 34192 10470 25396 39888 83290 98308 73656 51615 18410 6185 1868 26759 22706
18744 22706 21540 8105 4899 1740 11423 38050 49727 38008 39782 61279 87541 90924 73677
18731 73677 77337 113011 115995 102948 96697 95972 79947 68409 63822 89590 110484 129516 149103
18718 149103 148384 166439 157031 125968 129311 131465 108783 109997 139976 130942 114932 108200 119409
18705 119409 135107 170027 198374 272530 440826 709619 887754 886935 777296 614165 471150
18694 471150 362776 300550 248742 230540 185587 166171 164418 136668 120868 131551 142217
18683 142217 171815 196268 170569 114218 99770 130659 127223 91296 68153 76763 88839 91617
18671 91617 55048 61952 86976 114760 103818 82316 80725 108554 100771 46836 37874 51940
18659 51940 62888 71409 89939 90231 69357 68390 69725 99858 92186 82266 85006 76069 34780 45900
18645 45900 46565 63847 63202 39194 48326 38326 40366 38547 92653 102638 59651 47105 34401
18632 34401 42856 50008 71029 74703 73887 104937 115843 179033 204470 201910 217449 218114 212997
18619 212997 227742 226898 251372 259335 277376 269044 272023 297702 311510 328438 324911 294979 242787
18606 242787 199952 172450 172471 183790 209647 208253 229284 232455 256804 296180 261542 240132
18594 240132 221742 233916 202088 176182 191934 206116 174348 183276 204672 192259 175259 171474
18582 171474 187813 145011 100514 91700 122227 140782 160908 164409 120660 76454 77251 40891
18570 40891 1616 -1527 14882 24377 19236 42924 48425 7123 -21223 -44077 -17114 35982
18558 35982 66119 45894 26307 29291 51717 76161 110465 161978 189682 217552 229096 236473
18546 236473 229354 223261 179739 177590 215053 232611 234612 240046 222434 194981 170186 138376
18534 138376 134246 179691 224178 208021 175813 144963 135964 119951 84209 89903 85033 55516
18522 55516 63873 89318 89010 78776 81518 61617 55977 69013 48079 58989 78254 79011 84956
18509 84956 82529 82359 77598 87208 119308 182712 227443 283506 334102 355221 322880 294424 252962
18496 252962 225529 153028 113197 124225 91488 36139 -6909 -20375 16746 26986 25345 44418
18484 44418 56962 80388 64359 50941 57188 46484 19975 6301 -1250 -4025 -6136 7506
18472 7506 4190 -7368 -5258 8525 19015 39359 26787 14211 31700 57854 36690 -5165
18460 -5165 11822 6874 5085 41419 84244 105231 144801 193659 210913 233702 222496 222202 215277
18447 215277 198336 171857 108716 60887 51047 46195 43846 56348 46210 58846 23328 4178
18435 4178 13898 37791 22344 -13144 -18418 2445 22970 29655 38840 72205 130801 140492 121176
18422 121176 125643 146342 163772 162183 146394 147076 136146 115941 107297 89058 79522 90523 108396
18409 108396 129062 146906 169037 175719 133657 101968 97199 92424 101070 103180 113055 72625 65540
18396 65540 64625 79416 98557 103949 105690 105268 107907 112633 130576 128680 141203 131170 135498 140600
18382 140600 133064 115470 134856 168889 134756 122129 106637 78505 85045 104280 119130 102237
18370 102237 103902 130313 107204 116992 177222 204666 164796 117026 119074 154494 168267 187603
18358 187603 190804 173125 189040 226376 218906 194129 166859 178491 182667 168982 148236 139480
18346 139480 151657 129687 132616 136418 165259 172715 152196 115810 98484 81951 79235 87388
18334 87388 86949 67516 72992 81887 101412 121712 110309 71013 35294 48093 36187 21338
18322 21338 63132 66472 64436 53721 53373 68363 63283 21396 35183 42583 46445 41471 52063
18309 52063 83358 130276 167749 216642 239634 216469 182359 176651 204805 219227 191697 213783
18297 213783 235516 236860 218696 222336 252325 266598 244953 209182 218477 238508 228696 208999
18285 208999 207377 178651 177256 188713 178925 189331 221505 234868 238412 245071 260259 286104
18273 286104 263464 246324 248480 216650 192670 164048 181792 182843 192738 220144 196687 205198
18261 205198 239033 239236 245526 251527 208363 213339 226673 215008 195790 203618 218344 228349 246527
18248 246527 288902 281897 275253 281246 312349 356435 422609 490714 524143 537526 524419 535684
18236 535684 561899 581776 587654 551913 483751 393139 340473 327061 327248 311681 318727 325292
18224 325292 346209 347269 340488 336183 348541 404974 386756 354727 355955 356127 356247 394903 398642
18211 398642 399059 385889 401769 443253 444198 358558 334013 345888 349937 364372 351119 355424 386578
18198 386578 411463 463756 458512 431526 482180 513607 533420 563157 565190 542805 537892 531241
18186 531241 493800 454213 429905 455267 479189 483717 485456 487837 497721 486532 489768 520016
18174 520016 538010 542279 560808 579640 616601 674904 711803 761387 774555 815562 824265 842893
18162 842893 883035 917227 946320 987818 1040396 1075498 1155866 1260815 1373657 1508392 1625897
18151 1625897 1749456 1897945 1999252 2114576 2216626 2374290 2618206 2929673 3294143
18142 3294143 3779259 4362113 5138614 6262866 8072426 10964230 15282563 20040388 23065354
18133 23065354 24316455 25719939 28301704 31049583 32763533 34424810 37462423 40594952
18125 40594952 41453522 41376474 43296940 48059087 53796178 58124244 61116370 65413887
18117 65413887 75412391 96024645 131107770 172917643 194911577 186636797 168016088
18110 168016088 154392229 148629798 144132513 129810860 109938096 89528726 69811394
18103 69811394 53590895 42288929 34866378 29241133 24431698 20586580 17653542 15487490
18095 15487490 13915896 12959541 12887514 13673210 15297313 17751796 19699895 19140864 16715346
18086 16715346 14052773 11578548 9569489 8260840 7629626 7686182 8291596 8813760 8455529
18077 8455529 7499714 6555750 5690132 5018490 4550841 4294639 4209742 4212480 4180997 4109198
18067 4109198 4085138 4159565 4321062 4550552 4798884 5116022 5580593 6157630 6850788 7792257
18057 7792257 9213270 11691072 16077691 23400855 33342075 40917113 41434813 37629505
18049 37629505 33264428 29824252 28663618 31298243 38858521 51020377 64231426 77230465
18041 77230465 90012357 94294309 87569960 78763114 73027084 68952180 62614554 54739193
18033 54739193 49022566 46627301 45885500 42763870 36453196 29615592 23440507 18279021
18025 18279021 14457535 11851069 10084501 8794056 7792071 7044746 6476783 6005593
18017 6005593 5620913 5243202 4915527 4635531 4370609 4127999 3895346 3709595 3630478 3606290
18007 3606290 3669420 3857577 4137269 4537392 5110880 5995600 7287959 9198914 12298368
17998 12298368 17457854 25588192 35397198 42117696 45018803 48055601 50119193 46571387
17990 46571387 38935884 31380401 24866043 19318105 14798963 11405151 8977702 7142774
17982 7142774 5752686 4727710 3975011 3431771 3031883 2746738 2526571 2355587 2185856
17973 2185856 2085448 2032564 2044395 2069501 2094732 2092352 2086680 2004426 1892523 1779045 1641879
17962 1641879 1523926 1433423 1387437 1405749 1471520 1582488 1743655 1935294 2145284 2438267
17952 2438267 2901365 3668256 4997814 7176160 10238958 12904652 13985183 14525966 15215557
17943 15215557 14722838 12544621 9973792 7703941 5775748 4306889 3325899 2674297
17935 2674297 2198598 1808328 1560865 1374989 1248397 1148565 1077004 998797 903738 839756
17925 839756 779019 731304 720111 747674 796831 799478 757475 759344 738442 678859 625033 577832
17913 577832 553431 510535 449599 396952 371904 370379 387955 432046 420708 396210 390885 378877
17901 378877 385810 405115 407445 348980 341836 321480 315275 306331 287365 283466 288989 258627 250598
17888 250598 256343 234887 216467 195107 173223 191001 226923 217963 197602 210009 227968 214444
17876 214444 230986 204856 192777 194483 203839 197522 169292 139491 127494 124581 116473 115481 127600
17863 127600 149781 164944 202742 212667 225218 247321 262135 281576 279928 240383 228811 226819
17851 226819 225181 195874 170485 169774 205434 198335 203462 217549 216067 187760 162362 154349 144495
17838 144495 121176 114766 124831 131815 148358 134350 140822 132891 113118 124865 151353 138879
17826 138879 125216 120354 100573 111564 132179 125056 139777 162326 154621 164120 168375 136818
17814 136818 114774 119161 144866 146512 137445 128763 106821 75193 48517 64680 116231 124148
17802 124148 96528 93958 101789 105385 108986 92972 87321 133338 186087 193915 221483 219435 212237
17789 212237 226374 223355 219470 207131 221658 211661 207436 218760 201880 167763 153602 139073
17777 139073 125582 110145 87909 85884 137127 153538 158647 193397 198274 149700 125980 152906
17765 152906 123099 94865 99124 92856 82843 94253 100358 78227 77190 82173 114711 122821 124933
17752 124933 104000 112886 141892 124269 106883 126287 120425 101980 99314 93717 94333 87131 95982
17739 95982 107806 91362 118609 141867 109657 80639 116669 126334 120581 109104 98712 91004
17727 91004 57317 43611 61778 77724 71747 71982 84428 117977 120897 100387 111974 100962
17715 100962 80390 69940 100450 78946 65862 55689 47729 30233 19784 44817 81026 122285
17703 122285 109770 110958 110135 105555 130090 157529 166028 155129 159904 167862 152205 116458 78003
17690 78003 72494 109899 150667 160062 157994 176700 184420 184316 163345 172604 177213 149995 157531
17677 157531 156931 133814 158417 254136 286263 278374 242709 212680 202056 231651 237607 218504
17665 218504 197971 217581 200984 153595 110114 101258 133668 158045 162807 167021 218356 214067
17653 214067 211157 223306 211774 187719 162595 160583 173858 170414 157777 119830 134937 160307
17641 160307 181878 177660 195214 254190 317416 320773 316209 302516 300204 317232 332702 360814
17629 360814 359921 369834 380744 347045 351056 382417 397063 386377 380318 370032 369291 360513 334074
17616 334074 306412 318908 307724 315420 322771 317537 299883 279690 253806 230489 203656 160319
17604 160319 134323 119786 87217 82408 101806 104148 118889 131511 146477 127629 92355 87136
17592 87136 101413 86424 82676 59916 60870 96097 93808 69020 74541 101537 90881 86079 82754
17579 82754 121422 171795 205114 229023 206144 185391 187407 203511 196057 206890 211444 204777
17567 204777 215766 227524 227914 233638 211310 195808 200105 210052 205499 190554 176039 148160 154137
17554 154137 136015 107434 106184 119526 109402 149198 199606 247997 259874 242184 218435 211259
17542 211259 151989 92638 93795 117295 129456 132027 125197 114185 135213 172658 176000 168047
17530 168047 147386 139763 199603 267301 309375 369420 435228 558660 708049 900252 1054068
17519 1054068 1079743 968824 840891 691445 566334 465323 415783 361885 310139 281768
17509 281768 257782 248751 275464 267431 259657 243016 239367 259639 284838 319582 379651 435581
17497 435581 434686 406754 382320 343982 293898 276166 241166 233097 211337 172802 154759 148505
17485 148505 142030 162843 164190 140805 135152 136862 155066 153687 149269 144760 165824 183801 167535
17472 167535 144523 127080 99830 108805 145858 164214 144568 147005 139655 132182 132053 139763 146412
17459 146412 154062 131346 125005 108512 123482 173656 178550 227324 280378 291571 269760 262827
17447 262827 293535 295620 320545 328661 382754 466306 460831 347641 263356 246689 220374 186393
17435 186393 150689 151731 149231 152015 144491 149613 128711 111052 113796 147007 158734 151545 140981
17422 140981 109155 94911 118364 92897 110616 116838 104645 115764 115691 73777 64855 57087 69269
17409 69269 49473 55529 80069 79770 70875 89122 93474 78251 61269 49015 45273 31042 37962
17396 37962 64200 33623 17501 33151 46118 52147 69590 42507 38583 54709 78256 70992
17384 70992 61533 61012 61146 50108 31917 44897 80396 71769 84156 89399 69069 72302 81925
17371 81925 120674 110844 100577 131357 125401 95907 90401 92751 78209 84196 71691 79573 78554
17358 78554 78246 65023 54736 60616 72170 68435 44433 56856 59442 46773 50104 53527 43954
17345 43954 73727 66837 65241 55536 43367 77575 94719 98415 75594 56641 30129 3982
17333 3982 2240 9772 20976 28422 49413 66814 49562 44867 72938 74975 62011 29086 24251
17320 24251 50555 64590 90815 88164 45444 27270 -4776 5071 35037 54509 80018 102188
17308 102188 109135 140488 150719 123405 136427 149731 150766 152205 155376 130777 101600 104388
17296 104388 91218 96827 118890 110997 100626 91134 107708 88704 73683 64436 79075 84369
17284 84369 61703 54709 69235 103801 105779 96923 95014 82247 97187 88655 105345 127651 130153
17271 130153 123349 131828 145304 120530 118364 104335 92259 122639 137588 138808 139242 147304 164421
17258 164421 166404 145023 160639 179547 177676 182424 179741 183875 196488 185527 191662 210123 209856
17245 209856 229317 276380 330273 423352 578069 760974 864537 888442 824232 697582 574224
17234 574224 497310 446590 425986 387899 337450 298873 314018 343562 357880 401079 453409
17223 453409 516573 640678 848626 1105321 1279215 1288079 1180369 1018613 893315 816445
17213 816445 741396 710514 703496 726899 783964 822460 850573 884886 921258 986496 1040293 1156939
17201 1156939 1332959 1566787 1865591 2186954 2672940 3474840 4764361 6920257 10450797
17192 10450797 15394527 19778353 20820375 18874343 15964123 13090577 10768167 9353868
17184 9353868 8933501 9564106 11535594 15397379 20952783 25895309 28659519 30579279
17176 30579279 31554736 29441659 24893801 20090910 15869766 12518967 10224301 8855231
17168 8855231 8281472 8590636 9909917 12605772 16544020 19679890 19605665 17064770 13966882
17159 13966882 10981197 8504183 6711998 5500043 4770518 4429309 4372566 4554098 5044531
17150 5044531 6031530 7833260 10826748 14907516 18226724 18729510 16922173 14410635
17142 14410635 11995934 10133720 9107418 9028226 10025715 12473651 16775428 22416882
17134 22416882 27285541 30059958 30592801 28174173 23580491 18803346 14710031 11557950
17126 11557950 9428487 8194099 7755600 8115022 9520732 12361870 16163187 18633324
17118 18633324 17964304 15331671 12289171 9370625 6938457 5222294 4015317 3195193
17110 3195193 2633818 2193102 1869989 1625719 1438404 1294246 1178536 1134210 1093889 1055443
17100 1055443 963610 878874 822690 823657 800832 769905 721937 677592 650745 648335 619810 617755
17088 617755 691586 798615 893242 945485 896118 784242 722916 676051 642168 657890 707767
17077 707767 851343 983039 997143 903765 766681 631148 497635 387235 328781 278381
17067 278381 216358 195385 200331 179269 172375 172892 153981 144779 154637 176692 169284 147901 135519
17054 135519 147770 146528 130231 138366 128122 126556 132330 90486 63377 65982 126835 157063
17042 157063 153271 143259 135468 135438 109941 109306 116613 76494 53082 90952 82934 100841 105737
17029 105737 110718 96754 87107 103186 108610 96905 68217 60377 67044 52331 36930 17839
17017 17839 41394 56473 73222 92199 96399 69761 78248 98478 77493 58848 71425 89458
17005 89458 59382 46894 40881 63169 95489 84628 68336 60456 82029 64873 33044 53179
16993 53179 38870 16595 31402 41964 42809 55765 55366 70014 74396 81225 43723 27650 16340
16980 16340 33816 84892 93363 72451 94148 114647 99088 82864 75740 67054 44282 22460
16968 22460 19754 7958 51383 72225 63158 43529 41853 31054 6992 2157 43630 87306
16956 87306 89936 80405 59157 40519 49543 19402 11240 37889 40997 48592 48326 20518 -3188
16943 -3188 37979 81743 47492 35439 50948 47006 57945 54221 34441 41379 69528 76005 52656
16930 52656 57205 45872 27880 33160 52770 78211 81204 60314 71284 59942 23267 10632
16918 10632 15117 -5948 -22914 -16865 18088 -7771 -28643 -21099 -34486 -22073 24607 23480
16906 23480 -575 -1358 7792 13616 19583 10631 -5326 9871 35117 30349 -5212 -34668 -16882
16893 -16882 34719 62880 69978 64771 43351 53115 32112 14509 16909 23076 15466 9660 4474
16880 4474 9707 3364 -14852 -4627 -14167 -6012 -9549 -267 33989 41931 28020 4263 16065
16867 16065 20800 22213 23302 12733 17362 28903 26781 26986 29122 21823 1609 16064 30609
16854 30609 14634 3178 6980 2451 6060 40125 48571 44313 31416 20404 -3169 -8010 18756
16841 18756 42754 50822 43331 19643 27104 13834 -9285 4070 20152 29313 33598 33927 26482
16828 26482 44214 27995 25074 9385 16403 26732 49323 44438 40563 51670 32036 14441
16816 14441 31700 19032 24010 32856 18634 41537 51848 39865 1315 18170 41303 48767
16804 48767 57816 45347 34850 45072 51101 36992 41349 16832 22776 26359 43153 35689 25490
16791 25490 3639 -9172 5939 21891 27627 17029 24906 16280 27009 19807 10004 1213 -11960
16778 -11960 -25949 -7357 -10283 -7818 26862 42281 47911 42109 40093 22706 44059 61535 44389
16765 44389 -1008 -16222 -23172 -572 37182 51866 78491 57164 25813 26771 35049 22480
16753 22480 -5938 -21088 741 -1664 -13228 -10975 -14156 5610 17842 23635 35260 8150
16741 8150 -6090 3119 27467 25229 24864 28242 30907 28064 -1572 -371 16683 23275 -1504 14084
16727 14084 23964 23851 30478 36092 53616 50967 41086 39080 28887 30637 32153 35182 39723 30083
16713 30083 24923 45153 48976 49839 61883 53970 46078 47414 38270 27947 39273 35800 12607
16700 12607 17229 54922 60772 41270 2886 5786 45513 84184 107231 115627 109592 105329 122921
16687 122921 130086 111971 114321 96035 70260 53122 60680 81676 98983 101557 125070 121319
16675 121319 171637 195157 158685 95286 55408 30711 43236 64818 43157 22215 45761
16664 45761 85554 89058 93784 93290 93075 97683 74425 58613 62438 56667 40675 57838 107093
16651 107093 114685 116592 112602 114171 119930 92368 85448 115472 62865 8290 21728 78920 140707
16638 140707 144842 157330 200499 202648 174329 163254 154064 115998 72178 40947 24298 29227
16626 29227 50371 38568 39386 34930 55786 88680 125272 115418 75589 80294 69933 32074 14191
16613 14191 6373 5797 -58 11816 33603 49547 24559 12355 1342 8315 -11014 -7968 17126
16600 17126 4846 -19640 1617 18646 2417 17531 65172 58709 39663 29370 38940 54023
16588 54023 54421 45200 51772 49229 47967 48947 29644 5450 -2788 -20807 -15180 23433 32624 43065
16574 43065 6108 11351 5325 22990 36120 70306 51135 38509 33109 63712 54024 38302
16562 38302 21589 27698 10185 8556 30530 11491 -30887 -8348 -10345 -44397 -64987 -45399
16550 -45399 -13953 -10681 -31127 3410 12738 16939 23313 20500 41492 32589 35227 40438 10711
16537 10711 -34880 -49058 -31982 -17117 -18939 -45940 -60992 -42992 -19415 5821 -13477 9410
16525 9410 7037 13146 18175 -3506 20 9102 24576 1029 -6407 -8597 -12522 7699 18703
16512 18703 771 -14762 -20911 -28201 -36638 -12670 34358 43266 10999 1399 38561 42841 43995
16499 43995 32803 33796 24204 26049 14558 21609 50612 39077 43324 42582 3689 -17352 -36676
16486 -36676 -20128 -7188 -9321 2175 -13330 -38430 -32124 -30598 -23415 -12838 6771 28110
16474 28110 48747 23080 -10576 6 -5389 -21259 -25375 -25738 -24686 -24542 -5857 -6268 -19885
16461 -19885 -41930 -52823 -45337 -43274 -16596 1859 15576 -5060 -22893 -46414 -62608 -32224
16449 -32224 -19713 -16579 -21326 -22302 2179 42949 35927 47413 35253 16988 15951 -2177 -38199
16436 -38199 -37005 -8485 -4583 7760 23174 18278 -27932 -32999 -32981 -46774 -26048 4210 -1448
16423 -1448 -5588 -23954 -58252 -56854 -9701 42165 78429 76725 54133 37185 37722 16385 -30337
16410 -30337 -55899 -38108 4452 38249 44581 45299 21492 -21005 -14514 -1417 8996 2935 -24265
16397 -24265 -5913 12600 8229 -13487 -17917 -43011 -45166 -21339 -11490 7809 4956 -2624 -7940
16384 -7940 -11127 2703 19608 1912 -10615 15242 7292 -10923 30865 68745 51091 50759 35539
16371 35539 24297 37541 14218 17371 35342 36095 18864 4147 -31518 -41245 -22172 -19866 -29221
16358 -29221 10107 14089 7846 6582 15936 18106 20373 17618 31142 10184 -8295 -15067 2782
16345 2782 4364 1536 -17382 -28894 -34269 -22344 2442 -17871 -25127 -47394 -19831 -7505 -16584
16332 -16584 -14024 -22443 -8469 14377 9740 -5685 3178 14972 1020 6793 8203 10215 28182
16319 28182 21873 18819 -6833 8809 35288 33892 6617 -6727 25552 39236 39283 364 -5351
16306 -5351 845 830 31441 48802 23670 -16233 -43182 -44574 -80581 -63413 -41995 -42367 -42954 -34980
16292 -34980 -9060 21919 26372 -4823 -22767 -57064 -49377 -39671 -24714 -10045 413 -8404
16280 -8404 -24056 -34418 -35539 -26105 -29905 -21200 -8246 6478 21289 6411 -18638 -31276 -42916
16267 -42916 -22319 17697 4649 -43434 -72011 -72292 -53031 -36257 -47414 -39150 -51040 -51974 -52981
16254 -52981 -29561 4107 34805 20381 3709 11811 12351 8733 4071 3996 10506 22668 32419 18338
16240 18338 20367 -1994 -19585 -3051 -27722 -25846 -12320 4258 741 2337 30301 13796
16228 13796 -13677 -15290 -8422 8941 36209 14218 -8690 -18533 -26233 -13136 6051 34135
16216 34135 34475 21484 -22463 -19584 9063 -1081 5238 8985 6820 10315 16142 23186 22057 29237
16202 29237 25761 18989 23301 34577 33843 34617 50400 57073 46995 31746 16369 13044 228
16189 228 -8261 9243 11470 18125 -6789 -28630 -27605 -43233 -30967 -16034 -19441 -14860 1631
16176 1631 18043 5298 3116 -12913 -9536 15785 1987 8104 16470 5741 13053 22139 4011
16163 4011 9459 2956 -10122 15765 14852 10576 6963 -17169 -22406 -11108 -21600 -23125 17156
16150 17156 50942 51169 -4738 -54666 -85481 -44541 -40888 -25092 -9064 -19090 -15223 -15778 -16372
16137 -16372 -18495 -15535 -37356 -40554 -41367 -24454 -33876 -55769 -75719 -70932 -47678 -59847 -29301
16124 -29301 -23990 -49506 -62148 -45813 -14168 -8768 -24425 -19686 -6519 19008 7215 -7269
16112 -7269 -2755 -6 9616 26860 34987 -2181 -11859 -9780 22312 25883 21613 -811 -3024 -15120
16098 -15120 4946 5988 -28133 -9922 5820 7373 25348 10294 8406 -3927 -11726 -31199
16086 -31199 -26540 -13065 -13835 -25219 -8233 -5832 168 20245 7597 -17494 -10544 6015 11478
16073 11478 -2330 -11377 -35743 -38333 -42317 -47958 -1453 -9913 14850 23758 10269 -14531 -3224
16060 -3224 -8101 -33958 -28708 -32348 -22668 18443 5159 6820 9058 -505 -12535 -20696 -36640
16047 -36640 -50688 -41042 -23065 -15899 -48708 -21283 17492 25560 28249 36761 63612 57312 9709
16034 9709 -17874 -20688 -3096 4727 -389 -12049 -1195 -20827 -9697 24788 -3448 -54214
16022 -54214 -36295 -39232 -43374 -28511 -8313 18889 -15757 -27093 -21576 -17164 -3167 3034 13402
16009 13402 26308 27820 33771 28579 33150 10795 2256 24896 10724 -16580 157 -12086 -25142
15996 -25142 -22098 -12946 -23632 -7356 29815 8253 -14136 -19296 -24340 3785 21596 27799 16215
15983 16215 15524 -888 -28022 -50851 -78334 -71114 -63537 -40124 -43697 -48632 -46152 -39409 -18999
15970 -18999 20504 26281 24116 9915 -12314 -24246 -40878 -54885 -48748 -34268 -39484 -36298 -27175
15957 -27175 -23061 -12358 -13909 -30806 -14577 18232 41940 34329 10699 -6575 -21381 -10148
15945 -10148 3350 -4992 2004 -9577 -3795 1040 12819 28021 10373 -6947 -11212 -3838 20290
15932 20290 -10838 -49980 -60462 -39842 -9847 9138 11495 -1793 806 -2006 -25772 -33519
15920 -33519 -16106 339 21734 4950 -22091 -26147 -26882 -32167 -18300 -23287 -15797 13566 -16903
15907 -16903 -15018 -23482 -15322 2977 -11510 -18194 4288 10189 18971 29030 43432 32729 27091
15894 27091 21685 18420 15473 21442 -155 -8538 -23518 11327 34909 20646 -8459 -20182 -25629
15881 -25629 -1533 9880 -35 21713 34250 34189 13754 10163 5238 -9935 -10235 -13585 -12252 -19697
15867 -19697 13489 61295 37987 18723 13718 9455 -7304 3998 16201 33698 45107 67130
15855 67130 76289 79814 27998 17963 16101 8189 -482 2955 7643 1927 -9419 -16410 -46849
15842 -46849 -25343 11697 32698 -12317 -31734 -17403 -2581 8333 -35 3038 3571 -11352
15830 -11352 -19472 -5010 11076 30149 6672 8021 54821 48768 24964 13625 14074 11307 14585
15817 14585 -15950 -31417 -27461 -33691 -49294 -46662 -5979 -2020 -30274 -26664 -7825 8631 -4156
15804 -4156 4219 31001 44405 22530 -497 1341 -12124 -27603 -6207 -4841 -19959 -42706
15792 -42706 -54065 -44853 -28576 -23946 -46730 -28945 -24391 -38264 -27105 -4158 -1142 -42719
15780 -42719 -25515 -7265 -23759 -22682 -35684 -69003 -59444 -52480 -52469 -30326 -24937 -35894 -49227
15767 -49227 -53871 -54791 -32729 -19347 8967 9400 -2432 -41754 -66588 -41656 -23322 -29164 -13309
15754 -13309 5642 31325 27887 -7983 -19761 -18675 5816 25886 36181 4609 27878 62155
15742 62155 57695 20607 2480 19360 29560 31043 42140 23947 22457 24041 -9715 -9893 20103
15729 20103 33587 16685 2442 -18217 -23813 -13143 -10499 -20519 -28004 -62445 -68851 -49076
15717 -49076 -24615 9381 12296 11091 15860 8991 -11089 10774 21151 37910 33694 17812 19864
15704 19864 7394 -3505 -2789 15027 7718 -10378 11821 35288 44685 40520 5058 -38203 -34850
15691 -34850 -36490 -86944 -60785 -21447 -3380 -4632 -8716 -4979 12148 9041 16562 27972 26036
15678 26036 7034 -20468 -48654 -54399 -42783 -5774 -19815 -36950 -25511 -36606 -20093 -8963
15666 -8963 -12911 250 -15088 -27526 -46159 -61017 -45787 -12544 213 -4666 20899 24396
15654 24396 -11055 -25294 -39291 -42153 -49004 -79584 -79859 -47335 -34743 -51689 -49564 -31963 -39501
15641 -39501 2140 9800 -26869 -39457 -35379 -28903 -15445 -22831 -30335 -29171 -16969 -18297 -10632
15628 -10632 26184 29544 16102 15514 10298 2458 18148 45397 32753 15870 -23316 3665 23672
15615 23672 11985 -2109 -45704 -45229 -23700 -31131 -34781 -32114 -45505 -37642 -6827 1715 7962
15602 7962 3004 -14380 -16749 2708 -26574 -33763 -25851 -13103 -12466 -38192 -46133 -51488 -19899
15589 -19899 -32415 -56628 -36856 -27278 -2952 6085 -16041 -26817 -15474 -11419 22215 13809
15577 13809 -1051 5078 -18822 -22035 1492 -1432 -8470 7754 23615 8541 -24345 -15024 438
15564 438 11082 26210 6206 19771 12118 -12228 -17118 4044 27711 25165 -12326 -12743 -13570
15551 -13570 -27139 46 33763 22110 5182 11432 5711 -4887 1713 1975 2740 22222 18047
15538 18047 1634 -6668 851 -8758 -31647 -41552 -31926 -17937 -4079 -8662 -14845 -16945 -14013
15525 -14013 30890 22865 -35141 -51436 -28848 -3064 24630 62756 27834 -6606 21688 30342
15513 30342 14064 -16187 -46394 -65656 -70200 -63553 -76613 -69847 -20323 -15074 -40975 -82470
15501 -82470 -85572 -60965 -21546 -603 -6327 -39025 -56371 -40893 -21561 335 1597 10086
15489 10086 13411 20501 13481 11061 -18284 -54526 -34332 -25376 -24492 -7253 -10562 -42492 -49788
15476 -49788 -39717 -16320 -33443 -29740 -34161 -51629 -31973 -14319 -9505 -1200 33008 66276
15464 66276 59872 23166 4656 2007 -6094 -23093 -35739 -35633 -52486 -47055 -42332 -3733 -7343
15451 -7343 -27449 -5777 28317 34401 11429 -1709 4692 13800 931 6092 22793 32202 11323
15438 11323 10759 32649 47787 56294 54891 28170 10068 6562 -16534 -17701 -2816 -3205 17182
15425 17182 36720 30219 10764 -6343 11167 33473 38992 32274 33631 23535 2403 8267 -18808
15412 -18808 -20673 3291 25606 16422 24128 25753 14813 1312 6329 10929 -6952 -9136 20177
15399 20177 25705 12736 3763 3610 14859 12796 3432 -6513 -3167 2448 -7587 -35497 -29151 -5068
15385 -5068 861 6847 7417 3869 215 -8865 -26561 -49433 -51883 -37742 -14074 -22801 -33584 -48169
15371 -48169 -57754 -45067 -30393 -30561 -20136 13111 33004 50496 19271 11700 7610 -3892 -27882
15358 -27882 -44685 -41593 -18244 4109 -20572 -26196 -26935 -49042 -57904 -50948 -29994 15509 20961
15345 20961 25884 -5689 -24224 -25245 -40597 -64401 -96122 -79155 -88970 -75366 -33375 -13548
15333 -13548 -18114 -21020 -3114 28656 29046 17248 23466 24608 26207 -3555 -29347 -62324 -59537
15320 -59537 -43259 -33561 -57607 -67606 -50650 -53522 -51605 -45243 -44614 -38672 -974 -7770 -11345 -24244
15306 -24244 -18560 -20553 -22420 -31799 -34315 -28875 -20484 14829 17796 22786 19872 -15208 -19885 12647
15292 12647 40749 17773 -23068 -37544 -27912 -33911 -36310 -17771 2665 3421 14551 -15941 351
15279 351 -6179 -20665 -18831 -30766 -22016 -25449 -27218 556 4598 -33142 -26490 -12556 1500
15266 1500 -28567 -32822 -21849 -2252 1413 -498 -2009 5033 -1873 12994 12584 -1798 -2621 -23546
15252 -23546 -12892 -5722 26968 39900 28263 14177 18694 36381 25246 30154 27852 21792 -1417
15239 -1417 -11375 -24876 -20040 -3924 23610 31078 5404 19011 5154 6983 12999 14954 13806
15226 13806 -9894 -24716 -616 20275 28323 31750 2559 3819 33739 32257 -105 -43212
15214 -43212 -75021 -41934 1475 10505 -26566 -38732 -13953 -24799 -47477 -44581 -19618 -15557
15202 -15557 15755 30357 -7421 -23419 -16632 -14213 -8928 -6156 -27329 -65477 -65543 -63697 -48137
15189 -48137 -44285 -40211 -17284 -18291 -549 2068 -15635 -33837 -24069 2070 344 -8667 6216
15176 6216 20717 35877 33706 52458 75874 59048 20353 28113 15233 -17448 -8677 2540
15164 2540 -4438 -34270 -12598 13601 26136 22615 25482 33655 51280 16491 -12670 -6418 26685
15151 26685 -3736 -27449 -36067 -38828 1104 -8025 -13982 619 -6778 -2888 4601 2837 -5413
15138 -5413 -28242 -10891 19658 -9825 -31615 -40051 -35666 -29829 -21688 -34230 -34198 -53875 -78316
15125 -78316 -83276 -73295 -43257 -25104 -20296 -8785 11992 -5382 -2607 -18298 -23031 -37433 -46787
15112 -46787 -44324 -27870 -1238 6457 -13643 -1126 21043 24541 4221 1344 -2405 -2785 45053
15099 45053 20194 16457 13434 88 -18671 -17221 -8460 -2562 17395 10001 13681 29766 29930
15086 29930 -10035 -55464 -47756 -44441 -31603 -49145 -60416 -59232 -39754 -22882 -19647 -6693
15074 -6693 -7788 -21757 -39901 -38126 -21964 -6318 -54025 -72544 -67771 -65588 -51457 -36516 -48873
15061 -48873 -62848 -60918 -7427 22767 34246 19728 8263 -8617 -36167 -35610 -38969 -27919
15049 -27919 -23797 -24508 709 8971 -3927 -33100 -58222 -45035 -15309 -16411 -22408 -53853 -58965
15036 -58965 -31539 -22246 -5765 6384 7582 14645 7071 -3813 -6000 10503 -4006 -32986 -62851
15023 -62851 -57352 -43932 -35146 -23077 2965 8701 19704 21224 23970 5658 14800 34508 40963
15010 40963 27601 12018 -4690 -15427 -28070 -47440 -9750 37205 36048 26561 25808 28797 52287
14997 52287 36188 10497 14279 7876 -33360 -56998 -57718 -40794 -22363 7260 12746 -6295 -26293
14984 -26293 -40126 -20254 -18824 1182 9437 35786 32741 38019 70954 56942 18641 19713 12230
14971 12230 -1570 -16496 -14110 19123 49140 29105 -14 -23028 -32997 -43510 -48112 -29066
14959 -29066 -32245 -21618 -30959 -34394 -62105 -43409 -44234 -38981 -37620 -46143 -25200 10978 21757
14946 21757 60785 28657 6238 -561 -27613 -31629 -24536 -21671 -33005 -43629 -28397 -17857
14934 -17857 -7448 5292 20842 5402 -8609 1621 -1463 -1191 6872 -19518 -24018 9263 -6239
14921 -6239 -12878 -38129 -39475 -37621 -21168 5820 987 -617 -8210 -53144 -37899 -17634 -19265
14908 -19265 -31097 -29530 -16098 6649 30775 16711 1348 -5551 -7302 -15683 -10573 -11978 -3646
14895 -3646 -2501 -15140 13849 20055 4559 -2915 -5764 -7472 -20386 -8374 13839 -4244 -14513
14882 -14513 -18414 -33592 -22603 -23602 -24140 -8243 -12590 -8042 11622 -1370 14263 22103 24218
14869 24218 25728 30137 31484 17963 23163 22817 5744 -2315 28602 41965 17802 -18408 -57234
14856 -57234 -42234 11923 32218 18700 -12127 -27145 -9910 15947 33463 9055 -24814 -16211
14844 -16211 17250 19161 30618 15704 6171 18340 26294 26435 4417 1823 4344 9546 4751
14831 4751 -10554 -16676 15193 19734 -8608 -12862 -12385 -10941 10781 12029 3451 6442 -16623 -15803
14817 -15803 -31099 -45692 -49126 -40628 -26372 -21682 -2182 -27542 -59787 -20060 7905 15145
14805 15145 31530 18408 -895 -25619 -9170 13454 29651 15478 -7271 -21572 -19600 4058
14793 4058 23941 1946 -14819 -43427 -48124 -32239 -19970 -2929 1700 11411 3009 6994 -5468
14780 -5468 6199 36131 65828 42535 5047 14118 18369 21585 34752 21292 13577 -9367 -18388
14767 -18388 -37297 -69369 -76761 -49997 -20649 -20382 -37123 -35441 -31586 -32794 -52693 -37894 -42280
14754 -42280 -75586 -56615 -33138 -35354 -41909 -32879 2162 25840 14631 3132 29668 28265
14742 28265 23624 16193 -6967 -5021 -2125 19780 27485 12548 -7906 -17449 -30968 -26968 -26595
14729 -26595 -21606 -16329 -11172 -28985 -37387 -47536 -24469 -18174 6487 6770 -9568 -3796 14837
14716 14837 5880 125 8285 -11424 -25921 -9203 -26401 2006 12807 1474 -14882 -11492
14704 -11492 -10509 14756 45274 -4407 -21001 -18202 -9116 -9892 -7009 -10297 -6167 12305 35131
14691 35131 27580 18156 35196 25835 26456 29735 46205 41902 19408 16032 -2333 -15701 -8013
14678 -8013 5683 5041 12208 14314 -6438 -16304 -14023 4260 9351 31869 3825 -8618 18581
14665 18581 39331 31921 29759 17125 -894 -434 -19204 -44045 -43984 -36226 -27518 -19876 -16399 -7720
14651 -7720 -12761 -10966 14523 13112 -16916 -27594 -14185 -13564 5551 19402 -12330 -22380 -30595
14638 -30595 -20979 968 17884 9188 533 12897 15291 -9439 -11444 -6107 -2151 30605 9422
14625 9422 -18326 7680 -6315 -26035 -1739 3449 -12791 -28679 -41439 -24663 -11273 -18075
14613 -18075 -49502 -75074 -68166 -31042 -37403 -19067 -13883 -4258 2021 -3136 -8258 -5938 -15531
14600 -15531 -24889 -33235 -29133 -1761 7923 -12634 -18573 -35053 -26364 -16694 24965 33088 25441
14587 25441 4026 -13880 -3823 3342 -4608 -8900 -39641 -49344 -22151 -10164 -22405 -9116
14575 -9116 9499 -1483 -29935 -27793 -14599 -2198 590 -18742 -40246 -63038 -26140 5269
14563 5269 -45811 -39409 -32510 -23629 -42243 -53196 -62893 -86432 -47068 -33222 -31868 -28491 -24463
14550 -24463 -17519 -31499 -39400 -20352 2215 10864 12243 11014 -1090 -29884 -24665 1538 7561
14537 7561 47371 88320 48623 24457 2410 32261 29677 22200 27226 33526 41461 34276 47225
14524 47225 59533 19346 22580 11988 11905 2114 -27817 -45564 -45002 -34360 -9908 17091 2990
14511 2990 -22543 -29280 -19970 -6409 29829 35615 31212 42711 25992 5219 10136 -147 -8517
14498 -8517 -24951 -26706 -9780 -9887 -29974 -45044 -48659 -35416 -4358 4204 18057 -3610 -20502
14485 -20502 -538 12255 13160 24973 14323 9894 -18198 -39155 -56055 -59397 -39343 -30697 -41664
14472 -41664 -27185 -26641 -22307 -54518 -64065 -32569 -8989 2061 13514 9101 -1356 -4829 -19842
14459 -19842 -22227 -8157 -4944 -40391 -5461 -1381 12194 27270 18433 -6888 5036 28473
14447 28473 10288 -15569 -20061 -14218 -30664 -19557 -4698 4237 3441 -11542 -36762 -51055 -46458
14434 -46458 -49611 -61995 -48758 -37241 -44521 -34267 14834 9037 -25156 -16874 16614 29023
14422 29023 5341 -26237 -26612 -25116 -8734 17967 17484 41143 40022 41619 43208 10979 1253
14409 1253 8929 -19396 -21106 -16917 -4589 -4376 -28707 -32337 -15377 -20777 -23882 838 -689 8943
14395 8943 -10552 -9118 -7872 -1671 22591 34154 -469 -32665 -42374 -51984 -41436 785 2078
14382 2078 -2157 -43933 -31209 -18349 -63495 -50068 -43320 -30886 -158 953 12894 39961
14370 39961 63578 72509 28256 -3055 -8399 -876 -1769 -27524 -45691 -21638 -425 2417 6506
14357 6506 6379 31539 10100 20675 15882 -12475 -16253 -27907 -31875 -24938 -30339 -36513 -31670 -16945
14343 -16945 -23852 -32122 -12966 24115 16717 18636 -8071 -4690 13949 3202 -4584 -14400 -24963
14330 -24963 -48318 -88326 -76584 -27658 2368 30950 33475 19215 24673 43448 28019 7436
14318 7436 -11659 -31350 17381 34513 15335 1190 -15852 -16556 20605 27303 -1072 -23284
14306 -23284 -7237 -6340 -14087 -21396 -14373 -15891 -35631 -15114 32893 50229 34307 9929 16983
14293 16983 39696 50207 43383 31260 18876 26507 5324 -6849 25778 42644 23383 -8150
14281 -8150 -23745 -24779 -25176 -19710 -26158 -45427 -44995 -37794 -71744 -87562 -75052 -27563 412
14268 412 -9496 -14267 -42965 -38300 -40973 -69869 -93189 -83533 -49090 -31664 -8983 6633 2071
14255 2071 -19298 -30292 -25762 -54693 -55804 -52703 -44827 -20153 -8817 -14935 -17859 -6420 -9299
14242 -9299 9266 7180 -3933 586 17872 18023 28663 31869 26204 18598 14000 23365 17800 388
14228 388 7253 16967 32928 8960 -15838 -13538 -5671 2333 20144 -15588 -12669 -8700 -40799
14215 -40799 -49770 -18105 -442 -3586 -26273 -42764 -33496 -15113 3934 20494 9889 12015
14203 12015 7487 26446 1460 -24037 -31980 -42772 -25070 -17244 -16239 1747 40021 59937
14191 59937 62081 44296 48063 31853 21724 -26944 2545 30030 27552 14855 538 -37382
14179 -37382 -47718 -73096 -81395 -67457 -35678 976 11744 23599 25366 31133 49487 31450
14167 31450 17191 16204 1218 -515 -6777 -5341 915 -1821 4314 10366 31051 16504 7129 10504
14153 10504 45000 42467 7842 -13725 17565 -2275 -27606 -22998 17138 52214 50396 16002
14141 16002 -14101 -27734 -30674 -11152 -15958 -49360 -32653 -20832 -34745 -34821 -20242 -10327 -5057
14128 -5057 -1099 2004 -6097 5664 -7606 -45939 -75528 -60226 -42052 -32372 -34266 -47253 -48761
14115 -48761 -26436 -30327 -30011 -28236 -32487 -19919 -28747 -23848 -7449 -2347 1920 -2877 -12377 -29009
14101 -29009 -13175 -7158 -19077 -47438 -30839 -19554 -9499 6979 9135 13462 27937 30233
14089 30233 8659 13520 18001 170 -17615 -25231 -48100 -26250 -19287 3502 7451 -8001 -6839
14076 -6839 -11230 3501 1276 -6045 -15763 -25607 -31653 -26972 -295 23708 33819 12106 11653 34690
14062 34690 28663 17193 16666 179 -15915 -29640 -40960 -31587 -30862 -26922 14543 5711 -2319
14049 -2319 10960 -5215 -43002 -71597 -59675 -24546 -22153 12962 17574 -18041 -19873 -46981
14037 -46981 -32531 8680 20770 -4161 -9418 -30258 -16383 -15795 -26957 -46688 -38768 -47899 -44595
14024 -44595 -41866 -12389 -15142 -30200 817 42628 52045 40571 15161 25321 9169 -11560
14012 -11560 -10480 3689 40281 41226 8644 18634 4110 -7927 -5353 8863 25118 29129 31625
13999 31625 17837 26899 20903 7821 -6199 -9174 44058 60567 40411 23696 8364 17545
13987 17545 42750 31797 41220 63883 30915 -12151 -37176 -7838 23474 37257 24494 45847
13975 45847 56228 43012 50229 73524 46617 33954 31685 3262 -12524 -49989 -65660 -57259
13963 -57259 -11457 -17456 -9827 1480 8396 11838 -398 4034 22581 39435 43879 35996 10873
13950 10873 -18225 -16222 -6137 -23978 -15173 375 6126 -6409 14436 34559 31125 21071
13938 21071 16780 22228 29520 24729 2086 -5387 9705 30285 66281 65039 32704 -12167 -28699
13925 -28699 -31065 -40069 -37460 15827 42901 36243 35897 26010 27796 -11773 -12015 -5906 5969 17659
13911 17659 2364 -7394 -21202 -8594 2785 -1636 -19563 -24854 -15834 -18064 -557 13649 2135
13898 2135 -24029 -29484 -22571 -26144 -22993 -16560 1503 8719 -20619 -17278 -9816 12210 -3669
13885 -3669 8210 12429 -14336 -8500 6170 13613 19018 9439 12259 25765 48280 35638 26845
13872 26845 10434 27009 43974 29407 10413 433 7004 5862 4795 -6631 -7154 -20191 -25972
13859 -25972 -25798 -22649 -38364 -32676 -9988 -13693 -6095 -11297 168 26547 26244 23766 21419 1744
13845 1744 3997 7196 17710 42060 40515 8982 -6011 -26385 -41462 -13952 11497 48044
13833 48044 42334 43438 42239 29547 13724 -1206 9468 20122 8221 43797 40568 33081 28818
13820 28818 -2264 -26323 -37330 -29814 -19144 -23509 3081 36306 56794 53332 60313 62103 71870
13807 71870 49177 41994 34348 16734 -7616 -15755 -11436 -38042 -50692 -39064 -12939 926
13795 926 -1535 21248 41514 25965 23960 16993 19145 2790 -13654 11611 9808 12158 33732
13782 33732 41988 23664 17536 1722 -3478 9796 21486 -9378 6827 7711 7434 7955 4484 19336
13768 19336 26836 32111 19499 -9300 -13150 16307 39223 14071 -3723 -16679 13772 39738
13756 39738 42579 25075 4019 -29531 -46675 -26350 -11365 -26960 -43147 -47050 -40753 -31437
13744 -31437 -14554 18062 49484 44726 4604 -12977 -28415 -30424 -31310 -7025 10774 -13592
13732 -13592 -22626 -32619 -22791 15735 -274 -56912 -44742 -18684 2470 35952 55897 48798
13720 48798 26110 -19762 -50131 -47731 -3776 15088 15992 23004 38867 57197 35011 -1173
13708 -1173 -6284 25581 59104 58860 48286 57020 44687 9804 6122 13735 27631 37030 5909
13695 5909 -10864 -20554 13633 22417 26925 45494 37942 35404 29728 41482 39971 39085 7888 -4328
13681 -4328 10446 12493 -11359 -23650 -28817 -33121 -34591 -20526 -5304 -27604 -15892 3412 8786
13668 8786 -30068 -44966 -25774 -4969 13623 15000 -3799 -433 -9534 -39723 -62258 -52090
13656 -52090 -46442 -7065 13608 3344 -33503 -28172 -32971 -10966 5229 40381 75160 50859
13644 50859 8480 -12261 -7547 -23552 -34932 -41691 -6011 9069 -52 4944 26805 21448 16460
13631 16460 13907 -1503 35350 70316 39667 -16918 -26402 -22284 -21072 -15340 -17084 -4241 -11546
13618 -11546 -25911 -23476 -29642 -30710 -10498 -6854 9912 819 -13488 -15731 -14744 7564 -9414
13605 -9414 -23520 -12543 33629 24319 13548 -12403 -25050 -20830 -23192 -14349 -29382 -30373 -23634
13592 -23634 -3375 17965 19832 15158 -11750 -19592 -21626 -32500 -39889 -36589 -61932 -52513 -69338
13579 -69338 -49793 -6933 -10151 -4504 6632 -4993 -12625 -32219 -18293 -16939 7021 41823
13567 41823 63743 34296 -2079 5976 391 -35621 -49751 -19869 -4849 -17847 -43235 -52534
13555 -52534 -23460 -7567 23649 36349 23688 15855 30427 25514 18686 1384 13137 24419
13543 24419 4754 -34737 -33777 -39057 -51303 -40287 -29968 -21937 -40334 -39686 -33867 -24532 -14489
13530 -14489 2195 -1771 19946 19684 19426 17494 8588 -7349 14337 29508 30250 -10426 -7714 17596
13516 17596 -3500 -11542 -4620 3746 9470 -27816 -34226 -44498 -35575 -4961 39939 35093 1511
13503 1511 -6867 22738 41042 -1518 -22209 -10499 -1005 26494 38273 19426 32811 14711
13491 14711 31703 32201 14194 23486 16739 4600 1572 -26710 -47364 -37059 -469 16612 39522
13478 39522 34889 61123 78870 48937 36279 40430 43975 53042 63362 35026 35397 21139 25981
13465 25981 60355 68299 57219 30544 22196 19747 36447 21324 -1902 -28332 -4569 42094
13453 42094 64636 48511 53652 66715 77749 77441 72357 69243 69373 65312 67032 74647 78986 46218
13439 46218 33078 22914 3589 15963 24885 16829 -140 5936 13414 -10299 13198 24039
13427 24039 33 -7004 15894 43356 39902 2512 -16521 563 -11818 -35407 -27876 -16637
13415 -16637 1409 560 -15842 -19780 -13206 138 1084 27976 53174 38748 50359 32773 27600
13402 27600 51325 25530 1990 8613 9311 -17330 12963 11590 21210 23250 -25369 -28455 -10518
13389 -10518 14388 14326 6581 23381 88765 99042 71967 61453 55559 52488 28218 -1260 1440
13376 1440 -10428 -2424 5890 15876 17980 31692 31376 36756 20339 15992 29877 4000 8211 9280
13362 9280 -2895 -22861 -32319 -38401 -37554 -21147 9370 39070 70441 75665 46050 51943 37623
13349 37623 26632 58717 22408 1872 6272 52446 78264 52802 23265 26662 20635 34917
13337 34917 31407 67859 96323 69381 70008 77014 50198 41991 56503 76586 73233 76783 69321
13324 69321 70997 82133 83261 61367 40689 51394 57236 75007 79404 51335 31919 -1652
13312 -1652 -281 20318 15066 24758 52059 68628 48543 36193 53323 31724 43675 37684 36595
13299 36595 45151 15659 -8707 -919 -475 -5630 20531 45627 41667 39445 31943 67697 58842
13286 58842 7784 15852 -5500 6960 62784 79942 73433 67479 51101 16725 8335 24939
13274 24939 15003 8498 4204 -24296 -34880 -18812 -3074 -7833 -6944 16420 37472 50615 51771
13261 51771 41288 22967 34255 33250 17389 18183 24491 49665 55636 41058 60402 65198 88174
13248 88174 90853 95638 106640 85022 52207 38039 60543 69886 67612 43345 46172 42033 59065
13235 59065 61489 49754 39118 -258 37704 33161 31667 40002 20081 9583 30791 42631
13223 42631 66397 55726 22884 22041 19384 14599 18001 34566 40380 43134 50146 62820 57746
13210 57746 60649 49527 57754 61422 46983 55930 46485 46663 18600 5605 13200 24159 47377
13197 47377 54866 61327 48722 6839 14061 8649 43893 83413 71379 46375 22953 19887 42819
13184 42819 57521 68411 79831 80237 75077 74616 102837 111295 61494 56016 70760 101150 90752
13171 90752 90355 72523 68699 63923 75953 55796 51711 66741 53213 49501 55636 94517 115711
13158 115711 137663 132058 85616 64249 80984 104916 95868 82395 50518 14691 41409 46013
13146 46013 44079 34350 49355 71611 91868 76040 83373 90907 86284 95330 96975 73868 46548
13133 46548 66956 50411 29042 48844 72808 62618 64575 71026 66443 68545 88202 88572 75228
13120 75228 67582 59153 53061 53563 4941 20064 34450 41178 61550 76453 47939 50560 61155
13107 61155 65069 76922 90181 88359 71388 78413 99946 81852 78104 70962 42874 23185 38076
13094 38076 31841 45786 105521 118883 103708 86542 79579 77280 88288 89682 91385 99097 100738
13081 100738 90939 108937 129600 87629 63828 78149 119928 132815 135644 108095 98905 91781
13069 91781 91514 95322 105878 97594 71400 42265 40501 55293 76730 81226 82862 98740 104227
13056 104227 105059 97380 87134 76610 89574 108898 140251 128963 103299 111804 126826 112789
13044 112789 112077 103589 102509 107166 99219 85701 66929 65068 66612 77653 64650 105981 118547
13031 118547 83165 79191 79038 96095 147753 149190 146101 151657 135461 134185 159153 148856 143756
13018 143756 139482 139659 119007 144744 170191 159919 128561 110558 102791 103316 116289 111494 75397
13005 75397 46532 39541 26720 46442 91926 116896 107829 100359 89119 59311 37716 50031
12993 50031 89720 147231 153779 130686 146301 143841 167114 172905 123314 111862 101073 101442 127368
12980 127368 127737 152301 170617 156965 158579 137086 130761 151798 150638 160072 142513 185205 165774
12967 165774 179020 190138 203818 221522 211732 162251 131018 153322 145960 121148 82738 76034
12955 76034 105615 129784 114256 111132 148826 171127 133588 116055 118044 140576 166130 133309
12943 133309 135758 164889 169138 179145 182713 177597 200805 207515 198815 160931 136048 163075 172491
12930 172491 182161 183245 173749 186432 206896 195812 186905 196059 202928 191092 192857 192189 216978
12917 216978 200288 163780 152420 153607 159579 178305 212819 197567 228397 234783 212963 207093
12905 207093 204678 181050 194044 189736 186401 189070 183062 179143 210454 227053 229072 233791 222399
12892 222399 203029 209580 179428 176820 212409 241413 259743 291139 296416 274168 274688 249708
12880 249708 251083 254141 260011 239841 209262 196535 196140 220251 204652 188328 201882 210333 223193
12867 223193 218895 233294 258148 235969 210991 209875 250736 276086 280549 251978 270849 259671
12855 259671 250921 239285 239254 279167 289455 278326 283339 286540 273557 267741 247260 259305 275189
12842 275189 259904 260313 250343 249623 259826 267454 279254 284787 299221 315171 324873 319845 305359
12829 305359 313681 323956 311568 282936 264401 278976 309567 346665 340650 299332 270954 296886
12817 296886 305537 315446 332116 359985 379503 373943 362781 374118 366635 337498 345515 359307
12805 359307 362416 374502 375618 353151 358178 370810 389115 408956 412339 398787 403098 441304
12793 441304 443209 424513 433572 442337 431500 423870 414431 420228 429144 438249 446659 420202 420226 421617
12779 421617 422578 429668 459007 469633 481353 463640 466078 471659 497795 518835 505429 510090 516167
12766 516167 528889 550762 539061 523978 540072 568803 597620 608289 571000 558200 570848
12755 570848 562099 581759 573563 580866 616797 616157 619185 619368 608662 567771 572325 608974 607043
12742 607043 638139 655444 665962 660067 673453 694098 695116 667513 659813 646649 654888 688460
12730 688460 687332 721307 732302 721413 721064 734856 737026 716416 716990 742215 761590 766877 782875
12717 782875 793648 793425 782143 802694 837619 852017 862917 857173 855563 868349 878649 894729
12705 894729 899048 901184 880977 929501 961301 986737 960183 948204 961266 972673 962685 978213
12693 978213 1016047 1035256 1044744 1064962 1086820 1100912 1138361 1113786 1112788 1127848 1158868 1186388
12681 1186388 1186721 1202023 1213187 1249220 1278736 1255831 1247158 1258392 1255633 1297843 1372248 1391494
12669 1391494 1417579 1450879 1444755 1462734 1464301 1439635 1461928 1505557 1528328 1565177 1589318 1593514
12657 1593514 1618964 1649750 1658091 1684091 1727227 1788704 1809476 1841478 1866041 1858665 1868336 1892434
12645 1892434 1893663 1927940 1963750 1998116 2043536 2105093 2132571 2149175 2159096 2168718 2194629 2225188
12633 2225188 2281551 2314525 2366717 2439961 2474371 2529523 2607468 2654807 2697923 2724777 2773420
12622 2773420 2833895 2867651 2891464 2935860 2993101 3068980 3162739 3223964 3257338 3296365 3366466
12611 3366466 3488885 3565214 3602935 3646692 3684880 3766572 3855863 3897121 3968544 4069670 4166178
12600 4166178 4249840 4335851 4424836 4520103 4658581 4791137 4909828 5007862 5117074 5222225
12590 5222225 5284602 5397017 5525711 5648322 5779005 5897913 6068743 6248349 6400166 6538968
12580 6538968 6698842 6855073 7029028 7238277 7437956 7627346 7784703 7964825 8150837
12571 8150837 8389007 8624540 8853350 9077760 9315428 9550687 9809416 10103028 10384309
12562 10384309 10648500 10930536 11232091 11550423 11846165 12153025 12478748 12831403 13199839
12553 13199839 13553584 13904327 14283080 14670064 15045698 15441926 15850178 16270399 16710933
12544 16710933 17096288 17481012 17884418 18299782 18718844 19104978 19503107 19894968 20271209
12535 20271209 20652167 21042330 21390107 21699346 21999828 22252961 22551234 22832145 23043775
12526 23043775 23200174 23344475 23474062 23585801 23664920 23703819 23706922 23675606 23617104 23486727
12516 23486727 23349174 23217289 23061345 22834674 22553404 22277279 22007597 21682329 21333708
12507 21333708 20982993 20644178 20301924 19919976 19537110 19155023 18747801 18346625 17911075
12498 17911075 17495215 17092173 16680362 16247939 15851102 15477308 15122147 14767242 14400978
12489 14400978 14008354 13667672 13335933 13004125 12695262 12365075 12022374 11719268 11431230
12480 11431230 11145429 10841855 10555875 10303191 10060344 9788174 9510754 9241027 9007445
12471 9007445 8794435 8595505 8368450 8154014 7942690 7763103 7592004 7391652 7188262
12462 7188262 7007657 6865094 6724941 6585946 6441597 6314473 6150135 5994694 5864455
12453 5864455 5731463 5584352 5461042 5361002 5261705 5109988 4986409 4872778 4755373 4648560
12443 4648560 4543259 4435889 4377576 4306153 4219712 4166578 4112886 4033962 3939496 3832491 3761537
12432 3761537 3701129 3636478 3569771 3508839 3434958 3374047 3344185 3302256 3213315 3129915 3056340
12421 3056340 2998361 2936308 2905633 2881055 2806529 2759259 2725710 2667749 2605040 2565852 2531662
12410 2531662 2488108 2444127 2423133 2391566 2355194 2323153 2306512 2268519 2199126 2144405 2117996
12399 2117996 2114105 2073075 2045312 2018006 1992173 1964237 1914508 1873220 1869428 1852263 1799318 1796486
12387 1796486 1780810 1760731 1750901 1738320 1712154 1676881 1666850 1647269 1607135 1581665 1553372
12376 1553372 1532140 1522217 1479622 1452529 1444828 1424957 1403522 1431931 1423585 1406095 1390636 1351690
12364 1351690 1330780 1303615 1272952 1262396 1259112 1260706 1270605 1285440 1270762 1206325 1187835 1212384
12352 1212384 1208920 1187096 1173742 1141536 1103046 1049060 1025951 1063875 1091233 1082347 1085026 1057269
12340 1057269 1030985 1003602 990771 998206 1004205 982652 996880 1009388 1004067 1008156 990634 925201
12328 925201 900696 900038 904971 895875 877795 853246 843344 820460 823429 810656 796063 795640 787730
12315 787730 792200 831159 830120 818770 814440 800476 798991 772912 733499 730154 727186 717838 732573
12302 732573 731195 734745 734731 741079 724346 701600 707443 721101 750522 721575 660978 630468 645771
12289 645771 620107 589793 551837 573939 605284 600712 569692 556905 566928 569619 554894 564651
12277 564651 576957 571084 566461 552193 557583 560719 552320 541743 535724 525213 522471 536097 546961
12264 546961 542592 565456 567817 554149 545166 532607 542726 543878 529610 504946 518390 521793
12252 521793 487120 429250 414434 428605 413704 427028 431164 431145 442258 427478 413731 410640
12240 410640 416734 420862 434723 432819 426617 422471 410121 418753 408045 402334 422855 434449 442824
12227 442824 433656 405961 382323 395748 397667 397387 384806 362924 353823 354110 363353 367109 379566
12214 379566 380004 379793 383410 382532 388831 393226 387475 386260 381950 355475 338270 322888 313969 321364
12200 321364 317827 323867 317453 305205 318844 336401 333582 330226 332770 348336 332317 328324 330184
12187 330184 318135 283296 269418 271780 277535 265678 260680 292806 317215 340065 334720 320983
12175 320983 327280 311645 317859 359729 360379 355110 343274 310266 316641 302942 303812 310204 283159
12162 283159 276337 275273 286900 306983 294965 259908 261584 290573 272113 250226 250884 246433 247841
12149 247841 249779 253141 246363 226283 193088 190804 210862 211923 215216 206673 222372 230153 201570
12136 201570 179392 188558 227023 232150 213958 206830 221063 243649 254632 208180 173974 160408
12124 160408 169757 200546 203242 211011 216246 201909 187844 190021 176249 167865 210213 209248 200287
12111 200287 201900 208479 211115 172596 176754 181610 196563 227735 247337 253144 224616 215943 222047
12098 222047 232694 200871 165960 155029 154808 169566 190233 197556 185442 186074 169142 163217 148212
12085 148212 172167 175196 161465 152612 180193 193142 188428 170961 159570 140902 139307 147889
12073 147889 157277 127055 141810 177670 187981 193552 182392 177295 164163 176772 166217 162574
12061 162574 159693 141246 166787 161095 131360 122496 117236 120514 121433 146552 135914 131516 155316
12048 155316 169207 164046 172483 155629 182250 197105 184134 181823 173047 158277 178438 189934
12036 189934 150813 137230 139696 146506 154538 141567 168512 155817 156942 168628 167727 178456 176266
12023 176266 193625 186977 163047 186083 182170 174010 177576 126168 156024 166802 125717 125086 134525
12010 134525 119755 111470 101937 107346 151022 171247 152248 136172 128528 132341 123706 93082 89777
11997 89777 92819 131602 129458 122871 120495 142567 153134 152149 154060 134814 118667 87498 97250
11984 97250 137328 162651 182532 182235 214610 234695 246092 270391 251801 226768 179443 158416
11972 158416 151430 132973 100110 90990 82167 108708 120656 110291 98247 100990 109738 92590
11960 92590 82467 90765 75081 64158 73644 107139 100526 94209 81579 78084 83502 83775 126761
11947 126761 114422 80493 44650 63520 103650 105527 121998 121015 108180 93018 71735 87358
11935 87358 94007 60637 70497 86518 80550 98009 113381 110156 100575 97819 92996 86672 68733
11922 68733 60828 56340 61115 87518 96296 81931 94687 111410 105981 140214 146904 122166 136181
11909 136181 142413 96376 78872 95263 88885 77725 85480 88394 112659 94873 72141 34060
11897 34060 33901 47441 59185 86003 76651 74714 95501 90175 70940 68728 61482 70024 61629
11884 61629 71112 69525 59802 60313 54361 49275 18358 23610 36198 41961 35410 65339 69022 74753
11870 74753 84402 79936 80169 80746 63087 53456 51373 44164 56372 81393 79706 44831 43677 84378
11856 84378 94343 90787 80161 82738 95937 102991 109714 83018 52703 95931 105805 70654 51325
11843 51325 76860 58475 29836 19220 52897 84177 91736 79008 79146 77740 76949 85439 60756
11830 60756 88658 94394 88964 79865 83927 77812 74511 76221 91607 94551 90050 71574 62015 54178
11816 54178 33793 41379 50080 44732 30967 32282 42649 33547 43085 39969 52864 56029 44020
11803 44020 29685 43021 29465 23726 49796 49377 53216 78620 77106 52867 38739 69150 77010
11790 77010 71289 99771 104546 83148 65283 68350 59977 35198 43552 26543 12696 34811 56779
11777 56779 58984 47977 59942 87424 98827 79140 43891 51280 72662 96764 67665 45019
11765 45019 39810 38895 26509 16744 16512 35751 43558 57798 70477 72723 55803 41509 34328
11752 34328 48650 41501 24058 9594 -6025 -2096 8207 19911 34705 54567 68578 37788
11740 37788 34079 11989 22664 26120 29040 40840 69325 82012 47004 47966 47042 35703 13651
11727 13651 10346 824 6704 22515 63949 74782 29524 11944 2787 9239 44813 41656 25599
11714 25599 37974 42101 44660 44223 33742 53609 55700 48584 32755 29453 62237 40154 21445
11701 21445 38256 62384 54197 60549 91042 63632 53952 77302 67604 53675 43412 45995 50949
11688 50949 54049 56231 39344 10752 20588 26068 12272 23843 40327 47930 45842 14163 47715
11675 47715 79586 52425 22813 45952 38746 38615 12642 -6388 -13695 -34805 -18021 -13397 3880
11662 3880 31392 27510 5100 866 -5837 -10605 -11434 -7632 -7039 1118 -14074 -20865 -20891 -12283 -2647
11647 -2647 4992 23658 10219 -29625 -31799 -16021 -15027 6166 15433 48404 63876 48007 34353
11634 34353 25008 45956 43342 44187 54719 63421 59502 61768 76841 65810 63218 54544 40598
11621 40598 18217 14076 11683 40484 22639 -12842 -9872 2354 4795 -7975 -22463 -31481 -46855
11608 -46855 -28540 -19266 -17256 32703 62198 45203 23810 19397 17238 7195 13570 10255 25848
11595 25848 30269 34357 23359 6248 -9256 -24250 944 19251 27908 61402 46985 49177
11583 49177 62135 45053 29388 15480 33208 17688 6279 16850 6081 -14713 -1514 -14922
11571 -14922 5415 15727 35141 53638 76410 39721 -7110 -1192 -2990 -14945 25483 43120
11559 43120 33412 35988 32938 12947 -13113 -17320 6882 -2315 -15509 -37264 -37603 -36608 -11324
11546 -11324 19241 32028 55284 45864 22185 18234 34818 30526 -4760 -2636 2341 12327 47884
11533 47884 51064 10265 -5445 39900 81395 75885 60498 50601 58926 54879 51905 21156 13946
11520 13946 15988 13140 20630 19429 25260 1005 -20656 12890 43022 25604 10073 9448 -9030
11507 -9030 -32833 -41500 -44314 -14744 27357 41259 34570 29747 45101 57738 49534 13764 -13910
11494 -13910 26914 62400 44578 22286 16947 9044 -14069 -23014 -4939 -22056 -21702 20430 28045
11481 28045 11831 -7132 16034 31258 37438 48848 40875 31861 29981 35723 29142 44518 58122
11468 58122 63168 64874 72551 59740 16450 8113 17875 -11734 -9755 -11343 -15382 -12388 11284
11455 11284 23813 -6905 -1986 13751 33566 31556 6848 -10281 -16490 -28762 -48895 -44536
11443 -44536 3822 11763 3737 -12874 -7201 -7902 -6653 1821 -13939 -28280 -55274 -61549 -56693
11430 -56693 -54786 -40108 -14962 28841 28451 22222 17175 24222 47310 51290 46057 21719 -527
11417 -527 -21283 22218 67068 83257 97054 56566 63533 66388 61914 55230 58270 94828 169119
11404 169119 196633 210195 340398 547287 846272 1333420 2018028 2559544 2497799 2100323
11394 2100323 1656360 1218804 846404 580449 432732 352584 302742 251684 198204 158396
11384 158396 148878 118065 92377 57922 55886 55467 45985 38047 42786 37407 46265 46030 44022 70950
11370 70950 37507 43147 29793 14204 11510 31752 65402 50845 19035 8120 23730 39008
11358 39008 10881 -20197 -15878 -10509 24897 37006 34620 38351 33827 33392 13167 62 -2416
11345 -2416 -19482 -5082 1792 10776 -3862 -22806 -53499 -71629 -67553 -18966 8479 -3703
11333 -3703 -17993 -20043 -11482 -30999 -16788 5169 11423 -14517 -41827 -6800 16714 -28013
11321 -28013 -57056 -58502 -33109 -47821 -65140 -65760 -58134 -57551 -60981 -85141 -110242 -130679 -138377
11308 -138377 -155804 -159976 -149177 -85871 6616 84788 123562 121718 119974 127591 117949 114231 113999
11295 113999 124461 151369 159127 129345 93715 72159 13953 -29571 -11208 -11871 -9413 -2265
11283 -2265 6468 -7736 5916 44072 27518 -7530 42452 63680 33883 24 19181 12129
11271 12129 -19153 -12077 -15049 -19147 4515 27983 7454 -24151 -19420 8623 -3835 -21523
11259 -21523 -1016 1889 34051 70390 67065 68934 80445 91262 72730 90567 78342 97246
11247 97246 105141 138895 151151 156337 179417 240397 264485 258588 240765 224873 189456 137129
11235 137129 102130 66493 91617 80052 71508 89742 78732 61321 29932 12811 29991 44446
11223 44446 31240 22246 17666 10144 24624 19637 19410 10113 -5332 -939 595 -470 -13881 15089
11209 15089 27349 64162 72550 71077 28840 4935 6427 4539 -12008 -54598 -53824 -71688 -106765
11196 -106765 -102351 -97335 -110627 -126509 -116084 -66842 -49318 -56839 -83055 -73652 -68433 -90625
11184 -90625 -103367 -82038 -64606 -64258 -54745 -62530 -88046 -82065 -93954 -83024 -66171 -82721 -86419
11171 -86419 -65724 -26002 -17808 -6056 23625 47630 53912 99651 103522 102787 95611 83885 56036
11158 56036 28284 4603 -4830 1091 30129 39691 35349 64937 74681 53593 39335 49240 26056
11145 26056 36692 36392 46936 70478 65956 78276 97623 124880 99935 78232 40771 5402
11133 5402 -15567 -2760 -15321 13472 38788 42906 39180 37134 44128 55438 52651 19661 21381
11120 21381 73609 164297 350239 532124 592529 582561 517956 394404 303731 267113 245431
11109 245431 213845 234963 273450 288387 269553 222183 202362 179734 167576 166606 155570 173156
11097 173156 175290 180425 207784 208727 189581 146666 100384 104258 111221 116990 102829 104016 109558
11084 109558 79891 49401 31238 53581 83347 95078 98340 92658 114635 103383 93533 151076
11072 151076 184762 178593 190015 230862 302668 336546 359862 341400 319073 311835 305008 279769
11060 279769 276795 285736 311430 369046 368797 348388 361918 357191 358999 410081 439571 423276 426090
11047 426090 418403 415816 418827 442587 456482 449012 466587 482134 505523 595536 684297 751671
11035 751671 821533 886258 912745 888929 883899 928037 1002232 1100942 1226404 1394203 1519729
11024 1519729 1566110 1593890 1627074 1698293 1818121 2011362 2258142 2456516 2739069 3145479
11014 3145479 3737275 4558569 5547823 6257939 6444754 6463059 6514544 6640880 6941970 7427899
11004 7427899 8135198 9117018 10433531 12084308 14157703 17000477 20898199 26057695
10996 26057695 33356084 44486713 62134704 91842157 143668089 233579200 364649563
10989 364649563 466725962 459988052 387643263 306221559 226957163 159956388 112972177
10982 112972177 82444473 62483584 48883735 39044204 31528818 25824151 21627565
10975 21627565 18455817 15979377 14145841 12762790 11559269 10519685 9720782 9116043
10967 9116043 8802207 8763974 8759817 8251532 7393440 6516697 5702257 5000807 4515776 4149625
10957 4149625 3858266 3665372 3486873 3315732 3140039 2958974 2801050 2662719 2555058
10948 2555058 2446889 2324539 2213227 2106581 1988530 1874750 1764552 1737437 1724431 1694883
10938 1694883 1651061 1562812 1469685 1352382 1274104 1248186 1239377 1167301 1118346 1099776 1066855
10927 1066855 1030299 1020385 1021935 1064970 1090655 1027594 942571 899429 855160 815003 793951 781994
10915 781994 760743 741130 687962 630583 612189 597110 589533 611528 595557 593225 576030 609407
10903 609407 629738 637682 651208 640266 614220 576276 591825 583476 597154 602274 588336 553963
10891 553963 519252 484342 473083 466286 443496 431489 386302 359709 368088 348746 354521 375099
10879 375099 356511 312282 292495 295656 281260 255183 236596 229893 240203 247695 251392 261475
10867 261475 270974 321319 311317 254855 159125 105227 46419 37271 114024 177769 203385 247860
10855 247860 309847 330359 358283 369673 335894 306253 292754 280701 284060 329993 343210 342542
10843 342542 332374 313403 257368 194952 198368 193760 208902 197447 175349 162342 167510 180645
10831 180645 184487 161232 185147 220211 220662 195675 190536 196731 189749 167075 152152 160660 170232
10818 170232 142515 121972 99011 94327 134891 158211 164767 164654 167090 159107 185689 217867 226441
10805 226441 215699 195368 208666 212316 221722 231088 242113 245833 222474 222411 227643 233750 248067
10792 248067 254005 243821 218474 193491 227474 232929 236178 214652 229662 200834 183815 180174
10780 180174 197155 181301 175477 175282 166924 149957 109489 106234 101076 105979 102918 145741 147887
10767 147887 137843 121766 119397 122503 102877 56789 79795 101210 106314 109255 125098 149131
10755 149131 160907 131412 102444 125695 94631 70546 75424 83325 100465 73430 47568 49241
10743 49241 54132 76506 111318 122555 95234 76457 83311 91558 103141 153704 152160 131733
10731 131733 129086 161213 166700 147813 127947 107983 64809 54388 87375 75422 81195 72798
10719 72798 74873 56817 62922 106943 106070 95655 70099 67242 76452 98804 127121 138483 140929
10706 140929 100918 70442 83895 82776 59888 46357 54051 46817 81344 59752 43230 78658
10694 78658 114894 136263 113867 103868 82161 69801 68679 40282 -16472 -13930 -13276 -11734 -18449
10681 -18449 -17635 -3398 -2570 -22962 -46928 -56906 -35477 41020 157780 263941 381740 563179
10669 563179 805436 1118151 1273975 1152026 988483 781539 581768 429827 314905 242040
10659 242040 188770 179424 184313 184259 152735 103905 116891 117045 96295 103343 93196 116480 140147
10646 140147 142384 140815 128938 120241 135971 136072 123866 135404 124040 119054 100588 87805 89908
10633 89908 102097 75479 89431 84825 97075 86436 82524 94565 85635 83914 56643 77336
10621 77336 71134 58232 47873 40510 60216 62145 79966 64462 42530 52184 46439 49827 69579
10608 69579 80373 72251 59682 72744 58606 56645 56812 35935 54470 44927 29613 42645 34999
10595 34999 44127 66844 88634 98658 82247 98152 144373 153153 181167 191663 183609 201898
10583 201898 240263 294359 385923 517312 679395 989225 1549665 2239283 2602564 2403612
10573 2403612 1999268 1555363 1150727 843417 633966 459019 352791 297967 266090 222528
10563 222528 212090 188594 187614 176931 162779 132918 122443 129276 116015 118100 89263 63100
10551 63100 46483 44873 76413 118606 127576 126065 110402 91565 86439 95398 108860 86086 85965
10538 85965 84030 111137 89116 53305 40512 39043 51037 54786 44665 42651 67730 70337 46274
10525 46274 51865 36730 27750 34317 39419 45287 26662 32111 68235 96616 97382 99833 97922 89495
10511 89495 49102 67212 63128 61145 53104 49828 47214 52867 32431 71813 101206 102068 89148
10498 89148 77296 48577 31434 28996 19875 6486 -14650 -41702 -29304 12215 2884 4714
10486 4714 44685 51307 68530 70383 86129 78435 57513 33392 19016 22757 39167 38967 26620
10473 26620 49648 71857 96853 84986 62897 56357 44766 39529 59042 50815 43456 23034
10461 23034 500 -4539 10227 8553 28297 37336 32198 59297 55710 44184 36830 17743 29417
10448 29417 15544 11113 2756 14488 40275 71044 86673 79846 61914 21744 3235 10465
10436 10465 10431 35669 44018 51960 21798 -18231 15789 49118 65193 91429 69757 31309 29421
10423 29421 19278 -424 -29140 -60290 -54270 -23151 8994 33787 20526 9656 23100 18758
10411 18758 16192 37621 68936 72781 39653 30391 45824 36007 50159 52260 41608 36618 31086
10398 31086 7071 -5743 2535 8305 12219 15199 -2392 -37228 -41083 72 30947 59522 41318
10385 41318 63646 36352 34710 37901 14827 20486 2829 15142 44044 50867 72927 64763 53311
10372 53311 63028 67385 52977 35828 19444 15018 42896 23903 49859 77835 83485 86015 77152
10359 77152 55929 46802 61536 57697 55789 70700 116528 139136 172704 249457 362494 475138
10347 475138 611927 767331 954562 1140625 1250514 1344780 1416426 1407363 1368455 1261175
10337 1261175 1110984 933297 768080 639339 506252 386716 296949 228338 184858 157652
10327 157652 149270 190969 185411 128275 94690 97637 135272 122474 111993 81766 72180 58524
10315 58524 63794 51238 32472 16444 21307 6909 12643 1047 7049 34050 52792 58534 48369
10302 48369 15030 -21520 -10352 9551 10440 18791 12862 5252 7720 32656 28302 1873 -1537
10289 -1537 -11010 12246 48560 29156 -6788 -21791 -14067 -6647 -5949 -18290 -3810 28379 7304
10276 7304 -25947 -34114 -9071 17052 8864 13238 18608 14101 20568 -3201 -3999 20653 38880
10263 38880 62813 72896 45493 20445 -2933 5685 -99 7358 4658 19319 10512 30504 36025
10250 36025 49958 85141 64757 27666 40629 33513 26858 6394 -2204 -30455 -28883 5142
10238 5142 935 -31008 -25670 -21147 -24589 -23239 -29105 2019 1299 17214 20176 -18280 -20279 -6150
10224 -6150 21996 29485 47185 48845 35999 18972 3558 -20161 -15318 15241 33136 37966 285
10211 285 -21069 -8883 -6071 -16150 12160 9504 30671 34976 38464 42565 27416 4459 -27451
10198 -27451 -55003 -65847 -49634 -47601 -22867 -9408 -26855 -17521 -18891 -3932 11433 22566
10186 22566 1577 -3359 14091 39310 52803 26338 2187 -12811 -16548 -8531 -10901 -554
10174 -554 17635 2299 10204 -4839 5006 -7845 -16354 4785 43134 77468 80878 75944 75485
10161 75485 77689 73266 53932 50940 28873 17885 29256 41782 41503 31890 11408 16851 41158
10148 41158 31425 27865 38352 41404 54572 90668 156844 193914 232939 265871 301608 265024
10136 265024 218243 174181 134182 90602 50118 41452 53673 67607 66372 88025 110177 113970
10124 113970 120017 97187 91344 75627 43454 3405 -30789 2719 32271 55996 73067 73906
10112 73906 26428 14151 35835 31561 -6937 -18967 -18679 6690 40305 26489 48575 55366
10100 55366 36742 45918 46136 28577 -3819 18045 27876 -94 3263 335 -4848 -6846 -2811
10087 -2811 -9925 -29238 -25817 -14894 4625 -1353 6873 36987 54758 56189 37469 34050 23669
10074 23669 -18138 -44305 -40620 -20465 -6982 -15633 -36632 -11645 5312 7428 -4166 -14591
10062 -14591 -9235 21689 45465 56078 55674 84643 93815 98097 80203 85003 110778 117791 114390
10049 114390 137521 128283 130148 134474 122595 97636 54239 38951 23126 35905 61734 73024
10037 73024 69636 58920 69732 83514 88713 62051 27270 10042 -21907 -5627 -9629 -12579
10025 -12579 8244 29208 23461 20017 6601 10036 17655 2197 16331 50155 50224 49572 42666 27656
10011 27656 15270 37624 18036 -22369 -16311 2385 -5622 -10712 -11222 -8248 -27639 -18799 -25800
9998 -25800 -27258 18062 62129 68712 37023 -7566 -23286 -17033 -21532 -30595 -10649 25692 7771
9985 7771 -2839 17858 36991 36510 26112 19193 -9018 -1802 52630 86001 55372 17349 16007
9972 16007 5578 18179 14007 7016 27456 37249 11727 22371 8525 36446 39851 -7834 -1332
9959 -1332 -1796 15054 26735 35123 27378 31642 -994 -16208 6789 21615 6612 5512 14699
9946 14699 13646 -2309 -7168 -4192 -5428 6486 8396 -9769 -31842 -5120 -9417 9226 13752
9933 13752 -1574 -22028 -17245 -4629 -9659 -4531 -25667 -28978 5265 6733 -19197 -37199 -17788
9920 -17788 -8271 1198 27325 35243 25368 -5274 -17333 -30169 -30098 -19138 7000 14846 2051
9907 2051 -4710 9513 24734 15013 -8837 36186 57920 65830 58914 65818 108174 164265 170753
9894 170753 116691 98073 89702 74447 42768 20036 25874 22936 29512 41216 34423 31394 39803
9881 39803 16078 -13556 1816 -9084 -11020 -14381 5166 6089 -5650 -31879 -35431 -7997 41172
9868 41172 49819 26941 22101 18801 -4178 46443 73418 56367 23718 32755 38234 40596 56668
9855 56668 69654 61008 51607 56593 52574 39212 41223 76146 88485 45929 25196 19146 9878
9842 9878 33264 63245 53471 10211 -25456 -30028 -28897 -12731 -4601 -2358 31749 55410 38171
9829 38171 17172 14434 30660 29738 857 7015 6659 12846 11740 10413 13563 31882 16404 8851
9815 8851 -2067 -5276 10565 -36132 -24477 18314 48051 54164 49286 38139 38338 50929 40781
9802 40781 3768 -10363 -9135 5764 20557 35678 22673 6601 -39971 -30529 -5715 9822
9790 9822 2646 1226 -17041 -15476 6860 39341 55411 47362 60420 61943 39161 32348 28110
9777 28110 675 -26580 -10589 -300 -13547 6555 1100 1581 -3260 9018 21066 15784 -2943
9764 -2943 -4311 27914 29494 26274 11062 -6710 -19023 -17436 -10968 -15210 2962 -249 -10809
9751 -10809 -5554 -36342 -65804 -74595 -52007 -23471 -37873 -40240 -52570 -47153 -25272 19019 38692
9738 38692 -821 799 7490 -1207 6295 17090 14855 15683 18510 14646 21551 6874 -34257 -32143
9724 -32143 -12840 12803 14110 30365 23936 3598 25174 29093 11667 20782 65453 68619 53409
9711 53409 39732 41048 53233 43791 30070 13610 7558 -18943 -37595 -24399 6234 8051 23050
9698 23050 22119 5993 19220 41328 31178 19902 25695 25924 -15322 -2709 30289 30057 28500
9685 28500 17927 -18062 -13614 -9660 6746 22154 28352 12706 13219 -18631 4050 21679 23178
9672 23178 875 -1543 -12945 2372 13687 21066 24997 -7565 -19203 16510 29979 43611
9660 43611 57454 38462 21237 9852 -8710 -41899 -42584 -48439 -47021 -42050 -43559 -34047 -14681
9647 -14681 -14676 -10651 -19075 -16187 -19077 -12618 29757 50328 56649 19782 18736 2404 -3414 20275
9633 20275 24096 38295 45743 37254 22957 25908 32381 30691 26727 32530 38653 50633 57470 65737
9619 65737 28523 17241 30665 29237 -6888 -4230 -6502 -10219 -3923 8907 8462 8459 1981 -12494
9605 -12494 -31166 -36582 -32870 2799 23114 7652 4530 -13009 -20460 2956 2700 22943 55641
9592 55641 50164 39778 -5490 -6067 15649 15435 27203 10300 -1775 4810 -13770 -16042 -7912
9579 -7912 -13599 -20891 -41246 -43481 -25293 20330 19650 -18188 -33858 -37271 -21952 -19906 -7311
9566 -7311 2441 5498 5926 9000 17 -28503 -11394 8026 -12384 14314 21629 8205 22405
9553 22405 9620 -11079 -15387 4466 22865 37624 49678 17705 -21932 -22002 -21128 -38676 -38213
9540 -38213 -2457 2640 407 -816 -5891 -5349 -15488 -34763 -41127 -41000 -27685 -28388 250 16641
9526 16641 4325 4524 4406 29831 21106 11447 53961 70154 59232 19727 -12732 -27648 -49991
9513 -49991 -48522 -29105 -3782 7437 -12807 -24838 -33276 -42517 -37731 -33513 5789 35633 34578
9500 34578 21591 15503 10513 11393 19819 23135 21297 23089 15653 3423 19531 34850 11455 18323
9486 18323 -18767 6657 35967 25559 20162 25271 8848 18010 19465 -12210 -32379 1545 19672
9473 19672 -8339 -15251 2671 9660 -18684 -25795 -7488 5660 23851 8360 226 1643 -17208
9460 -17208 3083 30008 27612 8877 -10898 -25587 -43172 -42227 -38837 -15511 -1243 5513 19608
9447 19608 19911 29557 33035 29097 -17522 -44315 -46475 -27526 -3709 23962 6473 10184 -2477
9434 -2477 -15447 -23121 -18491 -30554 -15208 -14223 -13690 -1167 15123 29043 6916 -11698 -25782
9421 -25782 -31696 -30943 -35883 -32808 -18050 -13671 -18741 -33259 -37070 -51120 -55111 -30702 6635 6535
9407 6535 -867 -13734 -6533 -2903 -1925 10143 3954 -18365 -19652 -28949 -33579 -41048 -67375 -52774
9393 -52774 -22074 8219 -3230 -1773 188 -1539 27088 4708 -10441 21990 35537 583
9381 583 -32022 -26225 -43984 -40864 -24029 -30028 -25894 -1290 2688 -6188 -2011 7900 -22751 -42853
9367 -42853 -39887 -48260 -42086 -25824 -15479 -39220 -55001 -54844 -53685 -51266 -58234 -44697 -35419 7117
9353 7117 21061 879 17632 30302 37049 8574 -547 16087 37757 32345 35699 3493 1183
9340 1183 -4396 15052 37855 31719 25848 13649 1874 -17253 -15172 -19210 4737 20579 7461
9327 7461 23526 33120 563 -15106 22515 52194 17230 14491 21818 45365 36796 35900 27647
9314 27647 33041 52384 48608 68249 69629 79924 65933 30873 -20071 -20314 2053 12860 23904
9301 23904 19742 20006 -2300 -48113 -58657 -21045 -22031 3902 16280 -15173 -45817 -45476 -54639
9288 -54639 -38098 -47905 -61540 -71874 -64951 -46066 -52592 -38883 -39492 -30896 -22568 -10375 -23240
9275 -23240 -24546 -20256 -21377 -19881 4330 25712 17264 -12753 -48 7848 12332 12560 -15313 -4464
9261 -4464 -6850 -5551 -115 -36122 -47004 -23293 12304 43990 30329 28319 7793 -41813 -38122
9248 -38122 -13420 -33680 -29631 -33813 -12701 -23800 -59613 -77937 -50896 -25368 18930 49448
9236 49448 41944 21660 11874 28092 13295 18810 17305 2264 -5572 -9689 -27269 -61035 -57557
9223 -57557 -64493 -61687 -66618 -29681 7040 878 -38763 -44456 -15551 -20659 -43483 -58675 -50718
9210 -50718 -17539 -7088 -3532 2124 -2406 -2507 -22541 -40906 -5117 7126 -9494 -10008 1374
9197 1374 11232 3531 -16865 -26636 -53149 -47914 -17350 -21353 1447 28525 29024 15856 24442 30873
9183 30873 15776 -8195 -17330 -43165 -47935 -6078 21053 12988 -25780 -53406 -70168 -48672
9171 -48672 -18470 -34440 -39283 -30498 -13408 -4955 -32482 -49669 -40516 -27277 -36599 -12573 11317
9158 11317 -2064 -15977 -6694 -4795 245 9563 4175 -8800 -15427 -7814 -11216 -14131 6017 19096
9144 19096 19311 30011 43094 25572 -2880 5745 29739 7108 -18975 -19261 -2241 -7506 -19527
9131 -19527 2362 25584 12593 -13498 -21858 -6258 19212 17657 22646 78742 71553 53636 55830
9118 55830 55273 59153 76491 53807 42601 38724 17754 -15364 -22694 -17160 -6137 3097 13658
9105 13658 21701 4752 3719 16736 32797 35441 29240 1164 -53064 -40202 -35313 -26624 -15115
9092 -15115 -3909 16509 30787 16454 3472 -3059 -1911 14631 18547 9931 24313 16676 28321
9079 28321 11482 -5690 1763 -25248 -3575 -8935 -25026 -6739 22317 12552 26695 17196 2961
9066 2961 -12401 -11079 -12558 -20949 -18876 4008 26102 831 -17731 -1346 12736 -8094 -16128
9053 -16128 175 4194 13751 233 3236 31173 24269 8220 16805 10275 12153 -1347 -12516
9040 -12516 12441 34862 30158 25501 17635 -18895 -64568 -43843 -34419 -39729 -24400 -53738 -66415
9027 -66415 -32071 -11720 -3154 858 -10496 -22595 -8322 3817 6448 -4775 11824 13017 -20163
9014 -20163 -51103 -74137 -71169 -45353 -19020 -1310 27750 20379 -2839 -9889 -3535 6752 17024
9001 17024 1071 8958 27362 8261 -54871 -69480 -37430 6550 -2198 -30450 -77397 -71234
8989 -71234 -64962 -29960 -26419 -29692 -34823 -24935 -26596 -29409 -34590 418 4153 -13183 -10877 9214
8975 9214 6319 -18378 -25132 -24444 -9750 -3409 -4597 6603 24539 33393 23751 -6786 -38484 -26382
8961 -26382 -13502 -27266 -27562 -4159 3616 16392 24443 24458 -3008 -34519 -44184 -31690 -7690
8948 -7690 2373 14270 31927 16914 6934 -3375 -25323 -34099 -42781 -5543 2212 -3502 -5996
8935 -5996 8685 29494 30608 13226 -6431 -6176 31738 39137 34437 -5148 -17409 -32700 -30663
8922 -30663 13865 33830 19604 18370 36519 23666 20452 32097 61763 71540 66886 19783 -11310
8909 -11310 9775 -144 -29006 -24849 -19891 45518 32402 27352 20231 16340 -7908 3224 30983
8896 30983 18085 4397 -9991 -20830 -20602 -11384 6208 -10938 -2078 -10094 -22245 -21880 -22646 -16065
8882 -16065 18014 19890 14445 7924 -17070 -23438 -21959 15727 52576 45436 55699 65819 53445
8869 53445 26532 5724 -5772 4251 25545 6499 -11021 -6959 -7955 -17756 -1319 7812 26124
8856 26124 21326 16896 25250 27994 40755 29897 10473 15369 27702 29323 4100 23997 25047
8843 25047 5389 -10518 -25371 -43618 -15066 -15743 -9535 10085 16763 13750 -4534 -3562 -6901
8830 -6901 -7830 -42113 -30668 8045 -3850 -26761 -40808 -40290 -53472 -36792 -33571 -32634 -32225 -17678
8816 -17678 -40275 -41114 -47940 -29122 -20097 -18846 -13025 19666 -3065 -2828 -3913 -6743 14068 13661
8802 13661 5898 -3998 40114 43401 26761 23892 -14601 7354 25870 29379 12593 39110 32714
8789 32714 17168 23735 15767 1277 -7619 5629 -4681 -42764 -65893 -74742 -77365 -41524 2685
8776 2685 -719 -10851 -15811 -5976 -2505 -12180 -47503 -82213 -83810 -85842 -59552 -56749 -72735 -77120
8762 -77120 -48606 -11974 -2101 -14415 -34847 -23777 -20699 -15066 -5939 -16363 17699 25876 -14022
8749 -14022 -22636 -23909 5531 7300 -19733 -38153 -18389 -12069 -28530 -23635 -27169 -33001 -38378
8736 -38378 -14520 9030 14560 21599 23901 35412 12641 11752 23723 -3513 -16612 -44312 -16131
8723 -16131 7782 7641 17712 29764 17036 -5118 -8170 11861 23049 5479 18198 11265 16037
8710 16037 18609 -987 -5958 712 167 11248 27570 8915 -10872 -33608 -5677 -3157 6317
8697 6317 19855 -8571 -33838 -32733 -37986 -31196 2547 15249 17471 24356 43139 52850 40669
8684 40669 33781 39876 34393 7637 -3597 -17158 19101 36613 6906 -27511 -24072 -40623 -29042
8671 -29042 -7991 -6435 -342 4150 -13846 -23661 -27605 -26380 1184 -5337 28409 49636 38373
8658 38373 13010 -29727 -23782 -8798 -31437 -31619 -14804 23077 6252 12606 2734 -491 3308
8645 3308 31984 35122 31833 15447 23671 9177 5153 22644 59241 77369 64051 56712 49399
8632 49399 15692 9546 6974 453 22285 26840 24019 9746 -6276 -9226 -17930 -15445 24569
8619 24569 31644 53953 52042 39124 34461 65525 87461 84835 92194 86896 71123 47265 65603
8606 65603 83750 94868 128620 120725 85838 70867 56754 49025 29653 30179 49380 49497 23632
8593 23632 -15342 -23593 -12742 21429 47580 46078 50708 28565 18003 50647 19968 -23098
8581 -23098 -9606 12416 17735 32407 -4826 -26722 -20831 -10519 11837 11193 4759 21252 6512
8568 6512 -24079 -27554 -22831 -25575 -28018 -18862 -20246 -3942 -34636 -16350 15237 41264 64375
8555 64375 55773 18966 6792 5284 21593 -6366 -1837 3791 -17390 -39406 -39406 -29386 -15736
8542 -15736 -2889 -6057 -27889 -41723 -18750 -3706 -11119 -5007 -23431 -30784 -27196 -27817 -18241
8529 -18241 -3554 -467 4517 -5123 -18588 8155 19051 -14314 -12539 -14484 -3427 5652 -6944
8516 -6944 10787 -12661 -34168 -45214 -43960 -38889 -6508 17565 42397 14857 -18757 -13222 4086
8503 4086 -14398 -25167 -42504 -9662 1162 -10342 -8303 -19364 -21414 -36635 -14734 30596
8491 30596 26662 41437 43773 39861 49690 22400 4407 4458 5934 27456 28296 8246 18225 18846
8477 18846 31691 21972 30076 61633 48782 65317 85952 62051 50925 65598 61856 41110
8465 41110 43094 34353 7546 33228 38851 37929 11149 -9430 -24553 -16869 11229 7584 14179
8452 14179 25466 13500 21117 22464 -16817 -15094 11953 31727 18991 -23531 -37023 -29662 -19900
8439 -19900 -16320 6283 -1356 5641 21528 32340 30156 14235 -18381 -36247 -27198 -38724 -30064
8426 -30064 -185 15677 14060 146 -3423 10794 18829 8668 19500 18743 13808 -8082 -18836
8413 -18836 -16578 18064 22711 -15270 -22922 -12383 4100 6410 8541 21221 25470 30204 15242
8400 15242 -2122 2834 22518 26021 25577 12839 -7669 -18067 -29953 -16132 8246 3955 170
8387 170 23878 19548 50776 62372 31814 41201 61800 31291 10194 -11834 -14576 20415 69900
8374 69900 60835 32755 32920 36171 38340 22104 -2517 -12413 -707 24499 43294 19352 -4353
8361 -4353 -3481 -992 -5496 18173 22809 3391 -4721 6800 9359 -8075 -27621 -31290 -13698 -9826
8347 -9826 -20555 -6592 41550 42994 19665 23452 29404 -5445 -13594 -24757 -11509 -3564 3690
8334 3690 2237 -6780 -16670 -13160 -7933 -15637 -9656 -1189 3250 -10034 -8353 9711 11280 -13146
8320 -13146 -22884 6575 8024 -22575 -539 5897 -11182 -18096 -21069 -39765 -14617 -15182 -17782
8307 -17782 -37957 -52131 -73704 -79954 -56737 -54414 -44306 -14208 7494 -12486 -32823 -20009
8295 -20009 -16958 -21590 -23432 -23821 -43014 -54092 -59804 -44841 -18077 -20697 -23939 -18522 -17960 -4063
8281 -4063 7278 12717 7240 -21812 -39641 -58072 -39762 -21984 -15235 9317 5601 -2394 -8624
8268 -8624 -44491 -61515 -30010 -20554 -22614 -20727 -43682 -86392 -105803 -61305 -20874 -17028 -28434
8255 -28434 -24806 -1909 -1110 -9943 14290 18028 25218 18515 9185 2231 3861 4311 19562 24233
8241 24233 21687 19741 15400 -3682 -4871 -5429 1779 31495 53239 40914 28675 9929 -9158
8228 -9158 -10978 -8761 -39480 -45084 -14662 -11098 -1273 9572 -3299 -8128 -7752 -20613 -33083 -21931
8214 -21931 -11086 -5322 -2615 12521 -3302 -18779 9989 20441 14681 9322 7940 -13147 -2493
8201 -2493 10393 20485 12579 11724 15184 -28457 -49900 -52014 -44477 -4421 30462 6580 -2506
8188 -2506 9638 26986 22551 16272 -267 -4542 1980 -2315 9639 14292 30412 19078 -535
8175 -535 -3947 3156 -24687 -46666 -30997 10847 22638 19356 35778 37635 49147 47248 46437 67081
8161 67081 64159 30835 -11531 -11882 3334 11841 36913 59377 56393 53176 58291 34695 31747
8148 31747 36968 38221 21758 2928 9962 -3536 16447 8608 -953 -1671 -9691 -15437 17343 36166
8134 36166 17287 18078 17944 8256 -9426 -8553 -15169 -23545 -11912 -17827 -10562 -9450 -26326 -28141
8120 -28141 -20252 -14444 -7410 -9099 -10803 -13565 -14636 14626 20987 5089 32810 62717 57172 39583
8106 39583 5116 -20262 -46812 -45499 -24779 -36498 -17123 9514 36780 38498 11876 -7844
8094 -7844 25215 21972 11938 29724 29184 17194 -10115 -25282 -13447 -22529 -16278 -11084 -6850
8081 -6850 9733 13833 10699 -8837 3768 29516 29387 20185 6757 -5188 2000 15457 -16618
8068 -16618 -37878 -54788 -61368 -81975 -92814 -87631 -45109 -13820 -16353 7098 24526 27045 10761
8055 10761 10884 13462 753 -11253 -8771 -6420 -14596 -5613 2023 -3850 665 14024 3868 -9359
8041 -9359 -8066 3581 -8201 -21989 2578 15981 27299 5721 3810 -16869 -9226 -24316 -35976
8028 -35976 -8578 2892 -33576 -11948 -15789 -10860 3894 10991 10058 -637 11571 6714 9546
8015 9546 20750 10933 21642 24270 31388 30485 30868 37036 37658 39420 47377 39008 28631 31926 7689
8000 7689 3399 15315 14704 15690 20248 27613 23320 13656 16392 26593 28899 36847 18618 -6569
7986 -6569 -264 7102 -1805 -9450 -21155 -49508 -31963 -22857 -5178 1575 -2003 21684 56789
7973 56789 56411 54414 70542 38676 17227 36335 45481 63987 57380 44786 25191 19873 21462
7960 21462 12715 25849 19638 12701 10990 33147 66361 50874 32353 64450 84915 54606 18003
7947 18003 37258 51963 25346 6850 -10304 17603 31122 9415 18339 10213 12253 36126
7935 36126 36170 46192 51116 13120 -10838 -12759 25770 25591 19400 19751 46532 52165 32469 51168
7921 51168 51335 62530 64976 45987 27270 36232 4939 -10782 -15156 5636 -11835 1217 -2584
7908 -2584 -21826 -41329 -49734 -23086 -13797 -22771 -9901 6969 32028 28977 -13409 -39545 -29411
7895 -29411 -17114 -23161 -2299 3983 -9502 -18025 -19359 7169 12359 36680 47097 24170 3315
7882 3315 -29136 -46835 -52331 -32797 -28038 -37005 -58657 -34253 -14175 126 10476 -36076 -55197
7869 -55197 -36515 -32611 -8419 -9070 -16317 -30210 -1534 -6384 -9082 -7749 -20507 -26037 -3418
7856 -3418 6279 6259 1673 224 -18412 -34684 -27275 8641 5062 -16770 -6096 -28840 -48432 -28952
7842 -28952 -14618 -22804 7759 -17589 -44661 -8550 -11594 -9182 -3356 -9240 -10222 10409 3532
7829 3532 10788 -1285 -3572 -34150 -54178 -49830 -37723 2366 10440 31987 37107 32558 23855
7816 23855 17808 24114 13901 6427 -261 -19177 -14863 -29843 -17314 -15201 -17710 -534 7574
7803 7574 10823 -4593 -13914 -21682 -20671 3131 7360 -7830 -21710 -32902 -43816 -41198 -14958
7790 -14958 -8664 -5006 1462 -3874 -4670 -7197 -9996 5502 19558 10928 13509 -12416 -10776 14093
7776 14093 27796 35632 34846 25969 27330 18819 12788 -7927 -11907 -10462 -28130 -36377 -17599 -10800
7762 -10800 14477 3240 -35733 -52185 -68401 -44836 -37059 -8075 22756 18327 33755 7786
7750 7786 29093 25628 6492 -11203 -27887 -36066 -34502 -22248 -17930 -22974 9666 17255 12782
7737 12782 -11852 -35653 -44818 -23606 -2574 -21441 -21341 -23906 2655 -15322 -17565 -18443 -14532
7724 -14532 8618 87 -5693 -26543 -26994 -19696 17617 42400 42365 18935 3821 -15700 -25228 351
7710 351 28321 33317 16439 -11964 -19193 -28887 -36226 -29461 -50962 -75052 -50363 -32454 -32355 -33160
7696 -33160 -35456 -70820 -58380 -12731 9756 -3072 375 -28619 -44301 -12277 3942 -5918
7684 -5918 -1862 -13461 16701 13945 26294 17506 25164 8130 18373 16440 19422 19089 8677 -12400
7670 -12400 11992 26757 30045 20507 21217 30045 -13004 -64234 -30270 1659 -11959 -2113 20683
7657 20683 38934 25411 -11410 -12004 -9016 -11999 -14956 -13604 5029 -10545 -3170 45799 38698
7644 38698 -2875 -208 727 -18981 -14922 17456 23371 -399 -31303 -44174 -15724 -6693 -9710
7631 -9710 -30202 -12727 -16617 -38104 -2604 23981 20408 22439 -8564 -2393 -3708 -33575 -33571 -22475
7617 -22475 -21152 -18439 -27595 -41696 -51898 -16770 8801 44839 58614 41050 30128 21195 20027
7604 20027 44385 50145 4530 -20548 18802 48870 52890 34450 -3007 32260 66454 44571
7592 44571 22386 13468 12230 -6465 24020 31174 25972 5752 18448 -5635 -11331 2247 -660
7579 -660 6658 13645 38294 76121 61964 6883 -10582 -10101 27950 46741 46072 46061 39818 18622
7565 18622 16494 -3622 -7736 -27173 -51898 -58208 -51395 -40418 -21873 2759 18086 16885 824
7552 824 -32208 -56346 -80137 -71662 -40079 -50908 -47183 -40784 -40590 -39102 -29158 -35486 -37801 -6792
7538 -6792 -13110 -34895 -30253 -31093 -14362 29950 22099 9096 9213 11461 4067 -2669 32044 1840
7524 1840 -14327 -9531 -38060 -58105 -25609 -43808 -81576 -104563 -103990 -61573 -26288 -8648 5407
7511 5407 -5416 -30625 -46151 -56045 -50695 -22847 -10937 -10297 16929 13524 24423 12054 -7409
7498 -7409 -20350 -23051 4479 21506 29113 12374 -13167 -70119 -64154 -18656 -5940 -25447 -42021
7485 -42021 -24937 540 17119 11661 -5959 -1293 24555 -1917 -9043 23486 12295 -23821
7473 -23821 -36075 -52320 -58856 -46796 -36708 -19465 -20403 658 3403 -11086 -17371 -12744 -366
7460 -366 7346 19681 -9958 -23291 -46027 -34548 -25614 -25492 -9295 -13096 -19102 -32562 -20308
7447 -20308 3142 -7782 -13116 -15725 -12116 -13264 -15738 -18221 -41731 -42528 -19572 10940 -2788
7434 -2788 -57475 -56336 -36224 -25606 -43300 -35271 -34440 -22475 1814 -6608 -2481 6341 12473 -21962
7420 -21962 -48557 -49995 -44482 -80762 -102687 -96858 -107635 -118508 -110789 -91119 -58540 -36162 -14207
7407 -14207 -12216 -27447 -7557 480 20225 20416 -8793 -39606 -36422 -26818 -10636 12139 17155
7394 17155 1240 12585 25225 26865 14740 36147 22595 -10908 -7586 -5085 -17973 -6674
7382 -6674 -27231 -16234 27904 44165 35330 31701 10094 1194 26126 34890 35766 22231 23788
7369 23788 44115 54774 52106 35119 13318 -9967 -1645 -1787 -12769 -7825 -3465 6986 5491
7356 5491 -6739 -8443 8476 -18796 -15289 -1057 19090 27716 12668 2255 9664 -10901 -22140
7343 -22140 -6152 -11350 -11230 -30905 -42102 -17631 -1290 4809 -7471 -15188 -9866 -10067 -21964
7330 -21964 -17442 2372 16971 23004 9649 2543 -11816 -18736 1035 4864 -717 -685 -5938 -1957
7316 -1957 -6395 15029 21945 12685 21705 -21639 -77634 -85887 -74160 -42387 -28825 4660 26931
7303 26931 9689 -9779 11032 33514 10948 251 20748 29734 32191 7156 3951 12228 41652
7290 41652 29464 -8632 -25030 -32975 -35235 -30259 -29750 -51465 -55716 -28800 539 -12211 3187
7277 3187 -200 -3151 -748 15645 34576 13520 -5835 5751 11064 8600 14971 5040 7024 -14906
7263 -14906 -12979 3145 -6251 -28170 -22544 -30484 -24032 14666 19093 24439 34241 15168 -28228
7250 -28228 -34356 -17426 -7357 -3570 -5553 -14501 13033 5227 -625 -382 2946 -7935 14770 11630
7236 11630 -18408 -19734 -9023 -2725 24478 16883 -15135 -6691 3091 -18489 -23511 -31998 -23561
7223 -23561 -17853 -26521 -39005 -25493 -17255 -5004 632 -17865 -40822 -32723 -31806 -25841 -29363 -15888
7209 -15888 -17920 -17731 -12003 1757 -8 -3752 4440 16623 8714 -11386 -10073 -357 40245 43159
7195 43159 26266 17909 18804 25284 22336 4865 -13095 2182 14846 16223 -2383 -5177 22770
7182 22770 14584 -23951 -15850 -14824 -24968 -6266 10504 16026 -13471 -55228 -37417 -27178 -31748
7169 -31748 -43264 -61609 -46393 -37061 -32465 -28125 -21387 -39503 -36490 -23301 -25355 -23106 -23041 -35879
7155 -35879 -27748 -25405 -26694 -43638 -25696 1264 -11389 -26934 -39049 -41513 -35736 -60335 -87270
7142 -87270 -96861 -57560 -32159 -32211 -19463 -9386 17930 9180 -2553 29060 41299 36743 13914
7129 13914 -38888 -64321 -81145 -47606 -54780 -39992 1883 8740 -7341 -27314 -10868 -23149
7117 -23149 -27003 1431 12024 11636 8865 2086 1881 13541 -232 -17591 6467 9564 7082 12258
7103 12258 7544 948 10658 32677 28636 4201 16675 43679 34885 23170 47734 37899 48342
7090 48342 42036 4075 -4084 9691 5181 -136 24404 16958 -17077 -26816 2280 18658 1894
7077 1894 473 23729 57769 46706 480 4994 -5357 -40757 -30017 750 17975 8290 11245
7064 11245 4046 10707 1113 -2164 12546 -15988 -43088 -28448 -49346 -42908 -14283 -56804 -53233
7051 -53233 -35876 -28227 -16284 -4348 -6472 -15823 -25833 -32622 -18680 -21176 -25157 -11915 -16565
7038 -16565 -28411 3964 9880 -18934 -25943 -38493 -54736 -44169 -32649 14213 39159 12945
7026 12945 8648 -12540 19331 18924 20510 29704 14738 -13064 -20530 -21209 14290 3471 -16175
7013 -16175 -29420 -18218 -113 -29261 -46057 -64088 -69200 -36007 -24477 -33313 2877 10133
7001 10133 2290 -12003 10503 9315 -5182 -11893 1119 19588 50251 50623 48089 47139 29664
6988 29664 20291 19179 92 20027 43533 32329 -9804 -20976 -15708 -14443 -2037 -17958 -8480
6975 -8480 35414 32350 14270 -16580 -27636 -15142 -22322 -13141 7665 23394 6286 10458 -1702
6962 -1702 161 23469 44698 -1469 -7392 12702 34956 40432 20864 -8955 -52026 -46170 7083
6949 7083 19741 18017 -8056 -35546 -24342 -23264 -26237 -24790 31732 29956 -825 -2461 13463
6936 13463 13841 31019 45568 38007 37372 17384 -6163 -23036 -19512 -22419 -6181 2304 -19047
6923 -19047 -16896 -22357 -4757 18062 7441 5721 -346 -15345 -22754 -46660 -61121 -88475 -78816
6910 -78816 -48355 -42230 -60068 -60282 -59206 -25262 -7557 -24208 -36025 -30538 -26537 -15453 -15913
6897 -15913 -27962 -6543 -20339 -54314 -41076 -8557 4001 9835 18887 25146 29934 14197 5715
6884 5715 21855 33721 32350 32020 17757 1433 37920 49523 6003 -21026 1675 4793 -15444
6871 -15444 -26161 -51243 -60920 -54548 -53191 -41489 -42641 -47030 -24588 -535 23123 6158 -21071
6858 -21071 -57322 -59543 -12720 23732 29103 12355 -10934 -51220 -46423 -12949 -2908 -15708
6846 -15708 -10662 5382 7100 16100 29658 11253 4492 14479 -5178 -13126 -8968 -6882 -25771
6833 -25771 -56829 -20513 3055 -18787 -29010 -11550 -20333 3314 45032 54400 24187 25515
6821 25515 18317 12014 18095 13572 -8136 24218 34773 26083 11469 3597 1828 7999 22261
6808 22261 25393 -22252 -41892 -22075 -5692 16038 27069 29755 28053 25033 -1571 -18966 -10900
6795 -10900 -2296 1015 -28919 -34171 -27942 -46422 -103162 -83188 -43722 -3127 -2046 -21552 -17379
6782 -17379 7023 3235 -15246 -3331 10134 4883 -9808 -25826 -1208 10835 33725 28103
6770 28103 15095 -23285 -32118 -1428 17987 -4266 -24472 -20491 -1001 -20278 -15120 -26225
6758 -26225 -36890 -45019 -29356 -23190 -41881 -53504 -32930 -31828 -37926 -33112 -25030 -23093 -48400
6745 -48400 -57545 -19463 -14969 -28242 -30859 -18933 -1296 -39410 -49516 -14738 7578 15439 -7512
6732 -7512 5063 64768 99978 105207 129566 147820 192568 256582 279249 262683 222172 142289
6720 142289 97834 87317 52511 35687 44776 10029 -1284 -21800 12565 47879 50651 20275
6708 20275 15054 8970 5983 11364 2111 18097 6322 7551 16545 14164 -13040 -36747 -34921 -58025
6694 -58025 -74108 -66884 -71067 -45276 -6683 14438 25376 -1119 15565 49210 64125 63269 44226
6681 44226 57215 62181 22634 4946 9142 -11056 2138 9319 4905 -3270 1440 -17912 -32468
6668 -32468 -27672 -2613 4693 9505 23354 7099 -10724 -3019 5731 -18365 -27633 -17143 -28278
6655 -28278 -61319 -72547 -81464 -67511 -35157 -9962 -4099 12390 -15741 -38683 -29560 6585
6643 6585 11488 15935 8311 -22622 -2771 2584 -20256 -29428 3128 -6378 -32995 -41590 -58667
6630 -58667 -61587 -58385 -29079 29850 54589 62465 67390 70266 31768 9968 9035 -5019 -9093
6617 -9093 -186 15890 -5390 -21590 -5824 -23336 -25951 -5277 -40805 -47938 -37431 -1788 22103
6604 22103 42827 22535 26899 29374 7301 -10194 -33015 -38036 -53702 -69253 -74814 -60699 -40115
6591 -40115 -31567 -26084 -27151 -15433 17041 20731 17758 12567 8740 -4767 -11054 -3251 -12704 -42810
6577 -42810 -25682 -8224 -27878 -25048 17609 45015 34042 28359 27781 11323 -3106 2302 25830
6564 25830 26313 14785 -2409 6142 13357 31020 21756 -8601 -13583 -4949 3261 150 -19167 -34713
6550 -34713 10641 37769 58799 48834 4284 -2953 500 7552 -26405 -40729 -29164 -16321 1792
6537 1792 390 -15763 -47823 -35302 -10176 -1567 -21306 -53336 -30015 17217 10569 -12491 -41678
6524 -41678 -7760 17324 732 2260 -2257 9361 2369 -4536 4623 14230 5125 14957 18851 23520
6510 23520 -15940 -24517 7428 53920 66490 43576 21834 9410 13269 5156 -6981 -30490
6498 -30490 -44535 -41772 -41163 -64723 -52324 -35660 -44361 -35665 -35061 -29513 3270 -4791 1899 -1653
6484 -1653 -11221 3217 38755 66875 50840 32082 22338 9893 -8128 -32368 -47147 -10804
6472 -10804 10341 13419 21090 26363 20718 -9696 -13501 11123 8812 -23800 -11977 2710 -13671
6459 -13671 -5523 20779 15135 -2674 -26369 -9699 -1099 16612 39121 28636 3832 -5001 -32680
6446 -32680 -27024 -8257 4909 21477 7327 -10276 8332 22343 27052 35938 34211 12154 -21547
6433 -21547 -20597 3438 -22847 -26981 -36506 -19951 426 -44036 -52071 -49823 -60302 -56423 -34077
6420 -34077 -31474 -12365 -12743 -4586 2829 -16645 -18548 -20236 -30564 -17086 -16699 -4032 -7403 4802
6406 4802 12911 19988 10109 -8525 -20243 -8125 -5395 -24272 -51986 -56461 -65844 -64605 -55603 -44867
6392 -44867 -17613 6577 -18250 -55032 -39639 -14545 -1514 -13799 -22983 -36346 -32428 -14736
6380 -14736 -18205 -36758 -38645 -29752 -38440 -60806 -75022 -62330 -2303 26550 16330 14070 -1728
6367 -1728 -21764 8861 3093 360 -6132 -10757 -1139 -17798 2728 23647 33511 23590 49971
6354 49971 33637 18423 -1562 2227 5232 15038 -9070 -30482 -23531 -15469 -8870 -11690 19196
6341 19196 34544 24541 30581 31448 6079 9829 25402 -14290 -15686 -5244 -33841 -71450 -76997
6328 -76997 -71883 -51540 -51441 -72753 -50177 -463 -13141 -63042 -55676 -66423 -54466 -36883 -28455
6315 -28455 8976 27582 2081 -18790 2377 14966 -19205 -4644 3851 -15488 -9658 16572
6303 16572 23699 42271 17735 7752 40305 40501 59142 44826 16843 27375 39463 29982 978
6290 978 494 -1784 23034 17430 -2470 -3399 3500 -15771 733 7396 -13974 -9716 25220 9010
6276 9010 -13911 -11896 10654 -15628 -58883 -31812 -14137 3525 264 -12403 -8224 3396 550
6263 550 -11910 15696 6714 -5939 -8636 3685 -8842 -18858 -1105 -14856 -18611 -24726 -28914
6250 -28914 -5421 -12754 -32886 -40658 -21190 -25432 -37405 -54479 -40100 -32221 -33893 -31886 -24279
6237 -24279 -1370 -11774 6945 -2033 -25588 -36105 -18681 -17601 2412 21621 1725 -10945
6225 -10945 -4677 -5748 11624 27086 44143 30105 -3642 -10380 -10573 -7967 -20198 -33843 -38762
6212 -38762 -24734 -13631 -121 26551 64326 45241 35956 42361 57240 68882 56490 56889 35465
6199 35465 9300 -16084 1818 20824 7315 -25567 -40470 -27553 -4003 10616 22067 31784
6187 31784 23000 30285 12985 -5020 -22604 18877 32199 10248 -4297 -2737 37061 53328
6175 53328 35873 39839 33939 1699 -12851 -9100 15784 23829 23386 14759 -7053 -44461 -49323
6162 -49323 -47291 -35904 -56465 -86177 -71498 -7619 -1736 -31719 -19644 5416 2225 -2825 -3463
6149 -3463 -751 -9283 -21617 -36935 -1954 26091 18350 13405 -5821 -26490 -47338 -59450 -67587
6136 -67587 -64592 -61216 -52186 -31832 -24069 -593 -211 -16480 3595 -19176 -28403 -16482 -727
6123 -727 15702 26823 30372 14274 24556 32147 -1916 -31614 -36278 -5446 36193 36442 36781 45248
6109 45248 21718 -24247 -5110 12018 8471 7922 12677 1301 16591 26460 3500 7305 33257
6096 33257 24672 20934 9906 -16036 -32287 -41997 -47075 -34178 -22577 -38069 -40813 -18636 -17044
6083 -17044 -22922 -15315 -13326 10230 25148 36740 33326 38459 25967 3281 -9428 -1301 -9409
6070 -9409 -4321 -20520 -20840 -13621 -9297 -10994 5432 16338 22294 3783 -146 -5977 -15781 -17527
6056 -17527 -15308 952 36354 12809 -30655 -51478 -19814 23295 50185 36203 -4458 -26713
6044 -26713 -1908 9942 16802 -4772 -35473 -36658 -18387 -29581 -16891 18330 11809 31914
6032 31914 32712 25156 2697 -33344 -58385 -76112 -56128 -28707 -23756 -4780 37115 81397 64519
6019 64519 39595 65743 34586 -1151 3957 25457 -2030 -36051 -49091 -10124 2126 15522
6007 15522 29493 19369 -6731 -8083 -4546 -3764 12476 10047 22188 12780 -32094 -44010 -42277
5994 -42277 -25314 -2435 -5373 -35672 -28754 4442 -14537 -32541 -29782 -8960 9415 -7049
5982 -7049 -15600 -16784 -10956 5400 21035 12275 -19003 -35953 -28380 -27308 -40427 -12019 9683
5969 9683 -8580 -9895 -7783 -41000 -48713 -45708 -39522 -17434 -12804 -19629 -4984 23715 25514 11355
5955 11355 20570 12143 26441 32067 12957 9570 21011 777 15871 21932 18327 12203 -13287
5942 -13287 -20034 -32832 -37689 -23869 2654 5998 2289 -24089 -36361 -20764 13149 14828 -20124
5929 -20124 -40203 -16314 -8097 12916 33237 17583 -829 -4654 17907 46156 60153 36405
5917 36405 31451 15228 -2801 -18737 18078 35660 39135 30908 4160 -1903 4109 17828 -4326
5904 -4326 -15278 -41081 -46999 -49034 -51184 -63566 -73894 -51387 -10698 10388 41270 20775 -10247
5891 -10247 -22402 -26884 -24551 -26035 -16732 -35192 -23135 5428 -22101 -32647 -29904 -36808 -22066
5878 -22066 -19113 -10427 -8734 -25105 -36834 -4578 27196 33117 48268 45231 34651 17458 7732
5865 7732 1590 20726 39957 5602 -39970 -55928 -55659 -31017 -23706 -31000 -49825 -57516 -52575
5852 -52575 -39375 -33992 -24798 -10086 9510 -10653 -17288 -6652 27060 36788 23609 27553 7328
5839 7328 10551 20033 -26827 -19697 -5935 3119 2659 2335 4564 -3239 -17091 -22073 -15250 330
5825 330 -4503 -16142 -32948 -19236 -6216 3344 -14842 -8739 -13447 -9873 17118 15677 24815 25335
5811 25335 14351 3150 -5906 1513 -1072 -16618 -26553 -47744 -41154 -58055 -41512 -6671 -2961
5798 -2961 34058 48528 40242 33678 39163 5796 9095 -17980 -22331 -30126 -36557 -11619 -16782 -10177
5784 -10177 7234 16441 -10984 19058 29878 -8822 -26872 1546 -1174 -9867 -20660 -16526 -16674
5771 -16674 -17266 3411 33491 47399 25154 -1668 33645 58354 51666 36718 30212 29372 9117
5758 9117 13913 -426 -35411 -30303 -10800 -20744 -34643 -34488 -4803 -5296 -16346 -34396 -49769
5745 -49769 -42290 -40087 -44595 -32571 -15542 3371 31176 35162 41197 19905 -11718 -10771 -7234
5732 -7234 8769 40960 12950 -20576 -18085 -19651 -38893 -51782 -25234 -18835 -27029 -46294 -31055
5719 -31055 14587 20898 -5228 -18366 -22340 -18 5208 1916 -41766 -59842 -42847 -48579 -24971
5706 -24971 -412 -3536 -16321 -3039 -38727 -22333 -36677 -54201 -37027 -23294 15685 1407
5694 1407 -9241 14331 20211 -2278 -12789 11148 -12736 -33073 6417 43288 41871 18817
5682 18817 19413 22329 30473 36758 10836 -4587 1119 12656 -2539 -5291 -19175 -2848 -8513
5669 -8513 -40897 -4214 -7716 -57216 -41856 -1898 8566 6804 1687 8676 1562 -14331 -21331
5656 -21331 -18532 -7219 -10509 -19558 -11503 1531 3949 10613 -19734 -31624 -17135 -15945 -27969
5643 -27969 -18110 -13573 24673 -6516 -24438 -9490 22645 31536 11661 5880 -6565 -2671 -12870
5630 -12870 -28882 -21684 -41670 -27631 603 -12422 -620 7198 6225 -523 -7985 -27027 -9522
5617 -9522 -7782 14012 -4197 -7979 -9359 -37509 -31769 -39962 -34629 -47357 -32105 17477 50040
5604 50040 40166 28054 24520 11596 16761 38979 16870 22317 27190 -5345 -9694 29589 17030
5591 17030 -1478 12790 28382 11086 -6587 -20051 -4579 -1920 -27872 -52012 -49844 -18383
5579 -18383 8240 -7647 -22981 -16081 -3897 -14887 -32068 -22754 -19855 -30398 -38825 -10604 13329
5566 13329 14770 12199 12286 6441 -11739 -13646 -27728 -17827 -35199 -55149 -72793 -65492 -24219 4435
5552 4435 -15697 -9977 -6770 -7960 8313 16083 23935 23057 13132 -1530 -4795 -23175 -21906 -14556
5538 -14556 -17356 -8913 -8549 10342 -382 5172 -13644 -57680 -62662 -39359 -10480 -14089 -26612
5525 -26612 -27393 -13245 5507 16046 44634 42633 18698 5582 10598 12145 5239 -16004 -1203
5512 -1203 -1308 34760 9060 -26657 -31768 -29452 -19555 -27868 -19572 -18192 -1398 6365 20729 24018
5498 24018 -6927 -23335 -13446 -7020 -31241 -25381 -8140 770 1800 3766 -3077 -6981 3543
5485 3543 -6865 -28656 -30170 -3432 -3837 -19466 -3093 -15145 -18687 -31284 -26022 -8300 -12046
5472 -12046 -12074 -8622 -27866 -10436 3331 -1137 4975 17856 -20774 -23032 -9508 -2293 -29824
5459 -29824 -45584 -66687 -68812 -41635 7887 14645 -33314 -26827 3132 10846 -15604 -45452 -13455
5446 -13455 11259 -6246 -5945 -18193 -60430 -76893 -31770 -6848 8334 -2603 3207 20738
5434 20738 9217 8326 -5960 -33871 -39610 -11077 25775 34527 38708 60717 7465 -8339 -9390
5421 -9390 -2259 -22797 -37387 -52464 -38242 -31234 -45252 -29116 -41874 -26902 -10699 -4496 -2456
5408 -2456 -19263 -22842 -9014 1352 7556 -5152 -14193 -18449 -21595 -20757 -23012 -16795 -13135 -40290
5394 -40290 -44244 -21710 3655 -3800 -5424 -14072 4361 6088 -2607 -15292 -9684 -28481 -48433
5381 -48433 -69729 -45228 -15016 5625 -22662 -40957 -46254 -52447 -60583 -56777 -60232 -37205 4971
5368 4971 -4271 -11335 26144 33813 34762 61582 49217 21685 18366 24374 2213 -551 631 6602
5354 6602 -2465 -24986 -72305 -81211 -49029 -27804 14957 -6587 -38472 -34393 -33296 -30628 -43963
5341 -43963 -7950 -18132 -35940 -15117 -1207 12756 29458 37400 40522 44381 27847 -1255
5329 -1255 -10644 -5623 28770 40404 39361 23161 16264 14529 25712 41001 79663 93929 29596
5316 29596 -215 2570 -6293 -33544 -6983 5087 13047 13114 23776 29570 15980 3466 125
5303 125 6811 3860 -15016 -26186 -13575 -25263 -30065 -6299 8632 -8052 -53204 -57396 -33573
5290 -33573 15566 44417 38532 23449 18038 16173 2652 2764 -19732 -17135 -12939 -6022 -11155 10923
5276 10923 47154 36025 33983 43737 26385 15930 -8725 -24518 -13682 -7712 -9512 -14019 27249
5263 27249 23010 19734 -23782 -8271 -22035 -25349 -16304 58 7763 -1503 -7557 3875 -1761
5250 -1761 -35 -9715 -31447 -27465 324 -8033 -3986 15211 4192 13062 24088 31308 28706 13801
5236 13801 17105 12829 16418 4514 -21830 -17712 -2877 -8694 -8741 -8572 -8059 7263 -5385 -23641
5222 -23641 -7862 -2326 2438 12908 -8158 -37550 -58920 -66852 -40787 -43675 -32302 -22134 -13776
5209 -13776 7151 10012 -41036 -39427 -16763 472 -3807 -18421 -32665 -27891 -36077 -49949 -14891
5196 -14891 23920 26874 -9438 -14573 3038 17326 26832 17798 4214 -10296 10294 -727 -20525
5183 -20525 5440 11379 9728 -14070 -18154 -27693 3499 29510 24810 22589 35574 36442 24893
5170 24893 -13934 -14551 -7959 4621 4622 9676 12839 8301 8597 -5638 -19757 -36073 -28275 -45179
5156 -45179 -57617 -63322 -42970 -17216 816 27849 27912 21638 -13295 -34704 -32593 -19942 -36702
5143 -36702 -26373 -6176 2131 4357 33789 36930 15223 -13177 -13970 -30317 -23022 -26709 -35757
5130 -35757 -35875 -11512 9969 -13505 -9156 -23569 -25768 16329 36796 64192 87673 85183 98484
5117 98484 74629 45551 19723 29231 -2284 -1591 2253 -31042 -57535 -67991 -51446 -9893 -10222
5104 -10222 -16494 -16196 5949 25175 14464 36470 37703 3434 -4515 -7314 14453 3139 14957
5091 14957 17505 10308 29892 12754 -4084 -17373 -32683 -32624 -10789 3965 47058 51025 39005
5078 39005 12921 -16526 -19024 -18679 -17143 -33915 -11270 -2758 38231 34994 36433 22844 15624
5065 15624 20469 24004 22015 25302 40251 38861 12499 -25844 -41078 -6522 -4233 -43204 -19082
5052 -19082 -16779 -16426 5716 12555 18976 23949 1312 -24526 -3460 2368 2617 -798 1099 -14972
5038 -14972 -27835 -14548 5006 -3587 -24145 -10675 9162 -1571 -8021 -9892 27506 17952 4192
5025 4192 22098 19618 26151 -14776 -52095 -59091 -39466 -4426 13203 8346 4713 -598 -468 -21156
5011 -21156 -37348 -38188 -38682 -29707 -18235 -27279 -9662 15703 9174 17114 40511 27542 15464
4998 15464 25546 22872 47511 37998 -2702 -10680 -15942 -2123 -29978 -37742 -29831 -113 32931
4985 32931 21276 -18459 -3214 2026 -25927 6646 39175 69120 37187 5325 -8495 454
4973 454 57805 53322 46650 24983 14236 29189 46715 39573 24706 11973 -4318 -20225 -8082
4960 -8082 7180 19721 20584 6788 9166 5449 3283 -4724 -13637 -20653 -1640 10064 21037 6019
4946 6019 -30217 -43228 -57546 -62322 -18807 6967 1258 -6052 -31437 -29582 10328 40183 62270
4933 62270 56513 33388 8947 8443 -10221 -13238 -13572 -16181 -20447 -22402 -20882 -26472 -10348 -649
4919 -649 -13262 7127 34275 48199 26826 -6455 -11687 4342 26512 17502 -15212 -16971 -12710
4906 -12710 9185 17396 8937 -7241 -13369 7326 35146 21144 -6808 -18332 -57140 -61990 -45941
4893 -45941 -46633 -56239 -25312 -17755 -29232 -35492 -48232 -33843 -26068 -24689 -2360 13081 11177
4880 11177 21087 21584 9903 13208 -19144 -32589 -20728 -6552 22328 -17232 -32306 -61274 -54781
4867 -54781 -31388 -20480 -4647 21242 26235 -1778 -20193 -10131 3085 24536 33764 17572
4855 17572 -19694 -39529 -27629 -18559 -21742 -4916 -4691 17920 20461 22037 24637 -3862 -21463
4842 -21463 13438 17011 -3973 -16251 -11732 -17566 -21248 -25674 -27671 -10590 17852 34078 41310
4829 41310 32626 31821 15284 11830 7729 -3343 5100 25803 -6027 -25347 -24497 -10085 19607
4816 19607 20230 17694 17108 14516 13793 19544 20591 28478 44835 44822 28459 34354 35658 42805 11455
4801 11455 -15530 -12887 6789 15817 23225 -2346 22098 56023 14159 -13171 -9518 -13293 -21823
4788 -21823 -2151 -17778 -62770 -84538 -57412 -34930 -39251 -56297 -63614 -47647 -47186 -45072 -25231
4775 -25231 -1907 502 -32050 -54340 -52106 -44772 -40595 3174 23160 4849 12692 7878 23508
4762 23508 32678 20423 18635 41300 30611 9234 -16498 -15921 -22236 14005 18122 15414 892
4749 892 -4940 -432 1938 -5114 -24615 -19677 -40010 -36824 -21124 7782 20263 -5447 3307 -11853
4735 -11853 -21009 -23882 -20553 -19458 8074 15961 4841 -12864 -6007 11431 11007 -7403 -17557
4722 -17557 -12293 -18411 3263 -22189 -16033 -30101 -18358 -13806 -6873 -989 27504 20407 25679
4709 25679 22127 -2954 4573 12158 -16522 -40134 -21104 -12391 -17108 -30341 -26338 -11131 3053
4696 3053 -11757 -21528 -25120 -305 31325 32554 3487 -35416 -45087 -53503 -38734 -35405 -19638
4683 -19638 -26444 -55321 -59434 -27939 -11982 -9187 -34491 -27515 -3846 -4471 -15610 -8114 -8821 -26660
4669 -26660 -26909 -36368 -28790 -40427 -19309 -2798 -12873 -14993 -5457 -15236 -5952 1639 2025 -7496
4655 -7496 10556 33748 58626 45977 38636 10825 20395 49754 66657 50396 38824 3858
4643 3858 -12867 -11749 -4861 -32713 -66919 -80503 -96616 -75060 -36266 -25076 -16162 -4429 1994
4630 1994 -50849 -46007 -14380 -3848 6985 4703 13947 13013 321 939 -17932 -16069 -21931 -56825
4616 -56825 -46326 -65316 -34249 -15130 -12792 -35911 -41251 -39077 -36036 -24137 -40304 -35165 -40923
4603 -40923 -36885 -51691 -49492 -26059 -10142 -1841 26074 61396 51973 35355 -15634 -61641 -60842
4590 -60842 -49488 -31348 -24600 -16066 -9529 21691 45069 40636 -5288 -16603 -40071 -17437 -18639
4577 -18639 -48109 -44193 -69156 -60018 -59807 -59353 -18564 3534 -23901 -29854 -23902 -16017 1180 649
4563 649 -9516 7386 19646 18222 34649 55219 52281 44464 42077 25171 -9193 -9136 -7595 -12032
4549 -12032 -7248 -20252 -2862 370 -24809 -22788 -8929 -16183 -29884 -13561 24686 33278 45162
4536 45162 36257 9904 -6475 -7796 -10764 -7617 7382 16164 10122 4644 5856 5237 14816 18974
4522 18974 -15526 -32313 -43562 -12563 25829 39531 45938 22569 7480 14550 34854 41397
4510 41397 18300 1415 -20761 6850 28708 15467 20932 24394 13666 13925 9660 -1041 -1300
4497 -1300 -15675 6801 23342 26962 19549 5353 -16478 -21014 -33570 -18202 -12247 -37236 -58618
4484 -58618 -36876 -38674 -27673 1895 -2843 3881 18312 28282 -775 7692 6420 -17953 -41715
4471 -41715 -36858 -11255 26800 67181 39886 5664 -4463 12605 35611 18302 2833 8398
4459 8398 -23079 -29049 -23240 -18870 -34230 -56615 -45187 -36479 -16131 -9150 9114 4365 -13953
4446 -13953 -9114 -28972 -18617 -15631 -39965 -44679 -15995 -13331 -12788 -33850 -31820 -20884 -14689
4433 -14689 7298 28061 14617 -1608 -22517 -25673 -11145 -21809 -8200 8623 -10340 395
4421 395 7555 -12506 -51065 -38335 14523 50988 21530 -7002 -11752 27381 32241 -13516 -33693
4408 -33693 -4583 20429 31499 21852 -33846 -59502 -46570 -51334 -52306 -39906 -13170 13233 13509
4395 13509 -12340 -17364 1217 12811 9395 -5228 -19800 -29208 -22007 14571 7910 12836 19566
4382 19566 5832 36337 43093 54087 46622 43370 37321 38677 29838 34014 14791 25744 29519
4369 29519 44132 54982 33034 29302 19435 6618 -4516 -26121 -45299 -5270 -3692 -28659
4357 -28659 -31712 -21325 14186 17869 47185 48027 7217 -21454 -12416 -3811 440 25423 18132
4344 18132 12527 32748 34723 7651 -23045 -6887 20708 -11964 -57519 -54084 -25724 -15318
4332 -15318 -704 -18348 -43478 -57828 -38638 -45698 -57429 -59292 -53366 -54070 -31087 -41705 -40772
4319 -40772 -40346 -40877 -51572 -21076 -9693 -1359 -15520 -22956 -17848 847 23016 6009 -38676
4306 -38676 -61568 -80678 -74836 -79496 -92417 -67766 -39761 -25441 -30566 -16834 12780 41945
4294 41945 -3044 -39422 -27036 322 33335 19758 8146 -2954 1892 -11965 -2399 6156
4282 6156 1850 -18039 -9985 3258 10323 1093 -3071 -5402 1512 26334 32898 34548 25086 15368
4268 15368 24971 24770 29074 26422 -309 -1986 16053 9487 5797 -5641 -12792 1931 204 4425
4254 4425 40140 53516 44511 39534 31065 9206 -48 -27775 -34279 4856 19495 31834 36334
4241 36334 42576 63657 22757 19930 26723 1982 -23597 -29996 -28649 -13994 -19548 -42489 -61633
4228 -61633 -67050 -55172 -37944 -20160 -1525 10027 -3139 -8240 -11864 -5644 -11487 -28448 -14819
4215 -14819 -11531 694 20517 16723 -5023 -23801 11335 14286 -4797 -32717 -52205 -39450
4203 -39450 -29980 -20259 -11282 15287 21950 12082 29645 45641 32045 27457 8323 26245 36739
4190 36739 37017 47358 23284 -21172 -32782 -30925 -3522 8559 -9169 -27431 -25404 -10493 -6818
4177 -6818 13207 24815 308 -16985 -28312 15426 38384 32718 27926 11239 -31047 -30078 -8389
4164 -8389 -22160 360 -2995 661 329 -5352 1126 10734 15422 9823 22362 32388 43077 7297
4150 7297 -10102 -8374 -15731 8954 12371 -4710 -23265 -51344 -37551 -19716 -3823 -1818 -9218
4137 -9218 11741 38514 37354 5147 2274 11734 -6046 -4917 21708 42537 25018 -13662 -39517
4124 -39517 -5231 7595 30001 35853 4546 -22 -2369 -24710 -65545 -31987 -15339 -8484 -2245
4111 -2245 12343 15323 -4352 -34380 -62019 -19612 -3119 10410 -3645 -214 -5583 -6437 -20206
4098 -20206 16264 60042 63185 36986 10835 -5054 14244 25605 5619 -1213 7277 3050 9238
4085 9238 23054 37661 28304 -508 -44460 -46478 -25081 -18786 -19077 -4587 -26849 -12989 -22238
4072 -22238 -26787 -20037 7871 -23166 -4993 1403 -20242 -10273 27618 30616 2783 -48108 -66837
4059 -66837 -34842 -18538 -21535 -40980 -40562 -17147 9695 -11709 -27598 -24180 -9915 -22479 -38499
4046 -38499 -35955 -25762 -25488 -3486 2237 -4064 -11742 -8522 -7817 -15466 -21333 -9867 -5912 -2148
4032 -2148 -47055 -43321 -16720 -8823 -9027 -12050 -47629 -53492 -32334 -36130 -14752 -8726 2835 -4535
4018 -4535 74 31620 15387 -3133 26809 44661 27713 -38841 -64359 -51145 -3654 15092
4006 15092 23874 11782 -15076 -20878 -15298 -21296 -7973 17377 -160 -2223 19294 11312 -3897
3993 -3897 -6940 -5746 4603 10341 8176 1355 -11619 4512 20632 39329 41655 29170 21430
3980 21430 10877 7704 9429 -7284 12832 37543 45771 35271 26941 18120 18572 3551 21682
3967 21682 22493 8077 4401 -17465 -27136 -15821 -37101 -43825 -35278 -22331 -13987 16758 4750
3954 4750 -27242 -13974 -5051 -37911 -62371 -67351 -36996 402 17404 31743 32011 -16234 -34232
3941 -34232 -25321 -7613 32188 37635 46520 33625 49265 71855 60098 24938 2921 13912
3929 13912 17310 22256 40979 27903 23630 22525 7432 -7665 9381 -406 -7752 -5371 -18604
3916 -18604 -1428 34716 15389 559 -2982 -14256 -23136 -38860 -26531 1823 2421 -6004 6703
3903 6703 18543 9891 -3025 -18727 -15027 -19929 -16774 -12731 -23761 -13084 -53993 -61513 -58051
3890 -58051 -43693 -21668 -14165 6990 27868 52866 27913 -11400 -56317 -80394 -66311 -76601
3878 -76601 -57083 -35056 -4808 -6824 -12769 -21673 -18891 26939 71700 68196 24968 19570 45662
3865 45662 67367 98904 97044 56364 47317 23927 -10454 -8968 -31505 -45921 7453 21906
3853 21906 33677 25213 14905 14672 -12832 -44269 -41994 -11849 -721 -5808 2480 -8616 -12266
3840 -12266 -27146 -11660 -4962 -50162 -61050 -51471 -39070 -18798 -22546 -26931 -20768 -23471 -31789
3827 -31789 -44101 -34706 -14850 -27354 -26816 -4594 848 -10293 -18443 -26666 -30276 -2317 -11846
3814 -11846 -23269 -6984 -6672 -23520 -22941 -12841 8030 18470 8147 11942 30672 14958 -16731
3801 -16731 -34202 -17926 20587 1702 -3337 -2603 -6297 -22135 -36076 -30623 -45173 -38735 -2722
3788 -2722 4362 2907 -11297 -12624 -7915 -13126 -8075 -10550 6079 55721 51393 -16869 -30974 -22534
3774 -22534 -23659 -8257 -5011 -2444 -2981 -25059 -17429 -32471 -45543 -56074 -24447 -49 16084
3761 16084 20361 15435 14459 14876 32167 23374 21641 1736 -14465 -20618 -5455 10025 21015 23993
3747 23993 16005 16382 27820 12856 -38725 -21767 -7343 17326 14350 8712 60359 68518 33276
3734 33276 15240 21112 12677 -3450 16789 15719 13464 -2342 8114 2105 -12444 -25444 -33148
3721 -33148 -43916 -6265 7858 12131 11030 -1748 1904 -374 -9017 1070 -1926 7328 16922
3708 16922 25067 55076 76264 60648 311 -10543 1198 -12594 -17313 -23333 -7122 3799
3696 3799 -9757 -29730 -20413 -6049 -30235 -15472 -2901 -1619 -3962 -18177 6254 25656 34096
3683 34096 30045 68647 70736 57455 56884 52759 46805 24545 -6537 -19452 -4098 27648 15126
3670 15126 -4754 -7718 3163 8593 4522 15459 -25138 -71410 -63651 -41265 -21870 -15554 -9479
3657 -9479 7030 27606 39555 57868 72952 59304 46947 56114 37574 9300 5810 9118 48100
3644 48100 67089 52409 4387 -12141 -28774 -26870 -21608 -25296 -20117 -22109 534 1989 2815
3631 2815 18644 16688 10662 -12964 -61201 -83310 -66379 -8682 28144 24680 12920 -23141 -22518
3618 -22518 -40861 -22166 199 -14373 -33160 -12489 23163 35539 31161 -7217 -4596 9202
3606 9202 5770 -19396 -23181 7463 22055 22480 -2039 -42915 -41569 -49134 -56886 -49963 -41054 -45236
3592 -45236 -40176 -6013 -2644 -13661 -38990 -65460 -53661 -39887 -27117 -28395 -34617 -47990 -61435
3579 -61435 -38345 -18233 -7869 8500 13293 12956 22915 34076 26282 36107 12214 20006 54103
3566 54103 63084 46408 41855 39538 21566 3797 1763 19197 -3100 -25125 -10968 15157 33485
3553 33485 29978 37624 27011 7084 16472 -7908 -18960 -13627 -14023 -23390 13075 41106 32037
3540 32037 19652 13501 7355 4611 16931 26578 21318 5192 -39888 -45304 -21692 -21500 -19804 -16182
3526 -16182 -14623 1345 -11888 -9365 -8887 -23050 -49853 -42312 -19906 4944 14263 4868 -1739
3513 -1739 7149 6478 814 39535 38193 27242 12928 5077 15479 21462 -5513 -18146 5693
3500 5693 26843 28318 7453 11793 4520 -31501 -44870 -39790 -31504 -17669 -29985 -33761 10651
3487 10651 38972 47285 10978 -19559 -17323 -14202 -41577 -22357 -243 -19681 -31009 -24054 -28250
3474 -28250 -7046 -10089 -5302 5140 -25075 -39352 -39843 -48672 -38785 -2101 7573 -3675 -7331
3461 -7331 6879 -11017 -25321 -31374 -11713 39607 47105 48421 44917 27748 14304 55482 61673
3448 61673 41864 24850 2176 -31462 -47296 -24820 -7682 -8656 -10893 18751 30242 25816 29
3435 29 -13680 -7402 -13811 9635 21455 5658 16892 32017 7181 -30323 -54380 -53323 -51965
3422 -51965 -49839 -25155 -33803 -46513 -20197 -602 22401 29260 500 25381 -7939 -15659 -22769
3409 -22769 -34058 -26908 -47041 -30891 6892 -29272 -65359 -56687 -14472 -22672 -37072 -41971 -13952
3396 -13952 16879 19419 23039 34854 23638 5659 21922 38704 33704 12326 -8298 2779
3384 2779 822 15810 11736 8080 -21504 -55202 -44546 -60206 -84897 -89355 -61071 -41634 -15096
3371 -15096 6397 -2031 -20202 -43585 -16940 3620 -22137 -59241 -47438 -38440 -48629 -22584
3359 -22584 -24926 -22879 -23665 -50100 -72009 -65815 -31820 -33662 -25212 -13765 -12194 -30129 -14991
3346 -14991 -12727 -34467 -68994 -38726 -1909 1812 8155 16195 32575 25934 7442 -19048 -15927
3333 -15927 8766 7450 2471 36532 34988 6077 -16444 -40411 -42812 -24988 -22625 -18521 -11748
3320 -11748 -8383 -15661 -6687 12947 -7944 2294 6031 14179 21613 23821 5129 7170 13092 40753
3306 40753 60459 41442 32585 33523 38235 22366 8588 19799 -6828 -38951 -29333 3459 8515
3293 8515 -19766 -26735 -8928 -14887 -20487 -25964 -17389 -1821 1428 1032 19457 25700 -2003 -14424
3279 -14424 -19676 -20124 -33626 -6977 471 -18451 -20576 5634 17965 4392 -18591 -23560 -7966
3266 -7966 34917 42481 24530 19994 42081 65036 63009 71488 51684 31283 19332 29347 16348
3253 16348 -11638 -62824 -63723 -44178 -38251 -41650 -38089 -35863 -49497 -29613 26812 57213 22922
3240 22922 17879 15570 -7103 -20438 -25367 -37408 -25903 -20404 -41206 -72637 -43148 -9258 28375
3227 28375 33336 41813 5148 -27801 -44742 -30054 -27797 -10530 -24239 -61798 -79758 -46039
3215 -46039 -5024 -1324 -26936 -24090 995 999 23121 9712 8058 20946 -10480 6368 24281
3202 24281 7145 23644 13548 2408 -405 -241 7508 36354 23808 15174 19770 11179 -18173
3189 -18173 -25470 -26395 -17904 19067 47779 37044 24038 34630 37950 17669 -29618 -29663 -20967 -26365
3175 -26365 -20163 16492 20255 15742 11244 27702 41443 25712 14907 -14791 -24776 -17064 -43760
3162 -43760 -5375 28564 10544 15694 6333 5554 27067 44961 25846 -9498 -14848 -31870 -31343
3149 -31343 -12432 24433 10686 3624 -3322 -27046 -41161 -18932 -15673 -510 15767 9944 22910
3136 22910 28018 51296 61050 45886 61151 52286 29276 1760 3620 9359 16149 8140 12325
3123 12325 34898 55828 50691 29452 32763 33180 9741 -18234 -22299 -3104 7117 6297 -5509
3110 -5509 -28669 -19502 -23457 -44756 -55709 -39292 -32440 -41389 -38097 -23453 -35363 -13329 -34236
3097 -34236 -13208 9694 -4230 3062 1440 -25759 -24509 -7777 18405 17460 -14837 -9432 28435
3084 28435 14864 -13607 -27020 -22501 -31875 -32457 -2982 12262 2887 5737 -10517 -3333 -19688
3071 -19688 -42433 -28098 -20710 -9431 -3835 -19773 -10448 -9230 4771 12571 20148 8571 -13699
3058 -13699 6126 45971 45634 45246 40535 14080 -16494 -28469 4100 26868 32482 25800 13906
3045 13906 21787 36348 23961 14994 2040 25434 48280 51563 46532 38940 47623 27066 14247
3032 14247 9554 7098 40290 59210 48231 15729 2554 -6130 -5059 -2900 -2967 11138 8980 26730
3018 26730 21297 14372 18869 28278 23819 -7400 -12818 -739 5604 -31153 -12366 -3797 1527 -989
3004 -989 -7370 -6144 12816 8474 -2208 -18791 -27289 -2792 -11654 -10336 -32667 -45279 -27333
2991 -27333 -1294 15771 15372 16307 -58 13956 13990 37157 39539 25417 16887 6179 16808 48027
2977 48027 45092 46625 39683 768 13547 57881 32307 27417 24449 23790 -8597 -4245 20319
2964 20319 26621 21011 5438 6152 5268 12903 15377 -13994 -22206 -6610 17139 -15840 -18821 -8833
2950 -8833 12571 16681 -1929 -15139 11562 28464 23487 22167 23131 -16028 -20217 13130 38713
2937 38713 42907 32748 -5134 -14645 -7660 -642 3092 22816 9194 -22718 -32970 -35779 -7088
2924 -7088 20266 1070 -17848 -16949 981 28935 49539 36187 59508 61268 38613 28849 13631
2911 13631 14874 -12617 -12680 -22562 3612 24874 52446 31642 26506 7221 -13240 2521 -10137
2898 -10137 -4011 -6538 -7709 -3562 -13264 -20587 -10261 8944 14225 14484 31010 30520 35807 66013
2884 66013 66723 21944 14575 -4075 -18393 -9583 -680 3772 -15174 -13880 -2781 10786 24716
2871 24716 49919 4379 -31625 -32186 -38902 -14035 4859 -1607 -13218 959 27406 14043 -5396
2858 -5396 29 10874 22142 32848 24336 15593 -7098 9007 49764 58611 20913 17153 467
2845 467 -10700 -4908 -7867 -18540 -28163 -9910 3501 -2963 -10698 17930 20751 35925 49369
2832 49369 7575 5877 20175 19826 9242 22720 25391 2438 7776 -8386 -17792 3291 11615
2819 11615 50535 73293 52663 15889 9127 494 -2525 -13752 -11931 -26543 -27222 -17145 -16142
2806 -16142 -21314 -5066 -23139 -44561 -33215 -47025 -52042 -36467 -32051 -6317 -17147 -36569
2794 -36569 -19286 -19070 -2057 24681 9343 -12208 -21549 -21581 -22317 -5799 -1474 -10266 8711 -9940
2780 -9940 -29062 -7079 -20307 -11678 -1901 14268 5219 -6326 -4442 -1435 11570 22781 33759
2767 33759 37745 -4188 -22515 -22692 21049 46676 38682 24541 -11849 3974 17999 20720 64403
2754 64403 64222 66751 51279 27976 11940 -2420 3781 20835 20219 5214 24053 38476 20651
2741 20651 18572 27812 61943 49453 3305 27413 34393 13898 5329 -18512 -11379 -12884 7194
2728 7194 7106 -1348 -11378 -21194 -30490 -42681 -33280 -18652 -8680 -5766 -7873 -7682 -1002 3249 11687
2713 11687 45185 48981 27449 29597 19893 6203 16654 16414 15290 23542 -455 -12509 21715
2700 21715 74836 60296 20473 -30035 -51199 -38046 1897 10852 -11785 -6160 -9705 12116
2688 12116 14565 12529 14579 31240 25992 18501 30557 30463 38613 11138 19170 21844 10811 -1523
2674 -1523 -31172 -22172 4319 9729 1073 8148 18163 15668 -115 18579 37460 21565 18525
2661 18525 16046 17314 6100 18734 16092 17879 23635 20911 10796 -16679 -44354 -30682 -26249
2648 -26249 -17043 -19613 -36966 -35721 -36980 -49020 -45016 -45606 -51896 -37889 6984 41022 44318 24528
2634 24528 -28770 -59561 -47963 -18969 14350 14687 10091 5706 -3836 13246 4377 10709 9862 -12104
2620 -12104 -20240 -16618 53 -342 -13230 -18319 -11668 -6845 7356 9117 -6413 -10768 -45222 -24778
2606 -24778 14389 6570 -11332 -32849 -19411 -3467 -23061 -40457 -53362 -49670 -51400 -56192 -21889
2593 -21889 6483 -7905 -17965 -18181 -42565 -47126 -60558 -53974 -20577 -23308 -41654 -54635 -44861
2580 -44861 -15892 -22088 -27013 -33581 -17696 8066 40188 36197 12827 8092 3136 10190 6258
2567 6258 643 -332 -7682 -14791 -29542 -33907 -26439 -25318 7430 9755 1401 4431 18292 13187
2553 13187 7689 -13988 448 11123 920 4262 10643 16317 -1249 9255 28995 19920 14489
2540 14489 18104 32586 -4757 -9561 13782 21826 29279 6230 -3019 -3830 -26882 -14106 4158
2527 4158 -37378 -36622 -4291 -4673 6391 3543 -10864 -16824 14402 15950 20861 16524 -2182 -56817
2513 -56817 -45694 -50243 -23989 1497 22205 8136 12377 23849 26643 19621 18313 32898 32655
2500 32655 29155 30551 31120 10395 -7269 4339 3345 -17680 -7273 8514 26995 17654 23642
2487 23642 -6034 -30392 -34670 -38938 -30853 646 14885 433 -14779 -41509 -54021 -47815 -19996
2474 -19996 -19360 -29593 -20137 -14808 6159 -7421 1746 2045 -5256 -917 -3193 2876 -8541 -5610
2460 -5610 3133 -22640 -14517 -6117 -341 5757 -9968 691 17307 5370 -23633 -31947 -32547 -16914
2446 -16914 22060 33937 29377 4045 8394 9299 21042 -16707 -68753 -68775 -73481 -37641 -10013
2433 -10013 5328 7017 25031 20374 -17160 -14685 2775 5794 9145 -3882 9188 18211 7111
2420 7111 -8006 17274 27825 43614 31579 43042 80581 88330 65660 51522 55873 31794
2408 31794 25712 36879 41115 59685 44002 38191 31953 8986 -2593 -1664 -29900 -44805 -27875
2395 -27875 -5395 -21500 -11265 2892 2797 -10886 -20196 -3468 9172 27859 19300 16884 1955
2382 1955 -12032 -744 -3177 31513 37186 15009 -5196 -22552 -34516 -7879 6260 17129
2370 17129 28328 -406 -36906 -1732 12764 22659 15202 -1572 9201 32568 29200 19328 46819
2357 46819 44276 23858 7910 9409 38461 27176 7946 9389 41874 50554 44696 44059 49671
2344 49671 41313 34804 28639 37190 43493 41865 14882 -1752 -13133 -22915 -52899 -33973 2277
2331 2277 23262 26402 18247 -10073 12630 15831 18747 49412 48070 47225 44420 28744 40177 58684
2317 58684 35658 -1591 -29445 -28723 9554 24731 6118 -15272 -11482 35999 20463 4204
2305 4204 13166 2451 -64 -11541 -19416 3832 34911 42220 68092 44243 43732 47932 32325
2292 32325 15875 8726 32733 8923 -5872 -14744 1670 -9218 -13065 -26440 -19248 9508 1905
2279 1905 18583 13597 -8109 -17991 1189 -20805 -36159 -6412 27860 31078 10603 -6924 -6938
2266 -6938 -3783 4360 35814 39440 41035 31219 8508 -14682 -17283 2635 20554 16603 16216 36078
2252 36078 16902 -1109 -23043 -14101 331 18018 -9165 -21692 758 -15587 -24433 -509
2240 -509 -15577 -13827 -16544 -41246 -60375 -27694 1950 26080 37005 -7275 -56323 -17837 26513
2227 26513 46488 12175 13220 24885 8401 6107 -4441 7503 35733 44102 34887 8572 -29598
2214 -29598 -29084 -45418 -48619 -43907 -15984 17274 49468 58588 30272 6984 25494 39333 12114
2201 12114 30000 48419 22223 25175 21297 -41489 -77741 -49568 11412 56660 51128 33417
2189 33417 22545 17203 540 -5711 -58127 -64163 -26674 929 1631 7753 -9692 -5671 9310
2176 9310 -23494 -42605 -10434 -11129 -28452 -22547 -19103 -30453 -23789 14576 15094 -6226 -2990 -13765
2162 -13765 -29568 -8895 3611 -9526 5691 7794 3308 -3511 -16469 -23710 -30088 -18533 -9937
2149 -9937 -16132 -18699 -48485 -41102 13584 22737 14399 20905 -5197 -23261 1707 15929 4910
2136 4910 11750 5169 8789 34319 54072 29691 24094 33452 29728 20366 2913 -5564 -778 -22392
2122 -22392 -31993 -20136 16492 14967 359 2629 -3166 632 -166 -2961 -14240 -30141 -43129
2109 -43129 -18556 -8153 4684 -13609 -10001 -11860 -54094 -55308 -13739 -8441 -6039 -21562 -1225
2096 -1225 26289 25389 6398 14794 28717 1728 -32683 -10595 -41908 -14070 16408 -5671 -15444
2083 -15444 -33005 -53510 -46017 -35343 -13576 3798 14012 22875 52667 57812 36538 23377
2071 23377 30863 14739 -20189 -24690 -2036 4385 -4266 -13148 1030 -15922 -25766 -21800 1889
2058 1889 9524 -19202 -18942 -14169 12333 -11070 -13868 -8298 4218 21544 23466 44330 61573
2045 61573 72304 41837 5727 -5339 948 4617 28851 6081 9661 55385 70212 55285
2033 55285 39909 36906 59949 62183 38552 28685 -5816 -1309 11302 -5654 10118 5717 5668
2020 5668 4836 22217 33434 21685 2542 8836 14423 8246 8197 14750 6673 4625 31469 4380
2006 4380 4011 6508 30988 37219 16943 -3370 -3904 -9034 11646 15135 25356 30089 -369 -2632
1992 -2632 -14006 -4063 -16416 -32820 -16299 11523 36896 37497 20818 -4335 -26154 -39801 -31478
1979 -31478 -7772 -1441 -20351 -29967 -36403 -6733 9290 4119 -20995 -66052 -78134 -48939 -29069
1966 -29069 -13932 -20795 7240 18926 5379 6028 3834 10372 919 838 -26321 -34959 -27482 -14741
1952 -14741 3611 618 316 9051 -7092 -23842 -25055 -80 -2304 -11925 -21624 -35062 -22500
1939 -22500 5874 -11947 -25434 -36299 -28663 -16332 21988 18017 18433 17700 21933 19175 -4889
1926 -4889 -34050 -18074 676 19725 41313 57879 29268 3974 6851 2783 5184 -9203 -27965
1913 -27965 -10430 -1927 -4517 -12281 -20235 -10405 -4413 14729 2385 4587 11033 19323 18849 9213
1899 9213 -3812 4358 -6341 -1528 14080 23378 36017 58498 61200 34478 -6596 -6454 -14177
1886 -14177 -26371 -31064 -38539 -48580 1245 27321 24886 19708 -20199 -67144 -43937 -26710 15798
1873 15798 39941 2052 -21715 -1794 22084 38092 43005 31082 25096 16185 9757 -5171 -18570
1860 -18570 35042 63878 50734 24246 204 -26385 -19022 -1863 20639 42380 21383 20904
1848 20904 39253 38026 39816 31523 -4924 -51842 -38347 -34088 -14731 -31056 -48693 -34200 -16022
1835 -16022 -3988 -2549 -8791 -378 24710 30076 12430 643 -32418 -24496 35712 59813 64295
1822 64295 20670 13730 23672 25590 8963 -604 1058 6160 13755 28534 35071 832 -24050
1809 -24050 -25698 21654 59288 36539 31413 9687 27438 33715 16607 -12395 -10889 -32385 -56564
1796 -56564 -41930 -17368 -9746 -26401 -48449 -45546 -34995 -15311 9029 11792 -16279 -11037 1952
1783 1952 -21658 -18188 34254 34396 11290 27040 30413 -1719 8812 2742 -7974 -2715 -8727
1770 -8727 -4994 -237 13132 -13625 -35168 -14370 -10361 2794 23630 37049 54831 51784 51303
1757 51303 16742 -2804 -14679 -2955 -1625 -10585 -26592 -15298 -517 22263 24064 -2018
1745 -2018 -31872 -4082 15439 17140 31151 22120 16539 23675 8812 -10598 -4023 -7649 8996
1732 8996 24657 33348 39292 24663 44644 24406 -16050 -38201 -41048 -1921 -12517 -12151 716
1719 716 -14341 -4685 708 15060 44790 21420 -27098 -39102 -48337 -36139 -22462 -11792 -14267
1706 -14267 -2407 21792 36728 67019 80017 62662 36604 49518 57220 26583 13360 18752
1694 18752 17900 34043 33539 31631 38668 1170 -5497 3816 25762 56600 59006 44529 13343 2857
1680 2857 -10320 -26886 -36647 -21327 7889 28134 35585 18120 2431 22944 25953 -22629 -57225
1667 -57225 -25997 3222 13419 21313 48237 42580 32109 10969 16644 10726 -29510 -53680 -26911
1654 -26911 6328 625 -13516 -3522 -17338 -9919 661 -16466 -24561 -345 10117 21162 26466
1641 26466 5652 -18630 -24733 -8277 15006 16186 20924 36115 39554 13766 -17909 -33557 -12712
1628 -12712 -10891 -1161 8342 12396 6938 12819 -20304 -37710 -55118 -55680 -52976 -7103 9357 19190
1614 19190 62144 20907 4729 -10643 -22616 18512 58990 89394 66842 -3605 -15822 -10645
1602 -10645 -31590 -49967 -38530 -16314 -22495 -4153 31202 28721 44763 52046 50391 34901 4478
1589 4478 -16669 -5409 13749 41086 43360 29652 15381 29120 43140 41532 -834 -35959
1577 -35959 -31383 -14533 4978 -12803 -30963 -9772 42418 67878 52706 17878 23948 19139
1565 19139 12238 18599 74443 85862 70062 31902 42436 50087 48139 52361 47568 37884 8513
1552 8513 15058 15999 -8197 -22863 -17210 -18646 13421 32657 37593 18023 17010 2597 -2905 -21549
1538 -21549 -43794 -22077 -3736 4122 8046 12150 17556 24574 8236 -3005 174 17125 40552
1525 40552 31262 4391 7116 11908 -1736 -10687 -26577 -8200 25325 36656 15083 -4658 -14116
1512 -14116 -33651 -11717 -9643 11201 21082 26748 43428 18208 -2061 17381 39691 15641
1500 15641 -15983 1324 20968 28386 24151 36756 35860 19052 -3329 -20220 -30662 1292 17438
1487 17438 2053 10330 44162 63275 32588 7072 5052 -7255 -25414 -24710 -10082 -9735 3905
1474 3905 13002 10155 11074 14518 -15947 -13398 4374 7152 -14544 -28560 -45395 -18457 25433
1461 25433 14412 5068 8651 -13926 -43566 -57763 -19784 37398 70828 47214 17667 23753
1449 23753 14022 28849 42697 26738 -11081 -29848 -19886 -15909 -18428 -14882 -1112 -13734 -24397
1436 -24397 -15892 16600 39797 43151 39228 38171 16591 17682 32183 51462 63607 59245 41437
1423 41437 33427 10328 36444 51037 48547 35240 -15305 -16906 -12194 8606 5942 19825 34740
1410 34740 41572 24012 36173 33545 5660 19397 40540 41755 2629 12890 690 -30466
1398 -30466 -35396 24843 31373 8588 6339 30638 24974 30712 46641 25372 42275 43192 39870
1385 39870 27161 16546 30732 24308 36102 30485 22499 22862 -2920 -13977 -26579 -58511 -83959
1372 -83959 -49080 -8104 2900 2969 -7431 -1054 257 -6734 -11671 -2871 -3724 -3241 -28866 -23128
1358 -23128 -1188 -5446 11117 -4495 14305 11514 -6406 -32399 -42186 -42697 -32339 -7019 2500
1345 2500 3730 -11528 -29614 -23230 -18512 -14028 -21033 -36269 -38378 -20956 17867 31137 20095
1332 20095 28907 5973 -38347 -58642 -55353 -31977 -17042 -11822 -14044 -9698 -27310 -11685 121
1319 121 -22760 -23628 -22071 -22644 -16088 -26132 -10197 -18232 -17675 -8614 -27972 -27638 -5735 -24762 -50885
1304 -50885 -62972 -41536 -7963 -11498 -7329 -22041 -7110 -2633 -26217 -25185 -12206 -50433 -55136
1291 -55136 -38553 -51544 -33139 -42206 -16891 5262 5748 -15018 882 23168 22567 17255 -17333
1278 -17333 -26686 -26896 -15950 23701 30877 24479 10959 11549 14007 33566 22179 13650 5202 -11388
1264 -11388 -35918 -44017 -40485 -46675 -31112 -25218 -29479 -18280 -12286 -12206 -19528 -13297 -3635 -19115
1250 -19115 -7066 -2146 -5611 -6113 -27497 -20068 -9066 24501 34203 9206 6489 -5169 -12510
1237 -12510 3934 10004 -17839 1156 12741 12366 7177 36585 33103 6214 -14887 -11689 1077
1224 1077 -3258 3600 -8180 -14767 -5103 11663 -9880 -45664 -56566 -49254 -29185 18472 32547
1211 32547 24661 7510 -9628 3230 5973 11554 52415 29380 4732 -9299 -9104 4369 -8077
1198 -8077 4472 21090 27432 13077 24384 16793 13338 14289 -5488 -2566 -21101 -6561 35666
1185 35666 39595 35465 34620 39149 17381 19619 33081 42926 32963 56458 71087 48360 34281
1172 34281 15358 5260 -23523 -8921 2865 -8164 -30605 -34988 -33970 -23839 -16343 -4470
1160 -4470 -50762 -24914 16 -938 -3397 -3851 6774 19885 43420 19741 1705 12984 39300
1147 39300 41014 44103 26200 19783 4928 -15829 -42625 -35410 1826 24686 51612 79772 66591
1134 66591 89491 86649 64614 39830 -15188 -30697 -34264 -24937 -12819 -89 -7849 10607 19204
1121 19204 27773 11355 -17891 -17636 -36924 -44834 -37456 -31773 -35052 -2299 20186 35840 10327
1108 10327 -20387 -58741 -60266 -47755 -30742 -22050 419 -128 8402 4902 14654 22243 43309
1095 43309 42788 39256 40017 56827 46686 41777 48948 49501 44588 39218 24887 -2276 -5419 15944
1081 15944 19114 28840 24813 60085 45196 48307 43696 41421 43272 9860 -21330 -32019 -26303
1068 -26303 -8110 -10388 -587 16148 -2326 -11753 -20014 9382 1403 33678 43830 895 -10961
1055 -10961 10683 10606 17388 -7846 -22502 -11279 -7679 5266 31730 3790 -5415 -17506 -22615
1042 -22615 -25855 6562 17843 -5865 7183 8136 3711 -12075 -9692 2120 7463 -17644 -36364
1029 -36364 -15326 -3064 19954 4688 12808 7704 -20 -9323 1632 17920 20906 5418 -14221
1016 -14221 -2173 -19555 -37499 -18775 -30832 -37407 -25405 974 6803 1630 -11691 -35308
1004 -35308 -28411 -30283 -38449 -61473 -45395 -44948 -65666 -48768 -3794 17144 31415 35624 19068
991 19068 15083 39635 19857 -27008 -27799 18209 3229 -11343 10451 7180 -17403 -23867 -22844
978 -22844 -5670 5992 13073 -5190 -26888 -26777 -12465 13268 18598 25793 38096 27883 -12696
965 -12696 -23511 -25264 -22605 -7335 -10012 16895 36239 17719 12235 663 4716 12671 -10168
952 -10168 -6381 -11388 27031 51256 29977 13752 4192 -2765 3682 2933 -16769 -6989 19129 15586
938 15586 8291 -8888 490 3258 -18960 14718 22062 -2739 14628 19778 9282 -16528 -26528
925 -26528 -8124 -16914 -22598 9806 30080 10744 -21629 -17278 11698 43354 57347 57431 26534
912 26534 18586 20967 17422 16800 14206 9691 7194 11533 12759 8628 2700 2042 24317 33565 22080
897 22080 3358 -2121 -2108 2232 8056 19157 33363 48897 54507 37034 -9820 -26788 -19933 -1187
883 -1187 25846 36336 35054 8902 -26 24122 2944 -21952 -19088 -481 25195 40121 26619
870 26619 -8565 -11275 3411 6305 -38772 -38794 -28645 -36890 -45900 -74577 -81248 -71616 -46026 -35119
856 -35119 -34116 -768 8985 4123 24405 27886 20516 16783 4850 -6074 -6278 -12736 -52154 -63458
842 -63458 -50427 -45611 -34596 -21143 -24894 -29793 -16211 -8464 -13595 20031 38292 38720 27496
829 27496 21870 -13652 -24931 -9858 -11572 -13252 -2406 12334 3933 2067 -11769 -18455 -9705
816 -9705 -19265 -21015 -14494 -22198 -4197 8002 -14658 -15384 -12631 -7254 -1844 -6937 -6581 -11381 -4258
801 -4258 2242 -3126 -21202 -12754 -12532 -17518 -11224 -21034 -26878 -39932 -9121 23708 34247 36984
787 36984 21086 5787 -2959 -29394 -34040 -6780 -5029 -12005 -19845 -17066 5314 38506 52146
774 52146 70650 52432 18103 -18753 -22269 -37874 -28022 -22064 -3074 6453 -5348 -28752 -40532
761 -40532 -36114 -38055 -11529 25909 -18677 -27786 -20195 -32129 -46628 -30412 -1962 6108 10963
748 10963 -8043 -31786 -26103 -25439 -28942 -31719 -22493 -10622 -31059 -58079 -41080 -14576 -4297
735 -4297 -12606 -3726 -2336 -2675 18312 25693 37232 49650 42683 55206 66044 13671 -28370 -31795
721 -31795 18222 25603 15145 849 -12720 -15832 -2476 22538 17428 -3104 -539 5754 29043
708 29043 7179 -28137 -33879 -9535 -13678 -8879 -19446 -14923 -18175 -25192 -32041 -41874 -43803 -26050
694 -26050 -7044 -25371 -18407 3339 -32276 -37355 -26235 438 16572 12208 -31880 -39000 -30551
681 -30551 -38151 -22648 -28982 -17743 5446 20952 245 -3158 9862 4272 17867 7357 -6557
668 -6557 -18298 -27114 -21959 -15425 -20831 -14054 21585 25192 -10583 -43468 -44679 -51722 -61294 -51568
654 -51568 -21220 -18367 -35908 -22523 -13451 -10282 -2924 -6294 15717 26824 28743 16840 -3634
641 -3634 -29406 -20832 -9323 163 26008 -1986 -7932 15738 3544 -10033 -15151 -10493 -23950
628 -23950 3830 35484 41435 26367 4987 25205 55783 66913 62306 21781 -24695 -17627 -5973
615 -5973 -16575 10316 10921 -9129 -2645 14854 18337 7247 10088 29143 32279 10481 -11212
602 -11212 -43728 -30909 -16096 -11629 -1810 -7040 -52780 -65070 -56259 -27705 -32055 -44095 -11859
589 -11859 -21155 -39161 -82280 -62769 -35960 -15931 6321 15870 9209 17916 21077 30758 2794
576 2794 4143 12772 8776 -15900 -1001 23575 4177 -6485 6786 21195 -3687 -7080 -6903
563 -6903 -2661 -17863 -31688 -32156 -13458 -20933 -28476 -34169 -29327 -15092 340 35916 29126 8446
549 8446 -16143 -43178 -66219 -46552 -35357 -8062 -13815 -39912 -13473 -20176 -27545 -42887 -34660
536 -34660 -53828 -56214 -68693 -48030 -18169 4961 18496 5911 -19131 -29097 -22633 -11298 5428
523 5428 -9214 -2323 877 -7261 31147 40414 29470 19475 5929 -14236 -10896 -7839 -16331 -9177
509 -9177 -9572 -10527 -5709 22305 27017 6016 -13109 -19167 -43670 -28136 -43783 -29707 -14368 -14729
495 -14729 -18066 -26825 -30956 -13500 -26499 -52626 -57702 -27875 -11163 -39553 -43518 -33174 1109
482 1109 -6161 13094 25814 9435 -24727 -36892 -46087 -55568 -44083 -6134 19131 -8649 -29754
469 -29754 -26763 -18111 -26635 -25137 -2182 5837 -23937 -18568 -9926 4417 -26083 -47102 -47529 -50315
455 -50315 -58634 -69513 -50225 -9756 3329 12309 12178 9255 11541 -4611 -9779 10194 5620 -7727
441 -7727 -17542 -16597 6149 -25486 -41076 -59273 -72266 -82066 -69371 -10108 11184 1239 -10223
428 -10223 -11819 -11069 -19606 -20403 -21591 545 19013 12951 -9021 2218 23423 30834 25021 13751
414 13751 27468 27585 27347 15295 -7316 18161 30178 15061 20474 6589 -11047 -21773 -3406
401 -3406 24746 -3192 -22063 -7026 23104 47339 29365 8015 3784 -1230 4773 6628 26821
388 26821 9614 325 -7794 -13147 1418 8690 -8534 -21284 -8034 -22149 -24924 -28202 -26638
375 -26638 -4597 -36326 -38298 2677 31358 34335 20581 13201 -15654 -37207 -43722 -36859 -12747
362 -12747 -36139 -39010 -20288 -28148 -27295 -2980 15125 24063 6895 -1305 3646 -4060 -5830 9542
348 9542 22034 -2903 -26580 -37077 -33930 -37478 -48019 -49384 -25020 -5300 -6235 -9957 -11575 -20276
334 -20276 -10326 -6443 3395 -2181 4548 6474 7390 -1173 1141 -1961 -21213 -9772 -17052 -21036 -7549
319 -7549 -28615 -43593 -29000 -27718 -19461 8056 9914 -7394 -25279 -32665 -43063 -34106 -44146
306 -44146 -43468 -31925 -19811 -40001 -24437 -6604 -27672 4792 13231 -4914 2007 -1719 -7172
293 -7172 -19978 -6788 -6637 -2890 -8562 -28592 1200 4277 -41967 -47334 -21653 -9357 -8365 24069
279 24069 44584 33422 19291 19849 21878 -13759 -46343 -42041 1800 12742 32046 25147 8477
266 8477 -2547 -8981 -5349 -14879 -20295 -32475 -10902 -9888 -19315 -38886 -12777 -1868 7629 -5104
252 -5104 -28317 -13934 -763 -23428 -37812 -2723 21070 14138 -3724 -38505 -29531 -38062 -64547
239 -64547 -55824 -35518 -48532 -48092 -26716 -21421 -7989 7539 -7076 -18222 -32262 -40549 -27071
226 -27071 -22042 -2521 4740 -4966 -8731 -2046 300 2783 -21183 -28674 -40248 -45082 -19636 3510
212 3510 36086 36910 14234 13077 8967 2102 -55 4296 -2959 1854 -44 -10222 -14704 -14264 -23287
197 -23287 -29122 -32674 -18707 -22218 -19912 -28539 -32533 -37689 -22132 3293 -9585 -22331 -46436
$$ [...]
##END NTUPLES=NMR SPECTRUM
##END=
