##TITLE=Analysis number 312970
Compound Code cc 31501
Book Reference 302/188
Project Code adrs
Chemist Name toml
##JCAMPDX= 6.0         $$ Bruker NMR JCAMP-DX V2.0
##DATA TYPE= NMR SPECTRUM
##DATA CLASS= NTUPLES
##ORIGIN= Bruker BioSpin GmbH
##OWNER= NMR
$$ XWIN-NMR		Version 3.5
$$ Mon Aug 22 12:10:56 2005 GMT Daylight Time (UT+1h)  MAYBRIDGE\NMR@NMR_250MHZ
##.OBSERVE FREQUENCY= 250.131544655141
##.OBSERVE NUCLEUS= ^1H
##.ACQUISITION MODE= SIMULTANEOUS (DQD)
##.ACQUISITION SCHEME= undefined
##.AVERAGES= 16
##.DIGITISER RES= 18
##SPECTROMETER/DATA SYSTEM= dpx250
##.PULSE SEQUENCE= zg30
##.SOLVENT NAME= DMSO
##.SHIFT REFERENCE= (INTERNAL, DMSO, 0, 16.522)
##AUDIT TRAIL= $$ (NUMBER, WHEN, WHO, WHERE, WHAT)
$$ ##TITLE= Audit trail, XWIN-NMR		Version 3.5
$$ ##JCAMPDX= 5.01
$$ ##ORIGIN= Bruker BioSpin GmbH
$$ ##OWNER= NMR
$$ C:\u/data/dgb/nmr/ADRS/8240/pdata/1/auditp.txt
$$ ##AUDIT TRAIL=  $$ (NUMBER, WHEN, WHO, WHERE, WHAT)
(   1,<2005-08-22 12:10:37.83 +100>,<MAYBRIDGE\NMR>,<NMR_250MHZ>,
      <created by zg, POWCHK disabled, PULCHK disabled
       configuration hash MD5:
       62 19 C7 07 E1 42 D1 B7 37 6C 3D D0 77 39 F9 E6
       data hash MD5: 64K
       19 B1 BF 1E 74 3F 19 A7 15 E7 BF 0D E5 1A 53 93>)
(   2,<2005-08-22 12:10:48.72 +100>,<MAYBRIDGE\NMR>,<NMR_250MHZ>,
      <Start of raw data processing
       ef LB = 0.3 FT_mod = 6 PKNL = 1 SI = 32K 
       data hash MD5: 32K
       3D 46 AE 78 E6 0E DF 96 FE 1E FB CE 85 DC AE BD>)
(   3,<2005-08-22 12:10:50.91 +100>,<MAYBRIDGE\NMR>,<NMR_250MHZ>,
      <apk 
       data hash MD5: 32K
       DA 4C 7A B0 41 49 65 0A 3D 27 56 F7 BF 12 2C 70>)
(   4,<2005-08-22 12:10:51.60 +100>,<MAYBRIDGE\NMR>,<NMR_250MHZ>,
      <abs ABSG = 5 
       data hash MD5: 32K
       D5 3D B8 34 0A D0 FF 08 DA C7 60 D9 6A 83 B1 02>)
$$ ##END=
$$ 
$$ hash MD5
$$ B8 26 DE DC BC FA FD 03 58 67 52 6A C5 C1 E2 29
##$RELAX= 
##$RELAX= 
##$RELAX= 
##$RELAX= 
##$RELAX= 
##$RELAX= 
##$RELAX= 
$$ Bruker specific parameters
$$ --------------------------
##$DU= <C:\u>
##$EXPNO= 8240
##$NAME= <ADRS>
##$PROCNO= 1
##$TYPE= <nmr>
##$USER= <dgb>
##$AMP= (0..31)
100 100 100 100 100 100 100 100 100 100 100 100 100 100 100 100 100 100 
100 100 100 100 100 100 100 100 100 100 100 100 100 100 
##$AQSEQ= 0
##$AQ_mod= 3
##$AUNM= <au_zg>
##$AUTOPOS= <8 >
##$BF1= 250.13
##$BF2= 250.13
##$BF3= 250.13
##$BF4= 250.13
##$BF5= 500.13
##$BF6= 500.13
##$BF7= 500.13
##$BF8= 500.13
##$BYTORDA= 1
##$CFDGTYP= 0
##$CFRGTYP= 5
##$CHEMSTR= <none>
##$CNST= (0..31)
1 1 145 1 1 1 1 1 1 1 1 1 1 1 1 1 1 1 1 1 1 1 1 1 1 1 1 1 1 1 1 1 
##$CPDPRG= <>
##$CPDPRG1= <>
##$CPDPRG2= <>
##$CPDPRG3= <>
##$CPDPRG4= <mlev>
##$CPDPRG5= <mlev>
##$CPDPRG6= <mlev>
##$CPDPRG7= <mlev>
##$CPDPRG8= <mlev>
##$CPDPRGB= <>
##$CPDPRGT= <>
##$D= (0..31)
0 1 0 0 0 0 0 0 0 0.06 0 0 0 0 0 0 0.0002 0 0 0 0 0 0 0 0 0 0 0 0 0 0 
0 
##$DATE= 1124709037
##$DBL= (0..7)
120 120 120 120 120 120 120 120 
##$DBP= (0..7)
150 150 150 150 150 150 150 150 
##$DBP07= 0
##$DBPNAM0= <>
##$DBPNAM1= <>
$$ [...]
##$SUBNAM7= <"">
##$SUBNAM8= <"">
##$SUBNAM9= <"">
##$SW= 20.6930455092707
##$SWIBOX= (0..15)
0 0 3 0 0 0 0 0 0 0 0 0 0 0 0 0 
##$SW_h= 5175.983436853
##$TD= 65536
##$TD0= 1
##$TE= 295.16
##$TE2= 300
##$TE3= 300
##$TEG= 300
##$TL= (0..7)
0 120 120 120 120 120 120 120 
##$TP= (0..7)
150 150 150 150 150 150 150 150 
##$TP07= 0
##$TPNAME0= <>
##$TPNAME1= <>
##$TPNAME2= <>
##$TPNAME3= <>
##$TPNAME4= <>
##$TPNAME5= <>
##$TPNAME6= <>
##$TPNAME7= <>
##$TPOAL= (0..7)
0.5 0.5 0.5 0.5 0.5 0.5 0.5 0.5 
##$TPOFFS= (0..7)
0 0 0 0 0 0 0 0 
##$TUNHIN= 0
##$TUNHOUT= 0
##$TUNXOUT= 0
##$USERA1= <user>
##$USERA2= <user>
##$USERA3= <user>
##$USERA4= <user>
##$USERA5= <user>
##$V9= 5
##$VALIST= <valist>
##$VCLIST= <CCCCCCCCCCCCCCC>
##$VD= 0
##$VDLIST= <DDDDDDDDDDDDDDD>
##$VPLIST= <PPPPPPPPPPPPPPP>
##$VTLIST= <TTTTTTTTTTTTTTT>
##$WBST= 1024
##$WBSW= 4
##$XGAIN= (0..3)
0 0 0 0 
##$XL= 0
##$YL= 0
##$YMAX_a= 284975
##$YMIN_a= -223877
##$ZGOPTNS= <>
##$ZL1= 120
##$ZL2= 120
##$ZL3= 120
##$ZL4= 120
##$ABSF1= 16.522
##$ABSF2= -4.171173
##$ABSG= 5
##$ABSL= 3
##$ALPHA= 0
##$AQORDER= 0
##$ASSFAC= 0
##$ASSFACI= 0
##$ASSFACX= 0
##$ASSWID= 0
##$AUNMP= <proc_1d>
##$AZFE= 0.1
##$AZFW= 0.1
##$BCFW= 0
##$BC_mod= 0
##$BYTORDP= 0
##$COROFFS= 0
##$CY= 12.5
##$DATMOD= 1
##$DC= 0
##$DFILT= <>
##$DTYPP= 0
##$F1P= 14.0000005364418
##$F2P= -0.99999901652339
##$FCOR= 0.5
##$FTSIZE= 32768
##$FT_mod= 6
##$GAMMA= 0
##$GB= 0
##$INTBC= 1
##$INTSCL= 1
##$ISEN= 128
##$LB= 0.3
##$LEV0= 0
##$LPBIN= 0
##$MAXI= 10000
##$MC2= 0
##$MEAN= 0
##$ME_mod= 0
##$MI= 0
##$NCOEF= 0
##$NC_proc= -5
##$NLEV= 6
##$NOISF1= 0
##$NOISF2= 0
##$NSP= 0
##$NTH_PI= 0
##$NZP= 0
##$OFFSET= 16.522
##$PC= 1
##$PHC0= -94.41587
##$PHC1= 22.4183
##$PH_mod= 1
##$PKNL= yes
##$PPARMOD= 0
##$PSCAL= 4
##$PSIGN= 0
##$REVERSE= no
##$SF= 250.13
##$SI= 32768
##$SIGF1= 0
##$SIGF2= 0
##$SINO= 400
##$SIOLD= 32768
##$SREGLST= <1H.DMSO>
##$SSB= 0
##$STSI= 32768
##$STSR= 0
##$SW_p= 5175.98343685301
##$SYMM= 0
##$S_DEV= 0
##$TDeff= 65536
##$TDoff= 0
##$TI= <Analysis number 999999
Compound Code 99
Book Reference 9
Project Code 9>
##$TILT= no
##$TM1= 0
##$TM2= 0
##$TOPLEV= 0
##$USERP1= <user>
##$USERP2= <user>
##$USERP3= <user>
##$USERP4= <user>
##$USERP5= <user>
##$WDW= 1
##$XDIM= 32768
##$YMAX_p= 460374792
##$YMIN_p= -769925
$$ End of Bruker specific parameters
$$ ---------------------------------
##NTUPLES= NMR SPECTRUM
##VAR_NAME=  FREQUENCY,     SPECTRUM/REAL,   SPECTRUM/IMAG
##SYMBOL=    X,             R,               I
##VAR_TYPE=  INDEPENDENT,   DEPENDENT,       DEPENDENT
##VAR_FORM=  AFFN,          ASDF,            ASDF
##VAR_DIM=   32768,         32768,           32768
##UNITS=     HZ,            ARBITRARY UNITS, ARBITRARY UNITS
##FACTOR=    0.157963299565203, 1,           1
##FIRST=     4132.6476996994, 0,             0
##LAST=      -1043.33573715361, 0,           0
##MIN=       -1043.33573715361, -769925,     0
##MAX=       4132.6476996994, 460374792,     0
$$ Real data points
##PAGE= N=1
##DATA TABLE= (X++(R..R)), XYDATA
$$ [...]
$$ plain form
24711 66511 -38512 -91635 -53183 -233351 -276676 -273865 -82574 1457 100551 161376 31004
24700 31004 17360 -70457 -111493 -114891 -66657 -37742 -115801 -314593 -410250 -339139 -239907 -135858
24688 -135858 -265569 -275825 -175056 -120431 -231727 -475221 -466828 -390611 -134271 34493
24678 34493 -145618 -260944 -331435 -165068 -49735 -201816 -325012 -438536 -264922 -184162
24668 -184162 -147348 -247965 -330942 -253625 -31403 37614 -129501 -165258 -210478 -298459 -265897
24657 -265897 -206448 -288566 -130017 -25064 -74989 -208674 -200509 -348780 -304661 -237233 -261332
24646 -261332 -303770 -236595 -263637 -182280 -30844 -30759 -119409 -211382 -253659 -217054 -176816 -242162
24634 -242162 -183771 -400286 -328667 -35724 77174 -83725 -227258 -310955 -320003 -362189 -343909
$$ packed form
24711F6511j05023n3123L8452j80168m3325K811J91291Q4031R9094O0825j30372
24700C1004j3644q7817m1036l398M8234K8915p8059j98792r5657P1111R9232J04049
24688a35858j29711j0256J00769N4625j11296k43494Q393P6217K56340J68764
24678C4493j80111j15326p0491J66367J15333j52081j23196j13524J73614Q0760
24668a84162L6814j00617q2977P7317K22222O9017j67115l5757m5220q7981L2562
24657b65897N9449q2118J58549J04953m9925j33685Q165j48271M4119O7428k4099
24646b61332m2438O7175k7042Q1357J51436Q5q8650r1973m2277L6605M0238o5346
24634b42162N8391k16515P1619K92943J12898j60899j43533q3697r048m2186J8280
$$ plain form
24623 -343909 -314203 -214573 -41539 92497 159138 117198 90482 38571 -17869 -23648 -64138
24612 -64138 -113585 -109065 28448 -115496 -168908 -132309 -113899 6021 -14866 -178601 -231380
24601 -231380 -271155 -57478 104802 -117143 -242720 -250210 -299147 -225317 -306268 -388533 -176835
24590 -176835 -31442 -106807 -55279 -43843 -13361 -1136 52397 -82011 -381973 -390253 -312880
24579 -312880 -263926 -329796 -204865 -110128 -72557 -46638 -36224 -60686 -163541 -89399 -54810
24568 -54810 9789 -93219 -270124 -412302 -458560 -425508 -293429 -132925 -31158 -16892
24558 -16892 3476 5834 -105354 -192111 -239799 -165110 -40105 -50348 172090 133246 -118839
24547 -118839 -60327 16080 -3812 -67436 -53505 -89543 -105225 -207933 -159559 -19358 14188
$$ packed form
24623c43909K9706R9630J73034J34036O6641m1940k6716n1911n6440n779m0490
24612f4138m9447M520J37513j43944n3412L6599J8410J19920k0887j63735n2779
24601b31380l9775K13677J62280k21945j25577p490m8937P3830q0951q2265K11698
24590a76835J45393p5365N1528J1436L0482J2225N3533j34408k99962q280P7373
24579c12880M8954o5870J24931R4737L7571K5919J0414k4462j02855P4142L4589
24568e4810O4599j03008j76905j42178m6258L3052J32079J60504J01767J4266
24558a6892K0368K358j11188q6757m7688P4689J25005j0243K22438l8844k52085
24547a18839N8512P6407j9892o3624J3931l6038j5682j02708M8374J40201L3546
$$ plain form
24536 14188 151804 161495 98720 16238 -82858 -123486 -168354 -272161 -317694 -255739 -270724
24525 -270724 -250350 -79460 -149794 -195260 -77138 -36917 15562 43184 -12972 10201 13098
24514 13098 -129743 -177755 -2497 -25449 52870 -25545 -122350 -86981 42548 71867 94910
24503 94910 7704 -80784 -95439 -281481 -331774 -196736 -170205 -270653 -84800 -3976 -13582
24492 -13582 86432 96187 116842 98831 -5272 -65411 -31457 204 -41986 120446 125155
24481 125155 79557 20509 -62774 -158730 -194008 -259505 -354137 -250256 -293956 -303118 -189007
24470 -189007 -128366 -68821 -84159 -13623 5164 152187 120749 136648 -29809 -177599 -203592
24459 -203592 -72458 48670 163711 -23456 -178382 -155645 -55813 -8934 1921 -91603
$$ packed form
24536A4188J37616R691o2775q2482r9096m0628m4868j03807m5533O1955j4985
24525b70724K0374J70890p0334m5466J18122M0221N2479K7622n6156K3173K897
24514A3098j42841m8012J75258k2952P8319p8415r6805L5369J29529K9319K3043
24503I4910q7206q8488j4655j86042n0293J35038K6531j00448J85853Q0824r606
24492a3582J00014R755K0655j8011j04103o0139L3954L1661m2190J62432M709
24481A25155m5598n9048q3283r5956l5278o5497r4632J03881m3700r162J14111
24470a89007O0641N9545j5338P0536J8787J47023l1438J5899j66457j47790k5993
24459b03592J31134J21128J15041j87167j54926K2737R9832M6879J0855r3524
$$ plain form
24449 -91603 -119364 -39632 -15744 14269 141581 118139 45877 46529 126564 6986 -131133
24438 -131133 -308432 -291223 -306198 -133910 -185802 -130542 -82577 -22646 8235 -155926 -251541
24427 -251541 -322221 -86481 49531 -55205 -356 -45607 -107558 -166795 -26151 68533 -6356
24416 -6356 -80126 -87593 -140195 -82523 -91532 -169036 -211564 -160978 -233807 -231513 -50396 -13027
24404 -13027 -186788 -227522 -193698 -201220 -108382 -35604 50825 21998 24436 54582 -42240 -177191
24392 -177191 -228122 -148644 -101316 -9024 -43681 -70348 -14561 -20174 -74584 -38196 -31057 -35151
24380 -35151 -67665 -34236 -191227 -256329 -116730 40935 203380 216755 25786 -185418
24370 -185418 -187159 -139779 -40927 -68713 -45419 -49056 -148999 -89088 58511 59839 -76397 -98849
$$ packed form
24449i1603k7761P9732K3888L0013J27312k3442p2262O52Q0035j19578j38119
24438a31133j77299J7209j4975J72288n1892N5260M7965N9931L0881j64161r5615
24427b51541p0680K35740J36012j04736N4849m5251o1951n9237J40644R4684p4889
24416f356p3770p467n2602N7672r009p7504m2528N0586p2829K294J81117L7369
24404a3027j73761m0734L3824p522R2838P2778Q6429k8827K438L0146r6822j34951
24392a77191n0931P9478M7328R2292l4657k6667N5787n613n4410L6388P139m094
24380c5151l2514L3429j56991o5102J39599J57665J62445J3375j90969k11204
24370a85418j741M7380R8852k7786K3294l637r9943N9911J47599J328j36236k2452
$$ plain form
24358 -98849 -98367 -33208 27123 88059 60167 45620 -128570 -231151 -224944 -59366 -75972 -64762
24346 -64762 -25195 88649 242990 420892 513231 443080 316518 228971 259138 382220 421252
24335 421252 343566 433997 327914 288283 128071 -61483 -58388 -17625 -135658 -69878 56234
24324 56234 -74528 -28011 118710 183492 267481 310961 376575 368424 378298 116626 -59897
24313 -59897 -213070 -1689 71126 94006 25240 -77540 -220844 -140931 -24023 -22120 -12388
24302 -12388 -1035 45876 -73482 -171993 -126943 -67853 -123917 -153231 -119923 54214 63740
24291 63740 32054 46373 -99378 -60124 -89240 -117885 -253090 -275969 -314590 -185401 -45912
24280 -45912 106378 72772 149482 265432 275790 379318 311901 172538 195333 84545 -181757
$$ packed form
24358i8849M82O5159O0331O0936k7892j4547j74190j02581O207J65578j6606J1210
24346f4762L9567J13844J54341J77902R2339p0151j26562q7547L0167J23082L9032
24335D21252p7686R0431j06083l9631j60212j89554L095M0763j18033O5780J26112
24324E6234j30762M6517J46721O4782Q3989M3480O5614q151R874k61672j76523
24313e9897j53173K11381P2815K2880o8766j02780j43304P9913J16908J903R732
24302a2388J1353M6911j19358r8511M5050N9090n6064k9314L3308J74137R526
24291F3740l1686J4319j45751L9254k9116k8645j35205k2879l8621J29189J39489
24280d5912J52290l3606P6710J15950J0358J03528o7417j39363K2795j10788k66302
$$ plain form
24269 -181757 -294275 -262970 -329141 -377916 -379539 -485522 -478784 -444382 -350875 -259284 -237843
24258 -237843 -196714 -223328 -283064 -208256 -161173 -59120 -4251 135311 197830 56066 -37947
24247 -37947 -216548 -171361 -186974 -181794 -319339 -236747 -239719 -214940 -244472 -305083 -186459
24236 -186459 -84037 -118307 -160836 -127499 -80517 -63368 52803 -29978 -88491 -44084 -67597
24225 -67597 -14177 31371 47862 51397 -7941 -78245 -44914 64663 154682 168698 138824 31745
24213 31745 49293 -123106 -135450 -186285 -241367 -174130 -255375 -444580 -396556 -355322 -266165
24202 -266165 -96449 -42162 6660 -68489 -231419 -108436 -18685 -59869 -15525 -174553 -337865
24191 -337865 -357152 -309473 -321659 -357577 -292242 -315859 -225009 -37831 -107427 -336047 -462173
$$ packed form
24269a81757j12518L1305o6171m8775j623j05983O738L4402R3507R1591K1441
24258b37843M1129k6614n9736P4808M7083J02053N4869J39562O2519j41764r4013
24247c7947j78601M5187j5613N180j37545Q2592k972K4779k9532o0611J18624
24236a86459J02422l4270m2529L3337M6982J7149J16171q2781n8513M4407k3513
24225f7597N3420M5548J6491L535n9338p0304L3331J09577R0019J4016k9874j07079
24213C1745J7548j72399j2344n0835n5082O7237q1245j89205M8024M1234Q9157
24202b66165J69716N4287M8822p5149j62930J22983Q9751m1184M4344j59028j63312
24191c37865j9287M7679j2186l5918O5335k3617R0850J87178o9596k28620j26126
$$ plain form
24180 -462173 -430709 -327872 -416234 -326966 -188777 -164692 -13583 387 -88836 79341 175384
24169 175384 -60396 -157436 -230909 -321632 -303293 -271124 -75780 -109108 -129456 -203020 -79330
24158 -79330 -91812 -191541 -233972 -172360 -47987 -83696 -96086 -56079 111412 175837 87254
24147 87254 6840 -72049 -114643 -114861 -162344 -188283 -177071 -54243 -82195 -244587 -377774
24136 -377774 -349848 -223648 -99611 -222680 -216450 -218450 -214780 -57730 18127 -1059 67204
24125 67204 214886 200640 170137 -32524 -130848 -91643 -50140 -70954 -77582 -105812 -180959
24114 -180959 -121322 34539 -25999 -164901 -51121 140548 177786 153468 159754 118095 -31144
24103 -31144 -70417 -243877 -284839 -168429 -176088 -218312 -94481 101034 45057 59488 -49010
$$ packed form
24180d62173L1464J02837q8362Q9268J38189K4085J51109J3970q9223J68177R6043
24169A75384k35780r7040p3473r0723J8339L2169J95344l3328k0348p3564J23690
24158g9330j2482r9729m2431O1612J24373l5709j2390M0007J67491O4425q8583
24147H7254q0414p8889m2594k18m7483k5939J1212J22828k7952j62392j33187
24136c77774K7926J26200J24037j23069O230k000L670J57050P5857j9186O8263
24125F7204J47682j4246l0503k02661r8324L9205M1503k0814o628k8230p5147
24114a80959N9637J55861o0538j38902J13780J91669L7238k4318O286m1659j49239
24103c1144l9273j73460m0962J16410p659m2224J23831J95515n5977J4431j08498
$$ plain form
24092 -49010 -243811 -514478 -476993 -349415 -172679 -142735 -173892 -90046 -36393 82904 83298
24081 83298 -68117 -155967 -74029 -69981 -18041 -41780 -116335 -39728 -154599 -197088 -257692
24070 -257692 -384837 -409150 -273367 -326801 -182054 -152259 -144700 -202091 -179274 -59776 45777
24059 45777 -13763 55740 83591 120009 103077 96114 47494 38162 -15643 -39518 35239 -67137
24047 -67137 -183938 -356794 -306066 -223941 -166787 -127027 22072 4139 52823 57686 98459
24036 98459 254476 208938 111546 61572 26182 16334 138429 176729 200104 95886 -75616
24025 -75616 -128248 -146769 -72244 28177 -81526 -205346 -100369 101449 154234 91745 -113555
24014 -113555 -172522 -56351 -118547 -149709 -248802 -238290 -235758 -285212 -156338 -73338 -41673
$$ packed form
24092d9010j94801k70667L7485J27578J76736K9944l1157Q3846N3653J19297L94
24081H3298j51415q7850Q1938M048N1940k3739p4555P6607j14871m2489o0604
24070b57692j27145k4313J35783n3434J44747K9795P559n7391K2817J19498J05553
24059D5777n9540O9503K7851L6418j6932o963m8620r332n3805k3875P4757j02376
24047f7137j16801j72856N0728Q2125N7154L9760J49099j7933M8684M863M0773
24036I8459J56017m5538r7392m9974l5390r848J22095L8300K3375j04218j71502
24025g5616n2632j8521P4525J00421j09703j23820J04977K01818N2785o2489k05300
24014a13555n8967J16171o2196l1162r9093J0512K532m9454J28874Q3000L1665
$$ plain form
24003 -41673 15903 -153140 -168187 -3197 123929 183763 255625 84689 -188175 -334498
23993 -334498 -394200 -240528 -42881 52900 2808 -106106 -98511 -132538 -59026 40018 66984
23982 66984 -45798 -83859 -122675 -143735 -211329 -219613 -150241 -185533 -229459 -263438 -300030 -210950
23970 -210950 -131541 -207164 -265611 -253057 -202329 -92340 -117664 -167899 -169665 -117230 -86986
23959 -86986 -428523 -532357 -437672 -340911 -208013 -134581 -136733 -62524 -171275 -219269 -278733
23948 -278733 -308745 -292297 -170899 -83696 -21931 -330403 -495671 -447070 -452113 -344292 -110393
23937 -110393 -79823 -75340 -61294 -72296 -70358 71573 81236 -40714 -165653 -146109 -245494
23926 -245494 -123028 108603 205375 -11702 55126 185420 241892 147539 4771 -61857
$$ packed form
24003d1673N7576j69043j5047J64990J27126N9834P1862j70936k72864j46323
23993c34498n9702J53672J97647R5781n0092j08914P595l4027P3512R9044K6966
23982F6984j12782l8061l8816k1060o7594q284O9372l5292m3926l3979l6592Q9080
23970b10950P9409p5623n8447J2554N0728J09989k5324n0235j766N2435L0244
23959h6986l41537j03834R4685R6761J32898P3432k152P4209j08751m7994n9464
23948b78733l0012J6448J21398Q7203O1765l08472j65268M8601n043J07821K33899
23937a10393L0570M483J4046j1002J938J41931R663j21950j24939J9544r9385
23926b45494J22466K31631R6772k17077O6828J30294N6472r4353j42768o6628
$$ plain form
23916 -61857 -42059 -206325 -290989 -175129 -140794 -41602 62008 60812 31800 -90612 -31620
23905 -31620 71721 -102048 -283546 -237054 -162551 -121392 -116778 -130386 19671 55866 -248665
23894 -248665 -239375 -35791 60422 -77375 -154858 -185437 -214340 -140869 -115503 -133474 -153389
23883 -153389 -88926 -68461 -80209 798 48494 -75595 -240812 -244579 -214335 -13483 99014
23872 99014 -81022 -206235 -56307 -47307 -100140 -70652 -115537 -136903 -182660 -308424 -344061
23861 -344061 -295381 -301168 -338918 -249065 -243590 -185222 -57482 -124151 -135139 -164875 -204486 -201347
23849 -201347 -289455 -196804 -161411 -262535 -296935 -243301 -288527 -275397 -120412 -64305 -144906
23838 -144906 -190964 -297702 -282341 -127132 -99554 -154432 -44076 32359 -104094 31648
$$ packed form
23916f1857J9798j64266q4664J15860L4335R9192J03610j196k9012j22412N8992
23905c1620J03341j73769j81498M6492P4503M1159M614j3608J50057L6195l04531
23894b48665R290K03584R6213j37797p7483l0579k8903P3471K5366j7971j9915
23883a53389O4463K0465j1748Q1007M7696j24089j65217l767L0244K00852J12497
23872I9014j80036j25213J49928R000n2833K9488m4885k1366m5757j25764l5637
23861c44061M8680n787l7750Q9853N475N8368J27740o6669j0988k9736l9611L139
23849b01347q8108R2651L5393j01124l4400N3634m5226J3130J54985N6107q0601
23838a44906m6058j06738J5361J55209K7578n4878J10356P6435j36453J35742
$$ plain form
23828 31648 30635 -189911 -254514 -313592 -335302 -243211 -127349 19014 81990 -39158 -64754
23817 -64754 8314 -63740 -85637 -135763 -269331 -235662 -228963 -176697 -148152 -13708 77932
23806 77932 129594 96295 14925 -14035 79090 143359 36073 -70993 -130898 -178796 -256079
23795 -256079 -300913 -259629 -157122 -92942 -73142 -89743 -85821 -47927 -26346 -7792 63052
23784 63052 -3353 -254284 -206177 -58601 -112187 -219486 -450157 -318343 -296490 -182879
23774 -182879 -183080 -198698 -146000 -116718 -209610 -216536 -167996 -167885 -185894 -285515 -170611 -55062
23762 -55062 27086 -14125 -158852 -80004 -113311 -142997 -178416 -189792 -64112 -77314 -71945
23751 -71945 -35643 -318708 -476116 -281927 -207789 -237446 -94998 41155 140868 107185 125190
$$ packed form
23828C1648j013k20546o4603n9078k1710R2091J15862J46363O2976j21148k5596
23817f4754P3068p2054k1897n0126j33568L3669O699N2266K8545J34444R1640
23806G7932N1662l3299q1370k8960R3125O4269j07286j07066n9905m7898p7283
23795b56079m4834M1284J02507O4180J9800j6601L922L7894K1581J8554P0844
23784F3052o6405k50931M8107J47576n3586j07299k30671J31814K1853J13611
23774a82879k01j5618N2698K9282r2892o926M8540J11j8009r9621J14904J15549
23762e5062Q2148m1211j44727P8848l3307k9686l5419j1376J25680j3202N369
23751g1945L6302k83065j57408J94189P4138k9657J42448J36153R9713l3683J8005
$$ plain form
23740 125190 247976 88834 -57458 41020 236438 254978 152794 200993 111425 50795
23730 50795 23193 17767 -91938 -152221 105097 126400 100208 87598 37888 -9867 -35884
23719 -35884 -57837 -35582 22417 -35997 -35416 -52784 -79870 -137812 -210456 -154549 -64203 -97247
23707 -97247 -163566 -236178 -180575 -26363 19893 -11344 -100085 -104385 41191 -36705 -26435
23696 -26435 -16839 -167843 -209125 -16182 21734 3792 -14352 108864 133932 240858 115568
23685 115568 -25010 -59926 -17018 -127991 -63969 -137423 -213621 -145543 -14100 -103437 -95854
23674 -95854 -122750 -165291 -187906 -238506 -176097 -46598 -95029 -43922 -84606 -84099 -193370 -226571
23662 -226571 -235159 -173988 -7919 169906 127637 52343 -86556 -79361 -113076 -15981 63224
$$ packed form
23740A25190J22786j59142j46292R8478J95418J8540j02184M8199q9568o0630
23730E0795k7602n426j09705o0283K57318K1303k6192j2610m9710m7755k6017
23719c5884k1953K2255N7999n8414N81j7368k7086n7942p2644N5907R0346l3044
23707i7247o6319p2612N5603J54212M6256l1237q8741m300J45576p7896J0270
23696b6435R596j51004m1282J92943L7916j7942j8144J23216K5068J06926j25290
23685A15568j40578l4916M2908j10973O4022p3454p6198O8078J31443q9337P583
23674i5854k6896m2541k2615n0600O2409J29499m8431N1107m0684N07j09271l3201
23662b26571q588O1171J66069J77825m2269p5294j38899P195l3715R7095P9205
$$ plain form
23651 63224 -16478 -69333 -158020 -184015 -316958 -217907 -160536 -194335 -91936 -52857 -120162
23640 -120162 -78515 -53044 9962 162153 75166 -111710 -107450 -178142 -161625 -135157 -123774
23629 -123774 -63948 121744 223688 182664 -54798 -119923 -144793 -76889 -22107 154611 325233
23618 325233 184892 104906 116562 -11304 -176943 -225596 -226265 -330845 -391346 -384477 -180664
23607 -180664 -196193 -318572 -262452 -201916 -139489 -9511 -124571 -246366 -174299 -99727 -93489
23596 -93489 54156 17363 -170483 -272310 -260635 -256230 -148174 -92128 50266 115015 3633
23585 3633 -188815 -121127 -44943 -38434 -127571 -168378 -145147 -163046 -96046 -161345 -178991 -33034
23573 -33034 50839 67513 -57560 -65645 -159160 -99158 68825 -18865 -64243 -19769 19992
$$ packed form
23651F3224p9702n2855q8687k5995j32943R9051N7371l3799J02399L9079o7305
23640a20162M1647K5471O3006J52191q6987j86876M260p0692J6517K6468J1383
23629a23774N9826J85692J01944m1024k37462o5125k4870O7904N4782J76718J70622
23618C25233j40341p9986J1656j27866j65639m8653o69j04580o0501O869K03813
23607a80664j5529j22379N6120O0536O2427J29978j15060j21795P2067P4572O238
23596i3489J47645l6793j87846j01827J1675M405J08056N6046J42394O4749j11382
23585C633j92448O7688P6184O509q9137m0807K3231j7899O7000o5299j7646J45957
23573c3034Q3873J6674j25073q085r3515O0002J67983q7690m5378M4474L9761
$$ plain form
23562 19992 78707 117197 67758 99510 48181 120184 -95835 -202840 -140799 -20643 -26366
23551 -26366 41404 -165574 -166617 77973 129734 194445 236518 182870 -11123 87685 59442
23540 59442 33715 36784 42580 -89253 -161193 -223893 -170861 -71317 -102231 -49300 259527 220275
23528 220275 156637 92095 131560 152209 224097 248512 257552 278312 68416 -24695 -45559
23517 -45559 -67177 -73566 46724 14752 -264419 -291004 -245000 -143673 -85189 38147 -54313
23506 -54313 -101509 -51260 24202 29263 10270 85705 148706 -122104 -90314 56705 15784
23495 15784 -192480 -131418 -99300 -36419 -1101 2624 -180114 -193632 -141829 -227756 -313172
23484 -313172 -335885 -272821 -294680 -398693 -329092 -195376 -147398 -281055 -205954 -168874 8444
$$ packed form
23562A9992N8715L8490m9439L1752n1329P2003k16019j07005O2041J20156n723
23551b6366O7770k06978j043K44590N1761O4711M2073n3648j93993R8808k8243
23540E9442k5727L069N796j31833p1940o2700N3032R9544l0914N2931L08827l9252
23528B20275o3638o4542L9465K0649P1888K4415R040K0760k09896r3111k0864
23517d5559k1618o389J20290l1972k79171k6585M6004J01327N8484J23336r2460
23506e4313m7196N0249P5462N061j8993P5435O3001k70810L1790J47019m0921
23495A5784k08264O1062L2118O2881L5318L725j82738j3518N1803q5927q5416
23484c13172k2713O3064k1859j04013O9601J33716M7978j33657P5101L7080J77318
$$ plain form
23473 8444 217416 71626 20745 118084 150542 102948 -149588 -233484 -187985 -147526 -190823
23462 -190823 -228399 -231696 -308421 -299862 -163246 991 66833 83827 -85350 -99017 -32920
23451 -32920 -28074 -306362 -341514 -315910 -272981 -355182 -166126 21172 -36783 -214726 -208964
23440 -208964 -195205 -330545 -368987 -319285 -250068 -102191 -102972 -252754 -256464 -325461 -389914
23429 -389914 -286930 -184800 -144916 -95052 -19923 -36118 -54772 -217984 -207834 -287705 -376916
23418 -376916 -290187 -205863 -193144 -205609 -259665 -211678 -118881 -146677 -162633 -95776 -127361
23407 -127361 -214860 -273932 -217613 -146682 -224 8903 -72682 27773 59559 -24259 -232961
23396 -232961 -364650 -309687 -207022 -143424 -44322 -165612 -299542 -345807 -252217 -135430
$$ packed form
23473H444K08972j45790n0881R7339L2458m7594k52536q3896M5499M0459m3297
23462a90823l7576l297p6725Q559J36616J64237O5842J6994j69177j3667O6097
23451c2920M846k78288l5152K5604M2929q2201J89056J87298n7955j77943N762
23440b08964J3759j35340l8442M9702O9217J47877p81j49782l710o8997o4453
23429c89914J02984J02130L9884M9864P5129j6195j8654j63212J0150p9871q9211
23418c76916Q6729Q4324J2719j2465n4056M7987R2797k7796j5956O6857l1585
23407a27361q7499n9072N6319P0931J46458R127q1585J00455L1786q3818k08702
23396b32961j31689N4963J02665O3598R9102j21290j33930m6265R3590J16787
$$ plain form
23386 -135430 -1963 119802 -68810 -167638 -304836 -359449 -117650 -136235 -111463 -179197
23376 -179197 -233189 -113044 -112305 21627 85030 -20481 46689 25851 -19766 -18423 -92141
23365 -92141 -129414 -95332 -152916 -153842 -103690 -109790 -66768 -67375 -42829 -90645 -100519 -90693 -143116
23352 -143116 -267292 -209146 -128607 -162068 -131621 -41116 2442 34164 30943 -96348 -357286
23341 -357286 -474751 -394036 -270967 -151441 -1034 -63226 -61261 -112215 -220778 56673
23331 56673 189354 121377 -61923 -282558 -378178 -207876 -230818 -246224 -52577 174550
23321 174550 135567 -47250 -217155 -214481 -250355 -259943 -19482 86415 96314 271023 174934
23310 174934 95298 -16260 -36035 17521 93913 -6268 -33815 -206608 -429803 -336140 -166409
$$ packed form
23386a35430J33467J21765j88612r8828j37198n4613K41799j8585K4772o7734
23376a79197n3992J20145P39J33932O3403j05511O7170k0838m5617J343p3718
23365i2141l7273L4082n7584r26N0152o100M3022o07K4546m7816r874R826n2423
23352a43116j24176N8146Q0539l3461L0447R0505M3558L1722l221j27291k60938
23341c57286j17465Q0715J23069J19526J50407o2192J965n0954j08563K77451
23331E6673J32681o7977j83300k20635r5620J70302k2942j5406J93647K27127
23321A74550l8983j82817j69905K674l5874r588K40461J05897R899J74709r6089
23310A74934p9636j11558j9775N3556P6392j00181k7547j72793k23195R3663J69731
$$ plain form
23299 -166409 -148294 -143240 -72032 81837 4556 -132471 -151555 -198868 -272691 -258702 -289556
23288 -289556 -294475 -221386 -96407 -131717 -177875 -63526 -169353 -63496 -70989 -240624 -143779
23277 -143779 89505 248033 142653 24267 78213 39145 -49247 -15880 10723 -72997 -65619
23266 -65619 -32375 -57191 -218540 -276436 -150844 -72502 -45555 -53847 -35568 56869 27190
23255 27190 -103626 -131981 -100529 19359 -81914 -71964 -162072 -273950 -355903 -388214 -147308
23244 -147308 -70915 20992 194755 37350 -67362 -98881 -40322 65941 137627 238180
23234 238180 329262 235904 68834 136242 90302 59463 -27904 -66474 211 -39964 -160640
23223 -160640 -215965 -122820 -1816 73599 195689 244030 142392 8406 -102149 -115834
$$ packed form
23299a66409J8115N054P1208J53869p7281j37027j9084m7313p3823J3989l0854
23288b89556m919P3089J24979l5310m6158J14349j05827J05857p493j69635R6845
23277a43779K33284J58528j05380j18386N3946l9068q8392L3367K6603q3720P378
23266f5619L3244k4816j61349n7896J25592P8342K6947q292J8279R2437k9679
23255B7190j30816k8355L1452J19888j01273R950r0108j11878q1953l2311K40906
23244a47308P6393R1907J73763j57405j04712l1519N8559J06263P1686J00553
23234B38180R1082r3358j67070O7408m5940l0839q7367l8570O6685m0175j20676
23223a60640n5325R3145J21004P5415J22090M8341j01638j33986j10555j3685
$$ plain form
23213 -115834 -17465 102435 -321 -110023 -318285 -178290 10958 -103079 -122363 85672
23203 85672 117609 89429 165776 82276 -9545 38964 21513 -85320 -31635 215805 229206
23192 229206 173397 13186 97055 58690 135941 164284 33037 -114824 -40218 38153 68606
23181 68606 60087 -154535 -50606 -26705 -160533 -189806 29472 57231 97874 130642 65755
23170 65755 73466 -3071 -24402 -65312 -51913 18236 -90351 -4150 45474 83266 47828 -674
23158 -674 -8899 -9646 -144400 -268272 -402225 -416118 -376269 -350675 -420721 -384840 -311963 -257577
23146 -257577 -223909 -233474 -313337 -327249 -286395 -156612 -24592 -245037 -262319 -53678 46493
23135 46493 -11226 -122666 -75866 -99286 -75341 26806 58385 -23666 -57353 -18425 -16352
$$ packed form
23213a15834R8369J19900j02756j09702k08262J39995J89248j14037j9284K08035
23203H5672L1937k8180P6347q3500r1821M8509j7451j06833N3685K47440J3401
23192B29206n5809j60211Q3869l8365P7251K8343j31247j47861P4606P8371L0453
23181F8606q519k14622J03929K3901j33828k9273K19278K7759M0643L2768o4887
23170F5755P711p6537k1331m0910J3399P0149j08587Q6201M9624L7792l5438m8502
23158f74q225p47j34754j23872j33953j3893L9849K5594p0046L5881P2877N4386
23146b57577L3668r565p9863j3912M0854J29783J32020k20445j7282K08641J00171
23135D6493n7719j11440M6800k3420K3945J02147L1579q2051l3687L8928K073
$$ plain form
23124 -16352 -59327 85773 170048 190888 209971 94379 -141154 -225817 -262177 -208114 -184244
23113 -184244 -60990 -17394 -720 -15777 20418 -78040 -71153 3562 -9058 -92940 -64897
23102 -64897 83160 -20270 -11736 -10297 75851 78865 46618 51432 -26941 64239 33455 -16645
23090 -16645 68564 33428 -192193 -268864 -206273 -21824 77101 20221 104886 264170 218038
23079 218038 59232 -76582 -145250 -150502 -97462 -30055 18036 -91849 -144477 -52286 -71745
23068 -71745 -88038 -124671 -132207 -106934 -139108 -123469 -63602 66092 112228 19499 -137717
23057 -137717 -347474 -283740 -2281 124068 291892 283712 145748 183274 144755 63615 -68739
23046 -68739 -202076 -318531 -239902 -276487 -312041 -345200 -331046 -203728 -29759 10043 -169782
$$ packed form
23124a6352m2975J45100Q4275K0840J9083j15592k35533q4663l6360N4063K3870
23113a84244J23254M3596J6674j5057L6195r8458O887P4715j2620q3882K8043
23102f4897J48057j03430Q534J439Q6148L014l2247M814p8373R1180l0784n0100
23090a6645Q5209l5136k25621p6671O2591J84449R8925n6880Q4665J59284m6132
23079B18038j58806j35814o8668n252N3040O7407M8091j09885n2628R2191j9459
23068g1745j6293l6633p536K5273l2174J5639N9867J29694M6136r2729j57216
23057a37717k09757O3734K81459J26349J67824q180j37964L7526l8519q1140j32354
23046f8739j33337j16455P8629l6585l5554l3159J4154J27318J73969L9802j79825
$$ plain form
23035 -169782 -86663 -51414 2513 -148936 -297323 -166920 -158381 -131561 -49114 -100193 -186486
23024 -186486 -222859 -329011 -356242 -278986 -298740 -346172 -359624 -198100 -70740 -58096 -208114
23013 -208114 -164882 -192532 -132831 -79527 8614 126536 37501 -161652 -114341 -56794 -91472
23002 -91472 69403 116889 -7723 -108737 -98802 3213 7012 -117770 -237879 -284076 -246488
22991 -246488 -321855 -334047 -277657 -98524 -6965 43864 16841 -49578 -30597 -130330 -13504
22980 -13504 69678 57149 -67379 -171556 -153655 -2827 103291 -20047 -97820 -218102
22970 -218102 -268414 -211150 -269549 -304389 -338624 -319912 -369613 -248040 -173889 -165715 -175941
22959 -175941 -232733 -115533 45761 -12659 -101654 -172807 -251375 -127469 12641 -48938 -168191
$$ packed form
23035a69782Q3119L5249N3927j51449j48387J30403Q539K6820Q2447n1079q6293
23024a86486l6373j06152k7231P7256j9754m7432j3452J61524J27360J2644j50018
23013b08114M3232k7650N9701N3304Q8141J17922q9035j99153M7311N7547l4678
23002i1472J60875M7486j24612j01014R935J02015L799j24782j20109m6197L7588
22991b46488p5367j2192N6390J79133R1559N0829k7023o6419J8981r9733J16826
22980a3504Q3182j2529j24528j04177J7901J50828J06118j23338p7773j20282
22970b18102n0312N7264n8399l4840l4235J8712m9701J21573P4151Q174j0226
22959a75941n6792J17200J61294n8420q8995p1153p8568J23906J40110o1579j19253
$$ plain form
22948 -168191 -240279 -393033 -417147 -254322 -252983 -173472 -47399 -35523 35516 -26676 -158432
22937 -158432 -203458 -158269 -166041 -168692 -96617 -158199 -142131 -182516 -381165 -438223 -500047 -441287
22925 -441287 -137775 -24892 -77360 -91975 -204069 -316853 -173191 -39842 -160238 -253404
22915 -253404 -211276 -244200 -248956 -113721 2949 -48256 -65413 -222273 -208057 -59207 -62307
22904 -62307 -115159 -202715 -232937 -228156 -104764 -37760 -89722 -92553 53715 91846 -27790
22893 -27790 -205107 -220770 -181296 -151256 -170699 -92088 -91684 1231 133536 57241 -18523 1195
22881 1195 -37094 -29953 -216633 -136553 158428 293046 -31696 -238257 -220593 -281909 -134023
22870 -134023 -76842 40782 -174995 -246390 -259146 -116418 -223889 -199215 29847 64722
$$ packed form
22948a68191p2088j52754k4114J62825J339P9511J26073J1876P1039o2192j31756
22937a58432m5026M5189p772k651P2075o1582J6068m0385j98649n7058o1824N8760
22925d41287L03512J12883n2468j4615j12094j12784J43662J33349j20396r3166
22915b53404M2128l2924m756J35235J16670n1205j7157j56860J4216J48850l100
22904f2307n2852q7556l0222M781J23392O7004n1962k831J46268L8131j19636
22893b7790j77317j5663L9474L0040j9443P8611M04R2915J32305p6295p5764J9718
22881A195l8289P141j86680Q0080K94981J34618l24742k06561J7664o1316J47886
22870a34023N7181J17624k15777p1395j2756J42728j07471K4674K29062L4875
$$ plain form
22860 64722 -240276 -270626 -34256 12553 -58297 -92298 -179685 -192999 -39401 49324 -21048
22849 -21048 -83788 -159703 -99320 47746 -814 -84650 -140870 -220276 -211047 -91671 -224254
22838 -224254 -204240 -53721 -83097 -149855 -154904 -138684 -199021 -168581 -25885 55177 42614
22827 42614 -27832 36088 24678 -3039 -45405 -6979 -76189 -115507 35166 104280 -1674
22816 -1674 -111641 -152577 -162001 -161885 55298 222770 197248 62122 -90532 -86717 -32472 -18131
22804 -18131 -7848 -86050 -204062 -261257 -388728 -299627 -145710 -68421 -156121 -49690 -81881
22793 -81881 -141941 -17086 41913 144275 202015 72809 -61281 -18334 155300 189965 175018
22782 175018 68034 1234 -150239 -447611 -422508 -219894 -211944 -195431 2681 98836 -142196
$$ packed form
22860F4722l04998l0350K36370M6809p0850l4001q7387j3314J53598Q8725p0372
22849b1048o2740p5915O0383J47066m8560q3836n6220p9406R229J19376j32583
22838b24254K0014J50519k9376o6758n049J6220o0337L0440J42696Q1062j2563
22827D2614p0446O3920j1410k7717m2366L8426o9210l9318J50673O9114j05954
22816a674j09967m0936r424J16K17183J67472k5522j35126j52654L815N4245J4341
22804a8131J0283p8202j18012n7195j27471Q9101J53917P7289q7700J06431l2191
22793h1881o0060J24855N8999J02362N7740j29206j34090M2947J73634L4665j4947
22782A75018j06984o6800j51473k97372K5103K02614P950J6513J98112R6155k41032
$$ plain form
22771 -142196 -357464 -241945 -116867 -81956 -162441 -271425 -246299 -135175 -209761 -332002
22761 -332002 -354236 -395344 -331173 -117891 73150 27433 -43601 -205254 -346360 -375432 -424125
22750 -424125 -348672 -246033 -156352 -235345 -310487 -347770 -336490 -355840 -283603 -332306 -276825
22739 -276825 -159632 -103078 -13092 100951 200148 -936 -102498 -10953 -69443 -149612 -186409
22728 -186409 -191328 -258795 -357600 -244242 -66700 -70709 -300254 -262626 -47540 -91970 -75794
22717 -75794 -86088 1589 192063 168358 -52771 66830 111210 93948 208959 84831 52796
22706 52796 -2719 -103677 -4865 83121 27355 3762 -72604 -130268 -34930 -40343 18489 27677
22694 27677 -20091 -36581 -113380 -113008 -204772 -255681 -133444 -57694 -64681 125030 103045 7462
$$ packed form
22771a42196k15268J15519J25078L4911q0485j08984K5126J11124p4586j22241
22761c32002k2234m1108O4171K13282J91041m5717p1034j61653j41106k9072m8693
22750d24125P5453J02639Q9681p8993p5142l7283J1280j9350P2237m8703N5481
22739b76825J17193N6554Q9986J14043R9197k01084j01562R1545n8490q0169l6797
22728a86409m919o7467r8805J13358J77542m009k29545L7628K15086m4430J6176
22717g5794j0294Q7677J90474k3705k21129J19601M4380j7262J15011j24128l2035
22706E2796n5515j00958R8812Q7986n5766k3593p6366n7664R5338n413N8832R188
22694B7677m7768j6490p6799L72r1764n0909J22237P5750o987J89711k1985r5583
$$ plain form
22682 7462 29838 -90319 -160122 -232029 -79432 -43919 -150571 -251962 -213598 -138500 -159575
22671 -159575 -239685 -166442 -56474 -153819 -248619 -132610 -221163 -229073 -159627 -158973 -31570
22660 -31570 -183027 -333867 -127088 116688 169015 40081 -28540 -25162 25266 20641 -46779
22649 -46779 -237368 -257635 -137868 -125118 -169626 -166906 -82742 -82658 -83995 -59563 -34515 -71658
22637 -71658 -130360 -132176 -239118 -244443 -207691 -163086 -264724 -197835 -60957 -175052 -231985
22626 -231985 -106498 -6770 -52051 -65374 -46245 61969 141297 168810 61270 -33335 -171960
22615 -171960 -128013 -79816 -127554 -207617 -162456 -133983 -174766 -20115 -34909 59978 176850
22604 176850 224234 143316 160274 157782 52572 -137632 110331 150218 -40145 -123271 -274024
$$ packed form
22682G462K2376j20157o9803p1907J52597L5513j06652j01391L8364P5098k1075
22671a59575q0110P3243J09968r7345r4800J16009q8553p910O9446O54J27403
22660c1570j51457j50840K06779K43776N2327j28934o8621L378N0428m625o7420
22649d6779j90589k0267J19767J2750m4508K720Q4164Q4j337K4432K5048l7143
22637g1658n8702j816j06942n325L6752M4605j01638O6889J36878j14095n6933
22626b31985J25487R9728m5281j3323J9129J08214P9328K7513j07540r4605j38625
22615a71960M3947M8197m7738q0063M5161K8473m0783J54651j4794R4887J16872
22604A76850M7384q0918J6958k492j05210j90204K47963L9887j90363q3126j50753
$$ plain form
22593 -274024 -362752 -209807 -111618 -47197 -131080 -127285 -138570 -275284 -327066 -157260 24981
22582 24981 118902 94581 40977 9237 46490 26662 2502 -125894 -152952 -76259 -182080
22571 -182080 -244727 -224181 -138173 136155 204971 228024 247237 289962 139163 -48622 -56869
22560 -56869 -33479 -83904 26725 38932 56252 98197 39614 59708 173723 364474 471759
22549 471759 479639 210000 105894 169654 116699 1086 -108169 -249918 -319449 -372864 -481403
22538 -481403 -380425 -200474 -216671 -27245 89017 123699 -132584 -114939 -143874 -134023 -118419
22527 -118419 -174018 -122342 -120045 -144472 -65571 41334 -111766 -178987 -117364 -120251 -25647
22516 -25647 112806 92280 118605 137620 -101204 26146 217222 53121 -76751 9422
$$ packed form
22593b74024q8728J52945R8189O4421q3883L795j1285j36714n1782J69806J82241
22582B4981R3921k4321n3604l1740L7253j9828k4160j28396k7058P6693j05821
22571a82080o2647K0546Q6008K74328O8816K3053J9213M2725j50799j87785q247
22560e6869K3390n0425J10629J2207J7320M1945n8583K0094J14015J90751J07285
22549D71759P880k69639j04106O3760n2955j15613j09255j41749o9531n3415j08539
22538d81403J00978J79951j6197J89426J16262L4682k56283J7645k8935R851J5604
22527a18419n5599N1676K297k4427P8901J06905j53100o7221O1623k887R4604
22516b5647J38453k0526K6325J9015k38824J27350J91076j64101j29872Q6173
$$ plain form
22506 9422 152380 84678 63851 12276 97951 142039 15953 -272284 -244504 -128862 16214
22495 16214 88889 104432 98633 176754 219235 78187 7808 -12232 -92293 -105515 -206069
22484 -206069 -248307 -43017 213654 209476 144096 111471 -4622 -67509 -80998 -67780 57128
22473 57128 5881 -42785 -14501 -61364 -150955 -134610 -172956 -142384 -126833 -180794 -158607 -159556
22461 -159556 -214058 -218189 -267340 -264656 -49472 92794 23352 -18420 10290 18975 189143
22450 189143 109367 -70716 -178372 -93029 -67920 -97024 -181844 -163435 -130416 -109344 -30487
22439 -30487 122051 128071 9833 -94253 -91731 274132 495416 406213 273353 186535 52390
22428 52390 -214199 -382032 -362697 -86007 -127301 -178463 -149390 -134789 -181668 -141246 -126922
$$ packed form
22506I422J42958o7702k0827n1575Q5675M4088j26086k88237K7780J15642J45076
22495A6214P2675J5543n799P8121M2481j41048p0379k0040q0061j3222j00554
22484b06069m2238K05290K56671m178o5380l2625j16093o2887j3489J3218J24908
22473E7128n1247m8666K8284m6863q9591J6345l8346L0572J5551n3961K2187r49
22461a59556n4502m131m9151K684K15184J42266o9442m1772K8710Q685J70168
22450A89143p9776j80083j07656Q5343K5109k9104q4820J8409L3019K1072P8857
22439c0487J52538O020j18238j04086K522L65863K21284q9203j32860q6818j34145
22428E2390k66589j67833J9335K76690m1294n1162K9073J4601m6879M0422J4324
$$ plain form
22417 -126922 -108170 -248463 -175274 -131190 -104516 21922 65384 93779 53520 -13544 -155153
22406 -155153 -143514 -102890 65786 125313 32411 40237 186788 318330 304532 168316 198706
22395 198706 194042 88344 12451 -54912 -91589 -110445 84694 252395 229293 67378 80663
22384 80663 24963 44670 19392 69626 -38977 -196408 -156401 31410 149333 199729 449
22373 449 -98622 -58837 -62268 -41018 -25403 -260298 -432995 -161862 14172 89109 65121
22362 65121 35830 72311 87631 -64000 -125354 -144109 -122446 -52611 -115487 -35799 91608
22351 91608 180556 106678 -64200 -189400 -265366 -345299 -196074 -73215 23902 18145 69779
22340 69779 -46691 -36699 71794 47891 37781 186667 190640 113676 3925 -45866 -49730
$$ packed form
22417a26922J8752j40293P3189M4084K6674J26438M3462K8395m0259o7064j41609
22406a55153J1639M0624J68676N9527r2902P826J46551J31542j3798j36216L0390
22395A98706m664j05698p5893o7363l6677j8856J95139J67701k3102j61915J3285
22384H0663n5700J9707k5278N0234j08603j57431M0007J87811J17923N0396j99280
22373D49r9071L9785l431K1250J5615k34895j72697K71133J76034P4937k3988
22362F5121k9291L6481J5320j51631o1354j8755K1663O9835o2876P9688J27407
22351I1608Q8948p3878j70878j25200p5966p9933J49225J22859R7117n757N1634
22340F9779j16470R992J08493k3903j0110J48886L973p6964j09751m9791l864
$$ plain form
22329 -49730 -171025 -207303 -59483 -4329 -108040 -133887 -117143 54365 15442 68363 112629
22318 112629 159651 88762 94545 88241 -29132 -127844 -168045 -204458 -225634 -192259 -201407 -111171
22306 -111171 -95451 -25039 -95843 -245099 -168370 -18115 -3840 -156958 -146315 -32579 145881
22295 145881 210076 204425 153478 78016 -47718 2638 -6642 -124332 -220439 -123006 -37999
22284 -37999 -123909 -213857 -170520 -168630 -60942 -25904 -108508 2411 133264 140128 112094
22273 112094 -26224 -127473 -66159 -5385 22704 25328 13029 16563 76231 141748 96834
22262 96834 103161 171208 95744 -57017 -34371 -19157 -20894 23550 43354 -88407 -46275 160802
22250 160802 163549 109478 189192 55557 -13696 -108832 -212690 -31729 26252 18752 48274
$$ packed form
22329d9730j21295l6278J47820N5154j03711k5847J6744J71508l8923N2921M4266
22318A12629M7022p0889N783o304j17373r8712m0201l6413k1176L3375r148R0236
22306a11171J5720P0412p0804j49256P6729J50255J4275j53118J0643J13736J78460
22295A45881O4195n651n0947p5462j25734N0356r280j17690r6107R7433Q5007
22284c7999q5910q9948M3337J890J07688L5038q2604J10919J30853O864k8034
22273A12094j38318j01249O1314O0774K8089K624j2299L534N9668O5517m4914
22262I6834O327O8047p5464j52761K2646J5214j737M4444J9804j31761M2132K07077
22250A60802K747n4071P9714j33635o9253r5136j03858J80961N7981p500K9522
$$ plain form
22239 48274 -8178 50777 22551 6180 -64574 -103941 -156905 -145419 -126692 -9732 65530
22228 65530 -24105 -119515 157432 251700 68442 -44291 -102366 -37437 -139530 -128572 -13695
22217 -13695 115592 68488 42823 134026 284874 287461 201158 203322 44650 -238389 -286997
22206 -286997 -192235 -123918 26 43892 89880 -17906 -66341 -137002 -318252 -335342 -162869
22195 -162869 -251810 -248451 -55614 8482 -84808 -187731 -221637 -263438 -364079 -394750 -364951
22184 -364951 -334889 -220217 -218770 -199508 -212516 -271832 -246691 -42643 20404 20943 151304
22173 151304 161294 157274 192230 199570 105081 3155 -50158 98014 201894 202541 18597 54330
22161 54330 29251 -110046 -234889 -241339 -67720 -30783 2095 -116511 -222721 -260803 -73510
$$ packed form
22239D8274n6452N8955k8226j6371p0754l9367n2964J1486J8727J16960P5262
22228F5530q9635r5410K76947R4268j83258j12733n8075O4929j02093J0958J14877
22217a3695J29287m7104k5665R1203J50848K587q6303K164j58672k83039m8608
22206b86997R4762O8317J23944M3866M5988j07786m8435p0661j81250j7090J72473
22195a62869q8941L359J92837O4096r3290j02923l3906m1801j00641l0671K9799
22184c64951L0062J14672J447J9262j3008n9316K5141K04048O3047N39J30361
22173A51304R990m020L4956P340r4489j01926n3313J48172J03880O47j83944L5733
22161E4330k5079j39297j24843o450J73619L6937L2878j18606j06210l8082J87293
$$ plain form
22150 -73510 -56974 -97514 -190471 -206687 -160493 -148882 -166124 -127063 -14200 -36596 -7658
22139 -7658 14729 -100166 -114398 -99250 -139353 -5835 -104141 -286972 -188626 7490 263394
22128 263394 283669 147030 157722 222483 282195 272253 52850 -3737 -125244 -19712 -57722
22117 -57722 -133609 -107265 47269 -90316 -126606 -9206 111551 264314 285989 357690 320580
22106 320580 197115 93028 100571 -564 -147658 -106871 55489 21900 -96768 -5149
22096 -5149 142084 3243 -42101 -199986 -139599 -94734 -132462 -109662 -60523 -145039 -203957
22085 -203957 -210739 -89597 -23207 -39560 -199030 -190360 58616 24750 -49647 -75490 -141002
22074 -141002 -56565 144466 197625 109587 -8688 -126508 -193341 -286404 -116825 60683
$$ packed form
22150g3510J6536m0540r2957j6216M6194J1611j7242L9061J12863k2396K8938
22139g658K2387j14895j4232J5148m0103J33518r8306j82831R8346J96116K55904
22128B63394K0275j36639J0692O4761N9712r942k19403n6587j21507J05532l8010
22117e7722p5887K6344J54534j37585l6290J17400J20757J52763K1675P1701l7110
22106C20580j23465j04087P543j01135j47094M0787J62360l3589j18668R1619
22096e149J47233j38841m5344j57885O0387M4865l7728K2800M9139q4516n8918
22085b03957o782J21142O6390j6353j59470Q670K48976l3866p4397k5843o5512
22074a41002Q4437K01031N3159q8038j18275j17820o6833r3063J69579J77508
$$ plain form
22064 60683 78834 127133 123061 131074 134696 83785 83841 25982 -84512 -157237 -149405 -45794 12704
22051 12704 -53183 -183885 -246372 -89288 -16339 -127055 -178978 -207704 -149338 -71149 71613
22040 71613 118126 11872 11935 66665 168515 205837 61147 -99113 -241627 -158688 -92884
22029 -92884 -31768 -36007 96722 118694 3655 4571 -3457 50442 63401 125699 217450 209153
22017 209153 188887 167299 140591 134139 -57683 -139642 -232524 -149749 170001 231602 102317
22006 102317 115500 7400 -14687 216549 20252 -94314 -171065 -182521 -64137 118590
21996 118590 208613 284381 259515 193811 170915 -11714 -245687 -417388 -325843 -108449 75815
21985 75815 169984 -22133 -14806 -108705 -126041 -42426 -2138 -143961 -43822 104084 13562
$$ packed form
22064F0683J8151M8299m072Q013L622n0911N6n7859j10494p2725P832J03611N8498
22051A2704o5887j30702o2487J57084P2949j10716n1923k8726N8366P8189J42762
22040G1613M6513j06254O3N4730J01850L7322j44690j60260j42514Q2939O5804
22029i2884O1116m239J32729K1972j15039R16q028N3899J2959O2298R1751q297
22017B09153k0266k1588k6708o452j91822q1959r2882Q2775L19750O1601j29285
22006A02317J3183j08100k2087K31236j96297j14566p6751j1456J18384J82727
21996A18590R0023P5768k4866o5704k2896j82629k33973j71701R1545K17394J84264
21985G5815R4169j92117P327r3899j7336Q3615M0288j41823J00139J47906r0522
$$ plain form
21974 13562 -28288 -21398 -29808 125302 288888 295668 209571 132789 -10587 -150316 -184917
21963 -184917 -215532 -301191 -186861 5319 65977 42942 186187 111148 70944 92283 -18310
21952 -18310 -94536 -51851 97381 192494 95150 -32307 -7976 -38743 -11373 53724 92273
21941 92273 -29489 37406 122347 82304 -10521 63454 173508 312424 268057 51126 -121123
21930 -121123 50713 151250 12789 -120375 -25087 139867 128523 204674 314490 107240
21920 107240 -45197 -16427 -52732 53552 53438 222967 184172 165941 121769 -34487 76275
21909 76275 30414 13528 -29791 2052 72141 237431 143995 162376 270806 197266 55135
21898 55135 -89929 44501 202261 287869 362363 246993 310617 456880 372514 97149
$$ packed form
21974A3562m1850O890q410J55110J63586O780q6097p6782j43376j39729l4601
21963a84917l0615q5659J14330J92180O0658k3035J43245p5039m0204K1339j10593
21952a8310p6226M2685J49232R5113r7344j27457K4331l0767K7370O5097L8549
21941I2273j21762O6895Q4941m0043r2825P3975J10054J38916m4367k16931j72249
21930a21123J71836J00537j38461j33164R5288J64954j1344P6151J09816k07250
21920A07240j52437K8770l6305J06284j14J69529l8795j8231m4172j56256J10762
21909G6275m5861j6886m3319L1843P0089J65290r3436J8381J08430p3540j42131
21898E5135j45064J34430J57760Q5608P4494j15370O3624J46263q4366k75365
$$ plain form
21888 97149 -218122 -157754 17622 264653 171706 33848 -53699 -156791 -44417 156180
21878 156180 232967 60452 10875 62438 69872 205331 181021 44611 89523 151750 55383
21867 55383 145108 223410 198284 341003 368911 398683 375859 392493 407636 493129 403606
21856 403606 479673 377774 167778 91217 21324 -20921 -14785 -49791 48904 -77422 -113500
21845 -113500 -30001 -136389 -205571 -153573 -146004 -85015 73606 150874 232941 193869 199979
21834 199979 112260 12600 26049 8757 68853 12499 84131 195992 152281 230787 63467
21823 63467 -110741 -78322 -21991 -61550 -100109 -147620 -184758 -149280 -126496 -29544 100689
21812 100689 150611 271736 113661 83857 127313 -66639 -153946 -200445 -227147 -75780 17435
$$ packed form
21888I7149l15271O0368J75376K47031r2947j37858q7547j03092J12374K00597
21878A56180P6787j72515m9577N1563P434J35459k4310j36410M4912O2227r6367
21867E5383Q9725P8302k5126J42719K7908K9772k2824J6634J5143Q5493q9523
21856D03606P6067j01899k09996p6561o9893m2245O136l5006R8695j26326l6078
21845a13500Q3499j06388o9182N1998P569O0989J58621P7268Q2067l9072O110
21834A99979q7719r9660J3449j7292O0096n6354P1632J11861m3711P8506j67320
21823F3467j74208L2419N6331l9559l8559m7511l7138L5478K2784R6952J30233
21812A00689M9922J21125j58075k9804M3456j93952q7307m6499k6702J51367R3215
$$ plain form
21801 17435 91608 -51650 -70663 60956 -32711 -95022 11826 124370 162852 184082 172253
21790 172253 85743 -43032 -12670 -56215 -76144 -90191 116845 108013 -13351 46926 89779
21779 89779 92878 86257 30181 -9055 70586 87992 143741 37716 -47312 90617 19585 -54552
21767 -54552 -145278 -126219 41062 83626 105089 215808 156058 49365 -16026 30415 31671
21756 31671 -73943 -58755 9136 -49777 44533 60126 -66238 -76583 -108495 -84884 -51640
21745 -51640 -51224 -56939 -241937 -224018 -205446 -67982 -4814 -79645 -244839 -279214 -161782
21734 -161782 -174365 -220628 -240586 -169996 -76938 -21734 74587 35286 -36191 -19748 59703
21723 59703 47092 145165 112937 98382 118273 248658 306179 218366 78993 23076 -75064
$$ packed form
21801A7435P4173j43258j9013J31619r3667o2311J06848J12544L8482K1230j1829
21790A72253q6510j28775L0362m3545j9929j4047K07036q832j21364O0277M2853
21779H9779L099o621n6076l9236P9641J7406N5749j06025q5028J37929p1032p4137
21767e4552r0726J9059J67281M2564K1463J10719n9750j06693o5391M6441J256
21756C1671j05614J5188O7891n8913R4310J5593j26364j0345l1912K3611L3244
21745e1640M16n715j84998J7919J8572J37464O3168p4831j65194l4375J17432
21734a61782j2583m6263j9958P0590R3058N5204R6321l9301p1477J6443P9451
21723E9703j2611R8073l2228j4555J9891J30385N7521q7813j39373n5917r8140
$$ plain form
21712 -75064 -37555 148747 103353 18323 -19526 -80979 -40609 -105813 -218473 -86371 146274
21701 146274 33108 9172 -162827 -67978 128965 276007 339114 312101 271280 121290
21691 121290 -9858 -70781 -162096 -160262 -157036 -171817 -185115 -74655 15545 92912 62839
21680 62839 -40860 94994 205835 145590 63418 98260 24341 -202571 -235688 -106954 -107434
21669 -107434 -86702 -33087 -20089 -30447 -21315 -84174 -143670 -125761 -79052 110265 188110
21658 188110 102615 162597 62183 -96273 -57287 -50201 34375 125549 -113132 -117349 -105154
21647 -105154 -27202 -10690 -5620 55464 17130 -140704 -80285 -3804 -106068 -277474 -271101
21636 -271101 -329194 -226329 -199196 -192710 -142609 -142444 -53444 2702 88674 32768 16941 204804
$$ packed form
21712g5064L7509J86302m5394q5030l7849o1453M0370o5204j12660J32102K32645
21701A46274j13166k3936j71999R4849J96943J47042O3107k7013m0821j49990
21691A21290j31148o0923r1315J834L226j4781j3298J10460R0200P7367l0073
21680F2839j03699J35854J10841o0245q2172L4842p3919k26912l3117J28734m80
21669a07434K0732N3615J2998j0358R132o2859n9496J7909M6709J89317P7845
21658A88110q5495N9982j00414j58456L8986P086Q4576R1174k38681m217J2195
21647a05154P7952J6512N070O1084l8334j57834O0419P6481j02264j71406O373
21636b71101n8093J02865K7133O486N0101J65Q9000N6146Q5972n5906j5827J87863
$$ plain form
21624 204804 225065 106645 80894 63904 40219 -86702 -81943 12888 -109073 -187806 -58745
21613 -58745 -26833 -1041 102521 173968 251386 266667 128854 77011 162495 143619 156807
21602 156807 145128 49328 9188 42009 54422 95525 66361 -972 4883 134919 218980
21591 218980 111417 123589 -25195 15811 120423 108916 127130 252904 210871 187183 13716
21580 13716 -28277 45857 -105454 -157353 -162918 -151442 -60529 20752 -51588 -91949 -82772 26793
21568 26793 170630 310782 220719 97437 80185 187009 178070 136963 83210 -81952 -77495
21557 -77495 171816 271973 236511 103431 55415 53859 -24837 31214 51255 71907 -23256
21546 -23256 -78050 -97749 -27301 264309 377979 243352 193228 75188 -79881 -140769 -28278
$$ packed form
21624B04804K0261j18420k5751j6990k3685j26921M759R4831j21961p8733J29061
21613e8745L1912K5792J03562P1447P7418J5281j37813n1843Q5484j8876J3188
21602A56807j1679r5800m0140L2821J2413M1103k9164o7333N855J30036Q4061
21591B18980j07563J2172j48784M1006J04612j1507J8214J25774m2033k3688j73467
21580A3716m1993P4134j51311n1899n565J1476R0913Q1281p2340m0361R177J09565
21568B6793J43837J40152r0063j23282j7252J06824q939m1107n3753j65162M457
21557g7495K49311J00157l5462j33080m8016j556p8696N6051K0041K0652r5163
21546b3256n4794j9699P0448K91610J13670j34627n0124j18040j55069o0888J12491
$$ plain form
21535 -28278 154709 197803 41098 -29400 61807 2672 -6590 -4537 9125 82063 84934 84004
21523 84004 69644 -32678 53216 302985 239150 93684 120467 145247 141869 569 -156589
21512 -156589 -159677 -67808 22992 115897 52519 -36941 81944 3808 -85588 -263880 -200632
21501 -200632 740 100583 98970 -10353 31540 58416 100273 135288 114672 67703 -20923
21490 -20923 124828 178224 116847 -109043 -91077 -9583 -65154 -90792 -71749 -98925 -76394
21479 -76394 -18358 36774 116694 -80965 -109665 -131832 -40897 61587 -38466 -72239 -58189
21468 -58189 144333 65402 -87155 -142525 -35281 47364 -77180 64747 54670 -83167
21458 -83167 -2 131517 299710 224884 144968 117013 95173 190203 112918 33529 -11410
$$ packed form
21535b8278J82987M3094j56705p0498R1207n9135r262K053J3662P2938K871r30
21523H4004j4360j02322Q5894K49769o3835j45466K6783K4780l378j41300j57158
21512a56589l088R1869R0800R2905o3378q9460J18885p8136q9396j78292O3248
21501b00632K01372R9843j613j09323M1893K6876M1857L5015k0616m6969q8626
21490b0923J45751N3396o1377k25890J7966Q1494n5571k5638J9043k7176K2531
21479g6394N8036N5132P9920j97659k8700k2167R0935J02484j00053l3773J4050
21468e8189K02522p8931j52557n5370J07244Q2645j24544J41927j0077j37837
21458h3167Q3165J31519J68193p4826p9916k7955k1840R5030p7285p9389m4939
$$ plain form
21447 -11410 -65542 -190682 -131680 -106374 -200199 -140925 -116433 -62247 66389 43061 -152413
21436 -152413 -161913 -171594 -60849 36694 154705 109829 165942 253857 334702 273226 182801
21425 182801 139559 203435 244669 199364 183769 91106 27563 155470 150958 -99572 -221666
21414 -221666 -180819 -46439 117302 135491 90746 -71210 -163854 -28825 20662 74706 151763
21403 151763 80727 175474 130462 158309 123360 271339 252983 157488 34828 2547 -66413
21392 -66413 -89146 -222464 -232270 -197506 -84271 -46098 -150692 -179819 -72020 32808 125146
21381 125146 178595 165658 119110 139819 98791 255651 203411 153297 133977 58265 -17097
21370 -17097 -41123 -11885 184016 326998 260894 268978 360974 375237 156271 94146 43480
$$ packed form
21447a1410n4132j25140N9002K5306r3825N9274K4492N4186J28636k3328j95474
21436a52413r500r681J10745R7543J18011m4876N6113Q7915Q0845o1476r0425
21425A82801m3242O3876M1234m5305j5595r2663o3543J27907m512k50530j22094
21414b21666M0847J34380J63741J8189m4745j61956r2644J35029M9487N4044P7057
21403A51763p1036R4747m5012K7847l4949J47979j8356r5495j22660l2281o8960
21392f6413k2733j33318r806L4764J13235L8173j04594k9127J07799J04828R2338
21381A25146N3449j2937m6548K0709m1028J56860n2240n0114j9320p5712p5362
21370a7097k4026K9238J95901J42982o6104Q084R1996J4263k18966o2125n0666
$$ plain form
21359 43480 81691 -108107 -100301 -159814 -283931 -338062 -258802 -137680 91642 164063 167976
21348 167976 253126 360064 359192 117946 135769 238996 153032 185536 -61548 -184587 -104029
21337 -104029 -35201 -8048 6631 87829 -332 -41226 -154897 -80176 99452 116779 164693
21326 164693 183066 92734 140060 200643 281692 204222 259439 273115 209793 173667 183938
21315 183938 116319 59029 176357 362906 195250 88152 106471 67848 290700 379541
21305 379541 224453 13737 -98610 -98866 82123 253903 164463 184966 175933 290359 250737
21294 250737 284401 224650 208050 126021 -66662 -136453 -155220 -25818 261068 485904 624357
21283 624357 669417 800793 867612 997824 1229043 1317751 1328457 1270677 1207267 995134 925530
$$ packed form
21359D3480L8211j89798P806n9513j24117n4131P9260J21122K29322P2421L913
21348A67976Q5150J06938q72k41246J7823J03227q5964L2504k47084j23039Q0558
21337a04029O8828K7153J4679Q1198q8161m0894j13671P4721J79628J7327M7914
21326A64693J8373r0332M7326O0583Q1049p7470N5217J3676o3322l6126J0271
21315A83938o7619n7290J17328J86549j67656j07098J8319l8623K22852Q8841
21305C79541j55088k10716j12347k56J80989J71780q9440K0503r033J14426l9622
21294B50737L3664n9751j6600q2029j92683o9791j8767J29402K86886K24836J38453
21283F24357M5060J31376O6819J30212K31219Q8708J0706n7780o3410k12133o9604
$$ plain form
21272 925530 847108 818397 825849 785088 990617 1193193 1233528 1207058 1124225 1083986 1117192
21261 1117192 1225227 1108822 841108 714871 646948 496936 505007 548438 612318 693555
21251 693555 668369 467946 582338 526560 470683 231698 173173 329570 358647 449838 537593
21240 537593 493972 356237 262414 282615 520465 452031 413021 425549 449517 519730 454062
21229 454062 338100 247181 276675 297143 241806 182347 274603 264862 285001 228778 211049
21218 211049 217524 80303 92021 132841 249649 203480 223319 225467 175281 103160 104766 177663
21206 177663 165946 89375 80330 73878 95492 280349 391974 297266 161328 246797 370948
21195 370948 374810 282540 143973 171720 290260 209802 228210 210454 33355 72836 207086
$$ packed form
21272I25530p8422k8711P452m0761K05529K02576M0335k6470q2833m0239L3206
21261A117192J08035j16405k67714j26237o7923j50012Q071M3431O3880Q1237
21251F93555k5186k00423J14392n5778n5877k38985n8525J56397K9077R1191Q7755
21240E37593m3621j37735r3823K0201K37850o8434l9010J2528K3968P0213o5668
21229D54062j15962r0919K9494K0468n5337n9459R2256r741K0139n6223j7729
21218B11049O475j37221J1718M0820J16808m6169J9839K148n0186p2121J606P2897
21206A77663j1717p6571r045o452K1614J84857J11625r4708j35938Q5469J24151
21195C70948L862r2270j38567K7747J18540q0458J8408j7756j77099L9481J34250
$$ plain form
21184 207086 233887 245673 413741 437001 335446 124686 157836 178617 123053 180476 310080
21173 310080 359798 314795 332468 144031 119283 229082 242983 167769 59351 -36312 -23415
21162 -23415 78760 75283 16719 76347 99845 99513 144635 204810 168321 298882 327875 335698
21150 335698 382189 219445 244795 289240 170226 275013 364343 349857 284979 439523 658456
21139 658456 718759 629182 591119 662731 832674 955276 885830 692636 569087 517739 556353
21128 556353 450818 258234 202490 319403 478001 363264 163654 314011 451223 520119
21118 520119 445049 260704 237279 314061 510531 699367 821853 741255 652633 665608 622707
21107 622707 481803 631271 707296 784641 974207 1193828 1257016 1055596 1160774 1181304
$$ packed form
21184B07086K6801J1786J68068K3260j01555k10760L3150K0781n5564N7423J29604
21173C10080M9718m5003J7673j88437k4748J09799J3901p5214j08418r5663J2897
21162b3415J02175l477n8564N9628K3498l32M5122O0175l6489J30561K8993P823
21150C35698M6491j62744K5350M4445j19014J04787Q9330j4486o4878J54544K18933
21139F58456O0303q9577l8063P1612J69943J22602o9446j93194j23549n1348L8614
21128E56353j05535j92584n5744J16913J58598j14737j99610J50357J37212O8896
21118E20119p5070j84345k3425P6782J96470J88836J22486q0598q8622J2975m2901
21107F22707j40904J49468P6025P7345J89566K19621O3188k01420J05178K0530
$$ plain form
21097 1181304 1099530 970583 1002794 1020886 814987 643117 816220 1082429 1307493 1379050
21087 1379050 1419485 1522542 1638560 1597051 1505267 1456068 1266599 996663 947104 975450
21077 975450 1024305 994963 884619 749785 977628 987573 770839 684609 690917 796015 779703
21066 779703 754429 679399 691146 565567 366032 285045 104585 154825 257018 259269 243195
21055 243195 366671 581312 547536 362068 194233 214805 443151 593608 487132 515660
21045 515660 428905 358916 278927 363017 378460 332482 365471 387552 559780 757823 537523
21034 537523 332633 277025 407150 598345 636163 495503 279243 412268 589798 494055
21024 494055 401314 390655 340502 336994 353486 483369 467370 390542 324319 433025 351646
$$ packed form
21097A181304q1774j28947L2211J8092k05899j71870J73103K66209K25064P1557
21087A379050M0435J03057J16018m1509r1784m9199j89469k69936m9559K8346
21077I75450M8855k9342j10344j34834K27843R945k16734q6230O308J05098j6312
21066G79703k5274p5030J1747j25579j99535q0987j80460N0240J02193K251j6074
21055B43195J23476K14641l3776j85468j67835K0572K28346J50457j06476K8528
21045E15660q6755o9989p9989Q4090J5443m5978L2989K2081J72228J98043k20300
21034E37523k04890n5608J30125J91195L7818j40660k16260J33025J77530r5743
21024D94055r2741j0659n0153l508J6492J29883j5999p6828o6223J08706q1379
$$ plain form
21013 351646 258299 481922 520278 445630 444181 483484 376524 426876 425480 469127 526542
21002 526542 489894 615539 486059 360889 369718 451405 465762 490368 599601 575546 470087
20991 470087 470012 483615 449684 480360 466356 386664 242513 305363 281511 200361 247610 415653
20979 415653 550055 587275 604218 512081 609786 592335 358922 310145 404900 442603 564272
20968 564272 540198 461569 322358 196542 203785 356394 355254 355523 536971 795203 848770
20957 848770 672137 574180 575566 585252 494007 475157 546728 643728 679277 728816 737236 615222
20945 615222 615002 730269 788706 947557 1151648 1177630 1234853 1371351 1532621 1550077 1449759
20934 1449759 1347736 1250723 1192790 1124004 1134620 1032281 956784 849633 879938 888630 874827
$$ packed form
21013C51646r3347K23623L8356p4648j449L9303j06960N0352j396M3647N7415
21002E26542l6648J25645j29480j25170Q829Q1687J4357K4606J09233k4055j05459
20991D70087p5J3603l3931L0676j4004p9692j44151O2850k3852q1150M7249J68043
20979D15653J34402L7220J6943r2137R7705j7451k33413m8777R4755L7703J21669
20968E64272k4074p8629j39211j25816P243J52609j140K69J81448K58232N3567
20957H48770j76633r7957J386R686r1245j8850P1571R7000L5549M9539Q420j22014
20945F15222k20J15267N8437J58851K04091K5982N7223J36498J61270J7456j00318
20934A449759j02023r7013n7933o8786J0616j02339p5497j07151L0305Q692j3803
$$ plain form
20923 874827 904395 917406 770113 744414 829225 743876 456757 438757 443244 483381 537190
20912 537190 509873 550269 553844 646275 730167 779517 750566 704788 659827 751629 778669 817998
20900 817998 920405 753812 605586 657571 649894 628960 536215 436390 529019 578170 627503
20889 627503 575316 604031 704679 647056 600316 504804 473047 614584 661979 795053 843888
20878 843888 850463 846554 992970 909839 821467 728215 696488 668575 615613 627743 662832 678807
20866 678807 551257 542120 628970 511890 457932 468467 632544 621105 667083 740270 621627
20855 621627 775505 853108 818907 708685 619572 630051 609519 552963 649088 613784 706977
20844 706977 1038623 1140703 1128770 1166382 1184242 1184910 1237915 1252082 1114904 978420 1067238
$$ packed form
20923H74827K9568J3011j47293k5699Q4811q5349k87119j8000M487M0137N3809
20912E37190k7317M0396L575R2431Q3892M9350k8951m5778m4961R1802K7040L9329
20900H17998J02407j66593j48226N1985p677k0934r2745r9825R2629M9151M9333
20889F27503n2187K8715J00648n7623m6740r5512l1757J41537M7395J33074M8835
20878H43888O575l909J46416q3131q8372r3252l1727k7913n2962J2130L5089J5975
20866F78807j27550r137Q6850j17080n3958J0535J64077j1439M5978P3187j18643
20855F21627J53878P7603l4201j10222q9113J0479k0532n6556R6125l5304R3193
20844G06977L31646J02080j1933L7612J7860O68N3005J4167j37178j36484Q8818
$$ plain form
20833 1067238 1119470 1111277 1178848 1187279 1250909 1283020 1314454 1432744 1573512 1676752 1585908
20822 1585908 1351622 1296812 1384366 1597343 1695878 1620825 1644444 1816342 1677274 1608069
20812 1608069 1555300 1522910 1425220 1366476 1250178 1272363 1388597 1453092 1494977 1328693 1288005
20801 1288005 1270196 1295346 1353536 1354840 1393888 1571676 1393170 1158355 1256434 1362223 1588849
20790 1588849 1697119 1648747 1657784 1823866 1629370 1585786 1640473 1512048 1449353 1575875
20780 1575875 1746963 1963750 1981291 2112491 2120470 2016225 2187936 2258757 2130326 1994097
20770 1994097 2075648 2126577 2269065 2456264 2558660 2530026 2382529 2342562 2369100 2409408
20760 2409408 2638222 2875995 2943896 2904553 2651855 2353775 2324176 2499675 2672379 2791981
$$ packed form
20833A067238N2232q193O7571Q431O3630L2111L1434J18290J40768J03240r0844
20822A585908k34286n4810Q7554K12977R8535p5053K3619J71898j39068o9205
20812A608069n2769l2390r7690n8744j16298K2185J16234O4495M1885j66284m0688
20801A288005j7809K5150N8190J304L9048J77788j78506k34815R8079J05789K26626
20790A588849J08270m8372R037J66082j94496m3584N4687j28425o2695J26522
20780A575875J71088K16787J7541J31200P979j04245J71711P0821j28431j36229
20770A994097Q1551N0929J42488J87199J02396k8634j47497l9967K6538M0308
20760B409408K28814K37773O7901l9343k52698k98080k9599J75499J72704J19602
$$ plain form
20750 2791981 2856884 2927675 3025974 3172572 3283835 3300741 3301490 3428503 3518841 3514729 3712536
20739 3712536 3865408 4055629 3995423 4162288 4364907 4517285 5095193 5697273 6153607 6380223
20729 6380223 6497739 6578781 6552262 6441496 6341219 6222920 6123069 6215093 6507435 6834388
20719 6834388 7274311 8002911 8671284 9204906 9682502 10211549 10721220 11062531 11446402
20710 11446402 11947554 12537466 13458859 14909279 16658968 18991130 22195818 26690257
20702 26690257 32801745 41013402 52626166 69576877 93703829 125719300 162360057
20695 162360057 193629549 211171897 215953481 206496846 182801687 155738610 134152809
20688 134152809 119577271 112061561 111844259 119039430 134983470 160537831 195225213
$$ packed form
20750B791981O4903P0791R8299J46598J11263J6906P49J27013R0338m112J97807
20739C712536J52872J90221o0206J66865K02619J52378N77908O02080M56334K26616
20729F380223J17516Q1042k6519j10766j00277j18299r9851R2024K92342L26953
20719F834388M39923P28600O68373N33622M77596N29047N09671L41311L83871
20710A1446402N01152N89912R21393J450420J749689K332162L204688M494439
20702B6690257O111488Q211657J1612764J6950711K4126952L2015471L6640757
20695A62360057L1269492J7542348M781584r456635k3695159k7063077k1585801
20688A34152809j4575538p515710k17302P195171J5944040K5554361L4687382
$$ plain form
20681 195225213 232787317 260238967 271280378 267413476 245624037 210003306 173902318
20674 173902318 144475548 122001137 104993450 92614796 83425225 76436418 71132584
20667 71132584 66834212 63090112 59287543 55731053 52679474 50064060 47969002 46260732
20659 46260732 44521736 42839274 41385670 39884877 38343350 36957934 35740019 34628907
20651 34628907 33334373 32040892 30533186 28942659 27698380 26714369 26050953 25341398
20643 25341398 24354644 23247266 21994108 20662757 19204659 17715226 16537103 15622693
20635 15622693 14819656 14161358 13599393 13524666 13663688 13645211 13453407 12838630 12200326 11652807
20625 11652807 10925262 10247169 9624907 9111955 8659477 8191409 7699079 7417365 7344869
$$ packed form
20681A95225213L7562104K7451650J1041411l866902k1789439l5620731l6100988
20674A73902318k9426770k2474411j7007687j2378654r189571o988807n303834
20667G1132584m298372l744100l802569l556490l051579k615414k095058j708270
20659D6260732j738996j682462j453604j500793j541527j385416j217915j111112
20651C4628907j294534j293481j507706j590527j244279r84011o63416p09555
20643B5341398r86754j107378j253158j331351j458098j489433j178123r14410
20635A5622693q03037o58298n61965p4727J39022j8477j91804o14777o38304n47519
20625A1652807p27545o78093o22262n12952m52478m68068m92330k81714p2496
$$ plain form
20616 7344869 7076025 6657609 6449513 6366280 6133196 5917143 5753329 5686735 5600457 5433135
20606 5433135 5320796 5224245 5177753 4889746 4671515 4664144 4487564 4464362 4606988 4646411
20596 4646411 4574518 4783261 4654813 4508185 4372838 4245204 4269901 4073040 3915123 3738126
20586 3738126 3751517 3821939 3821454 3760557 3557763 3485370 3571715 3716944 3803517 3943003 4111243
20575 4111243 4344340 4585388 4990420 5475597 5940834 6077502 6149867 5968610 5761352 5450612
20565 5450612 5109160 5012373 5086035 5141469 5118618 5248549 5445871 5564285 5984758 6118818
20555 6118818 6402171 6383205 6253694 6254348 6532624 6962655 7157524 7366302 7562350 7794162
20545 7794162 7863467 7865392 7796979 7781811 7694632 7661897 7766725 7990138 8351272 8965534 9367707
$$ packed form
20616G344869k68844m18416k08096q3233k33084k16053j63814o6594q6278j67322
20606E433135j12339r6551m6492k88007k18231p371j76580k3202J42626L9423
20596D646411p1893K08743j28448j46628j35347j27634K4697j96861j57917j76997
20586C738126J3391P0422m85o0897k02794p2393Q6345J45229Q6573J39486J68240
20575D111243K33097K41048M05032M85177M65237J36668P2365j81257k07258l10740
20565E450612l41452r6787P3662N5434k2851J29931J97322J18414M20473J34060
20555F118818K83353j8966j29511O54K78276M30031J94869K08778J96048K31812
20545G794162O9305J925o8413j5168q7179l2735J04828K23413L61134O14262M02173
$$ plain form
20534 9367707 9834917 10249658 10775877 11316664 11613613 11839325 12134049 12404589 12799923
20525 12799923 13419503 14304732 15410162 17285477 19830704 23303303 27838841 33839099
20517 33839099 42286972 54506413 71918109 96483234 129848238 170848609 211134344
20510 211134344 237556713 248051597 243426437 220438327 187871801 158822622 137557588
20503 137557588 123786894 117675975 119679565 129812149 148196573 174479299 206082467
20496 206082467 232922893 245557811 245486383 231400757 202705162 169944242 142228451
20489 142228451 120771024 104491901 92528096 83791090 77276740 72014288 67437535
20482 67437535 63445498 59568321 55817396 52435162 49567614 47053209 44713238 42757780
$$ packed form
20534I367707M67210M14741N26219N40787K96949K25712K94724K70540L95334
20525A2799923O19580Q85229J105430J875315K545227L472599M535538O000258
20517C3839099Q447873J2219441J7411696K4565125L3365004M1000371M0285735
20510B11134344K6422369J0494884m625160k2988110l2566526k9049179k1265034
20503A37557588j3770694o110919K003590J0132584J8384424K6282726L1603168
20496B06082467K6840426J2634918p1428j4085626k8695595l2760920k7715791
20489A42228451k1457427j6279123j1963805q737006o514350n262452m576753
20482F7437535l992037l877177l750925l382234k867548k514405k339971j955458
$$ plain form
20474 42757780 41178115 39713258 38215334 36799894 35404019 34329479 33255262 32041048
20466 32041048 30717631 29074594 27448976 26084239 24815396 23824273 22933921 22094183
20458 22094183 21259703 20312118 19307120 18487353 17808362 17141513 16710567 16354331 16241308
20449 16241308 16201103 15966602 15752842 15441831 15109760 14578506 14008179 13319247 12669637
20440 12669637 11971959 11412834 11225339 11060114 11094113 11347081 11757171 12010029 12106616 12025506
20430 12025506 11748997 11287592 10815951 10390737 9777451 9309483 8516410 7662345 7059459
20421 7059459 6437429 5807978 5396426 5000424 4686297 4308315 4023107 3847430 3935888 4011708
20411 4011708 3954151 3888662 3653137 3339665 3317457 3310775 3151843 2847517 2591087 2334193
$$ packed form
20474D2757780j579665j464857j497924j415440j395875j074540j074217j214214
20466C2041048j323417j643037j625618j364737j268843r91123q90352q39738
20458B2094183q34480r47585j004998q19767o78991o66849m30946l56236j13023
20449A6241308m0205k34501k13760l11011l32071n31254n70327o88932o49610
20440A2669637o97678n59125j87495j65225L3999K52968M10090K52858R6587q1110
20430A2025506k76509m61405m71641m25214o13286m67968p93073q54065o02886
20421G059459o22030o29451m11552l96002l14127l77982k85208j75677Q8458P5820
20411D011708n7557o5489k35525l13472k2208o682j58932l04326k56430k56894
$$ plain form
20401 2334193 2184344 2123875 2096083 1948311 1843728 1785177 1821247 1791876 1829131 1709925
20391 1709925 1624430 1484549 1338581 1355020 1415996 1479796 1251422 1212703 1229705 1222623 1198119
20380 1198119 1115051 1076906 1056292 1010251 883835 890155 890710 876115 740659 720953 779450
20369 779450 905281 1041758 949967 833075 793669 864176 901581 890923 1024277 951629 794849
20358 794849 726315 722007 781529 884950 846045 862708 896610 967377 1106819 1105334 1050087
20347 1050087 990620 858404 765980 710834 798708 833091 836295 927577 938373 1087537 1147719
20336 1147719 1198092 1208614 1342160 1213917 1058847 1095567 1062305 977848 902261 936546 919446
20325 919446 959443 974153 1051806 1082500 895517 796887 761724 817433 816559 717673 746640 691536
$$ packed form
20401B334193j49849o0469k7792j47772j04583n8551L6070k9371L7255j19206
20391A709925q5495j39881j45968J6439O0976O3800k28374l8719J7002p082k4504
20380A198119q3068l8145k0614m6041j26416O320N55j4595j35456j9706N8497
20369G79450J25831J36477r1791j16892l9406P0507L7405j0658J33354p2648j56780
20358G94849o8534m308N9522J03421l8905J6663L3902P0767J39442j485n5247
20347A050087n9467j32216r2424n5146Q7874L4383L204R1282J0796J49164O0182
20336A147719N0373J0522J33546j28243j55070L6720l3262q4457p5587L4285j7100
20325I19446L9997J4710P7653L0694j86983r8630l5163N5709q74r8886K8967n5104
$$ plain form
20313 691536 653539 678166 765161 639967 546354 652191 663429 519850 507314 308527 230562
20302 230562 226133 35823 195502 475251 768086 862446 976353 944857 727524 664093
20292 664093 595919 633216 578327 560658 620386 577290 637081 601906 516460 379077 360456
20281 360456 403360 182074 118186 306499 317420 307492 317752 257380 258707 313253 407583
20270 407583 302364 224550 243553 238837 238896 243009 265368 168157 119903 92437 121056 127936
20258 127936 19703 21697 23624 82517 165254 258606 366830 317269 442623 588847 462029
20247 462029 536622 638497 1063499 1616989 1682005 1658124 1566058 1559807 1358169 1314566 1441964
20236 1441964 1600266 1734310 1972233 2170826 2452353 3096061 3839519 4463567 4745012
$$ packed form
20313F91536l7997K4627Q6995j25194r3613J05837J1238j43579j2536j98787p7965
20302B30562m429j90310J59679K79749K92835R4360J13907l1496k17333o3431
20292F64093o8174L7297n4889j7669N9728m3096N9791l5175q5446j37383j8621
20281C60456M2904k21286o3888J88313J0921r928J0260o0372J327N4546R4330
20270D07583j05219p7814J9003m716N9M113K2359r7211m8254k7466K8619O880
20258A27936j08233J994J927N8893Q2737R3352J08224m9561J25354J46224j26818
20247D62029P4593J01875M25002N53490O5016k3881r2066o251k01638m3603J27398
20236A441964J58302J34044K37923J98593K81527O43708P43458O24048K81445
$$ plain form
20227 4745012 4927142 4916757 4765606 4692365 4566456 4483927 4636812 4894364 4921216 4689773
20217 4689773 4313076 4056776 3719749 3330891 3025181 2617089 2192468 1988943 1982983 1982518
20207 1982518 2114581 2252966 2411754 2466123 2868697 3312829 3765509 4260643 4724253 4874292
20197 4874292 4807150 4626667 4407851 4214406 4308211 4760737 5143241 5324852 5178855 5035180
20187 5035180 4679290 4300234 3866884 3448115 2965750 2567399 2295521 2149107 1983613
20178 1983613 1815299 1604552 1538383 1541792 1640609 1494444 1396916 1395951 1435610 1284110 1160606
20167 1160606 1154124 1248690 1082727 1015015 1116424 1058279 872058 897224 902602 729323 596351
20156 596351 696812 665177 497277 436416 524129 517365 461449 486428 625971 777631 804764
$$ packed form
20227D745012J82130j0385j51151p3241j25909q2529J52885K57552K6852k31443
20217D689773l76697k56300l37027l88858l05710m08092m24621k03525n960m65
20207A982518J32063J38385J58788N4369M02574M44132M52680M95134M63610J50039
20197D874292o7142j80483k18816j93445R3805M52526L82504J81611j45997j43675
20187E035180l55890l79056m33350m18769m82365l98351k71878j46414j65494
20178A983613j68314k10747o6169L409R8817j46165r7528r65L9659j51500j23504
20167A160606o482R4566j65963o7712J01409n8145j86221K5166N378j73279j32972
20156E96351J00461l1635j67900o0861Q7713o764n5916K4979J39543J51660K7133
$$ plain form
20145 804764 683793 718034 739586 955593 1293353 1564658 1918939 2073921 2261337 2200425
20135 2200425 2008179 1799178 1572305 1212492 926167 796615 779510 842466 841268 765310
20125 765310 612223 402830 335442 418663 426495 419863 284760 260026 270389 252610 239232
20114 239232 378996 517950 495445 484376 549411 691370 785992 837482 788777 819060 947437
20103 947437 977721 1012907 1165330 1274772 1230525 1031242 1059338 956884 914120 1036254
20093 1036254 1095588 884844 925328 916710 950662 1057988 1061976 971316 1034908 934602 765805
20082 765805 682872 642669 643732 591072 453883 171263 177832 243762 268306 201986 267926
20071 267926 300276 311322 294942 239719 224441 232939 82274 105636 173495 126899 204351
$$ packed form
20145H04764j20971L4241K1552K16007L37760K71305L54281J54982J87416o0912
20135B200425j92246k09001k26873l59813k86325j29552j7105O2956j198p5958
20125G65310j53087k09393o7388Q3221P832o632j35103k4734J0363j7779j3378
20114B39232J39764J38954k2505j1069O5035J41959R4622N1490m8705L0283J28377
20103I47437L0284L5186J52423J09442m4247j99283K8096j02454m2764J22134
20093A036254N9334k10744M0484q618L3952J07326L988r0660O3592j00306j68797
20082G65805q2933m0203J063n2660j37189k82620O569O5930K4544o6320O5940
20071B67926L2350J1046j6380n5223j5278Q498j50665K3362O7859m6596P7452
$$ plain form
20060 204351 150485 37427 -25402 -168922 -125352 59522 61319 -15981 -10365 83440 85939
20049 85939 30722 248131 280974 139133 217394 314917 81903 298404 477588 503905 392617
20038 392617 263688 170205 208043 217426 81241 -30876 -20219 29861 96248 203216 217937
20027 217937 215864 198194 87818 -25706 6018 22103 -68910 -188452 -243610 -210275 -270964
20016 -270964 -293417 -164691 -172379 -101273 6524 84139 17085 -26205 21850 25823 76530
20005 76530 51260 168198 217266 136900 184146 192127 96863 29197 51695 161959 161076 165734
19993 165734 301536 303990 187821 89525 91701 201365 150932 173296 230554 316114 341422
19982 341422 358719 402586 371054 278745 409676 461565 381679 376613 264770 92618 75275
$$ packed form
20060B04351n3866j13058o2829j43520M3570J84874J797p7300N616R3805K499
20049H5939n5217K17409L2843j41841P8261R7523k33014K16501J79184K6317j11288
20038C92617j28929r3483L7838R383j36185j12117J0657N0080O6387J06968J4721
20027B17937k073j7670j10376j13524L1724J6085r1013j19542n5158L3335o0689
20016b70964k2453J28726p688P1106J07797P7615o7054m3290M8055L973N0707
20005G6530k5270J16938M9068q0366M7246P981r5264o7666K2498J10264q83M658
19993A65734J35802K454j16169r8296K176J09664n0433K2364N7258Q5560K5308
19982C41422J7297M3867l1532r2309J30931N1889p9886n066j11843j72152j7343
$$ plain form
19971 75275 106921 89164 91254 -11765 119282 160011 36498 4268 21491 59108 76983
19960 76983 65882 -129502 -273647 -133990 -6858 27059 102276 134472 -2300 6209 25022
19949 25022 -28353 -7830 95781 95610 110819 100684 61418 97325 65846 -79336 -31565 75057
19937 75057 45187 47522 -29941 -145670 -61079 65149 77421 134995 219921 245586 225985
19926 225985 158678 13272 42374 87618 125155 225779 248508 250157 347970 624742 822355
19915 822355 883620 994144 1071423 1051286 1105528 1006735 857751 709233 742875 654478 653141
19904 653141 761951 820538 731618 770783 989141 1128249 1166869 1208267 974471 762657
19894 762657 460401 329059 460753 465951 516538 410443 279105 183746 236405 338240
$$ packed form
19971G5275L1646j7757K090j03019J31047M0729j23513l2230J7223L7617J7875
19960G6983j1101j95384j44145J39657J27132L3917P5217L2196j36772Q509J8813
19949B5022n3375K0523J03611j71J5209j0135l9266L5907l1479j45182M7771J06622
19937G5057k9870K335p7463j15729Q4591J26228J2272N7574Q4926K5665j9601
19926B25985o7307j45406K9102M5244L7537J00624K2729J649R7813K76772J97613
19915H22355O1265J10524P7279k0137N4242r8793j48984j48518L3642q8397j337
19904F53141J08810N8587q8920L9165K18358J39108L8620M1398k33796k11814
19894G62657l02256j31342J31694N198N0587j06095j31338r5359N2659J01835
$$ plain form
19884 338240 471763 427198 441118 373247 363770 364059 478504 592015 663317 753197 695679
19873 695679 640296 692577 565259 490244 509043 378260 200253 107273 34716 79761 153808
19862 153808 272176 391826 149316 127817 224334 192193 162190 5859 -193138 -154532
19852 -154532 -79066 -976 -3454 45448 -150 -78574 88497 252741 160681 85046 50232
19841 50232 327341 483006 484969 523831 567520 546968 455720 410684 388382 515762 494243
19830 494243 361679 287107 351499 442930 519939 494732 534276 467530 328622 147976 34813
19819 34813 9498 103032 174131 139746 26626 24883 120638 317502 418408 480029 451033
19808 451033 392250 171244 65456 180215 201781 180698 198472 311224 359680 172946
$$ packed form
19884C38240J33523m4565J3920o7871r477K89J14445J13511P1302Q9880n7518
19873F95679n5383N2281j27318p5015J8799j30783j78007r2980p2557M5045P4047
19862A53808J18368J19650k42510k1499R6517l2141l0003j56331j98997L8606
19852a54532P5466P8090k478M8902m5598p8424J67071J64244r2060p5635l4814
19841E0232K77109J55665J963L8862M3689k0552r1248m5036k2302J27380k1519
19830D94243j32564p4572O4392R1431P7009k5207L9544o6746j38908j80646j13163
19819C4813k5315R3534P1099l4385j13120j743R5755J96864J00906O1621k8996
19808D51033n8783k21006j05788J14759K1566k1083J7774J12752M8456j86734
$$ plain form
19798 172946 122456 61490 -116616 -14142 25633 -158780 -309437 -219802 -19575 -105021
19788 -105021 -195750 -37079 78121 49918 -75397 -130711 24540 266908 334025 246153
19778 246153 47013 51638 262445 317216 257045 253039 386385 314169 373627 460169 465522
19767 465522 504660 555758 639620 431401 195570 132501 134131 234103 400129 361340 145104
19756 145104 151677 269216 256205 204798 127296 177707 390620 548037 692480 775168 883895
19745 883895 898822 796018 853775 785517 668691 600902 599627 370175 306146 313333 313577 345896
19733 345896 402196 417428 431558 360654 325364 68271 12493 57161 48289 264584 379227
19722 379227 215903 291124 612963 637508 475360 428928 319489 250871 245390 294614 408939
$$ packed form
19798A72946n0490o0966j78106J02474L9775j84413j50657Q9635K00227q5446
19788a05021r0729J58671J15200k8203j25315n5314J55251K42368O7117q7872
19778B46153j99140M625K10807N4771o0171m006J33346p2216N9458Q6542N353
19767D65522L9138N1098Q3862k08219k35831o3069J630R9972J66026l8789k16236
19756A45104O573J17539j3011n1407p7502N0411K12913J57417J44443Q2688J08727
19745H83895J4927j02804N7757o8258j16826o7789j275k29452o4029P187K44L2319
19733C45896N6300J5232J4130p0904l5290k57093n5778M4668q872K16295J14643
19722C79227j63324P5221L21839K4545j62148m6432j09439o8618n481M9224J14325
$$ plain form
19711 408939 546711 598286 651997 546261 559438 778956 894251 923428 886912 1075280
19701 1075280 1254503 1269681 1314287 1223776 1111407 1032499 842405 763024 756166 772337 738466
19690 738466 743813 706646 446681 377109 469331 680142 785585 819477 803535 771119 812898
19679 812898 939616 768263 667152 705327 882493 1007973 919573 885111 868250 761192
19669 761192 697668 944610 1015398 1044630 1161267 1191303 1267837 1271655 1273477 1290684 1246422
19658 1246422 1064942 1193350 1381473 1242763 1423936 1598346 1550022 1495277 1359931 1345379
19648 1345379 1264362 1143466 1210386 1416937 1441638 1294388 1330983 1375423 1570206 1597756
19638 1597756 1610017 1685467 1737598 1609056 1427549 1561482 1654043 1683975 1812896 1869832
$$ packed form
19711D08939J37772N1575N3711j05736J3177K19518J15295K9177l6516J88368
19701A075280J79223J5178M4606r0511j12369p8908j90094p9381o858J6171l3871
19690G38466N347l7167k59965o9572R2222K10811J05443L3892j5942l2416M1779
19679H12898J26718j71353j01111L8175J77166J25480q8400l4462j6861j07058
19669G61192o3524K46942P0788K9232J16637L0036P6534L818J822J7207m4262
19658A246422j81480J28408J88123j38710J81173J74410m8324n4745j35346j4552
19648A345379q1017j20896O6920K06551K4701j47250L6595M4440J94783K7550
19638A597756J2261P5450N2131j28542j81507J33933R2561K9932J28921N6936
$$ plain form
19628 1869832 1915763 1927812 1931931 1925655 1945717 2148577 2365194 2542098 2665585 2558407 2542401
19617 2542401 2853014 3193243 3470370 3693196 4077837 4528539 5164690 5864462 6357231
19608 6357231 6592125 6734837 6721408 6664109 6685054 6634989 6917918 7434878 7881898 8542594
19598 8542594 9511516 10773157 12338967 14226553 17074167 20452513 24517510 29610643
19590 29610643 35768384 43574483 54364475 69949969 94119821 132132171 188593292
19583 188593292 266132524 355243446 424917365 457761381 460374792 423208792 350830179
19576 350830179 276787050 219661656 178078895 147634671 126363572 111859895 101374007
19569 101374007 93131804 86331826 80283246 74712573 69755921 65334443 61054569 57231352
$$ packed form
19628A869832M5931J2049M119o276K0062K02860K16617J76904J23487j07178j6006
19617B542401L10613L40229K77127K22826L84641M50702O36151O99772M92769
19608F357231K34894J42712j3429n7299K0945n0065K82929N16960M47020O60696
19598H542594R68922J261641J565810J887586K847614L378346M064997N093133
19590B9610643O157741P806099J0789992J5585494K4169852L8012350N6461121
19583A88593292P7539232Q9110922O9673919L2844016K613411l7166000p2378613
19576C50830179p4043129n7125394m1582761l0444224k1271099j4503677j0485888
19569A01374007q242203o799978o048580n570673m956652m421478m279874l823217
$$ plain form
19561 57231352 54176689 51490243 49262412 47409380 45972262 44891032 44398000 44531279
19553 44531279 44758483 43904460 42075716 39499115 36729480 34067487 31602512 29417367
19545 29417367 27423933 25532392 23855173 22491986 21204282 19823567 18492196 17242344
19537 17242344 16233830 15326433 14392518 13638567 12831003 12066685 11512753 10869829 10331649
19528 10331649 9788035 9292927 8735314 8287368 7886673 7677116 7440675 7102349 6591644
19519 6591644 6206521 5853530 5609527 5372078 5305190 5120194 4808031 4623066 4455746 4167991
19509 4167991 3972347 3761592 3503856 3343143 2973631 2853217 3016237 2942701 2697582 2473147
19499 2473147 2487828 2415397 2354848 2116503 1968523 1762347 1685707 1682663 1571990 1567280 1467352
$$ packed form
19561E7231352l054663k686446k227831j853032j437118j081230m93032J33279
19553D4531279K27204q54023j828744k576601k769635k661993k464975k185145
19545B9417367j993434j891541j677219j363187j287704j380715j331371j249852
19537A7242344j008514r07397r33915p53951q07564p64318n53932o42924n38180
19528A0331649n43614m95108n57613m47946m00695k09557k36441l38326n10705
19519F591644l85123l52991k44003k37449o6888j84996l12163j84965j67320k87755
19509D167991j95644k10755k57736j60713l69512j20414J63020p3536k45119k24435
19499B473147J4681p2431o0549k38345j47980k06176p6640l044j10673m710r9928
$$ plain form
19488 1467352 1092530 1098410 1199415 1208225 1160877 1044775 878403 840436 1029397 1034987 708936
19477 708936 679296 835551 879040 917700 976813 949358 929560 781952 891131 806433 778283
19466 778283 844727 878649 907969 1174118 1345828 1320460 1400648 1795582 2140744 2460997
19456 2460997 2537143 2671542 2749230 2672014 2640659 2560091 2678671 3115305 3397827 3358810
19446 3358810 3285636 3217419 3156359 3265223 3377020 3325586 3128427 3063434 2862531 2566175
19436 2566175 2559890 2796038 3044324 3252206 3171837 3011353 2699102 2385677 2049719 1946495
19426 1946495 1744610 1702519 1664728 1407645 1237778 1225336 1235698 1005445 1097603 1140408
19416 1140408 1133219 1148108 1082559 1262928 1458793 1495759 1491709 1643610 1851208 2214401 2648872
$$ packed form
19488A467352l74822N880J01005Q810m7348j16102j66372l7967J88961N590l26051
19477G08936k9640J56255M3489L8660N9113k7455j9798j47608J09179q4698k8150
19466G78283O6444L3922K9320K66149J71710k5368Q0188L94934L45162L20253
19456B460997P6146J34399P7688p7216l1355q0568J18580M36634K82522l9017
19446C358810p3174o8217o1060J08864J11797n1434j97159o4993k00903k96356
19436B566175o285K36148K48286K07882q0369j60484l12251l13425l35958j03224
19426A946495k01885m2091l7791k57083j69867j2442J0362k30253R2158M2805
19416A140408p189J4889o5549J80369J95865L6966m050J51901K07598L63193M34471
$$ plain form
19405 2648872 2805201 2987972 2965853 2852826 2837168 2937488 3139861 3317293 3429041 3746602
19395 3746602 3720333 3598265 3390745 3387554 3473836 3584545 3666747 3551647 3261797 3023844
19385 3023844 2952847 3069784 3117780 3261021 3298235 3113878 2944749 2703473 2308904 1901591
19375 1901591 1564558 1197567 1036240 1145641 1164009 1119421 1098810 1037638 885545 748137
19365 748137 768780 930335 918182 707529 635810 660467 629218 678520 609844 600109 650442
19354 650442 602955 517676 606673 711910 712075 613070 539234 446326 359182 273663 302265 221413
19342 221413 195176 86917 52630 232135 240460 201103 210356 248972 239042 231674 253230 301337
19330 301337 219371 191152 249947 371545 599635 519513 332702 314974 231239 142776 -33995
$$ packed form
19405B648872J56329J82771k2119j13027j5658J00320K02373J77432J11748L17561
19395C746602k6269j22068k07520l191Q6282J10709Q2202j15100k89850k37953
19385C023844p0997J16937M7996J43241L7214j84357j69129k41276l94569m07313
19375A901591l37033l66991j61327J09401J8368m4588k0611o1172j52093j37408
19365G48137K0643J61555j2153k10653p1719K4657l1249M9302o8676r735N0333
19354F50442m7487q5279Q8997J05237J65r9005p3836r2908q7144q5519K8602q0852
19342B21413k6237j08259l4287J79505Q325l9357R253L8616r930p368K1556M8107
19330C01337q1966k8219N8795J21598K28090q0122j86811j7728q3735q8463j76771
$$ plain form
19319 -33995 -147357 -208525 -120404 -101153 72063 160727 214049 157063 -24693 -178771 -155523
19308 -155523 -41989 -33403 -180575 -279606 -199865 -5041 41519 70139 103450 159928 207035
19297 207035 155933 89739 227910 149383 96750 -10333 -28352 11230 142157 125036 172290
19286 172290 252066 268915 329194 328499 433174 660000 1007994 1442050 2092959 2860770 3476126
19275 3476126 3803185 3920090 3682973 3070152 2484559 2058456 1739279 1261813 1040015
19266 1040015 877588 736903 628274 571724 625095 523152 633151 670040 538258 398728
19256 398728 296676 282287 464516 591729 582728 508369 420079 278839 191165 195338 122335
19245 122335 154366 86223 -95585 -271725 -219719 -244680 -251425 -114994 -129351 -664 75808
$$ packed form
19319c3995j13362o1168Q8121J9251J73216Q8664N3322n6986j81756j54078K3248
19308a55523J13534Q586j47172r9031P9741J94824M6560K8620L3311N6478M7107
19297B07035n1102o6194J38171p8527n2633j07083j8019L9582J30927j7121M7254
19286A72290P9776J6849O0279o95J04675K26826L47994M34056O50909P67811O15356
19275C476126L27059J16905k37117o12821n85593m26103l19177m77466k21798
19266A040015j62427j40685j08629n6550N3371j01943J09999L6889j31782j39530
19256C98728j02052j4389J82229J27213r001p4359q8290j41240q7674M173p3003
19245A22335L2031o8143j81808j76140N2006k4961o745J36431j4357J28687P6472
$$ plain form
19234 75808 -78058 -159496 -29260 141013 147438 175148 21917 68030 77271 -57552 -54000
19223 -54000 -35435 -116179 -74786 -28432 69378 166969 149015 117492 38828 76099 184891
19212 184891 51185 44712 74859 30548 -137106 -183207 -114215 -63529 -69464 -158275 -174666
19201 -174666 -214892 -145866 -188548 -277145 -196090 -143927 59539 127996 -1256 -171315 -226109
19190 -226109 -206633 -188620 -235357 -170880 -158163 -229591 -151541 -93860 -108790 -153891 -243928
19179 -243928 -366551 -412046 -394069 -380578 -173315 10947 -207017 -443468 -353410 -248224
19169 -248224 -209722 -242372 -102805 -28014 -67034 -40081 -76593 -180180 -224854 -217847 -230119
19158 -230119 -394037 -506829 -475866 -444417 -348518 -171860 -40399 -228203 -342426 -225757
$$ packed form
19234G5808j53866q1438J30236J70273O425K7710j53231M6113R241j34823L552
19223e4000J8565q0744M1393M6354R7810R7591j7954l1523p8664L7271J08792
19212A84891j33706o473L0147m4311j67654m6101O8992N0686n935q8811j6391
19201a74666m0226O9026m2682q8597Q1055N2163K03466O8457j29252j70059n4794
19190b26109J9476J8013m6737O4477J2717p1428P8050N7681j4930m5101r0037
19179b43928j22623m5495J7977J3491K07263J84262k17964k36451R0058J05186
19169b48224L8502l2650J39567P4791l9020K6953l6512j03587m4674P007j2272
19158b30119j63918j12792L0963L1449R5899J76658J31461j87804j14223J16669
$$ plain form
19148 -225757 -52426 -254800 -167896 -104087 -219130 -243661 -157834 -153142 -210743 -359666 -338326
19137 -338326 -464482 -668787 -559182 -355888 -321784 -245703 -291646 -309996 -254281 -191080 -162086
19126 -162086 -88703 -53338 -4973 37149 43313 40082 61438 51846 -58472 -150861 -157699 -216843
19114 -216843 -333439 -263085 -222627 -263394 -240688 -115572 -69048 -129806 -121608 -172204 -3808
19103 -3808 113257 309730 255259 -41640 -204697 -193579 -199336 -119791 -175304 -140784 18715
19092 18715 91113 65279 -64809 -188419 -204032 -253575 -372911 -362054 -372331 -338974 -424786
19081 -424786 -337209 -265613 -348425 -162439 -123918 -110114 -6172 -10482 -4408 -13450 -3395 -40955
19069 -40955 -113233 8242 -108320 -135705 -119617 -18949 -34142 -91877 -186255 -132347 -226770
$$ packed form
19148b25757J73331k02374Q6904O3809j15043k4531Q5827M692n7601j48923K1340
19137c38326j26156k04305J09605K03294L4104P6081m5943j8350N5715O3201K8994
19126a62086P3383L5365M8365M2122O164l231K1356r592j10318r2389o838n9144
19114b16843j16596P0354M0458m0767K2706J25116M6524o0758Q198n0596J68396
19103c808J17065J96473n4471k96899j63057J1118n757P9545n5513L4520J59499
19092A8715P2398k5834j30088j23610j5613m9543j19336J0857j0277L3357q5812
19081d24786Q7577P1596q2812J85986L8521J3804J03942m310O074r042J0055l7560
19069d0955p2278J21475j16562k7385J6088J00668j5193n7735r4378N3908r4423
$$ plain form
19058 -226770 -226547 -214950 -121600 -10846 -41095 61257 142084 182996 32641 84777 273490
19047 273490 375578 329499 289012 151760 34028 11333 138510 49760 -137386 -188636
19037 -188636 -10008 204883 185599 97307 11207 -120356 21663 65693 35326 220559
19027 220559 303814 209480 204660 303719 265256 469618 771227 1060564 1446475 1936538 2065474
19016 2065474 2148931 2229188 2113591 1900685 1649805 1582593 1454991 1243659 1099684 1190303
19006 1190303 1009400 943194 909353 848378 748867 447353 417151 555914 397364 524324
18996 524324 583785 415715 257535 171896 266859 410480 361800 360596 414171 389011 264278
18985 264278 370926 444892 293822 227557 214773 85968 -213899 -467168 -404965 -454629
$$ packed form
19058b26770K23J1597R3350J10754l0249J02352Q0827M0912j50355N2136J88713
19047B73490J02088m6079m0487j37252j17732k2695J27177q8750j87146n1250
19037a88636J78628K14891j9284q8292q6100j31563J42019M4030l0367J85233
19027B20559Q3255r4334m820R9059l8463K04362L01609K89337L85911M90063J28936
19016B065474Q3457Q0257j15597k12906k50880o7212j27602k11332j43975R0619
19006A190303j80903o6206l3841o0975r9511l01514l0202J38763j58550J26960
18996E24324N9461j68070j58180q5639R4963J43621m8680j204N3575k5160j24733
18985B64278J06648P3966j51070o6265j2784j28805k99867k53269O2203m9664
$$ plain form
18975 -454629 -290322 -274979 -398751 -364107 -227190 -197487 -235059 -199492 -108259 83900 85136
18964 85136 -45558 -103356 -148587 -52828 -37292 91003 109157 -67789 -70969 -15082 87157
18953 87157 74747 -57450 -212819 -311214 -330390 -329984 -334203 -221055 -236280 -153825 -152498 -165524
18941 -165524 -133778 -222119 -295256 -337045 -307678 -282667 -267292 -391324 -357931 -267663 -175329
18930 -175329 -103717 102491 39209 -53418 -164412 -127284 -188850 -374373 -464425 -274291 -183454
18919 -183454 -189314 -353209 -347361 -448724 -509198 -474664 -405588 -267444 -217940 -293827 -435681
18908 -435681 -334711 -307076 -227239 -201931 -384161 -443839 -386805 -246078 -171832 -127944 -87089
18897 -87089 -64760 -128183 -109485 -17943 -21570 -90836 -148486 -116848 -195397 -298732 -315050 -204409
$$ packed form
18975d54629J64307J5343j23772L4644J36917K9703l7572L5567R1233J92159J236
18964H5136j30694n7798m5231R5759J5536J28295J8154j76946l180N5887J02239
18953H7157j2410j32197j55369r8395j9176M06m219J13148j5225Q2455J327j3026
18941a65524L1746q8341p3137m1789K9367K5011J5375j24032L3393R0268R2334
18930a75329P1612K06208o3282r2627j10994L7128o1566j85523r0052J90134R0837
18919a83454n860j63895N848j01363o0474L4534O9076J38144M9504p5887j41854
18908d35681J00970K7635P9837K5308j82230n9678N7034J40727P4246M3888M0855
18897h7089K2329o3423J8698R1542l627o9266n7650L1638p8549j03335j6318J10641
$$ plain form
18885 -204409 -8381 107118 55768 65170 116916 200545 192504 198535 134532 119995 -11175
18874 -11175 7796 146433 9811 -23457 147188 125654 3279 -38777 64058 63244 93398
18863 93398 96669 70108 5843 -99090 -105974 31601 45906 -50347 -268065 -332214 -270752
18852 -270752 -300302 -355037 -251363 -126049 -78608 -102804 -64485 -139555 -231377 -132999 -156090
18841 -156090 -113917 -192599 -168156 -113350 -195068 -312323 -258738 -399319 -452769 -229738 -80193
18830 -80193 -120378 -117485 -29614 18176 31877 -84126 -105825 -49130 -113633 -204217 -242652 -204166
18818 -204166 -186355 -11975 167574 16005 -179666 -226824 -193974 -26306 -266517 -386715
18808 -386715 -432890 -261089 -103862 -57444 -85589 -121162 -234683 -194614 -192031 -328325 -391736
$$ packed form
18885b04409J96028J15499n1350R402N1746Q3629q041O031o4003j4537j31170
18874a1175J8971J38637j36622l3268J70645k1534j22375m2056J02835q14L0154
18863I3398L271k6561o4265j04933o884J37575J4305r6253k17718o4149O1462
18852b70752k9550n4735J03674J25314M7441k4196L8319p5070r1822R8378k3091
18841a56090M2173p8682K4443N4806q1718j17255N3585j40581n3450K23031J49545
18830h0193m0185K893Q7871M7790J3701j16003k1699N6695o4503r0584l8435L8486
18818b04166J7811J74380J79549j51569j95671m7158L2850J67668k40211j20198
18808c86715m6175J71801J57227M6418k8145l5573j13521M0069K583j36294o3411
$$ plain form
18797 -391736 -390348 -360657 -209322 -14552 69787 -55258 -144152 -246409 -310438 -323375 -279291
18786 -279291 -276717 -240044 -171064 -260634 -297091 -223090 -204106 -132585 -163781 -187679 -241376 -9156
18774 -9156 45894 15558 -12859 -6638 -186820 -227109 -199812 -188855 -99865 -23285 -70567 -297308
18762 -297308 -255584 -134780 -91086 -88639 -210899 -176054 -78532 -105045 -76865 124820 289025
18751 289025 166643 57563 13234 -100545 -198186 -311382 -360162 -184375 -158944 -147608
18741 -147608 -245239 -295752 -313390 -348285 -349491 -314069 -334579 -290110 -186842 -190394 -159990 -164144
18729 -164144 -105473 -184736 -214862 -85283 -104708 -284924 -347034 -107270 -35413 130660 99015
18718 99015 74550 -4108 50629 147254 70118 -187282 -165372 -118084 -260854 -390508 -252217
$$ packed form
18797c91736J388K9691J51335J94770Q4339j25045q8894j02257o4029j2937M4084
18786b79291K574L6673O8980q9570l6457P4001J8984P1521l1196k3898n3697K32220
18774i156N5050l0336k8417O221j80182m0289K7297J0957Q8990P6580m7282k26741
18762b97308M1724J20804M3694K447j22260L4845R7522k6513K8180K01685J64205
18751B89025j22382j09080m4329j13779r7641j13196m8780J75787K5431J1336
18741a47608r7631n0513j7638l4895j206L5422k0510M4469J03268l552L0404m154
18729a64144N8671p9263l0126J29579j9425j80216o2110K39764P1857J66073l1645
18718I9015k4465p8658N4737R6625p7136k57400K1910M7288j42770j29654J38291
$$ plain form
18707 -252217 -323071 -386362 -149472 -49769 -38122 -19891 -44598 -55925 -141543 -293531 -335663
18696 -335663 -252035 -300319 -370203 -175181 76041 99022 -119058 -338951 -424575 -418501 -326871
18685 -326871 -194347 -119594 -56511 -117220 -247096 -405245 -499310 -530779 -426503 -474352 -421161
18674 -421161 -394061 -370675 -267540 -117706 -12303 -75547 -198728 -186753 -141220 -109731 -88046
18663 -88046 7920 78443 25412 57570 -132353 -387902 -290769 -123942 -79439 -10515 2087
18652 2087 20050 -27491 -49391 112632 63015 -99145 -139766 -188263 -224516 -376208 -421244
18641 -421244 -359052 -279402 -299312 -409269 -378257 -136962 -155443 -286096 -354743 -313446 -378419
18630 -378419 -302564 -266241 -318974 -214271 -97266 -150259 -229281 -271307 -292763 -249030 -168543
$$ packed form
18707b52217p0854o3291K36890R9703J1647J8231k4707j1327q5618j51988m2132
18696c35663Q3628m8284o9884J95022K51222K2981k18080k19893q5624O074R1630
18685c26871J32524P4753O3083o0709j29876j58149r4065l1469J04276m7849N3191
18674d21161K7100K3386J03135J49834J05403o3244j23181J1975M5533L1489K1685
18663h8046R5966P0523n3031L2158j89923k55549R7133J66827M4503O8924J2602
18652B087J7963m7541k1900J62023m9617j62160m0621m8497l6253j51692m5036
18641d21244O2192P9650j9910j09957L1012K41295j8481j30653o8647M1297o4973
18630c78419P5855L6323n2733J04703J17005n2993p9022m2026k1456M3733Q0487
$$ plain form
18619 -168543 -81924 79019 204012 407196 231631 -177087 -281770 -180944 -82999 -37093
18609 -37093 -154877 -188933 -83260 -27460 -75926 -88663 -183371 -250242 -272231 -190661 -120079
18598 -120079 7822 205969 65941 30348 54943 -99497 -350446 -385265 -295513 -203173
18588 -203173 -151813 -36130 -91793 -250886 -221774 -287400 -267366 -165545 -267148 -252793 -173764
18577 -173764 -172503 -22380 94122 39344 -26653 -48159 -34463 -97705 -198561 -130294 -4565
18566 -4565 23295 -157602 -244725 -337895 -130511 -62064 -67956 -98670 37102 19424 -169148
18555 -169148 -168046 -229767 -365392 -396192 -289518 -259489 -352706 -275600 -295903 -337047 -407627
18544 -407627 -286384 14077 78756 101251 -35051 -263101 -190468 -122833 -70038 -39781 20391
$$ packed form
18619a68543Q6619J60943J24993K03184j75565m08718j04683J00826R7945M5906
18609c7093j17784l4056J05673N5800m8466j2737r4708o6871k1989Q1570P0582
18598a20079J27901J98147j40028l5593K4595j54440k50949l4819Q9752R2340
18588b03173N1360J15683n5663j59093K9112o5626K0034J01821j01603J4355P9029
18577a73764J261J50123J16502n4778o5997k1506J3696o3242j00856O8267J25729
18566d565K7860j80897q7123r3170K07384O8447n892l0714J35772j7678j88572
18555a69148J102o1721j35625l0800J06674L0029r3217P7106k0303m1144p0580
18544d07627J21243L00461O4679K2495j36302k28050P2633O7635N2795L0257O0172
$$ plain form
18533 20391 160992 172687 121313 94318 17252 11387 -57814 -65816 -148234 -62526 -104815 -11521
18521 -11521 145988 75608 -46400 -68608 -74332 29157 104816 11144 138642 210577 179977
18510 179977 157702 207143 258489 233246 324318 459417 290271 456111 647797 646437 583308
18499 583308 761249 823179 828808 870321 965519 1114935 1116343 1393210 1580741 1811574 1733369
18488 1733369 1401448 1320539 1225856 1163072 1244243 1117175 961495 918412 1029599 868346
18478 868346 745301 602940 428535 279567 364915 408828 313119 202961 238732 462808
18468 462808 455011 346838 284100 336989 317572 36746 -16729 154328 284494 299877 278241
18457 278241 316981 176606 -47314 -159885 -76605 36977 132151 243448 197771 159789
$$ packed form
18533B0391J40601J1695n1374k6995p7066n865o9201q002q2418Q5708m2289R3294
18521a1521J57509p0380j22008k2208n724J03489P5659r3672J27498P1935l0600
18510A79977k2275M9441N1346k5243R1072J35099j69146J65840J91686j360o3129
18499E83308J77941O1930N629M1513R5198J49416J408K76867J87531K30833p8205
18488A733369l31921q0909r4683o2784Q1171j27068j55680m3083J11187j61253
18478H68346j23045j42361j74405j48968Q5348M3913r5709j10158L5771K24076
18468D62808p797j08173o2738N2889j9417k80826n3475J71057J30166J5383k1636
18457B78241L8740j40375k23920j12571Q3280J13582R5174J11297m5677l7982
$$ plain form
18447 159789 260669 218284 188933 147184 108166 98429 87034 169077 124492 99700 198832
18436 198832 46229 -114513 -43029 28766 145109 92473 101742 48150 44283 52993 12693
18425 12693 -16621 21117 81781 60430 70007 -23581 83407 175063 170621 177237 131097 206637
18413 206637 327696 310240 485344 729548 990713 1434798 1841830 2332073 2712467 3042169
18403 3042169 3058622 3301478 3486508 3350635 2930487 2543846 2148654 1760351 1519347 1338227
18393 1338227 1206549 1012644 815916 700057 790370 903547 1029211 1025410 1066785 1023877
18383 1023877 1067387 1218149 1238895 1544819 1777847 1987242 2197237 2633814 3031700 3474481
18373 3474481 3711905 3776203 3744343 3499490 3248784 2957230 2558367 2136726 1727931 1509131
$$ packed form
18447A59789J00880m2385k9351m1749l9018r737j1395Q2043m4585k4792R9132
18436A98832j52603j60742P1484P1795J16343n2636R269n3592l867Q710m0300
18425A2693k9314L7738O0664k1351R577r3588J06988R1656m442O616m6140P5540
18413B06637J21059j7456J75104K44204K61165M44085M07032M90243L80394L29702
18403C042169J6453K42856J85030j35873m20148l86641l95192l88303k41004j81120
18393A338227j31678j93905j96728j15859R0313J13177J25664l801M1375m2908
18383A023877M3510J50762K0746L05924K33028K09395K09995M36577L97886M42781
18373C474481K37424O4298l1860k44853k50706k91554l98863m21641m08795k18800
$$ plain form
18363 1509131 1521022 1487994 1481070 1574853 1620082 1767703 1800748 2025551 2481014 2927800 3310104
18352 3310104 3523173 3678614 3872477 3738035 3690700 3496421 3052125 2733387 2534272 2239416
18342 2239416 2026672 1770050 1449731 1368537 1202268 1001160 1009406 891471 966750 1072126
18332 1072126 1019915 1034213 999698 931952 1173812 1564873 1833955 2163275 2634698 2929653
18322 2929653 3239548 3425320 3489860 3380013 3052616 2848747 2450608 2217068 1815183 1333470
18312 1333470 1146184 1109515 1077927 937988 848606 851731 798490 697268 717748 562681 527737
18301 527737 641528 691917 607804 538370 621522 690700 657407 679659 636408 488802 316391
18290 316391 194379 253221 318172 324368 418487 226125 115496 153765 163030 159682 72806
$$ packed form
18363A509131J1891l3028o924R3783M5229J47621L3045K24803M55463M46786L82304
18352C310104K13069J55441J93863j34442m7335j94279m44296l18738j99115k94856
18342B239416k12744k56622l20319q1194j66269k01108Q246j17935P5279J05376
18332A072126n2211J4298l4515o7746K41860L91061K69082L29320M71423K94955
18322B929653L09895J85772O4540j09847l27397k03869l98139k33540m01885m81713
18312A333470j87286l6669l1588j39939q9382L125n3241j01222K0480j55067l4944
18301E27737J13791N0389q4113o9434Q3152O9178l3293K2252m3251j47606j72411
18290C16391j22012N8842O4951O196R4119j92362j10629L8269R265l348q6876
$$ plain form
18279 72806 50998 60161 114206 119334 88399 75984 5662 24304 -921 34733 -34559 -118271
18267 -118271 -120497 -90098 -129079 -145791 -146633 -271672 -281079 -150903 -5027 116669 311125
18256 311125 205389 112410 122714 311710 320182 590 -180795 -272528 -146099 -70391 -6704
18245 -6704 48399 59935 -76327 -27216 -5158 66010 132672 99720 -49371 -46478 54369
18234 54369 90900 152250 127225 116663 146048 232862 176155 199787 238188 224194 324382
18223 324382 374689 222658 -17459 -57057 -83911 -43097 71206 -56443 -190853 -281286
18213 -281286 -243837 -250855 -243132 -270790 -94035 169106 197278 -26964 -8237 -28090 -47912
18202 -47912 -2880 30304 72562 93987 143421 291737 149381 211209 239212 226453 287112
$$ packed form
18279G2806k1808R163N4045N128l0935j2415p0322J8642k5225L5654o9292q3712
18267a18271k226L0399l8981j6712q42j25039r407J30176J45876J21696J94456
18256C11125j05736r2979J0304J88996Q472l19592j81385r1733J26429P5708O3687
18245f704N5103J1536j36262M9111K2058P1168O6662l2952j49091K893J00847
18234E4369L6531O1350k5025j0562K9385Q6814n6707K3632L8401j3994J00188
18223C24382N0307j52031k40117l9598k6854M0814J14303j27649j34410r0433
18213b81286L7449p018P723k7658J76755K63141K8172k24242J8727j9853j9822
18202d7912M5032L3184M2258K1425M9434J48316j42356O1828K8003j2759O0659
$$ plain form
18191 287112 323170 372918 173598 39533 124911 293163 372384 553520 548607 507563 353817
18180 353817 393267 456425 584314 825588 988782 1173047 1412262 1545061 1718380 1801420
18170 1801420 1932876 1953321 1918283 1891368 1738124 1818966 1905803 1832457 1603226 1229964
18160 1229964 1127009 1219288 1210609 973731 748461 586750 550685 590604 441155 406573
18150 406573 462228 593761 621833 716739 690000 479817 483403 366853 310269 225760 188053
18139 188053 59676 209520 333413 220189 273349 342728 319352 225411 215182 268295 312900
18128 312900 197549 90722 131585 232706 153598 133590 262103 231814 124243 120643 107427
18117 107427 16777 -49291 -32469 36075 167779 278203 270249 156440 45430 -40878 -212075
$$ packed form
18191B87112L6058M9748j99320j34065Q5378J68252P9221J81136m913m1044j53746
18180C53817L9450O3158J27889K41274J63194J84265K39215J32799J73319Q3040
18170A801420J31456K0445l5038k6915j53244Q0842Q6837p3346k29231l73262
18160A229964j02955R2279q679k36878k25270j61711l6065L9919j49449l4582
18150D06573N5655J31533K8072R4906k6739k10183L586j16550n6584q4509l7707
18139A88053j28377J49844J23893j13224N3160O9379k3376r3941j0229N3113M4605
18128C12900j15351j06827M0863J01121p9108k0008J28513l0289j07571l600j3216
18117A07427r0650o6068J6822O8544J31704J10424p954j13809j11010q6308j71197
$$ plain form
18106 -212075 -262132 -244832 -290890 -363314 -369965 -193988 -123969 -29065 34356 -82337 -174492
18095 -174492 -318910 -274390 -993 59126 49222 49842 -6286 46189 112316 62344 63268 -48189
18083 -48189 -105170 -111594 -25905 -165209 -161183 -39943 32915 95553 -39048 -125364 -254322
18072 -254322 -255668 -153170 -205725 -190974 -219101 -240710 -229625 -55169 14266 38688 -311593
18061 -311593 -283484 -83701 14156 10204 1659 -18173 26784 -104619 -213988 -205290 -243673
18050 -243673 -294987 -220229 -178290 -191126 -110219 -102868 -234737 -226333 -180199 55084 -57730
18039 -57730 -123071 -207121 -255801 -214809 -127470 -151704 -182903 -15981 27448 14781 -116698
18028 -116698 -44086 -3918 -164317 -202319 -246508 -143579 -69650 -32085 -163498 -159136 27468
$$ packed form
18106b12075n0057J7300m6058p2424o651J75977P0019R4904O3421j16693r2155
18095a74492j44418M4520K73397O0119r904O20n6128N2475O6127m9972R24j11457
18083d8189n6981o424Q5689j39304M026J21240P2858O2638j34601q6316j28958
18072b54322j346J02498n2555J4751k8127k1609J1085J74456O9435K4422l50281
18061c11593K8109J99783R7857l952q545j9832M4957j31403j09369Q698l8383
18050b43673n1314P4758M1939j2836Q0907P351j31869Q404M6134K35283j12814
18039e7730o5341q4050m8680M0992Q7339k4234l1199J66922M3429j2667j31479
18028a16698P2612M0168j60399l8002m4189J02929P3929L7565j31413M362J86604
$$ plain form
18017 27468 -28916 20018 37033 140731 65424 137478 182553 26120 -276836 -417442 -352625
18006 -352625 -131678 -170913 -128639 -112460 -14783 -12602 20450 24132 -100893 -85800 83628
17995 83628 28558 -99919 -169553 -179183 -95488 848 21780 29454 147552 162674 179929 61598
17983 61598 -248496 -386546 -324860 -347265 -326991 -316993 -168963 -217037 -106083 -44587 -57173
17972 -57173 67266 207717 201994 248464 87948 4636 -62068 -134213 -12965 126470 135627
17961 135627 154637 181650 97699 4422 14309 -80867 -127044 -76919 -128014 -215749 -186231 -88869
17949 -88869 4366 -28587 -145807 -88540 -28027 -1698 6499 -22123 -120743 -175509 -138551 -197237
17937 -197237 -118677 -97631 -76643 -70205 -157298 -135801 -24246 22121 -11278 -56347 26616
$$ packed form
18017B7468n6384M8934J7015J03698p5307P2054M5075j56433l02956j40606O4817
18006c52625K20947l9235M2274J6179R7677K181L3052L682j25025J5093J69428
17995H3628n5070j28477o9634r630Q3695R6336K0932P674J18098J5122J7255j18331
17983F1598l10094j38050O1686k2405K0274R998J48030m8074J10954O1496j2586
17972e7173J24439J40451n723M6470j60516q3312o6704p2145J21248J39435R157
17961A35627J9010K7013q3951r3277R887r5176m6177N0125n1095q7735K9518R7362
17949h8869R3235l2953j17220N7267O0513K6329Q197k8622r8620n4766L6958n8686
17937a97237P8560K1046K0988O438q7093K1497J11555M6367l3399m5069Q2963
$$ plain form
17926 26616 8981 -91786 21712 160181 300275 338413 251721 132412 64261 -24424 -61050
17915 -61050 -13499 60459 44865 -19292 -87067 -3590 -79010 -8175 30130 -134508 -226448
17904 -226448 -174878 -193338 -225998 -226562 -230482 -315733 -291206 13146 134663 57076 83453 97835
17892 97835 -30569 -98211 -43667 -62518 27513 -66415 -159000 -87318 -2439 18931 177462
17881 177462 281367 40029 -64601 54394 269658 272644 366145 293750 315094 256829 154016
17870 154016 1816 -140013 -26288 90440 41052 122227 208100 182794 221462 368097
17860 368097 603033 588532 643202 776975 1017900 1165434 1186272 1206101 1299749 1533650
17850 1533650 1675852 1753104 1732187 1716992 1656742 1508784 1369662 1306883 1328202 1256578 1147402
$$ packed form
17926B6616j7635j00767J13498J38469J40094L8138q6692j19309o8151q8685l6626
17915f1050M7551P3958j5594o4157o7775Q3477p5420P0835L8305j64638r1940
17904b26448N1570j8460l2660n64l920q5251K4527L04352J21517p7587K6377J4382
17892I7835j28404o7642N4544j8851R0031r3928r2585P1682Q4879K1370J58531
17881A77462J03905k41338j04630J18995K15264K986R3501p2395K1344n8265j02813
17870A54016j52200j41829J13725J16728m9388Q1175Q5873k5306L8668J46635
17860C68097K34936j4501N4670J33773K40925J47534K0838J9829R3648K33901
17850A533650J42202P7252k0917j5195o0250j47958j39122o2779K1319p1624j09176
$$ plain form
17839 1147402 1201267 1103493 912985 695495 513799 354498 343241 256234 323692 498537
17829 498537 594615 498182 460103 398618 420558 491120 465030 257231 14215 -153799 -114170
17818 -114170 -139901 -71215 -3011 -96522 -94402 -43962 -7320 80679 119757 177686 244439 349552
17806 349552 271683 143483 -69598 -82352 64994 173290 146839 152468 78140 -105920 -275799
17795 -275799 -223097 23637 -45842 -23055 216863 214034 146666 257371 350851 362622 387623
17784 387623 400988 369979 545713 696918 1004059 1503612 1735007 2035420 2083941 1923780
17774 1923780 1849654 1713859 1400384 1301987 1109929 856090 800472 735358 546373 474147
17764 474147 421624 440157 444670 417706 348522 270319 369236 456417 397570 241126 43737
$$ packed form
17839A147402N3865r7774j90508k17490j81696j59301j1257q7007O7458J74845
17829D98537R6078r6433l8079o1485K1940P0562k6090k07799k43016j68014L9629
17818a14170k5731O8686O8204r3511K120N0440L6642Q7999L9078N7929O6753J05113
17806C49552p7869j28200k13081j2754J47346J08296k6451N629p4328j84060j69879
17795b75799N2702K46734o9479K2787K39918k829o7368J10705R3480J1771K5001
17784C87623J3365l1009J75734J51205L07141M99553K31395L00413M8521j60161
17774A923780p4126j35795l13475r8397j92058k53839n5618o5114j88985p2226
17764D74147n2523J8533M513k6964o9184p8203R8917Q7181n8847j56444j97389
$$ plain form
17753 43737 -127272 -82668 -5601 -138759 -182947 -142728 -126612 65180 195796 213558 208570
17742 208570 47762 -79806 -151331 -70705 62813 78457 12946 36996 33315 90297 70286
17731 70286 27895 -81038 -82755 66943 101551 122168 -50009 -127695 -151639 -309759 -140842
17720 -140842 -18575 -82099 -231161 -332941 -453085 -173811 19945 -59141 -151099 -223630
17710 -223630 -331706 -300240 -157907 -91220 46340 69458 81949 -25550 -105434 -108572 -19786
17699 -19786 38918 -28027 -169082 -65732 107323 104092 182330 188404 99247 120603 182911
17688 182911 54434 -98344 -144123 -83309 -116900 -167390 -154394 -86993 -99274 -137736 -126462
17677 -126462 -136121 -154533 -191187 -318039 -345358 -388503 -343379 -339259 -256725 -105290 58994
$$ packed form
17753D3737j71009M4604P7067j33158m4188M0219J6116J91792J30616J7762m988
17742B08570j60808j27568p1525Q0626J33518J5644o5511K4050l681N6982k0011
17731G0286m2391j08933j717J49698L4608K0617j72177p7686k3944j58120J68917
17720a40842J22267o3524j49062j01780j20144K79274J93756p9086r1958p2531
17710b23630j08076L1466J42333O6687J37560K3118J2491j07499p9884l138Q8786
17699a9786N8704o6945j41055J03350J73055l231P8238O074q9157K1356O2308
17688A82911j28477j52778m5779O0814l3591n0490J2996O7401j2281l8462J1274
17677a26462r659j8412l6654j26852k7319m3145M5124M120Q2534J51435J64284
$$ plain form
17666 58994 98373 -21600 80518 -9377 -69348 -47538 -71627 -136896 -76989 -54795 10828
17655 10828 11736 75731 231873 209540 157434 66577 -5946 -154444 -327713 -258901 -325628
17644 -325628 -79628 101193 32395 -84506 -235350 -208642 -89387 -48610 -120481 -310369
17634 -310369 -199869 -222629 -433144 -460152 -388680 -243158 -224217 -183449 -46526 17316 52819
17623 52819 -48744 -31113 28764 -32116 -241093 -391990 -262827 -132419 -212344 -243947 -132105
17612 -132105 -243185 -315180 -307163 -343141 -365854 -361614 -184893 34347 197541 128920 64278
17601 64278 19401 103366 92219 75922 99183 116480 73540 120035 80777 73381 -123479 -263955
17589 -263955 -110267 -61838 -64742 -86987 -42612 -51048 9247 -85423 -302986 -200288 -22610
$$ packed form
17666E8994L9379j19973J02118q9895n9971K1810k4089o5269N9907K2194O5623
17655A0828R08O3995J56142k2333n2106r0857p2523j48498j73269O8812o6727
17644c25628K46000J80821o8798j16901j50844K6708J19255M0777p1871j89888
17634c10369J10500k2760k10515k7008P1472J45522J8941M0768J36923O3842L5503
17623E2819j01563J7631N9877o0880k08977j50897J29163J30408p9925l1603J11842
17612a32105j11080p1995Q017l5978k2713M240J76721K19240J63194o8621o4642
17601F4278m4877Q3965j1147j6297K3261J7297m2940M6495l9258p396j96860j40476
17589b63955J53688M8429k904k2245M4375q436O0295r4670k17563J02698J77678
$$ plain form
17578 -22610 -76973 -85149 -35158 -189743 -103801 27026 -79478 -132517 -160561 -171715 -261115
17567 -261115 -239229 -194750 -189651 -56137 -79844 -16289 2369 -86610 -321724 -313709 -188517
17556 -188517 -156109 -17024 -164960 -208652 -217261 -175385 -144368 -175140 -190052 -132392 -166170
17545 -166170 -233246 -246790 -237721 -68359 119325 233461 111299 -24685 55207 59238 -74910
17534 -74910 -166768 -53893 42139 93745 -5235 -143976 -104219 78033 42760 -82754 -177075
17523 -177075 -281239 -237124 -122228 -137355 -200514 -234467 -282819 -356433 -313015 -130551 -106656
17512 -106656 -240650 -126805 -34938 -37292 99470 49172 -31146 -112081 -132737 -183542 -239894
17501 -239894 -258047 -293055 -355519 -359964 -226041 -149682 -145699 -4022 58034 14996 -3268
$$ packed form
17578b2610n4363q176M9991j54585Q5942J30827j06504n3039k8044j1154q9400
17567b61115K1886M4479N099J33514k3707O3555J8658q8979k35114Q015J25192
17556a88517L2408J39085j47936m3692q609M1876L1017l0772j4912N7660l3778
17545a66170o7076j3544R069J69362J87684J14136j22162j35984P9892M031j34148
17534g4910r1858J12875R6032N1606r8980j38741L9757J82252l5273j25514r4321
17523a77075j04164M4115J14896j5127o3159l3953m8352p3614M3418J82464K3895
17512a06656j33994J13845R1867k354J36762n0298q0318q0935k0656n0805n6352
17501b39894j8153l5008o2464m445J33923P6359L983J41677O2056m3038j8264
$$ plain form
17490 -3268 60497 174418 155128 84891 57604 -41372 -115584 -130477 -188546 -224447 -343985
17479 -343985 -405036 -296273 -153743 -70648 -125556 -147362 -221435 -175262 -207017 -218965 -276075
17468 -276075 -278221 -260686 -142823 -114553 -207934 -228955 -110146 -294637 -333604 -351124 -391452
17457 -391452 -324359 -266830 -181989 -2377 12385 -181488 -230644 -276090 -335477 -167469 -74159
17446 -74159 -183457 -179919 -35776 -12231 -162644 -228040 -266695 -274589 -286895 -332513 -301709
17435 -301709 -219731 -193120 -139182 -130768 -191872 -60469 51228 -42096 -93746 -140751 -245044
17424 -245044 -295000 -196641 -263822 -284225 -339625 -338265 -178130 -53315 -191381 -138157 12415
17413 12415 -203010 -124015 52625 115424 87698 -128071 -31541 -100073 -137656 -176452 -354213
$$ packed form
17490c268O3765J13921j9290p0237k7287r8976p4212j4893n8069l5901j19538
17479c43985o1051J08763J42530Q3095n4908k1806p4073M6173l1755j1948n7110
17468b76075k146J7535J17863K8270r3381k1021J18809j84491l8967j7520m0328
17457c91452O7093N7529Q4841J79612J4762j93873m9156m5446n9387J68008R3310
17446g4159j09298L538J44143K3545j50413o5396l8655p894j2306m5618L0804
17435c01709Q1978K6611N3938Q414o1104J31403J11697r3324n1650m7005j04293
17424b45044m9956R8359o7181k0403n5400J360J60135J24815j38066N3224J50572
17413A2415k15425P8995J76640O2799k7726k15769R6530o8532l7583l8796j77761
$$ plain form
17402 -354213 -288142 -173694 -248075 -46808 -39789 -6219 121462 184558 47975 26457 30779
17391 30779 11745 -43719 -63628 -28898 59531 232095 218205 41076 90462 326904 197533
17380 197533 -1783 -153820 -136919 -415292 -389459 -154828 -24768 87899 243898 74053
17370 74053 -117907 -183341 -187611 -84781 6122 43983 -150320 -297860 -390542 -377565 -360281
17359 -360281 -349231 -226390 -132682 -140897 -97874 -24784 15329 -15925 52964 -200505 -195786
17348 -195786 -108286 -10058 -30476 -169328 -192576 -185915 -177563 -89138 33103 -98790 -279868
17337 -279868 -197435 17084 73150 144921 204972 162693 65311 75308 174318 60653 -17597
17326 -17597 137128 109822 -8759 -27528 -132866 -136381 -217315 -139426 -263194 -310156 -314767
$$ packed form
17402c54213O6071J14448p4381K01267P019L3570J27681O3096j36583k1518M322
17391C0779j9034n5464j9909L4730Q8429J72564j3890j77129M9386K36442j29371
17380A97533j99316j52037J6901k78373K5833K34631J30060J12667J55999j69845
17370G4053j91960o5434m270J02830R0903L7861j94303j47540r2682J2977J7284
17359c60281J1050J22841R3708q215M3023P3090M0113l1254O8889k53469M719
17348a95786Q7500R8228k0418j38852k3248O661Q352Q8425J22241j31893j81078
17337b79868Q2433K14519N6066P1771O0051m2279r7382R997R9010j13665p8250
17326a7597J54725k7306j18581j8769j05338l515q0934P7889j23768m6962m611
$$ plain form
17315 -314767 -251569 -172505 -212111 -277928 -239773 -221093 -278086 -317587 -181394 -255611 -299173
17304 -299173 -314488 -548267 -534486 -342470 -141635 22434 46729 64991 -24196 43684 -19982
17293 -19982 79386 140056 52411 -58785 -153634 -215106 -356981 -312701 -264156 -39878 -39803 -20403
17281 -20403 -95205 -89802 -155573 -156074 -185873 -255897 -345419 -370063 -359683 -268743 -144277 -112610
17269 -112610 -46741 -20831 -67572 -223592 -275741 -265632 -348595 -239162 -108909 -94710 -338636
17258 -338636 -411913 -302789 -99693 39998 71746 -55471 -243048 -304397 -275637 -302893
17248 -302893 -335549 -218283 -113978 -109366 -301165 -423999 -321337 -31889 7439 -148610
17238 -148610 -257648 -316282 -361770 -305617 -392368 -551192 -471344 -318732 -370800 -270282 -212466
$$ packed form
17315c14767O3198P9064l9606o5817L8155J8680n6993l9501J36193p4217m3562
17304b99173j5315k33779J3781J92016K00835J64069K4295J8262q9187O7880o3666
17293a9982R9368O0670q7645j11196r4849o1472j41875M4280M8545K24278P5J9400
17281b0403p4802N403o5771n01k9799p0024q9522k4644J0380R0940J24466L1667
17269a12610O5869K5910m6741j56020n2149J0109q2963J09433J30253J4199k43926
17258c38636p3277J09124K03096J39691L1748j27217j87577o1349K8760k7256
17248c02893l2656J17266J04305M612j91799j22834J02662K89448L9328j56049
17238a48610j09038n8634m5488N6153q6751j58824P9848J52612n2068J00518N7816
$$ plain form
17227 -212466 -204445 -93617 -87361 -34063 22785 99618 -34297 -132651 -20657 16760 37430
17216 37430 134098 194253 12236 7414 -45586 18284 61595 36523 -23562 -30291 -85548 -158360
17204 -158360 -221112 -271676 -376157 -280798 -53449 12217 -131663 -183438 -140527 -226763 -275875
17193 -275875 -257468 -152905 -122664 -112182 -37837 85967 69530 -33752 -15000 -31665 21702
17182 21702 -28227 -132923 -154923 -89188 -52751 -45739 -90398 21656 94805 -63682 -142252
17171 -142252 -222672 -372940 -326380 -169104 -32098 -95767 -251062 -336775 -431268 -287963
17161 -287963 4181 99356 88296 162093 94328 -138847 -128945 -45028 30450 -6636 -80767
17150 -80767 -183555 -183237 -128454 -89100 -233777 -318034 -263000 -165669 -235275 -178072 -246308 -395141
$$ packed form
17227b12466Q021J10828O256N3298N6848P6833j33915r8354J11994L7417K0670
17216C7430R6668O0155j82017m822n3000O3870M3311k5072o0085o729n5257p2812
17204a58360o2752n0564j04481R5359K27349O5666j43880n1775M2911q6236m9112
17193b75875J8407J04563L0241J0482P4345J23804j6437j03282J8752j6665N3367
17182B1702m9929j04696k2000O5735L6437P012m4659J12054P3149j58487p8570
17171a42252q0420j50268M6560J57276J37006o3669j55295q5713r4493J43305
17161b87963K92144R5175j1060P3797o7765k33175R902Q3917P5478l7086p4131
17150h0767j02788L18N4783L9354j44677q4257N5034R7331o9606N7203o8236j48833
$$ plain form
17138 -395141 -429545 -358954 -208606 -83140 -80219 -67985 101718 251520 191629 54890 -210933
17127 -210933 -333872 -224799 -154781 -118102 40249 320291 294261 151642 108102 101685 27419
17116 27419 113554 90105 71471 19251 112143 81386 -139146 -227530 -65461 -40834 -43151
17105 -43151 -99669 14611 -87107 -189016 -151474 -57889 -186717 -294028 -31022 125311
17095 125311 134463 79568 -8649 -109355 -158899 -70544 -70196 -69281 -19605 -74724 -85949 -7291
17083 -7291 -11782 -155876 -283916 -194755 -174071 -57286 -63421 -190826 -200027 -6942 4238
17072 4238 -46109 -56507 -124293 -109629 -197185 -214602 -253849 -187051 -200651 -97163 -78071 -67384
17060 -67384 10676 -20392 -39089 -33683 21835 -62714 -76262 -192179 -178917 -123561 -164454 -161793
$$ packed form
17138c95141l4404P0591J50348J25466K921J2234J69703J49802n9891j36739k65823
17127b10933j22939J09073P0018L6679J58351K80042k6030j42619m3540o417p4266
17116B7419Q6135k3449j8634n2220R2892l0757k20532q8384J62069K4627k317
17105d3151n6518J14280j01718j01909L7542R3585j28828j07311K63006J56333
17095A25311R152n4895q8217j00706m9544Q8355L48R15M9676n5119j1225P8658
17083g291m491j44094j28040Q9161K0684J16785o135j27405r201J93085J1180
17072D238n0347j0398o7786J4664q7556j7417l9247O6798j3600J03488J9092J0687
17060f7384P8060l1068j8697N406N5518q4549j3548j15917J3262N5356m0893K661
$$ plain form
17048 -161793 -107309 -40546 -130067 -97866 -115562 -144652 -99342 -17790 61883 150175 133982
17037 133982 145733 103704 -147099 -174886 -205955 -111548 -45331 44093 -25016 -43842 -32736
17026 -32736 -205843 -294782 -241257 -173287 -242563 -352353 -393113 -196685 -192601 -255773 -314034
17015 -314034 -221203 22599 63973 98253 -81012 -106840 -66567 -263606 -439696 -414753 -178292
17004 -178292 -213700 -262232 -278462 -280987 -361639 -240746 -243040 -137347 -97007 -51018 45237
16993 45237 20956 -34493 -125597 -172356 -122278 69643 -41417 -133015 89595 148110 90277
16982 90277 200560 85967 4304 -56223 53686 128606 63151 -83869 -174850 -203807 -257068
16971 -257068 -317177 -356254 -277733 -187299 -151525 -31953 -14220 46484 -2763 -76093 -119682
$$ packed form
17048a61793N4484O6763q9521L2201j7696k9090M5310Q1552P9673Q8292j6193
17037A33982J1751m2029k50803k7787l1069R4407O6217Q9424o9109j8826J1106
17026c2736j73107q8939N3525O7970o9276j09790m0760J96428M084o3172n8261
17015c14034R2831K43802M1374L4280j79265k5828M0273j97039j76090K4943K36461
17004a78292l5408m8532j6230k525q0652J20893k294J05693M0340M5989R6255
16993D5237k4281n5449r1104m6759N0078J91921j11060r1598K22610N8515n7833
16982I0277J10283j14593q1663o0527J09909P4920o5455j47020r0981k8957n3261
16971b57068o0109l9077P8521R0434L5774J19572J7733O0704m9247p3330m3589
$$ plain form
16960 -119682 -155613 -372134 -363705 -197423 -294957 -299738 -249355 -328200 -335276 -191483 -218088
16949 -218088 -44221 13099 -71238 -138326 -114792 -226948 -198339 -273407 -322097 -222780 -231240
16938 -231240 -285111 -218606 -211521 -297261 -312275 -349293 -272467 -75958 124877 175256 -12440
16927 -12440 -264946 -387050 -335359 -281068 -208711 -326158 -468395 -357814 -164888 -124520
16917 -124520 -239287 -145682 -87831 -95556 -119796 -96831 -247138 -335042 -249414 -29015 139734
16906 139734 194126 -33450 -192151 -129944 -20474 9166 -52222 -136113 -69900 38997 800
16895 800 -180013 -229726 -35180 -29676 25065 86235 76838 3077 15303 -41943 -33890 21920
16883 21920 -52216 34174 8235 32683 -40660 -76906 -249448 -100880 -178769 -277424 -198659
$$ packed form
16960a19682l5931k16521Q429J66282r7534m781N0383p8845p076J43793k6605
16949b18088J73867N7320q4337o7088K3534j12156K8609p5068m8690R9317q460
16938b31240n3871O6505P085q5740j5014l7018P6826J96509K00835N0379j87696
16927a2440k52506j22104N1691N4291P2357j17447j42237J10581J92926M0368
16917a24520j14767R3605N7851p725k4240K2965j50307q7904Q5628K20399J68749
16906A39734N4392k27576j58701O2207J09470K9640o1388q3891O6213J08897l8197
16895H00j80813m9713J94546N504N4741O1170r397p3761J2226n7246Q053N5810
16883B1920p4136Q6390k5939K4448p3343l6246j72542J48568p7889r8655P8765
$$ plain form
16872 -198659 -95409 -164607 40972 77174 13426 34479 -70470 -132889 -48956 12861 38790
16861 38790 -36324 -192533 -176002 -244415 -308705 -193963 -120075 -95316 -4446 -74791 -174949
16850 -174949 -122411 -166909 -154783 -180817 -258407 -273485 -292850 -194525 181712 313647 217377
16839 217377 134138 134920 58004 22326 42153 62939 46770 27602 115878 187485 71408 109699
16827 109699 103046 40092 69659 -142392 -208887 -168334 24835 -29245 -208209 -301079 -306092
16816 -306092 -207632 -137281 -109383 -44419 -3244 -101828 -127183 -131100 -154097 -162360 -161834 -228311
16804 -228311 -212368 -160176 -66909 8992 -62380 -177011 -149602 25043 50236 -105031 -4896
16793 -4896 151339 276310 286434 130214 -86969 -131361 -198595 -208344 -192356 -268104 -210625
$$ packed form
16872a98659J03250o9198K05579L6202o3748K1053j04949o2419Q3933O1817K5929
16861C8790p5114j56209J6531o8413o4290J14742P3888K4759R0870p0345j00158
16850a74949N2538m4498J2126k6034p7590j5078j9365R8325L76237J31935r6270
16839B17377q3239P82p6916l5678J9827K0786j6169j9168Q8276P1607j16077L8291
16827A09699o653o2954K9567k12051o6495M0553J93169n4080j78964r2870n013
16816c06092R8460P0351K7898O4964M1175r8584k5355l917k2997q263N26o6477
16804b28311J5943N2192R3267P5901p1372j14631K7409J74645K5193j55267J00135
16793d896J56235J24971J0124j56220k17183m4392o7234r749J5988p5748N7479
$$ plain form
16782 -210625 -125989 -134010 -79664 19889 107018 72232 -61983 -17926 162555 168275 112718
16771 112718 -45827 -116056 -24118 124716 -4639 -117452 -67636 -85315 -119705 -112718 -161785
16760 -161785 -130714 -39460 -13452 -108497 -258283 -216773 3425 137536 77554 20423 21550
16749 21550 35785 52040 -86334 -75887 13997 62742 60227 86274 1908 -35867 -110215 -10653
16737 -10653 -2039 68386 -54998 -130909 -152386 -216964 -258828 -290918 -398271 -416263 -310663
16726 -310663 -176147 -277304 -278550 -58938 50634 -64366 -121165 -215358 -297050 -312711 -109885
16715 -109885 -37655 76374 22515 -161031 -400593 -508871 -353015 -92312 107538 -6039
16705 -6039 -44992 -144516 -142321 -206183 -170135 -37373 -96372 -108565 -190317 -78974 -85830 -49232
$$ packed form
16782b10625Q4636q021N4346R9553Q7129l4786j34215M4057J80481N720n5557
16771A12718j58545p0229R1938J48834j29355j12813M9816j7679l4390O987m9067
16760a61785L1071R1254K6008r5045j49786M1510K20198J34111n9982n7131J127
16749B1550J4235J6255j38374J0447Q9884M8745k515K6047q4366l7775p4348R9562
16737a0653Q614P0425j23384p5911k1477o4578m1864l2090j07353j7992J05600
16726c10663J34516j01157j246K19612J09572j15000n6799r4193q1692j5661K02826
16715a09885P2230J14029n3859j83546k39562j08278J55856K60703J99850j13577
16705f039l8953r9524K195o3862L6048J32762n8999j2193q1752J11343o856L6598
$$ plain form
16693 -49232 4204 50481 88247 38017 -8055 -56828 -114025 -86754 109800 218901 148220
16682 148220 -19382 9636 16191 -54556 69073 79213 199 26278 -30500 -153983 -227448
16671 -227448 -297390 -246645 -257685 -280206 -285515 -320186 -361233 -346386 -357834 -356384 -254657 -142346
16659 -142346 -130247 -67882 -19598 -137771 -174892 -258625 -254271 -225519 -212022 -154943 -209654
16648 -209654 -205464 -61787 -2730 172977 207600 7368 -186792 -191125 -109320 -98066 -195505
16637 -195505 -229130 -214534 -14800 -110962 -242382 -148821 -8153 -76531 -289687 -366451 -344389
16626 -344389 -376814 -323487 -340819 -248717 -244941 -293736 -204440 -212717 -267232 -272022 -287446 -167309
16614 -167309 -248820 -294342 -48556 93596 160906 5492 -201261 -175727 -193717 -212985 -133085
$$ packed form
16693d9232N3436M6277L7766n0230m6072m8773n7197K7271J96554J09101p0681
16682A48220j67602K9018O555p0747J23629J0140p9014K6079n6778j23483p3465
16671b27448o9942N0745j1040k2521n309l4671m1047J4847j1448J450J01727J12311
16659a42346J2099O2365M8284j18173l7121q3733M354K8752J3497N7079n4711
16648b09654M190J43677N9057J75707L4623k00232j94160m333Q1805J1254r7439
16637a95505l3625J4596J99734r6162j31420R3561J40668o8378k13156p6764K2062
16626c44389l2425N3327j7332R2102L776m8795Q9296q277n4515m790j5424J20137
16614a67309q1511m5522K45786J42152O7310j55414k06753K5534j7990j9268P9900
$$ plain form
16603 -133085 122194 158815 -39558 -137489 -292561 -234760 -166914 -39309 -43594 -182531 -228074
16592 -228074 -312195 -325269 -231781 -185926 -304235 -483862 -475089 -381601 -220455 -84709 -112758
16581 -112758 -215885 -281780 -358570 -339169 -253769 -242201 -245877 -29628 -169204 -290721 -322216
16570 -322216 -172432 -150359 -118847 -212262 -261699 -222202 -93833 -106547 -63903 -41281 -44123
16559 -44123 -37467 10937 -13421 11010 105801 16168 -72464 -69646 -32983 -76315 -134344 -78532
16547 -78532 -36542 -118069 -123324 -201688 -152005 -126823 -186909 -207868 -71839 -164083 -146117 11329
16535 11329 193060 142988 -19125 -98927 -137949 -133223 -61777 -76249 -122897 39031 91532
16524 91532 -100381 -298411 -179903 -71121 -250982 -263730 -259947 -229460 -120274 -31236 -15423
$$ packed form
16603a33085K55279L6621j98373r7931j55072N7801O7846J27605m285j38937m5543
16592b28074q4121j3074R3488M5855j18309j79627Q773R3488J61146J35746k8049
16581a12758j03127o5895p6790J9401Q5400J1568l676K16249j39576j21517l1495
16570c22216J49784K2073L1512r3415m9437L9497J28369j2714M2644K2622k842
16559d4123O656M8404k4358K4431R4791q9633q8632K818L6663m3332n8029N5812
16547g8532M1990q1527n255p8364M9683K5182o0086k0959J36029r2244J7966J57446
16535A1329J81731n0072j62113p9802l9022M726P1446j4472m6648J61928N2501
16524I1532j91913j98030J18508J08782j79861j2748L783L0487J09186Q9038J5813
$$ plain form
16513 -15423 12800 177305 236233 123119 80648 12102 23936 84990 74442 70048 -29882
16502 -29882 -27849 193778 -12647 -157731 -265696 -387058 -329636 -445007 -363689 -268388 -244558
16491 -244558 -212726 -106879 -105563 -94551 -61248 -14611 -29670 -156050 -284223 -331607 -353681
16480 -353681 -192392 -81715 -143822 -129867 37162 -15226 -104371 -78642 -151274 -90891 -40803
16469 -40803 -85068 -89568 -63981 17098 216517 71581 -198825 -217606 -64567 -93210 -91049
16458 -91049 -74700 -17742 138308 157764 136124 208929 123563 -17369 -19357 156617 176670
16447 176670 166270 45928 -60342 -49373 -56679 -9356 65465 -21697 -145099 -264548 -477616
16436 -477616 -546428 -546318 -525177 -258008 -222212 -95878 -90263 -156866 -136753 -103428 -120028 -229341
$$ packed form
16513a5423K8223J64505N8928j13114m2471o8546J1834O1054j0548m394r9930
16502b9882K033K21627k06425j45084j07965j21362N7422j15371Q1318R5301K3830
16491b44558L1832J05847J316J1012L3303M6637j5059j26380j28173m7384k2074
16480c53681J61289J10677o2107J3955J67029n2388q9145K5729p2632O0383N0088
16469d0803m4265m500K5587Q1079J99419j44936k70406j8781J53039k8643K161
16458i1049J6349N6958J56050J9456k1640P2805q5366j40932j988J75974K0053
16447A76670j0400j20342j06270J0969p306M7323P4821q7162j23402j19449k13068
16436d77616o8812J10K1141K67169L5796J26334N615o6603K0113L3325j6600j09313
$$ plain form
16424 -229341 -294289 -196876 -146035 -304329 -374827 -157127 -179618 -174889 -34284 49865 -21106
16413 -21106 -68059 -7508 25930 -10350 -35942 17813 -56697 -76420 -60168 24052 10328 40732
16401 40732 -36643 -47431 85194 67261 13598 -109345 -139716 -50864 -115459 -42739 36874
16390 36874 -67000 -240647 -276204 -8945 138422 46032 -224734 -428096 -559718 -530276
16380 -530276 -405676 -249464 -147569 -103148 -4578 96776 112385 12393 -53196 -18053 -17140
16369 -17140 69615 157047 131359 162468 15236 -241460 -253824 -312669 -320733 -33979 152271
16358 152271 226787 246667 117851 -57607 -33323 1458 -63497 -123820 -97413 -254146 -260246
16347 -260246 -156347 -66710 -17629 62698 7790 -51826 -12479 -186398 -185938 -189168 -64978
$$ packed form
16424b29341o4948R7413N0841j58294p0498K17700k2491M729J40605Q4149p0971
16413b1106m6953O0551L3438l6280k5592N3755p4510j9723J6252Q4220j3724L0404
16401D0732p7375j0788J32625j7933n3663j22943l0371Q8852o4595P2720P9613
16390C6874j03874j73647l5557K67259J47367r2390k70766k03362j31622K9442
16380e30276J24600J56212J01895M4421R8570J01354J5609r9992o5589L5143R13
16369a7140Q6755Q7432k5688L1109j47232k56696j2364n8845q064K86754J86250
16358A52271P4516J9880j28816j75458K4284L4781o4955o0323K6407j56733o100
16347b60246J03899Q9637M9081Q0327n4908n9616L9347j73919M60l230J24190
$$ plain form
16336 -64978 51492 23415 60034 34750 106863 69045 90458 96436 157388 158067 83179 29192
16324 29192 73692 37668 24951 -142515 -220238 -154044 -232034 -311427 -243105 -78982 20968
16313 20968 -54970 -52583 25069 -47464 -196589 -169349 -124201 -99919 35686 142890 230956
16302 230956 49328 -132666 -26933 73956 41776 -83722 -145188 -113983 -45473 -145116
16292 -145116 -160687 -103139 -106724 -52341 -25209 -185046 -33970 36195 -42304 -204776 -222889
16281 -222889 -249565 -184951 -94737 -131265 -7187 209318 20952 -131285 -152982 -89453 44808
16270 44808 24629 -34426 -171813 -136195 -7748 -52934 -494 -104087 -231609 -242803 -26303
16259 -26303 77209 81243 98962 3157 -55240 -82927 -240724 -221457 -224823 -75003 -56860
$$ packed form
16336f4978J16470k8077L6619k5284P2113l7818K1413N978O0952O79p4888n3987
16324B9192M4500l6024j2717j67466p7723O6194p7990p9393O8322J64123R9950
16313B0968p5938K387P7652p2533j49125K7240M5148K4282J35605J07204Q8066
16302B30956j81628j81994J05733J00889l2180j25498o1466L1205O8510r9643
16292a45116j5571N7548l585N4383K7132j59837J51076P0165p8499j62472j8113
16281b22889k6676O4614R0214l6528J24078K16505j88366j52237k1697O3529J34261
16270D4808k0179n9055j37387L5618J28447m5186N2440j03593j27522j1194K16500
16259b6303J03512M034J7719r5805n8397k7687j57797J9267l366J49820J8143
$$ plain form
16248 -56860 -4181 60236 27955 -54663 -16301 -45705 641 -31965 -43272 -19875 -108078 -224638
16236 -224638 -128318 -159532 -133353 -120992 -49250 4603 140806 204447 -93972 -285993 -162302
16225 -162302 -106936 -310275 -260490 -133780 -75392 -221114 -263216 -195206 -83663 -115840 -165641
16214 -165641 26840 -91749 -240777 -263135 -369291 -339441 -302068 -198413 -169504 -4867
16204 -4867 -95199 -199155 -315029 -297754 -235370 -206700 -107842 -190234 -199441 -79866 -110156
16193 -110156 -203004 -156936 -158851 -127557 -107619 -89547 -38315 14210 30978 -79559 14513
16182 14513 147251 5177 -81086 -71134 60835 19229 -76882 24073 122832 42518 -100139
16171 -100139 -71343 -94089 -96133 64826 41881 -6128 16145 11582 -110573 -178602 -199591
$$ packed form
16248e6860N2679O4417l2281q2618L8362k9404M6346l2606j1307K3397q8203j16560
16236b24638R6320l1214K6179J2361P1742N3853J36203O3641k98419j92021J23691
16225a62302N5366k03339M9785J26710N8388j45722m2102O8010J11543l2177m9801
16214a65641J92481j18589j49028k2358j06156K9850L7373J03655K8909J64637
16204d867r0332j03956j15874J7275O2384K8670R8858q2392r207J19575l0290
16193a10156r2848M6068j915L1294J9938J8072N1232N2525J6768j10537R4072
16182A4513J32738j42074q6263R952J31969m1606r6111J00955R8759q0314j42657
16171a00139K8796k2746k044J60959k2945m8009K2273m563j22155o8029k0989
$$ plain form
16160 -199591 -176010 -247679 -128876 38037 100862 121506 171517 132331 79416 59299 4419
16149 4419 -120337 -229413 -207539 -141999 -131842 -160512 -295186 -336321 -96557 125038 13242
16138 13242 -77040 -122565 51307 -21816 -48198 -23967 -29124 -102327 -198943 -32950 231784
16127 231784 213803 187920 58309 37903 -115243 -245720 -69189 83673 1652 -142310
16117 -142310 -183318 -102930 -168087 -278676 -263696 -194069 -246164 -222649 -81350 -93175 -258625
16106 -258625 -184359 -89214 1227 -123661 -45263 -46379 -92116 32960 9585 -67589 -133035
16095 -133035 -240540 -280648 -137527 -105577 -152689 -210313 -115409 -101085 -144601 -301186 -215804
16084 -215804 -91428 -30297 50047 309 -33871 66083 -46189 -109573 -106433 -74301 -290531
$$ packed form
16160a99591K3581p1669J18803J66913O2825K0644N0011l9186n2915k0117n4880
16149D419j24756j09076K1874O5540J0157k8670j34674m1135K39764K21595j11796
16138A3242r0282m5525J73872p3123k6382K4231n157p3203r6616J65993K64734
16127B31784j7981k5883j29611k0406j53146j30477J76531J52862q2021j43962
16117a42310m1008Q0388o5157j10589J4980O9627n2095K3515J41299j1825j65450
16106b58625P4266R5145R0441j24888P8398j116m5737J25076k3375p7174o5446
16095a33035j07505m0108J43121L1950m7112n7624R4904J4324m3516j56585Q5382
16084b15804J24376O1131Q0344m9738l4180R9954j12272o3384L140L2132k16230
$$ plain form
16073 -290531 -323954 -311884 -214257 -174987 -202987 -135907 -133 73671 91546 14587 -22122
16062 -22122 -34393 75270 60389 -78217 -65009 -92077 -169847 -245284 -323118 -335257 -317409
16051 -317409 -197928 -97705 -114053 -186552 -106071 -49691 64180 118641 -16737 -155750
16041 -155750 -159820 -112255 -241429 -224182 -100879 -73866 -89236 -247385 -365645 -206185 10923
16030 10923 -92919 -199612 -249350 -223431 -32279 154248 94110 74396 -12901 -96148 -301293
16019 -301293 -303270 -221515 -74304 -24367 83295 -115480 -252342 -279842 -363055 -333446 -382712
16008 -382712 -448074 -263572 -5206 131069 50055 82977 111305 -21967 8245 -16306 -109954
15997 -109954 -109431 -221741 -219014 -246543 -298468 -175473 -145031 36546 156906 146275 130667
$$ packed form
16073b90531l3423J2070R7627L9270k8000O7080J35774P3804J7875p6959l6709
16062b2122j2271J09663j4881j38606J3208k7068p7770p5437p7834j2139J7848
16051c17409J19481J00223j6348p2499Q0481N6380J13871N4461j35378j39013
16041a55750m070M7565j29174J7247J23303K7013j5370j58149j18260J59460K17108
16030A0923j03842j06693m9738K5919J91152J86527o0138j9714q7297q3247k05145
16019c01293j977Q1755J47211M9937J07662j98775j36862k7500q3213K9609m9266
16008c82712o5362J84502K58366J36275q1014L2922K8328j33272L0212k4551r3648
15997a09954N23j12310K727k7529n1925J22995L0442J81577J20360j0631j5608
$$ plain form
15986 130667 95747 11363 88847 -26126 -141500 -273651 -348717 -291968 -47060 33323 55404
15975 55404 -13128 17267 29617 -30203 -46914 -152860 -91412 15282 40034 63279 107766
15964 107766 237438 207824 75032 76837 161755 275668 195560 238967 201696 48784 -69074
15953 -69074 -94749 -90350 -154566 -165731 -116554 -265399 -134343 -82012 -44583 -153956 -233892
15942 -233892 -155098 -150299 -145650 -184610 -182281 -73848 -19519 -34366 -76665 -40093 42697 74917
15930 74917 188316 52500 -127099 -160737 8731 -101364 -98748 6994 -19250 -43540 -111937
15919 -111937 -59450 34647 14024 116817 130425 98861 -64009 -277753 -196049 -184506 -237726
15908 -237726 -148864 -30552 -153189 -130321 -28556 -34139 -7229 -47266 -198079 -254586 -354346
$$ packed form
15986A30667l4920q4384P7484j14973j15374j32151p5066N6749K44908Q0383K2081
15975E5404o8532L0395J2350n9820j6711j05946O1448J06694K4752K3245M4487
15964A07766J29672k9614j32792J805Q4918J13913q0108M3407l7271j52912j17858
15953f9074k5675M399o4216j1165M9177j48845J31056N2331L7429j09373p9936
15942b33892P8794M799M649l8960K329J08433N4329j4847m2299L6572Q2790L2220
15930G4917J13399j35816j79599l3638J69468j10095K616J05742k6244k4290o8397
15919a11937N2487R4097k0623J02793J3608l1564j62870k13744Q1704J1543n3220
15908b37726Q8862J18312j22637K2868J01765n583K6910m0037j50813n6507r9760
$$ plain form
15897 -354346 -349174 -153614 104472 84763 -55915 -136281 -145184 -10096 38017 43551 164201
15886 164201 202817 200836 263745 46563 -119722 5535 39588 -29365 -205190 -283458 -452736
15875 -452736 -464195 -277536 -201991 -154039 -152931 -155153 -129133 -154754 -192899 -202229 -129961 -146768
15863 -146768 -89335 -83135 -118851 -31642 -172776 -302178 -216774 -100950 -142032 -144411 -117083
15852 -117083 -253622 -266165 -201779 -90444 -132783 -84097 -140953 -277826 -328791 -255924 -215373
15841 -215373 -45696 2600 -79435 -54475 31788 26799 -25210 138313 161897 186241 161758
15830 161758 74413 -140060 -237020 -87704 -55819 -33597 -77822 -146745 -52936 -144404 -231459
15819 -231459 -397647 -409452 -78015 104408 160879 151226 295711 207281 205302 215125 87175
$$ packed form
15897c54346N172J95560K58086j9709j40678q0366q903J35088M8113N534J20650
15886A64201L8616j981O2909k17182j66285J25257L4053o8953j75825p8268j69278
15875d52736j1459J86659P5545M7952J108k222K6020k5621l8145r330P2268j6807
15863a46768N7433O200l5716Q7209j41134j29402Q5404J15824m1082k379K7328
15852a17083j36539j2543O4386J11335m2339M8686n6856j36873n0965P2867M0551
15841b15373J69677M8296q2035K4960Q6263m989n2009J63523K3584K4344k4483
15830A61758q7345k14473r6960J49316L1885K2222m4225o8923R3809r1468q7055
15819b31459j66188j1805L31437J82423N6471r653J44485q8430j979R823j27950
$$ plain form
15808 87175 -54742 31876 103421 112208 293075 342973 131020 -12340 -66653 -33021 -22261
15797 -22261 51045 70131 135175 240142 245909 156492 185455 155278 183728 119251 41504 -194398
15785 -194398 -173596 -156841 -7234 110798 7833 49406 71769 216932 166434 -39577
15775 -39577 -114237 1867 83614 5462 -65922 -112363 -145266 -153466 -219270 -138141 -194808 -193586
15763 -193586 -215772 -67033 -26840 27062 191932 275974 256878 165676 327006 429568 453765
15752 453765 517194 924977 1331274 1913392 2976918 4326496 5563470 6258083 6493536
15743 6493536 6542893 5662470 4449673 3457279 2876779 2494871 2033484 1708297 1602984
15734 1602984 1380251 1118702 1016695 913176 941424 1031110 1029966 1034542 1174626 1030443
$$ packed form
15808H7175j41917Q6618P1545Q787J80867M9898k11953j43360n4313L3632J0760
15797b2261P3306J9086O5044J04967N767q9417K8963l0177K8450o4477p7747k35902
15785a94398K0802J6755J49607J18032j02965M1573K2363J45163n0498k06011
15775c9577p4660J16104Q1747p8152p1384m6441l2903q200o5804Q1129n6667J222
15763a93586k2186J48739M0193N3902J64870Q4042j9096r1202J61330J02562K4197
15752D53765O3429M07783M06297N82118J063526J349578J236974O94613K35453
15743F493536M9357q80423j212797r92394n80500l81908m61387l25187j05313
15734A602984k22733k61549j02007j03519K8248Q9686j144M576J40084j44183
$$ plain form
15724 1030443 896171 822064 756229 728663 588691 506562 599123 505780 562962 570684 447648
15713 447648 375855 502018 533317 392431 202388 67942 64924 185600 317439 451516
15703 451516 306354 297320 222716 108826 61077 146021 140613 85187 114097 47316 35961
15692 35961 110225 117245 255573 276589 287700 208035 277311 192953 118381 108076 221642
15681 221642 340648 278545 190246 201442 94980 14986 -109846 -144367 -36824 65329
15671 65329 115169 142816 48904 -47804 -245276 -227331 -78068 8152 -49563 -202974 -17836
15660 -17836 -96043 -59520 -6580 41311 52589 -30012 -105228 -227690 -296561 -182935 31867
15649 31867 106201 239252 273125 194828 86529 -113934 -297149 -365935 -188473 -82518
$$ packed form
15724A030443j34272p4107o5835k7566j39972q2129R2561r3343N7182P722j23036
15713D47648p1793J26163L1299j40886j90043j34446l018J20676J31839J34077
15703D51516j45162r034p4604j13890m7749Q4944n408n5426K8910o6781j1355
15692C5961P4264P020J38328K1016J1111p9665O9276q4358p4572j0305J13566
15681B21642J19006o2103q8299J1196j06462p9994j24832l4521J07543J02153
15671F5329M9840K7647r3912r6708j97472J7945J49263Q6220n7715j53411J85138
15660a7836p8207L6523N2940M7891J1278q2601p5216j22462o8871J13626K14802
15649C1867P4334J33051L3873p8297j08299k00463j83215o8786J77462J05955
$$ plain form
15639 -82518 -42778 -35620 -16560 73838 132509 128542 135483 -31570 -2157 -19765 -117391 -70184
15627 -70184 -248728 -290328 -120991 -83214 -91777 -165201 -229753 -187712 -114091 -56611 -98505
15616 -98505 -118598 -38799 -48738 -93195 118480 188772 140984 184713 167241 160586 102995 259045
15604 259045 305446 137936 201552 340714 215212 138683 -30983 -229939 -148397 -111024
15594 -111024 -149726 -154053 -178387 -165781 -120391 -79728 -51217 -24258 112357 163946 80198
15583 80198 -42817 83537 257031 271337 92438 50747 -39749 -54043 83253 246049
15573 246049 127762 52641 -72389 -24724 36213 37261 58700 43929 -79653 -162335 -111050
15562 -111050 -13358 57907 145406 140783 -63680 -302241 -369892 -173352 -91895 -35958 202
$$ packed form
15639h2518L9740P158J9060R0398N8671l967O941j67053K9413j7608r7626M7207
15627g0184j78544m1600J69337L7777q563p3424o4552M2041P3621N7480m1894
15616i8505k0093P9799r939m4457K11675P0292m7788M3729j7472o655n7591J56050
15604B59045M6401j67510O3616J39162j25502p6529j69666j98956Q1542L7373
15594a11024l8702m327k4334J2606M5390M0663K8511K6959J36615N1589q3748
15583H0198j23015J26354J73494J4306j78899m1691r0496j4294J37296J62796
15573B46049j18287p5121j25030M7665O0937J048K1439j4771j23582q2682N1285
15562a11050R7692P1265Q7499m623k04463k38561o7651J96540Q1457N5937L6160
$$ plain form
15551 202 4913 -67203 -76040 -12348 -116576 -244397 -152664 48121 30647 -143188 -164934 -65429
15539 -65429 32596 -166658 -188786 -128536 -188945 -86755 58029 89419 23513 -163158 -111524
15528 -111524 9901 1965 -8066 93363 64810 119443 267480 273463 319437 225067 41374
15517 41374 12596 -1609 -10287 -112736 -99238 4576 85022 40980 11361 120052 193785
15506 193785 234288 224092 255800 187146 165178 253311 126415 -2842 29275 130505 159587
15495 159587 158271 112068 106710 153252 131992 84908 115473 164960 117038 171245 6326 -24906
15483 -24906 -86861 -37948 -65743 29086 259512 290158 160620 147956 109333 82269 -20734
15472 -20734 33384 216694 326000 197112 240047 209610 14602 -56795 38846 21190 28629
$$ packed form
15551B02M711p2116q837O3692j04228j27821R1733K00785j7474j73835k1746R9505
15539f5429R8025j99254k2128O0250o0409J02190J44784L1390o5906j86671N1634
15528a11524J21425p936j0031J01429k8553N4633J48037N983M5974r4370j83693
15517D1374k8778j4205q678j02449J3498J03814Q0446m4042k9619J08691P3733
15506A93785M0503j0196L1708o8654k1968Q8133j26896j29257L2117J01230K9082
15495A59587j316m6203n358M6542k1260m7084L0565M9487m7922N4207j64919l1232
15483b4906o1955M8913k7795R4829K30426L0646j29538j2664l8623k7064j03003
15472b0734N4118J83310J09306j28888M2935l0437j95008p1397R5641j7656P439
$$ plain form
15461 28629 146967 209937 181493 135484 223625 116613 101220 154874 258989 233833 89942
15450 89942 44834 117466 64693 -64978 -113020 41287 104262 169897 285533 361194 237134
15439 237134 16702 -34866 -154468 -187804 -322887 -403919 -301987 -68533 119710 270164
15429 270164 325796 117994 94427 298403 372269 281694 114355 -10374 23530 79692 105041
15418 105041 88442 -8299 -48288 -77981 15346 24916 17486 -5908 -170763 -147906 -3782
15407 -3782 89139 95372 75445 -66892 -88761 -128553 -199112 -235546 -270380 -214323 -174717 -132813
15395 -132813 -163187 -251697 -316690 -320809 -84773 181813 211365 195213 192575 5938 -151448
15384 -151448 -201361 -187340 -92806 -182459 -137438 -147663 -46652 -123641 -145636 -116124 -87786
$$ packed form
15461B8629J18338O2970k8444m6009Q8141j07012j5393N3654J04115k5156j43891
15450H9942m5108P2632n2773j29671m8042J54307O2975O5635J15636P5661j24060
15439B37134k20432n1568j19602l3336j35083q1032J01932K33454J88243J50454
15429B70164N5632k07802k3567K03976P3866r0575j67339j24729L3904N6162K5349
15418A05041j6599r6741l9989k9693R3327R570p430k3394j64855K2857J44124
15407c782R2921O233j9927j42337k1869l9792p0559l6434l4834N6057L9606M1904
15395a32813l0374q8510o4993m119K36036K66586K9552j6152k638j86637j57386
15384a51448m9913J4021R4534q9653M5021j0225J01011p6989k1995K9512K8338
$$ plain form
15373 -87786 -89895 -202468 -279447 -260700 -176422 -85389 4013 33302 43690 176159 248178
15362 248178 119797 69844 65002 -86633 -82874 -131811 -125105 -90751 76650 -29627 -29777 60244
15350 60244 207395 262565 136369 222651 182427 -29901 -192184 -232961 -197841 -113771 -50432
15339 -50432 -137593 -165469 -22357 -4984 50202 -57104 -32141 -33911 42313 313275 261497
15328 261497 82820 -130245 -234173 -168948 -137628 -93875 -39823 -38543 -109133 -53423 -23968
15317 -23968 132943 93852 -157522 -288219 -194818 -261013 -179095 -94075 -29141 -56749 -71653
15306 -71653 33721 67639 6220 -82352 -172388 -317623 -332175 -299669 -166083 -76559 -56466
15295 -56466 -42078 -64749 -183541 -318871 -324840 -160095 -25565 13465 -46074 -79049 -97749
$$ packed form
15373h7786k109j12573p6979J8747Q4278R1033Q9402K9289J0388J32469P2019
15362B48178j28381m9953m842j51635L759m8937O706L4354J67401j06277j50R0021
15350F0244J47151N5170j26196Q6282m0224k12328j62283m0777L5120Q4070O3339
15339e0432q7161k7876J43112J7373N5186j07306K4963j770P6224K70962n1778
15328B61497j78677k13065j03928O5225L1320M3753N4052J280p0590N5710K9455
15317b3968J56911l9091k51374j30697R3401o6195Q1918Q5020O4934k7608j4904
15306g1653J05374L3918o1419q8572r0036j45235j4552L2506J33586Q9524K0093
15295e6466J4388k2671j18792j35330n969J64745J34530L9030n9539l2975j8700
$$ plain form
15284 -97749 -93993 51265 146057 88317 135229 87786 -113718 -283473 -240070 -49676 25875
15273 25875 -2688 -4307 57527 7715 35388 132369 64961 78226 106616 118090 45253 46967
15261 46967 119196 157666 89475 81165 90528 60111 117987 102615 78177 -14605 -52706 -29338
15249 -29338 -46713 -142824 -70962 -86117 46296 164840 41085 -36402 -25271 -31323 83704
15238 83704 12827 94552 -93356 -106435 -87522 -92882 -164721 -141537 -65173 -80144 -65256 -30336
15226 -30336 -29576 -61000 -139468 -58656 -37945 16976 67382 77558 85642 104239 47190 -68098
15214 -68098 -113319 -50755 -173682 -201780 -123920 -107845 -13679 20219 78347 85787 97137 140317
15202 140317 262802 316557 250215 119919 59832 14258 -163437 22291 74405 38598 -43610
$$ packed form
15284i7749L756J45258R4792n7740M6912m7443k01504j69755M3403J90394P5551
15273B5875k8563j619O1834m9812K7673R6981o7408J3265K8390J1474p2837J714
15261D6967P2229L8470o8191q310R363l0417N7876j5372k4438r2782l8101K3368
15249b9338j7375r6111P1862j5155J32413J18544j23755p7487J1131o052J15027
15238H3704p0877Q1725j87908j3079J8913n360p1839K3184P6364j4971J4888L4920
15226c0336P60l1424p8468Q0812K0711N4921N0406J0176Q084J8597n7049j15288
15214f8098m5221O2564j22927k8098P7860J6075R4166L3898N8128P440J1350M3180
15202A40317J22485N3755o6342j30296o0087m5574j77695J85728N2114l5807q2208
$$ plain form
15191 -43610 -82457 58186 17784 4048 -298666 -391904 -219698 -115603 -258941 -242300 -62501
15180 -62501 -96270 13348 -98337 -193104 -234118 -129341 -492 85593 -61881 -163367
15170 -163367 -150922 -169283 -29407 -3231 94973 216352 298510 257042 228046 191530 270120
15159 270120 223175 145388 154997 106201 20804 -94540 -154538 -86549 -106293 -36284 -85129
15148 -85129 -48270 33057 112920 87087 -31713 -188798 -226296 -135679 -91737 -122166 -167679
15137 -167679 -112453 -86582 -9349 43536 -43474 27348 101291 113220 128171 -2254 -180586
15126 -180586 -173804 -27046 192766 260307 63896 142854 384209 441320 335445 270798 74938
15115 74938 175800 433293 535434 300037 34529 114534 239022 172507 25104 -29863
$$ packed form
15191d3610l8847J40643m0402j3736l02714r3238J72206J04095j43338J6641J79799
15180f2501l3769J09618j11685r4767m1014J04777J28849Q6085j47474j01486
15170a63367J2445j8361J39876K6176R8204J21379Q2158m1468k8996l6516P8590
15159B70120m6945p7787R609m8796q5397j15344n9998O7989j9744P0009m8845
15148h5129L6859Q1327P9863k5833j18800j57085l7498R0617M3942l0429m5513
15137a67679N5226K5871P7233N2885q7010P0822P3943J1929J4951j30425j78332
15126a80586O782J46758K19812O7541j96411P8958K41355N7111j05875o4647j95860
15115G4938J00862K57493J02141k35397k65508Q0005J24488o6515j47403n4967
$$ plain form
15105 -29863 -138732 7796 181997 190023 110733 -80965 -143052 -99932 -5641 61127 268906
15094 268906 255321 3380 -59027 24720 132033 62387 83177 178845 99059 103400 99295
15083 99295 94541 39981 -74158 -72873 -73875 -183883 -111049 -8208 -34021 -132391 -117718 -21980
15071 -21980 -13454 -14308 78884 -3019 -74398 11556 18617 61262 238519 291011 199141 89845
15059 89845 255660 425905 198447 121185 75526 89583 85665 112380 140394 119377 172677
15048 172677 228395 289411 214383 71489 -20448 164129 217181 136159 -73262 -74860 122538
15037 122538 139926 155618 344530 362229 262517 325410 266096 289290 204709 173598 233677
15026 233677 -9730 99233 115087 -7877 -2684 43597 166023 60750 38655 63039 82946
$$ packed form
15105b9863j08869J46528J74201Q026p9290j91698o2087M3120R4291O6768K07779
15094B68906j3585k51941o2407Q3747J07313o9646K0790R5668p9786M341m105
15083I9295m754n4560j14139J285j002j10008P2834J02841k5813r8370J4673R5738
15071b1980Q526q54R3192q1903p1379Q5954P061M2645J77257N2492r1870j09296
15059H9845J65815J70245k27458p7262m5659J4057l918K6715K8014k1017N3300
15048A72677N5718O1016p5028j42894r1937J84577N3052q1022k09421j598J97398
15037A22538J7388J5692J88912J7699r9712O2893n9314K3194q4581l1111O0079
15026B33677k43407J08963J5854j22964N193M6281J22426j05273k2095K4384J9907
$$ plain form
15015 82946 94479 78549 28372 11472 -83548 -56975 -54896 -41369 -76505 -129430 58513 159899
15003 159899 191428 340866 320302 322611 162256 74477 367 -27396 -26484 -29580 -88652 -33538
14991 -33538 125077 90929 -104854 -181065 8628 163372 154378 195676 337729 255447 79574
14980 79574 65206 167642 169946 211287 132925 -30151 2774 72094 161082 107453 16566
14969 16566 -32237 18289 13034 69974 -13986 41827 -6617 62054 143405 57874 -55669 -88016
14957 -88016 -71021 -136704 -141337 79011 274212 201715 203645 98230 26663 106179 145564
14946 145564 187093 133696 76052 -23597 106536 -62986 -140025 -107780 135218 157833 166770
14935 166770 133533 204438 226722 199509 111800 126994 132766 102719 83324 124460 140309 75514
$$ packed form
15015H2946J1533j5930n0177j6900r5020K6573K079J3527l5136n2925J87943J01386
15003A59899L1529J49438k0564K309j60355q7779p4110k7763R12l096n9072N5114
14991c3538J58615l4148j95783p6211J89693J54744q994M1298J42053q2282j75873
14980G9574j4368J02436K304M1341p8362j63076L2925O9320Q8988n3629r0887
14969A6566m8803N0526n255N6940q3960N5813m8444O8671Q1351q5531j13543l2347
14957h8016J6995o5683m633K20348J95201p2497J930j05415p1567P9516L9385
14946A45564M1529n3397n7644r9649J30133j69522p7039L2245K42998K2615Q937
14935A66770l3237P0905K2284k7213q7709J5194N772l0047j9395M1136J5849o4795
$$ plain form
14923 75514 76873 32144 167212 128482 -9596 59546 82223 35717 -13303 8100 52876
14912 52876 127311 91009 130514 73760 -99374 -53781 15024 130393 123042 127515 124634 -40085
14900 -40085 -151465 -163808 -32328 149947 155467 188477 177995 67023 206586 130073 72805
14889 72805 -15765 -24766 -47939 69562 191252 107619 140383 9365 42031 246170 280894
14878 280894 83668 8740 57338 208791 119278 -30937 -163223 -111722 -18686 -188450
14868 -188450 -272223 -145352 -154467 -98785 -101515 -110959 -144494 121412 235907 34767 -87011
14857 -87011 -111680 -111948 -67665 18618 -73508 37658 102608 -53083 -142788 -192329 -214489 -225550
14845 -225550 -130925 -110673 -243520 -60968 10055 -70345 17548 34334 105341 197416 456187
$$ packed form
14923G5514J359m4729J35068l8730j38078O9142K2677m6506m9020K1403M4776
14912E2876P4435l6302L9505n6754j73134M5593O8805J15369p351M473k881j64719
14900d0085j11380j2343J31480J82275N520L3010j0482j10972J39563p6513n7268
14889G2805q8570r001k3173J17501J21690q3633L2764j31018L2666K04139L4724
14878B80894j97226p4928M8598J51453q9513j50215j32286N1501R3036j69764
14868a88450q3773J26871r115N5682k730r444l3535K65906J14495k01140j21778
14857h7011k4669k68M4283Q6283r2126J11166O4950j55691q9705m9541k2160j1061
14845b25550R4625K0252j32847J82552P1023q0400Q7893J6786P1007R2075K58771
$$ plain form
14834 456187 300681 234642 77861 77693 -74839 -112160 -9422 -147965 -309483 -109608
14824 -109608 -106949 79104 257373 72510 -21514 142072 195779 76682 70583 104501 54248
14813 54248 -35205 -112386 -30306 21704 68877 102015 266260 364697 273283 231130 217674
14802 217674 174264 76974 176613 210145 95833 31891 29927 201706 293878 195916 176472
14791 176472 68102 18890 -102053 -130611 49274 294629 257030 186642 177454 134065 141578
14780 141578 58576 84400 125051 123579 204143 109375 44796 -151840 -9147 108188 33450
14769 33450 23258 113700 241476 204877 231609 99135 21359 185883 97073 3924 -74151
14758 -74151 -41460 50829 93551 144026 173410 49220 -41870 -201680 -78823 -58804 39504
$$ packed form
14834D56187j55506o6039j56781j68j52532l7321J02738j38543j61518J99875
14824a09608K659J86053J78269j84863r4024J63586N3707j19097o099L3918n0253
14813E4248q9453p7181Q2080N2010M7173L3138J64245R8437r1414m2153j3456
14802B17674m3410r7290R9639L3532j14312o3942j964J71779R2172r7962j9444
14791A76472j08370m9212j20943k8558J79885K45355l7599p0388r188m3389P513
14780A41578q3002K5824M0651j472Q0564r4768o4579j96636J42693J17335p4738
14769C3450j0192R0442J27776l6599K6732j32474p7776J64524q8810r3149p8075
14758g4151L2691R2289M2722N0475K9384j24190r1090j59810J22857K0019R8308
$$ plain form
14747 39504 50753 -67716 -33545 74584 57907 216065 260563 105643 -439 -6878 -26649
14736 -26649 -606 157944 190623 68189 -9676 115612 -13782 15422 79652 179358 93434
14725 93434 87670 201471 299036 329959 260712 128685 -12179 -178431 -252682 -88773 168869
14714 168869 212223 209836 166666 188902 259733 252772 228773 410172 342732 124935 116929 170333
14702 170333 -5861 -42500 -74495 -10617 97585 -72095 -245252 -229734 -125127 -60019
14692 -60019 -17693 96201 43107 83812 95720 200543 184619 219120 337973 394982 384572
14681 384572 360500 236301 18759 -164209 -186021 -126424 55729 117584 139250 30275
14671 30275 -79545 -141033 -130027 -171090 -195266 -69970 189348 79364 -16030 173068 137333
$$ packed form
14747C9504J1249j18469L4171J08129j6677J58158M4498j54920j06082o439j9771
14736b6649K6043J58550L2679j22434p7865J25288j29394K9204O4230R9706q5924
14725I3434n764J13801R7565L0923o9247j32027j40864j66252p4251J63909K57642
14714A68869M3354k387m3170K2236P0831o961k3999J81399o7440k17797q006N3404
14702A70333j76194l6639l1995O3878J08202j69680j73157J5518J04607O5108
14692f0019M2326J13894n3094M0705J1908J04823j5924L4501J18853N7009j0410
14681C84572k4072j24199k17542j82968k1812N9597J82153O1855K1666j08975
14671C0275j09820o1488J1006m1063k4176J25296K59318j09984r5394J89098l5735
$$ plain form
14660 137333 104531 291382 365551 262107 248139 266872 324870 309917 385203 309765 262778
14649 262778 127030 51917 -132934 -179376 -150365 14820 -6344 85911 143040 137000 70863
14638 70863 100697 68065 138066 157908 220620 150287 128515 176885 257472 223219 214785 218572
14626 218572 260895 155559 43424 -55196 52322 195601 86040 104486 -60087 21699
14616 21699 229019 294347 245046 279821 422694 272009 271129 280191 272266 231745 114695 2539
14604 2539 30944 -82221 -114145 -87980 -115755 -107067 79136 196348 78870 295878 170575
14593 170575 7943 90640 203311 219075 221324 115674 55218 25876 -248674 -209300 148458
14582 148458 410052 447007 313864 266456 242527 399637 481261 448615 371281 220403 -20554
$$ packed form
14660A37333l2802J86851P4169j03444j3968J8733N7998j4953P5286p5438m6987
14649B62778j35748p5113j84851m6442K9011J65185k1164R2255N7129o040o6137
14638G0863K9834l2632P0001J9842O2712p0333k1772M8370Q0587l4253q434L787
14626B18572M2323j05336j12135r8620J07518J43279j09561J8446j64573Q1786
14616B1699K07320O5328m9301L4775J42873j50685q80R062p925m0521j17050j12156
14604B539K8405j13165l1924K6165k7775Q688J86203J17212j17478K17008j25303
14593A70575j62632Q2697J12671J5764K249j05650o0456k9342k74550L9374L57758
14582A48458K61594L6955j33143m7408k3929J57110Q1624l2646p7334j50878k40957
$$ plain form
14571 -20554 -10314 80822 139986 141024 229483 295243 144737 160508 172700 291706 426625
14560 426625 186010 81496 178019 220571 261735 245544 180748 115942 33325 115804 238100
14549 238100 300408 320890 229025 37440 -61661 -266078 -235690 -118887 -208715 -58859 244808
14538 244808 186240 51415 19034 -18197 108151 332043 366003 445090 411224 371491 400099
14527 400099 413101 387705 316231 340314 355861 417346 332789 227830 204920 199124 192421 158153
14515 158153 145932 66615 -38842 -89257 25116 198827 304116 392722 452873 293743
14505 293743 108569 66737 138607 140867 227534 223982 159840 121032 175593 288851 246068
14494 246068 347036 455784 470214 313878 265459 159655 179223 185492 165370 40931 119112
$$ packed form
14571b0554J0240R1136N9164J038Q8459O5760j50506J5771J2192J19006J34919
14560D26625k40615j04514R6523M2552M1164j6191o4796o4806q2617Q2479J22296
14549B38100O2308K0482r1865j91585r9101k04417L0388J16803q9828J49856L03667
14538B44808n8568j34825l2381l7231J26348K23892L3960P9087l3866l9733K8608
14527D00099J3002k5396p1474K4083J5547O1485q4557j04959k2910n796o703l4268
14515A58153j2221p9317j05457n0415J14373J73711J05289Q8606O0151j59130
14505B93743j85174m1832P1870K260Q6667l552o4142l8808N4561J13258m2783
14494B46068J00968J08748J4430j56336m8419j05804J9568O269k0122j24439P8181
$$ plain form
14483 119112 184285 53612 -173870 -84556 161880 288805 186717 250146 370037 334285
14473 334285 301612 349309 319433 155293 153499 297402 412817 266890 259494 365208 194513
14462 194513 72167 233129 421512 406932 359843 421300 382491 415442 442674 308433 210699
14451 210699 190964 193305 247883 428744 418025 275102 272138 329094 302264 204149 143530
14440 143530 250759 334481 318975 362118 460097 276424 169169 116434 202068 411524 446239
14429 446239 334988 262593 219481 359429 359230 320706 334072 434934 532809 365705 217262
14418 217262 239776 190579 242131 370387 362885 170871 256010 455481 419201 390178 430107
14407 430107 403642 478167 523204 628824 545827 414897 477168 601896 645499 565896 518875
$$ packed form
14483A19112O5173j30673k27482Q9314K46436J26925j02088O3429J19891l5752
14473C34285l2673M7697k9876j64140j794J43903J15415j45927p396J05714j70695
14462A94513j22346J60962J88383j4580m7089O1457l8809L2951K7232j34241r7734
14451B10699j9735K341N4578J80861j0719j42923k964N6956k6830r8115o0619
14440A43530J07229Q3722j5506M3143R7979j83673j07255n2735Q5634K09456L4715
14429D46239j11251p2395m3112J39948j99l8524J3366J00862R7875j67104j48443
14418B17262K2514m9197N1552J28256p502j92014Q5139J99471l6280k9023L9929
14407D30107k6465P4525M5037J05620q2997j30930O2271J24728M3603p9603m7021
$$ plain form
14396 518875 276553 254155 313207 193285 248487 319880 513112 608064 592348 437340 428132
14385 428132 460383 461100 601002 522988 363827 385139 329939 297317 332713 346753 315254
14374 315254 125806 63589 -65228 -18631 203826 262355 107188 57494 160347 345631
14364 345631 321315 330653 351991 380471 211512 255700 112685 146623 218884 176322 261019
14353 261019 303440 309718 312178 377598 376141 539912 532544 595315 614793 516740 460482 416459
14341 416459 425252 382708 329524 299684 312885 346806 396529 355908 295555 214804 219669 364150
$$ packed form
14396E18875k42322k2398N9052j19922N5202P1393J93232R4952j5716j55008r208
14385D28132L2251P17J39902p8014j59161K1312n5200l2622L5396J4040l1499
14374C15254j89448o2217j28817M6597K22457N8529j55167m9694J02853J85284
14364C45631k4316R338K1338K8480j68959M4188j43015L3938P2261m2562Q4697
14353B61019M2421O278K460O5420j457J63771p368O2771J9478r8053n6258m4023
14341D16459Q793m2544n3184k9840J3201L3921M9723m0621o0353q0751M865J44481
$$ [...]
##END NTUPLES=NMR SPECTRUM
##END=
