##TITLE=Analysis number 313029
Compound Code cc 34909
Book Reference 441/129
Project Code adrs
Chemist Name colinb
##JCAMPDX= 6.0         $$ Bruker NMR JCAMP-DX V2.0
##DATA TYPE= NMR SPECTRUM
##DATA CLASS= NTUPLES
##ORIGIN= Bruker BioSpin GmbH
##OWNER= NMR
$$ XWIN-NMR		Version 3.5
$$ Wed Aug 24 09:30:48 2005 GMT Daylight Time (UT+1h)  MAYBRIDGE\NMR@NMR_250MHZ
##.OBSERVE FREQUENCY= 250.131544655141
##.OBSERVE NUCLEUS= ^1H
##.ACQUISITION MODE= SIMULTANEOUS (DQD)
##.ACQUISITION SCHEME= undefined
##.AVERAGES= 16
##.DIGITISER RES= 18
##SPECTROMETER/DATA SYSTEM= dpx250
##.PULSE SEQUENCE= zg30
##.SOLVENT NAME= CDCl3
##.SHIFT REFERENCE= (INTERNAL, CDCl3, 0, 16.522)
##AUDIT TRAIL= $$ (NUMBER, WHEN, WHO, WHERE, WHAT)
$$ ##TITLE= Audit trail, XWIN-NMR		Version 3.5
$$ ##JCAMPDX= 5.01
$$ ##ORIGIN= Bruker BioSpin GmbH
$$ ##OWNER= NMR
$$ C:\u/data/dgb/nmr/ADRS/8420/pdata/1/auditp.txt
$$ ##AUDIT TRAIL=  $$ (NUMBER, WHEN, WHO, WHERE, WHAT)
(   1,<2005-08-24 09:30:29.35 +100>,<MAYBRIDGE\NMR>,<NMR_250MHZ>,
      <created by zg, POWCHK disabled, PULCHK disabled
       configuration hash MD5:
       62 19 C7 07 E1 42 D1 B7 37 6C 3D D0 77 39 F9 E6
       data hash MD5: 64K
       3A 90 40 77 07 69 9B 80 55 7F D5 19 04 04 D9 72>)
(   2,<2005-08-24 09:30:40.17 +100>,<MAYBRIDGE\NMR>,<NMR_250MHZ>,
      <Start of raw data processing
       ef LB = 0.3 FT_mod = 6 PKNL = 1 SI = 32K 
       data hash MD5: 32K
       5F 65 08 DB 01 CF 81 95 E8 DD 5D BD A2 E0 A2 02>)
(   3,<2005-08-24 09:30:41.92 +100>,<MAYBRIDGE\NMR>,<NMR_250MHZ>,
      <apk 
       data hash MD5: 32K
       4C 12 63 D3 87 7B 58 55 9E 80 2F AC B0 04 0A 64>)
(   4,<2005-08-24 09:30:42.69 +100>,<MAYBRIDGE\NMR>,<NMR_250MHZ>,
      <abs ABSG = 5 
       data hash MD5: 32K
       8A FF 68 79 49 F9 53 C6 D6 4A 35 67 00 44 17 93>)
$$ ##END=
$$ 
$$ hash MD5
$$ 0A BC 63 8A 7B 13 FE A9 F3 4B 5B 1F FC 53 12 72
##$RELAX= 
##$RELAX= 
##$RELAX= 
##$RELAX= 
##$RELAX= 
##$RELAX= 
##$RELAX= 
$$ Bruker specific parameters
$$ --------------------------
##$DU= <C:\u>
##$EXPNO= 8420
##$NAME= <ADRS>
##$PROCNO= 1
##$TYPE= <nmr>
##$USER= <dgb>
##$AMP= (0..31)
100 100 100 100 100 100 100 100 100 100 100 100 100 100 100 100 100 100 
100 100 100 100 100 100 100 100 100 100 100 100 100 100 
##$AQSEQ= 0
##$AQ_mod= 3
##$AUNM= <au_zg>
##$AUTOPOS= <4 >
##$BF1= 250.13
##$BF2= 250.13
##$BF3= 250.13
##$BF4= 250.13
##$BF5= 500.13
##$BF6= 500.13
##$BF7= 500.13
##$BF8= 500.13
##$BYTORDA= 1
##$CFDGTYP= 0
##$CFRGTYP= 5
##$CHEMSTR= <none>
##$CNST= (0..31)
1 1 145 1 1 1 1 1 1 1 1 1 1 1 1 1 1 1 1 1 1 1 1 1 1 1 1 1 1 1 1 1 
##$CPDPRG= <>
##$CPDPRG1= <>
##$CPDPRG2= <>
##$CPDPRG3= <>
##$CPDPRG4= <mlev>
##$CPDPRG5= <mlev>
##$CPDPRG6= <mlev>
##$CPDPRG7= <mlev>
##$CPDPRG8= <mlev>
##$CPDPRGB= <>
##$CPDPRGT= <>
##$D= (0..31)
0 1 0 0 0 0 0 0 0 0.06 0 0 0 0 0 0 0.0002 0 0 0 0 0 0 0 0 0 0 0 0 0 0 
0 
##$DATE= 1124872228
##$DBL= (0..7)
120 120 120 120 120 120 120 120 
##$DBP= (0..7)
150 150 150 150 150 150 150 150 
##$DBP07= 0
##$DBPNAM0= <>
##$DBPNAM1= <>
$$ [...]
##$SUBNAM7= <"">
##$SUBNAM8= <"">
##$SUBNAM9= <"">
##$SW= 20.6930455092707
##$SWIBOX= (0..15)
0 0 3 0 0 0 0 0 0 0 0 0 0 0 0 0 
##$SW_h= 5175.983436853
##$TD= 65536
##$TD0= 1
##$TE= 295.16
##$TE2= 300
##$TE3= 300
##$TEG= 300
##$TL= (0..7)
0 120 120 120 120 120 120 120 
##$TP= (0..7)
150 150 150 150 150 150 150 150 
##$TP07= 0
##$TPNAME0= <>
##$TPNAME1= <>
##$TPNAME2= <>
##$TPNAME3= <>
##$TPNAME4= <>
##$TPNAME5= <>
##$TPNAME6= <>
##$TPNAME7= <>
##$TPOAL= (0..7)
0.5 0.5 0.5 0.5 0.5 0.5 0.5 0.5 
##$TPOFFS= (0..7)
0 0 0 0 0 0 0 0 
##$TUNHIN= 0
##$TUNHOUT= 0
##$TUNXOUT= 0
##$USERA1= <user>
##$USERA2= <user>
##$USERA3= <user>
##$USERA4= <user>
##$USERA5= <user>
##$V9= 5
##$VALIST= <valist>
##$VCLIST= <CCCCCCCCCCCCCCC>
##$VD= 0
##$VDLIST= <DDDDDDDDDDDDDDD>
##$VPLIST= <PPPPPPPPPPPPPPP>
##$VTLIST= <TTTTTTTTTTTTTTT>
##$WBST= 1024
##$WBSW= 4
##$XGAIN= (0..3)
0 0 0 0 
##$XL= 0
##$YL= 0
##$YMAX_a= 271101
##$YMIN_a= -341721
##$ZGOPTNS= <>
##$ZL1= 120
##$ZL2= 120
##$ZL3= 120
##$ZL4= 120
##$ABSF1= 16.522
##$ABSF2= -4.171173
##$ABSG= 5
##$ABSL= 3
##$ALPHA= 0
##$AQORDER= 0
##$ASSFAC= 0
##$ASSFACI= 0
##$ASSFACX= 0
##$ASSWID= 0
##$AUNMP= <proc_1d>
##$AZFE= 0.1
##$AZFW= 0.1
##$BCFW= 0
##$BC_mod= 0
##$BYTORDP= 0
##$COROFFS= 0
##$CY= 12.5
##$DATMOD= 1
##$DC= 0
##$DFILT= <>
##$DTYPP= 0
##$F1P= 14.0000005364418
##$F2P= -0.99999901652339
##$FCOR= 0.5
##$FTSIZE= 32768
##$FT_mod= 6
##$GAMMA= 0
##$GB= 0
##$INTBC= 1
##$INTSCL= 1
##$ISEN= 128
##$LB= 0.3
##$LEV0= 0
##$LPBIN= 0
##$MAXI= 10000
##$MC2= 0
##$MEAN= 0
##$ME_mod= 0
##$MI= 0
##$NCOEF= 0
##$NC_proc= -5
##$NLEV= 6
##$NOISF1= 0
##$NOISF2= 0
##$NSP= 0
##$NTH_PI= 0
##$NZP= 0
##$OFFSET= 16.522
##$PC= 1
##$PHC0= -76.5341
##$PHC1= 2.905603
##$PH_mod= 1
##$PKNL= yes
##$PPARMOD= 0
##$PSCAL= 4
##$PSIGN= 0
##$REVERSE= no
##$SF= 250.13
##$SI= 32768
##$SIGF1= 0
##$SIGF2= 0
##$SINO= 400
##$SIOLD= 32768
##$SREGLST= <1H.CDCl3>
##$SSB= 0
##$STSI= 32768
##$STSR= 0
##$SW_p= 5175.98343685301
##$SYMM= 0
##$S_DEV= 0
##$TDeff= 65536
##$TDoff= 0
##$TI= <Analysis number 999999
Compound Code 99
Book Reference 9
Project Code 9>
##$TILT= no
##$TM1= 0
##$TM2= 0
##$TOPLEV= 0
##$USERP1= <user>
##$USERP2= <user>
##$USERP3= <user>
##$USERP4= <user>
##$USERP5= <user>
##$WDW= 1
##$XDIM= 32768
##$YMAX_p= 517405810
##$YMIN_p= -618478
$$ End of Bruker specific parameters
$$ ---------------------------------
##NTUPLES= NMR SPECTRUM
##VAR_NAME=  FREQUENCY,     SPECTRUM/REAL,   SPECTRUM/IMAG
##SYMBOL=    X,             R,               I
##VAR_TYPE=  INDEPENDENT,   DEPENDENT,       DEPENDENT
##VAR_FORM=  AFFN,          ASDF,            ASDF
##VAR_DIM=   32768,         32768,           32768
##UNITS=     HZ,            ARBITRARY UNITS, ARBITRARY UNITS
##FACTOR=    0.157963299565203, 1,           1
##FIRST=     4132.6476996994, 0,             0
##LAST=      -1043.33573715361, 0,           0
##MIN=       -1043.33573715361, -618478,     0
##MAX=       4132.6476996994, 517405810,     0
$$ Real data points
##PAGE= N=1
##DATA TABLE= (X++(R..R)), XYDATA
$$ [...]
26341 -51944 -147044 -139095 18127 82094 120681 66643 29251 46403 51797 102777 27554 -65594
26329 -65594 -77808 -186033 -270578 -210462 -138836 -127835 -182340 -194474 -160361 -83855 -26821
26318 -26821 -89574 -144133 -20807 166299 164289 194673 158082 107924 159241 142534 135753 7648
26306 7648 -77723 6711 120173 161820 84840 89734 72079 82706 138935 126732 51732 -19400
26294 -19400 2999 57358 19584 -39647 137578 185066 167325 20897 75469 16229 -117389
26283 -117389 -100293 -10241 90909 123752 46668 29934 23795 -98382 -116898 -90209 -43418
26272 -43418 -84839 1487 28733 72986 161209 71371 -27734 59396 17365 -63456 84235
26261 84235 44179 -26992 83831 40710 30089 105552 132760 78160 -72105 -53244 -68725
26250 -68725 34613 125401 146064 66578 21895 20565 -38201 -63828 -103842 -41557 18459 -18971
26238 -18971 47129 78351 94929 72476 142900 90853 -898 -60357 -41465 -20733 -134903
26227 -134903 -93446 -165503 -227928 -159295 -70875 -16689 128252 137089 37237 -68859 -55697
26216 -55697 18119 143894 168156 -58267 -96459 10262 15509 -43409 -545 -53982 -13375
26205 -13375 141382 100822 42382 85828 146280 126188 80169 72538 49062 23177 21217 14068
26193 14068 -54641 58468 107876 54389 79604 93217 112319 121399 130284 36517 35465 118224
26181 118224 108522 59654 -22406 -153771 -217881 -192852 -133051 -35175 -54916 -185002 -150615
26170 -150615 -106361 -35328 90876 101724 137527 132032 90342 8296 -108493 -113584 -40663
26159 -40663 -109631 -86418 -207200 -172038 -56818 5817 60915 198655 214503 156821 60269
26148 60269 84334 85911 144592 62864 -8043 76388 152276 139920 234063 215676 169983 153571
26136 153571 86113 20535 49323 93350 85244 61983 -61215 5666 74604 58318 36751
26125 36751 54208 9592 28711 141633 136011 48433 158716 135477 -43779 -67560 11639
26114 11639 -3524 43678 21358 -42461 -99076 -48884 60911 18952 -43115 -33860 42062 19193
26102 19193 54471 94950 -4302 -148995 -211009 -157149 -96676 -41829 -70397 -159861 -250050
26091 -250050 -181066 -81334 -25861 -5728 73495 117068 139316 162593 141109 25272 8864
26080 8864 59984 -44262 -33265 3566 308 -95573 -169316 -70661 -59659 -136219 -50016 -23145
26068 -23145 -96266 -180839 -147002 -174800 -158879 -108643 10716 74488 71465 -25429 -71907 -70949
26056 -70949 -13237 141308 98982 153194 189441 108314 57869 32670 45081 6356 54077
26045 54077 56695 30356 42946 19938 -31910 -112124 -119559 -79338 -52440 -62784 -102924 -59842
26033 -59842 -17266 14828 33811 50184 -8958 -159036 -142746 -99239 2769 85102 133795
26022 133795 35598 -85831 -122217 -172268 -53406 39153 36335 111203 58345 32793 15265
26011 15265 -64123 -54804 27403 114239 92924 -26442 -100449 -75034 -119568 -82639 -56316 -77927
25999 -77927 -85488 -44631 51630 132750 74925 19421 -101908 -33607 -27654 -181424 -249791 -295571
25987 -295571 -57501 112924 93493 1471 -11022 52529 24560 -34462 -100134 -106217 -35765
25976 -35765 -11293 -103243 -83102 4550 78868 55063 -1157 -9250 -79323 -65721 -37129 44185
25964 44185 139614 116060 17273 -67894 4942 -10901 -18273 103668 84898 -8139 -21433 25282
25952 25282 32482 -91006 -96383 18054 27749 79114 120106 5314 -97810 -247184 -184140
25941 -184140 -151491 -115154 -23495 32344 94296 66694 48569 56343 23639 -33488 7515 17002
25929 17002 8059 135365 43957 -38368 3710 -29671 -87907 -139289 -93872 6864 151961
25918 151961 191259 60436 -36132 -74577 -122301 42384 161492 188818 95871 -21785 -109361
25907 -109361 -99355 -11527 34450 81015 54329 -34576 -169688 -116480 -14862 -90559 -163319
25896 -163319 -162036 -83666 -103045 -221247 -304392 -260473 -145409 -43679 -25249 -59219 -131148
25885 -131148 -125129 -99831 -64895 27705 57865 1951 -10519 -131390 -100592 -14129 90797
25874 90797 30405 23765 58299 61918 1028 -35447 -71681 -71311 -141315 -142049 -90543 -139452 -139203
25861 -139203 -120083 31047 50420 78361 37612 13408 -48508 -114892 -91214 -119460 -32397
25850 -32397 49267 -25764 -24361 88242 55783 114167 -8720 -96763 -13934 52668 44883 -81246
25838 -81246 -93088 -47737 64397 24496 -46487 -76991 80316 246066 226257 136268 63946
25827 63946 -67166 -126849 -59540 87996 25804 -88597 -80437 -76433 -77713 -77395 6317 -28011
25815 -28011 -3229 38233 56326 53938 -6799 -13946 35928 99088 58805 52140 54873 44027
25803 44027 -38214 -153344 -37176 -53888 -77174 -42187 -120141 -39882 64355 80893 -33146
25792 -33146 -184531 -167072 -37633 48218 12945 -50043 -4722 115758 20589 -7764 -18479
25781 -18479 -27414 56606 83041 102014 86940 27788 -9818 18888 6307 29100 132732 70075
25769 70075 -64221 -144215 -132078 -42436 -27973 -108238 -59967 63792 19273 -91386 -93313
25758 -93313 -1732 47259 -11265 -96790 -94267 -138697 -63278 -63267 -30021 -62349 -6196 -18483
25746 -18483 -102343 -187761 -169564 -227667 -174761 -72486 -123955 1067 68083 88656 64331
25735 64331 33788 -95072 -133007 -30484 20062 99640 167270 103154 34973 95443 123301
25724 123301 75537 80537 65972 75329 101929 102062 99581 43653 56977 255966 266229 135040
25712 135040 -18541 69863 70605 28121 33565 44711 26616 -15868 53514 88112 159014 168430
25700 168430 167369 193475 77718 -23853 -113928 -53802 35286 36209 104244 186027 103137 107587
25688 107587 242070 244267 237447 138225 19747 -138254 -80106 -39697 -98964 -78110 -21963
25677 -21963 168029 199622 22214 -115688 -89552 -86656 -39317 -24512 -56866 -86125 -82566
25666 -82566 -113317 -90447 -25802 32685 56919 135542 114827 108481 157560 127575 163387 237599
25654 237599 147015 217407 226253 148808 149020 125093 166379 199098 141824 112348 13038 70238
25642 70238 109383 111462 110746 8281 -18182 -79741 -88928 -53152 56103 16268 -36472 -125307
25630 -125307 16036 125228 81245 91039 67838 -50569 -163395 -173846 -75429 27523 71938
25619 71938 86667 380 78262 87893 130021 57598 -84810 -102590 -90898 -20585 -87011 -281067
25607 -281067 -236840 -84968 -69530 -163754 -163872 -86051 -77972 37296 -7908 -33472 -1204 125989
25595 125989 63096 -47594 -99695 -17232 -50396 -153459 -80066 27742 25457 31577 9388
25584 9388 -11936 55971 120200 105754 54483 47942 87399 229352 270819 210523 122254 -4681
25572 -4681 -41017 -49743 -67030 -103135 -116401 -33201 83110 175374 153239 -15944 -8021 67283
25560 67283 79158 54589 11981 -117820 -105382 -145019 -202646 -245891 -295985 -360027 -242463
25549 -242463 -90948 -4448 -12373 -48323 -130853 -105595 -66712 44312 75952 27678 51378
25538 51378 166355 118908 44103 -18611 -34007 122085 290608 276605 176525 128716 35161
25527 35161 -73805 -141566 -113264 -66862 -28555 37444 -47803 -69937 29204 39727 28529
25516 28529 105769 172699 163573 79808 43068 59434 114142 56137 16947 28274 117590 25786
25504 25786 106478 167969 48576 105007 148361 218415 81490 -102657 -62454 -96906 -132360
25493 -132360 -69826 -33032 15209 86186 133730 88243 4403 -59916 -75525 -202028 -314859
25482 -314859 -206355 -115004 -102403 -76418 -103708 -93616 -52914 -165150 -136746 -91072 -64753
25471 -64753 -70727 -61088 -43731 -64901 -89008 -10435 -6239 -80546 -81168 -53360 -7857 20405 5238
25458 5238 -54954 -92312 -117879 -80538 -63129 -45092 26619 60634 21670 -20009 44939 169502
25446 169502 29482 -16066 91670 181703 95759 116596 98004 7049 -66468 -83658 -79297
25435 -79297 -16552 127751 158144 73980 4211 30159 39803 48067 -67685 -160074 -125294 -108955
25423 -108955 -62193 -71250 -226361 -139814 -49446 -25929 -47577 -51302 -136440 -138123 -123958 -119193
25411 -119193 -102458 -21308 45174 138477 106726 41138 50880 64024 112246 106792 151921 187258
25399 187258 155457 124241 85166 18643 -30743 -68827 -63510 -46646 -50011 68483 122561 141415
25387 141415 133408 158979 26667 -92079 -150094 -143486 -127557 -46805 -7012 -29352 13913
25376 13913 50197 -2866 20240 23159 -26340 -72723 -63006 -44545 -17990 30620 9812 -7974
25364 -7974 16074 -3368 -70517 -84746 -33876 -19672 4984 5580 34096 36918 70311 85233
25352 85233 -6479 9531 97659 122643 91071 35948 108799 145697 139993 21676 -49181 59245
25340 59245 -496 -68279 -4823 10724 20385 -89237 -92339 -7834 67745 70644 35325 4864
25328 4864 36387 -108390 -42073 82422 148524 99416 20994 8091 -34884 -175640 -165836
25317 -165836 -173290 -195081 -79926 12807 -75210 -170356 -162754 3060 120132 141989 98187
25306 98187 51477 30368 -60974 -80516 -93202 -43985 30211 -77049 -193751 -89063 7084
25295 7084 30454 73657 106739 27969 29237 59666 76584 40757 28862 -44373 -107891 -33826
25283 -33826 173509 249746 236487 197053 277416 231594 174959 222744 177519 115855 -2853
25272 -2853 -23882 106231 93418 -5818 67103 71492 -26672 -11704 74979 66117 96101 121056
25260 121056 84896 -93564 -146529 -84275 -47818 -72204 -57618 -19089 15289 -68140 -140909
25249 -140909 -101585 21891 -4716 3387 95140 168028 208285 106675 -40466 -88640 -116427
25238 -116427 35670 -17779 -147161 -188535 -64028 -94490 -76288 -28278 54008 26347 -20875
25227 -20875 -70405 -106050 -68278 -17141 15192 90675 84258 72331 96263 92225 13006 -137383
25215 -137383 -157960 -156995 -78628 17355 28740 75487 84340 90457 41932 77940 122006 61177
25203 61177 -10644 97798 236539 187881 116217 155133 104045 165418 169368 172498 96182 102736
25191 102736 73886 -6852 17425 -41651 -57749 79981 167561 183394 121326 52174 -103604
25180 -103604 -95895 -76048 -80457 5874 -9862 -67125 -57198 -23136 -66067 -35083 16503 51736
25168 51736 -23803 -85627 -130924 -42422 121756 70087 -29254 -9952 67689 128959 103888
25157 103888 53794 64626 56748 -21689 -92758 -38468 2278 14091 -61763 -2522 31286 22009
25145 22009 16895 16617 2955 -779 -41277 -48366 -65351 -1591 -136936 -78349 -47814 -45878 65084
25132 65084 76669 35756 44833 -20453 -154552 -273659 -264958 -88764 94696 54089 -51974
25121 -51974 2934 134804 111130 66698 129962 52116 92131 120544 57020 53908 60831 77697
25109 77697 32027 88853 11799 -80352 -24792 86863 126517 111464 83325 56416 -24700
25098 -24700 29591 164076 282610 262943 254907 177959 68460 68576 108719 158259 97149 38959
25086 38959 74850 50846 -39162 72438 86055 7375 -47333 6864 41213 149431 188646
25075 188646 245412 250061 72330 -76582 1777 82317 146695 78163 7560 -3487 38588
25064 38588 -65034 -76975 -145652 -85821 -77941 35093 67547 -1121 115749 132468 141971
25053 141971 80573 84411 27858 -33197 -109433 -31459 42466 115317 67829 -51590 23672
25042 23672 110029 46336 13754 -93974 -126656 4151 68239 72460 40038 -64196 -38094
25031 -38094 -16616 -73166 -42790 -57272 -66976 -35355 -109511 -119807 -116546 -105344 -30920 16931
25019 16931 13925 17583 -60886 -14852 92674 35023 -35631 -74114 87064 100790 32891 12873
25007 12873 15546 -53721 -80795 -152701 -201666 -147539 -131115 -130813 -146361 -125030 -106983 -21301
24995 -21301 19164 -44732 -84295 -105004 -157614 -57750 116794 87632 20103 62194 121105
24984 121105 223733 111617 112957 192937 111697 13525 20328 32649 16366 22435 5280 -31328
24972 -31328 -22928 -48114 -54074 -13540 -98553 -205143 -186772 -210719 -187965 -109322 -120152 -137756
24960 -137756 -166799 -314861 -215882 2755 73315 -13792 -83532 -18003 123558 252147 198278
24949 198278 141602 113493 173775 193919 163771 101291 106567 102865 65975 12252 -3768 -120251
24937 -120251 -71890 -30811 40149 14419 -21500 -87065 -151257 -201545 -214050 -230467 -254305
24926 -254305 -226237 -82406 -19326 -46635 65223 65782 -65545 35429 12811 2805 24083
24915 24083 -9403 -89858 -144387 -41046 64211 177901 291989 232741 94977 126675 113491
24904 113491 54147 66808 -17531 -106576 -99380 -128710 -67970 -14965 -27771 -75930 -53567 -170609
24892 -170609 -95553 -43657 -53303 -151553 -171109 -114877 -117982 -202200 -163578 12362 50345 53264
24880 53264 16398 129538 91853 -5472 -143277 -147585 -135293 -125933 -63987 -164655 -246943
24869 -246943 -176867 -40218 38510 102876 40851 -28739 -49189 -104443 -189766 -87818 142341
24858 142341 233259 246328 274154 93570 49921 90503 158120 62406 -56711 -44177 -3021
24847 -3021 -15801 -24491 3677 89420 79600 2497 -61812 -25730 105339 75998 -15344 11324
24835 11324 -71562 -26559 54118 113817 163845 130369 3688 -51918 10931 13158 106425 25627
24823 25627 15143 118289 105893 2468 -70377 -68551 -31043 -57063 -107660 -116107 701
24812 701 -44552 -47193 -72925 -122347 -187310 -65246 -2096 9428 -98152 -119617 -96257 15176
24800 15176 26127 -33782 75152 144685 32630 -14408 -64578 -37447 -40941 46607 144753
24789 144753 167970 40431 -36227 19276 2580 78240 39671 -38885 -93964 -1728 92722
24778 92722 85381 113642 103737 35255 30062 29576 92696 -9434 -86100 -23811 -62831 -161209
24766 -161209 -67414 -41286 -9023 -32087 -40269 -141239 -191310 -163172 -139559 -79839 -120140
24755 -120140 -41848 26797 60344 71069 11322 -96706 -41958 108098 58170 20337 53481
24744 53481 19167 30008 70438 98034 111125 81558 82538 28844 2759 155366 129748 68302
24732 68302 -1865 -28850 -67577 -57868 -23949 73923 51142 91634 46809 -7650 -15019 63382
24720 63382 146240 124548 13686 11851 52446 109669 31295 162834 153939 177396 97661 65896
24708 65896 74082 61166 72119 76929 62827 57998 33067 73434 162537 140202 109595 108397
24696 108397 29218 -117775 -123188 -28993 -145020 -156246 -30137 -13740 -36262 -6793 54297
24685 54297 89911 160231 181566 -26267 -78944 -120044 -174572 -116865 33346 84919 143080
24674 143080 86816 158042 126864 -77387 -83170 -114040 -94168 101549 59803 161811 111177
24663 111177 66107 -5063 -32994 -126653 -190847 -167937 -180934 -59233 -114582 -259011 -251902
24652 -251902 -200029 -74258 -2894 -10799 -5770 16087 6679 4473 -76305 -68719 -66533 51696
24640 51696 189539 168416 15877 -121281 -188863 -195090 -131059 -63994 63513 197409 169825
24629 169825 71190 39664 14409 40035 33321 -103573 -79867 75409 12413 -192321 -206209
24618 -206209 -99079 -44374 -15696 -12165 -39628 -92439 75731 -27502 -137945 -47352 -89069
24607 -89069 -116914 -64656 -83129 -99185 -993 -52700 -44994 -45750 45354 53860 -64430 -14825
24595 -14825 -1919 47712 116852 16433 -28797 -153190 -49717 -67326 -116827 -35722 -39586
24584 -39586 -136556 -157088 -62048 25447 -24612 8377 -34719 -87512 -59201 65353 122391
24573 122391 79255 108122 96208 96972 66428 -29178 -53209 -76362 -145901 -148120 -244478 -246923
24561 -246923 -186519 -216920 -237923 -143779 -87217 -23593 21456 -79970 -139108 -97687 -21727
24550 -21727 -57379 -120369 -158631 -140647 -53809 -34890 -92959 -54646 -139179 -130450 -94825 -164800
24538 -164800 -65589 -42710 -51962 -154482 -162954 -109353 60391 158553 151330 132004 148506 170353
24526 170353 97634 170424 85867 25860 92977 153205 77517 -14409 -64748 -119434 -178881
24515 -178881 -89355 50395 14128 -14792 -139843 -168920 -50311 80974 143669 14466
24505 14466 -30022 17432 66117 -25138 53039 119983 -46656 -116833 -49199 -13232 10903
24494 10903 143526 353165 305637 72456 67419 28324 -32713 -43089 113959 146102 123045
24483 123045 133045 138564 129204 85094 57871 58514 -38205 -16445 62940 35246 6463 58822
24471 58822 44270 -23486 -133401 -49981 25074 -6814 12268 -66607 -180467 -91281 -34505
24460 -34505 -110317 -225834 -180084 -93490 -43013 7015 -126560 -133340 34661 69871 66221
24449 66221 39903 57833 -665 -74980 -8527 99269 22397 -29746 21724 69902 97696
24438 97696 49680 -104020 -169246 -143153 -10171 23709 33797 -70460 -35667 115830 41357
24427 41357 -56164 -53185 -77310 -31050 -167365 -193076 -78025 -90366 -75755 -17097 -150928
24416 -150928 -290833 -261073 -155213 -87677 -42823 -46132 -140230 -244181 -187714 -90212 -3480
24405 -3480 -41249 -90499 -49657 -1224 -56911 -96375 -102093 -49472 18318 61639 -128481 -260280
24393 -260280 -205140 -77914 11039 -145184 -213727 -173710 -127412 -167961 -92035 -72183 -87948
24382 -87948 14912 218245 81068 -79238 -62433 27226 99273 64934 24042 -39703 -63010
24371 -63010 -118467 -83587 -3832 -3040 6226 -31154 -82776 -103078 -100178 -15242 -40024 -134062
24359 -134062 -99657 -52865 -16516 31440 20268 114160 15150 -44153 -72155 -139417 -261923
24348 -261923 -135449 56959 214736 233719 219253 114481 85720 108705 181840 229747 168918
24337 168918 -75306 -116656 -50682 -58766 -126074 -71985 11387 71153 71194 97549 -7287 -126044
24325 -126044 -91796 -88099 -46119 -12747 43150 88519 149579 129513 -5160 -42524 -167330
24314 -167330 -237690 -214073 -110490 -9259 81537 123956 171697 130275 -61533 691 152281
24303 152281 143291 104461 58226 1253 -36195 17691 60258 8422 2992 21650 20946 66653
24291 66653 60155 6301 -45683 -162386 -83629 -7160 114920 -65031 -167823 -71571 -25903
24280 -25903 14773 82606 47154 98323 -18177 -142812 -148682 -8662 64431 22745 43752
24269 43752 125854 214222 259358 230231 137562 196454 276053 430742 344427 166861 140269
24258 140269 95093 146778 107379 10850 906 -30009 -9713 -31301 -48451 52551 135967
24247 135967 14091 -153329 -182504 -141460 -4731 20162 -58337 -89276 -109508 14125 119282
24236 119282 131398 140760 94862 84961 -1774 -119151 -206801 -145078 -127634 -124938 -67713 -50064
24224 -50064 -115592 -108538 -93033 -18991 -25388 -86249 -107583 -114613 -166356 -230145 -195798 -46608
24212 -46608 -45139 -42448 -8742 -2197 56396 130082 59985 557 -85256 -20080 -82584 -145060
24200 -145060 -29181 81946 162859 185954 180054 48424 -1691 -55760 -101593 -122696 -13371
24189 -13371 56057 -10631 8903 -51754 -87520 -125020 -61291 -16621 -16109 58332 6053 -10391
24177 -10391 -115429 -109693 -69578 -18200 39579 108280 13207 982 90322 96649 55187 71740
24165 71740 29869 131695 87602 -79555 -107611 9333 89829 -15666 -1443 118326 53858
24154 53858 -23008 -59175 -14196 59042 -49036 -99808 -69593 -91270 -141359 -82597 -100949
24143 -100949 -42442 -1296 -71466 -75273 -22674 24327 60744 122018 -508 -24421 -110900
24132 -110900 -119159 -112760 -105883 10099 -23825 10446 41883 68047 127472 9187 5056 -42508
24120 -42508 -28156 21795 -12580 -57787 -72019 -91844 -53641 15212 54944 67106 105388 146622
24108 146622 121357 139725 98971 -15349 67216 157827 73491 -1397 -117787 -141180 -67322
24097 -67322 -14033 33026 24109 22759 -28850 -84035 -153117 -135665 -27759 829 -54397 -11393
24085 -11393 -48813 -69868 23170 -12484 -167430 -140781 -23819 55540 -6055 83994 110412
24074 110412 117523 185181 227145 203343 176007 89085 23808 -15927 -71195 -7944 30809 50230
24062 50230 30350 58976 65312 -12339 -86384 -124600 -64002 -65108 -4376 -13878 -38005 -7078
24050 -7078 -31613 3493 -4970 -4162 -14618 42617 17403 23424 27864 -149309 -176603 -110112 -61714
24037 -61714 -91221 -68838 -43046 115202 105890 57738 -68542 -36883 -27311 14031 -29014 45814
24025 45814 40402 94936 108403 163458 65054 41414 1307 -53731 -73178 -23334 19697 -27911
24013 -27911 -57348 -73521 -105767 -121726 -122969 -17185 -3680 -83590 -30386 40270 14481 -55639
24001 -55639 -37442 25822 17059 3493 -30906 -83305 -67829 -17202 28529 129332 105983 15003
23989 15003 55224 25168 -48468 -8436 5308 -61392 -82491 -24349 -71848 -109502 -89518 -68663
23977 -68663 -98360 -111701 -147621 -74477 -3993 20075 28447 -74810 -147898 -140974 -259246 -236396
23965 -236396 -51307 -103149 -85598 20899 -9541 -29144 39355 54386 115991 209264 236916
23954 236916 286762 234694 67160 -10034 -36541 -84557 -164525 -187295 -201062 -262389 -231441
23943 -231441 -182886 -69144 -77683 -43503 -71307 -75580 -160800 -176050 -57040 -33408 -70051
23932 -70051 -143199 -106775 -76207 21084 -60345 -70406 -50734 -68460 -135395 -210837 -297696 -246976
23920 -246976 -304625 -282395 -229911 -160073 -130004 -133602 -94965 18123 -58949 -120525 -18733
23909 -18733 -9895 37694 -39221 -109399 -44266 -42591 -46808 -34685 -87755 -129875 -79554 -24878
23897 -24878 3600 -53500 -151159 -222877 -197980 -175706 -136902 -120531 -106877 26175 69523
23886 69523 47009 17702 49833 -33982 -66185 -54202 -65027 -132569 -171805 13154 78121
23875 78121 12071 73523 81646 -14602 -83336 -40948 -75050 -212348 -217880 -34370 121809
23864 121809 145903 150079 151059 192912 45441 -155019 -213785 -92414 97617 166096 85941
23853 85941 73704 4940 -112992 -146592 -64264 34574 -24233 4032 10486 -41865 79410
23842 79410 14289 -59114 -79454 -109800 -100970 -95419 -89652 -73431 -105165 -15053 26113 -49702
23830 -49702 -119304 -77896 -73281 -31147 63635 52116 47620 13822 16951 18974 -109051 -228167
23818 -228167 -234816 -142440 -156552 -207755 -134008 -71300 -127730 -184442 -62715 52663 -30438
23807 -30438 -49942 -116006 -103583 52757 29753 -109144 -93070 133823 132917 85058 38007
23796 38007 -42676 -101825 -39724 -50572 -159980 -150406 -185179 -175267 -131461 -74587 37710 142964
23784 142964 38455 76805 119295 75147 99381 44952 -4172 -21221 4847 9423 6876 92909
23772 92909 44844 113675 50420 -106714 -177085 -204708 -152982 -125849 -217991 -203897 -135158
23761 -135158 -112733 -19470 -2872 -182010 -105825 29700 142316 118645 60179 146147 228400
23750 228400 243563 123176 141812 139426 53566 12893 38364 63546 -31194 -70659 29299
23739 29299 -24150 52315 91688 62361 9926 -6039 -65105 -170819 -143811 18234 49091
23728 49091 -6161 70044 101705 -7953 32660 99929 59804 -26289 -3983 23936 24859 -7298
23716 -7298 16922 76644 52299 21048 110313 50364 -101122 -88815 -9750 -22719 -17812 63905
23704 63905 104454 64052 13330 16652 -151348 -177650 -74913 -62924 -62373 -141495 -152988 -61219
23692 -61219 31977 101970 -43250 -52636 -26384 -80151 -87143 -75252 -119108 -118634 -115179 -183140
23680 -183140 -228176 -305551 -178103 -5745 738 36943 34119 -19425 -36788 13012 12701 82790
23668 82790 87862 -2642 14107 -858 3890 -30123 102613 164076 68961 -69521 -31777 73463
23656 73463 144751 142930 179002 165325 32580 -16661 -27959 -44082 36137 122660 148776 107406
23644 107406 101934 123384 31484 3821 -44263 -74721 7 50859 64039 27854 -5117 -908
23632 -908 -169672 -201373 -107320 -194047 -182016 -87399 70249 104747 54196 -52034 -77025
23621 -77025 -105335 -81579 -114151 -48941 -45944 -136941 -194866 -128299 -99876 -110475 -116220 -153028
23609 -153028 -150369 -110727 24722 75290 200142 222656 220310 121102 116822 102136 58310 74669
23597 74669 60653 3404 -16871 -66815 -61723 -119539 -135776 -46354 -76688 -4476 93315 129372
23585 129372 178230 90317 5312 54525 76831 205454 253829 157592 84711 32843 -48562
23574 -48562 -74792 -73363 -75886 -15810 59508 60444 90807 96131 49315 -20859 -7570 -60748 -122
23561 -122 -110765 -21489 44308 4239 77529 77388 -38022 -39670 -104573 -42887 36275 -16020
23549 -16020 -104764 -136545 -173483 -166100 -176838 -82110 -122619 -143610 -41494 90515 132779
23538 132779 109159 136251 158470 49848 -33800 -70546 -116397 -115805 -100295 -110464 -67417 1799
23526 1799 82908 65347 28249 26571 -76671 -202553 -183483 -213041 -83008 10837 14824 66859
23514 66859 30190 10763 23811 -55301 -138857 -256324 -202770 -100650 -148461 -149741 -151818 -206299
23502 -206299 -195509 -169580 -188675 -127139 -47663 18232 33409 96305 42757 -11392 -8765 63053
23490 63053 98403 32289 -59507 39526 62917 11723 36909 124315 170499 158184 107359 -1845
23478 -1845 -23294 9911 76042 66901 131648 163052 58368 -79596 -71819 83133 69531 81096
23466 81096 -45182 -238853 -235342 -250918 -318851 -314928 -305556 -251841 -170804 -113235 -45550 50571
23454 50571 33198 75760 164005 152380 20242 -21669 23700 86458 41416 54428 129730
23443 129730 92028 25151 67586 30737 42604 111718 44674 24562 68059 -59233 -3659
23432 -3659 -1460 90010 78159 119499 199515 83700 -38937 -8509 65274 -25632 -26687 -3518
23420 -3518 42024 18411 677 86495 111468 -11768 -168130 -139587 -28051 -51513 -68392
23409 -68392 -67301 -75030 -100299 22422 111910 168702 55987 16055 64191 -7608 -100767 -87128
23397 -87128 -37167 -20033 -34013 -15862 -24023 128202 156059 169312 90090 -80705 -101520
23386 -101520 4408 21970 92184 42908 40136 125907 191514 206678 231030 146395 104702
23375 104702 90588 36311 103121 134572 148772 122613 131785 16282 39742 1056 32878
23364 32878 62400 57420 21115 -33719 90848 119585 2787 -14711 -8850 92762 134196
23353 134196 153357 183842 123602 147399 103772 125369 111158 8055 42261 7341 30502
23342 30502 64915 51757 -53761 -55306 5058 -117033 -188020 -108522 -132785 -128637 -103776 -159336
23330 -159336 -186458 -235203 -202393 -206746 -234773 -236327 -148561 16317 57296 52538 61378 15386
23318 15386 -103494 -103342 -59030 20760 63361 128520 103614 48387 62580 -22466 19203 17818
23306 17818 3895 26778 2028 -180121 -146574 -178928 -219982 -207937 -73824 -75466 -187326
23295 -187326 -156952 -52265 59901 137393 105789 117419 120881 3284 -194304 -304949 -315951
23284 -315951 -154383 -47331 -136649 -171965 -137442 -88798 -80757 -107346 -108221 -60563 -11111 -22740
23272 -22740 -75869 24452 78026 81249 8619 -89245 -64701 -58320 -79072 50213 104484 177097
23260 177097 196413 93728 -57352 -182072 -120488 -37578 -25751 -36810 -92850 -11203 -7430
23249 -7430 -69565 -37633 49129 -3403 -54386 36460 44066 -29438 -15722 4162 -79914 -71207
23237 -71207 -177471 -176808 -126243 -226213 -189637 -89432 -23092 -77898 -129027 -107678 17470
23226 17470 42750 -26089 47173 19873 -24572 -39222 -77777 -5640 -22842 -68168 20816 -10784
23214 -10784 43103 11725 -53379 -59538 11158 -11756 -151425 -142140 -121575 -52021 -77153 -98217
23202 -98217 -12769 39953 46582 45667 -19807 -78354 -119317 -175731 -145501 -110051 -89822 -12045
23190 -12045 -26290 1422 35275 -41052 -168289 -97732 -105077 -140476 -88121 -32316 -23616 64850
23178 64850 119129 53438 -76533 -109042 -21654 6549 -16719 -70319 -15251 25016 -40204
23167 -40204 4456 530 29381 89487 94216 36132 -134189 -125097 21892 138358 109403 248189
23155 248189 191563 -5753 -15035 8889 -46753 -41337 5559 21242 -68031 -127003 -92037 -24348
23143 -24348 26338 179066 269285 229567 195269 147298 2988 -78447 -65843 11482 55651
23132 55651 120577 29473 -10209 55791 56122 -13660 -30724 56118 149612 58463 -126174 -107142
23120 -107142 55267 36054 84838 155495 196101 252544 238700 190518 -31421 -158528 -88996
23109 -88996 -113213 -174717 -126632 -57507 22148 2387 83155 64881 125145 135209 96687 -25762
23097 -25762 -68969 -57732 -81562 -114680 -105386 -74966 -27983 66008 105936 122723 116501 53705
23085 53705 -87160 -113953 -65282 -103311 -180168 -117432 -128722 -19430 -25600 -95527 -123176
23074 -123176 -214974 -110343 -108363 -25870 80510 57250 29646 31874 98957 128024 25732
23063 25732 -47334 112333 189288 175208 202050 197086 87957 -78965 -201436 -119921 -45301
23052 -45301 -8825 -45426 -58534 -57731 47882 40746 14668 95425 104160 116850 139209 232115
23040 232115 281722 150936 61486 63802 -1664 -118722 -112196 -182577 -146432 -61605 -101084
23029 -101084 -29452 65840 129880 148876 123757 29230 57479 102734 13834 -28536 -48054
23018 -48054 -81741 -99488 -47292 20251 95886 -23760 10078 -16139 -13751 -39836 -136788 -226342
23006 -226342 -113369 -117636 -95909 -108480 -58031 -6454 -33945 -117975 -99794 41499 -29050
22995 -29050 -144014 -201131 -180316 -135039 -198118 -193418 -31134 81284 162481 190064 95811
22984 95811 98294 141109 -64701 -70327 -51153 -42468 -130844 -151923 -72055 -43531 -93026 -19677
22972 -19677 9410 98 -30370 -44103 -93158 -44800 47473 105173 80362 -6164 -17355 103164
22960 103164 53702 71337 105959 95462 16323 75446 126312 89294 55318 48808 -56862
22949 -56862 -87302 -88027 -235592 -367113 -266357 -151850 -73102 103958 74987 54008 53147
22938 53147 -8045 25526 27261 10239 3630 -42644 -172297 -166102 -179084 -198951 -233838 -153113
22926 -153113 -29216 43911 140778 98967 -10289 -104278 -254771 -283560 -193570 -92100 -191817
22915 -191817 -251275 -287988 -210573 -96475 -85334 -145116 -91641 -42286 -59040 -22266 9121
22904 9121 -24310 -121966 -194495 -115672 -101285 -105081 -76812 -11669 41897 -47274 7832 37954
22892 37954 25611 74117 19974 -111485 -157234 -96896 -74863 -144802 -131681 -80942 -104129
22881 -104129 -12943 84613 12350 46243 59636 134750 23489 -26992 1422 -1221 -36303
22870 -36303 -84746 -135856 -105617 -224522 -127234 -46 -2564 -88534 -34823 55124 24162
22859 24162 58026 -77784 -176893 -106989 -43610 -55233 -81009 -106971 -45143 -82032 -77399 8638
22847 8638 -68786 -24188 4008 -21991 -28992 44896 170703 102258 13910 59314 62084 58921
22835 58921 -31028 -138501 -100251 -120530 -98526 54633 20540 41406 176277 158780 97343
22824 97343 13807 -115857 -127044 -66953 -76168 -57257 -70921 -185770 -306350 -254941 -112793
22813 -112793 43735 131375 36369 18805 128223 78420 44191 18100 -39878 94629 134055
22802 134055 38397 -67031 -29370 69999 12282 22834 -6205 -76320 -32047 -36879 -49283
22791 -49283 31 56238 58241 -6952 23928 49131 24093 -21904 -64442 -11020 -36167 -20281
22779 -20281 -73015 -115224 -12638 78919 122602 59860 16991 45173 -90442 -147356 -108958
22768 -108958 -159788 -115466 -34010 -12038 72975 -25847 -145681 -238544 -218009 -141819 -108748
22757 -108748 -69952 -36400 -156284 -214221 -78137 -49046 13499 34865 -17799 -90884 -77110
22746 -77110 -45192 57477 51853 113648 205171 243039 233497 320330 343370 245282 155795 39833
22734 39833 26735 50580 47032 22869 -26655 -62812 64498 51828 25620 108999 156165 94830
22722 94830 59853 31102 108941 79043 -57099 -221747 -235065 -138598 -141561 -224240 -208583
22711 -208583 -68124 -35904 -133860 -248965 -177263 -116252 -257161 -218624 -112822 2349
22701 2349 66803 128409 175484 170157 37619 -58767 -74761 -19581 72515 44929 -57956 -49681
22689 -49681 -17232 -48582 5443 -24300 17763 -15646 -103189 -62248 12148 72563 93004 60777
22677 60777 -31114 -34420 -71681 -61551 -112765 -180110 -129748 -102649 -63432 -13036 5183 -117117
22665 -117117 -108941 -170327 -157889 -44598 60227 -23633 -57935 -4013 -48971 -104575 -159530
22654 -159530 -141621 -34970 48373 51306 84551 8774 198 -13889 -13984 43377 -42458 -86638
22642 -86638 -12335 -12318 -83146 -127094 -128675 -141831 -44244 73682 178395 189770 38812 32630
22630 32630 44757 76388 82222 -48011 -125049 -10049 -40082 -103361 7257 54069 24710
22619 24710 -50050 -116258 -48450 63560 21807 23014 2512 -18749 -163029 -218119 -107769
22608 -107769 -27081 114284 79213 -4993 -54607 -107520 -39752 70463 158553 182254 179984
22597 179984 109499 40995 -29704 -60998 22918 101225 28923 -40165 -46212 1945 81894 219616
22585 219616 196686 102422 9573 -46998 6220 -17793 78135 98154 -3197 -39463 -84515
22574 -84515 -218341 -185418 -42383 -97030 -149774 -170016 -263334 -270220 -226569 -48203 173789
22563 173789 309346 230977 34981 -5094 -28285 -31761 62276 102214 23752 16759 -23769
22552 -23769 -26742 -19922 35913 16337 46709 124445 -49772 14769 143459 180336 178909 212825
22540 212825 121950 -55201 -46597 -141584 -164500 -76432 -55504 32707 90433 -31754 -30415
22529 -30415 -126376 -128394 -180881 -263118 -128120 -71261 -78416 -34127 -17148 -48038 -79412 -43302
22517 -43302 39944 -7715 -2402 -109896 -104627 -127533 -107089 53493 104645 226812 138072
22506 138072 74350 55938 -8087 -42876 -12482 -10276 11401 17845 30317 -39212 -123537 -110190
22494 -110190 -95517 -36353 -34838 -108390 -171252 -225242 -95928 63186 42778 -35455 -77208
22483 -77208 -114971 -162440 -302199 -318608 -182444 -81705 -42086 -24039 20547 -52191 -28679
22472 -28679 60097 14488 64726 21212 -29732 -40550 -46980 -30908 -30032 -56711 -30531 -56659
22460 -56659 25157 142312 178176 190955 218866 174880 25144 -42474 19267 15324 23472 108915
22448 108915 84555 128579 220531 132577 -42269 -82000 -63066 24206 62127 34530 58102
22437 58102 75336 -25624 -99852 -94113 -67765 -85966 -55819 -49213 -81032 -112166 -110099 -38751
22425 -38751 -70671 -155139 -88447 -148304 -190736 -198635 -156644 -85316 35964 89926 50697 -66328
22413 -66328 -38282 41146 -647 -67862 -30875 -38708 25426 91617 84533 83311 92755 69135
22401 69135 -12687 -76935 -18751 93496 96229 -39696 -66288 7269 -46723 -194077 -183722
22390 -183722 -54223 11133 -31660 47658 87788 90785 195311 225138 -70174 -159963 -54834
22379 -54834 -98684 -200507 -212345 -186799 -114450 -39383 -96840 -7867 -9012 -11936 7721 -43319
22367 -43319 -86736 -84299 -51348 -6602 -15538 17377 23949 -25480 -166596 -237446 -184564 -170840
22355 -170840 -91850 1475 48872 -17964 -187532 -191781 -94321 -91196 -61068 -78395 -86387 -123821
22343 -123821 -79894 -75214 -13073 24952 -12514 51894 33730 -64804 -97593 -40394 68528
22332 68528 55741 -44031 -112388 -5362 6467 -4843 66908 116549 156001 156603 87521 193702
22320 193702 235138 182037 140143 -58771 -108292 -94060 -159634 -171923 -295125 -301455 -143444
22309 -143444 -113222 -25481 -6002 -47630 -57855 -14335 -101319 -157609 -240926 -99208 -28397
22298 -28397 -78941 -31002 -54283 -133364 -79320 -47311 -36696 8377 -1114 -18122 78827 72560
22286 72560 15147 18691 25667 89393 90339 -16806 -37072 48094 -66551 -123391 -108719 -114223
22274 -114223 -38108 -11050 52814 182165 148003 47407 -17905 5560 43659 151763 105078
22263 105078 29123 30040 152321 155322 156404 82803 -39309 -65066 -155654 -137216 -99184 -99655
22251 -99655 -137076 -81669 -96115 -33389 -86523 -58801 -3649 -6834 -24538 -5565 -2340 -27373
22239 -27373 -122840 -181304 -54124 -23909 -1520 84421 1365 13511 3202 -57494 19622
22228 19622 135647 123483 61502 61068 15206 43752 80032 -6381 59573 88423 -45231 -131714
22216 -131714 -72388 -87282 -63083 -83606 -74005 -102783 -76448 -30363 34980 97047 116148 178197
22204 178197 132291 36994 -46065 -41447 17139 54684 153113 159134 310074 330463 170209
22193 170209 62073 74038 181699 136327 175398 18086 10200 126108 97448 23293 -15062
22182 -15062 -64563 -108176 -151554 -153978 -114187 -133923 -34099 -89405 -163716 -189815 -167189 -208598
22170 -208598 -78521 -53565 -204855 -91065 -48388 -98752 -88808 -24422 61370 99105 46020
22159 46020 -73659 -131334 -36868 83821 14288 46340 102465 71911 43267 59009 -78207
22148 -78207 -208322 -242187 -147566 -18800 -15745 -69979 -53810 12217 44613 51703 -17334 -27490
22136 -27490 -30782 -107423 -53972 83790 111809 -26330 -144614 -86564 40979 163960 106098
22125 106098 -56804 -34227 32529 25080 -77279 -118626 -146832 -128888 -66056 -105513 -15841
22114 -15841 70266 71898 56190 5805 51236 120960 147240 162879 77917 -31162 -114088 -48873
22102 -48873 -20132 -25095 -119366 -30865 3344 -30664 82130 59008 38345 -14028 -46210 -66839
22090 -66839 -136039 -85889 -26607 -67830 -93749 -61331 -53742 -46756 -50369 32707 117316 145612
22078 145612 14531 75575 132749 34070 -42659 10931 106678 89114 26564 111345 148085
22067 148085 54866 -29578 -115857 -106700 -42399 32597 111264 181931 135187 -33261 -152144
22056 -152144 8918 7206 -118955 -122880 -15198 43972 90094 44121 6500 -40257 -75183
22045 -75183 -58548 -55306 -138977 -182623 -226392 -153117 -151397 -40961 -132271 -115013 -133429 -181858
22033 -181858 -25436 80892 143479 222240 209413 236261 258576 317991 257165 199103 144907
22022 144907 91445 178135 158060 34884 -33795 -48695 39275 19167 -66181 -103680 -20948
22011 -20948 -95718 -63078 13974 -176 -17212 -32641 -82763 -24136 186751 260327 219001
22000 219001 19082 -49649 -30771 -2637 527 38573 26310 15542 27811 11855 66468
21989 66468 49609 98390 75923 56326 24984 -67772 -107282 -115101 -166052 -167882 -180639 -169188
21977 -169188 76468 96988 119394 112043 169511 121542 48405 -41692 6958 -12094 10596
21966 10596 56651 12947 -95009 -128022 -56190 -39549 -7681 -41672 -81386 48691 165125
21955 165125 43081 -107062 -23713 32775 30022 18365 -147034 -11632 54411 24238 -48410
21944 -48410 -77914 -69750 -109693 -59210 10180 -20568 14189 -16525 -19272 -52233 -58155 88369
21932 88369 119011 106993 178314 267319 285490 230534 137681 -16880 -11016 -41831 14499 4993
21920 4993 21053 37556 18864 -2533 43166 42668 14884 -45411 -139266 -181830 -121019 -104234
21908 -104234 -93709 -113209 -82483 -103593 -517 -42075 -157824 -240313 -159085 -40020 -29323
21897 -29323 -61360 -206501 -225913 -216928 -221205 -146158 -59718 13710 48550 115463 70568 -54978
21885 -54978 -133430 -126845 -47661 -6003 46029 179750 148926 139765 35895 -101867 -117869
21874 -117869 -103438 -37033 30401 -85236 -178844 -190554 -164859 -164827 16638 121102 31484
21863 31484 122256 213098 89226 41893 65717 37601 -73141 -78757 -109791 -80538 -92714
21852 -92714 -136507 -37858 97090 102327 -1222 65602 -49129 -194170 -86806 -60686 -45929
21841 -45929 -14681 -12790 -22551 11338 -32798 -39244 -7625 -20928 -81619 -56543 -147339 -95240
21829 -95240 -172663 -101806 -26658 -161670 -151977 -86856 -211599 -152270 -73096 27913 17706
21818 17706 23944 62430 -54072 -218819 -236095 -49987 36658 -46510 -80523 -129683 -112594
21807 -112594 28031 57036 -92098 35209 31274 -34162 -35290 -103184 -52859 -91398 18504
21796 18504 61365 23884 53472 -471 -46580 -60706 102158 210618 277258 200208 45430
21785 45430 -14487 11587 102137 93895 15259 13281 -8126 -69492 -65048 -125839 -148197 -86538
21773 -86538 -89622 -67561 -125360 -76597 20202 17751 9119 -1833 12630 -8084 -117802 -125428
21761 -125428 -132424 -68600 73494 88964 209 -20178 -179146 -245983 -98217 123897 50541
21750 50541 -40428 -64393 -184644 -169441 -104853 -82259 -116997 -69809 -41659 -58765 -96678
21739 -96678 52543 77946 -4399 9596 17454 94884 27866 -23666 -61294 31095 87452 72092
21727 72092 51884 13266 75028 65171 1360 -69053 -12845 -66215 -44583 -51448 -70975 17910
21715 17910 86153 77923 161085 137291 61918 88594 83644 78440 191280 163034 119221 160494
21703 160494 159180 168393 186199 168906 108236 -19278 -13355 91249 48818 -5754 13834 -66990
21691 -66990 513 -61608 -19143 -62959 -131625 -190995 -214555 -165744 -124713 4831 87672
21680 87672 57779 1484 -168259 -171490 -71897 27015 -14653 -98260 -132238 -168357 -149023 -93537
21668 -93537 -170684 -175117 -88688 -60470 -92700 -111553 -95331 -116721 -121884 -42243 -30140 106754
21656 106754 71830 -34436 -16949 72166 99768 -51650 -132605 -271499 -281631 -252953 -230026
21645 -230026 -240446 -348842 -366988 -197983 -156280 -228893 -220982 -139396 -102547 -27695 72233
21634 72233 90644 11358 -2000 15054 99770 95929 71248 80613 149 -90359 -132207 -211977
21622 -211977 -232284 -305616 -301949 -189625 -136042 -56281 -79509 -99104 -44926 -80700 -52064
21611 -52064 37242 41705 -6542 -84843 -49061 -82076 -108484 -202854 -72300 -59431 -137369 -205361
21599 -205361 -201077 -180487 -138386 -101096 -110474 -94631 -17683 34965 95756 198635 179097 36353
21587 36353 -27126 70370 74223 43721 30052 48199 4023 -5768 73539 70054 -36268 -9008
21575 -9008 -34308 -27568 -22730 -2821 28348 -10192 52323 108855 4678 -8846 -13587 30291
21563 30291 -14920 -28480 -29353 -35704 -62894 -79988 -144524 -17575 110619 126828 67037 -37429
21551 -37429 -78483 -88077 -44916 8637 58711 -2662 -57105 -132934 -106471 13451 5759 48202
21539 48202 113635 120161 22718 -105769 -155939 -53248 25105 78456 -43843 -193679 -183672
21528 -183672 -63551 8142 -74215 -219619 -172641 -98109 -51450 -62409 -65074 -30647 -102701
21517 -102701 -130825 -77419 -65719 -154488 -139169 -171968 -114227 -148817 -199018 -137335 -155601
21506 -155601 -230888 -167206 -103535 -23606 16985 -37997 -102440 -75420 -103202 -63479 -127963
21495 -127963 -102133 54747 -11502 -52079 6396 -17512 -56490 -4461 14863 3171 10411
21484 10411 26161 -92963 -149352 -90602 -33171 -41963 30767 100920 116335 111961 -25832 -121942
21472 -121942 -155099 -88183 -79628 12626 112689 139042 -74296 -231960 -193256 -153728 -93343
21461 -93343 -50774 -47057 -23098 -28036 -128802 -109263 -31169 112384 114386 15643 -19713 98091
21449 98091 111247 131646 165999 99590 67705 51444 -18924 -85088 -152074 -106637 -112974 -112832
21437 -112832 -153498 -16048 24533 29608 -35132 -2675 58580 91028 94349 27421 13712 -28666
21425 -28666 9556 63101 38194 44594 105950 74910 72812 18709 -47982 -51959 -84469 -111807
21413 -111807 57698 174963 218926 141924 149653 127440 19548 -144374 -206300 -121047 24744
21402 24744 -2052 -25663 64918 8754 -32088 101477 95150 -1905 19448 -2181 -106109
21391 -106109 -110784 -107632 -76101 -34627 53212 59098 63583 145701 190028 189787 251745 165729 70434
21378 70434 -10190 -143962 -73242 -70564 -36860 -15733 -60493 -194371 -175963 -171134 -127169 -147538
21366 -147538 -143937 -91355 -70951 -127622 -165343 -48959 37586 76460 105802 160021 92493
21355 92493 39652 44201 30560 -29868 -35951 38222 2751 36888 -13549 -65295 -75014 -92446
21343 -92446 -111720 -119592 -92113 -35246 -67295 -42912 -108879 -143858 -196121 -152345 -157193 -131381
21331 -131381 -52777 43203 77717 74263 167307 191602 84457 53945 -34626 -74755 -106809
21320 -106809 -42953 31595 -68613 -78624 -46335 57286 71285 81675 5435 -30199 27452
21309 27452 95298 109321 67607 25937 14179 -69470 -54810 -88778 -24043 89029 72703
21298 72703 42914 14436 14334 94241 9043 -93397 25008 -40392 -113558 -147943 -73909 93266
21286 93266 204334 39520 -89068 -51787 -82766 -39352 -924 -15429 -79331 -191243 -150522
21275 -150522 31061 12623 -11362 -22171 -66141 -89274 -189491 -213001 -156199 -89256 -105986
21264 -105986 -129262 -96105 -42265 86207 100867 35003 -26874 -17946 -28349 -73640 -82616 -90217
21252 -90217 -55965 -71365 -101685 -147844 -39886 12204 -38619 -93387 58553 220981 117201
21241 117201 4634 41321 169284 83667 -29421 15771 -46154 -32860 149235 228189 274678
21230 274678 137957 -7024 -56634 -85121 -40764 -37436 -145214 -114387 35183 21771 -4317
21219 -4317 -76539 -199339 -296757 -171258 -46745 -11728 -64664 -60842 -155006 -133813 -100811
21208 -100811 -61653 -77031 -65357 -116389 -115738 -40810 87126 61132 2692 23576 89214 98011
21196 98011 26412 61904 171040 164356 80272 76441 10000 -141515 -172341 -90415 123419
21185 123419 110888 44129 -21674 -46883 44626 16690 -79095 -47924 -118854 -135183 -216556
21174 -216556 -156481 -115629 -76089 -92851 -135199 -171472 21628 70194 -24392 -100682 -97747
21163 -97747 -107651 -70044 -12264 24464 61997 16576 -37401 -48962 5817 -5354 -35463 -152955
21151 -152955 -170886 -12329 -36902 -201445 -160931 -75362 -89180 -51256 -96619 -113236 -147710
21140 -147710 -132633 -45220 -19187 -48645 -136913 -249725 -267580 -262400 -293242 -193778 -259517
21129 -259517 -254644 -233401 -265278 -189710 -88606 -142387 -140329 -124705 -38531 39106 93465 59322
21117 59322 -21213 -63606 30308 51079 -16448 -59661 -5249 -76865 -141559 -117774 6235
21106 6235 155104 263149 222870 103331 -31115 -151506 -103807 19679 61494 45699 -56773
21095 -56773 -105143 -103068 -110610 -82224 15139 -4428 19512 -99772 -157688 -62455 -85054 -108431
21083 -108431 -12532 153863 247263 251281 194874 185179 39602 -83263 -106789 -143031 -70000
21072 -70000 81415 27175 63375 29083 88046 102062 17122 -47344 -26158 -55668 -58031 10551
21060 10551 89855 -88456 -175599 -107567 -125292 -87748 -38960 -24418 -169712 -97686 44206
21049 44206 30719 87405 124879 -4253 -31401 -29812 -67881 -112686 -601 147350 150138
21038 150138 141365 42606 42958 -91583 -122756 -83229 52633 92443 -30572 -70852 10276
21027 10276 5932 54285 148537 94048 46174 -50388 31757 85281 8779 -21289 -30665 -19431
21015 -19431 -5862 14473 52643 54672 11360 65985 -19067 -126103 -3954 48229 65722
21004 65722 -5807 -72227 94040 170859 133901 109978 51672 -8326 -98888 -190708 -165954
20993 -165954 -8444 -43248 -213411 -274085 -170631 -39053 -127466 -251620 -241613 -254078
20983 -254078 -76931 63574 67374 115368 83633 19604 -36305 -1451 -53775 -133969 -181318
20972 -181318 -63128 -101834 -66903 -50889 17169 25633 41680 50590 168721 198390 178213
20961 178213 181093 126795 128850 67503 17038 80109 229497 135315 20031 60734 -53025
20950 -53025 -125966 -77372 -45619 -33003 -16115 -181 95773 94108 89303 -33165 -34207 30563
20938 30563 -9036 -87415 -32418 21549 16293 -56089 -55013 28391 18748 -29913 -50792 -47721
20926 -47721 16505 76338 5395 -63517 -17684 13981 -19826 -63222 -100523 44910 158151
20915 158151 152897 189830 157942 178977 83263 -84962 -109851 -74120 -59412 -43711 -90629
20904 -90629 -101142 100707 76991 88339 149028 239220 192467 174175 134668 155002 162962 75787
20892 75787 68614 76343 116291 69277 45846 7074 105290 174378 259644 182124 38471 39276
20880 39276 155646 157232 161783 108566 82945 43015 -21285 -6707 -20117 52677 94313 -32588
20868 -32588 -130412 -55493 -9336 -89695 -125255 -63300 34075 104209 76707 114069 92228 25137
20856 25137 -15505 42265 79741 145092 246910 140556 -34632 -127325 -132004 -91772 -3622
20845 -3622 -2574 -72473 -9406 29263 66172 60152 -58447 -94633 -62776 53279 112505 29871
20833 29871 13355 -49726 31155 46921 -117266 -85323 -82036 -85496 -148576 -168378 -9255 175686
20821 175686 154205 24084 14476 -54387 -114227 -121584 -170442 -199753 -139642 -147316 -139474 56459
20809 56459 140994 87199 73952 161049 171625 133161 143898 134673 56213 961 -48024 26062
20797 26062 -62448 -115822 -103789 118454 139220 -43470 -118795 -129637 -125954 14680 85756
20786 85756 42420 -6003 14773 -67442 -120030 -173761 -90453 -31762 -23847 -87784 -102257 -54358
20774 -54358 -68660 23587 82443 7141 -124652 -102684 25671 26229 -91216 -144616 -200136
20763 -200136 -104566 29500 149294 82810 -67467 -69404 -35055 -24815 25543 -37174 10592
20752 10592 67524 25697 -10512 -127911 -128353 -121549 -128262 -125572 -99068 -66193 -34117 27050
20740 27050 71462 21609 -53504 -59324 -98599 2575 20839 46899 92133 73970 38404 -46431
20728 -46431 -241126 -282335 -218501 -149519 -127169 -151921 -177067 -113057 12564 -58098 -2374
20717 -2374 -73154 -159205 -24908 -6322 50822 4071 -189879 -154957 -97873 -170930 -249211
20706 -249211 -159749 -82780 -16659 43447 -34629 -102684 -108168 -168763 -245945 -187681 -71298
20695 -71298 -43739 -70188 -2662 -16759 -63947 -108720 -86573 -49428 -154662 -165605 -53425
20684 -53425 -27283 -23064 -25490 -44006 -35035 -53668 -12814 -26568 -157288 -274278 -236706 -165393
20672 -165393 -79558 -11755 39383 72441 74340 52092 13192 -111725 -119167 8171 30280
20661 30280 -6998 31628 41786 154357 130170 10337 -25200 -41593 118518 206378 198264
20650 198264 178928 181745 198564 132386 72015 28620 -40178 -43919 1712 15861 25153 61703
20638 61703 -25217 -139413 -87948 -94213 -123683 -148644 -12380 -30109 -54932 -31925 -20523
20627 -20523 12806 -5029 -108327 -74266 -54098 -80637 -42304 -126790 -190368 -131071 -52861
20616 -52861 69803 92545 159052 102517 118874 71805 51562 92854 96702 86373 150187 167888
20604 167888 98303 51439 43348 116713 162858 153202 -30018 -70562 -132146 -73341 50174
20593 50174 99815 71873 78135 65645 97440 -58152 -128357 -130982 -91264 -69428 -60833 -76674
20581 -76674 30640 33195 -41480 -485 36010 -19810 -74992 -129229 -52022 91170 92031 -15674
20569 -15674 -64275 -40577 -17044 7740 33498 -44147 -53921 39938 78047 28460 92840 48042
20557 48042 98994 88095 55925 1921 -118117 -133502 -183040 -127415 -60693 -57332 -47735 3819
20545 3819 66860 687 -4502 -80565 -172389 -47869 3014 -55034 31981 51023 38136 12359
20533 12359 -113028 28952 256230 276034 147870 87453 17055 -32609 -40066 30003 138892
20522 138892 142232 148048 236208 209469 179915 30958 -52830 -94133 -136046 -156457 -122839 -96438
20510 -96438 -59383 9925 64844 -4019 -151437 -235991 -239223 -102664 -74971 -69782 -86945 -35167
20498 -35167 16831 73684 41348 6885 -33054 10461 128664 159643 146836 108718 68442
20487 68442 -81239 -185044 -191151 -178703 -147018 -70187 -71964 -141260 -103707 -150077 -139979 -56447
20475 -56447 22290 50136 13109 29636 42587 -32450 60784 195797 127766 127999 138131 52357
20463 52357 -29255 25510 113882 214247 125974 60862 138436 169545 173920 148742 170757 83372
20451 83372 33975 -82806 -70972 31014 25726 22475 4459 20507 -9548 8766 139328
20440 139328 164599 45605 -122052 -241349 -167923 -33270 37909 50971 77522 13919 -10897
20429 -10897 -119348 -190514 -173103 -193075 -194093 -168067 -238206 -277800 -133411 -63363 -43310
20418 -43310 -42627 -83605 -32319 33240 59054 63559 -53648 -40844 -32429 8551 -47732 -91292
20406 -91292 -89433 -132403 -92390 -41942 -205206 -139926 -41404 42167 -74580 -127454 -122484 -53384
20394 -53384 -49968 -98644 -43121 26152 129389 239024 76062 -164785 -219834 -219509 -184139
20383 -184139 -141739 -55076 105547 164309 94349 20328 -45622 -68682 -78193 -121876 -78253
20372 -78253 -106832 -18039 28787 -28230 11708 -39464 -168426 14057 204703 244142 60552
20361 60552 -26589 -72141 -129699 -81832 -63996 -51671 -24572 46507 86667 122763 153714 85712
20349 85712 -54652 -123100 -66928 96736 192188 87958 -7443 38115 122295 123968 7760
20338 7760 65943 128219 36306 -25110 -94035 -142839 -87641 -120160 -15274 109958 105275 -56623
20326 -56623 -166313 -118434 -126465 -85978 7728 -33032 -33102 -162927 -184201 -92664 -43997 24004
20314 24004 104572 118938 184673 180333 108539 16884 -59797 18527 187734 258302 154922
20303 154922 179834 230845 299043 318385 270409 111310 42699 54691 -70208 -140172 -149884
20292 -149884 -10825 118784 94930 -35130 -13665 -45971 134353 65598 -26940 -2316 108112
20281 108112 173434 169939 57524 -22003 -36124 6099 -47274 -15427 114240 144054 96755
20270 96755 -30205 -76067 -140492 -127349 -158662 -175387 -26941 22330 82543 77331 -53650
20259 -53650 -63067 -60632 -20398 -78671 -136556 -144104 -166354 -44635 -33636 -711 119614 164992
20247 164992 26816 -29602 -63863 -66309 -29402 -35736 -20384 43552 48924 98041 156411 151480
20235 151480 165483 184581 141932 39614 -18028 31937 83388 176710 106321 33488 -60490
20224 -60490 -47653 5085 8823 -8115 -48366 29252 17882 64357 -9601 36410 -9456 -94152
20212 -94152 -98638 -111150 -115956 -84332 -7626 40304 583 -82032 -116484 -73171 -29067 38338
20200 38338 126353 134616 160576 48580 1149 -23741 -142433 -182296 -190471 -32746 26536
20189 26536 133989 111204 97611 171816 172664 172321 121814 82412 8986 1281 32837 104277
20177 104277 211153 164383 77314 57459 54470 -6699 -9829 -16703 -101044 -50579 98759 46394
20165 46394 29004 -17760 -129516 -310810 -280077 -77124 66693 105944 63930 -33824 -86691
20154 -86691 -38211 -72339 -114447 -168715 -128491 -53534 -7359 36909 27950 34050 105358 41417
20142 41417 -30523 -50325 -178590 -175852 -24848 -45064 -167447 -155009 -176115 -110194 -52210
20131 -52210 -139188 -65623 -81719 -40986 52474 88979 160334 102007 12580 5575 -18624 -4969
20119 -4969 -113247 -209502 -124888 11272 133742 65100 -38649 20200 169678 189600 180016
20108 180016 78873 -28324 56169 90063 -74540 -91549 -42625 -135306 -238112 -126565
20098 -126565 -48467 -44082 -82441 -145275 -105853 -94505 -111384 -129456 -44053 -36432 -84844 -61049
20086 -61049 -19564 -11517 -64962 -53462 20169 129236 125379 72617 142622 194530 55854 -16339
20074 -16339 41944 35277 -40557 -126618 -142641 -220700 -244642 -150496 -77978 -74517 -47291 73606
20062 73606 65304 -43873 -53743 -118952 -227304 -243344 -199133 -171301 -63127 5591 62171
20051 62171 97922 116478 75856 70625 86769 138247 172356 85430 -7670 -7113 -40870 -43454
20039 -43454 -53183 -47034 13863 34723 20942 59204 66797 -7322 -165105 -152490 -117753 28988
20027 28988 53083 -101875 -126675 -116645 -122117 30925 40798 52516 92373 18391 57613 -88791
20015 -88791 -77015 38111 13953 37462 117625 125744 176163 168408 87114 -18309 -4241 -26703
20003 -26703 -94399 -51784 -66066 -212547 -390743 -312296 -236241 -235492 -205401 -48552 66316
19992 66316 -14718 -80318 -111163 -120480 -193760 -143416 -50299 28274 -46184 -81567 -54539 -113177
19980 -113177 -128987 -35057 -46455 -81178 -2705 -105503 -181275 -213553 -51563 108988 129353
19969 129353 47741 23342 67690 83842 -21042 56895 165464 68748 -35652 -42701 88193
19958 88193 130669 -71809 -133431 -131623 -70364 45863 154815 62682 -16183 2643 17159
19947 17159 48142 81490 8758 -16195 -28729 -63075 -146512 -175782 -58405 -85504 -27849
19936 -27849 15808 -34438 -89200 -8520 107445 125904 81386 30803 -26802 17168 14653 -21823
19924 -21823 -24750 90922 175166 135046 68623 -63624 -7868 124159 48151 -61709 -107569
19913 -107569 -100334 -119502 -112279 -151227 -260573 -287130 -221326 -271084 -380159 -274079 -111991
19902 -111991 -177326 -225572 -289334 -299393 -263035 -200969 -108395 59301 33925 -92739 -100346
19891 -100346 19028 94976 110127 48138 75679 30773 -107046 -44815 64461 92362 30426
19880 30426 73446 3891 -94126 -134875 -26203 53810 71599 4307 -29281 -80729 -84628 -43061
19868 -43061 -135172 -78487 -84643 12022 51134 -55771 -83506 -82306 -51072 53308 46631 77693
19856 77693 84950 93709 20903 -83179 -155907 -81438 -20804 -93846 -194381 -185357 -3096 -32119
19844 -32119 -13553 -38848 -46004 97495 30404 15675 170572 235124 168229 -2333 33479
19833 33479 155729 101370 -22024 -18858 -14797 3934 -15763 81859 81173 69051 149821 138387
19821 138387 109768 56147 39646 -70046 -83814 9788 97889 166533 122868 67148 74690
19810 74690 181916 201765 138277 -10538 -110037 -59231 33274 115227 102318 64371 -6123
19799 -6123 36794 6150 -81431 -95763 -86397 -86191 -176234 -313943 -263332 -123166 -62060 -69764
19787 -69764 -99776 -65699 -21552 -12146 -122513 -80198 -82737 -213990 -134680 -1081 54435
19776 54435 56685 157805 170313 -29828 -105956 -26077 -73246 13494 -2695 -27607 74368
19765 74368 50966 16074 3149 32217 73858 84136 161495 171547 162141 93274 51304 57233
19753 57233 41612 18718 67260 63445 -58532 -27605 -22261 -44097 -151329 -51182 13954
19742 13954 59142 42941 71621 114605 167559 39323 -5437 53056 -556 -31576 23658
19731 23658 60895 92519 -38573 -3392 45148 115755 146069 171960 65854 -49853 -145247
19720 -145247 -66072 -9494 52693 6124 -226131 -157600 -67486 -15629 -56958 -68343 -92666
19709 -92666 -113654 -116673 -17909 88545 -72269 -108577 13571 168435 161812 118332 -1188
19698 -1188 66760 31523 -34912 -18834 -53463 -133225 -162654 -98796 15076 29698 -77038
19687 -77038 -195193 -289286 -78602 124832 76177 49251 165678 106535 5577 46679 92604
19676 92604 74977 74486 -74956 -168871 -148662 -30467 59563 42579 -71267 -173859 -93460
19665 -93460 -84268 -49270 70471 -17886 -97677 -118299 -72018 29858 -25941 -92680 -101775 -15319
19653 -15319 -57464 -17335 145276 173316 115168 81688 -7192 -22242 30313 12492 -144660
19642 -144660 -169569 -150112 -87111 -80447 -102702 -160240 -105415 -7903 22440 57767 -58590
19631 -58590 -17332 74507 -10545 -115541 -14370 -5348 -37694 33306 19629 -111437 -47643
19620 -47643 -92307 -124115 -159337 -154827 -83401 -75311 -77211 -12711 117153 100559 46567 4985
19608 4985 -15111 38146 50219 -31067 44709 112664 168697 201746 288435 260385 286452 286560
19596 286560 271230 249762 193674 152114 86628 124286 207546 274416 210842 75917 30701
19585 30701 117734 69346 38396 -39363 97953 166785 116409 102267 133844 192833 109231
19574 109231 133734 186600 232052 172016 65980 19589 96910 132394 79654 2981 19933
19563 19933 123900 15414 -106794 -159915 -113547 -71918 -109975 -21671 -22460 44818 118338
19552 118338 77495 45280 21430 -32545 -38770 -95514 -93923 -77520 -45192 -25463 36345 177496
19540 177496 155867 143780 107078 147712 129679 50896 -25733 26111 122911 237682 231387
19529 231387 193365 126123 142649 147576 37217 7841 3546 -20068 -74206 -21503 3914 -35300
19517 -35300 -69377 -194385 -162108 47197 108538 81938 -17517 -4753 -5092 51794 9253 -1826
19505 -1826 -12275 15529 57328 78849 52595 24054 -62556 -112746 -79912 20785 64812 30990
19493 30990 32701 172041 250779 270151 238675 131388 194775 128395 51359 99308 42475
19482 42475 62090 94702 155033 99062 172983 236960 181571 81095 44737 62186 94340
19471 94340 199219 193950 107093 -7215 -61745 10844 66224 135424 135768 105895 68245 110726
19459 110726 178604 -65226 -73166 70711 136536 170693 154924 89233 101263 37655 70663
19448 70663 56323 184265 235001 195295 107905 84872 81728 112146 -4008 -70721 -84978
19437 -84978 -82386 -15213 29219 82132 64452 102971 60120 131264 196892 278887 335415 196024
19425 196024 195073 158019 117272 -8578 -22945 33684 97123 172435 134987 200548 122768 19873
19413 19873 -24622 -85574 -158571 -79959 93275 87465 119473 20638 -53998 -79138 -131107 -92539
19401 -92539 31455 74813 48053 72400 158606 74512 -12539 43375 34098 -14113 46395 58538
19389 58538 178816 264339 213626 185455 160423 -3865 3232 70472 212593 308112 170217
19378 170217 101838 133468 55393 -78729 -100514 20817 127618 83312 130146 268190 179119
19367 179119 177710 195323 118734 126207 250107 223359 208521 234976 287272 180739 180149 147389
19355 147389 128395 48078 -4756 52444 90713 113968 148254 237323 161643 164069 123654 192607
19343 192607 168388 176313 200982 371232 386003 207984 163570 134107 74627 -477 -997 204733
19331 204733 242820 206822 236667 221365 172166 -22955 -68611 -105215 -17097 27781 -10185
19320 -10185 -33583 -36694 -7087 -57274 -27452 -83883 -99377 -60577 15019 82024 80688 -10562
19308 -10562 3569 45803 56730 9248 -119976 -98011 29113 30208 96998 207336 197680
19297 197680 184113 199250 255511 101931 50622 41266 -48178 1430 79683 48096 -53295
19286 -53295 -73351 -105792 -7259 20386 74023 1237 -58904 5291 57251 42648 47040 54687
19274 54687 45716 71743 35516 -19669 -30250 -83570 -110819 -120773 -222625 -149987 3986 30292
19262 30292 77253 43406 45090 28657 -57448 -85707 -39323 26938 -80959 -85550 -57346 -36406
19250 -36406 -44022 51545 22773 -134370 -143860 -84902 71413 151919 243482 289321 289168 292848
19238 292848 320621 397107 440925 304917 236120 216304 162792 108466 66035 29571 79680
19227 79680 56938 30927 165128 170044 102244 79306 51690 81022 220403 253585 168043
19216 168043 185259 241723 213093 127121 122761 118449 173368 135871 59325 -81373 -30336 233715
19204 233715 290077 290078 210048 156592 158517 329420 447620 470983 492197 589531 788917 904005
19192 904005 990363 1118707 1266213 1322942 1330882 1307792 1371879 1368278 1374454 1271526 1218382
19181 1218382 1351589 1427111 1458492 1528156 1667880 1669930 1595153 1531483 1385098 1206073 879682
19170 879682 661667 601879 554603 523892 454844 328248 241437 345421 423041 444005 358629
19159 358629 261775 283589 181405 190947 88248 -27796 60738 74451 -33179 17328 72930
19148 72930 113176 -27918 10580 77967 9420 116547 369175 385340 308982 262684 251936
19137 251936 239975 176679 96144 130084 156409 194213 158065 139366 38534 123386 150213
19126 150213 188881 105259 59718 80504 113878 29396 71346 16638 -52758 45996 138567
19115 138567 98034 137047 203937 203147 83806 71323 80386 106599 115700 -10725 -107465 -121226
19103 -121226 -97981 -24736 -46460 48850 161237 172796 97423 84915 6745 -36764 -18408
19092 -18408 64522 -23491 3194 -37635 -10345 14859 61263 28166 9472 45219 111155 124863
19080 124863 93000 133823 107142 93637 828 -1121 8618 47328 -51188 -76253 -89723 -86276
19068 -86276 7436 102334 79872 70071 31038 13790 26915 -29149 60002 203259 210188 66120
19056 66120 4982 -13951 87969 117938 154785 142056 189942 13340 -12745 91632 140587
19045 140587 114569 134743 174297 251696 305462 291219 268298 220139 68453 -9183 1849
19034 1849 29328 44877 76562 45333 1455 -104920 -69045 -10164 12160 75865 95283 34434
19022 34434 -17481 3588 17755 36791 17746 6053 47928 -12398 18389 159273 252086
19011 252086 194450 67136 67007 218285 105823 50452 76528 111818 27653 67026 103010
19000 103010 52479 -7818 14024 122563 204782 148678 150242 210400 215387 185890 180473 289093
18988 289093 333927 373418 364652 353257 314760 296212 281704 175355 136903 83944 45421
18977 45421 113906 153057 162714 199987 105616 79717 185564 183137 224899 229840 146877 153037
18965 153037 188655 222004 220442 228490 116990 29586 22616 23779 63751 33703 -25693 24747
18953 24747 42489 -74721 -97060 -60525 94211 213489 99798 -138705 -214344 -3201
18943 -3201 134133 298926 267086 201726 174673 130371 242186 148502 49423 -45166 62896
18932 62896 200052 158313 129933 46187 158694 234230 199267 153201 218782 299030 225347
18921 225347 127857 211005 223654 159982 97557 153729 184622 148770 108211 123284 -10422
18910 -10422 21065 157190 226902 228905 224562 188798 165156 301808 333854 289662 403171
18899 403171 461091 399763 379731 439267 444731 395808 331243 275630 209302 147234 197048 192364
18887 192364 198960 259240 396816 448344 294099 178947 62775 36471 137305 271789
18877 271789 135523 89429 174990 255980 275655 321313 330511 300669 242843 234303 381968
18866 381968 414985 309462 273125 300921 314301 185329 23921 91998 92834 192826 137412
18855 137412 36187 26225 268849 414912 530015 496217 365690 296591 319421 254956 234815
18844 234815 302166 330757 365045 294181 104375 114858 172729 156829 236332 297838 275784
18833 275784 260704 206517 230556 140572 125913 49018 79115 241235 283278 159439 127907
18822 127907 160911 102607 137068 181901 218200 123348 66797 43354 181973 254618 285312
18811 285312 282969 422211 444268 363233 283339 384229 447153 423164 458568 347904 349838
18800 349838 499794 606617 628963 579769 542959 554879 598088 490324 465768 478916 527600
18789 527600 485889 389502 424240 472822 580157 550827 387951 377746 385200 303545 259957
18778 259957 354931 343908 349882 470401 619688 662249 624391 570136 698708 682060 747778
18767 747778 859388 941229 952291 934858 826317 662471 455488 263046 229620 377107
18757 377107 409290 517039 709289 630701 544638 358787 306870 337432 293241 427963 418564
18746 418564 295144 341104 271611 229583 235999 260266 212176 98979 112460 187751 293537
18735 293537 235372 276736 271359 280213 274217 278742 271671 215933 294606 292824 257212 342560 381862
18722 381862 227642 117324 105751 207755 271233 406808 468265 390646 380572 333353 300485
18711 300485 284114 297831 465538 407985 354868 420687 556080 680118 680392 680833 698395 664485
18699 664485 791455 824111 721321 715332 709410 703795 617780 647159 556323 448780 505338
18688 505338 563491 478328 361445 343480 346430 519350 643729 729684 720695 684969 579743
18677 579743 446712 451824 624712 699669 779040 848772 781651 733523 828519 859418 746100
18666 746100 744414 843019 872822 718824 833169 810891 728496 607685 646787 702725 803980
18655 803980 776384 616280 515323 546474 642484 668696 648985 568202 519880 601434 631568
18644 631568 628942 716570 807785 799684 903692 1030168 1161908 1197933 1125454 976444 1053790
18633 1053790 1246062 1327567 1361496 1315156 1356595 1308508 1318279 1334841 1403958 1461093 1405618
18622 1405618 1402266 1423937 1498003 1507920 1540855 1585097 1708822 1720615 1602964 1512950 1506269
18611 1506269 1733153 1847355 1848961 1901901 1891008 1808675 1784999 1916420 2054236 2153445 2093736
18600 2093736 2082714 2077418 2203052 2387170 2503958 2664783 2895739 2967276 3110599 3174025
18590 3174025 3225913 3375041 3623388 3871821 4034845 4198949 4303806 4457448 4731697 4856054
18580 4856054 4841724 4935232 5169280 5522800 5753546 5945486 6275577 6690029 7143691 7683052
18570 7683052 8292282 8665877 9026593 9483487 10038416 10697911 11629175 12636086 13994812
18561 13994812 15644487 17780324 20546119 23964304 28601001 34591639 42535549 52966683
18553 52966683 66682341 84697729 107528569 135420742 166864873 197631650 223616135
18546 223616135 240771931 245230731 242063221 240438615 241892170 239821709 229139340 217647915
18538 217647915 217863274 229478303 244342181 255352923 255137449 243465749 228698104
18531 228698104 215943687 200266931 173380571 136460337 102256186 79211253 65460100
18524 65460100 57141635 51841038 47939773 44762848 42208713 40127597 38469155 36871365
18516 36871365 35260978 33831404 32482047 31269335 30459662 29707245 28800443 27597901
18508 27597901 26371073 25318299 24263843 23089925 21921633 20539335 19196127 18044354
18500 18044354 16906929 15866995 14986962 14156338 13421372 12657116 11980827 11426855 11048129
18491 11048129 10600187 10022465 9379801 8883481 8447324 7991452 7464313 6966392 6481833
18482 6481833 6138908 5840662 5577797 5352758 5020952 4742512 4512856 4225217 3950124
18473 3950124 3744996 3658807 3477316 3266179 3124397 2893008 2787746 2574326 2428826 2431704
18463 2431704 2374833 2206743 2110013 2134012 2067232 1896491 1911435 1922346 1747392 1597620
18453 1597620 1503938 1453622 1449791 1318838 1135740 1080413 1029146 976802 1031203 928932 788719
18442 788719 756716 719540 764703 710286 665358 718770 751303 714027 652474 671477 734456
18431 734456 665487 680479 814211 847022 750883 905732 955907 971332 921294 915247 1047659
18420 1047659 1129043 1182373 1221677 1179391 1023353 913316 951320 904424 823002 840932 898468
18409 898468 909648 802436 773081 720726 596664 464077 532391 611036 645824 704117 763735
18398 763735 761633 698289 634212 494471 423524 287331 342836 327545 350674 339276 342073
18387 342073 453557 443879 465220 424404 439172 382831 259042 275049 247719 409263 477281
18376 477281 392798 291652 320648 480150 580537 760017 837992 714979 619528 642710
18366 642710 670029 714192 742463 744698 755896 664812 664286 632390 726389 929338 968055 945668
18354 945668 967632 1031520 993729 872607 789789 792013 886196 1075210 1205963 1294998 1285823
18343 1285823 1188817 1124878 1014563 963392 907861 944755 995991 999948 936770 851584 886281
18332 886281 869391 650808 535750 516885 392335 336991 296770 233424 225255 292183 466107
18321 466107 512800 487569 524959 457014 371680 310938 298984 328332 364902 391678 470332
18310 470332 439147 332214 240939 250839 214358 268024 354777 358118 362694 447606 520093 406964
18298 406964 330019 345572 302963 318630 377670 383502 348184 392773 387065 237224 152295 81500
18286 81500 12087 84821 271194 294287 199238 218886 353004 346473 246771 170376 122289
18275 122289 175285 172995 158376 83944 109438 143370 195312 212510 348306 322708 252404
18264 252404 274933 381345 451348 353118 232557 207186 208852 254642 313249 362873 371878
18253 371878 393213 398732 411192 336537 290267 343733 440185 459039 426531 537606 510994
18242 510994 485915 418625 378251 382738 238131 270262 508032 635026 594591 533241 494132
18231 494132 488465 574122 545603 514676 503070 511953 425154 414967 397049 342410 357208 317337
18219 317337 379196 332110 283748 343834 513243 588256 460235 388255 441663 355315 333636
18208 333636 459346 468570 333139 402067 394679 460535 488824 519737 538362 524177 584949
18197 584949 480810 383607 362516 292628 305446 417404 345750 434826 465205 462152 434030
18186 434030 519120 562420 514020 445296 407175 377414 392656 483372 419746 391375 417627
18175 417627 550120 637764 706599 639628 566263 460657 331433 415725 455351 464086 464519
18164 464519 458454 524289 579637 542679 514590 518816 508281 462143 532633 611462 731335 797109
18152 797109 708815 644690 604042 651090 677342 742490 869950 949745 1034162 1044132 1168703
18141 1168703 1220199 1210685 1261183 1264676 1307233 1426439 1478172 1562488 1595282 1663605 1818296
18130 1818296 1935433 2025906 2242990 2423337 2636815 2938994 3474060 4119892 4889538 5916629
18120 5916629 7021878 8636518 10872531 13873413 17875252 23265758 30474629 39948692
18112 39948692 52797732 69847281 90839307 115975550 141348680 156486526 161075434
18105 161075434 147729044 105313388 65955878 43518043 31773869 25224725 20879520
18098 20879520 17889638 15643842 14059882 12821929 11827922 11056684 10358994 9933120 9677515
18089 9677515 9532823 9406354 9284839 9311257 9435394 9631494 9987713 10243407 9945321 9293345
18079 9293345 8720711 8284624 7713784 7017939 6416672 5976766 5470352 5022836 4664711
18070 4664711 4293233 4084338 3745915 3508881 3185787 2937408 2821038 2758042 2679685 2515415
18060 2515415 2413589 2373901 2180341 2001648 1921044 1890203 1782396 1736088 1722499 1614920
18050 1614920 1498590 1527593 1507702 1472125 1414367 1202109 1165357 1024184 986417 1000429 894111
18039 894111 842989 869647 870020 717842 675242 680632 658751 619232 426744 322888 360668
18028 360668 409375 513364 511671 444861 525556 586275 563302 418462 321619 328939 344841
18017 344841 440267 464878 284980 230010 216697 283230 229847 153469 227517 308212 483940
18006 483940 472994 339681 295401 346302 254491 184217 153215 155924 262295 215667 150589
17995 150589 165506 123354 -15495 -122895 -124787 11051 128503 78901 57549 128256 144953
17984 144953 208003 216572 325940 452221 533749 486258 448515 411922 267833 226379 201157
17973 201157 219633 275460 290416 312579 353134 282573 190450 107479 123938 66501 219470
17962 219470 278800 229095 178811 106532 187111 211119 194697 276966 251902 213582 120236
17951 120236 83389 188518 157762 122613 30312 165296 255432 260497 290262 264616 254086
17940 254086 234517 343575 281188 154998 152375 93074 172627 242596 326304 296983 188455
17929 188455 130739 185875 382656 474312 457320 398758 351683 443296 402072 405179 388804
17918 388804 388721 547315 500378 345065 296789 264244 321062 319927 438605 616535 707367
17907 707367 695730 710520 736931 663903 641024 625352 649267 694193 882171 1077400 1213968
17896 1213968 1308155 1373340 1616720 1735523 1595209 1522558 1647432 1615656 1522837 1531252 1419714
17885 1419714 1474708 1710901 1750505 1766424 1642943 1506157 1465397 1349496 1171075 1043647
17875 1043647 744383 632553 631187 531874 543545 698629 659759 498148 443102 483015 464418
17864 464418 475653 417752 398712 499972 600960 596921 530872 516595 470976 428992 375448
17853 375448 443295 268566 284741 382403 363192 355330 438665 470486 433297 377567 303919
17842 303919 310557 342168 222185 238305 216329 91601 34526 174931 176081 258144 315587
17831 315587 350624 219208 97605 98381 133137 128637 219268 306048 331479 317365 262081 279858
17819 279858 270999 349931 431943 492163 422510 357199 395861 282908 210797 229252 274161
17808 274161 333378 450492 522182 514843 552226 555654 475415 482604 568663 576259 451847 354440
17796 354440 411491 618483 688708 433393 339739 389435 307350 216045 375300 494679 420949
17785 420949 290697 281060 293383 390418 494825 515351 485111 473311 529291 592794 581740
17774 581740 557402 512902 418332 332632 335310 348324 280427 333063 462918 504687 424573
17763 424573 381880 343528 340748 355758 311540 285742 319253 407438 405706 371800 231558 334709
17751 334709 350069 286187 299699 257987 218530 282536 200800 140338 160764 248653 281025
17740 281025 260620 305933 359118 375018 353907 420258 369436 351432 409353 435834 288095
17729 288095 159690 178378 185372 217852 224536 239331 210547 247267 316405 341924 392857 398543
17717 398543 421166 485351 430958 389692 431899 567954 558371 450372 331886 416328 563466
17706 563466 541068 492988 505247 687056 866818 745871 606663 543577 471553 490154 470279
17695 470279 584273 675324 732834 695978 652651 596751 559775 533543 638339 733484 712780
17684 712780 570846 491326 491420 533168 574746 622183 718468 754463 720911 740008 720981 688226
17672 688226 739521 831916 820481 794758 785791 801078 772091 709819 700214 690920 700088 773184
17660 773184 742139 643958 534017 656870 844785 837381 896246 807842 806897 813795 783519 786218
17648 786218 755011 752487 782304 842191 874542 821803 765334 798061 947112 1092808 1071184
17637 1071184 869837 842036 923851 989970 1105516 1107675 1139596 1214733 1153670 1057843 983330
17626 983330 903413 977822 1074982 1062058 1088350 1223631 1321821 1367774 1561839 1656765 1643293
17615 1643293 1529192 1408808 1328607 1343719 1504519 1548014 1595670 1539977 1503797 1558879 1642085
17604 1642085 1728719 1713131 1652913 1652677 1763333 1903408 1973669 1963836 1862270 1740489 1802425
17593 1802425 1903668 2129633 2184830 2230364 2269972 2415277 2551066 2528458 2465460 2586538
17583 2586538 2737236 2879128 3003476 3029260 3189145 3639799 3961517 4210744 4450136 4692754
17573 4692754 5101836 5476506 5867361 6174228 6465363 6713064 7009170 7298095 7480376
17564 7480376 7784280 8353755 8925502 9500148 10263288 11591018 13225037 15281040 18070911
17555 18070911 21629944 26309437 32693494 41100226 51949317 65963102 83951256 106598156
17547 106598156 133314402 161002579 187161309 207297425 215521668 215795996 208716179
17540 208716179 197987294 184898735 163889008 138113994 110140668 86215107 71378588
17533 71378588 64262491 62338178 64169777 69390335 78156593 91051667 108627887 131436047
17525 131436047 158597299 187258911 214624673 236062192 244881199 244520731 235999786
17518 235999786 222787740 207170739 182993601 153262072 120809957 91806229 71971980
17511 71971980 59447782 51384442 45632443 41341599 37923204 34906093 32475926 30616700
17503 30616700 29155525 27848139 26954951 26262746 25769719 25350283 24731316 23940848 23160620
17494 23160620 22461986 21743323 20916078 19898558 18949640 17976550 17016854 16083428 15223364
17485 15223364 14396326 13581046 12824854 12206300 11688883 11256250 10978353 10626048 10273846
17476 10273846 9982543 9667380 9064136 8272234 7539368 6847273 6234772 5744766 5388921
17467 5388921 5088337 4763450 4458377 4197170 3973078 3767154 3608967 3529767 3347702 3119014
17457 3119014 2883781 2717728 2512520 2373304 2297083 2191163 2082378 2078958 1904721 1771882
17447 1771882 1696691 1702961 1641277 1714292 1884266 2055115 2184970 2252409 2146121 1885252
17437 1885252 1626408 1355588 1122800 909410 816635 767306 833499 920039 884406 830490
17427 830490 659877 533750 588402 654075 627247 582637 632582 669267 770669 880327 972269
17416 972269 988019 910541 798247 696084 519105 513099 503628 503606 425150 457102 480903 494208
17404 494208 528159 532407 571760 564236 571012 706000 691535 655288 547547 549021 476224 411722
17392 411722 440870 444093 446964 384363 345383 387487 390042 388166 389521 409790 528516 538218
17380 538218 463144 465979 568712 670417 628053 540166 510372 490712 535624 409047 300219
17369 300219 284451 196924 179985 297477 294276 362173 405457 495822 489595 444645 507434 542876
17357 542876 601803 597330 568645 556473 566149 455220 489465 491477 460374 500814 481838 431991
17345 431991 431875 491337 511640 449356 490736 608573 598127 553781 525946 541560 433230
17334 433230 349136 369533 511907 513391 455887 478450 347364 329517 325655 352110 445324
17323 445324 580039 584209 569552 463557 479954 547065 342581 174941 271383 341751 279751
17312 279751 301666 354321 403245 313052 307810 363764 308922 173376 135261 164948 139522
17301 139522 247649 329908 367929 319952 233884 267182 317720 230436 162130 220285 329344
17290 329344 407545 404487 345798 338417 383925 348175 278684 240867 271270 320900 288736 295864
17278 295864 243018 343035 343228 297385 223449 246083 334652 407718 373285 447171 519692 553365
17266 553365 486472 325364 267757 212775 183282 196465 183527 117748 139934 79853 13907
17255 13907 -64708 -46480 5234 11853 -26521 37684 157610 203384 274213 294195 302882 270351
17243 270351 154442 39834 79527 170058 236873 277921 272490 323177 397540 363405 346953
17232 346953 451484 536470 617083 589814 440126 422074 427789 456160 515483 566479 602516
17221 602516 558590 496267 481976 437099 379523 393888 390097 522140 534105 365478 371087
17210 371087 529351 690300 659004 644917 568795 603451 570455 579285 559357 617835 536299
17199 536299 526945 598870 584119 506724 523117 514473 507724 481787 480842 511207 537994 520011
17187 520011 515259 606660 507222 422629 376476 328641 246404 327335 280904 331795 452789
17176 452789 481206 530551 548985 579283 528663 526500 398088 244049 364285 648678 654386
17165 654386 609111 549665 687603 780877 807790 696837 638034 732486 629197 588874 646779
17154 646779 624739 575258 575664 446124 405537 455645 487763 459095 485136 408510 347880 311499
17142 311499 281055 372630 483109 481292 494185 505279 579260 629813 607262 581497 537292
17131 537292 575489 571199 553541 614131 683894 716403 715053 691549 690436 657665 720654 731506
17119 731506 699543 677293 510630 398893 486281 632388 688633 661541 679195 676924 664909
17108 664909 644026 572576 619573 682700 736393 721087 692916 728033 643352 724876 714886 700867
17096 700867 688707 739488 734743 732108 822841 862284 785627 847571 942264 985606 921020 847282
17084 847282 798055 826516 830688 839565 822191 732770 728083 806272 828808 843973 825149 785414
17072 785414 838731 904411 929909 987884 826973 834199 910940 951622 857253 999623 1174734
17061 1174734 1293225 1248360 1212774 1284415 1390105 1472727 1509828 1493547 1551589 1616671 1615541
17050 1615541 1519741 1427354 1418494 1324119 1173752 1142633 1175957 1172666 1215215 1268408 1399881
17039 1399881 1496411 1563327 1657186 1696107 1824242 1946276 2015107 1906929 1860769 1949757 1926001
17028 1926001 1950219 2010093 2063271 2122870 2230859 2213888 2284959 2296656 2362624 2470837 2515820
17017 2515820 2538776 2497463 2397947 2312914 2333898 2428535 2483826 2559530 2633511 2773566 2858129
17006 2858129 2999348 3089033 3235297 3432744 3566746 3769095 4144025 4547025 4748451 4933196
16996 4933196 5193497 5365732 5498652 5737453 5997874 6282774 6728303 7175914 7575955
16987 7575955 8050175 8398214 8846967 9394367 9963896 10757681 11861863 13250037 15030190
16978 15030190 17215125 19951744 23343274 27517655 32946222 40043490 49692942 62877614
16970 62877614 80242135 101591245 126781624 152376591 170465494 178436702 170898796
16963 170898796 140984105 111542848 96782377 95059571 102675766 116996717 136600105
16956 136600105 159338775 178644863 188494339 187753940 166096833 133905510 113560229
16949 113560229 108402249 114153369 127268650 145791147 166046704 180282533 185785745
16942 185785745 178342032 150446233 121517988 105881109 102267002 107348077 118691380
16935 118691380 134812671 154044433 170032505 176783529 173468138 149840759 113118398
16928 113118398 84799605 67955819 58238145 52209932 48054326 44944534 42628203 40964457
16920 40964457 39837434 39427974 39042496 38825970 39196910 40205535 41740027 44052091 47464683
16911 47464683 51917562 57929937 66197557 77585900 92544063 112546879 139388650
16904 139388650 174885109 220413618 276033060 339821941 406345403 465355831 505735623
16897 505735623 517405810 494130887 439821819 365839297 286242020 215404677 160482011
16890 160482011 121894980 96844995 80693149 69932612 62450745 57084133 53121387
16883 53121387 50160667 47692096 45631346 43938590 42420536 41163809 40098019 39234462
16875 39234462 38623707 38064041 37591274 36837019 35899736 34629688 33150698 31681583 30022445
16866 30022445 28288061 26520000 24681434 22775552 21024970 19427390 17970008 16664746
16858 16664746 15482942 14468463 13579284 12907154 12281833 11633538 10955780 10359235 9727206
16849 9727206 9153174 8631290 8216150 7828534 7509349 7129227 6757923 6485880 6270992
16840 6270992 6029783 5721837 5448409 5124078 4768134 4502828 4296770 4084857 3888938
16831 3888938 3725736 3535025 3367333 3237892 3131835 3011675 2785287 2680645 2598631 2491262
16821 2491262 2389432 2281094 2306693 2325625 2194435 2034348 1881149 1803622 1817926 1737468
16811 1737468 1575019 1487261 1346357 1329031 1299139 1254099 1075591 1041594 976343 906931 729143
16800 729143 708500 766857 834537 750139 728170 809071 784724 726900 663748 664049 626975 566322
16788 566322 474665 385035 486479 640056 701603 763675 782831 898412 907561 828738 788221
16777 788221 781007 805283 907655 1081386 1162877 1191626 1164851 1042635 949027 956283 887459
16766 887459 894611 901022 955534 949271 826503 806036 772824 716394 659230 647628 682960 620828
16754 620828 599433 670398 700774 670164 677845 781501 788339 687708 730274 805889 781258
16743 781258 833636 855664 815770 797754 831444 832043 774568 731790 701556 637406 454622 329289
16731 329289 339644 549774 537617 571492 526746 468744 430817 457306 416219 452023 443182
16720 443182 323151 334943 517213 591423 586840 662969 643446 677900 794210 800679 746369
16709 746369 735574 693315 681036 715918 712200 706819 758316 901826 905578 876148 784370 631979
16697 631979 526010 467491 473710 511790 444923 400160 238635 196024 294236 425436 283123
16686 283123 185790 258425 263978 126419 68537 17278 92712 127184 69686 115366 286307
16675 286307 283892 274132 279484 184929 120214 56604 -31709 -49298 -72060 -23113 -52834 -6875
16663 -6875 -76 -126357 -162306 -168521 -240724 -194502 61514 216574 263318 320437 198917
16652 198917 102775 195746 287000 356846 391951 332191 270849 281460 325654 259335 196681
16641 196681 131972 47568 53940 38097 38438 -49358 -197775 -164730 -95430 -106938 -196018 -124368
16629 -124368 -89938 -140593 -97342 -155677 -166652 -177207 -223940 -126913 -5581 57415 -9823
16618 -9823 -77330 -165034 27764 156449 145245 120023 2367 -14739 -8930 96456 26143
16607 26143 -53888 -28423 7148 110816 111302 147879 91375 -61325 -92869 -138364 -43549 38314
16595 38314 79437 77876 35434 151210 193708 184295 241922 142961 -42072 32188 188261
16584 188261 93837 -49711 -23776 105537 153847 124996 96961 19521 -31295 -11975 -50471
16573 -50471 12133 25159 -24664 -63261 -15305 -18053 -48438 -64017 -127838 -151336 -93819 -22660
16561 -22660 -55286 -61805 3101 2758 10655 31473 42888 -32761 -126293 -21346 106077 84915
16549 84915 11426 -45403 -37530 -77763 26321 130635 89039 90261 29029 33283 75490 130596
16537 130596 127690 147122 -29764 -184204 -221221 -244741 -283935 -284648 -302454 -165956 -33678
16526 -33678 -37508 54699 111598 127062 29538 -53987 -125374 40140 171599 105991 66988
16515 66988 1058 24139 14115 -21427 -51630 -22609 -46985 -73552 -23151 10636 -126975
16504 -126975 -112275 -17672 51709 -19868 -50624 -63935 -62307 -46160 11474 6108 86291 102910
16492 102910 181147 190875 87202 33143 -15200 -95589 -217351 -110131 37199 48922 -31575
16481 -31575 59256 92434 84834 -25245 -32062 -48021 15232 70660 62713 85637 58180 -17996
16469 -17996 -15850 98549 110372 175335 95463 33119 81912 156016 104110 80369 84520 51050
16457 51050 5334 55136 75107 -10153 -67789 -63022 -35843 5038 92043 171130 197392 157387
16445 157387 101637 154450 139063 125406 127925 113892 113764 45923 74747 4516 -62207 -95281
16433 -95281 -31992 4039 10665 31465 -9504 -142905 -148932 -167011 -86869 -36917 -31495 55383
16421 55383 121692 103824 94249 100067 42122 -77454 -202881 -231449 -77619 49046 70347
16410 70347 93861 -16411 53850 78233 176897 207732 346271 534420 737720 840745 910668
16399 910668 867786 711907 591486 480599 439964 528056 728252 958579 1122997 1091717
16389 1091717 1049247 1093222 934481 676369 566957 581559 625231 723473 851407 984166
16379 984166 1049703 1104202 956082 840413 774208 710832 656417 574941 577831 631160 799494
16368 799494 874380 820127 801207 723431 515755 376497 248149 79827 155959 269095
16358 269095 277226 248391 112253 -72218 -81876 33010 59382 232821 308690 253855 134161
16347 134161 188312 230550 275472 219085 160784 177917 180889 77204 116846 72834 22775
16336 22775 9519 61241 94001 215988 230164 109695 33972 33943 -12668 102714 233600
16325 233600 245314 372676 551365 636702 741368 724439 928097 1149980 1363813 1644695
16315 1644695 1972410 2291935 2453732 2558218 2518344 2326994 2020498 1579760 1324413 1029272
16305 1029272 812091 512303 327456 196501 29343 -17575 -27732 52414 158815 221463
16295 221463 210466 141312 188753 206809 138652 152129 80275 69513 276425 458796 418443
16284 418443 354019 227636 152581 134954 199623 157483 139158 103967 141128 97337 51014
16273 51014 87239 135106 92815 67158 -5914 -96118 -64004 79389 123617 -31443 -75989
16262 -75989 -93659 -119054 -79317 -11775 36313 82660 45121 68513 -28532 -106766 -56316 -16676
16250 -16676 30683 69136 80637 73623 109507 -34052 -181137 -216019 -256145 -162989 -203361
16239 -203361 -176145 -172058 -233590 -253865 -343663 -345578 -267836 -226311 -86865 22488 6298
16228 6298 -7031 60712 145909 109223 -14841 -117806 -152865 -93184 -127006 -169997 -175592 -108562
16216 -108562 -4512 -44127 -43401 -60431 -131252 -146211 -114531 -189212 -247034 -247374 -190869 -226607
16204 -226607 -192151 -214365 -214531 -120748 -13832 -69524 -167529 -295903 -262923 -178324 -6622
16193 -6622 101719 130193 447 -107818 -57702 -142290 -164418 -92400 -122975 -43112 9356
16182 9356 -64077 -151690 -204803 -260494 -260838 -380437 -446096 -357172 -230241 -129968 -104515 -108669
16170 -108669 -116711 -39509 -62300 -82264 -82787 -45483 -72534 -54469 -55986 -35315 -27928 -82704
16158 -82704 -93978 -98856 -175811 -284808 -185094 -161943 -335769 -235367 -247543 -281440 -158460
16147 -158460 -238678 -298083 -174497 20206 105643 65318 49351 -6527 -104211 -245099 -205321
16136 -205321 -85528 -69665 -87374 -88869 -131031 -55233 16529 -72070 -136448 -77200 -115993
16125 -115993 -26137 79930 186451 155464 317 -149136 -148038 -59523 -18129 -98219 -171144
16114 -171144 -132927 56358 113753 719 -12098 -30557 16236 53187 65565 49182 95188
16103 95188 146749 196460 111716 -31891 -46079 -8580 -25626 96733 146847 125018 163572
16092 163572 -14024 -97746 -131456 -152996 -271988 -237781 -144134 -191878 -92092 -181554 -183972
16081 -183972 -223859 -270912 -219131 -187359 -34971 69151 15828 -44905 51601 83427 65896
16070 65896 33826 -114922 -283641 -238413 -122258 -197517 -185859 -187486 -182388 -75319 -23193
16059 -23193 36892 430 12322 -55022 -131950 -149594 -154324 -26106 22338 -114095 -93502
16048 -93502 -160237 -185229 -43757 36456 -24650 -203702 -327314 -213615 -20042 14684 35860
16037 35860 -3287 -88227 -44655 -87458 -172477 -149180 -80521 -17522 9627 29437 1576 -123823
16025 -123823 -190070 -223139 -157252 -104192 -139912 -49049 -53168 -71371 -47389 31083 49431 110631
16013 110631 39585 -136739 -110149 -44015 -52457 -79151 -77626 -20669 -52866 -75328 -132148 -95674
16001 -95674 -73694 -48038 -92426 -238407 -293834 -267108 -167055 -16866 -47886 32583 103711
15990 103711 154884 60294 12891 55014 68995 -26835 -49163 -4642 -107847 -152455 -305198
15979 -305198 -356847 -267630 -35463 28737 -40147 -155808 -187963 -28480 15247 60213 106602
15968 106602 43111 -40777 -12052 -41594 -107828 -148587 -95687 -98070 -98819 -91202 -87158 -150963
15956 -150963 -179302 -119950 -126655 -144294 -130436 -162761 -207366 -182285 -303687 -257666 -130968
15945 -130968 -202233 -173551 -214634 -181407 -225439 -174643 -76681 -48809 -52317 -25341 -27961 43186
15933 43186 767 11763 -34293 -47403 -35629 -105050 -201426 -180022 -9562 21153 39869
15922 39869 -27933 -142970 -208883 -280740 -229684 -149487 -44822 -64766 6802 11563 45813
15911 45813 -16366 -61831 -73287 -203993 -280463 -229546 -219886 -160355 -87207 7290 -47550 -80475
15899 -80475 -53875 30840 -15398 -75579 -143485 -210559 -102055 42226 -9435 -263313 -344907
15888 -344907 -274544 -245340 -155625 -139311 -93123 -12846 16868 -153782 -170991 -209755 -227166
15877 -227166 -229699 -25629 35053 37453 2370 -9181 -52073 -55744 -22663 54381 106131 -54712
15865 -54712 -134743 -30973 33266 100960 41689 -42983 -55759 -130676 -235114 -260083 -210249
15854 -210249 -185929 -253343 -237128 -193668 -157265 -95098 -71733 -71583 -49016 52263 188160
15843 188160 122710 9991 -18106 42667 50520 65318 -13049 29029 56375 43667 66157
15832 66157 -11616 56177 99510 85536 35548 -99206 -87853 -8832 -56694 -38395 -131135
15821 -131135 -119176 -156600 -138693 -138866 -120902 -43151 -4886 70383 109825 7515 52419 79663
15809 79663 113022 116741 35273 -6291 -113941 -183759 -220238 -174688 -100314 -78863 -62192 -118413
15797 -118413 45826 234140 257251 229673 104997 -1186 79516 65020 15922 9757 6247
15786 6247 34722 7099 -63419 -119305 -70335 -32368 -74346 -146830 -139817 -142936 -155540 -117797
15774 -117797 -114102 -70842 -91369 -124420 -135846 -90896 -111704 -157691 -98980 -71957 -119846 -101934
15762 -101934 -76477 -51925 -25637 -23927 -108079 -121924 -122946 -159593 -168280 -12190 18326 43700
15750 43700 -18861 -89139 28504 -34288 -116660 -90040 -79469 -26824 -2925 21892 -14138
15739 -14138 -22449 -67738 -39968 52726 52821 -126515 -239091 -264705 -186354 -103772 -77614 -107415
15727 -107415 -171357 -96250 22771 59358 22137 16050 28450 -58369 -129458 -174797 -123896
15716 -123896 5822 -70868 -211834 -297850 -310415 -221911 -65132 -24615 -2782 3783 -26795
15705 -26795 -109020 -141381 -70734 -12481 -14377 38157 106341 88693 284512 293410 259941 121171
15693 121171 36981 -60375 -94119 -140326 -179935 36 116871 93730 67367 90637 168247
15682 168247 192036 20478 40952 -64476 -41214 17224 -43930 -57611 -35267 47074 224966
15671 224966 97393 95114 133541 95743 83502 -1459 -57811 -83926 -23848 -53216 -55202 -5669
15659 -5669 73864 47496 -34223 -82221 -114226 -165363 -233964 -239169 17553 72589 109185 162685
15647 162685 64486 87785 67113 133638 165154 139643 100900 64294 -99181 -122848 -72113
15636 -72113 -76587 -141135 -62442 35785 56261 -6856 15135 -94272 -147752 -150945 -89250 -156510
15624 -156510 -159434 -6887 47026 44256 -311 -60016 -66237 -142862 -169195 -164489 -192206 -132100
15612 -132100 -72810 76834 102380 80267 -3232 -92823 -95223 -238267 -165501 -50855 -13230
15601 -13230 -17237 -52858 -204052 -280311 -301886 -201043 -107063 -41648 4023 -12593 35301
15590 35301 112406 188024 176925 96293 44417 -36210 -149600 -262983 -253717 -275501 -191172
15579 -191172 -226631 -173552 -143038 -109485 1273 -63126 -189603 -98478 -3610 66975 56875
15568 56875 -26797 -58598 6094 -53946 -78470 -30415 -80567 -46206 5582 63041 17344 1587
15556 1587 -17106 -19532 -162839 -255231 -213748 -130162 -132499 -55344 24176 4419 -18468 -66248
15544 -66248 -117717 -105481 4282 -16373 87217 225944 163058 99485 13626 73111 168624
15533 168624 19341 -74477 -71769 -1836 27253 41117 158383 179839 121452 170587 152225
15522 152225 27566 -4247 -146858 -183076 -111032 -125213 -165114 -142781 -105522 18470 24334
15511 24334 98274 131509 102427 177132 82882 129287 193706 62751 -72429 -18057 203897
15500 203897 186086 107334 68346 129862 102440 98312 185405 173736 86228 5128 22726 76598
15488 76598 153399 219528 322387 379763 332778 166160 108392 151121 192466 126153 77339
15477 77339 55324 43619 -10943 -6308 18596 -22344 12600 19595 55234 61476 112362 184791
15465 184791 125504 102152 82852 17923 7860 -34175 -49504 45265 102355 46535 -14144
15454 -14144 52562 120782 152359 151189 221139 327099 272001 110368 52036 -44525 76134
15443 76134 84963 104680 38323 57391 64798 -6869 -16747 -40017 -70861 -70075 -114832 -61859 7893
15430 7893 65301 189154 245198 70694 13742 1392 -27799 -46709 -41685 -78090 -77825 62408
15418 62408 9122 25953 16307 -13077 -28175 -15246 2890 16879 16235 -22798 -42668 -79480
15406 -79480 -39126 -85429 -146800 -72462 -146136 -144716 -27097 38835 34162 25317 33299 -45517
15394 -45517 -28449 -21197 -154772 -248729 -149232 -104076 -89695 -65174 -93475 -49732 -145336 -50116
15382 -50116 -22399 -80663 60263 -455 -74675 -63184 2040 41921 17190 -96881 -106650
15371 -106650 -26072 -38339 -38199 -19371 -94229 -41762 -8489 37362 21769 -44462 -105404 -130520
15359 -130520 -142383 -157042 -78474 -82081 -62923 -147927 -179058 -153738 -59959 -90608 -87247 -72865
15347 -72865 -123088 -186873 -162442 1264 65342 166932 117409 -35043 -105641 -86370 -136479
15336 -136479 -131260 -103339 -171322 -57517 95910 135248 159525 -57237 -119554 67780 164330
15325 164330 242850 287800 221704 78640 -47259 -88353 -198750 -131134 29823 -26711 -55323
15314 -55323 -68405 -67354 -66251 -59549 38409 56537 -16350 60011 212849 276922 214603 19310
15302 19310 -121744 -99216 -108189 -68044 -46027 -101043 -215478 -209638 -80975 -27028 47417
15291 47417 -20647 -89233 -126693 -119612 21283 -63396 -75328 -8059 123293 195528 183342
15280 183342 109863 19795 8581 -16614 57131 136565 31464 -8024 -18155 42352 45389
15269 45389 96340 186915 16820 -13545 -6433 -99493 -87084 -17520 35216 151567 38077
15258 38077 -49946 -20170 1332 11119 84691 69608 103676 64150 98576 -14062 -165691
15247 -165691 -138840 -67136 42063 56181 39161 -32105 -84725 44613 210555 162229 80849
15236 80849 117729 82219 128846 157379 221060 142673 86100 69891 -29810 34660 52688 71490
15224 71490 70107 -49911 5636 50659 -1261 340 31281 23475 16161 -80084 -79335 -7468 148684
15211 148684 181632 127996 135993 169640 88297 146810 46286 7410 -1402 41510 -19448 -38742
15199 -38742 -32787 -33211 46820 39151 4515 59084 94417 -39351 -104120 -112628 -52265 -38254
15187 -38254 -19564 51240 127383 110776 156977 188298 91481 39040 -11143 39533 14817 -68839
15175 -68839 -32990 -10713 -18891 78832 111078 74108 181495 141835 120906 150628 77764 52700
15163 52700 87039 27629 9876 87705 42889 -64304 -129081 -126383 -147379 -118996 37049
15152 37049 180018 88403 75959 197748 135575 59848 75860 113471 151733 132557 85172
15141 85172 20403 69876 73106 96423 -123091 -276376 -162474 -92144 -78081 -34273 24897
15130 24897 40429 11928 -58477 -136902 -13421 56973 12079 73010 108274 82905 14567
15119 14567 13287 -21457 13566 44721 78408 102613 175972 134171 82619 62673 101542 -21544
15107 -21544 -7439 56189 132009 158355 83803 17157 54455 169368 234931 91008 24537
15096 24537 56786 146109 190293 99018 25132 -48004 -145192 -185448 -28500 69732 28845
15085 28845 18292 191712 250362 149645 124512 78394 61850 4526 -29584 -41735 -55789
15074 -55789 -8552 93147 20951 20316 -31347 -24857 -9557 -64714 -81596 -121759 -103243 -40587
15062 -40587 -9352 21769 65209 171075 282129 222160 144189 75430 134712 113851 -19396
15051 -19396 -74870 45920 93689 -7721 -7716 83078 164911 92387 91575 171541 169241 195926 204204
15038 204204 106814 9721 -51292 -30454 -18017 24252 44132 69637 115706 85029 -26577
15027 -26577 -14097 110836 193018 150238 43170 -31626 -26499 -22540 -46111 -35825 -134058 -172525
15015 -172525 -131614 -53654 72755 50697 55341 53852 84100 131565 181802 126766 118479 134998
15003 134998 201081 125579 32146 -16586 -6258 39987 -48445 -67962 -49275 16504 -4057
14992 -4057 -18735 36884 56501 -3345 -5069 13631 74766 141946 167009 119076 87867 113064
14980 113064 210738 340395 288756 201207 290200 305424 282393 282507 288951 285212 266685 108531
14968 108531 -25177 5943 32249 131965 143299 190549 231210 167788 129317 204896 195061
14957 195061 193581 57197 88547 83369 115580 175553 162838 96365 30306 104959 132602 118982
14945 118982 189424 141032 60485 55532 95081 185683 170803 308395 370469 351162 206748
14934 206748 70201 5212 29708 93485 232915 257577 130500 99573 109020 71611 87904
14923 87904 208428 128957 27158 -26318 110155 262635 116586 86785 64806 10091 -21440
14912 -21440 41505 -18136 -151418 -151154 -129122 -22141 93018 163729 104816 70202 13461
14901 13461 45576 59068 93383 -55454 -109534 -115678 -133066 -77267 -12074 14109 -45099 -14493
14889 -14493 38699 112797 66140 93699 136112 128974 90411 1721 94840 36021 13546 56156
14877 56156 71389 40410 -31912 37783 75443 62341 103520 49052 19929 124453 203149
14866 203149 52967 -34688 55518 40734 -107355 -125066 -2117 198204 147027 105030 145361
14855 145361 108990 30445 49636 92316 -20666 65463 226389 241457 271502 300778 382433
14844 382433 485646 468172 392588 466720 486673 589520 727111 997388 942796 777371
14834 777371 742239 686101 657878 595966 481329 443522 415277 302174 289819 408364 438697
14823 438697 390355 332038 242315 194574 245813 280879 186133 36416 -20822 75397 194977
14812 194977 316837 334900 305751 145499 97964 218608 164040 190139 221651 124307 190249
14801 190249 270692 264896 185204 152949 231794 397138 350448 199706 92971 186234 186526
14790 186526 163634 110742 143458 119849 51891 22222 60546 49655 161919 235549 163009
14779 163009 150560 131347 116248 91369 285739 370828 301962 210535 201750 167253 213239
14768 213239 157699 215465 200740 169948 36711 67180 153231 237517 163461 99896 38327
14757 38327 56547 83291 167239 211155 160813 285414 242549 90712 -86969 -163789 -45573
14746 -45573 38260 155203 176743 89773 -41491 16298 156342 187383 140588 -2165 118270
14735 118270 220070 260084 87910 36475 146193 149173 187234 187188 149922 138996 65570 84678
14723 84678 203304 233084 208900 168892 156318 187328 160765 23729 57875 160040 198565
14712 198565 293402 344751 287247 193864 127300 128335 6640 -94195 -6216 169590 246402
14701 246402 271359 350704 375532 176583 171886 292846 327350 316103 314223 310029 408855 479069
14689 479069 435511 471579 513385 654492 731183 724595 598789 497832 512427 622611 642308
14678 642308 632117 618539 744957 894931 940634 1078310 1182080 1390314 1558354 1556646
14668 1556646 1660160 1732541 1811161 2013172 2130380 2207086 2197087 2330073 2508716 2712982
14658 2712982 2811450 2694075 2659220 2644583 2612516 2550164 2420396 2204067 2041470 1934459
14648 1934459 1829649 1810465 1720174 1572917 1452992 1364789 1223160 1118908 1055659 1030106
14638 1030106 1109320 1195872 1232783 1329143 1235724 1131183 1099692 1134215 1232097 1260779 1218241
14627 1218241 1058293 980847 974386 899922 901794 901616 858241 808513 799607 890486 739546 586180
14615 586180 662831 737069 852439 754166 696911 706024 602743 514063 554821 645987 607323
14604 607323 411770 465272 581232 644477 672323 660834 621529 674599 746904 755262 738939
14593 738939 702500 724749 814940 746901 666170 666053 726611 652589 751690 813890 724797 637113
14581 637113 539389 591424 636264 559749 589367 542585 517857 481228 338528 399467 488805
14570 488805 483174 469612 421100 468319 404355 473605 497262 506786 465309 488808 409443 466044
14558 466044 537566 592313 571086 615889 640088 576084 560796 626840 755617 662679 509011
14547 509011 534361 487933 529139 511206 501976 519907 480443 600630 596382 573500 436911
14536 436911 350825 343478 419887 346091 354776 321669 417773 400627 328490 424038 439664 452491
14524 452491 621236 652744 465354 394884 453884 511785 493452 507480 502112 500807 377373
14513 377373 366389 414584 423038 409117 440219 398025 322045 469943 540095 407060 520628
14502 520628 526373 501970 547964 549472 462850 432393 441310 506143 510424 422740 439957 467765
14490 467765 412113 482467 589746 621070 626059 780623 830149 677361 631719 635944 679859
14479 679859 723651 756520 795521 761055 769022 776886 695748 675606 863316 1059125 991444
14468 991444 906380 938486 973160 1061060 1064496 1100918 1056448 1051413 1097518 1054114 976000 1030897
14456 1030897 1205661 1271232 986777 727576 634418 639367 735023 681001 761605 783138 838922
14445 838922 897892 784891 669121 624570 696349 776402 770237 714306 789555 803254 697781
14434 697781 607882 523438 480875 534486 605216 566061 560173 599216 614718 551184 541620 494107
14422 494107 480675 473199 460030 461571 522393 576560 655171 797619 792609 744113 711356 692814
14410 692814 693590 730755 807055 731345 606276 679804 728238 701999 574669 579641 634462 747403
14398 747403 741142 671998 643390 629144 664935 607861 578720 724201 817074 854501 792228
14387 792228 661113 662566 798944 801978 717295 711328 888925 987786 958238 874909 793731
14376 793731 867561 933224 911083 947408 1081367 1027932 977833 985974 1008789 1006859 1054729 1061026
14364 1061026 1006670 1062050 1183939 1269630 1364598 1450688 1441462 1337915 1458965 1515196 1407030
14353 1407030 1431096 1441532 1295447 1166907 1295251 1338847 1287219 1236222 1270331 1306646 1327972
14342 1327972 1323745 1409405 1506186 1427447 1358438 1313921 1363150 1563494 1642634 1698974 1708379
14331 1708379 1742212 1851556 1894995 1851285 1918528 1948295 1978924 1990621 2027355 2167715 2259438
14320 2259438 2198493 2068101 2137095 2182730 2161417 2156867 2185270 2312182 2441669 2420326 2460469
14309 2460469 2520646 2563789 2775458 2922147 2893567 2827174 2829355 2834044 2933665 3020290 3134965
14298 3134965 3202396 3184966 3302284 3388387 3518484 3758863 3794832 3851537 3900832 4038110
14288 4038110 4146392 4129501 4237836 4311028 4426226 4712403 4922822 5128638 5299879 5459452
14278 5459452 5552964 5591258 5722170 5799266 5919121 6092354 6332910 6633674 6794938 6977261
14268 6977261 7144587 7336805 7575591 7796531 8046890 8337636 8716167 9015251 9339486
14259 9339486 9660576 10073080 10414675 10889594 11370781 11745957 12166804 12756518 13445492
14250 13445492 14052176 14596817 15283059 15995399 16850846 17754415 18502489 19443965 20409711
14241 20409711 21401022 22621107 24193315 25763978 27372293 29061592 30798444 32707803
14233 32707803 34864592 37212851 39841776 42744219 46031391 49648603 53550228 57833138
14225 57833138 62340511 67454580 73216858 79502676 86476862 94325051 103044805 112901312
14217 112901312 123903705 136246609 149951712 165243683 182080270 200699277 221146699
14210 221146699 243341989 267054754 292139891 317948149 343871722 368984656 392197117
14203 392197117 412295252 427998149 438254285 442068592 439338451 430224125 415351668
14196 415351668 396073839 373703047 349469473 324547887 300033882 276654921 255058625
14189 255058625 235192251 217062359 200650052 185979565 172919010 161292048 150828803
14182 150828803 141491472 132983149 125237379 118405425 112149416 106280708 100830131 95870355
14174 95870355 91034925 86468882 82116201 78010779 74065285 70336480 66746007 63336649
14166 63336649 60166821 56990719 54053128 51320052 48567380 46054554 43722193 41448531
14158 41448531 39250848 37123859 35180686 33475189 31705411 30120957 28746305 27472963
14150 27472963 26271996 24931542 23534634 22337993 21223424 20128086 19269429 18315269
14142 18315269 17329133 16533979 15805515 14968362 14173638 13542095 12911842 12286289 11793088
14133 11793088 11266889 10709427 10333131 9891014 9402402 8937452 8546666 8234278 7735917
14124 7735917 7265213 6868882 6643501 6380568 6102992 5893299 5620601 5365075 5054108
14115 5054108 4836234 4657102 4363559 4099870 3855713 3647864 3489924 3356955 3256738
14106 3256738 3102972 2875358 2719592 2637545 2584279 2498721 2451844 2333398 2191754 2097998
14096 2097998 1996868 1981499 1955942 1845271 1829034 1859305 1751437 1655760 1665055 1580181 1531737
14085 1531737 1507489 1504354 1677451 1644247 1397567 1328165 1449893 1524409 1501191 1528098 1590011
14074 1590011 1612952 1552685 1527731 1517851 1481480 1407040 1350208 1329374 1316631 1195593 981911
14063 981911 922519 898461 972619 1077272 990496 866143 811750 710943 671351 709558 604898
14052 604898 525669 555895 687690 780453 759667 683334 525225 370902 407210 422379 371131
14041 371131 360417 467170 466397 446126 493070 508688 633700 599327 675750 704537 765815
14030 765815 659951 547298 605264 741440 801811 888336 781934 687801 667344 694517 808351
14019 808351 774915 749755 843769 806626 735842 707979 703114 713019 770543 765527 679285 618165
14007 618165 667043 708051 615642 724264 774221 683578 730676 715549 639809 592314 558429
13996 558429 467026 515340 402903 390043 357767 284285 258729 266937 264028 319335 253738 130313
13984 130313 125309 86600 53115 79315 88349 -8125 -58958 10252 11437 101097 271226 236450
13972 236450 117533 112268 80130 25319 -36252 -68083 -49149 -44444 -84370 -11269 17129 179835
13960 179835 315612 219195 147782 103130 151661 212834 236469 249838 192402 64481 149671
13949 149671 244301 61083 -76702 -39806 -64632 -225161 -209931 -163061 -102582 -59000 -163273
13938 -163273 -317390 -511011 -460575 -416842 -373010 -488463 -618478 -569018 -388449 -397088 -321273
13927 -321273 -257009 -236021 -296167 -337022 -288702 -257914 -290675 -229238 -262030 -261050 -149001 -58743
13915 -58743 -35920 -98445 -188166 -281190 -441977 -443244 -321101 -248486 -189841 -23843 -51515
13904 -51515 -110306 -115318 -62631 15227 7068 -173247 -254227 -301712 -333273 -267303 -175472 -59421
13892 -59421 -19226 -38554 -112098 -88872 -39487 -8167 19136 78574 -39017 -96333 -13914
13881 -13914 -2777 -14993 51018 73774 99561 64413 -86559 -56586 -80150 -106625 -169219
13870 -169219 -102434 -117527 -123745 -82501 -114057 -194545 -116461 3024 3743 -48457 -198919 -188479
13858 -188479 -160203 -142096 -288280 -229092 -212775 -110821 -92445 -175866 -75589 112198 131121
13847 131121 34560 -103911 -238334 -452964 -395788 -200707 -86242 -143299 -211860 -254699
13837 -254699 -336321 -355051 -167300 -122129 -166899 -109380 -181063 -275907 -255565 -265187 -318490
13826 -318490 -304053 -166212 -131536 -169555 -254937 -273132 -211456 -223436 -255914 -366592 -317849
13815 -317849 -115913 -103431 -139627 -178810 -105161 -113610 -166929 -90271 -22523 -90971 -225283
13804 -225283 -245879 -180540 -207886 -197930 -151188 -156990 -124396 -47600 -141760 -203134 -200116 -151582
13792 -151582 -182212 -175293 -139781 8605 67032 -71990 -187444 -92968 -72390 -216485 -256118
13781 -256118 -209566 -181420 -246265 -257809 -193041 -158921 -144089 -77603 -47678 -79802 -136176
13770 -136176 -62118 64768 110338 27641 -19905 55046 66719 196866 265789 287393 359484
13759 359484 402295 416508 376302 445287 423270 325040 332513 466319 685061 760508 837383
13748 837383 1041853 1248018 1357065 1388501 1416124 1631795 1859883 1879114 1868741 1875273 1920092
13737 1920092 2068214 2259214 2227639 2162915 2013114 1964171 1947736 1781575 1631411 1535275
13727 1535275 1396783 1215561 1211042 1179157 1216399 1009172 835126 732524 619240 581137
13717 581137 584115 568877 497795 382581 318273 399019 549531 666535 494770 402026 256401
13706 256401 149623 88476 70577 73339 101397 89530 32192 -52161 -109822 -181543 -184096 -214474
13694 -214474 -255139 -206603 -123397 -58695 -65307 -22907 -130930 -120506 -33631 -18551 38185
13683 38185 59091 -16309 -108647 -100002 61338 -1254 -115373 -117390 -82420 -73118 -37620 -20273
13671 -20273 75735 78721 5341 24922 51591 71742 13282 -11919 33530 64872 89896 103771
13659 103771 16430 -113148 -51524 -59533 -81772 -92021 -132582 -137692 5754 47147 86071
13648 86071 8973 -137383 -217363 -151396 -141412 -137746 -166868 -87230 -45333 -74312 -277498 -335640
13636 -335640 -284194 -121082 -169539 -208915 -224621 -186080 -252031 -242907 -197582 -171887 -134498
13625 -134498 -138937 -183054 -162364 -123975 -107406 -116796 -154192 -153097 -55992 -103480 -156295 -217769
13613 -217769 -182859 -10291 -48782 -122308 -124856 -105463 -5342 14637 60281 -41476 -77066
13602 -77066 -87671 -108857 -59052 -49614 -123783 -232038 -241054 -212635 -248249 -224158 -109150 -56511
13590 -56511 44633 -69292 -136206 -71835 -8083 -76972 -165082 -127073 -182225 -217583 -146558
13579 -146558 -102903 -106662 -58722 89249 -45217 -109796 -91900 -42340 -7168 -41542 -1190
13568 -1190 32931 77064 93972 154187 136029 -38494 -183217 -78019 101704 130735 113984
13557 113984 -28814 -171241 -237499 -202218 -42116 4018 77041 156773 225952 240021 192274
13546 192274 199392 173205 97852 45227 123097 217717 214228 200123 120199 163965 218017 172908
13534 172908 119539 130482 63604 10335 36695 57808 71055 -6280 -41837 -144603 -151795
13523 -151795 -81422 -8363 -6572 24871 -81722 -151133 -125772 -115845 -220098 -339926 -296771
13512 -296771 -202248 -140138 -87477 -47806 -165126 -235740 -261282 -209026 -114118 -35323 -57926
13501 -57926 -77686 -196574 -201601 -46260 -32439 -95193 -191440 -85820 117916 124398 -56054
13490 -56054 -117566 -28307 -146469 -212411 -132452 -137402 -195847 -201177 -222251 -241205 -289889 -239997
13478 -239997 -100924 -2715 -107752 -162688 -175525 -209608 -54516 80741 -5024 -77362 -287356
13467 -287356 -349765 -277089 -164037 -201199 -88392 -31203 -61355 51766 49831 -20445 -157418
13456 -157418 -158437 -36688 7010 -17548 -169590 -198176 -95642 33993 -16150 -101186 -13481
13445 -13481 37394 74810 74384 129660 119763 117498 37645 -34858 -60846 -95541 -57987 56887
13433 56887 10385 -154856 -248795 -237462 -148136 -71737 -128155 -175389 -132829 2903 -163923
13422 -163923 -262296 -270127 -101074 -123885 -229044 -235616 -178155 -92261 12129 -50086 -120183
13411 -120183 -86234 -114549 -120729 -146273 -107432 -128790 -209580 -209018 -163879 -50201 -85723 -169836
13399 -169836 -111688 6775 2223 95224 29639 76658 46326 -59321 -173616 -106816 -110162
13388 -110162 -148017 -284893 -227588 -81862 41058 -21341 -116870 -180160 -183047 -194634 -96732
13377 -96732 9410 32472 14967 45969 68730 61914 -5620 -83944 -78702 -108160 -185733 -194254
13365 -194254 -118524 -195359 -273757 -123000 28904 -70610 -137719 -144623 -209983 -282330 -122912
13354 -122912 -103396 -144561 -211825 -176535 -82557 -138895 -187502 -171530 -258733 -204016 -170862
13343 -170862 -192417 -226171 -143943 -52144 28865 14719 -87555 -77522 -11232 9587 -54595
13332 -54595 -151059 -152938 -86481 -62235 -44218 -27128 -159099 -190498 -246355 -206455 -221247 -295852
13320 -295852 -154132 -105710 -20752 -53811 -24106 -17493 -100532 -220953 -220782 -156949 -247389 -185848
13308 -185848 -206708 -175978 -72050 -127667 -193968 -235851 -229098 -140683 -171363 -257075 -278977
13297 -278977 -180541 -176924 -289509 -359576 -295155 -205251 -219059 -116149 -95122 -117173 -56265
13286 -56265 50936 66783 -135659 -136997 -104882 -83826 -66920 -97134 -165862 -128519 -113750
13275 -113750 -86984 -25090 -121443 -126149 -120988 -206014 -269471 -119497 -53279 -47503 -145171 -139358
13263 -139358 -55476 -125730 -53231 69590 19645 27717 8388 -155872 -190913 -101917 -92373
13252 -92373 -45091 6719 47499 -120484 -223797 -218264 -286615 -235293 -123964 -69203 11182
13241 11182 73159 790 -75848 -33670 -7433 83232 63374 -116738 -216016 -271807 -349790
13230 -349790 -215216 -106258 -158278 -201055 -203569 -224360 -112412 -87232 -84021 -79837 -71397 -68735
13218 -68735 -20044 59820 111586 77237 -28370 -95469 -114528 -88519 -92653 -149577 -79835 -83603
13206 -83603 -166076 -140396 -69217 55969 95961 -28726 -134970 -17071 163516 146460 98328
13195 98328 106965 140803 165774 228254 362414 439229 306069 177758 170334 191163 -3049
13184 -3049 -44631 -29561 -37070 6091 113246 43634 -55325 118200 -1299 -206955 -103964
13173 -103964 -58868 -66858 -39843 -37631 38210 8950 29064 91026 96353 -2695 -51870 -94609
13161 -94609 -55518 -36573 -48216 -81366 -199215 -226435 73671 212916 212686 254903 382465
13150 382465 465553 408337 539295 710479 841257 857503 739540 536645 326980 261004
13140 261004 157787 -148200 -271250 -175805 7940 106681 125578 116804 61348 49391 97854
13129 97854 61220 -21280 68314 41798 74749 76776 48651 9248 8838 7843 -32490 -32904 -11904
13116 -11904 -11314 72817 27729 -68783 -38452 81727 163410 102492 213316 349608 359577 323146
13104 323146 328529 508342 580107 712002 844076 910523 708576 496625 485129 336109
13094 336109 250003 210510 116030 5199 66761 49547 -41451 -111384 -98389 16585 -25044
13083 -25044 -38138 -34501 -121737 -127895 -103718 -74006 -130202 -157359 -85701 29548 66455 142152
13071 142152 127751 89333 31440 36468 -30832 4935 69028 48845 -44001 -15982 76274 125524
13059 125524 63945 109570 213898 240736 234843 214101 211320 210578 208343 210084 102442 8304
13047 8304 -66624 -109888 -162513 -76388 -111508 -180486 -185096 -189081 -179133 -220431 -331328 -331708 -203835
13034 -203835 -120544 -54260 -107063 -93245 -53908 -141024 -102045 30200 -46252 -162413 -165951
13023 -165951 -73557 -90526 -94668 -26163 11226 60459 145555 121772 101224 41193 -28622 -135206
13011 -135206 -117441 -13297 35798 15954 49343 104456 66577 12268 -47524 12623 21991
13000 21991 -84443 -122564 -122226 -116334 -243120 -218511 37312 138221 101674 76737 206877
12989 206877 143824 78768 -60008 -113045 -38401 35776 36767 -13635 35836 -35775 -33550 59035
12977 59035 182144 134668 -20882 -87853 -35074 6901 23716 33361 93224 86972 -66254
12966 -66254 -102381 -68600 -39178 -47758 -80234 -82814 -94834 -143686 -205259 -175660 -220686 -209023
12954 -209023 -213259 -176089 -161661 -98414 -54067 -89966 -106373 -150081 -70286 -5330 94339 23302
12942 23302 -25040 41960 102119 71734 20276 36210 55597 -15811 -28285 -62457 -30861 14982
12930 14982 63005 25601 -124542 -141603 -155679 -163338 -189576 -206337 -108856 -37806 58036 12803
12918 12803 -70722 -270964 -299182 -303194 -183054 -140413 -52644 -13907 -48296 13708 -69958
12907 -69958 -194982 -226151 -117878 -111583 13457 -70993 -34869 -48179 25449 75732 20986
12896 20986 20806 9591 -21553 -43121 -161157 -256916 -221333 -159110 -46934 -20028 -30329 -72656
12884 -72656 -75186 -43208 -38452 -43618 -62620 -32789 -64157 -54842 -70068 -142559 -88536 -34168
12872 -34168 -43014 8183 6796 -116965 -149136 -40996 94079 50391 -8307 32097 42484
12861 42484 40028 76030 23607 17353 13373 -78448 -44723 -22290 -47235 -71279 -98107 -61886
12849 -61886 -113216 -6104 50828 7911 -83359 -148674 -176019 -87764 -8929 -51984 -36071
12838 -36071 59517 162504 71200 30724 -65912 -121621 -62120 -56613 -135374 -107896 18945
12827 18945 5257 44680 21930 -132768 -165645 -98115 -85651 -3029 81258 -24592 -125843
12816 -125843 -129810 -134900 -136948 -176543 -125671 -41887 -22583 -120656 -142692 -20245 -44705 -117253
12804 -117253 -128571 -130455 -132746 -81118 -194284 -227406 -110892 -45104 49607 -56518 -120053
12793 -120053 -259198 -172456 -22173 -26299 -12949 -90894 -76517 -158215 -163791 -107030 -84733
12782 -84733 -44736 32784 103401 142333 64579 -19853 -37687 -117913 -35906 -29080 -83781 -120525
12770 -120525 -149865 -145365 -69158 -98038 -173149 -115765 -154867 -159941 -94088 118781 101418 -24075
12758 -24075 41043 17589 -103172 -87761 -29496 -130188 -266805 -266349 -149297 -24904 -44108
12747 -44108 -212252 -262117 -122362 -37684 -42832 -80949 -89071 -34374 -15965 50450 53076 27634
12735 27634 -580 -8216 -81394 -103288 -141288 10717 25099 -76153 -91743 -46460 -41073 -128198
12723 -128198 -129584 -142182 -126983 -51661 77194 48395 -29401 -78498 -169675 -251230 -248207 -213614
12711 -213614 -146053 -41388 -15985 -84375 -90078 -158713 -200842 -135770 -106964 -125521 -177117
12700 -177117 -149721 -45060 -62918 -108139 -106938 -135873 -111560 -103913 -11233 -153217 -251347
12689 -251347 -234346 -253593 -159402 -155582 -58352 -60826 -51535 -74272 6186 -90137 -161701 -93335
12677 -93335 -14141 -20887 37983 -13442 -34147 -29256 -65001 -61717 -154448 -119857 64477 39769
12665 39769 -94236 -138875 -119200 -95198 48562 113004 149374 16820 -84418 18247 103352
12654 103352 80760 -33454 -120882 -96638 -176226 -123591 -100707 -148378 -95167 -18733 16701
12643 16701 46510 -35217 -182433 -118420 -34922 -163563 -310884 -217144 -169978 -120744 -166270
12632 -166270 -201154 -222704 -85351 114082 205912 35038 -82148 -141826 -95398 -50174 -96578
12621 -96578 -49870 71217 90894 22648 47074 64715 118798 113685 76523 -29013 -76853
12610 -76853 -18225 -60269 -13182 36847 83747 -1132 -81705 47666 104377 147323 65554
12599 65554 72024 7798 39948 93818 68700 82305 95161 65848 4860 -2441 25926 136135
12587 136135 154204 118025 137381 49348 38296 93711 42911 -94365 -104151 -88680 -206683
12576 -206683 -206246 -104626 12489 19830 76930 142557 241774 239900 321235 243254 124099 40477
12564 40477 8867 85004 162556 175290 185654 68628 5905 50073 27013 -18075 -23862 -2772
12552 -2772 64111 45815 -51704 -71549 -108915 -187740 -57462 15621 -16891 89143 135912
12541 135912 87127 167685 60159 -123646 -199220 -104349 2283 39522 135363 141336 129715
12530 129715 80229 18416 180383 130025 -50784 -165815 -233746 -163415 -118985 -10601 -67278
12519 -67278 -75296 -83127 -322 101034 2545 -65857 -116173 -126210 -174662 -209328 -182095 2663
12507 2663 135005 23572 -64955 -132289 -143055 -101571 -93614 -80630 -102831 -60465 39916
12496 39916 111320 104115 -44522 -185429 -171451 -53404 148238 98326 79222 116277 115073
12485 115073 57233 62598 12257 16667 -5759 98061 111929 -3405 -106885 -85681 -40425
12474 -40425 3969 -112828 8700 107951 111055 81770 19305 -39329 -135406 -165377 -95158
12463 -95158 -169427 -185609 -59840 45504 31170 3996 2561 33451 -64168 -132127 -185021
12452 -185021 -180494 -98832 -185363 -243750 -259380 -79631 15768 25876 30126 -24390 54700 -22893
12440 -22893 -161579 -150864 3973 141613 191841 -7733 -23618 62724 6255 -48034 -92231
12429 -92231 -78299 -36583 98241 118089 162808 130136 24550 -64933 -84001 -60717 -9003
12418 -9003 -49012 8659 75576 127838 88055 117008 32335 -56500 -16577 -90792 -24670 -92117
12406 -92117 -106270 -55187 -13654 41881 99933 170051 234620 162472 160999 117636 177665 199669
12394 199669 72349 36880 76894 147244 119986 6276 5172 -6449 -58121 -41282 71582
12383 71582 188252 169424 123219 94590 7795 -14744 -9739 -56424 -45912 -60194 -30634 41807
12371 41807 43070 83335 72297 90182 94664 84452 211871 290490 238684 109636 63232 54547
12359 54547 71889 59151 60122 -17257 36960 -8163 -62114 -15368 34963 163999 155836 70600
12347 70600 -5040 -82103 -80647 -91708 -67022 -73445 -106152 -150825 -89684 -41328 -12153 32944
12335 32944 31437 -23583 -74932 -19931 -7952 -17695 -24268 -117123 -111617 -25754 -102743 -91761
12323 -91761 -91701 -111695 -78539 -68499 10110 64375 103662 2854 -26635 -1326 37577 -70287
12311 -70287 -208497 -337439 -304091 -112622 -44717 -47616 -132188 -91846 17713 32322 -32461
12300 -32461 -32759 20766 -18205 -50738 -72652 -139013 -88903 -71251 -79125 -85997 -133942 -63840
12288 -63840 -29904 -37395 -19028 -91537 -116285 -93025 -136649 -79422 41702 75642 20668 -14515
12276 -14515 -80428 -60931 6506 -112793 -181565 -70372 -68333 -70057 -66746 -87852 -216526 -190537
12264 -190537 -137873 -118147 -115125 -179930 -155263 -92456 -129673 -146454 -31043 22607 30217 1234
12252 1234 90350 158138 10604 -41233 -8886 35478 154714 104025 -40373 -134623 -188784
12241 -188784 -178831 -36565 -60319 -87369 -108058 -70537 -78376 -171414 -235686 -191295 -74094
12230 -74094 -75670 -94694 20293 -23957 -122611 -180621 -205365 -230051 -121473 -33283 -15174
12219 -15174 17934 -13993 -91662 10885 125991 145825 10669 55468 32574 45037 -14595
12208 -14595 -66022 -78405 -42551 140080 231563 223840 255907 245578 162785 109292 142391 26932
12196 26932 -26772 -68271 -83783 -49983 -54672 -112246 135800 184451 135744 182444 103033 -89187
12184 -89187 -13716 16287 29487 35176 77629 47353 30094 -17279 -32633 1775 18170 89720
12172 89720 79405 120633 56170 -92650 -52007 -43438 32894 92371 161870 181285 169931 216899
12160 216899 244679 197977 125472 87744 106498 41775 85672 174555 189882 163297 128741
12149 128741 114274 108517 63185 23057 30218 22997 -26906 -50037 -13166 94880 59043 93497
12137 93497 187134 108783 36380 -54625 -175973 -114686 -79277 -107156 -13702 81346 -9245
12126 -9245 -107906 -172528 -134554 -141163 -166242 -23656 91615 142256 60183 -25890 -155124
12115 -155124 -138806 19198 34656 53961 6683 34109 14463 -16154 -51860 -99805 74022
12104 74022 158251 33014 -78993 -78130 -99344 -84363 -131071 -127181 -81250 -57378 -117339 -21876
12092 -21876 76781 28214 -67866 -50625 -27331 84828 149036 42625 -47006 -50265 19817
12081 19817 -33760 -91421 -119842 -9806 -17325 -61259 -100974 -189457 -78821 -35459 -101907
12070 -101907 -191113 -140894 -185919 -40982 59615 43166 32246 28505 10646 73416 120680
12059 120680 115775 -15676 -198430 -173077 -155659 -86943 -40503 -110946 -151750 -147442 -69534
12048 -69534 -20606 43784 15652 59101 -2504 67995 -47617 -68253 -65810 -10661 16 13784
12036 13784 63305 17767 -25671 74609 121993 130663 118841 79208 160758 180288 233818 262311
12024 262311 137310 -835 54171 136598 49899 87660 182606 130321 103269 -10348 -71604
12013 -71604 -81672 -135069 -186961 -62006 -29572 -49497 -35131 -1363 77333 4197 -25346
12002 -25346 -11741 -30156 -43449 -83457 -122510 -56746 17434 -18671 -57181 109669 117415 43110
11990 43110 -12215 82406 59315 23024 112684 80468 24564 60023 49347 97234 75180 -81327
11978 -81327 -47548 -25199 11801 -66320 -16816 -52818 -31070 -40667 35227 30774 -21900 -86524
11966 -86524 -126969 -119066 -113717 -23956 10752 22317 51501 105266 176164 105458 6471 7081
11954 7081 19144 -61911 -65376 10432 75591 88442 142749 117281 90924 159357 157826 41108
11942 41108 42821 73186 46360 22273 70114 223572 340334 264224 61268 15785 -3480
11931 -3480 -33073 8150 -37225 -20256 34277 28141 -21247 76196 196071 279529 301360 187341
11919 187341 66880 -69598 -37624 -30039 -117262 -206621 -264391 -140426 -58254 -144672 -169238
11908 -169238 -161580 -164528 -206448 -166343 -145800 -45769 -2313 138092 256344 114571 66568
11897 66568 95355 98492 131608 160281 107703 77353 19940 -89402 -110146 5549 25586
11886 25586 16656 157218 246308 133528 60335 80369 179859 179754 34286 15609 -12996 -44844
11874 -44844 -123685 -12924 45714 183967 112056 31635 -123608 -92604 -73400 -32544 51720
11863 51720 31889 18885 41519 -11333 -61238 -68493 28164 63643 26502 30434 -80028 -31713
11851 -31713 71178 46617 48656 116794 188885 169832 108169 55861 15120 126919 114220
11840 114220 25859 27668 -27558 -17350 -34916 34173 96165 81619 44204 36881 6721 35863
11828 35863 135971 102399 152981 231795 271182 221296 222278 211675 172024 126978 -15874 -10579
11816 -10579 -33263 -109314 -139304 -65635 21102 -2275 -118634 -72273 -7573 23452 67970
11805 67970 86996 -70630 -74425 -92206 14044 183826 143869 -50360 -127939 -226374 -218586
11794 -218586 -44630 94101 11920 -92956 -50163 23324 91675 45082 -30378 -43081 66906
11783 66906 6802 -98073 -49623 -54818 -13570 88061 70013 77061 16833 25130 69528 107588
11771 107588 38526 120360 17478 -38965 57249 71065 79232 -27648 -52293 -148657 -123609
11760 -123609 -40975 39509 105076 177023 138162 6510 -161754 -180186 -118843 -63324 -13876
11749 -13876 52975 10757 105617 231253 178854 96715 58915 32860 84085 55438 -13027
11738 -13027 -64697 -13119 35815 24781 -2736 22751 94929 62041 2085 10294 -50307 -31955
11726 -31955 43434 85137 27128 -21627 37532 174585 83417 13162 91659 189224 237319
11715 237319 122796 73050 80256 127867 -12831 -8182 134539 136930 122087 68315 61042 37510
11703 37510 -5817 -18463 -117396 -175108 -123606 13218 215580 139577 -35677 -120543 -214051
11692 -214051 -271944 -288848 -148577 106997 135731 218775 80806 42880 73374 16913 95841
11681 95841 45542 -4011 51336 132772 160531 94105 73080 56294 149752 173932 59114
11670 59114 75325 216589 154569 31334 32161 12202 14463 96594 -13173 -21249 57202 -93144
11658 -93144 -199217 -196490 -45250 -45699 -72558 -61864 -149762 -246997 -150707 -73179 -49471 -78622
11646 -78622 -130757 -196095 -266326 -188831 -101947 -120748 -13383 10134 50584 143206 170805
11635 170805 46653 -12428 -70336 -55930 152565 211972 197496 246457 37779 -43582 -86382
11624 -86382 -96207 -119414 -101222 -67888 -39999 -136587 -203826 -173964 -108459 -117639 -42474 -110562
11612 -110562 -87263 86720 135975 88002 -38046 -125587 -24909 149775 207121 235485 212481
11601 212481 161491 1998 20631 31494 49676 51061 26939 -41253 16377 -9845 57879
11590 57879 86458 180090 91842 -2460 -32454 35742 -12186 18889 11833 2891 29012 93535
11578 93535 136367 189673 123708 11956 77564 130851 137984 87989 46366 123464 159573 38506
11566 38506 35657 112541 47931 -14392 -53443 -113867 35808 74108 93047 69982 72805 146326
11554 146326 120933 11425 34002 -38544 52796 181088 163726 10300 -88611 -29550 -52276
11543 -52276 -61621 -130208 -162347 -93800 -144999 -121667 41248 157109 136469 95876 82503
11532 82503 126622 -11146 -61582 -25453 -64208 -98007 -29029 -64201 -134729 -89694 -46091
11521 -46091 5138 -7360 59762 -8962 -54558 577 -29103 -59223 58607 136579 174148
11510 174148 163382 50779 20680 15767 88450 142159 200288 175396 265031 148154 118439
11499 118439 54854 3369 76426 111371 135242 117476 64940 40277 28938 179237 261441
11488 261441 236491 303149 267466 115456 107768 189391 191593 216862 96200 25159 82770
11477 82770 202577 242069 199320 136102 80924 27369 5087 165859 183889 143862 87698
11466 87698 134177 73149 83094 190124 142891 68107 13925 27367 117379 95440 130635 196770
11454 196770 149108 44407 576 -22414 -68225 -132259 -42141 -102498 -106488 -67065 27782
11443 27782 204657 199937 19553 -109605 -107073 -26225 -35700 -7796 -20039 -80755 -90233 -59154
11431 -59154 -53833 -105074 -49883 -108970 -100924 -88534 -28958 55221 100450 109036 112257 110319 118108
11418 118108 222480 169617 96058 -13163 -120668 -103738 -108483 -42165 -59669 -112378 62229
11407 62229 131657 168601 133059 18622 -51576 -32572 31004 21127 -15500 75681 131039 64596
11395 64596 61468 106145 84495 139544 36996 -78947 15808 145809 136990 46753 128733
11384 128733 254700 204712 128141 21700 -11250 -46782 56761 31614 -32563 -15113 63060
11373 63060 269254 370736 311561 159314 69422 40627 54660 85085 105083 85169 175324
11362 175324 178393 146608 211871 193291 245261 135667 96336 195294 221791 131834 120714
11351 120714 147138 178724 98928 -47863 -111953 -21072 412 70086 30551 27034 29708 -9456
11339 -9456 50157 138083 125932 130701 208152 146893 142223 308502 198493 92476 90994 70955
11327 70955 64485 26790 -37416 -81254 -109537 -66190 -65349 -34132 86376 73897 186566 265521
11315 265521 207656 118255 104284 92654 71015 24699 -92100 -137188 -108145 -115310 -95459
11304 -95459 -24775 62293 113638 122558 86087 95379 157607 106778 -7297 19735 12116 -38150
11292 -38150 -26776 -7638 961 -19682 104899 105101 43089 85264 117753 136984 119375 59405
11280 59405 18671 160009 264781 212549 150653 195634 212281 109774 105666 46461 -14803
11269 -14803 72092 33141 57061 224760 146023 43228 103712 270456 312972 217730 182027
11258 182027 207955 256240 424203 500876 420553 403868 465345 580893 711137 937410 1157449
11247 1157449 1236872 1273734 1276749 1206057 914952 689125 482397 277377 155217 93756
11237 93756 67166 87255 219174 239803 254062 298934 256507 285900 296002 197638 163608
11226 163608 210261 154589 95587 66037 140375 240475 301328 272043 230834 236416 166202
11215 166202 300683 436728 528374 596277 721714 845358 1028563 1131936 1248995 1282068
11205 1282068 1082097 834067 590022 550371 667333 637918 491512 294221 96713 -44669
11195 -44669 37688 93897 144874 190624 196175 197851 152333 62813 -50394 -18671 124214 205362
11183 205362 227991 138243 242110 243529 202511 191474 192540 100736 -6837 46999 73153
11172 73153 12402 79384 84106 84608 102656 199367 139573 -6756 -11010 31691 52076 156622
11160 156622 236611 154169 86037 -4827 -47763 1444 -29201 26291 105899 99662 159092 178258
11148 178258 104977 204831 282852 265764 187744 81223 64104 166622 214226 170001 214104
11137 214104 107163 54034 14152 -13515 -86802 -45945 114364 183041 279041 280181 171133
11126 171133 114282 90054 150710 25527 22392 223674 253095 138502 46097 8108 -8222
11115 -8222 -40979 -69994 50471 211620 192052 104488 121760 335192 355561 175140 153548
11104 153548 96525 64212 92542 96237 21314 -59415 -18581 86693 134816 82910 73585 -7535
11092 -7535 5835 58322 111384 245361 195950 121881 121514 105927 72409 149716 174831 350973
11080 350973 402223 342760 294588 182867 260929 272243 126906 110628 184311 222948 298150
11069 298150 311278 301221 230793 284243 347198 200317 36044 52104 88506 90407 149145
11058 149145 66460 63322 122949 153348 98943 51403 114140 201135 346385 370366 249188
11047 249188 120235 238639 236977 100571 91957 210119 265775 125308 131103 125232 8703
11036 8703 -46683 -72311 42078 99888 179221 300856 241808 98980 97794 89090 103178 15781
11024 15781 -106801 -79871 -14336 36436 74864 5103 -8593 8490 -2923 -4522 116776
11013 116776 162253 134802 -52673 -9018 -11070 -43323 106794 43148 64239 108022 77636
11002 77636 91581 141381 199379 225337 251938 221740 109364 180829 248784 212471 194596
10991 194596 246121 111862 24805 -31176 -71609 -41374 23634 13946 80089 38262 113527
10980 113527 182639 190545 137113 130221 141109 103079 167852 189657 191308 172390 223149 230146
10968 230146 217695 173809 244788 171279 157007 206041 121648 96557 154787 189064 194327 194033
10956 194033 168922 183031 205520 196736 165555 177959 302559 408151 357097 196176 99236
10945 99236 42025 39950 48126 153440 269286 256377 106316 -48524 -57371 70938 131636
10934 131636 143058 240466 198908 66045 85583 215614 232140 279296 355704 305769 208498
10923 208498 290111 216768 177553 214217 176505 175370 236114 168870 161991 194357 195633 224067
10911 224067 291963 258532 187695 101453 153625 187877 202819 286346 279077 243134 317870 373794
10899 373794 438856 571795 529834 502657 426172 340462 193726 170359 186226 234641 317280
10888 317280 418202 500883 531064 449750 425474 323341 319259 176256 201529 212028 225745
10877 225745 243021 232321 227471 283735 413272 431947 271362 225342 239453 142487 65829
10866 65829 111596 136851 279661 241150 209101 239425 329457 276993 246383 361756 401261
10855 401261 320108 283006 343059 281979 215034 215035 283050 409390 470196 486524 392767 283214
10843 283214 302013 213333 173236 145172 172425 227562 218360 355438 457081 455083 347162
10832 347162 370406 343786 245097 194966 241886 375443 273486 207274 271554 334513 293821
10821 293821 266119 311500 369152 442434 456888 415257 496603 513180 467643 445823 347377
10810 347377 320220 338521 393006 473249 507453 502552 416111 411649 420103 316013 277922 486408
10798 486408 659321 722149 766078 729752 689573 600314 478256 482384 499974 511595 480453
10787 480453 482184 521240 589992 710195 750734 697674 594483 493299 415085 343709 283877
10776 283877 305545 410123 459952 468276 476988 536390 470096 440376 556291 619649 738291
10765 738291 763178 727404 667779 626724 620698 717896 708018 628193 606601 563919 546556 577538
10753 577538 633479 696908 748098 757857 899773 909522 812108 714884 691459 707315 705493 711082
10741 711082 833899 820915 848545 884953 860484 876963 843350 878013 792024 785525 897463
10730 897463 907964 989956 1103647 1033552 965465 915982 944500 994055 951905 889121 899765
10719 899765 899241 903038 869970 822605 713417 750400 831488 887216 913802 892500 755709 672890
10707 672890 757209 873477 914110 881901 827265 841166 875152 936646 942187 873740 850475
10696 850475 827728 805142 797542 829592 862891 938207 946312 957356 988391 948573 1059026 1123301
10684 1123301 1172539 1148968 1113810 1126319 1080599 978995 841438 926219 1039863 1068217 1048362
10673 1048362 1019661 1055076 1058972 1038390 1075712 1212081 1327251 1329805 1225990 1147769 1147472
10662 1147472 1267335 1284959 1296850 1230066 1203577 1235076 1338984 1338775 1242085 1180679 1231189
10651 1231189 1234851 1193358 1225445 1350092 1414483 1514520 1466056 1479985 1536402 1574510 1701734
10640 1701734 1820524 1885136 1886257 1784949 1755887 1808306 1801713 1741694 1770603 1895137 1938509
10629 1938509 1952974 2019768 2029223 1913643 1996105 2101398 2170007 2184086 2109356 2161780 2237801
10618 2237801 2267400 2270549 2246564 2301221 2406859 2362551 2447667 2441291 2446251 2482916 2578818 2538862
10606 2538862 2645786 2797911 2930412 3032026 2986220 2918278 2995605 3205796 3308473 3279791
10596 3279791 3371002 3339048 3434211 3622656 3743909 3834579 3790438 3810530 3884431 3860996 3884236
10585 3884236 3937031 4102368 4258618 4345919 4470509 4552830 4670045 4760802 4982922 5108488
10575 5108488 5179732 5298658 5350040 5436489 5635948 5898942 6010873 5981224 5989806 6215445
10565 6215445 6422157 6663563 6870628 7047894 7199059 7365895 7664728 8001541 8185708
10556 8185708 8444668 8603078 8649571 8799825 9145681 9513288 9931549 10370812 10671076 10866213
10546 10866213 11237329 11582336 11929373 12450122 12768937 13275790 13801759 14296557 14803802
10537 14803802 15363523 15949317 16473993 16893284 17528865 18287310 18927618 19620248 20445750
10528 20445750 21283656 22034855 22914062 23887168 24811283 25755469 26809097 27872281 29032744
10519 29032744 30197953 31445740 32752358 34091506 35458077 36946161 38611554 40173093
10511 40173093 41904853 43652217 45503575 47455165 49509027 51513628 53619772 55816220
10503 55816220 58088037 60489237 62913778 65252754 67615887 70185873 72664743 75222729
10495 75222729 77714654 80295036 82714811 84970962 87259141 89505456 91605609 93432882
10487 93432882 95060413 96611227 97928519 98744881 99408140 99849042 99954419 99722740 99339748
10478 99339748 98768685 97847861 96781484 95565228 94138845 92419058 90621557 88750465
10470 88750465 86843814 84750093 82565778 80325170 78078019 75833876 73586692 71424272
10462 71424272 69216235 67071279 64962854 62873222 60698557 58751649 56852806 55025853
10454 55025853 53277514 51516744 49779890 48029278 46324556 44798494 43285486 41827999
10446 41827999 40473814 39039188 37673956 36437457 35248064 34008435 32847118 31728408
10438 31728408 30637053 29544395 28535892 27520266 26312778 25294890 24425000 23521092
10430 23521092 22641241 22022560 21337253 20530561 19759718 19180752 18599416 18032218 17416232
10421 17416232 16811947 16283145 15744074 15201649 14740529 14295806 13816394 13401759 12933924
10412 12933924 12444383 11973556 11483837 11091040 10725981 10498602 10185827 9801293 9380328
10403 9380328 9125926 8813499 8545513 8245762 7936358 7639301 7439183 7232089 7069149
10394 7069149 6865220 6590907 6342152 6185182 5993033 5878945 5852695 5657119 5465699 5142675
10384 5142675 5016144 4997197 4781166 4586997 4462481 4376100 4259490 4226852 4167304 4065699
10374 4065699 3926721 3792724 3650299 3703059 3679672 3539718 3349473 3210790 3212436 3137535
10364 3137535 3110568 3119973 3076773 3013754 2966093 2936828 2776804 2704010 2657613 2527666 2480042
10353 2480042 2473907 2345390 2439573 2511313 2383966 2240802 2162375 2113756 2025244 1968181 1980211
10342 1980211 1891191 1758992 1742858 1876544 1970278 1908731 1845441 1901385 1892545 1720737 1682902
10331 1682902 1563810 1578304 1698111 1660671 1493714 1489252 1526572 1497955 1409258 1307601 1281885
10320 1281885 1374290 1357742 1341059 1436844 1266435 1132383 1162897 1145381 1121639 1110176 1058055
10309 1058055 1067281 1138538 1256951 1247525 1280590 1256613 1142057 1009934 1009701 1093454 1003354
10298 1003354 1100328 1119520 1111674 1157226 1118696 1167802 1151221 1112326 1119066 1076574 991546 1068928
10286 1068928 1098151 1107867 1006945 821545 830188 831024 832882 786541 742136 753982 753207 721513
10274 721513 636054 646356 696818 812738 873491 765967 680894 734061 727362 745571 704883
10263 704883 722074 716301 623185 640748 667765 813741 826590 617926 600511 574574 633046
10252 633046 597177 546815 553274 535070 470035 356095 446632 492843 465268 441037 388688
10241 388688 410061 509027 519402 598064 612892 537642 462215 400333 345479 448308 448558 392592
10229 392592 341826 494890 498773 492057 491121 435882 377038 339209 437339 357864 327707 348362
10217 348362 301874 313086 324333 251520 353401 461465 440870 359853 298613 282893 208868
10206 208868 206337 324951 499724 559022 599433 532770 423546 456237 489597 430137 515117
10195 515117 537130 508509 506791 528307 416378 388182 463527 444195 415860 348118 220935
10184 220935 302014 359153 353066 330619 252867 227653 314828 350252 434085 434323 351885 348256
10172 348256 353591 330878 333515 204041 327829 467673 422228 458090 554565 533064 382333
10161 382333 158857 92287 83525 49123 145616 256038 226887 199163 192485 144658 208018
10150 208018 170749 91503 154422 320651 332190 135359 38549 66554 118199 187033 259901
10139 259901 304605 217625 191422 303145 281660 160603 171531 289080 290991 102360 6451
10128 6451 83906 208698 333645 297641 201899 272039 382291 289818 195015 174157 208668
10117 208668 193425 203150 189823 163625 104250 137134 149674 249331 222514 214315 157846 146875
10105 146875 154067 83743 69826 218288 247026 126896 106605 21483 -16040 159726 227958
10094 227958 178524 163556 318638 386681 183410 39701 50329 63787 14411 64376 193105
10083 193105 209775 176747 158464 164219 75902 38801 -17921 126662 235025 298389 327583
10072 327583 282688 209010 214742 194518 98262 90272 35217 2034 -2714 15174 61783 43189
10060 43189 71621 -82 51320 51130 122413 67599 -6979 49535 34295 172947 175744 86523
10048 86523 174855 342356 329307 312634 275247 307778 383439 535609 503281 369385 171632
10037 171632 150317 45606 132887 158233 154530 189694 295838 284054 111398 102299 191360
10026 191360 201698 141839 118623 47003 75706 133743 238684 203064 91467 127290 212002
10015 212002 216476 172664 225192 217108 184925 245684 253599 136503 234142 334722 416085 479125
10003 479125 384316 507630 813671 1039875 1253138 1565610 1614329 1509568 1387217 1071293
9993 1071293 749001 500564 449577 420003 360373 266213 178708 163960 186296 158620 85061
9982 85061 29532 4670 31988 -5946 55785 126404 28808 -146541 -129119 -3140 68593
9971 68593 73208 167333 181511 157608 43792 30186 102953 52513 -68964 -36534 108565
9960 108565 78781 77910 67292 35416 4877 18761 34435 79792 167700 191974 210241 190496
9948 190496 119444 160694 181910 149278 164943 139365 173795 239593 145701 44577 14034
9937 14034 -8000 -8610 7559 81952 286712 307170 198630 253502 257537 109106 32003 -17475
9925 -17475 -8501 -9616 15961 40835 79579 60623 136806 163355 93229 89234 41345 23001
9913 23001 87342 85011 132329 149609 24709 41238 32720 138712 155282 103550 193919 231584
9901 231584 176216 218155 238806 173828 223431 177081 5188 35507 36736 114039 168512 112279
9889 112279 190533 297207 353146 287168 353039 377753 417877 444994 288957 246329 322070
9878 322070 455239 414085 305381 201280 150426 139483 70197 90637 139722 89760 79887
9867 79887 37922 5129 -9612 -1674 74226 204779 184059 93825 170473 264499 330367 308497
9855 308497 343987 589049 632322 427018 390055 530334 643122 797106 1020076 1298022
9845 1298022 1583720 1975914 2476742 3019012 3563638 3985112 3870996 3432185 2619784 1747304
9835 1747304 1098429 682740 464166 359696 312837 436553 435466 388285 420356 342711 300991
9824 300991 279013 343452 349676 169620 239765 321267 330282 307476 378370 392430 446617 495254
9812 495254 435092 426939 344007 122108 35187 -18149 124157 201063 183126 233188 243221
9801 243221 225231 222800 118902 76077 129746 122424 230712 248128 145860 68285 7385
9790 7385 77437 168337 226892 293187 172074 214940 190859 136013 105405 110354 230180 266290
9778 266290 161810 42130 15462 62158 121874 234364 225776 216026 269450 304480 276645
9767 276645 246150 148933 97367 88862 161734 43888 -32807 34704 -66059 -94729 13259
9756 13259 102318 121921 205570 50602 17924 103833 78677 32822 146761 228819 113639
9745 113639 228794 332997 294478 258268 218712 129532 95168 119568 112754 85388 133564
9734 133564 74154 80626 159564 230004 270915 260983 71488 1553 -17160 -17632 -35138 -2239
9722 -2239 76320 -18786 -106102 -53688 -143954 -182545 -111717 29563 103897 203453 307571 210559
9710 210559 41274 128347 168004 107197 50428 4741 -56469 -37781 9885 141064 171154
9699 171154 146008 -1371 -11279 -12546 55612 126892 115684 146676 169021 278318 294253 213268
9687 213268 111221 24162 -22789 -93344 29051 153601 275445 276261 223241 291659 157444
9676 157444 19708 131790 231082 257002 281642 241496 218736 275059 180745 101986 98921
9665 98921 202263 288152 288068 260881 208970 42430 56258 103790 6965 -82275 54762 221455
9653 221455 271477 169820 58677 76614 58632 72022 226970 228896 178485 120511 -2675
9642 -2675 13994 -62599 -39218 43471 15844 38936 99008 256840 294483 235545 232813 151210
9630 151210 153629 108989 124659 203241 254247 204619 130158 161139 90397 71764 149301 164436
9618 164436 252124 293181 123503 122813 135608 71112 98042 94977 84478 165787 326145 341970
9606 341970 330423 327036 306317 343508 291477 241892 239182 446782 598895 621950 521428
9595 521428 488529 422856 414298 374882 342616 384868 424700 332661 235391 270701 409367 492242
9583 492242 394122 305930 405514 491113 328416 308357 334710 334142 259101 196997 204685 207149
9571 207149 295754 417968 365322 211289 120484 115167 208661 200096 133873 171010 238512 324599
9559 324599 208488 160961 270351 370391 424192 444611 516806 539546 579529 530817 446294
9548 446294 435433 420836 368518 382270 427050 528108 473919 495916 488614 422218 334321 272557
9536 272557 214196 328980 436870 351163 436764 403508 311226 233768 331152 397803 505275
9525 505275 528700 473111 383076 397413 452515 484856 389712 335998 332669 385754 358244 320209
9513 320209 388410 522620 655356 583321 430038 396507 463353 361287 327928 387862 444455
9502 444455 385132 358818 533258 702156 613311 563762 413789 487810 613722 665709 663265
9491 663265 537383 469841 586516 687324 622368 587793 623448 737823 795425 766102 699462
9480 699462 781436 867073 834361 673646 708957 733202 757182 775784 676091 628816 678516
9469 678516 750797 722356 803973 754412 713789 922168 1051977 1069623 920724 830433 838381
9458 838381 979636 971145 861317 844559 931553 1009966 1211676 1299727 1143917 1015372 1033189
9447 1033189 1138649 1129047 1152110 1114148 1080298 1080691 1030293 1099184 1129055 1178485 1286482 1115688
9435 1115688 1212773 1368136 1482388 1446454 1360365 1299495 1283506 1380943 1500608 1610272 1640270
9424 1640270 1572908 1470152 1459254 1495789 1389071 1382859 1509668 1651873 1770855 1865588 1848541
9413 1848541 1838570 2014820 2038552 1999377 2053928 2024760 2131108 2266443 2217993 2240797 2360442
9402 2360442 2417843 2408285 2478586 2472076 2515489 2592955 2635785 2789477 2951597 3018809 3003643
9391 3003643 3017165 3066181 3114293 3144134 3174035 3331427 3394586 3391311 3480205 3552926 3674408
9380 3674408 3799562 3824406 3854401 3970679 4072621 4224240 4312425 4491079 4685993 4955504
9370 4955504 5111664 5166983 5253237 5428218 5463390 5597058 5646485 5713995 5875232 6001435
9360 6001435 6184835 6343629 6479370 6603591 6752945 6814326 6705536 6782183 6903254 7172152
9350 7172152 7367860 7577765 7672348 7635980 7645634 7754672 7856776 7880310 7930386 7931685 7994929
9339 7994929 8016313 7955538 7976860 8121983 8049252 8016935 7933827 7885904 7856636 7730925 7630001
9328 7630001 7548386 7549059 7521185 7468651 7334044 7053250 6857667 6768061 6681408 6666577 6610023
9317 6610023 6535812 6482700 6318653 6062757 5857326 5761695 5608443 5442366 5323584 5276573
9307 5276573 5242218 5164473 4941001 4800198 4627165 4442490 4302599 4220308 4175400 4020317
9297 4020317 3789648 3921085 3808460 3674616 3532680 3502354 3492551 3363186 3342187 3198777
9287 3198777 3114183 2971183 2780916 2841470 2897720 2833646 2669724 2455845 2488743 2411767 2375510
9276 2375510 2449908 2298228 2167753 2102878 2045804 2138283 2047660 1902789 1829973 1895479 1947700
9265 1947700 1943208 1859969 1705449 1651485 1595782 1532041 1613547 1529115 1440551 1408624 1287290
9254 1287290 1323487 1351914 1216197 1303211 1356541 1303115 1195089 1101499 1030879 1040585 1098295
9243 1098295 1119781 1083998 1029962 1000942 1020604 1068031 1028223 919527 912720 899211 898981 765017
9231 765017 773433 793806 785332 760192 626797 564625 635548 571833 516090 629812 696702 738772
9219 738772 780069 850933 862928 696261 567683 539307 667527 654064 562977 566928 527917
9208 527917 442484 403570 410768 463759 481678 482392 535988 571690 609647 608460 505091 431450
9196 431450 435469 335184 305375 280062 359062 486486 559723 630579 586415 521443 575616
9185 575616 653604 643635 584951 557728 626048 579507 486343 471813 651425 615388 505826
9174 505826 487073 434370 345854 298473 297369 261116 283774 360151 340530 290144 179784 243109
9162 243109 312217 257257 205667 246447 341256 377651 267605 260945 355459 334241 259058 283182
9150 283182 297941 367260 402830 331889 273083 251513 254960 122268 49315 -744 -47589 89262
9138 89262 133863 168035 217075 227525 255769 315647 347148 259494 298185 271606 336105 359060
9126 359060 145596 397 -48641 -163013 -114406 -15531 -8054 74990 174143 165698 105699
9115 105699 -33943 -37714 -20778 -15649 82266 254091 254439 197497 146205 81867 20965 84729
9103 84729 98092 53469 30955 139885 236139 217503 106384 141563 177434 181678 220277 -24401
9091 -24401 -145912 -69369 24211 102032 183342 177556 81449 34229 73711 211409 245102 174107
9079 174107 148421 66370 11174 118565 172418 65594 75479 113675 65330 76872 74518 79049
9067 79049 9237 -99823 -182897 -161683 -59748 -7425 -118661 -97648 -58381 8447 72105
9056 72105 36639 140197 118052 46065 115259 286580 332602 306276 125312 -19760 -44261
9045 -44261 35255 -34921 -35927 -20510 34982 93629 148660 121769 127218 75412 78362 79505 136525
9032 136525 115441 90048 107618 182930 147249 208553 222940 209880 200451 184780 236785 261381
9020 261381 77171 -5519 -17409 80904 134002 89053 98553 99430 -52861 -137185 -121189 -68193
9008 -68193 -19553 40860 -95787 -144706 -89331 -31745 62104 23294 25573 -3163 -38679 -120186
8996 -120186 -117875 -19092 110652 52280 -28305 -53491 -65116 -149571 -183257 -219998 -124663 -70026
8984 -70026 -111223 -40971 92022 141948 69716 -10982 29329 41361 -6623 148602 132930
8973 132930 53265 -27667 -4426 88260 174163 92653 12852 -30776 -9598 50334 25125 63978
8961 63978 55459 58463 36652 -61538 -179893 -60329 -54887 -127130 -149290 -40489 -144194 -147467
8949 -147467 -60318 -50446 24169 76146 48502 13488 72735 -12549 -18441 54551 17854 -34534
8937 -34534 -65814 -43098 32552 97738 52741 -50498 -192418 -166968 -118955 32399 121969
8926 121969 77461 90433 132000 44569 87167 89010 45907 202678 307155 221938 28941
8915 28941 -16019 81746 182404 206231 101658 104030 134989 150337 228534 180659 212780 218828
8903 218828 175221 167200 50476 104832 143558 127164 137394 192590 207794 86054 21452
8892 21452 44494 92902 243315 291489 143524 36791 22534 31150 -46368 -24089 64278
8881 64278 21902 73169 150639 365199 320947 299457 387596 559814 677801 831849 1057137
8870 1057137 1204675 1443439 1444748 1226986 1023647 755068 529736 475347 478614 324712
8860 324712 197015 209063 303463 272525 173705 3110 -1012 6508 -9687 -10213 -10085 -50410
8848 -50410 84326 224938 266582 159516 65946 -10483 -73867 16297 26288 843 5304 51175
8836 51175 -47912 125666 119921 2819 -28440 57370 108378 60722 85294 64642 41966 106569
8824 106569 70305 -31085 -159888 -33127 3541 -1566 5835 4535 -121871 -209524 -126506
8813 -126506 -191474 -211028 -117395 -79226 -114951 17459 20416 -64805 -143060 -56411 2264 111807
8801 111807 171367 250029 293232 336005 196937 80303 -10635 -76639 -87832 -56707 8592
8790 8592 79414 168484 250930 254491 179725 45028 89761 49603 -115394 -169863 -107594 13984
8778 13984 153168 67491 75205 5423 -125529 -163022 -98175 -50964 14918 76341 60337 8452
8766 8452 -33164 -143095 -111880 -46573 5444 101989 96295 -22261 13108 -27995 -112776 -189711
8754 -189711 -146337 85044 191520 167544 3707 -29775 -81972 -177998 -256821 -189082 -133276
8743 -133276 -109558 -44778 41410 103380 44807 -31311 -102803 -155233 -282084 -207952 -32318
8732 -32318 70160 74826 120073 167752 186271 276234 207276 43421 116589 219864 286828
8721 286828 235535 212133 162247 50682 76059 126254 212287 142762 -28245 -20646 62469
8710 62469 4642 -113723 -42627 84072 173516 135510 6320 -37757 44082 106293 10313
8699 10313 -16219 -84158 -97944 13838 88072 60412 76260 -3554 -83825 -85045 -66858 18768
8687 18768 -75907 -107806 -166660 -160737 -63352 11009 163715 247392 162359 100884 25642 -10554
8675 -10554 -54745 -164176 -98832 46342 104709 100165 216128 221134 31928 -7525 31685
8664 31685 138626 173386 99463 21658 -69688 -47063 27881 -3791 -112724 -182274 -166048
8653 -166048 -166797 21799 158890 92544 134021 196780 245074 192426 341849 410607 391805
8642 391805 519272 741264 869509 929678 980811 1036528 1047761 962101 666557 494401 357498
8631 357498 158907 112053 168106 277695 335368 368124 264313 195968 222800 155476 153274
8620 153274 175997 255014 271343 329855 314057 352740 369323 299933 233278 302671 286993 136547
8608 136547 93894 255059 363021 388313 431240 390970 444450 470182 495110 518689 680584
8597 680584 850540 1032268 1277151 1706083 2063811 2188210 2133376 2072239 1708579 1183556
8587 1183556 777474 634259 584274 452095 399612 509817 500290 450775 358060 334465 269754
8576 269754 155892 114735 89962 184383 339620 304274 124318 56036 167510 177293 145903
8565 145903 154253 178634 176898 208781 207046 118428 88020 117658 118417 224678 238360 210586
8553 210586 341957 602700 773398 883678 1040742 1173768 1248325 1220712 946531 702141
8543 702141 484659 388893 230131 30924 42679 -11094 -60059 -19460 41881 -2871 -4024
8532 -4024 76363 94857 12683 93255 72801 -36941 -94942 -24497 -49293 -56319 -88362 -73526
8520 -73526 20447 127927 187043 150050 -5702 37167 81565 54205 82469 178313 296236
8509 296236 171572 86937 75782 24538 10648 80652 21499 20545 136856 181432 164423 153326
8497 153326 110390 80897 75470 86400 72381 172634 170505 243128 169652 99959 91420 62451
8485 62451 -5239 -15360 -28109 -84139 -39406 63430 9522 -82051 -133945 -63419 27873 31370
8473 31370 29642 69334 -42226 -88592 -91547 -25571 -64301 -144268 -118230 -100495 -63302 -68202
8461 -68202 -29629 -15036 -48329 -70655 -137043 -132080 5267 28859 -44998 -7151 -95812 -118134
8449 -118134 -103069 -9117 134740 82517 14815 23263 54520 70076 68857 -5825 55944 57340
8437 57340 -2576 -80830 -57598 30560 17022 30308 32260 71796 46833 -21526 -105658 -261845
8425 -261845 -240161 -34339 18403 2270 -77899 -171100 -159266 -206041 -166085 -130458 -131630 -123947
8413 -123947 -51043 22009 24259 -19105 -28893 59668 94571 100310 73761 -5963 -29898 37324
8401 37324 102927 99601 159404 121191 111484 144941 27438 22682 -5625 -17843 -154659 -172279
8389 -172279 -122079 -152229 -25138 121063 159461 84756 84724 111203 117907 144988 107364 74126
8377 74126 185119 284111 195926 105476 78466 29900 74673 134485 117429 45252 90037 110511
8365 110511 182051 50778 -69185 -96969 17287 -70118 -194332 -92661 -123896 -20711
8355 -20711 121844 87810 12012 2935 92144 97678 18305 -84156 -54341 33119 46907 134059
8343 134059 20008 -113604 -99777 -122034 -68350 10132 -15742 -71445 -112887 -98748 -62676
8332 -62676 -35130 -59374 -112661 -168639 -187094 -239046 -150806 -70811 -130067 -214772 -261652 -138288
8320 -138288 -50271 45589 60500 77410 58764 2374 -76250 -119814 -67073 -48363 -129276 -195535
8308 -195535 -254436 -86497 -44553 75574 103148 50204 -96953 -182142 -199598 -169157 -168794
8297 -168794 -106641 -152198 -214021 -144589 -190015 -199015 -214713 -120122 -43690 -2342 30143 -31566
8285 -31566 -51660 22749 61287 11515 -91917 -193150 -108719 -645 -31337 -27996 -34013 -22645
8273 -22645 -21012 -58503 -174696 -109464 18515 100232 32238 -140151 -109903 -86941 -102147
8262 -102147 -19792 60626 87368 110607 155935 57728 -14722 -122422 -198327 -159037 -148343
8251 -148343 -35595 7241 110898 69075 67928 80995 56248 67253 79892 52061 25302
8240 25302 52029 88666 8877 33984 17402 81158 168233 52882 3083 -60117 -53670 18647
8228 18647 14404 11761 37852 8775 -12514 -43874 64074 245522 207235 113808 12845 -104199
8216 -104199 -129396 -29883 104246 130554 106866 93761 110228 119362 147141 101284 -5969
8205 -5969 -29688 -33439 -26474 97336 112586 51869 -58587 -59895 -26842 -59418 -35156 -12509
8193 -12509 11917 199125 231642 219529 88778 -78975 3745 105051 115474 164251 49019
8182 49019 -9609 51833 94773 114074 77374 187873 236131 231621 175078 12562 -74862 31067
8170 31067 79884 -19931 -43975 -2484 48344 225006 201050 103390 86033 45071 13183 -75924
8158 -75924 -157122 -86519 -95348 16974 87325 127488 175049 72911 -124180 -194110 14590
8147 14590 3801 27733 -103736 -148529 -147942 -22682 156605 424243 567184 632255 545702
8136 545702 460323 440045 347261 283980 192717 60554 79734 104983 93693 150819 157041 59147
8124 59147 25428 27939 -14135 84218 167614 217207 89127 32468 -61313 30822 105728 145347
8112 145347 202422 150196 129835 103473 29590 13464 88188 140924 182842 221744 140326 83841
8100 83841 22393 48381 -2771 -113469 -176925 -141198 -89130 -85549 -6816 -8211 -186452 -118155
8088 -118155 -26776 46967 54274 27829 26493 61694 52192 85618 131087 115168 138848 86258
8076 86258 121675 92339 50664 -14831 -130351 -94206 -52313 -19472 -35789 -87463 42802
8065 42802 54698 100776 63513 71550 37168 13015 -30604 66941 24904 -6781 137236 96019
8053 96019 85109 96098 81704 83678 136034 150615 99530 -17350 5256 134165 257456
8042 257456 409124 370620 211712 68037 73036 160025 124327 92500 89160 153979 201356
8031 201356 112948 31882 107148 54465 39982 41112 -40216 -65911 24541 -11584 -48354 3107
8019 3107 99567 188879 204932 212696 151516 59925 71372 96924 157080 150008 130462 62078
8007 62078 26190 -54747 -44226 47628 32854 30603 33298 92644 134781 192509 260979 293074
7995 293074 191324 202426 285451 216337 208103 343067 313257 232706 130067 -48349 -113115
7984 -113115 -168484 -79156 -6477 -90464 -104139 -94106 -57597 -83039 -69097 76223 99822
7973 99822 102916 118647 39050 -19340 -17616 -8775 -96961 -70011 -72828 -101650 -136962 -68275 -54425
7960 -54425 -66745 -35630 63003 39456 1679 96057 146472 467 8804 68383 75101 133705
7948 133705 185460 116604 102855 156151 183155 187934 64090 -45534 -41664 -22243 -27573 -46338
7936 -46338 35256 124133 159735 195480 161750 125344 104800 120687 130204 154417 79359 -28901
7924 -28901 -128879 -102348 -153204 -83890 -88405 -161197 -2208 69759 156 -116890 -138881 -4128
7912 -4128 -4709 -68279 -118349 -72403 -47320 -62042 -141303 -150178 -138701 -153141 -217345 -192975 -158257
7899 -158257 -99665 9653 16125 88151 111080 5345 -64944 5991 -131362 -222610 -203908
7888 -203908 -113832 -150222 -209652 -247521 -124849 49113 87097 50795 -1106 96031 89461
7877 89461 -99621 -118708 51865 5369 -34740 -62289 -129280 -143990 -120900 -85474 -49211
7866 -49211 8047 -662 -54109 -33465 -18617 -6608 -10807 67508 72492 38925 10424 -81339
7854 -81339 -101804 -49788 -32026 46916 107888 45631 -93269 -150502 -133689 -150336 -218594 -200631
7842 -200631 -188754 -224377 -243556 -190505 -145155 -64730 -111659 -49706 35784 41046 84265 157246
7830 157246 39949 -39976 28440 -32037 14084 126175 34040 -115557 -196175 -120801 -46557
7819 -46557 13491 18254 -126769 -208365 -248982 -298452 -205628 -100186 -17425 16242 -20342 -46225
7807 -46225 -24780 9786 -16788 -170075 -190602 -146360 -113359 -94583 -111866 -70985 -40501 -11743
7795 -11743 65044 -43415 -70705 -69214 -66305 -67849 -96664 -86363 -138082 -200442 -241489 -176622
7783 -176622 -4805 7904 -2848 56546 93811 -5297 -16348 -30687 8092 64811 26095
7772 26095 -54458 -43533 -94723 -53469 -6800 94084 187722 188160 127090 101656 -50959 -101968
7760 -101968 17769 28595 -86055 -91348 41653 68909 62508 850 -12674 -50133 -122368
7749 -122368 -144355 -100407 16989 -73626 -771 70081 114763 109381 152142 85793 17895 -59122
7737 -59122 -118981 -96702 -44624 33734 -20184 23338 -23595 -72718 -93778 -200926 -287710 -276801
7725 -276801 -236770 -154546 -129867 -33110 -41003 -22425 -100492 -85978 6964 17383 -27185 1607
7713 1607 -82399 -88934 -85996 -60980 -69762 -169063 -188705 -175163 -130979 -114028 4089 59445
7701 59445 7775 -29794 -9773 51730 69745 39431 23335 -119499 -152970 -127170 -115867 -159465
7689 -159465 -124814 -118809 -17562 33622 92577 20080 -108744 -95709 -86939 -120340 -118172 -62854
7677 -62854 -120526 -212565 -179978 -54423 -12847 -3871 46843 -18516 -49285 29560 69468 53973
7665 53973 95620 237419 188663 76452 109987 17576 -75231 -110878 -78968 -15109 -1645
7654 -1645 -93234 -146111 -50918 -30719 -76717 -89233 -98587 -3430 102441 121124 138066 105177
7642 105177 136418 98339 38800 24102 37717 19958 -112647 -153307 -214722 -318296 -228001
7631 -228001 -170494 -167083 -79083 99596 -11733 -4295 128172 114684 56427 19342 -91977
7620 -91977 -41342 41272 -80824 -69818 -53301 -127951 -28439 99088 26986 -17003 -131046
7609 -131046 -129739 -78893 6641 37265 -7948 -13517 -80571 -96041 -181740 -89489 -65572 -43094
7597 -43094 -12867 -1089 20212 126815 169697 77346 -19297 -16340 -123812 -49489 57004
7586 57004 33291 38770 36098 70487 70683 -44792 -158403 -239983 -221090 -189389 -200162 -130015
7574 -130015 -11316 -70906 -152970 -91764 -168514 -317298 -359750 -229628 -269907 -165304 30519
7563 30519 139766 82542 -48658 -89718 -22111 131449 185647 111541 96103 125163 120249
7552 120249 167891 228583 180951 187367 103536 85237 6629 25253 67725 58517 -20941 -116789
7540 -116789 -72901 5910 52922 10767 -46160 -64270 34631 101457 68127 59759 60238 100771
7528 100771 51788 -32366 -6506 -47203 -86183 -159256 -74301 15529 -14237 -46520 78982
7517 78982 105422 -21853 56927 -38477 -143042 -197854 -140847 -101961 -17905 -13895 -18158 -44851
7505 -44851 -96278 -86337 -22840 70566 31810 -87377 -180423 -191147 -251223 -217247 -159504 -113052
7493 -113052 -58653 -40638 -10664 -23314 11370 -9431 64011 35524 21273 63582 111956 28411
7481 28411 -32990 -38503 -71169 -134743 -129045 -104387 -177871 -80098 -69267 -51457 -15105 -32196
$$ [...]
##END NTUPLES=NMR SPECTRUM
##END=
