##TITLE=Analysis number 313203
Compound Code cc 35563
Book Reference 413/186/2
Project Code adrs
Chemist Name stevem
##JCAMPDX= 6.0         $$ Bruker NMR JCAMP-DX V2.0
##DATA TYPE= NMR SPECTRUM
##DATA CLASS= NTUPLES
##ORIGIN= Bruker BioSpin GmbH
##OWNER= NMR
$$ XWIN-NMR		Version 3.5
$$ Fri Aug 26 11:11:19 2005 GMT Daylight Time (UT+1h)  MAYBRIDGE\NMR@NMR_250MHZ
##.OBSERVE FREQUENCY= 250.131544655141
##.OBSERVE NUCLEUS= ^1H
##.ACQUISITION MODE= SIMULTANEOUS (DQD)
##.ACQUISITION SCHEME= undefined
##.AVERAGES= 16
##.DIGITISER RES= 18
##SPECTROMETER/DATA SYSTEM= dpx250
##.PULSE SEQUENCE= zg30
##.SOLVENT NAME= DMSO
##.SHIFT REFERENCE= (INTERNAL, DMSO, 0, 16.522)
##AUDIT TRAIL= $$ (NUMBER, WHEN, WHO, WHERE, WHAT)
$$ ##TITLE= Audit trail, XWIN-NMR		Version 3.5
$$ ##JCAMPDX= 5.01
$$ ##ORIGIN= Bruker BioSpin GmbH
$$ ##OWNER= NMR
$$ C:\u/data/dgb/nmr/ADRS/8710/pdata/1/auditp.txt
$$ ##AUDIT TRAIL=  $$ (NUMBER, WHEN, WHO, WHERE, WHAT)
(   1,<2005-08-26 11:10:58.46 +100>,<MAYBRIDGE\NMR>,<NMR_250MHZ>,
      <created by zg, POWCHK disabled, PULCHK disabled
       configuration hash MD5:
       62 19 C7 07 E1 42 D1 B7 37 6C 3D D0 77 39 F9 E6
       data hash MD5: 64K
       2E 18 CC EA 55 E6 21 E5 65 72 DA 88 7A 72 C5 29>)
(   2,<2005-08-26 11:11:11.33 +100>,<MAYBRIDGE\NMR>,<NMR_250MHZ>,
      <Start of raw data processing
       ef LB = 0.3 FT_mod = 6 PKNL = 1 SI = 32K 
       data hash MD5: 32K
       C2 A8 ED 66 D0 95 E9 28 1E 6F 0B A6 C3 45 9C EB>)
(   3,<2005-08-26 11:11:13.19 +100>,<MAYBRIDGE\NMR>,<NMR_250MHZ>,
      <apk 
       data hash MD5: 32K
       1A 8B A9 E7 1F 17 7C A6 FC B1 3E AA F7 30 52 D4>)
(   4,<2005-08-26 11:11:13.85 +100>,<MAYBRIDGE\NMR>,<NMR_250MHZ>,
      <abs ABSG = 5 
       data hash MD5: 32K
       D6 DF 0D 74 13 E1 AB 1B F6 8E D7 37 27 B5 8D 4F>)
$$ ##END=
$$ 
$$ hash MD5
$$ 70 C8 CF 46 2E F7 08 DD 6F 72 29 4B AD CD DE B6
##$RELAX= 
##$RELAX= 
##$RELAX= 
##$RELAX= 
##$RELAX= 
##$RELAX= 
##$RELAX= 
$$ Bruker specific parameters
$$ --------------------------
##$DU= <C:\u>
##$EXPNO= 8710
##$NAME= <ADRS>
##$PROCNO= 1
##$TYPE= <nmr>
##$USER= <dgb>
##$AMP= (0..31)
100 100 100 100 100 100 100 100 100 100 100 100 100 100 100 100 100 100 
100 100 100 100 100 100 100 100 100 100 100 100 100 100 
##$AQSEQ= 0
##$AQ_mod= 3
##$AUNM= <au_zg>
##$AUTOPOS= <15 >
##$BF1= 250.13
##$BF2= 250.13
##$BF3= 250.13
##$BF4= 250.13
##$BF5= 500.13
##$BF6= 500.13
##$BF7= 500.13
##$BF8= 500.13
##$BYTORDA= 1
##$CFDGTYP= 0
##$CFRGTYP= 5
##$CHEMSTR= <none>
##$CNST= (0..31)
1 1 145 1 1 1 1 1 1 1 1 1 1 1 1 1 1 1 1 1 1 1 1 1 1 1 1 1 1 1 1 1 
##$CPDPRG= <>
##$CPDPRG1= <>
##$CPDPRG2= <>
##$CPDPRG3= <>
##$CPDPRG4= <mlev>
##$CPDPRG5= <mlev>
##$CPDPRG6= <mlev>
##$CPDPRG7= <mlev>
##$CPDPRG8= <mlev>
##$CPDPRGB= <>
##$CPDPRGT= <>
##$D= (0..31)
0 1 0 0 0 0 0 0 0 0.06 0 0 0 0 0 0 0.0002 0 0 0 0 0 0 0 0 0 0 0 0 0 0 
0 
##$DATE= 1125051057
##$DBL= (0..7)
120 120 120 120 120 120 120 120 
##$DBP= (0..7)
150 150 150 150 150 150 150 150 
##$DBP07= 0
##$DBPNAM0= <>
##$DBPNAM1= <>
$$ [...]
##$SUBNAM7= <"">
##$SUBNAM8= <"">
##$SUBNAM9= <"">
##$SW= 20.6930455092707
##$SWIBOX= (0..15)
0 0 3 0 0 0 0 0 0 0 0 0 0 0 0 0 
##$SW_h= 5175.983436853
##$TD= 65536
##$TD0= 1
##$TE= 295.16
##$TE2= 300
##$TE3= 300
##$TEG= 300
##$TL= (0..7)
0 120 120 120 120 120 120 120 
##$TP= (0..7)
150 150 150 150 150 150 150 150 
##$TP07= 0
##$TPNAME0= <>
##$TPNAME1= <>
##$TPNAME2= <>
##$TPNAME3= <>
##$TPNAME4= <>
##$TPNAME5= <>
##$TPNAME6= <>
##$TPNAME7= <>
##$TPOAL= (0..7)
0.5 0.5 0.5 0.5 0.5 0.5 0.5 0.5 
##$TPOFFS= (0..7)
0 0 0 0 0 0 0 0 
##$TUNHIN= 0
##$TUNHOUT= 0
##$TUNXOUT= 0
##$USERA1= <user>
##$USERA2= <user>
##$USERA3= <user>
##$USERA4= <user>
##$USERA5= <user>
##$V9= 5
##$VALIST= <valist>
##$VCLIST= <CCCCCCCCCCCCCCC>
##$VD= 0
##$VDLIST= <DDDDDDDDDDDDDDD>
##$VPLIST= <PPPPPPPPPPPPPPP>
##$VTLIST= <TTTTTTTTTTTTTTT>
##$WBST= 1024
##$WBSW= 4
##$XGAIN= (0..3)
0 0 0 0 
##$XL= 0
##$YL= 0
##$YMAX_a= 286046
##$YMIN_a= -333496
##$ZGOPTNS= <>
##$ZL1= 120
##$ZL2= 120
##$ZL3= 120
##$ZL4= 120
##$ABSF1= 16.522
##$ABSF2= -4.171173
##$ABSG= 5
##$ABSL= 3
##$ALPHA= 0
##$AQORDER= 0
##$ASSFAC= 0
##$ASSFACI= 0
##$ASSFACX= 0
##$ASSWID= 0
##$AUNMP= <proc_1d>
##$AZFE= 0.1
##$AZFW= 0.1
##$BCFW= 0
##$BC_mod= 0
##$BYTORDP= 0
##$COROFFS= 0
##$CY= 12.5
##$DATMOD= 1
##$DC= 0
##$DFILT= <>
##$DTYPP= 0
##$F1P= 14.0000005364418
##$F2P= -0.99999901652339
##$FCOR= 0.5
##$FTSIZE= 32768
##$FT_mod= 6
##$GAMMA= 0
##$GB= 0
##$INTBC= 1
##$INTSCL= 1
##$ISEN= 128
##$LB= 0.3
##$LEV0= 0
##$LPBIN= 0
##$MAXI= 10000
##$MC2= 0
##$MEAN= 0
##$ME_mod= 0
##$MI= 0
##$NCOEF= 0
##$NC_proc= -5
##$NLEV= 6
##$NOISF1= 0
##$NOISF2= 0
##$NSP= 0
##$NTH_PI= 0
##$NZP= 0
##$OFFSET= 16.522
##$PC= 1
##$PHC0= -86.09861
##$PHC1= 5.53255
##$PH_mod= 1
##$PKNL= yes
##$PPARMOD= 0
##$PSCAL= 4
##$PSIGN= 0
##$REVERSE= no
##$SF= 250.13
##$SI= 32768
##$SIGF1= 0
##$SIGF2= 0
##$SINO= 400
##$SIOLD= 32768
##$SREGLST= <1H.DMSO>
##$SSB= 0
##$STSI= 32768
##$STSR= 0
##$SW_p= 5175.98343685301
##$SYMM= 0
##$S_DEV= 0
##$TDeff= 65536
##$TDoff= 0
##$TI= <Analysis number 999999
Compound Code 99
Book Reference 9
Project Code 9>
##$TILT= no
##$TM1= 0
##$TM2= 0
##$TOPLEV= 0
##$USERP1= <user>
##$USERP2= <user>
##$USERP3= <user>
##$USERP4= <user>
##$USERP5= <user>
##$WDW= 1
##$XDIM= 32768
##$YMAX_p= 406661914
##$YMIN_p= -519133
$$ End of Bruker specific parameters
$$ ---------------------------------
##NTUPLES= NMR SPECTRUM
##VAR_NAME=  FREQUENCY,     SPECTRUM/REAL,   SPECTRUM/IMAG
##SYMBOL=    X,             R,               I
##VAR_TYPE=  INDEPENDENT,   DEPENDENT,       DEPENDENT
##VAR_FORM=  AFFN,          ASDF,            ASDF
##VAR_DIM=   32768,         32768,           32768
##UNITS=     HZ,            ARBITRARY UNITS, ARBITRARY UNITS
##FACTOR=    0.157963299565203, 1,           1
##FIRST=     4132.6476996994, 0,             0
##LAST=      -1043.33573715361, 0,           0
##MIN=       -1043.33573715361, -519133,     0
##MAX=       4132.6476996994, 406661914,     0
$$ Real data points
##PAGE= N=1
##DATA TABLE= (X++(R..R)), XYDATA
$$ [...]
18398A02124194j0838637j1561660j1040021q729569n081659j466463K26736j232815
18390E2400106m164527o528240p359691o445841m819558l477377k509437k006671
18382A5088764j686105j371584j263664j173636j083432p82802n35914l64213
18374F827414l19609l96549l12656l40842k84824l30260j59132k46184k02262
18365D235096m2536o7373j19700j79037n5691j32469P566J63826K87884L11971
18355D409537L06096O5711j72624k98126k50716J931J34266J78207J59371m7516
18345D486137k94398l15078k42793l11676j46228l22589l12305k68029j43149
18336B129892l3437M2511l2860l2521j8374j65968k17002j05533k7628L4387L1920
$$ y = [102124194, 91285557, 79723897, 68683876, 59954307, 54872648, 53406185, 53632921, 52400106, 48235579, 41707339, 34347648, 27901807, 23082249, 19604872, 17095435, 15088764, 13402659, 12031075, 10767411, 9593775, 8510343, 7727541, 7191627, 6827414, 6507805, 6111256, 5798600, 5457758, 5172934, 4842674, 4683542, 4437358, 4235096, 4192560, 4125187, 4005487, 3826450, 3770759, 3638290, 3645856, 3809682, 4097566, 4409537, 4715633, 4781344, 4608720, 4310594, 4059878, 4061809, 4196075, 4374282, 4533653, 4486137, 4191739, 3876661, 3633868, 3322192, 3175964, 2853375, 2541070, 2273041, 2129892, 2096455, 2138966, 2106106, 2073585, 2055211, 1889243, 1672241, 1566708, 1539080, 1573467, 1605387]
18325A605387j43173j30903J41888J45752K4677n872k8595N1399L7836j38316
18315A560080k16987q3045M1183R0829n9027Q1717J08742L9126r5932j32483k01785
18304A132418l8352j22554q2132Q5032l2824m187M592n6882l491j06439L1197
18293H06378L3387J9276r2079j14288O6156J89328M3079m6246L7957j07230j09355
18282G26363K2135m9286p8486l0324N5578l6749p0471J55437P0196j7934n6306
18271F90153L9338J00176O3769j46698p5077n0414p8224P1430R5429p4360K6078
18260F61600k8161R4760Q8639Q508m997j5547K11478R2651j3101J47343o245n8295
18248A178633o6809L7243J89300n0150j16404l5740J5579k227J8915j71085n2365
$$ y = [1605387, 1462214, 1331311, 1473199, 1618951, 1643628, 1637756, 1609161, 1660560, 1698396, 1560080, 1343093, 1260048, 1301231, 1392060, 1333033, 1414750, 1523492, 1562618, 1466686, 1334203, 1132418, 1094066, 971512, 889380, 974412, 941588, 937401, 941993, 885111, 881620, 775181, 806378, 839765, 859041, 766962, 652674, 718830, 908158, 951237, 904991, 942948, 835718, 726363, 748498, 699212, 620726, 590402, 645980, 609231, 538760, 694197, 764393, 746459, 690153, 729491, 829667, 893436, 746738, 671661, 621247, 543023, 614453, 709882, 635522, 661600, 633439, 728199, 816838, 825346, 820349, 804802, 1016280, 1108931, 1095830, 1243173, 1236928, 1178633, 1111824, 1149067, 1338367, 1288217, 1171813, 1136073, 1151652, 1149425, 1168340, 997255, 944890]
18237I44890m8357N8324P1352o3498o6349J09442J40559Q8910L3101J8865J14604
18226A401843J14294N2309J3560j71517j9833k9407n3008j28493m7910N8512j31418
18215A058932j17519q8121p7408j3158j70104o7460J45524O510k0530O3445K4520
18204G44631J23010J48220K4357k1345j02648P1475p1292L7553J79150J30883
18194A263994N6228P0161j31952k32677j53013j49472j8334j8195l2028L4267
18184F88979J4024M4250L3321K53956N3525l6357P5955K35840J70153p7492j91380
18173A264774r0990j28151j78593j51111P3901J62991P0011L8917J68097L8269
18163A268115m6075k5704K212P1799K35343J84697K4017L0515J65689J23236k5811
$$ y = [944890, 896533, 954857, 1026209, 962711, 896362, 1005804, 1146363, 1235273, 1268374, 1287239, 1401843, 1516137, 1568446, 1582006, 1410489, 1390656, 1361249, 1308241, 1179748, 1131838, 1190350, 1058932, 941413, 853292, 775884, 762726, 592622, 525162, 670686, 677196, 656666, 720111, 744631, 867641, 1015861, 1040218, 1018873, 916225, 987700, 916408, 953961, 1133111, 1263994, 1320222, 1390383, 1258431, 1025754, 872741, 723269, 704935, 686740, 654712, 688979, 703003, 747253, 780574, 1034530, 1088055, 1051698, 1127653, 1363493, 1533646, 1456154, 1264774, 1173784, 1045633, 867040, 715929, 789830, 952821, 1022832, 1061749, 1229846, 1268115, 1222040, 1196336, 1198548, 1270347, 1505690, 1690387, 1714404, 1744919, 1910608, 2033844, 2008033]
18152B008033N1919K40914J99270O9573O5078K13713J57210J68915O9013Q3950
18142C327588K01766K63216L22048M76847N93440N24062O62336Q08191R93132
18133H172626J368331J823314K585306L972492O583475J1148483J7076318J9884041
18125G2614386J3058277J091929q500502j1827466p320548K134347J2420579J7494297
18117I1165299J0328270l198472j4218723j9097198j5785268r865639n272397
18110C4055872j871096J012921M295559Q985485J6688837K7722370L6431188K9461174
18102A56782310P456634j2937387k4022293k0257219n893634J0621076K2046327
18095A33795814J7437421r73252j8696445k9366743k8322895k0548980j3547362
$$ y = [2008033, 2059952, 2300866, 2500136, 2569709, 2634787, 2848500, 3005710, 3174625, 3243638, 3327588, 3529354, 3792570, 4114618, 4591465, 5184905, 5708967, 6371303, 7179494, 8172626, 9540957, 11364271, 13949577, 17922069, 24505544, 35654027, 52730345, 72614386, 85672663, 86764592, 78264090, 66436624, 59116076, 61250423, 73671002, 91165299, 101493569, 98295097, 84076374, 64979176, 49193908, 39328269, 34055872, 32184776, 33197697, 37493256, 46478741, 63167578, 90889948, 127321136, 156782310, 164238944, 151301557, 127279264, 107022045, 101128411, 111749487, 133795814, 151233235, 150259983, 131563538, 102196795, 73873900, 53324920, 39777558]
18088C9777558q960763o111905m298363l043204k240741j859192j502531j131501
18080A0629358p10894o00411l89646m08038l79485l08481o2710P2111L02238J64068
18070H308110j49724k68524j71656r4639K07865M52565P21849J062965J442414
18061A1511225J810476K716142M153618O821030J1487806J9837622L2478132M0721967
18053A31538018K7125548N67k2732565l4380976l0578836k0586346j3181603q626506
18045B8577301n771970l622449k380957j497987q21746k74304K12091Q50798J820422
18036A7091199L032633N414959R076289J5256898K1449369J8162513M647399p609358
18028H6521901j4947606j3690990o358348J801958J1448850K3498801L1643074
$$ y = [39777558, 30816795, 24704890, 20406527, 17363323, 15122582, 13263390, 11760859, 10629358, 9918464, 9318053, 8928407, 8520369, 8140884, 7832403, 7769693, 7841804, 8144042, 8308110, 8158386, 7889862, 7718206, 7623567, 7831432, 8283997, 9005846, 10068811, 11511225, 13321701, 16037843, 20191461, 27012491, 38500297, 58337919, 90816051, 131538018, 158663566, 158664133, 135931568, 101550592, 70971756, 50385410, 37203807, 28577301, 22805331, 19182882, 16801925, 15303938, 14482192, 14207888, 14419979, 15270777, 17091199, 20123832, 25538791, 34615080, 49871978, 71321347, 89483860, 94131259, 86521901, 71574295, 57883305, 51524957, 53326915, 64775765, 88274566, 119917640]
18021A19917640K2164349j54266j9165475k9501788k6955563j8651472j2092376
18014C5561049q136112n308097l554761k394693j710047j106491n09335j0678
18006A2830835O64191J673601L018110M708507Q439629J5111431K1894039J9063298
17998H7403641M235388r723417j8751853j8904689j3388431q515065n511230l604885
17990A3239459k297315j601928j443825j058489r31022p35242m50793l88962k11078
17981D120805r1511j69560k58156j21873j68356j99011k25488p4001Q0050j28569
17971B764330j57875n1167p5207o8922r3655M7313r7709k60313j92941o7312L2549
17960A779091K3964J5636p231j0052o3201J15405K00857M855L3801j31356j82404
$$ y = [119917640, 142081989, 141927723, 122762248, 93260460, 66304897, 47653425, 35561049, 27424937, 22116840, 18562079, 16167386, 14457339, 13350848, 12841513, 12830835, 13495026, 15168627, 18186737, 22895244, 31334873, 46446304, 68340343, 87403641, 91639029, 81915612, 63163759, 44259070, 30870639, 22355574, 16844344, 13239459, 10942144, 9340216, 7896391, 6837902, 5906880, 5171638, 4720845, 4331883, 4120805, 4029294, 3859734, 3601578, 3479705, 3311349, 3112338, 2886850, 2812849, 2892899, 2764330, 2606455, 2555288, 2480081, 2411159, 2317504, 2364817, 2267108, 2006795, 1813854, 1746542, 1779091, 1803055, 1818691, 1811460, 1801408, 1738207, 1853612, 2054469, 2059324, 2093125, 1961769, 1779365]
17949A779365q4490j3734L4165J0896Q3749j01019j47631j26007O7776Q637J25591
17938A637298P004M0838R6232o1788q3402j9928k2470j35545m9001K5071M638
17927A438947l5583r941j07258j3160n0886j8111L1855p8256M9413O6606j6855
17916A256771r7205M4798J4360j30764m4124j77521p9817J00862Q1922J64783
17906A134065J57160R968l5233j7617K570o3803j21709r2417q978L2345Q3715
17895A080066P2072N4682j59241l1963J25579j33807n5926J3544m3181P7590M6358
17884A045773j63066m6124o3269P0697M9668p3875k8905K4568P6006L6248j08653
17873H19068j13498j22709p3884J9626O6373m9103l7567N7411J17958q9651j79234
$$ y = [1779365, 1694875, 1681141, 1715306, 1726202, 1809951, 1708932, 1561301, 1435294, 1503070, 1511707, 1637298, 1644302, 1685140, 1781372, 1719584, 1636182, 1616254, 1593784, 1458239, 1409238, 1434309, 1438947, 1403364, 1393423, 1286165, 1273005, 1222119, 1204008, 1235863, 1157607, 1207020, 1273626, 1256771, 1159566, 1204364, 1218724, 1087960, 1043836, 866315, 786498, 887360, 969282, 1134065, 1291225, 1301193, 1265960, 1248343, 1250913, 1187110, 1065401, 972984, 964006, 996351, 1080066, 1152138, 1206820, 1047579, 1015616, 1141195, 1007388, 951462, 965006, 921825, 999415, 1045773, 882707, 836583, 773314, 844011, 893679, 819804, 790899, 815467, 891473, 927721, 819068, 705570, 582861, 508977, 528603, 594976, 545873, 508306, 565717, 683675, 594024, 414790]
17862D14790o56m475r037p1204J0414K72687J48502M4762p1586K34o2422k9397
17850F42612K7919p424n3608l9085L5048k3753o3084M7934n1095j02041k5565
17839C87858q1994R4538J70721P0959j38719j29437k7103J08463J0638P4554m4486
17828D95992j78123j69984J48583J63499q5939j02239j16288o1063L3339J22775
17818B50552q16L6166J29276l745q4521p7662R20Q1393J10559o7734j3574q1309
17806B79505r385M5135Q8580m504k9411j32379j46088P3086M6502j40760l6544
17795C3737Q9795J32523J82063L9764j19773j48996K7706R1092J07748L0788j11202
17784C55245j18272j8666N1632q8577j04482O4309J34997J03866q2855n7604n268
$$ y = [414790, 414134, 409659, 400622, 329418, 339832, 612519, 761021, 805783, 734197, 734431, 672009, 642612, 670531, 663107, 609499, 570414, 605462, 581709, 518625, 566559, 515464, 413423, 387858, 305864, 400402, 571123, 642082, 503363, 373926, 346823, 455286, 465924, 540478, 495992, 317869, 147885, 296468, 459967, 374028, 271789, 155501, 94438, 127777, 250552, 249736, 285902, 415178, 411433, 326912, 249250, 250170, 331563, 442122, 374388, 360814, 279505, 270120, 315255, 403835, 399331, 369920, 237541, 91453, 164539, 211041, 70281, 33737, 123532, 256055, 438118, 477882, 358109, 209113, 236819, 327911, 435659, 466447, 355245, 236973, 218307, 269939, 181362, 76880, 141189, 276186, 380052, 297197, 239593, 234325]
17773B34325O2271k130q7060o5137j4592L9724J72456j4476j32111k6490K09401
17762C76181n1892o7621K1759J6663q7217m0127N7285J91302J27987l4274j10738
17751C99308K6367O0786O6754M9929Q8202J487j20751l3050o4619m8507J1091
17740D36997j8377j02925L1708m1321k1949l2293O4490M4926k8698p9679P3960
17729C26839l5210l0192Q9395M8620j05205o3349M5787O3048l7368q1526p1999
17718A48840P1593P7296o934m0589J2840O977J6210j9667J9229N410m3452k5161
17706B22592N5435N455j5628j66061O0858N4486J3853j5695Q7853p3574p2180
17695A57394j4109k0049P2176r9487k0802J9602O7034R5762M7811o4307j28769
$$ y = [234325, 296596, 294466, 207406, 142269, 127677, 167401, 339857, 325381, 193270, 166780, 376181, 324289, 256668, 278427, 295090, 207873, 167746, 225031, 416333, 544320, 510046, 399308, 425675, 486461, 553215, 603144, 691346, 692833, 572082, 539032, 474413, 425906, 436997, 418620, 315695, 347403, 306082, 284133, 251840, 316330, 361256, 332558, 252879, 326839, 291629, 261437, 350832, 399452, 294247, 230898, 276685, 339733, 302365, 220839, 148840, 220433, 297729, 290795, 250206, 263046, 270023, 286233, 266566, 285795, 291205, 247753, 222592, 278027, 283482, 267854, 101793, 162651, 217137, 230990, 215295, 303148, 229574, 157394, 143285, 123236, 195412, 95925, 75123, 94725, 161759, 257521, 305332, 241025, 112256]
17684A12256L3836L2078Q0786Q5945q7312N069N2417j55142j839K17685J12197
17673D87976p3023q3552J2757J31133J1913K2019j59264o9405N8933o0787r2993
17662A85707k7781n8100K6740N5768L4910o8690L5370j2990j2258J8034k7052
17651A49658J7215P627R3988M6221l5152j00793n0360N3739J4340O0659p3422
17640A83720j58323l6968O7387L6543J54383K35n8930p36J0320O4531q323L1105
17628B84944L0231m2608r7985j2839L7877Q0078L7906j689o7427L0310Q0303L7962
17616C97063n7125j02892q1797K507M4477J9747M8822o3160j46567r9401k4289
17605f2615L6725K00589M9852k0627n7310N483L4169l0682O2819m6894L3326J87908
$$ y = [112256, 146092, 178170, 258956, 344901, 257589, 262658, 315075, 159933, 158094, 375779, 487976, 414953, 331401, 344158, 475291, 487204, 509223, 349959, 280554, 339487, 278700, 185707, 157926, 99826, 126566, 182334, 217244, 148554, 183924, 170934, 158676, 176710, 149658, 166873, 174500, 268488, 314709, 279557, 178764, 128404, 182143, 196483, 257142, 183720, 25397, -11571, 55816, 92359, 246742, 246977, 188047, 187311, 197631, 262162, 253839, 284944, 315175, 272567, 174582, 161743, 199620, 279698, 317604, 315915, 248488, 278798, 359101, 397063, 339938, 237046, 155249, 157756, 202233, 221980, 270802, 207642, 61075, -38326, -62615, -25890, 174699, 224551, 203924, 146614, 152097, 186266, 155584, 218403, 171509, 204835, 392743]
17593C92743J27476M3202R6604L4159J065j26171j30814P3627J41237J5480Q7731
17582G56339q0896K3196Q4649j28482j49255j51372l3613j0219j33735n4878M2001
17571A63735O245K18955J65156J58431O1692R3303r2454j12467r571m8342O6649
17560F71332J32259N8594r7084k21070j58108p2825p5905O0421K1850L4165J16597
17549D70226M112J4841M4446p7606j36703j40472K3774M1236L5203r4804o3691
17538A20562P1296M1464M019j39219j80178N0160O4255K8191l7386J43211J2983
17527A79358l917K0395l1400J09883N1995J53189R1472R4645J9860r296o8780
17516F07404p8643j42111m9210K2012J0194k9811m8468K6254j02422N0419R9992
$$ y = [392743, 520219, 563421, 660025, 694184, 695249, 569078, 438264, 511891, 653128, 668608, 756339, 675443, 698639, 783288, 654806, 505551, 354179, 320566, 310347, 176612, 121734, 163735, 169980, 388935, 554091, 712522, 774214, 867517, 775063, 662596, 653025, 604683, 671332, 803591, 862185, 765101, 544031, 385923, 313098, 237193, 297614, 319464, 353629, 470226, 474338, 489179, 533625, 456019, 319316, 178844, 202618, 243854, 279057, 184253, 120562, 191858, 233322, 237341, 98122, -82056, -31896, 32359, 60550, 23164, 166375, 179358, 175441, 195836, 164436, 274319, 326314, 479503, 570975, 665620, 685480, 676184, 607404, 528761, 386650, 337440, 359452, 369646, 339835, 291367, 317621, 215199, 265618, 365610]
17505C65610N7072k2799j35458M243O2168K3360O6377J14020J45342M869p1137
17494F13667m9660N0366M4224q8552k9469k2210j01885K31143K38244j6885j35089
17483G33894o4123k2959j3820j03954j24247p7263j10266K8026M7318j21118L9390
17472B10878j32427n5434L6227J49808Q5673j9410K8393M4533Q7687R6991j7665
17461E15254m0826j05800N5216Q9903r4755o8042M3972P5639j26562j81217J4165
17450A76947l6740j42066Q0843O0446O5658k9520o9453l0396o7418J03268k6188
17439H5381O3769L0232r2960j68606n1078J35899j6842M9920M3985O5233J29234
17428B74167J1070q1076J08983p5484j27610L880k7339R0230K2289Q2014J03411
$$ y = [365610, 422682, 399883, 264425, 268668, 330836, 354196, 420573, 534593, 679935, 684804, 613667, 564007, 614373, 658597, 570045, 540576, 518366, 416481, 647624, 885868, 868983, 733894, 669771, 646812, 632992, 529038, 404791, 327528, 217262, 245288, 292606, 171488, 210878, 78451, 23017, 59244, 209052, 294725, 275315, 303708, 348241, 435928, 532919, 515254, 474428, 368628, 423844, 513747, 418992, 350950, 394922, 470561, 343999, 162782, 176947, 140207, -1859, 78984, 139430, 205088, 175568, 106115, 75719, 8301, 111569, 85381, 149150, 179382, 86422, -82184, -133262, 2637, -14205, 35715, 79700, 144933, 274167, 285237, 204161, 313144, 237660, 110050, 113930, 86591, 176821, 199110, 281124, 384535]
17417C84535r6389j37511m5674N8505j8398r7988j04986k4231J82826Q7525l3410
17406A54804l6521j11166o6170L5727O219R7344J70782J20096m2368o5120M324
17395B67951J5895p7O3702m9600l8247r1942j77733m1983P5651M9835R0635K2366
17383A86453j9869j1091j28138k26368J7811K6457J59315P6700J00096N4185j22746
17372A12805J2278J69842J6633K2341J2109j41241r5862j16174J8589m9514N1393
17361A3199J01822j08321p8234K2534L5323L8306P9568J1004k5712M9404L3172
17350A72065k809j755r9745j15592J1936J10321l248P773j5317k35656n7944J66844
17338f3127P8969J8993R0841n3060L3318J53326J5561j47914K8950K7048j73448
$$ y = [384535, 288146, 150635, 104961, 163466, 145068, 47080, -57906, -82137, 100689, 188214, 154804, 118283, 7117, -59053, -23326, -17107, 80237, 251019, 371115, 328747, 263627, 267951, 283846, 283769, 347471, 297871, 259624, 167682, -10051, -52034, 23617, 73452, 164087, 186453, 166584, 155493, 27355, -199013, -181202, -154745, 4570, 81270, 181366, 235551, 112805, 125083, 294925, 311558, 333899, 346008, 204767, 108905, -7269, 11320, -38194, 13199, 115021, 6700, -71534, -49000, -13677, 24629, 104197, 115201, 89489, 138893, 172065, 169256, 167501, 67756, -47836, -35900, 74421, 71173, 78946, 63629, -172027, -229971, -63127, 15842, 34835, 125676, 72616, 105934, 259260, 274821, 126907, 155857, 182905, 9457]
17327I457k47628J14537K00235P5546Q1342Q5039l3150j07950N6568j13773j56800
17316c6577O1182M7699O862J20151k7334p8422k0804n086m589r7628k5867M0975
17304a9438m4502o980K27496L1013r306M7712n4350n3588p5281j22746r704L2938
17292e6736L1194o8013J53084P0647j00054p4765Q9854O5935l185J3946L6490
17281A58397n3183r039K2276Q0043l8183n287m6701K7344K0945q7450k02173j52685
17269b85696j881K38704P0819J7710J20386m5264J2321j9824j00872o5622o7110
17258a26329J3238o999M5472J02615J21449n7883j25032P2522N0298j37454r3663
17247a41766R0041J05761Q355l3090M921J53404L580M8307p5091l4818m2999l0025
$$ y = [9457, -238171, -123634, 76601, 152147, 233489, 318528, 285378, 177428, 233996, 120223, -36577, 24605, 72304, 79166, 199317, 171983, 93561, 72757, 67671, 63082, -34546, -60413, -19438, -63940, -70920, 156576, 187589, 178283, 225995, 171645, 118057, 42776, -79970, -89674, -56736, -25542, -93555, 59529, 130176, 30122, -44643, 45211, 111146, 107961, 121907, 158397, 105214, 96175, 118451, 198494, 160311, 155024, 108323, 135667, 156612, 69162, -133011, -285696, -287577, -48873, 21946, 39656, 160042, 114778, 127099, 107275, 6403, -59219, -126329, -113091, -120090, -74618, 27997, 149446, 91563, -33469, 39053, 89351, -48103, -141766, -51725, 54036, 62391, 29301, 34222, 187626, 191206, 239513, 164422, 129604, 86605, 56580]
17235E6580l4338j50114m7061R1800R4606M6117N2321k4229j07758k2232k8588
17224g2896K2872n5830J4069j5241L5548P1439j3334p7457k9380N5366P4254l079
17212F331N3522Q2419K13868M1726n3882j63509q649j03519j95590j23777Q8148
17201a62912J50117J25899J23968j2213k2680n6253k2759R5887j5985n3595o7472
17190H2002j0074j41273j47404M7276J29866R4977j26781M088R0392m1900j0571
17179b9402M1372m6352L5641m87K4317L0287r9669N7989L185K2510j11751m4726
17167a17086J1033K4082R1873J22537O6240r277j7904Q1421j20450q0903j8937
17156C2629Q5288l0799m0459k2270o088n987k627K5062O4471J43284N9642n4972
$$ y = [56580, 22242, -127872, -174933, -83133, 11473, 57590, 109911, 85682, -22076, -44308, -72896, -50024, -105854, -91785, -107026, -71478, -39, -13373, -90830, -120210, -64844, 9410, 6331, 59853, 142272, 356140, 397866, 343984, 180475, 171826, 68307, -127283, -251060, -162912, -12795, 113104, 237072, 224859, 202179, 145926, 123167, 219054, 203069, 149474, 82002, 71928, -69345, -216749, -169473, -39607, 55370, -71411, -67323, 23069, -18831, -29402, 11970, -34382, 1259, 772, 25089, 55376, -44293, 13696, 16881, 39391, -72360, -117086, -106053, -81971, 9902, 132439, 198679, 189402, 171498, 252919, 132469, 51566, 32629, 117917, 87118, 46659, 24389, 18301, 12314, 9687, 34749, 99220, 242504, 302146, 247174]
17144B47174j02566j91230j92420L1463K58708J98714o6939j48800R178m5433
17134b151O185p3916M3783K7299J76637r2765n9164L6625m5376m4266p2923m9768
17122a49800J57269J26327o5933k0096R735j05186r2284M1529m847M7660n2813
17111a08439M653J34576O9056r0196r9942n34q724L2383N0355R6290P1764j9326
17099A31916L4521j05526p4097O8251J10085N210j74955J0855m1091j9553N3944
17088d40M8257k6664j17258K8038J24121n1537J677R9595J06441j22761p7851
17077A1618O3590k541l8106O7902J1866n0984Q3048R7415k9466p0227j0297Q1439
17065B15257J03930O2867j35369m5213R944K5535P231J4557q4466j27946L0047
$$ y = [247174, 144608, -46622, -239042, -207579, 51129, 249843, 182904, 34104, 43282, -2151, 4034, -69882, -26099, 1200, 177837, 85072, 25908, 62533, 17157, -27109, -100032, -149800, 7469, 133796, 67863, 47767, 57502, -47684, -139968, -98439, -103286, -55626, -108439, -103786, 30790, 99846, 9650, -90292, -90826, -99550, -67167, -16812, 79478, 151242, 131916, 166437, 60911, -13186, 55065, 165150, 170360, -4595, 6260, -34831, -54384, -440, 47817, 21153, -96105, -68067, 56054, 4517, 6194, 105789, 212230, 89469, 11618, 75208, 72667, 34561, 102463, 114329, 63345, 146393, 243808, 214342, 144115, 133818, 215257, 319187, 382054, 246685, 201472, 211416, 236951, 244182, 258739, 174273, 46327, 76374]
17054G6374Q0456J19306O2365o9641k14021j18455O11l3986J11199J01079M241
17043A19528P1956j25161j27818Q1375P8769n2124M0999N9921P2890o8878m4971
17032A06486J7761j29946k671J07298J2427K527N8006j8877o9209o9624N0222
17021F4400j7524n4202p7096o5162j18912O9402J82607P960n3239O9172p5752
17010f8346L1749P3737N0142J44415K6864r7088q3873q808M8173J26002O8503
16999C11470j9957k1283j04481O904j16781k09482o0410J06655Q03n0046k8858
16988a85466R8945j6702K4970J21252J45559K7317j6143q7170m0650M7897n6277
16977F3532L1321p8583o8897L2846P108J01592N9686O5698o8431n9737N4329Q3616
$$ y = [76374, 156830, 276136, 338501, 268860, 54839, -63616, -63005, -96991, 14208, 115287, 119528, 191484, 66323, -61495, 19880, 98649, 46525, 87524, 147445, 220335, 151457, 106486, 124247, -5699, -8370, 98928, 111355, 113882, 171888, 153011, 83802, 14178, 64400, 46876, -7326, -84422, -149584, -268496, -199094, -16487, -8527, -61766, 7406, -68346, -36597, 37140, 87282, 231697, 258561, 161473, 77600, 68792, 116965, 242967, 311470, 291513, 270230, 165749, 172653, 55872, -153610, -214020, -107365, -106562, -156608, -185466, -86521, -103223, -78253, 42999, 188558, 215875, 199732, 112562, 71912, 119809, 63532, 94853, 16270, -52627, -19781, -12673, 88919, 148605, 214303, 145872, 86135, 140464, 224080]
16965B24080j5891l7609j24485O6336J39090k1329j34198o4437m8426j7203j09033
16954a43105n2512J55308Q0693l4304n9026n7840j15099J26214P3205j551n2563
16943h0580r3368l680o1310N8457J02716j3122j3888n7441N2665N3827l6146p6095
16931a67965J26490M6138L7140l3175l5826k2771O7510K6043k0162m1365M9104
16920C1161P8528j23088o3628q6983m6653Q0416J74289n1020O7697Q0766L5301
16909A76786r4652j27166k0739P7834J46580r105k13161k5677O23O0895j3766
16898d1548M7526K8075L6926J78516N7510r8556j37354j10885J33112J13800L9077
16887B46199p3018j14903L0552J1041P333K1876k5529j17460J03952J11430j5298
$$ y = [224080, 208189, 170580, 46095, 112431, 251521, 230192, 95994, 31557, -16869, -34072, -143105, -195617, -40309, 40384, 6080, -52946, -110786, -225885, -99671, -26466, -28017, -80580, -173948, -177628, -238938, -180481, -77765, -90887, -104775, -162216, -109551, -55724, -91870, -167965, -41475, 4663, 41803, 8628, -27198, -49969, 17541, 43584, 23422, -17943, 31161, 109689, -13399, -77027, -164010, -210663, -130247, 44042, -6978, 60719, 141485, 176786, 82134, -45032, -65771, 12063, 158643, 149538, -63623, -89300, -88677, -27782, -41548, 5978, 34053, 70979, 249495, 307005, 208449, 71095, -39790, 93322, 207122, 246199, 173181, 58278, 88830, 99871, 107204, 129080, 103551, -13909, 90043, 201473, 186175]
16876A86175o2645j07891N096R5562P3779P399m9761p0816m8945J64704j20354
16865G2303j78215j22990N4412N9989Q9277m6664P8618R5035J0776P4258p442
16854A79357Q1942J12465j46550o7578m2213l0259m7492j59640L733p3118N405
16843a83948O7233J25287K1297J7932K8279l873j5286m4137J09917m2120M994
16832H5575p0328J2970M7770o2195m8214K7961j37375l8135l9590p4723K09329
16821h6955N704L0861L7533j81625n477R9799J6509M3575P923p65J9210n9747
16809g3455J626N5559j2202J7319j12207R3608N1836L933o9402o2512K4468J85297
16797A03868R9774N8200o6355k25675j52669J16692N0357N5108m5674m64J9913
$$ y = [186175, 123530, 15639, 20735, 116297, 190076, 197475, 147714, 76898, 27953, 192657, 72303, -105912, -228902, -174490, -114501, -25224, -71888, 6730, 101765, 112541, 186799, 179357, 261299, 373764, 227214, 159636, 117423, 87164, 39672, -119968, -116235, -189353, -183948, -116715, 8572, 29869, 47801, 76080, 72207, 56921, 12784, 122701, 80581, 85575, 15247, 28217, 75987, 13792, -34422, -6461, -143836, -181971, -221561, -296284, -86955, -81251, -50390, -12857, -194482, -199959, -100160, -83651, -40076, -32153, -32918, -13708, -73455, -71829, -16270, -28472, -11153, -123360, -29752, 22084, 26017, -43385, -105897, -81429, 103868, 203642, 261842, 195487, -30188, -182857, -66165, -15808, 39300, -6374, -6838, 13075]
16786A3075q7972N2410j1575m8881l7753L3399J58104p2316M5506p1042j4853
16775d1898n833L289o1823M9200J42210K228L2549l0847J2250p4788j25957k403
16763a01823P8816J5169k9999P1582Q9774J06302p3988j40753p9908J17103P8081
16752A30356L6363j6774L5433o7262p3804p4625p6822N8117K2846J31233j43233
16741c8172J3557J56918M9007j70980l5063n9547r6497K7812J2732p1473n2966
16730b64672L5320J36255J05565J1832M708j07985n0297R5138m0479M786P7197
16719G368j5770j01259O8602m0162q0208J65786l1314p7814K4155L4520J88161
16708A42065L5706L0108n1698k2717P227l8419j15117K2419m1675O9916J4894
$$ y = [13075, -74897, -22487, -34062, -82943, -120696, -87297, 70807, -1509, 43997, -27045, -41898, -47731, -44442, -106265, -57065, 85145, 87373, 119922, 89075, 101325, 26537, -99420, -101823, -23007, -7838, -37837, 33745, 123519, 229821, 155833, 15080, -64828, 52275, 130356, 166719, 149945, 185378, 118116, 44312, -30313, -107135, -49018, -26172, 105061, -38172, -24615, 132303, 181310, 10330, -24733, -84280, -180777, -152965, -140233, -211706, -264672, -229352, -93097, 12468, 24300, 29008, -78977, -129274, -34136, -74615, -69829, 7368, -8402, -109661, -41059, -81221, -161429, 4357, -26957, -104771, -80616, -46096, 142065, 177771, 207879, 156181, 133464, 140691, 102272, -12845, 9574, -32101, 37815, 52709]
16697E2709r5218j7909N0561p9265J32608K15319j27341r7758n5726k3277q3905
16686a29202L0466Q5234o1987K6962Q5321J6747q615M7708p612q0226l8818p3337
16674a07359o0975N966k4597L67l6271J12742P5786j0031p1918J5796l5650k2312
16662a58456m3602J11187L0739J8478J08075N9245l1905R4288N7644j7489l1909
16651A96295P1960L0900q4349q6440O6464k10303M6340L9067M5489m393q5631
16640B5399j49102Q9741M6233N1086r044j00377Q9904K3477j06826l0748N3352
16629a6905q9232N0605O3017J02518K0440m6172R067p0432q9054N1896l7487o9055
16617a20794M2326J35877r1941R3295O4798q4319J25717m3466M7172K5712j36368
$$ y = [52709, -42509, -60418, -9857, -89122, 43486, 258805, 131464, 33706, -22020, -45297, -129202, -98736, -13502, -75489, -48527, 36794, 53541, 44926, 92634, 85022, 4796, -34022, -107359, -168334, -162368, -186965, -186598, -222869, -110127, -34341, -44372, -116290, -100494, -136144, -158456, -202058, -90871, -60132, -41654, 66421, 125666, 93761, 188049, 245693, 228204, 196295, 268255, 299155, 214806, 128366, 194830, -15473, 30867, 69934, 115423, 111030, 25399, -123703, -33962, 12271, 63357, 54313, -46064, 43840, 67317, -39509, -70257, -16905, -106137, -55532, 7485, 110003, 130443, 84271, 93338, 22906, -66148, -14252, -51739, -120794, -78468, 57409, -34532, 58763, 123561, 39242, 164959, 121493, 168665, 194377, 58009]
16606E8009J2532J41737j3286r6777j37j05320l5726n351r704m8391m1693j7636
16594a61743J82491M4399n861J0278j28954j2508J12692Q3152N5789j5818o7147
16583I6770J03987o8429j02073j89324k2891K43741Q8553k1594j05428p5411N5070
16572B971J33299n4495r7294K6875J03752j42697o5181J4503L4283L0378J05991
16561I2385j6647m5609p5045j01794o032L5448k0172J80849J9272k14590O9382
16550h2553M3569L3547J53437r9750j24034J2857L6596n0852J40075M5141j67545
16539e9512j29075K8190Q3631P7127L8270J04980q7952l8419P5001N7544l3731
16528A16054j5522q6438M04K0418j51903j39983J04180K44815R7756q8863J4657
$$ y = [58009, 70541, 212278, 198992, 102215, 102078, -3242, -38968, -44319, -54023, -102414, -144107, -161743, 20748, 65147, 59286, 69564, -59390, -71898, 40794, 123946, 179735, 163917, 96770, 200757, 132328, 30255, -159069, -181960, 61781, 150334, 128740, 23312, -52099, 2971, 136270, 81775, -15519, 11356, 115108, -27589, -92770, -78267, -43984, -13606, 92385, 75738, 30129, -44916, -146710, -152742, -117294, -137466, 43383, 62655, -151935, -82553, -38984, -5437, 148000, 48250, -75784, -62927, -26331, -77183, 62892, 108033, -59512, -188587, -160397, -76766, 361, 38631, 143611, 55659, 17240, 92241, 149785, 116054, 100532, 14094, 14498, 34916, -116987, -256970, -152790, 92025, 189781, 100918, 115575]
16517A15575p1760l9726M6205j43848j47881o933P6141J18653J12397N2623N7814
16506A69260m6619j49826j48435Q8130K9263p748P8983j9650j83161j44380M9157
16495b85026J33195K66896n8847j257r379q7796k0865M634o9221m2357L2940R4890
16483d2193m3538O5473j6256j9085M3329O8981k6158Q5708m8330o9699J4143n9942
16471d7567p776J4135P435J17596J53815J0808p7198j07477J9964O415O4609N7532
16459B12291N8977M792o4819n4658m7694o5576M9843o763n2610n251q2931O630
16447d7769J49726j4264J28695M1244L0332n1345j49874K8750K5416p9519K4144
16436H5536R7744L0170p7909n3167m7781j24263J8803P9416M7627L0042m3593
$$ y = [115575, 43815, 4089, 50294, -93554, -241435, -248368, -172227, -53574, 58823, 111446, 169260, 122641, -27185, -175620, -87490, -58227, -65975, 13008, -6642, -189803, -334183, -285026, -151831, 115065, 56218, 54961, 45582, -42214, -63079, -58445, -127666, -170023, -137083, -42193, -85731, -20258, -36514, -55599, -12270, 56711, 30553, 116261, 67931, -1768, 12375, -47567, -55343, -41208, -33773, 83823, 237638, 248446, 171248, 63771, 83735, 90150, 154759, 212291, 271268, 276060, 211241, 156583, 108889, 43313, 93156, 86393, 33783, 28532, -54399, -47769, 101957, 87693, 216388, 257632, 287964, 236619, 86745, 115495, 140911, 61392, 85536, 183280, 213450, 135541, 82374, 34593, -89670, -70867, 8549, 56176, 86218, 42625]
16425D2625j41832L1298R3955r1185l4275j8672j43206Q861m4912J32198J27134
16414c8011j17800K2267J62270o5348j36499o5840J8689J90617M1491P232K7743
16403D6811K8077N5825Q8559m0203o3123J0133n1784M3640M387m0933l2141o7857
16391a8609K5787r3526Q4505O8652K3975o2122n1525P7397J08299l930j86724
16380b7821n3549J3250r4608M2372L3173m0151P6138P8548Q2562J35282N9741
16369C04937p9767j19230j47723k64O7389Q1363k0933J4293q9148j54260N9752
16358h3591P1547k2436j3716k2595l8388R216q240p6958N1580R9184n4754O4899
16346b4252m1932M9J31073k1920N185J00208R9006J932j47492m8502M6985j6239
$$ y = [42625, -99207, -67909, 26046, -65139, -99414, -118086, -261292, -252431, -297343, -165145, -38011, -155811, -133544, 28726, -36622, -173121, -238961, -220272, -29655, 11836, 19068, 46811, 74888, 130713, 219272, 179069, 115946, 126079, 74295, 117935, 122322, 81389, 49248, -18609, 7178, -86348, -1843, 66809, 90784, 28662, -22863, 54534, 162833, 158903, -27821, -81370, -68120, -162728, -120356, -87183, -127334, -51196, 27352, 109914, 245196, 304937, 225170, 105940, -41783, -42047, 25342, 106705, 85772, 100065, 10917, -143343, -83591, -12044, -34480, -48196, -70791, -109179, -99963, -108203, -185161, -133581, -34397, -89151, -24252, -66184, -66135, 64938, 43018, 48203, 148411, 247417, 249349, 101857, 53355, 100340, 84101]
16334H4101j1144o9777m0469M4425j9679q8641j2280P1291o2010l5604k8897J03006
16322f5678P2248k4657M9561m6250m6633J5608Q0912J4006n0235p5617N5842L4832
16310A3939j53004r8548J38691J15610m3227j48792L9240J82559J39036N9503
16300B45007k25176r3993O9540Q8875J8581M6448J7169j38339J4709N6551m645
16289I4727N2155J7549j62555j26143j5388l5288J03280j23089M5147N4242K7429
16278f7934q6421j197Q2123J6217k0212L5032O6232l0266l9305J18660j7329K4766
16266H0366L7377l059m8124j95180K3150J73036m9735j12750l2445J64257J6294
16255E3187N8059R684O1824P8922r0188j89188j42660m5691J89029J2726J7721
$$ y = [84101, 72957, 3180, -37289, 7136, -12543, -101184, -113464, -42173, -104183, -139787, -168684, -65678, 6570, -18087, 31474, -14776, -61409, -45801, 35111, 49117, -1118, -76735, -20893, 13939, -139065, -237613, -98922, 16688, -26539, -175331, -136091, 46468, 185504, 245007, 19831, -74162, -4622, 84253, 102834, 149282, 166451, 28112, 42821, 99372, 94727, 146882, 164431, 1876, -124267, -139655, -174943, -71663, -194752, -149605, -95363, -67934, -154355, -155552, -73429, -57212, -77424, -42392, 23840, -6426, -45731, 72929, 55600, 80366, 117743, 114684, 66560, -128620, -105470, 67566, 17831, -94919, -127364, 36893, 53187, 111246, 120930, 182754, 261676, 171488, -17700, -160360, -206051, -17022, -4296, 13425]
16244A3425l8384P0301M1065j36479j11636L1799J15943j7576q8024Q2540N0820
16233A3794j44735q6808k0080R4555P8665J013K3204J40922j7956j3221Q1430
16222A50783o5072p0898M7617J03334J11088n1859j40005l6890l2868j3126j03995
16211a01891O1052l494J7584n6247J01882N239j09876Q6540m1722O7762J01525
16200A28354j32138j11276j1558P6074Q8162O0788n4373j85334J0391O1081O1062
16189h767Q406K6886O541P2183Q3360k4733N8621j28919k6243J04370j09973j30909
16177f9177R4420L2834j03892j31998O9107O6872N5676M142k3422j07467l6002
16166a48907N7488P6704n5135J4309l7952r8075L3646J59615N3525k4590O213
$$ y = [13425, -24959, 45342, 86407, -50072, -161708, -129909, -13966, -31542, -119566, -37026, 13794, -130941, -217749, -237829, -143274, -64609, -63596, -40392, 100530, 82574, 69353, 150783, 85711, 14813, 62430, 165764, 276852, 224993, 84988, 48098, 15230, 2104, -101891, -40839, -44333, -26749, -82996, 18886, 24125, -85751, 789, -40933, 26829, 128354, -3784, -115060, -126618, -50544, 37618, 98406, 44033, -141301, -130910, -69829, -8767, -361, 26525, 33066, 105249, 188609, 163876, 222497, 93578, 67335, 171705, 61732, -69177, 25243, 58077, -45815, -177813, -108706, -41834, 13842, 17984, -5438, -112905, -148907, -91419, -14715, -69850, -55541, -93493, -191568, -157922, 1693, 55218, 30628, 36841]
16155C6841Q8603Q8375O0098j83435q9858M876k4610N8436Q2011l27k3928p7442
16143A9640j13083n9121j11121L0124J8555O2656O1991M0744n8232J19716N6469
16132F8338o1556p0106n9426J02624N7265L0088l3418q0011K9394l2927J40597
16121I0862j15875L5023j02956n4119l4392M8585L5269J307P0044O2824o2510
16110b5938j44827j8734K4499L685L0623q3326J7207J02887q2143N8010K7082
16099i0975K9436P3823N99q0062q4058L2258O8856K3361Q4593L6771j0654p7445
16087F503o8726q6721j1340p6917J75417J9040O636P0666K8092L148J7583N8457
16075A41838j71880j14178o7959p9045J88457l965L4648Q5084K15111J8763j12856
$$ y = [36841, 125444, 213819, 273917, 90482, 624, 5500, -19110, 39326, 121337, 121010, 97082, 19640, -93443, -152564, -263685, -233561, -215006, -152350, -90359, -49615, -107847, 11869, 68338, 6782, -63324, -122750, -20126, 37139, 67227, 33809, -46202, -16808, -49735, 90862, -25013, 10010, -92946, -147065, -181457, -132872, -97603, -96296, -26252, 36572, -25938, -170765, -189499, -165000, -161315, -130692, -214018, -196811, -93924, -176067, -118057, -90975, -61539, 12284, 12883, -67179, -151237, -118979, -50123, -26762, 57831, 94602, 83948, 6503, -62223, -148944, -160284, -237201, -61784, -42744, -36108, 34558, 62650, 65798, 83381, 141838, -30042, -144220, -212179, -291224, -102767, -106732, -72084, 13000, 228111, 246874, 134018]
16064A34018k4255J39830K3419j88191o1807J8090K8774m2847r2248l018O1812
16053f423R4759m2726j13848P2967j8542k3844J01406N7837Q3282P2088j48062
16042A28894j50267o9762Q6878m370K9355J8661J2999q0644K7919k1429J08568
16031H6802n9332j38166M3171L6992n4993L0013K260j29260L9131q8927k866P3696
16019a61479J11502J27788r2999k8025J70505J19114r1997r0961N6687j8364k0985
16008H0786M5353k9640j68782K778N7105Q6636J54364M254j04118j6168k3399
15997H9169j2352j49219J5562K9179r5883N882j8505M4077l7174o498j8843M1095
15985a13510p200J40605R5064R4325M2379n5656j89168j48687o2170R9043J39842
$$ y = [134018, 109763, 249593, 273012, 84821, 23014, 41104, 69878, 27031, -65217, -68235, -6423, 88336, 45610, -68238, 4729, -13813, -37657, 63749, 121586, 204868, 276956, 128894, -21373, -91135, -4257, -8627, 20728, 39389, 52388, -28256, -337, -21766, 86802, 27470, -110696, -67525, -30533, -85526, -55513, -53253, -182513, -143382, -232309, -235175, -161479, -49977, 77811, -15188, -43213, 127292, 246406, 154409, 63448, 120135, 101771, 80786, 126139, 96499, -72283, -69505, -12400, 74236, 228600, 232854, 128736, 112568, 89169, 76817, -72402, -56840, -27661, -123544, -117662, -136167, -92090, -129264, -135762, -154605, -113510, -120710, 19895, 114959, 209284, 251663, 196007, 6839, -141848, -204018, -104975, 34867]
15974C4867m8837j54193K362R5794M3232J25941J60356j11050q8372j43730n1292
15963a34922J628M984l7714M6325J32642l8897J05426L8169M2317j63m5224o1032
15951E3539q5140J00067M245m9248j01433j45584l1029N4144J9832K2000J93853
15940C5246J09583o7282j8774j37119j29404J27188Q2177Q591P4311Q075o5343
15929B7249k0873N3532j0109K8939l6736m6049j8851J72892P1969l7439k16100
15918c1576n4875J04742N7917O8733J18698j3561q635o9363o6183j04944Q3713
15907H4666L2695q691P2548j54586o0387K8069J5576l0757j36512k0649N6815
15896a21213p1759L3693k1033J5784R6178J8921j5016J4948k7751q9343l9814
$$ y = [34867, -13970, -168163, -165801, -70007, -26775, 99166, 259522, 148472, 60100, -83630, -134922, -133294, -128310, -166024, -119699, 12943, -25954, 79472, 117641, 159958, 159795, 114571, 53539, -31601, 68466, 72711, 23463, -77970, -223554, -254583, -200439, -180607, -158607, 35246, 144829, 77547, 58773, -78346, -207750, -80562, 1615, 10206, 84517, 92592, 27249, 6376, 59908, 49799, 78738, 42002, -4047, -22898, 149994, 221963, 184524, -31576, -86451, 18291, 76208, 144941, 263639, 250078, 241443, 172080, 105897, 953, 84666, 117361, 108670, 181218, 26632, -33755, -5686, 9890, -20867, -157379, -178028, -121213, -192972, -159279, -180312, -164528, -68350, -49429, -64445, -49497, -77248, -166591, -206405]
15885b06405P1982J10100k212L6712N7363N1207M1371p1495j38069j20360o7710
15874b37516J24862J20943R29K0663j17j7492o0771N9276l6977M0758O0401o4419
15862A0540K2198K3902q3825p2481j74943L0949J36911l9444M7350N5725R9258
15851E6140L5314q3043J2141n7954p4105P1045K4021N0119o9569N6126K63467
15840B83702J4618l1065q9294j60366p7491k3149m3627N4978K8222R1015m1770
15829E773J185O3109l7477k1854m3840r1432L3290J8826P3400q415L1094R940
15817C3599O7448o8060o3609J9090J5816M1805j46868q8045n5115K5436L4623
15806a83880L9827m3052m0151n8381j2343P5502k4260N1972j6143K8089J96631
$$ y = [-206405, -134423, -24323, -26535, 10177, 67540, 118747, 160118, 88623, -49446, -169806, -237516, -112654, 8289, 9218, 29881, 29764, 12272, -48499, 10777, -26200, 14558, 74959, 10540, 32738, 56640, -27185, -99666, -274609, -243660, -106749, -146193, -98843, -43118, 56140, 91454, 8411, 20552, -37402, -111507, -40462, -16441, 33678, -35891, 20235, 283702, 298320, 267255, 177961, 17595, -59896, -83045, -126672, -71694, -43472, 47543, 5773, 6958, 70067, 32590, 10736, -33104, -124536, -91246, -72420, 980, -7435, 23659, 33599, 101047, 32987, -30622, -11532, 4284, 46089, -100779, -188824, -243939, -218503, -183880, -144053, -187105, -227256, -285637, -297980, -222478, -246738, -194766, -210909, -182820, 13811]
15795A3811J36396N0544j82455j25266o3429n7397N1831N6310J06698J3070M7280
15784D7393m0531M4580m4528N994M2596r9021p1717k0471R6654P648j4476q8736
15772a34615j9399R0038J44765M234j49483j54336q0775J16206k1520J579J17278
15761h6028J12711J12889j17794p1307l3564Q6552k0171j6259j11068k0356J06994
15750e7401J04349p8275j10366J14917J66619j8332r3425J6482j4264o5752j43355
15739a78803L8712O4737J54439L3041p7548p28K5577l5970j91553j50211j1823
15728c30130J14014J57688P9490M4532J3600m8802p3775p0499n5407J3978J0828
15717a44483n617n3604J69725J84175l2186j99296J9933K0258K2792J11776J9728
$$ y = [13811, 150207, 200751, 18296, -106970, -170399, -227796, -175965, -119655, -12957, 113, 47393, 6862, 51442, 6914, 12908, 55504, -43517, -115234, -135705, -39051, -31403, -45879, -134615, -154014, -63976, 80789, 85023, -64460, -218796, -299571, -183365, -204885, -203306, -86028, 26683, 139572, 21778, -49529, -83093, 3459, -16712, -32971, -144039, -164395, -57401, 46948, -31327, -141693, -26776, 139843, 121511, 28086, 44568, 30304, -35448, -178803, -140091, -75354, 79085, 112126, 34578, 33850, 59427, 23457, -168096, -318307, -330130, -216116, -58428, 21062, 65594, 79194, 30392, -43383, -113882, -169289, -155311, -144483, -150100, -203704, -33979, 150196, 118010, -81286, -61353, -41095, -18303, 93473, 113201]
15706A13201j03843l2366m5250N780M2451p7497P999Q4149J25689J310M035o3708
15694F1950L3629m0885o468l7009r6909m0178J49187J01329m9881p6338R2699
15683I1126K4355k6648J0889J3615k46487j02941p0718j3970N7651m7445J18524
15672a92049J80080J12399M2739m8738l7995p7833l088K2020N331P3046n2390
15661B3522o6888j14908j2309o584J56892M5162p6569m9914P3420N7775m8910
15650a9311P8529m7431q1494L8375J70515O1339K1402m2031j9456L0461M8088
15639B38986q9501r1709J33693O1754r6081j18828N897j11603r6245M6372k1276
15628a38541K8837j8619R6670j9013j56083j0312J09685Q7702K6194k5463n6851
$$ y = [113201, 9358, -23008, -68258, -62478, -20027, -97524, -89525, -5376, 120313, 121623, 125658, 61950, 95579, 54694, 48226, 11217, -85692, -125870, 23317, 124646, 74765, -1573, 91126, 115481, 88833, 99722, 113337, -133150, -236091, -306809, -320779, -263128, -310573, -192049, -11969, 100430, 143169, 94431, 56436, -21397, -24485, -2465, 2866, 75912, 23522, -43366, -158274, -170583, -177167, -20275, 24887, -51682, -101596, -28176, 29599, -19311, 59218, 11787, -69707, -31332, 139183, 200522, 221924, 179893, 160437, 190898, 238986, 149485, 57776, 191469, 253223, 157142, 38314, 44211, -67392, -163637, -117265, -138541, -109704, -128323, -31653, -50666, -206749, -217061, -107376, -19674, 6520, -18943, -75794]
15617g5794J03227r602l5035J15295p723n0049J74454l7897j35901j27951K1826
15606f5150R1286J8382l5048o0576P1807Q4452Q407k730J5565q3776r6279m6190
15594i9850p9724N0730K0768J16689K3637k3269L9947n8225n9086o6933J12112
15583b3204Q7139j30794j1165L2522N9404k9859j4578K9112r1243r1699m4393
15572b28758P8536R5735j1393J53257K5585l4909m9884m3058j0631m4831Q8510
15561A8159j10951m3055K7596j6190R4642J05522k5127j12314J5575J15732m1771
15550B7818N0428L8855n4184q1343J13001N2342k0176M1686j13919K902o040j36975
15538h5605o829L2778J1127m4130Q6829O0406L0406R1570p043k6398N7995Q1879
$$ y = [-75794, 27433, 17831, -17204, 98091, 90368, 40319, 214773, 176876, 40975, -86976, -65150, 26136, 44518, 9470, -51106, 20701, 105153, 113560, 110830, 126395, 42619, -53660, -99850, -179574, -128844, -108076, 8613, 32250, 8981, 48928, -9297, -68383, -135316, -23204, 63935, -66859, -78024, -45502, 13902, -15957, -30535, -1423, -92666, -184365, -228758, -150222, -54487, -65880, 87377, 112962, 78053, 28169, -14889, -25520, -70351, 18159, -92792, -135847, -108251, -124441, -29799, 75723, 50596, -61718, -46143, 69589, 27818, 78246, 117101, 62917, -18426, 94575, 146917, 126741, 168427, 54508, 57410, 51370, -85605, -92434, -59656, -48529, -92659, -5830, 54576, 84982, 176552, 169509, 143111, 201106, 282985]
15526B82985r9265j41756m9378o0307J30356j17786J39447J11585j50531j99124
15516a53774R5822O1112K1401p7807j2900r1842n5308l7206N0988m7986J09646
15505a37854l6271m4870J68169K0016k8689N2641J3799K8914k3850j26518j61725
15494b76238n510K70335J02152j4626r8855j17710j20838J17563J11037N1588
15484A8898k8990j08674n1553J4446L9072J24231m9049q4169l2534R0049K4679
15473d3594p7683J43804K402m15J28051J6627o2591m1938K1014M0644j2543j63139
15461d9361n8138J24965K0598M449l5155M0187N0181J1705j06884j25492j17535
15450b40480K8296J90228m4319J868m0198L7705M0862M2653j22016j60379J0435
$$ y = [282985, 183720, 41964, -7414, -67721, 62635, -55151, 84296, 195881, 45350, -153774, -57952, 3160, 24561, -53246, -66146, -157988, -213296, -250502, -199514, -247500, -137854, -174125, -218995, -50826, -30810, -59499, -6858, 6941, 35855, 12005, -114513, -276238, -281748, -11413, 90739, 76113, -22742, -140452, -261290, -143727, -32690, 18898, -10092, -118766, -170319, -155873, -116801, 7430, -41619, -125788, -158322, -68273, -43594, -121277, 22527, 24929, 24514, 152565, 169192, 106601, 64663, 85677, 126321, 113778, -49361, -107499, 17466, 38064, 42513, 7358, 47545, 97726, 109431, 2547, -122945, -240480, -212184, -21956, -66275, -64407, -104605, -66900, -26038, 16615, -105401, -265780, -255345]
15439b55345P1495Q4759N4459M3287k2866k2807J8038k2833j14077M561R3393
15428f7936P7340J2627j64242r4137P5992q228J3217J72390J11307R0508n4252
15417A64586K7749K737k585L2949r7489q3076j13997n7656K8371q612j2518J0209
15405a09332l2426L0310J42354l5224k7678O422k0057O1029J3147j3433O651K6233
15393D7996L5749M205L7291m2941k42535j06680Q6399J08029K10527Q2840n2080
15382A68800j54132M5355m7673r7156K1387R0232j11898k4056q1185L2017J05622
15371e2687J42297o4045m6935O07K913j06634P757L0327N2117O5798j1025O0319
15359H0809M2166O3243p2568r6416L8292j31895j18404K0551M5821K7139J0773
$$ y = [-255345, -183850, -99091, -44632, -1345, -24211, -47018, -28980, -51813, -165890, -161329, -67936, 9404, 22031, -142211, -236348, -160356, -168584, -155367, 17023, 128330, 218838, 164586, 192335, 195072, 192487, 225436, 127947, 44871, -69126, -126782, -98411, -107023, -119541, -109332, -141758, -111448, 30906, -4318, -31996, -25574, -45631, 15398, 28545, 15112, 21763, 47996, 83745, 87950, 125241, 82300, -160235, -266915, -180516, -72487, 138040, 220880, 168800, 14668, 60023, 12350, -84806, -63419, 26813, -85085, -109141, -190326, -158309, -52687, 89610, 25565, -21370, -20763, -17850, -124484, -116727, -86400, -34283, 31515, 20490, 80809, 122975, 186218, 113650, 17234, 55526, -76369, -194773, -174222, -128401, -101262, -90489]
15348i0489K5091J63695Q9744n2527j14950p0357J62793N0040j8015n1967j18910
15337b5852j19920N8231L5405L4103K6199o1071o8075j30521L0507P2688R7401
15326e0905Q7232M0353j04327J6580J6812K3678j38527k4179o5961K5330J11266
15315f2648J95528j77735j60382N6575O223k4426L8587J5023P1027Q1971J5413
15304E5156L3522n2495o0823j8032l5556j07561r0222p1083J07867J42915O6253
15293c0059j03213j57688J78590J43280O6022R2840J8901j12472n5115P8913n4660
15282F5339l2689p4875j6448O0200J17107o2698j47280l730R8404Q8147R3022
15271A84499n28k5786o7513j25928J2893k5115r2739J80382J25902l577J4820
$$ y = [-90489, -65398, 98297, 188041, 135514, 20564, -49793, 113000, 163040, 145025, 93058, -25852, -145772, -87541, -52136, -18033, 8166, -52905, -120980, -251501, -220994, -148306, -50905, 36327, 76680, -27647, -11067, 5745, 29423, -109104, -133283, -199244, -173914, -62648, 132880, -44855, -205237, -148662, -142439, -166865, -128278, -113255, -42228, 39743, 55156, 88678, 36183, -24640, -42672, -78228, -185789, -276011, -347094, -239227, -96312, -30059, -133272, -290960, -112370, 30910, 96932, 189772, 208673, 96201, 41086, 119999, 65339, 32650, -42225, -58673, 1527, 118634, 55936, -91344, -95074, 3330, 91477, 184499, 183971, 158185, 90672, -35256, -22363, -47478, -140217, 40165, 166067, 162490, 177310]
15260A77310N5012j1831j70444k10996j9088M6534n5220J81316O9322j11211n2503
15249a01799J01076J13529k3588j01693P652n9194m2651O4020J22723l5915m1612
15238B548M7869K5164J48024O955k01995r2358m5618L9585J53724M5907M1637
15227A71442j19461L8474K5391k2234O5498q0958j24936l0899k3303m283J07357
15216B088O0018N5013j79157l5006J09308m2066j79742l7832P6242j9667n3350
15205b44151N8871J18077L0977j00879l0119o0321m2085L500o4026J66380L1806
15194a31970j89791R7008K15386O0327j02602l0367J028J07181j08161r6877m1057
15183b19895j18868M0364J08463j320o9576P477J02935m3520O0893J01166K2774
$$ y = [177310, 232322, 220491, 50047, -160949, -180037, -133503, -188723, -7407, 61915, -49296, -101799, -723, 112806, 89218, -12475, -4823, -64017, -106668, -42648, 80075, 44160, 2548, 50417, 75581, 223605, 230560, 28565, -63793, -109411, -69826, 83898, 129805, 171442, 51981, 90455, 115846, 93612, 159110, 78152, -46784, -77683, -100986, -105269, 2088, 62106, 117119, -62038, -97044, 12264, -29802, -209544, -247376, -171134, -190801, -244151, -185280, -67203, -36226, -137105, -167224, -227545, -269630, -266130, -330156, -163776, -131970, -321761, -224753, -9367, 50960, -51642, -82009, -80981, 26200, -81961, -178838, -219895, -338763, -298399, -189936, -191256, -260832, -253355, -150420, -193940, -133047, -31881, -9107]
15172i107j03765P3469J16669J9749K654j27731q4812j1695m432R9173J26416
15161I6588l7086m2949j28856p7482l4749k5489M4725N2398J8126J10014j4150
15150c8910K4986j29698j791P135l5395K8226J16494J48372j16116j9573r8277
15139a14547j0204k8173o78m0567l6918L8950L7635R682N5134k8905J35149O7230
15127H3788m4005j36982q4131J06873J06789L6822Q640k01379p4138J29067J84011
15116A15355N575j15703p4650M7535J03599j21013o6206q737M723L8229J0568
15105f0725Q2730M3864O8920N6542o2976N0840l1850J03441j68108r9154k204
15094a8680J8411n5338j18622l8969J9955R3658O0085k334p2278l9097R9096J98404
$$ y = [-9107, -112872, -39403, 77266, 97015, 99669, -28062, -112874, -124569, -129001, -29828, 96588, 59502, 16553, -112303, -189785, -224534, -250023, -205298, -152900, -134774, -24760, -38910, -13924, -143622, -145413, -138278, -173673, -145447, -28953, 119419, 3303, -16270, -114547, -124751, -152924, -153602, -194169, -231087, -192137, -154502, -144820, -89686, -118591, 16558, 83788, 39783, -97199, -181330, -74457, 32332, 69154, 77794, -123585, -197723, -68656, 115355, 120930, 5227, -69423, -21888, 81711, -39302, -105508, -114245, -109522, -71293, -60725, 22005, 65869, 134789, 191331, 128355, 179195, 147345, 250786, 82678, -16476, -18680, -269, -55607, -174229, -213198, -193243, -99585, -39500, -41834, -114112, -153209, -54113, 144291]
15082A44291L1126J8065m753l7418j6857j47677J5425L318k7782J0800J33451
15071A21989J49480n2519r1137j15848k9995J07808M5971k9146j50121R064Q3792
15060D9338J10686l2376j21563J0885p0634N242J32177N013j52586k7152j17170
15049b08140Q2490J24213L3472m3179l7701r8788M5574l1504r0077M6319O4937
15038a12384q1774J43300M5419o1216n5700P852J03220L2052j71829j09121J57367
15027a02814J38276m8484k302l5635M5075R869K0001J4360j92502L067M8677l4675
15015a37087O9639R0879J34410j5823o9868j26059l5150j4620O4545Q145J0970
15004b0019r9611L9421k7075R293r865M2848q1113L4942J3881l7181n8113O6544
$$ y = [144291, 175417, 193482, 188729, 151311, 134454, -13223, 2202, 5520, -22262, -11462, 121989, 271469, 218950, 127813, 11965, -18030, 89778, 135749, 106603, -43518, -34454, 49338, 160024, 127648, 6085, 16970, -53664, -48422, 83755, 88768, -63818, -90970, -208140, -125650, -1437, 32035, -11144, -48845, -147633, -102059, -133563, -223640, -177321, -112384, -194158, -50858, -5439, -66655, -122355, -114503, -11283, 20769, -151060, -260181, -102814, 35462, -13022, -15324, -50959, -5884, 3985, 23986, 38346, -154156, -151089, -102412, -137087, -67448, 23431, 157841, 142018, 72150, -53909, -89059, -103679, -39134, -30989, -20019, -119630, -80209, -107284, -97991, -107856, -65008, -146121, -111179, -97298, -134479, -192592, -126048]
14992a26048O3977l3603k379j576j4648Q5435p360L8221M953J06788n7039n8810
14980b089J07607O0181j31976j54109n2148J5785K8585n8253J8385r4673K8614
14969b34091K3298M9680N9110j8981K3056J6996l564m5605q2676r5674J8909J02719
14957a86823J64834N7693R697p3909k52104n8935Q6674P1336O5479R7234P6846
14946E8022p7430K3366M8739n5806J09038n2042j63937R49P0139j2642J07500
14935E5896K3659J05043l1712j70176k3557n4020J2004R7966L6905j1002o5190
14924b4184q3566K0065k0910m0818J09826m2031K1272J02774J8535O371r4615
14913b7281j28012J8004J871M6206N6538m1227n648r6673m9477J3303O7561n4022
$$ y = [-126048, -62071, -95674, -98053, -99629, -114277, -28842, -36202, 2019, 6972, 113760, 56721, -2089, 105518, 165699, 33723, -120386, -172534, -156749, -128164, -186417, -168032, -262705, -234091, -210793, -161113, -102003, -120984, -97928, -80932, -84496, -130101, -212777, -308451, -289542, -186823, -21989, 35704, 45401, -28508, -280612, -339547, -252873, -181537, -116058, -18824, 58022, -19408, 3958, 52697, -3109, 105929, 53887, -110050, -109101, -38962, -51604, 55896, 79555, 184598, 152886, -17290, -40847, -94867, -82863, 15103, 52008, 41006, -24184, -107750, -87685, -108595, -149413, -39587, -81618, -60346, 42428, 60963, 67334, -27281, -155293, -137289, -135418, -89212, -32674, -73901, -79549, -176222, -225699, -212396, -144835, -198857]
14901a98857k6616N5188q1472O4868l0202m0664J49188J51254J65485k8695q2568
14890I6909j57488J1243M2194o5052M4479K4751M3618R3010L4295j07247k1021
14879C9691L0450l229j08204m1753P7040j2201o6040r0956l829q688N870O9002
14867a12847O6491j71962j30355J12429J19464R3051r0347m8628K3949K5211k6877
14856a40421J59356j878o6076q364o4588M0016k571n9819o269K839R2628K3927
14844c1220Q442M0575m1836n3194J05568J37856l1670o4257j71916L4940J77030
14833A10318n6040p1930q8045M6279J20755q65n8387q9054k2979l9141o9093m0140
14821b58322O3934N2681o2487l3442J06805N933L0768N4540r5496M8423K8659
$$ y = [-198857, -225473, -170285, -251757, -186889, -217091, -257755, -108567, 42687, 208172, 179477, 96909, -60579, -49336, -7142, -72194, -27715, -2964, 40654, 133664, 167959, 60712, 39691, 70141, 66912, -41292, -83045, -6005, -18206, -84246, -175202, -179031, -187719, -181849, -112847, -46356, -218318, -348673, -236244, -116780, -23729, -114076, -162704, -138755, -113544, -140421, 18935, 17057, -49019, -57383, -121971, -81955, -84526, -144345, -150614, -147775, -55147, -31220, -22778, 17797, -24039, -77233, 28335, 166191, 134521, 70264, -101652, -66712, 110318, 54278, -17652, -105697, -59418, 61337, 60472, 2085, -86969, -109948, -149089, -218182, -258322, -194388, -141707, -204194, -237636, -130831, -124898, -94130, -39590, -135086, -86663, -58004]
14810e8004O921K0519l3450j02043j9947o405J12133J09850j9294k0254j85991
14799a95965j01213Q663J32104N2353K4870J3807j60019n0117J72322J1906j25411
14788b16700N7893L0608O3380m6862Q2442o6978K6687j777p2301R6217P9397M813
14776C6819q7060l9984k8881M8182j3719J02226m576P8850p5173o5622J47824
14765I8886J13027K4957j35359m4975r3815o2878J4408J07613J3217k105p1985
14754c9009J2111Q6610o9496o6731M4561K7530N2230l5045j16249r8132Q600k8280
14742b21300k7406k3298J27716J47177R3084q2981k08153l5944m6807l7813j26442
14731d42167J52400J76771P8746l1216p5456j5048J09020M137k5973q0550K9364
$$ y = [-58004, -51083, -30564, -64014, -166057, -186004, -192409, -80276, 29574, 10280, -9974, -195965, -297178, -288515, -156411, -104058, -79188, -65381, -225400, -275517, -103195, -91289, -216700, -158807, -128199, -64819, -111681, -29239, -96217, -69530, -71307, -143608, -47391, 32006, 36819, -50241, -90225, -119106, -70924, -84643, 17583, 13007, 91857, 16684, -48938, 98886, 211913, 236870, 101511, 56536, -37279, -100157, -85749, 21864, 35081, 32976, -39009, -26898, 59712, -9784, -76515, -31954, -4424, 47806, 12761, -103488, -201620, -193020, -221300, -248706, -272004, -144288, 2889, 95973, 12992, -195161, -231105, -277912, -315725, -442167, -289767, -112996, -34250, -65466, -140922, -155970, -46950, -42813, -68786, -149336, -119972]
14720a19972N7989N4986N6892J3551J2195r3471K4118J4632r836j0563L3051j1305
14708B2267q132Q337J9395j18045k732L571q686J24499L5162q8865l933K6334
14696I172M3337P2718L7303n8613p6121j19826M324O7960p4594j49930L6778J42945
14684f4547p0678L098J31778o982j33824L8530J64033K759q618l4018k4714n2180
14672e5363j14073k5543J16212N1681K5627n4716J7656J27047o6016J725L481
14661B7718q545l109j55143j11554Q2741R0512N8520M1826R9969J9813n92O7575
14649B09731l2536j40303m9452j27522j53296P247Q7398K775n954l8135O6811
14638a73236L0221P5925J09312M1861o8044L6912j2412J5743k8278n3241r0059
$$ y = [-119972, -61983, -6997, 49895, 63446, 75641, -17830, 6288, 20920, 11084, 521, 33572, 22267, 14135, 22472, 41867, -76178, -78910, -75339, -84025, 40474, 75636, -13229, -17162, 9172, 52509, 125227, 162530, 103917, 27796, -92030, -87706, -19746, -94340, -244270, -207492, -64547, -135225, -132127, -349, -7331, -141155, -102625, 61408, 64167, 55549, 21531, -3183, -55363, -169436, -194979, -78767, -27086, -1459, -56175, -38519, 88528, 22512, 24237, 27718, 19173, 16064, -139079, -250633, -167892, -77380, -18860, 22966, 122935, 142748, 142156, 209731, 177195, 36892, -12560, -140082, -293378, -286131, -198733, -195958, -201912, -240047, -173236, -143015, -67090, 42222, 84083, 16039, 52951, 40539, 56282, 28004, -25237, -115296]
14627a15296J07062L1509l5096l3091L199j2012M1873n2206m7806j8186J29053
14616i97M4511j35227j188k185o7578q149K1666J09440J03273J5474j03549n5666
14604h0175m2777l7021m7601J40210J35795M1184J0717m3983j14436l1833M7542
14593b2378N7567j02883q7164P8013J20814o0251l564P4607l0384j1223q0654
14582f7500J5402K1331m8335r1638j03898k7567J13858J36991J70853m2837m0316
14571C6344n2756K7491J37992j06273n0947K0610l3697N3514P7754p557N0349
14560A52824q3451M793j770o8372K966Q5252R5599J17115k6516k8398j52028k86936
14548a88922j4229P2960R175N6006j3491M3960n114l0670n1547K9093j05983Q93
$$ y = [-115296, -8234, 23275, -11821, -44912, -41713, -53725, -11852, -64058, -111864, -130050, -997, 43514, -91713, -92901, -95086, -162664, -170813, -149147, -39707, 63566, 79040, -24509, -80175, -122952, -159973, -207574, -67364, 68431, 109615, 120332, 76349, -38087, -69920, -22378, 35189, -67694, -154858, -76845, 43969, -16282, -19846, 54761, 24377, 13154, -67500, -52098, -30767, -79102, -170740, -274638, -302205, -188347, -51356, 119497, 76660, 36344, -16412, 11079, 149071, 42798, -8149, 12461, -21236, 32278, 110032, 102475, 152824, 69373, 74166, 72396, 4024, 6990, 92242, 187841, 304956, 278440, 250042, 98014, -188922, -203151, -130191, -121016, -65010, -78501, -34541, -39655, -70325, -121872, -92779, -198762, -197869]
14536a97869J75790J79720o67o1618j11961o6783l1948L9066O552P4348L5746
14525D0376j61795k4392J49990J1509j14222N4427K22017P3790j50839k47762
14515a46901r2167r153M9224n8494J0958j6197Q0015J40386L5073J39627m3443
14504H8928j81012J208l9884j04695J27694P5576K2037J09174r3034j96704j07252
14493b97964Q718O9177K2652L295O3151j9943J5455O288m5961M9097K0370N5624
14481e0041R6230K9741m9247j76385k04781O9659K9497L5744J47823K9231K6382
14470a6147m8966J30509l2783M6756O1769l8624K6222j4147n4040m7334K0700
14459C3915l6178O440n92j4092J24131r125j4866l2506k0297J3180k9890Q709
$$ y = [-197869, -22079, 157641, 156974, 95356, -16605, -83388, -115336, -76270, -69718, 4630, 40376, -121419, -145811, 4179, 15688, -98534, -44107, 177910, 251700, 100861, -146901, -239068, -248221, -198997, -257491, -246533, -262730, -182715, -42329, -7256, 132371, 88928, -92084, -90876, -130760, -235455, -107761, -32185, -10148, 99026, 5992, -190712, -297964, -289246, -220069, -197417, -194122, -130971, -150914, -135459, -129171, -175132, -126035, -105665, -50041, 46189, 75930, 26683, -149702, -354483, -284824, -255327, -219583, -71760, -42529, -16147, -65113, 65396, 32613, 79369, 141138, 102514, 128736, 114589, 60549, 13215, 33915, -2263, 4177, 3585, -10507, 113624, 104499, 89633, 57127, 36830, 50010, 20120, 28829]
14447B8829q0080J8298n274M1109j60624o4984K7874o3692R0191L6699p279J6985
14435a21948O9460O0335k8583j1034L7347P8625J0155l1239k1646j49487J4100
14424i3915J26422R9291m4150j03340m0385P3222J1812o9552n6987M8528P1019
14413B1965k7826n144P5899J26557j08623j57344L6559o7068J58492p7496j13658
14402a37687j9048J17981M1980J1923j0188k8334K4547L0346N7988R047k02806
14391a04251l4888J06871j6209k8109O0862j9556j29900j1311R5683k9382P6037
14380c4153m5769J13719J33113k57654j22004k0702l2333J44262J38404n0436
14370c3553j09129J5849L0435l4608P2242O2571l816m6729N3029j032j00831K57
$$ y = [28829, -51251, -32953, -38227, 2882, -157742, -222726, -194852, -258544, -168353, -131654, -138933, -121948, -52488, 7847, -20736, -31770, 5577, 84202, 94357, 63118, 41472, -108015, -93915, 32507, 131798, 87648, -15692, -56077, 17145, 28957, -40595, -97582, -49054, 21965, -5861, -11005, 64894, 191451, 82828, -74516, -37957, -105025, 53467, -24029, -137687, -156735, -38754, 3226, 15149, 4961, -23373, 1174, 31520, 89508, 98555, -104251, -139139, -32268, -48477, -76586, -15724, -35280, -165180, -176491, -80808, -110190, -34153, -79922, 33797, 166910, -90744, -212748, -233450, -265783, -121521, 16883, -33553, -142682, -126833, -96398, -131006, -58764, 3807, -9, -46738, 6291, 5259, -95572, -95315]
14358i5315o26l4918K8900o6350J1754J00544M8616j33757j23718r954J58363
14347a16461J3808m3567j2434L9771K8231n8501K5868K11159J01225p8521P509
14336A18087P1031p0028L1422p0026n0956o6806q4111j9044j4061q6631J12319
14325a28804O492M4613n3523Q5923J65386J5429m3141j21660j00064J01010Q4273
14314E5934j4524l1662o4272p1361J00263O8751L7795j4353n3578p0499p2104
14303a29610n3571m1921k1740K4798J00737q011k00526k2909J3728R6268J03701
14292a39056P9382N6871Q1238J6982k50225p1609N4365J3576O7342n2446j4324
14281a57904J7354j4995N028m0981L2925P1012P4395l8351M0544k7414N0812J37160
$$ y = [-95315, -95941, -130859, -101959, -168309, -156555, -56011, -7395, -141152, -264870, -274824, -116461, -102653, -146220, -158654, -118883, -90652, -149153, -123285, 87874, 189099, 110578, 118087, 189118, 119090, 150512, 80486, 29530, -37276, -121387, -140431, -154492, -241123, -128804, -122312, -77699, -131222, -45299, 120087, 135516, 92375, -29285, -129349, -28339, 55934, 41410, 9748, -54524, -125885, -25622, 43129, 80924, 66571, 12993, -57506, -129610, -183181, -225102, -246842, -222044, -121307, -129318, -329844, -352753, -339025, -242757, -139056, -59674, -2803, 78435, 95417, -154808, -226417, -172052, -158476, -91134, -143580, -157904, -140550, -155545, -150517, -191498, -158573, -87561, -13166, -51517, -10973, -38387, 12425, 149585]
14269A49585k080L1609n2343K1148j1576J0696r4251J01558Q1318P3464o3571
14258B45557j1057M9450N619j26507k23293j22342L9569j4617N786j5098m2640
14247b09573l734K2609k0946O3276J61703O8876R558K3454q5944k6889j9348M1239
14235B4281Q0001j3483j7129p98J511m1158r0924o1675P0373M3406L4783p0021
14223d0833n1753k2661l5001k333O9938l3652N8739k0914Q6673L6355r626m9755
14211a4823j24399k9651J68658r119J44942j499j63233J3271j5107j4837N0166
14200D369m3388q8601O4247k691K9023j8072o6277l5633j17207R1951J40209q2306
14188a24376n6281J39131k1297j15731K7612J25404L7499n4303J02412l9417j10149
$$ y = [149585, 147505, 179114, 126771, 147919, 136343, 147039, 52788, 154346, 235664, 309128, 245557, 234500, 283950, 289569, 163062, -60231, -182573, -143004, -157621, -151835, -166933, -209573, -213307, -190698, -211644, -148368, 13335, 82211, 91769, 115223, 29279, 2390, -16958, 24281, 104282, 90799, 73670, 72872, 74383, 33225, -57699, -119374, -49001, -5595, 29188, -40833, -92586, -115247, -150248, -152581, -82643, -116295, -57556, -78470, 8203, 44558, 34932, -14823, -139222, -168873, -215, -9334, 135608, 134109, -29124, -15853, -30960, -45797, 4369, -39019, -127620, -63373, -66064, -37041, -55113, -121390, -157023, -274230, -182279, -42070, -124376, -180657, -41526, -62823, -178554, -150942, -25538, 11961, -42342, 60070, 20653, -89496]
14177h9496N4457N809K231k2247l2284O2343J06897Q6861q3278q9876R9963L5925
14165A37305k0675Q5963n9784n2375q9845M4209J96236M0029q1844k8283J650
14154A72586L8636k5065K41j98467p2690O2339L3759l5812L1540o513L1870n8342
14142b5918p7056R8508o751o8033Q8578P3992j26539m4506q7661J52453M5815
14131B2882p3178Q229N1934k9228m0302q383R8332J3316q0247j04026K5898M7953
14119f6820n2514j1596j00067N9890O1064K09395Q5371L7005m8529L786j47841
14108B9144j00676j2193n655j0566R9174j68661n6394R065Q8371J32148l5046
14097c1289p6220o967N1816L9100l8970r4097P1417J6274q9247J4179r1722J25471
$$ y = [-89496, -35039, -29230, -26999, -49246, -81530, -19187, 87710, 174571, 91293, 1417, 101380, 137305, 116630, 202593, 142809, 90434, 589, 44798, 241034, 281063, 199219, 170936, 172586, 211222, 186157, 186398, -12069, -84759, -22420, 11339, -24473, 7067, 554, 32424, -25918, -102974, -4466, -11217, -79250, 9328, 83320, -43219, -87725, -175386, -22933, 22882, -50296, -42067, 9867, -19361, -59663, -68046, 30286, 43602, -36645, -140671, -114773, -66820, -119334, -130930, -230997, -171107, -110043, 99352, 184723, 221728, 173199, 176985, 29144, -71532, -83725, -89380, -99946, -772, -169433, -225827, -216762, -128391, 3757, -31289, -107509, -114476, -62660, -23560, -62530, -156627, -85210, -68936, -158183, -144004, -235726, -110255]
14085a10255Q5855r365P1126j7888n1219P5563P4061P0285R460j76135j11408
14074h9920N0314J65040J38896j06166k35784j55309N386N0615L2903K9301L0264
14063h4460O8535N5607q3694k3213o4372r2000J83302J08879j35296j00427O5882
14052a01257L653J10122R967j32559j7105j802J19314k243j04113q27k702M3656
14040g5896R5874k0691p3739o6511j1762J28817P1244m1577m5454N0312J69277
14029A79894L6574o2021n2732r2657j55000J874J06746K4325m5998J3836J002
14018d4157J62K0944N9107n9863n0946o5101n4467J02572J28768L9681n8565n3110
14006c4975m0097q2496M0928P790n8364q3847Q9932O5782M5376l4132j20019r01
$$ y = [-110255, -24400, -33765, 37361, 19473, -31746, 43817, 117878, 188163, 197623, 21488, -89920, -39606, 125434, 264330, 158164, -77620, -232929, -227543, -176928, -144025, -114724, -84460, -15925, 39682, -44012, -67225, -131597, -223597, -40295, 68584, -66712, -167139, -101257, -97604, 12518, 22485, -110074, -127179, -128981, -9667, -11910, -116023, -116850, -119552, -75896, 19978, -713, -74452, -140963, -152725, -23908, 47336, 5759, -39695, 10617, 179894, 216468, 154447, 101715, 9058, -145942, -144068, -37322, -12997, -58995, -45159, -44157, -43995, -23051, 36056, -23807, -74753, -139854, -194321, -91749, 37019, 76700, 18135, -34975, -75072, -157568, -116640, -108850, -167214, -251061, -161129, -95347, -49971, -84103, -204122, -205023]
13994b05023r670Q7882r4725O5079L9948J1660J17420l1483q3833m6536M7170
13983a02111O3574L3173J728j37691Q2546O3470p5121p6043N428N3184k7591j68383
13971b83837N2916K31063O7569n8931j19747j14408P8219N0342Q3347q3690p838
13960a04995J06470N3736M2032j04509L522J5646o9978r8856Q413J82345l3254
13949E72q4596P1498K2163m1936N1841k1972k3822k8905j10383M2491J41759Q468
13937B7178r2978p7296J08234o8751M7945l4283k7402J9921L5397P5307N095J692
13925B0059j74383o189J22717j9355N4930m1882j1979r9087j6906R9158Q0281
13914G364O9720k5684l1859k3323q5366L554L3217M3824M1657q0240o6878O0765
$$ y = [-205023, -214693, -126811, -221536, -156457, -116509, -104849, 12571, -18912, -102745, -149281, -102111, -38537, -5364, -3636, -141327, -58781, 4689, -70432, -146475, -141047, -87863, -115454, -283837, -230921, 142, 67711, 8780, -110967, -225375, -147156, -96814, -13467, -97157, -104995, 1475, 55211, 97243, -7266, -3744, 11902, -58076, -156932, -148519, 33826, 572, -84024, -12526, 9637, -32299, 19542, -2430, -26252, -55157, -165540, -123049, 18710, 27178, -65800, -143096, -34862, -103613, -55668, -89951, -117353, -97432, -62035, 13272, 18367, 20059, -154324, -160513, -37796, -57151, -2221, -44103, -56082, -155169, -172075, -72917, 7364, 77084, 51400, 19541, -3782, -89148, -85594, -52377, -8553, 33104, -47136, -114014, -53249]
13902e3249j9280n1114M9354O8685M2943p5287j28068p3959J46432J11597O4045
13891H2099l4559l4528m5727M4225k8458N3504p9838j73727K8941l6127J9978
13880b04217N1878m0998r4618N7872J11151k3422m2866J6814P7882N2798N0957
13869A3231L5476o1084n7320L0373J4746n8684j13651q0983q1061J01132J71449
13858h6376J8055j82769j11351J48797R0998l3232j16719Q0311J34048J9057n3663
13847i2844j2392J0422r8748j9062j24545J53906N1161j19522p6455K9392K4005
13836b74682j7152Q968M3665J54480p4454Q2082J4039r1614M8045N8343L2791
13825a5489k9862o4223m3572o6676l7453l0545L9475j2867j3568K07466J39794
$$ y = [-53249, -72529, -123643, -74289, -5604, 37339, -37948, -166016, -239975, -93543, 18054, 82099, 47540, 13012, -32715, 11510, -16948, 36556, -43282, -217009, -188068, -224195, -204217, -152339, -193337, -287955, -230083, -118932, -142354, -185220, -168406, -90524, -37726, 13231, 48707, -12377, -69697, -39324, -24578, -83262, -196913, -277896, -358957, -257825, -86376, -68321, -251090, -362441, -213644, -122646, -155878, -272597, -192286, -58238, -39181, -92844, -105236, -94814, -193562, -212624, -337169, -183263, -132102, -251624, -328079, -298687, -274682, -291834, -282866, -239201, -84721, -159175, -77093, -63054, -154668, -106623, -48280, -15489, -45351, -109574, -153146, -219822, -257275, -287820, -248345, -261212, -274780, -67314, 72480]
13814G2480k12n3233M494m2753o7698K4262K51469J33119r4842m4434o7341o1478
13802E3833K7124J6444k595L1223o4356K1934L9724r0466j74167P1920j1942R4484
13790A3160j8688j3669L7859l8987l6024K5418J0318m9798R7690o5039m4496M1651
13778d0605m8809q3529l987K556J1749r709Q1297P1059r0174L1316k6574k6875
13766a32285k5783K6651q6086K6260Q3217J5488q2751j09815Q0101O6766p7807
13755b16044l1291J25078O80j3393o009r054j58013k3823L3713R3051J93232K335
13743i538m9874k5267O0259J03275M5000q3662j8811l3956m2455R6173R9595J4050
13731A54789O394n7913j25944l1612m0700o2060q4663P5695M8672R6388P6778
$$ y = [72480, 72268, 19035, 23529, -19224, -86922, -62660, 188809, 321928, 227086, 182652, 115311, 53833, 80957, 97401, 94806, 126029, 61673, 83607, 123331, 32865, -141302, -69382, -81324, 13160, -5528, -19197, 18662, -20325, -56349, -30931, -20613, -70411, 27279, -37760, -82256, -40605, -89414, -172943, -176930, -174374, -162625, -172334, -91037, -19978, -110152, -78836, -105410, -132285, -158068, -131417, -217503, -191243, -108026, -92538, -175289, -285104, -205003, -138237, -216044, -247335, -122257, -121577, -134970, -140979, -150033, -308046, -331869, -298156, -205105, -11873, -9538, -59412, -84679, -24420, 78855, 123855, 40193, 21382, -12574, -55029, 41144, 140739, 154789, 161183, 103270, -22674, -54286, -94986, -157046, -241709, -166014, -117342, -20954, 55824]
13720E5824m7745q6957r5110l2800l514P4836q793j4695J15018J5486r9696n7208
13708a85354O0592J01530J02779p3168j25656J7884n2980P5916L2007M5370P3445
13697G2365m6047m6006P02m8218k7157K9693K9852P1617L5398j3884j30224K3247
13685d8662J25459M5560J238J14491M7153j12746l8401n5856o5070M030J9937
13674C7133q7293j8991R0245k2244j34604L3436J52099J277o1276L5947m7517
13663b1788j2026J16266J6646j8930R9588n5176r1408q8359q6960J15431O4397
13652C7681o4819q7105k0392P47k7486l5548p5010M3971m2558N9548J02979R1512
13640a6480J50928J9752m9212O1808M9500r8472j28566M6428j2194O058j42923
$$ y = [55824, 8079, -78878, -173988, -206788, -210302, -135466, -144259, -158954, -43936, -28450, -128146, -185354, -124762, -23232, 79547, 6379, -119277, -101393, -154373, -78457, -46450, -1080, 72365, 26318, -19688, -18986, -67204, -94361, -64668, -34816, 36801, 72199, 58315, -71909, -48662, 76797, 122357, 123595, 238086, 285239, 172493, 134092, 78236, 13166, 17196, 37133, -50160, -69151, 21094, -1150, -135754, -102318, 49781, 51058, -10218, 25729, -21788, -33814, 82452, 99098, 80168, 179756, 124580, 33172, -55187, -142147, -26716, 37681, -27138, -114243, -134635, -133888, -161374, -196922, -271932, -227961, -270519, -210971, -107992, -16480, 134448, 154200, 104988, 166796, 216296, 117824, -10742, 35686, 23492, 29550, -113373]
13629a13373j33116K4029J31931L8786l6011J3228M8639p987L6807j7591r0304
13618a04962l7254R2397P0969j0867K7276j00284p4125L7243M7632p6245J47867
13607A9647N6253k1851l0549j81052l7055J29327N0284o3684p5802K3140K3380
13596a07962N0084K7878m1237J48769l3132m8572M1159N0418J07948M8688j4194
13585B29847l7562m4476p3583L4798J40478k2009k33492q5357Q1050O5365K3824
13574G8883m6840n8583O7647P9918Q7772R1415n067k4534M4204J76219O0994q6830
13562D65198m7680M6595L0097J26817Q1490N9732R8854J30864r55K39611J89122
13551A419745J97174J84344J8861q6597J6402o6834j25009j09369j21541j80564
$$ y = [-113373, -246489, -222460, -90529, -51743, -87754, -74526, -25887, -33874, 2933, -14658, -104962, -142216, -49819, 21150, 10283, 37559, -62725, -136850, -99607, -51975, -128220, 19647, 75900, 54049, 23500, -157552, -194607, -65280, -14996, -78680, -154482, -131342, -107962, -57878, -30000, -71237, 77532, 44400, -4172, 36987, 87405, 195353, 244041, 229847, 192285, 147809, 74226, 109024, 249502, 227493, -5999, -91356, -10306, 55059, 78883, 32043, -26540, 41107, 121025, 208797, 300212, 295145, 270611, 314815, 491034, 552028, 465198, 417518, 464113, 494210, 621027, 702517, 762249, 861103, 991967, 991012, 1230623, 1419745, 1616919, 1801263, 1820124, 1733527, 1749929, 1683095, 1558086, 1448717, 1327176, 1146612]
13541A146612l25112k64028L1655O540r2276j1532m7678r181K6938K642J2249
13530D76829k04805k50402J1763Q4270M2697J02147q1136j58296J18570K4448
13520A66085M3895n1473l4741q0938n0471o7840N1188M7225J5000P6180K5992
13509A40102q6732Q1073j46019j80769L4622K05327k4990q3195L822Q0396N9977
13498H3614o130P3347o3638l2086m150Q1855J68p1479q7891m5831l7351k8834
13486a38406Q2170q131N1110M4096j26024r375P6781N410L4672J7778p1373L8854
13474b438J34643R0344l087j08144j40173J1370L6159Q6475j05138j1440m6198
13463e7627P4769J47943k8259m5096j64948n5044P5814J41586O6521M9072L5498
$$ y = [1146612, 821500, 557472, 589127, 595667, 503391, 491859, 444181, 435000, 461938, 464580, 476829, 272024, 21622, 33385, 117655, 160352, 262499, 181363, 23067, 141637, 166085, 209980, 158507, 123766, 42828, -7643, -75483, -24295, 22930, 37930, 114110, 140102, 53370, 134443, -11576, -192345, -157723, 47604, 22614, -60581, -56759, 23637, 83614, 77484, 150831, 87193, 55107, 50957, 132812, 132980, 61501, -26390, -72221, -109572, -138406, -56236, -64367, -13257, 30839, -95185, -104560, -27779, -22369, 12303, 30081, -41292, -2438, 132205, 222549, 219462, 111318, -28855, -17485, 18674, 105149, 11, -11429, -57627, 17142, 165085, 136826, 91730, -73218, -128262, -52448, 89138, 155659, 204731, 240229]
13452B40229r5009j2790k3154N113L5491r1817q8165J8037L2915L8337r4072k3464
13440e8349k7299O6093j0338k8394k2736P8349L4529p282n4425M6691k8765Q8412
13428G6486J42944o4573p146R3463n8831r2206j0551n7679q4097k1393K8205n2260
13416a07638j2052K5023O5643Q6582K9164p6003j08895k7482n0280Q7968N8228
13405b9742L2484M4289L6880J40999K0725p0625p7335K782q7251j03542Q6342
13394c994R2111Q9196k1790j7662m492p1310m020q6467l6881j8330J13541K0182
13382E0084j5978p3123M6528j469J2990M2290N3387j62738J779J06515m0028r8169
13370g7932J30679J44322j2601j11663m8535k7145n9204J62148K9340n4095l6016
$$ y = [240229, 145220, 132430, 109276, 114389, 149880, 58063, -30102, -12065, 20850, 59187, -34885, -58349, -85648, -19555, -29893, -58287, -81023, -2674, 31855, 24573, -29852, 16839, -11926, 76486, 219430, 154857, 147711, 241174, 182343, 90137, 79586, 21907, -62190, -83583, -55378, -107638, -119690, -94667, -29024, 57558, 86722, 10719, -98176, -125658, -175938, -87970, -29742, 2742, 47031, 83911, 224910, 245635, 175010, 97675, 100457, 13206, -90336, -3994, 88117, 177313, 155523, 137861, 133369, 62059, 58039, -28428, -65309, -83639, 29902, 50084, 34106, -39017, 7511, 6042, 19032, 61322, 114709, -48029, -46250, 60265, 20237, -77932, 52747, 197069, 184468, 72805, 24270, -2875, -62079, 100069, 129409, 75314, 39298]
13359C9298O7385M4246M8438m3090j5896j8149N4097q6597J9487P5489K0616J14876
13347C20200J0605q5960j47867K5295n1416L4874J03782J00003j4946j6985n8661
13336B18924K4529R9525j0840J0216J9364j43962n1831M6931O7j12193j43630
13325d2900J16838J80198N635m9929k1191j32469r3024J45867P3024j20165j33774
13314g1890K7749j8481l113K2544O0110J9205n0993j50012l9944J15795J31573
13303D2543J91372K6128j07295j12956O6254J61507j8598J12951m2280o519L3780
13292C46887J4699k7786j14491r8875M6698J62981M3978j09263j17805p8453P1206
13281A39776q0691j2124k4876n9902l9486R007P8205J649J6915J43907o7752m9304
$$ y = [39298, 106683, 150929, 199367, 156277, 140381, 122232, 176329, 89732, 109219, 184708, 205324, 320200, 330805, 244845, 96978, 122273, 70857, 105731, 209513, 309516, 294570, 277585, 218924, 243453, 342978, 332138, 342354, 361718, 217756, 165925, 212856, 212923, 100730, -42900, 73938, 254136, 259771, 209842, 188651, 56182, -36842, 109025, 182049, 61884, -71890, -44141, -62622, -65735, -43191, 16919, 36124, -14869, -164881, -204825, -89030, 42543, 233915, 260043, 152748, 39792, 106046, 267553, 248955, 361906, 319626, 313107, 346887, 361586, 333800, 219309, 120434, 167132, 330113, 374091, 264828, 147023, 68570, 139776, 59085, 46961, 22085, -37817, -77303, -68296, 9909, 11558, 28473, 172380, 104628, 55324]
13269E5324J62098N3188J15475N5662j07050o414m8988J08378N3767m4484k4770
13258C72186l5366q1210j33795L0216L2782J23407R0817Q834J9351j174l5415
13247C90633P9978r9158n6620K2462j73516M6093Q3563R1329P1956Q8987R1697
13236F37404K6040J04339J50306J43841N2380K6536Q24M5517J41524J66451J29517
13225A624679J05783J15142P9913k07054j30307n1830n4101p5230r5478j29923
13215A181594n7207M1236N4817N3585n9710j34614j31857r02R5632J72250Q3171
13204A297995j40536p8774J16860J57311O9292j5326j29976l0753P3969j02611
13194A217451P1416J00985l9397N6580O5223J9092o1637l6888Q2982j6559K2116
$$ y = [55324, 217422, 270610, 386085, 441747, 334697, 328283, 279295, 387673, 441440, 396956, 372186, 336820, 255610, 121815, 152031, 184813, 308220, 399037, 407871, 427222, 426048, 390633, 470611, 371453, 314833, 337295, 163779, 209872, 293435, 384764, 456720, 545707, 637404, 663444, 767783, 918089, 1061930, 1114310, 1140846, 1141670, 1187187, 1328711, 1495162, 1624679, 1730462, 1845604, 1925517, 1718463, 1588156, 1536326, 1482225, 1406995, 1311517, 1181594, 1124387, 1165623, 1220440, 1274025, 1214315, 1079701, 947844, 946942, 1042574, 1214824, 1297995, 1157459, 1078685, 1195545, 1352856, 1422148, 1406822, 1276846, 1246093, 1320062, 1217451, 1288867, 1389852, 1350455, 1407035, 1472258, 1491350, 1429713, 1392825, 1475807, 1459248, 1481364]
13183A481364o2405k0248P7741N0975k4786k2006N5115p130n4910j2119r311N4752
13171A507032J53120K39105J33209N2311J61334J36818J52426R7124r097R2010
13161B715392R7408M1614R9242J93111N7624Q9686K18033J41315J18614K34376
13151D006415J31870L5892J91429J11584J82753K67853J76046J86161J33209K50544
13141E673756K37282L21397L53915L82772L61500N21051O53450N00951N37618
13132I543692P32149O91182O79410Q26716Q14715R91013J075562J290037J420353
13123A8064829J755091J964909K386948K710725K840599L217606L947327M433498
13115D1321532N042515N952296P079698Q332050R914424J2293358J5495148J9323432
$$ y = [1481364, 1418959, 1398711, 1476452, 1527427, 1502641, 1480635, 1535750, 1528620, 1473710, 1461591, 1452280, 1507032, 1660152, 1899257, 2032466, 2084777, 2246111, 2382929, 2535355, 2632479, 2623382, 2715392, 2812800, 2854414, 2953656, 3146767, 3204391, 3294077, 3512110, 3653425, 3772039, 4006415, 4138285, 4174177, 4365606, 4477190, 4659943, 4927796, 5103842, 5290003, 5423212, 5673756, 5911038, 6232435, 6586350, 6969122, 7330622, 7851673, 8505123, 9006074, 9543692, 10275841, 10967023, 11646433, 12473149, 13287864, 14278877, 15354439, 16644476, 18064829, 19819920, 21784829, 24171777, 26882502, 29723101, 32940707, 36888034, 41321532, 46364047, 52316343, 59396041, 67728091, 77642515, 89935873, 105431021, 124754453]
13107A24754453K4387972L0031867L5877433M0852481M3146748M1153851L4363583
13100C74568388K3165381Q928145o243823j9959167l0745186l7523538l9987737
13093B72202463l8892892l5473726l0567715k5556002k1159589j7206792j3869704
13086H9476043j1236530r312389p735054o615963n886393n110848m352269l678876
13078C5547721l348757l047342k596834k281235k099605j729088j375241j328995
13070A7740624j238576j146194j025701r30730o41750q04755o40071m42032m96649
13061A0374166n66626n55658l91523m67451n30294k21123k64913l44762k83961
13052F747855k84299k68377l60289j71768j02897j36380j77854j61926p0988j32049
$$ y = [124754453, 149142425, 179174292, 215051725, 255904206, 299050954, 340204805, 374568388, 397733769, 406661914, 400418091, 380458924, 349713738, 312190200, 272202463, 233309571, 197835845, 167268130, 141712128, 120552539, 103345747, 89476043, 78239513, 68927124, 61192070, 54576107, 48689714, 43578866, 39226597, 35547721, 32198964, 29151622, 26554788, 24273553, 22173948, 20444860, 19069619, 17740624, 16502048, 15355854, 14330153, 13399423, 12757673, 11952918, 11312847, 10870815, 10374166, 9807540, 9251882, 8860359, 8392908, 7862614, 7641491, 7376578, 7031816, 6747855, 6463556, 6195179, 5834890, 5663122, 5560225, 5423845, 5245991, 5084065, 5013077, 4881028]
13042D881028l00606k54852j28775l24922j53067K0527m1741r3324j11385R970
13032C502853r7872r0050j63540l1065q2405m3764m6878j00031o9111j74744l5271
13021B568122N0990r2998k15234j06065K131j4333j11567j10735j53360n454J47891
13010A959388m910O2259n0519q073P5992l747j93211q4751O1398k12278n2078
12999A549470J01847o7614j6729O5362j26580j25816q0082j48587j2947N0758
12989A189082J03290K008j0832J05065J32770L5163j97240j66055q9140J13911
12979A218022r7944l9858k4649p8118M0703m2185n7181k9284M1593p7993m0322
12968H12784p7228N0309l5143R8186K8149M04j05415o8550n377j9491j08583O3316
$$ y = [4881028, 4580422, 4325570, 4196795, 3871873, 3718806, 3739333, 3697592, 3604268, 3492883, 3502853, 3404981, 3314931, 3151391, 3120326, 3037921, 2994157, 2947279, 2847248, 2778137, 2603393, 2568122, 2619112, 2526114, 2310880, 2204815, 2206946, 2192613, 2081046, 1970311, 1816951, 1811497, 1959388, 1954478, 2016737, 1966218, 1958145, 2034137, 2030390, 1837179, 1752428, 1813826, 1601548, 1549470, 1651317, 1583703, 1566974, 1632336, 1505756, 1379940, 1299858, 1151271, 1138324, 1189082, 1292372, 1294380, 1283548, 1388613, 1521383, 1556546, 1359306, 1193251, 1104111, 1218022, 1120078, 1080220, 1055571, 977453, 1018156, 975971, 918790, 889506, 931099, 853106, 812784, 735556, 785865, 750722, 848908, 877057, 877461, 772046, 703496, 698119, 678628, 570045, 633361]
12956F33361O3269o0168J763n7870q62J0705J8319r582p5338j30014R0533m4771
12944D39345j21239R0929J61178Q057n1756P0464r037P7626m1670J674m3785j35283
12932D46503j37335K6692K43695J69725n8058M7243j18311k59091Q1437n5368
12922C87132j3041J75662m264K6109J44800K0900m7695p0596j7485j18631m9704
12911D33187P6662P1079j48962j05067k9252o1115K2337q0892R8203j8060L7289
12900B95409L7160p2647o2797m6488q09O4918K3357J42440m8098R3738r694j07000
12888C09489n0703j28964L2248N3892p8990r5260L5168K32051R1942l3421l0722
12877C36730j5841j0269o84k9581J3673O90R801N8993O3405M3504J9880j78224
$$ y = [633361, 696630, 636462, 638225, 580355, 579493, 590198, 608517, 598935, 523597, 393583, 484116, 439345, 318106, 409035, 570213, 578270, 526514, 596978, 587941, 665567, 623897, 625571, 581786, 446503, 309168, 335860, 579555, 749280, 691222, 738465, 620154, 361063, 442500, 387132, 374091, 549753, 545489, 571598, 716398, 737298, 689603, 619007, 601522, 482891, 433187, 509849, 580928, 431966, 326899, 297647, 236532, 258869, 177977, 276180, 258120, 295409, 332569, 259922, 197125, 150637, 149828, 214746, 238103, 380543, 332445, 426183, 416489, 309489, 258786, 129822, 162070, 215962, 136972, 41712, 76880, 308931, 400873, 367452, 336730, 320889, 310620, 309936, 280355, 294028, 294718, 304519, 363512, 426917, 470421, 490301, 312077]
12865C12077j74549J19501l4292L6289L1572k0723M0724m7042q5426r7230k4366
12854E6535J13133O1455M8388K5272O7611L6575J0900k7942P3842p3181m6228
12843C46360o2021j03432J8258O5750M6543J9056q4612J9028j01540j50866j2675
12832a51R191p6081P4195R3590M3611J14643J8566J3718k00326j41204J46612
12821I6364J19129j20550j08298j1053m0576R2731P8130l4568N8693k3887q8287
12810A7828O8278J94388M9534o533j41267j84096O2083J49146J37662M3424k8499
12799C61948j49544n4183L9332N5669j17769p1509K1364K8224n1411k4182r406
12788B8533K347Q8299L1356L1375J02859N3519j5338N905p1087Q0305R9636R473
$$ y = [312077, 137528, 257029, 222737, 259026, 290598, 269875, 310599, 263557, 178131, 80901, 56535, 169668, 231123, 279511, 304783, 372394, 408969, 419869, 391927, 465769, 392588, 346360, 284339, 180907, 199165, 264915, 311458, 330514, 245902, 264930, 163390, 12524, -151, 9040, -67041, 7154, 100744, 144355, 258998, 277564, 291282, 90956, -50248, 96364, 215493, 94943, -13355, -24408, -64984, 27747, 105877, 71309, 130002, 106115, 17828, 86106, 280494, 330028, 323495, 182228, -1868, 60215, 209361, 347023, 390447, 361948, 212404, 158221, 197553, 253222, 135453, 63944, 85308, 113532, 62121, 37939, 28533, 30880, 119179, 150535, 181910, 284769, 338288, 322950, 328855, 257768, 338073, 437709, 447182]
12776D47182j53026j29066j07395L5760l276P0876N4634J07603l8585r6600p104
12765A81003J8407j09009j9008n2497J6170P7121J45611m3529l8148j7690M6191
12754B04622Q6664m0302r4689j35168j4733K39381M6300j68267r9167k345L5934
12743E8230L9626j04855j27514L1604M0935M1313n4325N8056M3641M0144M8685
12732A15540J20852N5709J6422l980j17412j09264k8963N3214N6423m6407L411
12721A15545J5236n8124J6896l5568N1003N8446n4629J07950N4753k0203L2310
12710B83615o7981p2339M9017J23181o0988j22384J8674L4967j9929r3888o2976
12699H969J21348P8081R9086k472Q358j10949n7711k1983M7450O4644J4282q592
$$ y = [447182, 294156, 165090, 57695, 93455, 90179, 161055, 215689, 323292, 284707, 188107, 181003, 199410, 90401, 71393, 18896, 35066, 112187, 257798, 214269, 176121, 158431, 204622, 291286, 250984, 156295, 21127, 6394, 245775, 292075, 123808, 24641, 22296, 58230, 97856, -6999, -134513, -102909, -61974, -20661, -74986, -16930, 26711, 66855, 115540, 236392, 292101, 308523, 304543, 187131, 77867, 48904, 102118, 158541, 112134, 115545, 130781, 72657, 89553, 53985, 104988, 163434, 108805, 216755, 271508, 251305, 283615, 215634, 143295, 192312, 315493, 254505, 132121, 150795, 185762, 165833, 71945, 8969, 130317, 208398, 307484, 305012, 313370, 202421, 144710, 122727, 170177, 234821, 249103, 240511]
12687B40511j6877j49522O4892k8001L0106n4272l7898J55697P568j50906j01694
12676d0396R5111o2211n155J06709Q6465L0026m8702m1601M5591M9840r7887L991
12664A21781J33931l8328J40702J78254J53518L283j39610p9795r606Q2593J35032
12653F81755Q6160n660M0504J02857M2806K94745J76775P3091N8603Q8246O9256
12642A709138l0510K3099q6650j16278k13308k68974l1269l0591j64390j56953
12632F33314K3502r0627j13426j03578N7762k3528j17905j5035L2843N9498j25453
12621B17367n2834L3P6589K9375o0784l2147j8569M466J86274N329j12722j690
12609B40687k2368M6632o1542j0920J06078k0666j471l5733k8782n1187r1646
$$ y = [240511, 223634, 74112, 139004, 111003, 141109, 86837, 48939, 204636, 212204, 61298, -40396, 54715, -7496, -12651, 94058, 180523, 210549, 161847, 120246, 165837, 215677, 117790, 121781, 255712, 217384, 358086, 536340, 689858, 693141, 553531, 473736, 464130, 546723, 681755, 767915, 762255, 802759, 905616, 948422, 1243167, 1419942, 1493033, 1551636, 1639882, 1709138, 1678628, 1701727, 1615077, 1498799, 1285491, 1016517, 985248, 954657, 790267, 633314, 656816, 566189, 452763, 349185, 406947, 383419, 265514, 250479, 283322, 342820, 217367, 164533, 164566, 241155, 270530, 209746, 177599, 159030, 163496, 349770, 355099, 242377, 240687, 218319, 264951, 203409, 192489, 298567, 277901, 276430, 240697, 211915, 160728, 69082]
12598F9082j2080J09431Q7699n9305l2297L4058m3427j55678O683J3302N2877
12587G0345R5932O9351k324j15131m9695P4180J28896L9675k20825j61461k0920
12576i1977J33030M0459L2717j2915L0069r5543q0359l3140m9749P3142m400J8127
12564d0539j0548O0064r252J42285J30321K2160k50601k6094J2788J0721j25310
12553h4005n9867J15841n031j0714J0700j1783p5594j3195Q0500L0746R5255O1280
12541A34133n8006r7911K765M6290m1012r400N7078L1143Q9042q5233k9937P7157
12529A16109k9455N8413J16933o0512j88489r612M0730o9529j13399R6960k3387
12518f5238l6317J9538J01484K5006K3927K7785J5211k0627j0746K4917N7738
$$ y = [69082, 57002, 166433, 254132, 194827, 162530, 196588, 153161, -2517, 4166, 17468, 70345, 166277, 235628, 233304, 118173, 68478, 142658, 271554, 311229, 90404, -71057, -91977, 41053, 81512, 114229, 101314, 131383, 35840, -44519, -77659, -127408, -54266, -58666, -40539, -51087, 8977, -275, 142010, 272331, 294491, 43890, 17796, 30584, 41305, -84005, -143872, -28031, -33062, -43776, -33076, -44859, -120453, -133648, -53148, -22402, 72853, 134133, 76127, -21784, -19019, 27271, -13741, -23141, 33937, 65080, 154122, 68889, 38952, 116109, 86654, 145067, 262000, 201488, 12999, 3387, 44117, -25412, -138811, -41851, -65238, -101555, -82017, 19467, 44473, 68400, 96185, 111396, 90769, 80023, 104940, 162678]
12507A62678N4959K5213j09648m8222l1697J9278M2784P6503r011l8555j6204
12496A28078o2295K685Q4851j16309N6898K1967l9752L5150J9456l2003M062q5667
12484A7121K6043R7947j85388o1654J95354j40141n7616P1696j1395R2140O1513
12473A05620N8814n5437P0446N3011k0792M3723p4642O2082k5793l0844k5546
12462A60642p3133M6768n3229j41928L0222M2900n290P7762J08058m7875n8535
12451H6362K2699r0458n0146O9915J68170Q3113j4743o1556j32626n880j084j05998
12439c2232p1702J37782J74672P4645l2000j22686o6492j1323r992j7926R956
12428C2702q731O8234j2080Q017l0553K4643k8782q9760M0802p5588o1725k8312
$$ y = [162678, 217637, 242850, 133202, 84980, 53283, 72561, 115345, 191848, 182837, 144282, 128078, 65783, 68468, 153319, 37010, 93908, 115875, 76123, 111273, 130729, 98726, 102788, 17121, 43164, 141111, -44277, -105931, 89423, -50718, -108334, -36638, -48033, 44107, 105620, 164434, 108997, 179443, 232454, 211662, 255385, 180743, 242825, 217032, 186188, 160642, 87509, 134277, 81048, -60880, -30658, 12242, 6952, 84714, 192772, 144897, 86362, 109061, 18603, -31543, 38372, 206542, 289655, 274912, 213356, 80730, 74850, 73766, -32232, -103934, 33848, 208520, 283165, 251165, 128479, 61987, 50664, 40672, 22746, 32702, 23971, 92205, 80125, 88142, 57589, 82232, 53450, -36310, 4492, -71096, -132821, -161133]
12416a61133O8844j1476J0022J20111O3561O2033J4625N940L4342k7821j31121
12405D7927o0436j10720k298R8726K52994Q0591J7227r8075j64778o5678o8476
12394g2996j19303N2055L0439m8021l8575J7057L1013J5512J02138n6786j4115
12383a01582O0839K145q9981J29225m3729m4739M3355j2931J3833j0835l0754
12372h5154n2013O51O8143k934n6286J03242J63822N1810m1361n4921j7246n936
12360G1817N4376K1355j02976o9759J6976P9054j08588n7936Q3134Q2379j1002
12349E8830j34925j63712L6482K50940k9729k48937j84206J80302K42948M4232
12339E2225K8694k5365p6420J19931J2772J3765j8397j84321p0412L8793L3745
$$ y = [-161133, -92289, -103765, -93743, 26368, 89929, 151962, 166587, 172527, 206869, 179048, 47927, -12509, -123229, -125527, -26801, 226193, 306784, 324011, 225936, 61158, -4520, -72996, -192299, -140244, -109805, -157826, -196401, -179344, -148331, -132819, -30681, -87467, -101582, -40743, -38598, -128579, 646, -43083, -87822, -44467, -57398, -43565, -54400, -85154, -137167, -136516, -68373, -71307, -127593, -24351, 139471, 191281, 149920, 94999, 77753, 71817, 126193, 147548, 44572, -25187, -8211, 70843, -37745, -95681, -12547, 69832, 58830, -76095, -239807, -203325, 47615, 17886, -231051, -415257, -234955, 7993, 52225, 80919, 55554, -20866, 99065, 111837, 125602, 107205, -77116, -147528, -108735, -74990]
12328g4990k4445J5349L8511m056J65512J8084k0506N400j9085n7782j60771j15291
12316b34070Q5159Q9047O3131n3918N5903n5434K0960m6573M451q9590j35837
12305b96771N3593M5808k0030M1199K0776N1888l9034j3520k8067J50716O2056
12294B8614j14754K249O9368N5252j2243r6312k9083P1846L6849o7593J12988
12283E7181R5330m4314j20991j50303k9216J23009O5868q3311j21890J02000N7383
12272d9254p1684M0457K3532N3103M8223o1622N7990M0408R9333J59339J3185
12261C53010o1398p7051q5400j15002J26459j07045k12523r7312O315P3598N9784
12250a36565J02902J25931J33565j8586P2183j64029j54707J7385J40130L7464
$$ y = [-74990, -99435, -84086, -45575, -49631, 115881, 133965, 113459, 118859, 99774, 41992, -118779, -234070, -148911, -59864, 3267, -50651, 5252, -50182, -29222, -75795, -71344, -160934, -296771, -243178, -197370, -217400, -176201, -155425, -103537, -142571, -156091, -184158, -33442, 28614, -86140, -83891, -14523, 40729, 28486, -67826, -96909, -25063, 11786, -55807, 57181, 152511, 108197, -12794, -163097, -192313, -69304, -3436, -86747, -208637, -106637, -49254, -120938, -80481, -56949, -3846, 44377, -17245, 40745, 81153, 180486, 339825, 353010, 291612, 214561, 129161, 14159, 140618, 33573, -178950, -276262, -269947, -196349, -136565, -33663, 92268, 225833, 207247, 279430, 115401, -39306, -21921, 118209, 155673]
12240A55673m8054j27235p188k2323K8843K545o7250M2458m8539R928p6922j0104
12228a68168q939K8839P4864J15402l7053Q523J16536J55438M2975j4073r8029
12217B16315j53365L9496P9093r921j3308P6644j5213J44855K7328j06723j39879
12206A45322j03161Q519k96P8999J2812j19807p4918r0098J28312O8749O5555
12195A19988N5107P0198P6671J26140r6348k09145j89190m2399m1203j00795M4062
12184a86914J87273Q9682J1312J5547j5118o2507P888q6205p4479o0442q455R6502
12172h5916L7662K5145Q4162J26031M9098p2212J6138m5562k3467O0092J344p6436
12160I6079K3077r3134j69485K03064K61739O69N9644K7144r9083j35334N5034
$$ y = [155673, 107619, -19616, -26804, -49127, -20284, -17739, -84989, -42531, -91070, -81142, -158064, -168168, -177107, -148268, -73404, 41998, 4945, 13468, 130004, 285442, 328417, 314344, 216315, 62950, 102446, 181539, 171618, 158310, 234954, 219741, 364596, 391924, 285201, 145322, 42161, 50680, 50384, 129383, 142195, 22388, -52530, -142628, -14316, 54433, 119988, 175095, 245293, 321964, 448104, 351756, 142611, -46579, -88978, -130181, -230976, -186914, 359, 90041, 101353, 116900, 101782, 39275, 47163, -39042, -113521, -173963, -182418, -85916, -48254, -23109, 61053, 187084, 236182, 163970, 180108, 134546, 111079, 171171, 172515, 96079, 119156, 26022, -143463, 59601, 321340, 322009, 381653, 408797, 309714, 174380, 229414]
12149B29414J577j27573m3207j00861O1223P2946j66R5884K6650R8413R8625L869
12137D16794l0120O6605L2502j20287j90021j16096k3013L3159m337J2545k510
12126G5221N9740p9912m0919O882R5302p0012Q1897r6817k34115j3407N6605p8103
12114b37638r7095M3841N5039R3186o9128o3455P9156L1549q7365J55481J48875
12103E2446Q6034j8051q0219N5497M9429r165m332L862n0819J6890j8043J56055
12091B39584J07270K1917q2463j55337m1668M1815M6978J09667j15985p473r5227
12080F9078q5696L1994j4782k6801R0392J13308J34157M990j40763k8762J68853
12069C15968J37868R1123J47574J79194J74171R1566R9367q0655j30647O6426
$$ y = [229414, 230991, 103418, 60211, -40650, 20573, 93519, 93353, 189237, 215887, 314300, 412925, 416794, 386674, 453279, 485781, 365494, 175473, 59377, 36364, 69523, 65186, 77731, 75221, 134961, 55049, 14130, 21012, 116314, 46302, 128199, 31382, -202733, -216140, -159535, -237638, -334733, -290892, -235853, -142667, -211795, -275250, -196094, -164545, -251910, -96429, 52446, 138480, 120429, 40210, 95707, 145136, 135971, 131639, 135501, 84682, 101572, 83529, 239584, 346854, 368771, 286308, 130971, 89303, 131118, 178096, 287763, 171778, 164305, 69078, -16618, 15376, 594, -26207, 64185, 177493, 311650, 316640, 175877, 147115, 315968, 453836, 544959, 692533, 871727, 1045898, 1137464, 1236831, 1156176, 1025529, 1091955]
12059A091955Q6995K5635n6315j28900q6844j78080j48638p8613j8264p9973j01121
12048C27837l3661L2636J4934M0478J1696j3941l4190r3264P3708Q8976P6039
12037D91248k2752k1635r2875q8745R871L8423j0223l2028l4694k7794M5965j18306
12025A36455j5286J53979J63011M1812j5090o0730m2561N7093J3490O17R1892
12014E24682M9579n0060m0453r9043J07641J66215j3565p4563J5783K3845Q8249
12003F98310J32793J2388J04188J19195N4835l7829J8178J18422n5040n418k439
11992A157583Q4342L0382l8286j7722K6337l1366K1597J3048Q4957Q4540m161
11981A411251O6073K40620J16302j09334L347J19552K14852J55875J79006Q5830
$$ y = [1091955, 1178950, 1204585, 1148270, 1019370, 932526, 754446, 605808, 527195, 508931, 428958, 327837, 294176, 326812, 341746, 382224, 393920, 379979, 345789, 252525, 326233, 415209, 491248, 468496, 446861, 353986, 265241, 275112, 313535, 303312, 271284, 236590, 208796, 254761, 136455, 121169, 275148, 438159, 479971, 464881, 404151, 361590, 418683, 432173, 432790, 524682, 574261, 524201, 483748, 384705, 492346, 658561, 644996, 570433, 586216, 610061, 698310, 831103, 843491, 947679, 1066874, 1121709, 1083880, 1102058, 1220480, 1165440, 1160022, 1157583, 1241925, 1272307, 1234021, 1216299, 1242636, 1211270, 1232867, 1245915, 1330872, 1415412, 1411251, 1477324, 1717944, 1834246, 1724912, 1728259, 1847811, 2062663, 2218538, 2397544, 2483374]
11971B483374k9814J72028J71763K47252K02423K02200L01411L96309M56255N05648
11961E108849N42204O18371M47703O51814R26491Q76509Q84352J089949J119309
11952A2265551J316252J663613K267834K805165L476763M508571N559113P313066
11944D1175928R726766J3435534J8850901K6610386L7837722N2193975O4521874
11937B64353086O3452681L9678610P54250l5939022n7261065n9593269n0145407
11930A65299864l8230691k8385070k0891687j5589109j1739121q841821o735779
11923C4886586n178986m218531l435728k710644k092581j757686j576198j478934
11915A2437298j075132r36354r43979p28347p51410p21151l90890l59042l80719
$$ y = [2483374, 2453560, 2625588, 2797351, 3044603, 3247026, 3449226, 3750637, 4146946, 4603201, 5108849, 5651053, 6269424, 6717127, 7368941, 8295432, 9171941, 10056293, 11146242, 12265551, 13581803, 15245416, 17513250, 20318415, 23795178, 28303749, 33862862, 41175928, 50902694, 64338228, 83189129, 109799515, 147637237, 199831212, 264353086, 327805767, 367484377, 368238627, 332299605, 275038540, 215445271, 165299864, 127069173, 98684103, 77792416, 62203307, 50464186, 41622365, 34886586, 29707600, 25489069, 22053341, 19342697, 17250116, 15492430, 13916232, 12437298, 11362166, 10425812, 9481833, 8753486, 8002076, 7280925, 6890035, 6530993, 6150274]
11906F150274m90493l84323k55075k10086k60970k12559j66360k51602k01471
11897C717335k12646j39943k80115j24201L1610o0856k23053q8976l9000j21743
11887B458412j60782k34732o2195j5836j2681j75803r3623o7772n8549m0898k160
11876A533381n6185q8092n3978j7288n5322m6324M2204m7705j73079N9841m3600
11865A053853j27019l0233m259q8608O2385K6184m0824N8429O4521m2339k3607
11854I08483J00668J3087P0696j41340j26740m5822N0215L4153K8206j324m204
11843H86078L3689o758n6502q6925r5843j04087p8436r3553k8281J76858J640
11832E47880j291J30399k3670j44720j29636J2000n9836Q356J38609K3893j1277
$$ y = [6150274, 5659781, 5275458, 5020383, 4810297, 4549327, 4336768, 4170408, 3918806, 3717335, 3504689, 3364746, 3084631, 2960430, 2992040, 2931184, 2708131, 2619155, 2580155, 2458412, 2297630, 2062898, 2000703, 1984867, 1972186, 1796383, 1702760, 1634988, 1576439, 1535541, 1533381, 1477196, 1389104, 1335126, 1317838, 1262516, 1216192, 1258396, 1210691, 1037612, 1097453, 1053853, 926834, 896601, 892342, 803734, 866119, 892303, 851479, 909908, 974429, 932090, 908483, 1009151, 1022238, 1092934, 951594, 824854, 779032, 829247, 863400, 891606, 890282, 886078, 919767, 913009, 856507, 769582, 673739, 569652, 491216, 397663, 369382, 546240, 547880, 546589, 676988, 653318, 508598, 378962, 390962, 331126, 339482, 478091, 501984, 490707]
11821D90707q8508p9674Q1507J46685j3747r6472o0503N1193n7196J08092J06024
11810E88108r9820j79938j25992P1589l5247J126L4562K5336l8045l3353K9927
11799B38253Q2097K1325j491p0107N302R8173m2982o1178q9727j41856j50486
11788a12677P2040Q1344R3631k2082l886J62067o1720r3540L1169J1599L0185
11777A88130K3405K0077l5331N9837L5031M8141P1305o231l8253p0101k7395J25240
11765C93855m6812J09903k7525p6932k3548l0803p4216j0252K8787P968J31634
11754C82059J17668N0380j37657k05098R8419Q7740j34614j82243m4462l8060
11744e868K6185O4638P644l9806j02580p4689L9138J929n1162N8226j7090k2769
$$ y = [490707, 402199, 322525, 404032, 550717, 536970, 440498, 379995, 431188, 373992, 482084, 588108, 488288, 308350, 182358, 253947, 218700, 219826, 254388, 279724, 241679, 208326, 238253, 320350, 341675, 340184, 270077, 275379, 373552, 330570, 269392, 179665, 37809, -112677, -40637, 40707, 134338, 112256, 108370, 270437, 208717, 115177, 146346, 157945, 188130, 211535, 231612, 196281, 256118, 291149, 339290, 410595, 404364, 366111, 296010, 268615, 393855, 347043, 456946, 429421, 352489, 328941, 298138, 223922, 213670, 242457, 250425, 382059, 499727, 550107, 412450, 207352, 305771, 393511, 258897, 76654, 32192, -5868, 20317, 84955, 92599, 52793, -49787, -124476, -85338, -83409, -134571, -76345, -93435, -116204]
11732a16204P0351m903L9063J10981N762J4180J2425p8988l4821Q5889P6690k5670
11720A54755L875O3156J70380j3206j4353j48678q5914p6584M1994n2679L0131
11709G2877k1030P865K5236K4219p6615M3821L0897l347j67912j2319m0937K8548
11697h8697J5524K0084P6042K31180R068K61j10974R5242L7471m7096Q1152O5961
11685C85218n4505K2476M6435J07798n8683j12985p139O5709R347M0253J2495
11674D56419M7467l148q7648m0771q0590m6789J9406L7617o9510M701r6752m2907
11662I7495J65334K21384M0647n3216J35784O5588J35085O1883O6941l9815o6020
11651H31090O9631o2828j75484j12617Q1276L6867m5924J910j58041j21580j54410
$$ y = [-116204, -45853, -50756, -11693, 99288, 105050, 119230, 131655, 52667, 17846, 103735, 180425, 154755, 158630, 221786, 392166, 378960, 364607, 215929, 130015, 53431, 95425, 42746, 72877, 51847, 59712, 84948, 109167, 32552, 76373, 107270, 103923, -63989, -76308, -117245, -88697, -73173, -53089, 22953, 254133, 263201, 263462, 152488, 247730, 285201, 238105, 319257, 385218, 330713, 353189, 399624, 507422, 448739, 335754, 328615, 394324, 403671, 443924, 456419, 503886, 500738, 413090, 372319, 291729, 244940, 264346, 301963, 232453, 237154, 140402, 97495, 262829, 484213, 524860, 471644, 607428, 673016, 808101, 869984, 936925, 897110, 831090, 900721, 837893, 662409, 549792, 631068, 667935, 622011, 623921, 465880, 344300, 189890]
11640A89890p5436R7704K9886J334O6031n9738o1844P8253K02420l6551r7817
11629C34132J33089J63179J29369j6160O4445J31147M8636k9030j10414n0100
11619G98293N7781p441j65871j96656m6717j824J19643m8357k8567l7626j37991
11608C04667r988J9293o7431j02402j684P4623K697r7077K0382k2687J3970J05549
11596B39912N4412o5218j07171o0143K1171O5866o576J266P4504m5309j88579
11585a5865j04563P4315J00255j14835j58002J62965J596M7873P8104p9922k0637
11574b8716O2760j38642j8867Q6280N8120J3792M892L7382p248J11054Q9702p6789
11562A93720l2967j17162K5159L0678p9052j47956N3644J2469J08633J3475O3620
$$ y = [189890, 114454, 212158, 242044, 243378, 309409, 249671, 187827, 266080, 468500, 431949, 334132, 467221, 630400, 759769, 743609, 808054, 939201, 987837, 958807, 848393, 798293, 856074, 848633, 682762, 486106, 439389, 437565, 557208, 508851, 480284, 442658, 304667, 294679, 313972, 246541, 144139, 142455, 217078, 219775, 122698, 143080, 120393, 134363, 239912, 294324, 229106, 121935, 61792, 82963, 148829, 142253, 143519, 218023, 172714, -15865, -120428, -46113, 54142, -60693, -218695, -55730, -54134, -6261, 71843, -8079, -28716, 34044, -104598, -123465, -37185, 20935, 34727, 39619, 77001, 69753, 180807, 270509, 193720, 160753, 43591, 68750, 99428, 20376, -127580, -73936, -61467, 47166, 60641, 124261]
11551A24261n5989Q8193o9385j37972r3613P3994p803j8372n7455J06195J85851
11540A37905J6117K1293j00247n7278n3966m0303r4526L5069M3793R8840l1812
11529b5115j02402j0295n0819p718J40151M3950N0605Q0036r410o7579q4822m5459
11517h8877P4870l4506M3075K0202k0824N2832r5406M7956J37446l7976k5790
11506G3002N6843m8305q0980J10010O1532j33244r9738k113m2664L4200k7987
11495i9444O5291R4608O9845j1472m8556k5416k0487O7954M0991j06618O8903
11484I5599J6727j7981m5999l6008M4651m7157j6004Q8740n9757J51506K16859
11473C91176J46950j5247p7056k86223l3907O7908P4692m3207j2033k5560n1254
$$ y = [124261, 68272, 156465, 87080, -50892, -144505, -70511, -78314, -96686, -154141, -47946, 137905, 154022, 175315, 75068, 17790, -36176, -76479, -171005, -135936, -92143, 6697, -25115, -127517, -137812, -188631, -196349, -56198, -12248, 38357, 118393, 108983, 41404, -43418, -88877, -14007, -48513, -5438, 14764, -6060, 46772, -48634, -678, 136768, 98792, 73002, 129845, 81540, 560, 110570, 172102, 38858, -60880, -62993, -105657, -71457, -99444, -34153, 60455, 130300, 118828, 70272, 44856, 24369, 92323, 133314, 26696, 95599, 112326, 94345, 48346, 12338, 56989, 9832, -6172, 82568, 22811, 174317, 391176, 538126, 522879, 445823, 159600, 125693, 193601, 268293, 225086, 213053, 187493, 136239]
11462A36239j13674j73487j24849r638l3186Q6921N6244J7015J15168P5941O6431
11451I9125l6865k3253q3504p880p2297K694N0794J20110K8186l4313J8673l512
11439E7958j77430j19809K2365N430J4093m6793o5457J07878Q0561P0225j71752
11428b22731m5192Q4049L2606J1490J13276M7105R0963n56j38021J07056k778
11417G7267j41779J73467O8333q3684j05143M2949L7217J53273R114K5081n660
11406B50435j78323j24691N7304J35775p7752K9998P7724j54458l8885m3701m3679
11395a10253k7528K8459M9538J28560O2414q4156m4649K5019k7473J3271J36065
11384A49267J1194p7386j32547m3525J18328K9002l5015L4348Q1984l6757j7553
$$ y = [136239, 22565, -150922, -275771, -285409, -318595, -231674, -175430, -158415, -43247, 32694, 99125, 62260, 39007, -44497, -52377, -124674, -121980, -71186, 48924, 77110, 42797, 61470, 57958, -119472, -239281, -216916, -211486, -197393, -244186, -309643, -201765, -121204, -50979, -222731, -267923, -183874, -151268, -139778, -26502, 20603, 111566, 111010, -27011, 80045, 77267, -64512, 108955, 177288, 93604, -11539, 31410, 68627, 221900, 231014, 256095, 250435, 72112, -52579, 4725, 140500, 62748, 92746, 170470, 16012, -22873, -66574, -110253, -137781, -109322, -59784, 68776, 131190, 47034, 2385, 27404, -69, 13202, 149267, 160461, 83075, -49472, -92997, 25331, 54333, 19318, 53666, 135650, 98893, 81340]
11373H1340K2792n1562M1948o1983p6786o2824l5345n3473N0786J53121R3044
11362A01058q5158J01263J05011m4410K7729o3318j39976o6177o5735J04426J08873
11351H3586j41299J7675J93521N9821m5455m5607o826o2387j65108M5319M5051
11340b1709O616P821K9639M3853o136r734k8289r211n2347m6640o0848K5673J39507
11327A8195O4599n9308P479j3293n2890m1373K7138p0717m09O570O5777J03638
11315E5406j16664o3480j21025n7591q406N5216J32482K52434K63617m9788o2488
11304B79713r2877j24751q6018M2874l4098l5287Q1312K8654J80782j6321j55361
11293F8622K9850l420j0367Q0524n1639q2445n6606j5105M8362j9947L6748L5141
$$ y = [81340, 104132, 52570, 94518, 32535, -44251, -107075, -142420, -195893, -145107, 8014, 101058, 15900, 117163, 222174, 177764, 205493, 142175, 2199, -63978, -129713, -25287, 83586, -57713, -40038, 153483, 213304, 167849, 122242, 115416, 53029, -112079, -66760, -21709, -15093, -7272, 22367, 66220, 60084, 50350, 22061, 12850, -39497, -86137, -146985, -121312, 18195, 82794, 23486, 30965, 17672, -35218, -76591, -49453, -120170, -120579, -114009, -48232, 55406, -61258, -124738, -245763, -303354, -311760, -256544, -124062, 128372, 391989, 342201, 279713, 186836, 62085, -23933, 18941, -15157, -50444, 30868, 59522, 240304, 223983, 68622, 98472, 95052, 84685, 165209, 113570, 31125, -25481, -40586, 7776, -12171, 24577, 59718]
11281E9718N2523n9271m8519P1602J12771o9737m8977k2095R925m7122p432J7689
11269B1075K5934K2921J4279N6766O9931l8690k7952j37175N1571R9599L3220
11258A91479k3887r0778K5524K4031q0940j26295K21111J52133m8972k24538j33340
11247a14472O0205K13401j5145j02988m4146J59078L7320j5082J8279m6888K0958
11236A70520j0252P3407P4237j4962L8279j85424j4889K0687N7166q761o4832
11225A35176m9776p0374j4454j40036j16359L6146J99541P6570L1053p6725j43364
11214a32602r1011m0887j3644M6366q925r5432l3224Q799P0980K4342N1012l8497
11202b52723J54414J01406L0280J6844J8275n1444o4205L812j8870q8021O7064
$$ y = [59718, 112241, 52970, 4451, 76053, 188824, 119087, 70110, 48015, 57940, 10818, 3386, 21075, 47009, 69930, 84209, 140975, 210906, 172216, 144264, 7089, 58660, 158259, 191479, 167592, 76814, 102338, 126369, 45429, -80866, 140245, 292378, 243406, 18868, -114472, -54267, 159134, 143989, 41001, -3145, 155933, 193253, 178171, 196450, 149562, 170520, 160268, 233675, 307912, 292950, 331229, 145805, 130916, 151603, 208769, 200008, 135176, 85400, 15026, 572, -139464, -255823, -219677, -20136, 56434, 87487, 10762, -132602, -223613, -264500, -278144, -231778, -240703, -336135, -369359, -360560, -289580, -265238, -214226, -252723, -98309, 3097, 33377, 50221, 68496, 17052, -47153, -43341, -62211, -150232, -83168]
11191h3168p5390j10285M5529j8877J82270J50311o686p9537o3259o4306j8040
11180a41438L8279M9205J9934J06507n2017j23788M9365p7669q4097N5880M7186
11169a12653r724j7340j21261J6576J73511J29008l4472j02214J52237J18491
11159A92159j58948j08076K6072P7244J23688j1710j09377R097o7246m3187O0619
11148i665J10928Q8071p1839k3236l5722n1171j14780j1503K25763K7103o4403
11137F9546j14191m0077p247N8139j154q29l2838j8898m5093n6412l0798M7208
11125a72644J83213J28492j10073j47486M7074N7814q2584j66651P6713N3025
11115a33107m703O0245J18922R4710q1164n8925J1550k18844j04172R484l6607
$$ y = [-83168, -158558, -268843, -223314, -242191, -59921, 90390, 83704, 4167, -59092, -123398, -141438, -103159, -53954, -34020, 72487, 20470, -103318, -53953, -131622, -215719, -159839, -112653, -122377, -139717, -260978, -244402, -70891, 58117, 23645, -78569, 73668, 192159, 33211, -74865, -48793, 28451, 152139, 140429, 31052, 40149, -27097, -70284, -9665, 101263, 189334, 117495, 94259, 58537, 7366, -107414, -118917, 106846, 133949, 69546, -44645, -84722, -91969, -33830, -34984, -35813, -68651, -87549, -132642, -189054, -219852, -172644, 10569, 139061, 28988, -118498, -71424, -13610, -96194, -262845, -186132, -133107, -137810, -77565, 41357, 136067, 54903, -4022, 7528, -211316, -315488, -306004, -342611]
11104c42611j2734M685j7219j5222j6456N7037K05662J01095r0137O550Q4719
11093c4631k015j35294L1684L2216J7731M0227P0174R8143J9060j7274n008n073
11081A09940r7760k5254K5598k9827n5810o0774R0129O2016k2595K4520j14678
11070i4495N3222J1768l8320j6779k8442L1246k60J18550J0237p6377k8014m9441
11058a07105O5103J79526m0623j14538O869M3545J25924K9451n834k9410j8912
11047A33996M3404K6935j948j5983o5499K6582N401N9030k594l0484N0016K7478
11035B56334Q0438n8164P5519J45081J14899O2407j08878q5615J3648j18693L0486
11024D07462O6892J13834K22798K91287J29059o4660l1705l9933k33219j41083
$$ y = [-342611, -355345, -350660, -367879, -383101, -399557, -342520, -136858, -35763, -125900, -119350, -34631, -36646, -171940, -140256, -108040, -90309, -50082, 20092, 118235, 137295, 120021, 115013, 109940, 12180, -13074, 12524, -17303, -73113, -133887, -43758, 18258, -4337, 20183, -94495, -41273, -29505, -67825, -84604, -113046, -81800, -82060, 36490, 46727, -29650, -57664, -107105, -42002, 137524, 96901, -17637, -10768, 32777, 158701, 188152, 182318, 152908, 133996, 177400, 204335, 202387, 186404, 120905, 147487, 152888, 211918, 209324, 178840, 228856, 256334, 336772, 278608, 354127, 499208, 614107, 676514, 567636, 482021, 495669, 376976, 407462, 474354, 588188, 810986, 1102273, 1231332, 1166672, 1134967, 1095034, 861815, 720732]
11014G20732p786j09736j5483J96367J79795j3212j83665n8955j55280j02230
11004D50547k7319j18080k6900M8101L4004p1682k3105J4675n1959J5907P0733
10993C14922K3714j09191L9223Q3868l7450o9013j15782j42718j6369k693J25583
10982I4094K5829j48230k328J48462j6876j58684M4414l6491p870K3960j56000
10971a89720R75J12104K9589r8071l9264J2759J59660j8774L9356j102r1730q438
10959i2656j826l9556j40196J8810Q2692j0066K0292l1829J20968L9119p1902
10948a06150J57703Q3556q9142k2587j1106m2200K5115K8846o1183L9851m9094
10937d6391j21116M0042R3690J15754n1483R946j11595j22495n0689k0275K04980
$$ y = [720732, 712946, 603210, 587727, 784094, 963889, 950677, 767012, 708057, 552777, 450547, 423228, 305148, 278248, 326349, 360353, 288671, 265566, 280241, 228282, 244189, 314922, 338636, 229445, 268668, 352536, 315086, 246073, 130291, -12427, -28796, -31489, 94094, 119923, -28307, -30635, 117827, 100951, -57733, -13319, -49810, -57680, -33720, -189720, -188745, -76641, -47052, -145123, -184387, -171628, -11968, -30742, 8614, 7512, -84218, -92656, -94482, -134038, -274234, -255424, -172732, -182798, -162506, -194335, -73367, -34248, -106150, 51553, 135109, 45967, 23380, 12274, -29926, -4811, 24035, -37148, 2703, -46391, -167507, -127465, -33775, 81979, 30496, 40442, -71153, -193648, -244337, -264612, -59632]
10926e9632P6406k9045J27059K9081j6135n876L6527q7023r5507J04801J3008
10915I3664q2142J0809l2110L9241J44892O7634j18502j87385r7748l5805j5914
10904b13366J28631J26454Q769L7578p2601m036j2202j9055j13165M3194O4749
10893b5050j8777p7151j3412R4614J6313o2626L1155J40199Q8316J1057j38334
10882D6304r240K333j5267r2185M508J6406O3622k6298l6952j7874m9358M5244
10870f8757j14420m2027k9812Q8753J3502K5890K2809K5544j16819k23292o9588
10859d88217L07496K15085M9585q5274j61056Q2164J96949J7904j76910k48097
10849b90371M8669J64432P3157J69920l3281j02783o8123j23192N8797J31740
$$ y = [-59632, 16774, -12271, 114788, 143869, 127734, 121858, 158385, 71362, -24145, 80656, 93664, 11522, 22331, -9779, 29462, 174354, 241988, 123486, -63899, -161647, -197452, -213366, -84735, 41719, 50488, 88066, 15465, 11429, -773, -19828, -132993, -89799, -25050, -43827, -120978, -134390, -39776, -23463, -86089, -54934, 85265, 173581, 184638, 46304, 37064, 39397, 24130, -68055, -63547, -47141, 16481, -9817, -46769, -64643, -114001, -68757, -183177, -225204, -255016, -166263, -152761, -126871, -104062, -78518, -195337, -418629, -488217, -180721, 34364, 83949, -1325, -162381, -80217, 116732, 134636, -42274, -290371, -241702, -77270, -4113, 165807, 132526, 29743, -38380, -161572, -102775, 28965]
10839B8965j9770K6380J36427k199p0012K5599O2541J35444p323n7692n1812k309
10827B04239o0792n7185J482J8153K6327m4129R604j24563O5134O7592O1212m9955
10815A17119j61789M4243J0951k00549r3906J87886M2947j7679J9535J11723J10321
10804A70802j08637j17519K0052O4517L7665J28388Q3099l7974M3361j37465k09710
10793f3421m599M7793j0026Q32L1821O4225M4878r607k0607P7816l7587k1384
10781A00134q1144o2027m8010q4276J9795k75k5972o7638Q2106o561K3182O9238
10769h1448N3622L5110m3159o7479j27886j19327J9519J4904k7531K21849P1656
10758e0170m5987k7095J7681m8378L9463J09748n7184r5213j08015L297P6833
$$ y = [28965, 9195, 35575, 172002, 169803, 99791, 125390, 187931, 323375, 316052, 258360, 206548, 204239, 143447, 86262, 87744, 105897, 132224, 88095, 97699, -26864, 38270, 105862, 167074, 117119, -44670, -427, 10524, -190025, -283931, -96045, -53098, -70777, -51242, 60481, 170802, 62165, -55354, -35302, 29215, 66880, 195268, 278367, 240393, 283754, 146289, -63421, -68020, -20227, -30253, -29421, 2400, 66625, 111503, 101896, 81289, 159105, 121518, 100134, 18990, -43037, -91047, -175323, -155528, -155803, -181775, -249413, -167307, -173868, -150686, -81448, -27826, 7284, -35875, -103354, -231240, -350567, -331048, -316144, -343675, -121826, -50170, -96157, -123252, -105571, -153949, -114486, -4738, -61922, -157135, -265150, -261853, -185020]
10747a85020p7093n5911Q750J80467O5963N7220P1543j9771n1583P944M8506K0291
10735G1306J10640N058p9998Q2163J22994M2598J361j26770N480K580p0134R3580
10723B60858Q9223L220q659L6706P8416R3506L9892M1669n0069o1293q5770j9673
10711D18026J40020J93337N4218J816n9332j12429M6422J5874q1116O1361j5329
10700F62868j71824k2337N8150j81391q5466J38574k089j87155j08482O9822J00391
10689B71061o5158q1835L5678J8701j35395n0944r0067K0835N3204J05954L3072
10678A15106j79086k2145P3205J29476J7055O2987q827j22852J49372J04608L30
10667C19229p2673q0366q8517P152P4352Q4946L44R846J98474j12042k00800N6092
$$ y = [-185020, -262113, -318024, -309274, -128807, -62844, -5624, 65919, 46148, -5435, 2509, 51015, 71306, 181946, 187004, 107006, 189169, 312163, 354761, 356122, 229352, 234832, 237412, 167278, 260858, 350081, 353301, 344642, 381348, 459764, 553270, 593162, 634831, 584762, 523469, 437699, 418026, 558046, 751383, 805601, 807417, 748085, 635656, 682078, 697952, 616836, 678197, 662868, 491044, 468707, 526857, 345466, 260000, 398574, 396485, 209330, 100848, 170670, 271061, 205903, 124068, 159746, 178447, 43052, -7892, -97959, -77124, -23920, 82034, 115106, -63980, -86125, -12920, 116556, 133611, 196598, 187771, 64919, 214291, 318899, 319229, 246556, 166190, 77673, 84825, 159177, 244123, 244467, 254313, 452787, 340745, 139945, 196037]
10655A96037K29550l0306m4547L8406R4237Q6812j1023N3066m4809R2342J42533
10644H02298k3412k8774J34774R1583L4696J40261J14024J46233J8177J59337
10634A589197J10055K19375K35978K85383L68110K62381N63553M73817L20247
10625D428096L07156P22630R59923J228349J664598K365920L083189M375746N902839
10616B5038446P455978Q891199R082210P169943L818159L67610j864082k239201
10608E7720262j106313J595238N061637R358673J4175212J7804490J7620738J2131175
10600A34361112L299820n187392j0059622j0195353o867904j546170M536241J1303081
10592A19643813J8003488K2359409K0542922J1171280k561619j4573813k0593862
$$ y = [196037, 425587, 395281, 350734, 389140, 483377, 570189, 559166, 612232, 567423, 659765, 802298, 778886, 750112, 884886, 976469, 1011165, 1151426, 1265450, 1411683, 1429860, 1589197, 1699252, 1918627, 2154605, 2439988, 2808098, 3070479, 3634032, 4107849, 4428096, 4735252, 5457882, 6417805, 7646154, 9310752, 11676672, 14759861, 19135607, 25038446, 32494424, 41385623, 50467833, 57637776, 61455935, 61823545, 59959463, 57720262, 56613949, 58209187, 63270824, 72629497, 86804709, 104609199, 122229937, 134361112, 137660932, 132473540, 122413918, 112218565, 105350661, 103804491, 108340732, 119643813, 137647301, 160006710, 180549632, 191720912, 189159293, 174585480, 153991618]
10585A53991618k0135007j5531864r367033l049766L036282Q119813J0998386
10578A28062429R250921K427744o768505j4066441j7224265j5878517j2285882
10571G3517484q085906m338752j070019J447943K358640J328516j552328n304705
10563E8300873p959673q758442q140729o899090n524491m237393l051424k205496
10555A1524135j798885j322246j084104p68420o79166n87286m53136l41293l24588
10546D165011l97368k36347j95571j69759k46083k08704j45682n2300q5653j42146
10536B285398l3950m33j59429l52994p4063o8989Q9509n1655o6674J4074q9755
10525A491039p0404j10207q9392J047k5576n8842o8554l8779m815M1173j6659
$$ y = [153991618, 133856611, 118324747, 108957714, 105907948, 108944230, 117064043, 128062429, 137313350, 139741094, 132972589, 118906148, 101681883, 85803366, 73517484, 65431578, 61092826, 60022807, 61470750, 63829390, 65157906, 63605578, 58300873, 50341200, 41582758, 33442029, 26542939, 21018448, 16781055, 13729631, 11524135, 9725250, 8403004, 7318900, 6550480, 5871314, 5284028, 4830892, 4489599, 4165011, 3767643, 3531296, 3335725, 3165966, 2919883, 2711179, 2565497, 2513197, 2427544, 2285398, 2251448, 2251015, 2091586, 1738592, 1664529, 1595540, 1685049, 1633394, 1566720, 1580794, 1491039, 1420635, 1310428, 1221036, 1222083, 1196507, 1137665, 1069111, 1030332, 1025517, 1066690, 1050031]
10514A050031j23433M3956K1934n6070o9667K2616o9049m5411k3543K9055n440
10503G74979n902J1275Q0854r120l5450J782l6665n6703j64317j33195K08786
10492F36324R1373m0297O6831j15616q5614K9976p1111n5115j11795m2053J02030
10481D04933j1309L2860k3342L1778L7588j2816q6325J59141O5776m2490n1780
10470E04014M206l6833j9423K2885j7627p2450j02833o7013p3084m4211J03568
10459B01199N6179J1881J43503R136m343l9902J6203J066O63J2145n6874j16039
10447B34817k2510o7057k2072P0796R7500j1025o9251p8726J9979N9743m664q569
10435A98961k9003L006j50945l5449J24948N0179j3307L7461l7234n2746J54204
$$ y = [1050031, 926598, 970554, 992488, 936418, 866751, 889367, 820318, 774907, 751364, 780419, 774979, 769077, 780352, 861206, 852086, 816636, 818418, 781753, 725050, 560733, 427538, 636324, 727697, 687400, 754231, 638615, 553001, 582977, 511866, 456751, 344956, 302903, 404933, 393624, 426484, 403142, 434920, 472508, 459692, 373367, 532508, 598284, 555794, 504014, 508220, 471387, 451964, 474849, 457222, 384772, 281939, 214926, 141842, 97631, 201199, 257378, 269259, 412762, 421898, 417555, 377653, 393856, 394922, 395585, 407730, 350856, 234817, 212307, 145250, 123178, 193974, 291474, 280449, 211198, 132472, 152451, 212194, 207530, 198961, 169958, 172964, 22019, -13430, 111518, 161697, 148390, 185851, 148617, 95871, 250075]
10424B50075J04821P3526r1924P6816o6125j09158K0640J29171J8299o7744m9752
10413B88645l7508J29967r168J0628l2271q1175j1067n5840m1646j38503N0350
10402G2412R1602J06096R9518l8707P3499o7030j33217j01227r3247J14653O7646
10391A91998j7882J45926L9009j34044j36002R81J9716j01818P1690J02535n3687
10380A28422K354K158K7607n3430O948M2330l732m0627J7762O4634K1924j00549
10368A15801N6209l6987k8179J03820O2059l7113P5458k7903l3101Q054m7095
10357B11023k293K4540K0075K3860k715n8094j24352m8401Q0948O3512m4415j01629
10345D2059p185k6385n4498o5047L2642P8442J65720J08077M7592j0415m4099
$$ y = [250075, 354896, 428422, 336498, 413314, 347189, 238031, 258671, 387842, 406141, 338397, 288645, 251137, 381104, 371936, 382564, 350293, 269118, 258051, 202211, 160565, 22062, 72412, 164014, 270110, 369628, 330921, 404420, 337390, 204173, 102946, 9699, 124352, 191998, 174116, 320042, 359051, 225007, 89005, 89986, 109702, 7884, 79574, 182109, 128422, 130776, 132934, 160541, 107111, 114059, 156389, 152657, 112030, 129792, 194426, 216350, 115801, 172010, 135023, 106844, 210664, 272723, 235610, 311068, 283165, 250064, 258118, 211023, 208730, 233270, 253345, 277205, 274490, 216396, 92044, 43643, 124591, 188103, 143688, 42059, 34874, 8489, -46009, -111056, -78414, 28, 165748, 273825, 321417, 311002, 266903]
10334B66903j01261J9907J51785o7113k35101j4618k0937l8544M7088l6494j32915
10323a61300n5476J3272j9237N7228J06419N7478Q3963L0031J3494O3121Q4637
10312B73630J1419r0831l4581J43171o8504j22735L6044P5164o7105R7626O1570
10301C14868j23632l3118M0056p8139q3239k542n3819J523J02818K8329n8279
10290E4826M21K7177J9220l5157P046o3405l5512J91016R5015j28012j77224M060
10278d0529M1076P476O2024J8662k6651J15J74297O9534K1574L1043q2972j15885
10266A59764J26563R826M917O0579j41482k23562n9589P6000O6811R4291L1874
10255B05992r1919j00551l9106l4332q5654M192K8988o2591K2242k3140R5300
$$ y = [266903, 165642, 185549, 337334, 270221, 35120, 20502, -435, -38979, 8109, -28385, -161300, -216776, -203504, -222741, -165513, -59094, -1616, 82347, 112378, 125872, 188993, 273630, 285049, 194218, 159637, 302808, 234304, 111569, 147613, 222777, 155672, 253298, 314868, 191236, 158118, 198174, 120035, 36796, 34254, -19565, -18042, 84776, 113105, 54826, 55247, 82424, 101644, 66487, 73533, 10128, -25384, 165632, 260647, 132635, -44589, -40529, 547, 8023, 70047, 88709, 62058, 62173, 236470, 306004, 327578, 358621, 275649, 159764, 286327, 296153, 301070, 361649, 220167, -3395, -62984, 13016, 79827, 174118, 205992, 114073, 13522, -25584, -59916, -145570, -141378, -112390, -174981, -152739, -175879, -80579]
10244h0579M893j02188J36415O2175J039Q1985q2017k2712p4852J8000l0198o9133
10232a57172L2958Q7597P5488n5262L4258M2551j4235J08709M3546L625M6273
10221B48336P9631r8442q0400q8136L1381K1950q2576N1885Q8649p127p0191n4533
10209D0427k4910P459j3025Q4721J08373O0791l0283n1940J00365J06235q0253
10198C07960j46743o4914K4364l3643K0636P4938L4905n3862p6146m1005M8996
10187I5486R3118R3431r6703j08928Q8017J13702N5587j7746m7925L4342J56765
10176D59146J5605j14014n3879K1996l436k1717J41794P2401o9037J02432m1032
10165E10259q485L9863q1004M4110m3966N2093N0833k1920K3504J16097J11961
$$ y = [-80579, -75686, -177874, -41459, 20716, 21755, 103740, 21723, -989, -75841, -57841, -88039, -157172, -124214, -36617, 38871, -16391, 17867, 60418, 46183, 154892, 198438, 202063, 248336, 327967, 229525, 149125, 60989, 92370, 114320, 31744, 83629, 172278, 165151, 94960, 40427, 15517, 22976, 9951, 94672, 203045, 263836, 233553, 181613, 281978, 388213, 307960, 161217, 96303, 120667, 87024, 107660, 182598, 217503, 163641, 87495, 46490, 95486, 188604, 282035, 185332, 76404, 164421, 278123, 333710, 315964, 268039, 302381, 459146, 474751, 360737, 306858, 328854, 325418, 303701, 445495, 517896, 448859, 551291, 510259, 501774, 541637, 460633, 504743, 460777, 512870, 563703, 541783, 565287, 681384, 793345]
10154G93345J11544K03071J77564l568M861k35707k88223o4242n3374j27479R4422
10143F12214J43290J76355M6006j92091r2110m2477o9777m112j07929p7190l2262
10132C59917n8975J03415J0092r3340J31362k0455j6500k1357p8283j64953j4287
10121A36636M8306q4484K141k1069j43335O7217P7416q3638k2875q3332m6236
10110a53253P8150J20617P6007J31276m25J4802j9249r8254p7704n2128j49443
10099a29604l9163P9878J9548n4445O6762o048R798L8854j40576l7767J05423
10088h7340M6924n9762p2180Q3928o9602J2320K04399J82714L9976K9971O2712
10077C74060k53136j16812m9557n795L9053J37030l4004q0151N7497K5055J2414
$$ y = [793345, 904889, 1107960, 1285524, 1281956, 1286817, 1051110, 762887, 698645, 645271, 517792, 612214, 755504, 931859, 977865, 785774, 693664, 651187, 581410, 577298, 469369, 392179, 359917, 300942, 404357, 414449, 321109, 452471, 432016, 415516, 394159, 315876, 150923, 136636, 184942, 100458, 102599, 81530, -61805, 5412, 82828, -810, -23685, -107017, -153253, -75103, 45514, 121521, 252797, 252372, 267174, 247925, 149671, 71967, 19839, -129604, -168767, -88889, -69341, -123786, -57024, -63072, -53274, -14420, -154996, -192763, -87340, -40416, -100178, -172358, -88430, -158032, -145712, 58687, 241401, 281377, 311348, 374060, 120924, 4112, -45445, -51240, -12187, 124843, 90839, 10688, 68185, 93240, 105654]
10066A05654M5678p5591j15708q3241m0278J49258k9682L0316J5194l9240L8941
10055A301l8760p4025L4140O3525M1292m3240j15920j1303j2497J07310M0928
10044g249P6946J31386L1534j17898j92706p6507J43440Q3032j58794l3786O7990
10033e2612P1100p7876l776R0217j4185p4622P6663J42645n5177j5683m9101l5284
10021B309j02946n6345Q2914P4877R3726M6284m5449n1376k2158p2685J46941
10010I6092j8547j47182L787O7939Q030J8360J11266j0404k1333o2391Q0842l7852
9998H8607r7330k5865L2823r5202O3108P95r5497J29314O6801J9458j11998p4480
9986i9466j41961q1360N988J45070R2009O2375k6031M5278j6398o1147J00304
$$ y = [105654, 151332, 75741, -39967, -123208, -163486, -14228, -43910, -13594, 1600, -37640, 1301, -37459, -111484, -77344, -13819, 27473, -15767, -131687, -142990, -155487, -48177, -7249, 69697, 201083, 232617, 114719, -77987, -154494, -11054, 71978, -86816, -120602, -52612, 18488, -59388, -63164, 27053, 12868, -61754, 14909, 157554, 102377, 86694, 37593, 2309, -100637, -156982, -74068, 809, 94535, 140819, 95370, 43994, 21836, -50849, 96092, 77545, -69637, -65850, 2089, 10119, 28479, 139745, 129341, 108008, 45617, 126459, 88607, -8723, -34588, -1765, -96967, -33859, -33064, -128561, 753, 67554, 87012, -24986, -99466, -241427, -322787, -316799, -171729, -79720, -17345, -43376, 1902, -14496, -75643, 24661]
9975B4661Q0327j85847j43026J1526J87993Q0834j3643P092J26243M5450j73788
9964D7822j38125j62062R6512K16552K4978R0113L123r1765l0230j03764n2571
9953i9417o4554o1427M5101Q9239J05171n3615n9062p8014O6774P5992K3791O2186
9941E2165N6309o191j74464j00142K4477n0715M7491M3946J23685M6041M2694
9930A05296j07164j04263P9908K3752p4842l8248o7447j4456Q9949M9203R7655
9919C9343O3624M909j02011p896J59606k8343j42715n8201j1222o7111m5842k935
9907a98794o268J00933R0686R5356J41919j38692m2124o7245k1256n5620L233
9896i7872J01732L2607l1461L1864K6759M4918M5226j562j03290m7830j8290N1545
$$ y = [24661, 104988, -80859, -223885, -212359, -24366, 56468, 42825, 49917, 176160, 221610, 47822, -90303, -252365, -155853, 60699, 85677, 175790, 178913, 87148, 56918, -46846, -99417, -163971, -225398, -180297, -91058, 14113, -39502, -98564, -176578, -109804, -33812, -10021, 52165, 108474, 102283, -72181, -172323, -147846, -198561, -151070, -107124, 16561, 62602, 105296, -1868, -106131, -26223, -2471, -77313, -115561, -183008, -197464, -107515, -58312, 39343, 102967, 107876, 5865, -2031, 157575, 129232, -13483, -71684, -82906, -150017, -195859, -198794, -205062, -104129, -13443, 81913, 223832, 85140, 43016, -24229, -45485, -101105, -97872, 3860, 36467, 5006, 36870, 63629, 108547, 153773, 152211, 48921, 1091, -17199, 34346]
9884C4346p0533K0250R3726Q6867P1937M6242l9682l0791m8792j87623J2565L4973
9872B3485J9522l7814n8449j29771o8111J9101O6036k2520P6903R8829o5616m1212
9860a19617J6399m4805R2572P9463p894N1362K9743M3704o7906l1957Q1431l2810
9848H9685k9328j13225N2495J9004J2397r1191j14633J35858P811R139O1387L163
9836D2562m6145m3341j2040j55589N3732J94320M8188l7244J85K2388R4822o9863
9824I1975l6806k6086q4790N4614k037Q015O7775K7622o7368P6758N6907o75L240
9811A69144j7820m9703K1535N7253j58862J1754q1731o8109J65642Q0865N7398
9800A87366j12819M5333J03575o8667k63955j23234J31786N4822L0005j18217
$$ y = [34346, -36187, -15937, 77789, 164656, 236593, 282835, 243153, 212362, 163570, -24053, -11488, 23485, 43007, 5193, -53256, -183027, -251138, -232037, -166001, -188521, -111618, -12789, -78405, -119617, -103218, -148023, -55451, 24012, 16118, 67480, 97223, 140927, 73021, 41064, 122495, 89685, 60357, -52868, -373, 18631, 31028, -60163, -174796, -38938, -31127, -21988, 39399, 42562, -3583, -46924, -58964, -214553, -160821, 33499, 81687, 44443, 44628, 67016, 161838, 91975, 55169, 29083, -55707, -1093, -3130, 4885, 72660, 100282, 32914, 109672, 166579, 165904, 169144, 151324, 101621, 123156, 180409, 21547, 33301, -48430, -116539, 49103, 129968, 187366, 74547, 119880, 223455, 154788, -109167, -232401, -100615, -45793, -15788, -134005]
9790a34005M3563J82705N3040k1334j7010O1946l2993j6998R715N9040j6719j1717
9778A59233Q1036K8174j00940p0692J1877J1004L657n2205l2510p6332n8276L1462
9766f4512M3617Q444q3127k3191k41M8388q7542n3112n8826L5381l3303p589n7758
9753c33371J6091K9688R8814k8690J14074J60248j4046l2514j518N8548o4155
9742C169k9969K3831J4522j04703o2719O0782Q838J37728n0987k432j06124k20
9730a08284K03342N8977j39852r2422J3232K1268q7813n3578N8153K05814M2756
9719A21593Q660m53q3680m7968l2237J1168O1057j9117N3480j15878j17858Q2153
9707g9080J64456J5513q6693k8482j9381k5044l3357j7906M1114j55432M0102
$$ y = [-134005, -90442, 92263, 145303, 123969, 106959, 168905, 135912, 118914, 128629, 187669, 170950, 159233, 240269, 268443, 167503, 96811, 108688, 119692, 123349, 71144, 38634, -37698, -95974, -64512, -20895, -12451, -95578, -118769, -119010, -70622, -158164, -211276, -270102, -234721, -268024, -275613, -333371, -317280, -287592, -188778, -217468, -103394, 56854, 42808, 10294, 8776, 67324, 3169, -26800, -2969, 11553, -93150, -155869, -95087, -86249, 51479, 492, -1940, -108064, -108284, 95058, 154035, 14183, -78239, -65007, -43739, -131552, -185130, -126977, 78837, 121593, 130253, 129800, 46120, -1848, -34085, -22917, 38140, 19023, 72503, -43375, -161233, -79080, 85376, 100889, 14196, -14286, -33667, -58711, -92068, -109974, -68860, -224292, -184190]
9696a84190N5661m0248J2556J9092J20818L3549L478J6725r3492K0737M8540O260
9684A9486J22838J32394j03425j15431M6939j2539R2217j37966k15852N4508J33477
9673A6646k2549j004M3873O5803k7109q6377L8868O6607J1678k1731j0640K0478
9661I4543m5610p3133O7110J08453Q4562o4713R240N309R0153K15992J25416j6179
9649F01143j10892j79784k03360p0963O2069J60812m8542m1333k1941j32122J1455
9638B6542Q503L831l9857k6141p7985k9310P9998J66676J36820n7316k01285n6064
9626f5588k0881p5306k6550P758R9444J09278L5749Q6822n5258j84708M8931j3787
9614e4096Q9050l3072o0109k5571L1747M2158n0410o021N1316k8351J7905j5388
$$ y = [-184190, -128529, -168777, -156221, -137129, -16311, 17238, 20716, 37441, -56051, -35314, 13226, 19486, 142324, 274718, 171293, 55862, 102801, 90262, 182479, 44513, -171339, -116831, 16646, -5903, -6907, 36966, 102769, 75660, -10717, 28151, 94758, 106436, 84705, 74065, 94543, 48933, -24200, 42910, 151363, 235925, 171212, 180452, 185761, 275914, 491906, 617322, 601143, 490251, 310467, 107107, 36144, 98213, 259025, 210483, 169150, 147209, 15087, 26542, 35045, 38876, -981, -27122, -105107, -134417, -54419, 112257, 249077, 191761, -9524, -65588, -86469, -161775, -188325, -180567, -81123, 28155, 63904, 150726, 95468, -89240, -40309, -54096, 34954, 1882, -58227, -83798, -52051, -9893, -60303, -66324, -15008, -43359, -25454, -40842]
9602d0842J9651P0604m8337j58158j911R9779O3126N9876J2791q4326j11952j06638
9590b26337P4847J20323K8453J31574q5739r1522L3851k5988Q092K185N3135J96404
9578B19278k391o8598j52381O036P4555j51318j7994j05336P7782K53574M614
9567A37821n6841O936J22187l335q5745j08321k4779m2098m8236K3460O5391K9584
9555A6024L0009m8834l9974n6392J2552p1603k3872J54110Q9474J839r623k20728
9543a67018J2468J55968k3208q0167j8399Q7431J51643q3023r5041m0471N2692
9532d7125J58290L562j56816k5412l9915L2363Q1482q1168o4492R7470J63594
9521A21833L2957Q4897m0128o765j53817j4852J39412O1553j88214j47063j20941
$$ y = [-40842, -21191, 49413, 1076, -157082, -158993, -59214, 3912, 63788, 76579, -7747, -119699, -226337, -151490, -31167, -2714, 128860, 43121, -48401, -14550, -40538, -32446, -30261, 22874, 219278, 216887, 148289, -4092, 1944, 76499, -74819, -92813, -198149, -120367, 133207, 137821, 80980, 87916, 210103, 206768, 121023, 12702, -12077, -54175, -102411, -78951, -13560, 16024, 46033, -2801, -42775, -99167, -86615, -158218, -182090, -27980, 61494, 63333, 53710, -167018, -154550, 1418, -21790, -101957, -120356, -32925, 118718, 35695, -59346, -99817, -47125, 111165, 114727, -42089, -67501, -107416, -75053, 6429, -74739, -139231, -41761, 121833, 154790, 239687, 199559, 192794, 38977, 24125, 163537, 225090, 36876, -110187, -231128]
9510b31128O1483R8995j7406p5757J6402K2321J45610Q4645l1734j2425Q1451
9499A42457K9603n9170o7989q2541l2452J3416K8235l1650O886l1249J1975Q5559
9487A3080R2327j4425n238l4079j06116j69950M2244O5265J2501J73826Q5197
9476A54632m2873q8424M2348j070n9807K2220J13856K1869j28497r8265M0617
9465b3394L5226J7391o3364n6477j11388j5951J1982K9898K2052P3400j3907R742
9453h4790j22420p452m9597J35535J03334k764q0518N6965l1335R4455P8189N4853
9441A44455m6587j57349Q5023P7650o0201k3133K5874J24338n4188q8827m2069
9430a5014r542j35712L3701J18360M0517r4501j06871J23842J49039n7713p9864
$$ y = [-231128, -169645, -70650, -88056, -163813, -147411, -125090, 20520, 105165, 73431, 61006, 142457, 172060, 112890, 44901, -37640, -70092, -56676, -28441, -60091, -53205, -84454, -72479, 13080, 105407, 90982, 85744, 51665, -54451, -224401, -182157, -116892, -104391, 69435, 154632, 111759, 23335, 65683, 64613, 4806, 27026, 140882, 162751, 34254, -64011, -23394, 11832, 29223, -34141, -90618, -202006, -217957, -205975, -176077, -154025, -80625, -94532, -84790, -207210, -214662, -264259, -128724, -25390, -28154, -108672, -51707, -83042, 11413, 89602, 144455, 97868, -59481, 25542, 103192, 42991, 19858, 45732, 170070, 115882, 27055, -15014, -24556, -160268, -126567, -8207, 32310, -62191, -169062, -45220, 103819, 46106, -33758]
9419c3758N1123p1693j25208Q2843Q8811J20881j05159p0768k4183O5517O4028
9408D2434R1727l9339j42265r0449O8141J5145L9748L5827j8073J07075q1403
9397B8568j16878k4101o9243j3418N1198J10412K09754K8297p1150k9670O8579
9386A72348q235l2557l3498m1367O9033R0323j7817r8615j96556j60554K5242
9375b32253J72039j8327j89613o5988l4437K28432P1523j0980M237R447j8468
9364h4388k8261j05019j369J65473J34412n6538K1247o3793L8297L3844J22291
9353A76196p4959j93326n7475O5203N5850j2576R067J10151k6665j31598k4622
9342a04754Q2226J32431p3341L7052j40562n8186j6166m3602k1085M8568Q0548
$$ y = [-33758, 17365, -54328, -179536, -96693, -7882, 112999, 7840, -62928, -87111, -21594, 42434, 134161, 94822, -47443, -137892, -69751, -54606, -14858, 20969, 2896, 109971, 28568, -88310, -112411, -181654, -195072, -143874, -33462, 176292, 204589, 133439, 103769, 172348, 164113, 131556, 98058, 56691, 125724, 216047, 198230, 99615, -96941, -257495, -232253, -60214, -78541, -268154, -334142, -368579, -140147, -68624, -79604, -75367, -65920, -84388, -112649, -217668, -219037, -53564, 80848, 24310, 45557, -18236, 20061, 53905, 176196, 101237, -92089, -149564, -84361, -28511, -41087, -32020, 78131, 51466, -80132, -104754, -22528, 109903, 36562, 73614, -66948, -125134, -141300, -184902, -205987, -157419, -76871]
9331g6871J40763K8767j5812n806m7403P3890K03593l6313k09133j17324L0962
9320c0687j83478J59722J52344j4081m7567J05917J7473L2927R3317k4638n413
9309B55836j13011r0567j02495Q902Q00o1011l2252O037J67J918P4450J7055o5442
9296i9613J6986q0484q2271P8503M5705j03681N1618N3780Q0711P4854N5219o8751
9284B2576j98574n1339R4922k7168O0009J65842N8743r2282L1841l5207j24719
9273i5356o0203J66952P1066o3717L5218m3399k80504j26023J05559J66975J21847
9262a585K0054l8595l6227K6337K2261p1491M2502Q2040q8942O9466r5846o4761
9250a34787J12201o487k0075O9995N578j36443N3487J11243Q7976L3574j55522
$$ y = [-76871, 63892, 92659, 76847, 71041, 23638, 97528, 301121, 264808, 55675, -61649, -30687, -214165, -54443, 97901, 83820, 36253, 142170, 159643, 192570, 285887, 261249, 255836, 142825, 52258, -50237, -41335, -40535, -101546, -133798, -127761, -127594, -125676, -51226, -34171, -99613, -82627, -163111, -245382, -166879, -121174, -224855, -173237, -119457, -38746, 36108, 91327, 22576, -175998, -227337, -132415, -159583, -99574, 66268, 125011, 32729, 64570, 29363, -95356, -155559, 11393, 82459, 18742, 53960, 10561, -269943, -395966, -290407, -123432, -1585, 18469, -20126, -56353, -30016, -7755, -79246, -36744, 45296, -43646, 25820, -70026, -134787, -22586, -29073, -49148, 20847, 26425, -110018, -56531, 54712, 142688, 176262, 20740]
9239B0740r8719j1514j32720L361J19372J78390L4166q7920j26976N1967O9106
9228A9253j21730o6737L6671K0083k3333o3887K2697J37256k0009k2608P0836
9217a1508l2631n7071Q1902N3471k852L6219J0405m9648O1923J19327o7203m2017
9205A00317n2028j2740j02433o0570n3662L6707N3653O405k8081K9056N3850l5580
9193f5106k5346K0740J36788J16619j04923r1374j59168K0606J80453j20383k746
9182i3840J3713J9885L6981p5083p7234k7158M6488L6073q7655J14230J38162
9171D4562K0907j22163p7504j5238N4556o1716N5983M1676P719K5050R7494K4456
9159I5782M9855q2072j61801r2568l2351M121N9610J10031J41344M0940K3845
$$ y = [20740, -77979, -89493, -222213, -218852, -99480, 78910, 113076, 25156, -101820, -49853, 19253, -102477, -169214, -132543, -112460, -135793, -199680, -176983, -39727, -59736, -82344, -11508, -44139, -101210, -19308, 34163, 31311, 67530, 77935, 28287, 90210, 209537, 142334, 100317, 48289, 35549, -66884, -127454, -181116, -144409, -90756, -84351, -112432, -83376, -29526, -65106, -90452, -69712, 67076, 183695, 78772, -12602, -171770, -151164, 29289, -91094, -93840, -80127, -60242, -23261, -98344, -175578, -202736, -156248, -120175, -207830, -93600, 44562, 65469, -56694, -134198, -149436, -94880, -156596, -100613, -58937, -51218, -26168, 71326, 95782, 145637, 63565, -98236, -190804, -223155, -219034, -159424, -49393, 91951, 132891, 156736]
9148A56736m7111q464r7463n9074m4875J42337R370o2393j08892m7182K32723
9137F5712J6687r7074Q4713k0468j39986Q751J50819m7610j20778K881o595J5002
9125h7946J32375O1330j21181m8064K6593N3620M9605M0449Q2432n9510j12796
9114A6907j08075j4960J11371J13420k9905p8134p2757n538L1428M3998K0492
9103B8247M1873O3467l4704L257K7222K9162l3045j61723m2966K1874k4263K5475
9091e6124Q7962k7797Q4324L8723j0775R1111j27334j09036N1698J0306m3804
9080a0746L9283J01948R3436p0709o6865k4203j20627p5993K6277O590J23151
9069B1542J46584j41374N2181J37255m7431j88041r0521R1410o2053N1807J32848
$$ y = [156736, 109625, 101161, 3698, -55376, -100251, 42086, 51456, -10937, -119829, -167011, 65712, 82399, -14675, 70038, 49570, -90416, -81665, 69154, 21544, -99234, -96353, -102948, -87946, 44429, 105759, -15422, -63486, -36893, 16727, 66332, 106781, 189213, 129703, 16907, -91168, -106128, 5243, 118663, 88758, 10624, -62133, -67671, -36243, 7755, 28247, 70120, 133587, 98883, 102140, 129362, 158524, 125479, -36244, -79210, -57336, -81599, -56124, 31838, 4041, 88365, 127088, 116313, 207424, 80090, -28946, 22752, 33058, -10746, 28537, 130485, 223921, 153212, 86347, 62144, -58483, -134476, -108199, -101609, 21542, 168126, 26752, 78933, 216188, 168757, -19284, -109805, -18395, -80448, -28641, 104207]
9058A04207n6945L6497J1282n7267J15450J38944p3181q7015L3792o420j2949
9047A46395l8440N7217K7119o2788k5456P6977R5323l2619k29789J4052O3598
9036I1589j71722p5927J67241P9202N970J02312Q3180o737j041j36711r4925J6353
9024E8784m0203j22880J09988J00827J00535m2862j19539o8162j5L2309j0308
9013a526P9581n6371n9166Q0759J36627p7258j9684J21l4133n3563J10823n9413
9001D6797R6166L9310q5043j22425O6696N4222O1080j41319J3784j11581j0138
8990i2451J35695j4952o4257M1329K4400R940O2875J02112j729r3598j32463j4629
8978c7728P0558K6907o9058o561L4218M3420k4990j97005q482J20631N8905J9955
$$ y = [104207, 47262, 83759, 95041, 37774, 153224, 292168, 218987, 131972, 165764, 159344, 146395, 107955, 165172, 192291, 129503, 104047, 181024, 276347, 243728, 13939, 27991, 91589, -80133, -156060, 11181, 90383, 96353, 198665, 281845, 275108, 274067, 137356, 42431, 58784, 18581, -104299, 5689, 106516, 207051, 164189, 44650, -23512, -23527, 8782, -1526, 78055, 21684, -37482, 43277, 179904, 102646, 82962, 83083, 48950, -4613, 106210, 46797, 142963, 182273, 97230, -25195, 41501, 95723, 156803, 15484, 29268, -82313, -92451, 43244, 28292, -35965, 5364, 29764, 39704, 102579, 204691, 202962, 109364, -23099, -37728, 32830, 59737, -9321, -15882, 18336, 61756, 36766, -160239, -168721, -48090, 10815, 30770]
8966C0770r3362o5896p9080j5012L8927J32172O6169j17248k9905N2327j33403
8955b13541Q9840K2449J7651J6070L0040j04029j200N1990N5474J30363Q5649
8944A80756o4321j21289j2979L7557k8305N9165K6067k9950L9440K3260N7819
8933A67220q2612o4658o6977q1766L426J8572M8153J37737R6418j12599m5447
8922A7467j07209k4995q437P4042J03299L6341o9774M3305J63130J526j29702
8911I8993L337j0541J24129O3395n3629j02031K3861P4117j69325j64023l2983
8900a44700J06028m7846q2086r735J9771k0481j6508Q2404P5839J12830k6685
8889D8831o9025j67224o5772j0152j1642M3963J73927M2958q879p6378O2060R5887
$$ y = [30770, -62592, -128488, -207568, -222580, -183653, -51481, 14688, -102560, -132465, -80138, -213541, -123701, -101252, -83601, -67531, -37491, -141520, -142720, -90730, -35256, 95107, 180756, 116435, -4854, -17833, 19724, -8581, 50584, 76651, 46701, 86141, 109401, 167220, 84608, 19950, -47027, -128793, -125367, -106795, -58642, 79095, 175513, 62914, 17467, -89742, -114737, -123174, -49132, 54167, 90508, 20734, 64039, 227169, 228695, 98993, 102330, 91789, 215918, 279313, 225684, 123653, 147514, 221631, 52306, -111717, -144700, -38672, -86518, -168604, -178339, -158568, -179049, -195557, -113153, -37314, 75516, 48831, -20194, -187418, -253190, -263342, -274984, -231021, -57094, -14136, -23015, -99393, -37333, 58554]
8877E8554Q3816j6011l8143L2333J13615M1455O3206j25288j05168p1700K3636
8866F0305Q9571m4565j9087M3746L7030l4362j4586K8529R0953j00852j45758
8855i076n0362J72764O1395n3402O9796J10822m7984l1219k891L7610j06070N4095
8843B05478k6640k5887l3437j59424N4277j5279n0499n3694K165K9346M8638O376
8831a8580j23281k6360k8044J05443L9854N9433n4862j6034J8990p6508k1979
8820a41928R6761J45646j09737o6620M7663m4026n2192J5618J16247k8400N7864
8809C6896l5205j31557j5285J11083J8063l1926K2269J21693L7041o9025q3228
8798a9181Q611J5769l0666r0489J1522J01278Q6229j84621k22533o8313J21738
$$ y = [58554, 142370, 126359, 88216, 120549, 234164, 275619, 338825, 213537, 108369, 36669, 60305, 149876, 105311, 86224, 129970, 167000, 132638, 118052, 146581, 237534, 136682, -9076, -59438, 113326, 174721, 121319, 191115, 301937, 253953, 222734, 219843, 257453, 151383, 205478, 178838, 152951, 119514, -39910, 14367, -912, -51411, -105105, -102940, -73594, -24956, -18580, -141861, -168221, -196265, -90822, -50968, 8465, -46397, -62431, -43441, -119949, -141928, -45167, 100479, -9258, -75878, -28215, -72241, -124433, -108815, 7432, -20968, 36896, 1691, -129866, -145151, -34068, -16005, -47931, -25662, 96031, 133072, 64047, -19181, -10570, 5199, -25467, -115956, -104434, -3156, 83073, -101548, -324081, -392394, -270656]
8787b70656J36105k5131K1259p624J1545O042R0317Q9030o9073Q0839M9451n9681
8775E2423J0156p936q4026j58650R6880R6928p7660j00372l9413J51887P436L9588
8763a2759K8019p7314J3929K4269p1141m9991K0141J28790M2079p0712j8708K847
8751d0551M2600l2408O0692P9948Q7165l7190K8756j19589L378l4863j26640m13
8739h9115n5770q0832O327J19136J41816Q4611N1443k03717j17762j2104J6975
8728a38992J82244o5559j58401p0603K2160M7249O1633J10206K5492R8518O8451
8717A82398r904M4972n308r7837j98603M0842N1381j0995Q109J8328k6734M778
8705A427j5937K8759P9749n958m6271m7842k5961J22975j13056n7039n6698M9075
$$ y = [-270656, -134551, -159682, -138423, -146047, -134502, -128460, -38143, 50887, -18186, 62653, 112104, 52423, 62579, 54643, -29383, -188033, -91153, 5775, -71885, -172257, -211670, -59783, -52347, -12759, 15260, -62054, -48125, -23856, -94997, -144988, -124847, 3943, 46022, -24690, -43398, -40551, 2049, -30359, 30333, 110281, 197446, 160256, 189012, 69423, 72801, 37938, -88702, -89115, -144885, -225717, -219390, -100254, 41562, 126173, 177616, -26101, -143863, -155967, -138992, 43252, -22307, -180708, -251311, -229151, -181902, -120269, -10063, 15429, 113947, 182398, 172494, 217466, 212158, 114321, -84282, -43440, 7941, -3054, 5055, 23383, -3351, 1427, -14510, 14249, 93998, 88040, 41769, -6073, -32034, 90941, -22115, -79154, -135852, -86777]
8693h6777M9833q3673L0836j1395K9695N6417P8567l8272j00590P5322J1534j863
8681I634O5711j05730m6977n2940j4041O7793Q816n9682l9339J51006J53493O9202
8669B06946k7906j84562o1991M053l6796m7110K1712p853M305o4828J02280L6083
8657e5667J8075N2683M5615k08641p8327p9076n2938O1336K28575N1871p4628
8646i1122k8664P8367O3056j31613R2211P1488P8620O2812Q883k6751l2749n2411
8634I2127L2357j2989j81382p7163P7022J15837r129J0577p4498m3671J2167k0306
8622g9051Q2592K5243j43451p7177K291J46902M4870p4837K3899R066l6759Q1539
8610E127L9499L282L2483L9597P3628J9763J9851j4795j01973N679J776j26223
$$ y = [-86777, -36944, -120617, -89781, -101176, -71481, -15064, 63503, 25231, -75359, -37, 11497, 9634, 75345, -30385, -77362, -130302, -144343, -76550, -67734, -127416, -166755, -15749, 137744, 206946, 179040, -5522, -67513, -63460, -100256, -147366, -125654, -133507, -129202, -194030, -91750, -55667, -37592, 15091, 60706, -147935, -226262, -305338, -358276, -296940, -68365, -16494, -91122, -119786, -41419, 21637, -109976, -17765, 53723, 132343, 195155, 204038, 177287, 144538, 92127, 124484, 111495, -69887, -147050, -70028, 45809, 36680, 47257, -27241, -70912, -58745, -79051, 3541, 28784, -114667, -191844, -189553, -42651, 2219, -72618, -48719, -39653, -76412, 5127, 44626, 47908, 80391, 119988, 193616, 213379, 233230, 218435, 116462, 122141, 123917, -2306]
8598b306J37218M1485j51772l1009Q0505n8264Q682J05872J04694L2910k0956
8587B47059m4763p819K4078M7734o5967p5191M2347N1956m2871r0250M9546j4204
8575A21655o18j27421k6847M1555p894k6045l3441q8953L3840n2687J24724N3967
8563A1835j6558K7581M4603K4672J21271m9815r7621r4968l5980N3456m8503q882
8551f8909Q2874R1466m0347O3652j07862M2094J9078j02217L9255J89906o2424
8540A46566j23761j16240o0151L8437Q8797p7881j2466K6032N0099j37L0966K2963
8528A3224J7704O426p9998O3650l3377l4229J38439J03368k7422j46378j16866
8517i5459J8419o6251n115P1625K016J0053P591K4754k4610J5577M167q714J38386
$$ y = [-2306, 134912, 176397, 24625, -6384, 74121, 15857, 24539, 130411, 235105, 268015, 247059, 202296, 194477, 218555, 266289, 200322, 125131, 167478, 219434, 176563, 86313, 135859, 121655, 121037, -6384, -33231, 8324, 430, -25615, -59056, -148009, -114169, -166856, -42132, 11835, -4723, 22858, 67461, 92133, 213404, 163589, 65968, -29000, -64980, -11524, -60027, -68909, 13965, 105431, 65084, 128736, 20874, 62968, 82046, -20171, 19084, 208990, 146566, 22805, -93435, -153586, -115149, -26352, -104233, -116699, -90667, -40568, -40705, -9739, 13224, 30928, 37354, -42644, 21006, -12371, -46600, 91839, 195207, 167785, 21407, -95459, -77040, -143291, -148406, -76781, -74765, -64712, -57121, -32367, -56977, -41400, -37233, -45947, 92439]
8504I2439L793k2087O5446l1392O1174o3354k1644j15055j75521J34394J91291
8493A19484L9866l2109q5290o9481q7791M0915j39500p458J16338R2342K8523
8482A5839M2609J2724j39029k4756o7534o6007l6719M6837O3805O6235J54402
8471F8406q3462k3513L4925O8962N1186J00966j5340p2539k54931r9786N0390
8460a74736P0821O0632L8616M9120j40984P6772M3965M95J31277K8159r3126j54033
8448f3022q3278L0838J32109J68053r8181j31056K134m229m3838P6140J17191
8437A02861L8230J2963p7678m9152l7441m089q0661O9159J66302k9k4611O2091
8425A77945Q1240j49508k10628J1802n869j34076M6453J90887L6537j13836m0528
$$ y = [92439, 96232, 74145, 139591, 108199, 169373, 106019, 84375, -30680, -206201, -71807, 119484, 159350, 127241, 41951, -27530, -115321, -74406, -213906, -221364, -105026, -12684, 15839, 58448, 71172, -67857, -92613, -160147, -226154, -262873, -216036, -152231, -85996, 68406, -15056, -38569, -3644, 65318, 116504, 217470, 202130, 129591, -125340, -225126, -174736, -103915, -43283, -4667, 44453, -96531, -19759, 24206, 24701, 155978, 184137, 91011, -63022, -146300, -115462, 16647, 184700, 86519, -44537, -42403, -46632, -90470, -14330, 102861, 141091, 154054, 76376, 27224, -10217, -14306, -94967, -25808, 140494, 140465, 115854, 177945, 259185, 109677, -100951, -89149, -95018, -229094, -182641, 8246, 44783, -69053, -109581]
8414a09581P6332o1105l3107O2567N7460Q3431m4217l7228q3271l8049N2367P8411
8402D010N4417J6090O2428N5773j82626Q93J02808n7861o8398n2885N501R5196
8390C5346J09450l4989l3626O2690q7921q945L3457J4494o7808R470p8308q3148
8378a29838o703L4503K3022Q233J23328K79L9746Q7437p1766j16795n6724j9593
8366h4871Q9368J07769k078r9463J06966K4936j49730M7334L0709q3931J1366
8355a625M7842m6841K8720Q5741J49500l3926j4669N2006L633j55011J8032j28924
8343D478j024L1778J22335R3053J7710j76266j51041n0418J6858J10528P1367
8332H9358J2963k9926n7091p9659k1030N9334R034Q3665j06918Q4487L8320k5668
$$ y = [-109581, -33249, -94354, -127461, -64894, -7434, 75997, 31780, -5448, -88719, -126768, -74401, 4010, 58427, 74517, 136945, 192718, 10092, 10985, 113793, 55932, -12466, -65351, -59850, 35346, 144796, 109807, 76181, 138871, 50950, 42005, 75462, 89956, 22148, 31618, -46690, -129838, -136541, -102038, -79016, -70783, 52545, 52824, 92570, 180007, 108241, -8554, -65278, -84871, 4497, 112266, 110188, 10725, 117691, 142627, -7103, 40231, 70940, -12991, -1625, 46217, -624, 28096, 113837, 263337, 229411, 214742, 266748, 270381, 115370, 133402, 4478, 3454, 35232, 157567, 250620, 268330, 92064, -58977, -109395, -92537, 17991, 89358, 102321, 72395, 15304, -64355, -85385, -26051, -17017, 66648, -40270, 44217, 82537, 56869]
8320E6869P8818l5917q6453n5780O6113k1571n6194q6775J2335J02951j6513J0243
8308c1874K9224J10663J47615M3762K5473k1620k94976j04088K9633N6083O7675
8297E7570p53j02897J4134K1455j05712Q8293P9203j2004R6881m0227n9239q3488
8285d6784J25419m4481j29359n6793r1400J15723Q5314J0717j35775j22434J17098
8274a72755J22577J7512j97866l7302J20575J45149J44084l8700j32224J3671
8264a5279r3546k188J4833k9932M0125R1946k0672K2203Q8845j02987j16606n2934
8252a76192O3091J15898L2829l4890Q7919J04613J92401o2901m2357k9574q8338
8241A62499m8381l0762r9381j63752L8225J24246k8510p7157J18405J7196L3086
$$ y = [56869, 135687, 99770, 13317, -42463, 23650, 2079, -54115, -140890, -128555, -25604, -42117, -31874, -2650, 108013, 255628, 299390, 324863, 303243, 8267, -95821, -66188, -10105, 57570, 56817, -46080, -31946, -10491, -116203, -27910, 51293, 39289, 136170, 95943, 36704, -46784, 78635, 34154, -95205, -151998, -243398, -127675, -42361, -31644, -167419, -289853, -172755, -50178, -32666, -230532, -267834, -147259, -2110, 141974, 103274, -28950, -15279, -108825, -111013, -96180, -126112, -85987, 5959, -14713, 7490, 96335, -6652, -123258, -176192, -113101, 2797, 35626, 736, 88655, 193268, 385669, 322768, 280411, 250837, 162499, 114118, 83356, -16025, -179777, -141552, -17306, -45816, -122973, -4568, 12628, 45714]
8230D5714n3768m1475J02754P416j7733O0636M6777k4725J820J2529p1375r2483
8218b3913r8891J311N5990O4192n4052k07915Q2924K12838O0004Q525j04839l5992
8206c9818J52669r1483J04164Q4577r0140j22254j50779m0P4934L0212q5485l4398
8194a67841O1157M9007j6788J5051L0968r7154m1246N5798j0758M8911o7014Q9467
8182e0442J53644O8818K7516j0792j06003R2176K293j02594P0102O4939k2327
8171A87330J4874R0361j07560n6726k3809M2260k00105k18851J21689O0171O4083
8160b6283L7654j2447p0269Q2768r4962p339O1891q491q4614n6171J4008P0046
8148i4209J24389P1352J9241j1573j52591K0721J50390m9540j58873J417M0897
$$ y = [45714, -8054, -49529, 53225, 60641, 42908, 103544, 150321, 125596, 127416, 139945, 68570, -23913, -122804, -121493, -65503, -1311, -55363, -263278, -180354, 32484, 92488, 101013, -3826, -39818, 112851, 21368, 125532, 210109, 119969, -2285, -153064, -153104, -78170, -47958, -133443, -167841, -106684, -57677, -74465, -59414, -28446, -125600, -166846, -111048, -121806, -72895, -139909, -50442, 103202, 172020, 199536, 188744, 82741, 174917, 177210, 74616, 144718, 209657, 187330, 202204, 292565, 185005, 128279, 104470, 146730, -53375, -272226, -150537, -90366, -26283, 11371, -1076, -71345, 11423, -83539, -90878, -28987, -37478, -122092, -178263, -164255, -94209, 30180, 101532, 120773, 109200, -43391, -22670, 127720, 78180, -80693, -79276, -38379]
8137c8379P328K578j8761J06464P6267o7290k1386N3632K3598o8195o7807p6092
8125h8043j5585L1663l3263j09267J1743J89226R9666j20153m5053K5876k4772
8114g7962j05507j2706J04134J93394M7369K4504k9598k4847o680k64o7455K4635
8102F9017j38701l0643J02085J098j4803q4423j15965j80019R5050J62182J07886
8091b7236j0776K6327M3664o2643j8876O5529P0414p0041n3317o4695o9014J0897
8079a59767P0429O0694n2691j01447R5659P9337L32l8397j9783L8642J85641J90590
8067C49239R443j75124k33090n3602P9257o9457p5695R9921J79113J976p2275
8056C9706R8980M4662N940P4530m6137q8197L4636J15831P7641r5461j98999l9803
$$ y = [-38379, -31051, -28473, -47234, 59230, 135497, 68207, 46821, 100453, 124051, 55856, -11951, -88043, -103628, -71965, -105228, -214495, -202752, -13526, 86140, -34013, -79066, -53190, -77962, -183469, -196175, -92041, 101353, 148722, 173226, 143628, 118781, 112101, 111837, 44382, 69017, -69684, -100327, 1758, 2856, -11947, -96370, -212335, -392354, -297304, -135122, -27236, -38012, -11685, 31979, -30664, -49540, 15989, 86403, 16362, -36955, -101650, -170664, -159767, -89338, -28644, -81335, -182782, -87123, -7786, -7454, -45851, -65634, -26992, 158649, 349239, 358682, 183558, -49532, -103134, -23877, -93334, -169029, -69108, 110005, 111981, 39706, 138686, 183348, 189288, 263818, 217681, 129484, 164120, 279951, 357592, 262131, 63132, 23329]
8044B3329M1231J27357M5645j8956k6015j05772o9068n4318j1555L7345P5190
8033F4413J05345n7221J13215j63290k38395l5607P3474J46246q5798O2423J386
8022a3809j55188K7680J83527p2525q2628j1059n5360j0969P6326R317k4752L6683
8010i2757m9155K3911K17620Q415j79562k8549J79590R737J12219r893J9272J2908
7998B23756j92556j21242p5120O3412J07386k0614J34815o544N7904j10806o2048
7987a657J12770K0016L8680j28335j12802O4667j20535N319J47854l229k38636
7976b15888l001J12799J18908N7966j19349q5298r2569L9190J07786J28332o151
7965D2725j58993p233M9301p2327j01235j5876M3108P8777Q8474J18403R2532
$$ y = [23329, 64560, 191917, 237562, 218606, 192591, 86819, 17751, -36567, -48122, -10777, 64413, 169758, 112537, 225752, 62462, -175933, -211540, -138066, 8180, -77618, -15195, -13809, -168997, -141317, 42210, -30315, -112943, -124002, -179362, -190331, -114005, -104688, -129440, -92757, -141912, -118001, 99619, 108034, -71528, -100077, 79513, 89250, 201469, 191576, 210848, 223756, 31200, -90042, -165162, -101750, 5636, -14978, 119837, 113293, 171197, 60391, -1657, 111113, 131129, 169809, 41474, -71328, -6661, -127196, -121877, 25977, 22748, -215888, -218889, -106090, 12818, 70784, -48565, -133863, -226432, -187242, -79456, 48876, 42725, -116268, -123501, -74200, -146527, -247762, -263638, -220530, -141753, -53279, 65124, 157656]
7954A57656k7652L0000k4204l0546R0249r3600r5042P0947K7714r5538q6601K8180
7942d8437O2809L432m0153m8407j01421p889J40455K520L7763k9477j10947O8194
7930g1558N0817j13371j9618J43258L7908P4571p0430J42270o4752n8093n3996
7919b994k0717L7327j11847K9241J57722q8735o5239P6330q262l622k6273j67681
7907a94750M1051J9430P5870O9157N001K4316m9803p0093L5702M7987J13916K5227
7895A43011j16541q2915P814K0209N9178l0336K1933K1706q9509N5316R2396J66776
7883B69038k1163r5524j13425l9770L2309K396L8181k67r9220m1318n4664J04914
7871a8513J5608l1403m976J03431l1789p2646K5653p7047O7888K21569K4427j48071
$$ y = [157656, 130004, 160004, 135800, 105254, 195503, 101903, 6861, 77808, 105522, 9984, -76617, -48437, 14372, 17804, -22349, -70756, -172177, -180066, -39611, -37091, 672, -28805, -139752, -71558, -20741, -134112, -153730, -10472, 27436, 102007, 31577, 173847, 109095, 51002, -2994, -23711, 13616, -98231, -68990, 88732, -3, -65242, 11088, 2826, -796, -27069, -194750, -153699, -134269, -58399, 10758, 15759, 40075, -9728, -79821, -44119, 3868, 117784, 143011, 26470, -56445, -48631, -28422, 30756, 420, 22353, 44059, -45450, 9866, 102262, 269038, 247875, 152351, 38926, -844, 31465, 33861, 72042, 71775, -27445, -68763, -123427, -18513, -2905, -34308, -39284, 64147, 32358, -40288, -14635, -91682, -23794, 197775, 222202, 74131]
7859G4131j04133J01344J33638q9064n8023j0079n6614j22292j060N3290n9797
7848a38659M12n1783j0401Q9553R9100O8867l7697l3473L8093j7252k15558O0994
7836a47804N2522O7836n7583j3518o8320j4343M8434P320n0619n243J4167Q3199
7824h3952j39628l2689K04249k345r1257l5761P9525L2058Q7986l1010R4183p6
7812H1283N212K5284r7038j01087J5785j1093M6196O8804Q8598R382j19546k9928
7800a8148j921L0589l5023m24R9138J23104j337m2143q7806j04358l9779R0805
7788A2697Q3365J00835N772j26381j88859j4014J72179J33955N7632r029K9978
7777B58130R5944r2041j30920j13004O5764N0735J05056O1648N484r7282J02951
$$ y = [74131, -30002, 71342, 204980, 115916, 57893, 47814, -8800, -131092, -132152, -78862, -138659, -138247, -190030, -200431, -110878, -11778, 57089, 19392, -14081, 24012, 6760, -208798, -147804, -95282, -27446, -85029, -98547, -166867, -181210, -132776, -125456, -176075, -181318, -167151, -83952, -223580, -256269, -52020, -54365, -145622, -181383, -101858, -69800, 18186, -12824, 81359, 81283, 86495, 111779, 14741, -86346, -70561, -81654, -35458, 33346, 121944, 131326, 11780, -18148, -20069, 10520, -24503, -24927, 74211, 197315, 195978, 153835, 66029, -38329, -78108, 12697, 96062, 196897, 202669, 76288, -112571, -126585, 45594, 179549, 237181, 228152, 258130, 354074, 262033, 131113, 18109, 83873, 134608, 239664, 301312, 306796, 209514, 312465]
7766C12465p8974j69828j13527r9203O6257M5827j28489j52309K4666M9361J4944
7755b28810K9614P6459J7978N6672j72615L5042K32333L7411J6020k8349r5069
7744b3314j13207N4455M5904j527J43957m3131j59194l2810N1273Q6482N4324
7733F3212j13276p5215k6601R9120o2000l146J7657l0813K5143K7891M4638o667
$$ y = [312465, 233491, 63663, -49864, -149067, -82810, -36983, -165472, -317781, -293115, -243754, -228810, -199196, -122737, -104759, -48087, -220702, -185660, 46673, 84084, 100104, 71755, -23314, -136521, -82066, -36162, -37689, 106268, 63137, -96057, -128867, -77594, 8888, 63212, -50064, -125279, -151880, -52760, -114760, -117906, -100249, -131062, -105919, -78028, -33390, -40057]
$$ [...]
##END NTUPLES=NMR SPECTRUM
##END=
