##TITLE=Analysis number 310839
Compound Code cc 38513
Book Reference 335/188
Project Code adrs
Chemist Name davee
##JCAMPDX= 6.0         $$ Bruker NMR JCAMP-DX V2.0
##DATA TYPE= NMR SPECTRUM
##DATA CLASS= NTUPLES
##ORIGIN= Bruker BioSpin GmbH
##OWNER= NMR
$$ XWIN-NMR		Version 3.5
$$ Thu Jun 23 13:05:07 2005 GMT Daylight Time (UT+1h)  MAYBRIDGE\NMR@NMR_250MHZ
##.OBSERVE FREQUENCY= 250.131544655141
##.OBSERVE NUCLEUS= ^1H
##.ACQUISITION MODE= SIMULTANEOUS (DQD)
##.ACQUISITION SCHEME= undefined
##.AVERAGES= 16
##.DIGITISER RES= 18
##SPECTROMETER/DATA SYSTEM= dpx250
##.PULSE SEQUENCE= zg30
##.SOLVENT NAME= CDCl3
##.SHIFT REFERENCE= (INTERNAL, CDCl3, 0, 16.522)
##AUDIT TRAIL= $$ (NUMBER, WHEN, WHO, WHERE, WHAT)
$$ ##TITLE= Audit trail, XWIN-NMR		Version 3.5
$$ ##JCAMPDX= 5.01
$$ ##ORIGIN= Bruker BioSpin GmbH
$$ ##OWNER= NMR
$$ C:\u/data/dgb/nmr/ADRS/4690/pdata/1/auditp.txt
$$ ##AUDIT TRAIL=  $$ (NUMBER, WHEN, WHO, WHERE, WHAT)
(   1,<2005-06-23 13:04:49.54 +100>,<MAYBRIDGE\NMR>,<NMR_250MHZ>,
      <created by zg, POWCHK disabled, PULCHK disabled
       configuration hash MD5:
       62 19 C7 07 E1 42 D1 B7 37 6C 3D D0 77 39 F9 E6
       data hash MD5: 64K
       C1 AB 4C CF 18 C5 6B 9D AE 02 08 1E AB 39 7C 08>)
(   2,<2005-06-23 13:05:00.41 +100>,<MAYBRIDGE\NMR>,<NMR_250MHZ>,
      <Start of raw data processing
       ef LB = 0.3 FT_mod = 6 PKNL = 1 SI = 32K 
       data hash MD5: 32K
       EA 6B 8F 75 5C 12 20 DC 0E C7 17 3D A3 BB D6 31>)
(   3,<2005-06-23 13:05:02.38 +100>,<MAYBRIDGE\NMR>,<NMR_250MHZ>,
      <apk 
       data hash MD5: 32K
       F4 C4 90 81 0E 11 54 57 DA B5 A3 9E CE D7 89 9E>)
(   4,<2005-06-23 13:05:03.10 +100>,<MAYBRIDGE\NMR>,<NMR_250MHZ>,
      <abs ABSG = 5 
       data hash MD5: 32K
       93 25 5A 14 66 20 92 6B 4B E3 67 B0 67 B8 2A DB>)
$$ ##END=
$$ 
$$ hash MD5
$$ D4 0A 1D 8F A6 16 54 14 62 AB EE C0 A9 67 3B 48
##$RELAX= 
##$RELAX= 
##$RELAX= 
##$RELAX= 
##$RELAX= 
##$RELAX= 
##$RELAX= 
$$ Bruker specific parameters
$$ --------------------------
##$DU= <C:\u>
##$EXPNO= 4690
##$NAME= <ADRS>
##$PROCNO= 1
##$TYPE= <nmr>
##$USER= <dgb>
##$AMP= (0..31)
100 100 100 100 100 100 100 100 100 100 100 100 100 100 100 100 100 100 
100 100 100 100 100 100 100 100 100 100 100 100 100 100 
##$AQSEQ= 0
##$AQ_mod= 3
##$AUNM= <au_zg>
##$AUTOPOS= <20 >
##$BF1= 250.13
##$BF2= 250.13
##$BF3= 250.13
##$BF4= 250.13
##$BF5= 500.13
##$BF6= 500.13
##$BF7= 500.13
##$BF8= 500.13
##$BYTORDA= 1
##$CFDGTYP= 0
##$CFRGTYP= 5
##$CHEMSTR= <none>
##$CNST= (0..31)
1 1 145 1 1 1 1 1 1 1 1 1 1 1 1 1 1 1 1 1 1 1 1 1 1 1 1 1 1 1 1 1 
##$CPDPRG= <>
##$CPDPRG1= <>
##$CPDPRG2= <>
##$CPDPRG3= <>
##$CPDPRG4= <mlev>
##$CPDPRG5= <mlev>
##$CPDPRG6= <mlev>
##$CPDPRG7= <mlev>
##$CPDPRG8= <mlev>
##$CPDPRGB= <>
##$CPDPRGT= <>
##$D= (0..31)
0 1 0 0 0 0 0 0 0 0.06 0 0 0 0 0 0 0.0002 0 0 0 0 0 0 0 0 0 0 0 0 0 0 
0 
##$DATE= 1119528288
##$DBL= (0..7)
120 120 120 120 120 120 120 120 
##$DBP= (0..7)
150 150 150 150 150 150 150 150 
##$DBP07= 0
##$DBPNAM0= <>
##$DBPNAM1= <>
$$ [...]
##$SUBNAM7= <"">
##$SUBNAM8= <"">
##$SUBNAM9= <"">
##$SW= 20.6930455092707
##$SWIBOX= (0..15)
0 0 3 0 0 0 0 0 0 0 0 0 0 0 0 0 
##$SW_h= 5175.983436853
##$TD= 65536
##$TD0= 1
##$TE= 295.16
##$TE2= 300
##$TE3= 300
##$TEG= 300
##$TL= (0..7)
0 120 120 120 120 120 120 120 
##$TP= (0..7)
150 150 150 150 150 150 150 150 
##$TP07= 0
##$TPNAME0= <>
##$TPNAME1= <>
##$TPNAME2= <>
##$TPNAME3= <>
##$TPNAME4= <>
##$TPNAME5= <>
##$TPNAME6= <>
##$TPNAME7= <>
##$TPOAL= (0..7)
0.5 0.5 0.5 0.5 0.5 0.5 0.5 0.5 
##$TPOFFS= (0..7)
0 0 0 0 0 0 0 0 
##$TUNHIN= 0
##$TUNHOUT= 0
##$TUNXOUT= 0
##$USERA1= <user>
##$USERA2= <user>
##$USERA3= <user>
##$USERA4= <user>
##$USERA5= <user>
##$V9= 5
##$VALIST= <valist>
##$VCLIST= <CCCCCCCCCCCCCCC>
##$VD= 0
##$VDLIST= <DDDDDDDDDDDDDDD>
##$VPLIST= <PPPPPPPPPPPPPPP>
##$VTLIST= <TTTTTTTTTTTTTTT>
##$WBST= 1024
##$WBSW= 4
##$XGAIN= (0..3)
0 0 0 0 
##$XL= 0
##$YL= 0
##$YMAX_a= 377244
##$YMIN_a= -576388
##$ZGOPTNS= <>
##$ZL1= 120
##$ZL2= 120
##$ZL3= 120
##$ZL4= 120
##$ABSF1= 16.522
##$ABSF2= -4.171173
##$ABSG= 5
##$ABSL= 3
##$ALPHA= 0
##$AQORDER= 0
##$ASSFAC= 0
##$ASSFACI= 0
##$ASSFACX= 0
##$ASSWID= 0
##$AUNMP= <proc_1d>
##$AZFE= 0.1
##$AZFW= 0.1
##$BCFW= 0
##$BC_mod= 0
##$BYTORDP= 0
##$COROFFS= 0
##$CY= 12.5
##$DATMOD= 1
##$DC= 0
##$DFILT= <>
##$DTYPP= 0
##$F1P= 14.0000005364418
##$F2P= -0.99999901652339
##$FCOR= 0.5
##$FTSIZE= 32768
##$FT_mod= 6
##$GAMMA= 0
##$GB= 0
##$INTBC= 1
##$INTSCL= 1
##$ISEN= 128
##$LB= 0.3
##$LEV0= 0
##$LPBIN= 0
##$MAXI= 10000
##$MC2= 0
##$MEAN= 0
##$ME_mod= 0
##$MI= 0
##$NCOEF= 0
##$NC_proc= -5
##$NLEV= 6
##$NOISF1= 0
##$NOISF2= 0
##$NSP= 0
##$NTH_PI= 0
##$NZP= 0
##$OFFSET= 16.522
##$PC= 1
##$PHC0= -79.65552
##$PHC1= 5.937484
##$PH_mod= 1
##$PKNL= yes
##$PPARMOD= 0
##$PSCAL= 4
##$PSIGN= 0
##$REVERSE= no
##$SF= 250.13
##$SI= 32768
##$SIGF1= 0
##$SIGF2= 0
##$SINO= 400
##$SIOLD= 32768
##$SREGLST= <1H.CDCl3>
##$SSB= 0
##$STSI= 32768
##$STSR= 0
##$SW_p= 5175.98343685301
##$SYMM= 0
##$S_DEV= 0
##$TDeff= 65536
##$TDoff= 0
##$TI= <Analysis number 999999
Compound Code 99
Book Reference 9
Project Code 9>
##$TILT= no
##$TM1= 0
##$TM2= 0
##$TOPLEV= 0
##$USERP1= <user>
##$USERP2= <user>
##$USERP3= <user>
##$USERP4= <user>
##$USERP5= <user>
##$WDW= 1
##$XDIM= 32768
##$YMAX_p= 374588705
##$YMIN_p= -192624
$$ End of Bruker specific parameters
$$ ---------------------------------
##NTUPLES= NMR SPECTRUM
##VAR_NAME=  FREQUENCY,     SPECTRUM/REAL,   SPECTRUM/IMAG
##SYMBOL=    X,             R,               I
##VAR_TYPE=  INDEPENDENT,   DEPENDENT,       DEPENDENT
##VAR_FORM=  AFFN,          ASDF,            ASDF
##VAR_DIM=   32768,         32768,           32768
##UNITS=     HZ,            ARBITRARY UNITS, ARBITRARY UNITS
##FACTOR=    0.157963299565203, 1,           1
##FIRST=     4132.6476996994, 0,             0
##LAST=      -1043.33573715361, 0,           0
##MIN=       -1043.33573715361, -192624,     0
##MAX=       4132.6476996994, 374588705,     0
$$ Real data points
##PAGE= N=1
##DATA TABLE= (X++(R..R)), XYDATA
$$ [...]
19141 -101910 -134753 -94706 -68799 -71284 -27518 3375 -18018 -19136 -39026 -40294 6435 3781
19129 3781 42965 76533 20404 -14109 -7022 -10336 -35488 3148 4162 10772 -5786 -29858 -55276
19116 -55276 -16293 -21901 -10606 3661 20714 15996 45204 -26337 -102732 -150158 -138970 -145858
19104 -145858 -81867 -22095 -35436 -57187 -51912 -57322 -62084 -24883 -10609 4821 10975 -25617
19092 -25617 -40794 -44442 -47930 2992 60989 45534 31366 -25066 -73006 -55133 -91885 -143215
19080 -143215 -120004 -70351 4761 73694 125293 53864 -9468 -13379 23212 -4528 -25782 -3691
19068 -3691 -4443 37388 36259 -16752 11651 -17362 -109569 -117902 -28796 -20491 -39809 -15111 80645
19055 80645 69407 42445 -30596 -68577 -26951 2952 -20663 -64317 -70124 -87598 -76966 -56114
19043 -56114 -30359 -106550 -106308 -30485 7549 56588 51948 80950 67126 91642 108017 81640
19031 81640 94189 105608 47264 13442 5574 25846 -5964 -40000 -40370 -98818 -80664 10818
19019 10818 66412 60225 -9785 -35119 8643 80220 113691 78983 57435 30445 14989 22746
19007 22746 67702 79867 95610 108832 59066 46485 61023 74200 29061 9749 -52748 -55125
18995 -55125 -62966 -54970 -59500 -56274 -8638 920 37039 87560 54144 48714 -7552 -66513 -25340
18982 -25340 38047 21141 9426 28353 39187 33959 57264 52634 14291 1369 26441 7268
18970 7268 -9003 15603 24580 27372 64946 78812 89944 72195 69543 45244 49219 63126 107903
18957 107903 117137 69020 27954 -42410 -29753 33917 67766 53361 19100 -14233 -25699 44975
18945 44975 85355 66094 98523 69947 -18147 -73197 -87057 -42246 -12709 -17016 47530 36773
18933 36773 17099 -44948 -87881 -53996 -34389 -27601 1439 -3290 5792 20401 35525 31407
18921 31407 5308 943 11551 11160 -15012 -27043 4632 -42640 -60015 -62077 -36882 -45299 -41936
18908 -41936 -10964 8000 56006 60371 13207 -13424 25971 -13609 -35481 -65935 -116532 -129909
18896 -129909 -143474 -99568 -82926 -61114 -47193 -72207 -122691 -109286 -98980 -77317 -61582
18885 -61582 -25539 -8908 -6264 4717 -12592 -62579 -65747 -59421 -19087 -8287 -10861 14121
18873 14121 45374 53845 34090 25202 672 22555 -2283 -34493 -19138 -54380 -74345 -35284
18861 -35284 -65864 -128087 -69577 32603 66187 29019 39197 69978 -1799 -49969 -36291
18850 -36291 7413 40225 7785 12266 10335 -5809 21594 26684 18614 43805 80092 98395
18838 98395 101422 14082 -31551 -16268 25969 74417 74551 106109 33814 -7937 -19103 -28199
18826 -28199 -4249 13727 25981 -28560 -16919 35137 32671 -20722 -68044 -60796 -30096 -31476
18814 -31476 25930 54319 23583 805 -14597 -13026 -59949 -104286 -92523 -109713 -87109 -64278
18802 -64278 -49126 3701 -6532 -54094 -46613 -62154 -87514 -90025 -56000 7539 4180 -40782
18790 -40782 -42010 -17193 33800 84659 75976 20492 1084 -27197 -19826 11241 -15775 14882
18778 14882 40581 17226 -8737 27826 44153 77030 133858 150854 167181 277720 352625
18767 352625 402516 387456 284527 190337 146900 143854 104741 98824 128633 131895 89711 94015
18755 94015 138027 115293 62792 1734 -40663 -32339 29594 73646 105836 52914 6614 -60500
18743 -60500 -44989 38442 64820 41348 21351 57200 82891 67227 100383 132709 119029 113561
18731 113561 34459 1013 -24327 -49569 -42446 -17084 15683 -9705 10053 42934 66708 41517
18719 41517 23296 -9029 -26219 16851 -5735 -27470 39482 51388 -17383 -42967 -20804 -3405
18707 -3405 28547 49780 47076 39262 40501 41384 66975 76546 17514 -43114 -24293 -43120 -79580
18694 -79580 -34103 51440 95643 113261 62238 46870 69331 37137 25738 79938 66850 39441
18682 39441 21932 28826 34431 50736 100783 130815 133442 81241 5422 -55356 -24369 13649
18670 13649 16677 -63216 -49165 -6372 24420 56656 10814 -10636 -15821 26231 70658 64991
18658 64991 2187 -20598 -13570 -55208 -28272 -4498 26819 8065 71197 77505 22833 57666
18646 57666 40223 19068 38948 56088 21482 -26325 -37392 -46771 -65963 -37497 -11649 -41935
18634 -41935 14102 63525 106127 97080 51629 54109 41250 32088 -12022 -65776 -31794 26612
18622 26612 181 -6116 15900 -3511 -12056 16852 -32963 -96584 -75644 -55032 21205 61077
18610 61077 11672 46145 41207 68849 99831 74718 38679 26601 11783 16395 568 7424
18598 7424 635 38755 26218 2320 49408 14113 -15843 -1790 -31888 -48250 -12903 44781
18586 44781 62927 48812 118560 131491 63413 38214 37241 13232 26522 31770 53260 72918
18574 72918 65682 81066 96848 83780 82141 68331 -2097 -35387 9899 46892 84427 95472
18562 95472 87564 43150 6358 22311 54652 145579 228493 269877 321846 348704 340317 308409
18550 308409 262442 210643 158036 122037 108644 120837 166762 201972 190123 130786 51340
18539 51340 14995 60154 158221 140356 108798 89574 132653 170422 173756 105571 36924 21563
18527 21563 29963 37617 -6046 -24935 25380 104336 133985 142425 172438 172067 168994 194901 211188
18514 211188 132943 144264 231879 217710 256830 337463 352965 439159 509441 543266 580766
18503 580766 599176 571809 630391 633705 580714 526689 456800 391148 403075 342004 305745 314761
18491 314761 293300 255105 180192 164675 162607 116020 117893 115082 125636 169318 220673 231891
18479 231891 193248 152101 127629 102939 101693 72153 121459 159728 166580 186140 224169 204208
18467 204208 148590 137974 178986 202988 219712 203698 216464 234154 289943 344154 358894
18456 358894 410169 420633 408681 394068 412650 367877 299438 262395 220814 185692 178861 209398
18444 209398 199017 190057 230957 206074 159972 162750 198107 183144 210506 218045 209445 257818
18432 257818 244032 202779 196049 205809 209886 149314 71948 36086 87743 168626 213060 193566
18420 193566 155300 204251 173235 106040 40150 42622 78672 84937 105556 155307 198756 219858
18408 219858 202880 207844 227892 244524 255048 257064 200106 184810 166423 204838 233548 235091
18396 235091 229845 242406 237651 188972 130752 159238 218689 209547 150814 177149 167786 206886
18384 206886 176226 175089 177890 193236 179811 175622 165147 162890 180303 185123 180579 178016 180280
18371 180280 155119 142833 109031 117387 162405 171125 214089 254882 239356 193352 158566 135925
18359 135925 116461 155551 138978 100063 95038 107231 104247 133533 169708 166181 141131 73543
18347 73543 95551 142157 138143 157072 178832 139689 78196 79861 82950 90360 61855 50080
18335 50080 93608 141210 132189 140934 173109 137012 114323 129503 165054 134611 100745 107362
18323 107362 108951 120463 83319 93306 140394 197392 233922 259666 239999 218990 263753 286908
18311 286908 325723 376168 293739 239338 259464 296632 286711 220347 190278 188571 220184 228765
18299 228765 210823 223721 202414 172577 190606 199172 143499 129907 127294 99740 148723 159153
18287 159153 158526 215259 277314 281098 302270 315551 334955 282645 268632 313471 367384 400241
18275 400241 322258 282026 296489 270589 283424 342236 395000 378549 385627 409198 448018 478747
18263 478747 518803 521192 484599 479199 463846 447547 443457 472346 460545 437780 360350 364468
18251 364468 411598 435838 460215 466101 446379 400164 345236 326866 333451 386724 356915 311053
18239 311053 335221 362639 371336 396741 403505 376181 397578 473997 516669 550362 557039 538671
18227 538671 547440 534945 533623 536765 507057 461893 490143 483656 565708 675166 729708 778462
18215 778462 771065 756640 778519 813306 790542 729620 713150 766667 753841 749957 717147 676873
18203 676873 628987 618865 654911 658994 687641 637725 568555 539063 561052 578364 544037 593187
18191 593187 642052 606546 685159 706193 765240 781417 717150 684081 729335 782363 805560
18180 805560 804924 829996 824390 781234 761958 741290 671500 666097 729806 790679 818653 852739
18168 852739 781430 713257 753947 780069 783322 778698 838257 800626 858427 932829 925838 900063
18156 900063 913388 953115 983364 1007181 1013810 1071610 1128693 1152765 1198893 1182454 1168231 1175678
18144 1175678 1174703 1210801 1262201 1307790 1362243 1428876 1463643 1488439 1546272 1550666 1589183 1652057
18132 1652057 1712707 1707598 1761252 1875187 1948592 2013619 2060260 2215035 2395505 2577581 2844438
18121 2844438 3227688 3723655 4301038 5021949 6025721 7310126 9006284 11460001 15211272
18112 15211272 20919483 29708375 41712518 54250336 60210304 54567462 42569544 32654458
18104 32654458 26169513 21898252 18881108 16611226 14877580 13529515 12401209 11550319
18096 11550319 10911993 10365272 9965818 9645242 9343206 9103599 8946343 8871518 8763878
18087 8763878 8662280 8576738 8505558 8427214 8373128 8360781 8365229 8434847 8583249 8772375 9045819
18076 9045819 9276857 9487097 9754048 10136613 10660936 11308138 12110510 13230580 14882854
18067 14882854 17307681 20893541 25829980 32211969 39545414 46597414 52033329 54835699
18059 54835699 54674746 51859354 46823043 40656903 34782033 29937995 26185312 23314747
18051 23314747 21206314 19526420 18113645 16985219 16040288 15277668 14664145 14184578 13910924
18042 13910924 13856890 13867067 13884855 14001512 14134210 14254080 14294345 14165952 14028726 13843301
18032 13843301 13703269 13655510 13739798 13882321 14097754 14472631 15030658 15706123 16597995 17868925
18022 17868925 19566378 22018551 25448027 30248587 36907609 45666088 56262595 67776572
18014 67776572 78952290 88801984 96725043 101637293 102461592 99141521 92974235 84866820
18006 84866820 75359102 65486414 56414209 48912181 43108060 38602352 35021047 32231590
17998 32231590 30057571 28289127 26905677 25860860 25084989 24583547 24254735 24047391 23954298
17989 23954298 23905678 23881026 23766657 23487983 23127480 22775768 22385166 21961405 21535869 21219393
17979 21219393 20968588 20796331 20656535 20581810 20579595 20684847 20911791 21450113 22434964 23976834
17969 23976834 26283274 29817527 34911475 41756112 49933525 58145868 64750849 68542295
17961 68542295 69003045 66118796 60239781 52585729 44876234 38263211 33063036 29073845
17953 29073845 26037016 23676782 21816932 20263499 19004160 17971593 17059253 16269411
17945 16269411 15626859 15138856 14779994 14561034 14507569 14501943 14467014 14410521 14283787 13961515
17935 13961515 13584638 13185725 12833733 12453442 12126715 11805192 11515889 11142470 10793147
17926 10793147 10437740 10059583 9659686 9215269 8782036 8324336 7891388 7486670 7165272
17917 7165272 6848302 6499922 6203575 5922614 5633141 5388990 5171256 4954465 4685081
17908 4685081 4467396 4329783 4186149 4016798 3852351 3716925 3636142 3490448 3306933 3119446
17898 3119446 2969676 2908892 2868348 2744870 2675480 2613756 2573596 2527984 2508828 2446427 2372445
17887 2372445 2299055 2228129 2148541 2024961 1955404 1899997 1811519 1708340 1647875 1550859 1431554
17876 1431554 1370398 1343846 1322046 1230181 1155865 1119319 1125229 1097643 1030513 1047226 1065842
17865 1065842 1047470 1000397 999625 950359 934450 938899 950222 942160 936023 894244 894430 928259 948450
17852 948450 942477 950838 933523 939875 934366 925195 921965 896192 917306 920311 832430 848156 884419
17839 884419 906285 912484 927253 901782 860936 850226 819121 792035 761827 734108 675798 640805
17827 640805 661228 633505 614706 608017 565186 569507 617119 671156 666511 622321 581755 548694
17815 548694 537232 628419 637460 628603 641017 640943 672192 696112 670476 708374 730637 732653 686517
17802 686517 665451 632177 629968 608618 603692 621303 602438 631257 653299 656028 635999 657465
17790 657465 649271 585050 576172 564719 558370 542112 543816 570823 573978 608057 620125 609885
17778 609885 562531 518750 518326 523482 436699 468826 491020 480608 485547 486006 414919 403447 500255
17765 500255 594263 573510 566680 515820 571033 615086 615995 561463 575393 625267 670153 717181
17753 717181 749654 759636 765106 757685 772930 761912 752125 717313 710910 721225 674579 660366
17741 660366 654296 634835 670353 664192 664928 701941 697009 705950 715907 708844 682632 663358 684836
17728 684836 724572 760688 767700 737566 736619 778841 765446 711639 697694 706784 798606 816027
17716 816027 841386 854041 840952 801194 871632 909795 894123 939037 921843 897801 885809
17705 885809 887561 907333 928015 900750 808918 754853 685373 657174 650248 625215 565965 559499
17693 559499 562386 589081 549720 534852 533398 556126 547410 479900 443482 451995 444601 428209
17681 428209 406396 393171 414773 471952 468985 431004 413327 425911 389134 359542 314964 301300
17669 301300 333696 372941 399557 298769 308504 325044 290653 301606 313266 344814 379120
17658 379120 379064 410882 385439 365498 338688 356231 367841 365089 346125 365859 327472 314083
17646 314083 343949 291200 232730 206388 227491 249296 250546 279471 293140 269059 228309 238657
17634 238657 269246 242603 250505 297235 291937 291546 317918 248501 181390 184134 277087 280370 270324
17621 270324 294363 281273 227301 263514 260103 297077 326299 365211 369556 342898 343827 358953
17609 358953 380085 449395 508031 484749 468003 499967 482564 502111 530397 539449 581713 636505
17597 636505 617616 598969 620414 621793 633012 656063 640780 616347 625690 672450 664357 614133
17585 614133 553562 498532 475026 459143 439716 372472 379192 420187 411535 328761 270240 247402
17573 247402 280704 267711 266398 256129 254980 321263 360576 398116 461534 510582 578911 589387
17561 589387 663655 648857 616294 605741 585405 646785 684113 668121 689119 695992 675119 653341
17549 653341 654775 688936 706416 729519 722817 703266 647992 605469 535760 489740 499434 538688
17537 538688 507581 400930 392888 403870 390953 395691 408947 454258 420239 387366 385561 437354
17525 437354 432573 388116 438539 462950 473397 521771 562271 556516 584065 655849 761478 794513
17513 794513 816918 839200 816230 769196 689831 674411 651549 601579 519366 490844 473271
17502 473271 466225 460136 392715 388596 394646 397342 405015 377418 328193 269066 267826 264086 260433
17489 260433 315669 331787 318723 281979 244754 221530 194738 232999 241237 247983 237098 269371
17477 269371 267185 278317 315376 308768 293448 334599 400423 370845 340591 414535 499517 579361
17465 579361 588848 601112 571933 557442 531935 454368 447679 445406 446238 427506 458961 493021
17453 493021 394904 328093 313042 355425 394657 455446 405165 433914 429973 421169 481688 554229
17441 554229 555124 501849 493467 444754 363263 308782 270943 254146 268331 306632 244492 261989
17429 261989 371624 434231 406153 431254 428303 481451 514146 544476 582730 556759 508851
17418 508851 525562 590557 622440 657034 692577 701102 728653 686003 658478 630803 647673 725643
17406 725643 751863 791441 834539 864464 894422 837227 766920 743749 715718 690708 730804
17395 730804 696427 700954 714312 686993 652602 624170 566884 607464 581130 588264 624878 664965
17383 664965 685724 686392 696845 661923 689324 715948 732578 778901 863802 979739 966157 991492
17371 991492 1056284 1084225 1110752 1153519 1245003 1355074 1421578 1497294 1510086 1490969 1461981
17360 1461981 1459824 1464412 1402910 1286696 1245939 1149144 1104199 1080508 1028894 992821 953760
17349 953760 936109 914125 939413 936552 844904 818624 808566 832358 768168 766570 772048 703884
17337 703884 703343 712508 744905 768118 791908 853404 891728 916030 950708 999229 1028799 1059423
17325 1059423 1038528 1119163 1228452 1280050 1325877 1326432 1297991 1335118 1344659 1373896 1408483 1439244
17313 1439244 1452315 1468380 1411062 1387988 1386139 1364033 1361289 1287739 1223444 1149372 1092374 1086078
17301 1086078 1026301 936320 961731 932765 894561 857853 850646 852013 785976 776731 750428 728517
17289 728517 748010 760674 753530 788097 786090 755878 750848 726480 725208 726994 721573 686724 674847
17276 674847 695953 733758 735008 652633 658143 698741 698030 605095 577391 621590 563908 488594
17264 488594 466823 511609 548979 587228 592186 542481 563350 616977 636057 625488 617866 661942
17252 661942 688298 669882 645420 562782 556074 618566 648710 665068 681301 671845 705406 783030
17240 783030 810371 847692 948305 1061881 1171370 1289979 1457370 1672946 1825823 1927665
17230 1927665 2048616 2158229 2228629 2350479 2430609 2503941 2545054 2582225 2583765 2559748 2556153
17219 2556153 2526506 2551526 2556442 2457947 2405347 2277545 2141027 1972514 1865476 1782059 1666938
17208 1666938 1609261 1626006 1561885 1509768 1502963 1582010 1636032 1666567 1748782 1822901 1884303
17197 1884303 1970095 2116430 2189335 2285898 2406182 2473857 2502579 2557138 2616996 2779434 2962167
17186 2962167 3137389 3340438 3528134 3694871 3841115 3944321 4091548 4218518 4335603
17177 4335603 4396618 4427674 4399046 4354284 4323426 4290014 4257136 4265126 4277191 4202710 4017324
17166 4017324 3881147 3798911 3659427 3453583 3347749 3270096 3173008 3143376 3130357 3091760
17156 3091760 3016187 2956413 2933517 2960711 2973553 2976563 2948033 2980770 2972506 2924134 2954513 2920997
17144 2920997 2944531 2978834 3038554 3129562 3188003 3252209 3302851 3361510 3461832 3523694 3559468
17133 3559468 3662960 3760234 3865884 4007851 4166628 4311141 4476781 4684254 4925594 5152062
17123 5152062 5327174 5582579 5884799 6267836 6677518 7177232 7785338 8644759 9773846
17114 9773846 11218049 13101560 15565573 18529931 22020186 25915381 30096971 34430344
17106 34430344 38655692 42682903 46438957 49975795 53493419 56999059 60353886 63122812
17098 63122812 65149796 66597618 67499313 67744796 67325051 66325411 64977552 63351434 61412320
17089 61412320 58860345 55536864 51641658 47611042 43665836 39870212 36319308 33308163
17081 33308163 30863962 28959812 27509407 26389664 25605864 25002303 24513383 24160913 23942614
17072 23942614 23794572 23851180 24104082 24449451 24956249 25822536 27080998 28909707 31245964
17063 31245964 33992277 37034727 40311394 43833034 47246813 50424470 53265233 55898691
17055 55898691 58504064 61181215 63668277 65772507 67342971 68395292 69046701 69103339
17047 69103339 68460067 67255667 65717072 63899289 61837285 59313861 56151487 52467511
17039 52467511 48556061 44621312 40816441 37306424 34088002 31434177 29421404 27884939
17031 27884939 26671621 25713956 24950005 24357658 23784240 23226709 22721389 22274665 21822720
17022 21822720 21350826 20899385 20383921 19890312 19468736 19065992 18681610 18344725 17996028
17013 17996028 17509951 17029694 16494104 15859031 15278697 14715274 14117965 13569923 13049526
17004 13049526 12468429 11969074 11544815 11128916 10693090 10277578 9884152 9528282 9160147
16995 9160147 8894607 8680308 8442887 8174896 7891562 7691756 7532099 7397194 7267901
16986 7267901 7114280 6960360 6815948 6710828 6623172 6484900 6335790 6247514 6197271 6078199
16976 6078199 5970192 5844894 5766048 5760167 5788721 5746238 5683748 5678540 5700044 5644642 5636034
16965 5636034 5641210 5721330 5914070 6043468 6204558 6413860 6585760 6787080 7042539 7326559
16955 7326559 7687913 8006451 8418853 8919487 9536635 10348452 11468758 12897673 14739985
16946 14739985 17202297 20300387 23976881 28174699 32807456 37645118 42410505 46688622
16938 46688622 50330193 53336514 55734144 57644130 59276226 61069359 63500392 66766011
16930 66766011 70843533 75691493 80989897 86539096 92009091 96766273 100545836 103116484
16922 103116484 104257183 104217003 103357712 101925276 100309331 98910167 97917409 97330088 96838851
16913 96838851 96067887 94692212 92411054 89180433 84965988 79909218 74417510 68931872
16905 68931872 63689623 58986766 54988123 51599764 48826223 46662342 45037435 43879189
16897 43879189 43077720 42656716 42619890 43085650 44027853 45679474 48192721 51698041 56226268
16888 56226268 61508760 67074148 72193017 76361864 79299718 81109443 82047018 82443422
16880 82443422 82284481 81305295 79242952 76157027 72227962 68266910 64938998 62758034
16872 62758034 61697910 61393114 61475370 61538199 61176253 60469719 59665855 58685143 57426161
16863 57426161 55761942 53588776 50817133 47578094 44276511 41070420 38251054 35968177
16855 35968177 34136395 32648147 31415376 30456078 29649764 29009919 28467540 27999243 27616828
16846 27616828 27301042 27153076 27180530 27478046 28175507 29424648 31333192 34073107 37596943
16837 37596943 41925402 46677513 51289229 55223505 58063337 59842825 60893689 61430339
16829 61430339 61537407 61097877 59925699 57921013 55262959 52550018 50474432 49394967
16821 49394967 49414445 50253213 51485181 52601963 53221139 53322650 52967293 52343351 51504219
16812 51504219 50270410 48391383 45738659 42477701 38975002 35568280 32506782 29948009
16804 29948009 27879081 26265294 24951002 23843741 22943343 22136161 21389059 20718338 20028767
16795 20028767 19353355 18675223 17998052 17361732 16755429 16120683 15597614 15047758 14534309
16786 14534309 14088030 13669332 13255467 12776349 12225986 11736676 11330034 10940405 10500297
16777 10500297 10046511 9560180 9139911 8712258 8319381 7997451 7632121 7243044 6885175
16768 6885175 6564104 6283584 6053288 5781698 5516107 5258543 4962274 4729852 4564605
16759 4564605 4354544 4182449 3963219 3811312 3710947 3594666 3478389 3356331 3240097
16750 3240097 3118174 3039568 2921821 2824425 2764717 2606639 2465208 2397136 2359616 2332957
16740 2332957 2253828 2151979 2046978 1988509 1917342 1879092 1795879 1774641 1734926 1732634 1702328
16729 1702328 1651798 1583428 1525745 1520424 1502666 1453717 1370363 1258571 1194258 1231189 1241835
16718 1241835 1232838 1241249 1212525 1214329 1183140 1163830 1206685 1184505 1126854 1128832 1083691 1038382
16706 1038382 1002952 1020237 1036913 1009071 962129 911458 930407 965441 948862 907412 893828
16695 893828 888512 874234 814634 774682 802059 812927 800734 776190 760687 735579 701855 671077
16683 671077 667158 603049 624798 665473 658888 625721 589436 562103 571538 579791 579332 539822 543691
16670 543691 577159 594944 544831 559354 582229 599099 554140 524153 523821 502011 500613 510153
16658 510153 509070 478617 467962 463943 478170 476788 471469 501958 520858 482305 448709 432612
16646 432612 421114 400024 418894 429265 376582 372257 315869 262705 236732 271444 368233 412721
16634 412721 436569 423773 398637 345723 360461 401876 442303 403497 363172 376913 375336 338861
16622 338861 349859 393041 438357 449369 422677 468894 506898 466937 404365 396972 373906 401021
16610 401021 437989 463346 453550 487886 483585 492701 541887 618968 711504 646281 601246 608902
16598 608902 581249 570454 560314 584771 624777 671709 684252 670734 629106 593434 641203
16587 641203 635083 615369 575709 596105 579670 529045 534955 539386 482947 451919 482091 454365
16575 454365 373060 311334 317193 360034 381463 360661 357642 361633 327280 376111 388754 384695
16563 384695 371515 369193 386111 427301 455192 431178 403654 430319 480895 545418 615890 645123
16551 645123 618575 592507 603393 617725 622444 614837 612361 606445 625343 594221 540370 492359
16539 492359 494876 496840 452183 375022 328336 353718 398165 380942 365558 347864 362929 365531
16527 365531 367260 308450 305362 280153 273197 305994 285476 229437 236571 301140 290703 235234
16515 235234 198319 227853 243571 197871 124382 125674 160726 153522 182055 215721 210325 208138
16503 208138 225393 192761 138647 174164 184212 229241 216321 183986 183142 209123 228993 277208
16491 277208 239315 199473 158964 121086 148976 202562 203663 194258 186205 150655 156908 133260
16479 133260 107308 147123 180369 137375 96839 99605 108134 121496 133260 104399 123800 151119
16467 151119 151932 136940 58829 28640 77500 84654 87826 84120 46817 136002 204686 152587
16455 152587 143872 163291 194169 303226 343548 344010 360557 411432 462723 425153 415772 386143
16443 386143 437116 434691 459138 474838 429107 441006 458762 527765 578168 596610 582722 553212
16431 553212 565509 580619 623206 593421 567698 565859 587420 586824 578478 563910 535635 521315
16419 521315 533797 537396 489705 446561 467636 440267 390744 289281 257240 259036 301615 247586
16407 247586 192689 170379 179465 230798 243497 218798 236244 251104 269375 221414 222646 291624
16395 291624 334059 327227 334782 295609 341294 338744 302971 343419 420566 422280 366941 300540
16383 300540 315110 303667 310598 402567 446208 393325 354109 319160 344856 358141 363408 407560
16371 407560 434909 421854 346514 335905 371042 378318 376683 334977 298211 342747 346689 320697
16359 320697 230036 180820 146815 112822 114671 62551 55152 133904 159363 155661 140804 116383
16347 116383 147646 199245 185077 109127 72851 135291 148245 151087 194121 210384 177802 156904
16335 156904 236674 346182 379373 417417 401917 368805 337998 328238 355246 345943 313557 317271
16323 317271 268864 327925 366216 335941 312085 344413 335142 332411 300618 206798 187497 200625
16311 200625 222417 232911 211075 217752 178671 106179 148774 206054 158238 126652 114184 127257
16299 127257 130568 124184 146761 226862 223783 201838 254609 244405 187761 131172 52780 11542
16287 11542 69778 61787 79695 81312 111634 98028 111813 113193 135347 125733 112216 87010
16275 87010 53895 71024 88376 68295 74226 30074 44722 41249 -2314 7902 -17976 -6637
16263 -6637 31483 16495 -12442 -16555 -6133 -11780 -84699 -96972 -18859 3331 -14561 -10481
16251 -10481 6355 18532 37693 83881 88142 99246 135287 144981 104145 54151 21788 32875
16239 32875 11771 -1888 58205 105272 95893 111583 108359 112937 122078 89423 28804 13529
16227 13529 32466 -6520 -7153 -56809 -30210 8228 19570 -16921 -49764 -36861 -2204 15239
16215 15239 -19226 4727 1024 -47484 -46248 -5138 -8160 -63036 -30223 -10936 3035 1270
16203 1270 -17894 -59011 -50089 4019 -16034 -31136 -48269 21157 -12319 -84968 -61524 24744
16191 24744 34566 7394 15467 10282 -66844 -36340 2044 7509 -6986 -25043 -53738 -59628 -94319
16178 -94319 -65078 -31705 32421 78511 -7486 -115166 -105986 -47936 -22970 -35288 -19973 13461
16166 13461 -14091 -54327 -42092 6379 -750 -67830 -119500 -90814 -38124 6190 3419 16941
16154 16941 70496 65576 73365 37788 -32574 -54411 -59046 -61175 -41221 -58361 -36323 -37296 -27308
16141 -27308 -93339 -79634 -26999 20635 14723 -1222 18449 -545 -23736 -13097 -8222 -2704
16129 -2704 -4791 -24527 -31748 -55845 -48986 6916 30093 -13039 -71296 -72429 -48173 -56561 -45946
16116 -45946 -8455 -31457 -29305 -94142 -170489 -159084 -93275 -46980 -33234 -56786 -76834 -76754
16104 -76754 9359 77944 73772 52474 33108 -353 -41358 -37670 -3491 9725 30366 25755
16092 25755 27132 65626 564 -79336 -113281 -61854 -11816 3664 6557 6168 -6266 -33812
16080 -33812 1399 20397 -32268 -50019 -46006 1092 -19909 -6128 -66958 -78760 -37333 -13731
16068 -13731 -31860 -59132 -42758 -33158 13842 46182 19666 20817 11924 -4462 -30364 -32974
16056 -32974 -49094 -37674 2049 5821 44330 36504 17975 18396 23493 6835 30542 55911 95450
16043 95450 89154 54196 63035 102792 108185 80635 46593 -151 -16760 -46546 -60881 -15359
16031 -15359 -4635 -37028 -29777 -6464 61939 69603 -5220 -45165 -67270 -72920 -83060 -118067
16019 -118067 -80124 -61321 -33138 -65355 -111125 -67653 -15746 -28204 9678 15257 16605 -29367
16007 -29367 -76331 -80617 -62393 12532 43830 5488 3609 -8639 13365 -2760 -45514 -70614
15995 -70614 -41098 14821 5651 -43103 -89063 -89935 -38024 -34733 -65858 -64220 -75931 -48566 -27154
15982 -27154 -52449 12283 -31202 -30421 -28138 -106966 -137514 -151488 -121994 -49282 -2077 19927
15970 19927 30513 19306 8690 -75718 -55313 -15803 -85800 -140570 -109143 -67160 -59959 -64642
15958 -64642 -54768 -70611 -101211 -70152 -19194 -28109 -30183 -86378 -135092 -118729 -112065 -154290
15946 -154290 -134823 -93482 -91061 -92996 -54823 -53025 -16196 22968 17087 -47295 -70108 -61470
15934 -61470 -1911 33053 13358 4852 -39995 -67965 -87357 -48348 26584 -2720 -71863 -98184
15922 -98184 -109817 -110513 -121587 -85067 -73714 -69762 -67719 -72623 -82908 -37905 16350 35168 18386
15909 18386 24384 32671 32541 49255 42967 47868 68276 4241 -26824 -2000 22338 26890 -24494
15896 -24494 -55299 -94471 -135417 -115605 -53003 36785 98896 74612 28473 -8041 22313 -20007
15884 -20007 -279 31416 -32339 1542 3727 -20276 -74848 -115881 -61633 -19930 -12483 -37449
15872 -37449 -91889 -152563 -163717 -112919 -59089 -63835 -20056 -13116 -11619 -20485 2197 18613
15860 18613 -27685 -16596 3109 -35346 -30304 -8632 20143 34245 23659 3778 4030 5235
15848 5235 12402 20146 26144 -415 -20579 -30291 -15949 -5046 3681 9793 14676 -50867 1827
15835 1827 33235 4222 26839 -5621 -24862 -6065 -29123 -55626 -53561 -69865 -79279 -44497
15823 -44497 -39227 -81608 -82639 -47181 -40017 -46832 7497 29431 -31002 -99080 -107845 -63334 -44397
15810 -44397 -87053 -117734 -54841 -1088 -9782 -23433 -15431 6710 9630 22140 20081 -22436
15798 -22436 -42944 -54864 -66840 -67123 -10713 29735 26466 6059 -59074 -58967 -76042 -98599 -76825
15785 -76825 -83412 -73313 -52600 -48247 9328 47005 -10127 -79371 -138301 -125782 -78284 -33593
15773 -33593 -49435 -62285 -24940 -5022 25345 62306 82321 32827 6893 -43267 -115007 -98814
15761 -98814 -55395 -86282 -140017 -183693 -176911 -145653 -130684 -143158 -93268 -1374 -12233 -14178
15749 -14178 20241 47015 71899 76425 35609 -7901 -47503 -106433 -96320 -77165 -77279 -94328
15737 -94328 -121754 -88443 -85395 -82262 -49979 -22901 -22797 -56186 -38089 -44793 43986 73092 7651
15724 7651 10243 23467 25282 53709 8524 42697 73845 63748 36 -28627 -21012 -46215
15712 -46215 -48741 -65728 -46511 6726 22611 -29959 -42190 -6981 13988 5504 -69342 -173879
15700 -173879 -131362 -58103 -14469 -9748 -26593 -30077 -117265 -115217 -92294 -80387 -54671 -21241
15688 -21241 -15244 -23603 -55034 -43987 -69238 -80871 -55252 -92226 -102003 -53835 -16130 -11352
15676 -11352 -34836 -77861 -103380 -68411 -29471 -28820 -23835 -63493 -55783 -154426 -192624 -135014
15664 -135014 -41321 -11493 38551 38788 20334 -15140 -11057 -62990 -42005 8102 -3456 -69224
15652 -69224 -82359 -68927 -42571 -54370 -71395 -95506 -135539 -82577 -18549 33264 44519 8339
15640 8339 -17439 -19573 -4953 -9481 -29608 -60703 -63106 -23642 -11448 -9457 -15941 -77066 -93003
15627 -93003 -70109 -44963 -27348 -27203 11914 35394 44473 -2184 -49825 -25013 -20008 -61155
15615 -61155 -101464 -64557 -23227 -31403 -76798 -87331 -67284 -73614 -53878 -12798 -62733 -104830
15603 -104830 -109221 -72439 15017 -5208 -23280 -4442 27898 9566 -25830 -52452 -84526 -104167
15591 -104167 -44199 -18732 -772 10665 3303 -25527 -41762 -11865 -46134 -65938 -21156 -58175
15579 -58175 -79346 -60789 -46158 -49377 -72211 -82659 -70410 -67265 -57147 -28910 -28060 -29844 -62573
15566 -62573 -66639 -41286 -53202 -45836 -65039 -98610 -136600 -86190 -48518 -36905 -47755 -85887
15554 -85887 -112938 -105448 -102046 -82283 -55272 -6822 -14343 -6515 -17539 1105 37597 -18843
15542 -18843 -39850 -62004 -58846 -36572 -20425 -27569 -2758 16745 21013 -11750 -8100 -22929
15530 -22929 -25836 -22757 2604 56875 104953 106659 58553 64657 81411 67423 89791 80553 86566
15517 86566 77466 29572 -493 -6414 18658 20776 31649 7522 -4360 -27883 -50728 -84757
15505 -84757 -72470 -25567 25020 2705 -74913 -134255 -149607 -114126 -68620 -47677 4069 56358
15493 56358 42247 39061 -12134 -27217 -31524 -10524 401 -37431 -1588 -10169 -18947 15934
15481 15934 18361 1761 -5091 10182 -3174 -33039 -42051 -98552 -103067 -35348 -7925 3056
15469 3056 -25487 -23316 -27846 6597 45139 18406 -30486 10932 -2936 28972 30896 45406
15457 45406 -20295 -90181 -57982 -42468 -51911 -53036 -39771 -46301 -91290 -51178 -31600 -41790
15445 -41790 -42080 -31787 -16146 -4684 -30761 -11900 6565 -65421 -93808 -67815 -10677 -81421
15433 -81421 -103251 -105370 -100136 -115679 -94688 -84937 -85786 -89582 -42083 -11639 29525 3362 -51592
15420 -51592 -103975 -39977 17455 53575 -10491 -79142 -71976 -53685 -76512 -125057 -79119 -13288
15408 -13288 -22391 -32932 -38116 -67673 -95804 -93436 -124807 -140595 -74594 -24755 -16299 -109
15396 -109 -72035 -55702 -9935 684 -60506 -81787 -59271 -33258 -6474 3825 -24443 -42373
15384 -42373 -89120 -43825 -19396 -39214 -35185 -27795 -59978 -68496 -121553 -115033 -136143 -100010
15372 -100010 -108746 -161547 -161756 -154173 -149380 -107693 -155527 -152138 -134849 -133514 -86641 -51286 -58659
15359 -58659 -80513 -76983 -19826 -5855 -79398 -81089 -65066 -74191 -23442 25377 45939 3032
15347 3032 -28661 -19850 -1079 9112 -34538 -48067 -43773 -67144 -7897 33200 -8957 -24270
15335 -24270 16997 -4206 -10285 31764 50262 10312 12993 37800 36939 -8388 -10181 8933 27609
15322 27609 56842 96100 19166 19175 32173 -4695 -34040 -62756 -35616 -27 1450 -12142 62133
15309 62133 92678 58272 30073 -10386 -37551 4284 3651 27698 55336 49702 31959 33080
15297 33080 9501 -27998 -62294 -38400 -50266 -56592 -4519 20290 13462 30379 26823 31141
15285 31141 64787 58595 32056 72574 37594 43066 26664 22163 8582 -11959 -27395 -29330
15273 -29330 -47873 -19155 16810 64400 88791 45690 38043 48073 105855 117190 117382 67572
15261 67572 -17552 4999 17026 -15786 41457 58012 95938 78218 17168 -3646 -15 -11944
15249 -11944 -3883 -19054 -28827 -107014 -104468 -33117 39292 62563 53285 54486 2165 2681 46268
15236 46268 49588 16992 -4932 6279 16633 -39049 -81640 -53025 7933 -11320 37316 32954
15224 32954 20356 -46893 -112019 -43832 37624 19279 27780 23493 -27492 -57665 -17121 34592
15212 34592 123072 149242 129312 43993 28012 36633 28585 12765 27392 47191 51098 69694
15200 69694 14945 -1594 21372 46050 78187 76106 41862 17430 16240 21023 -13124 -8941
15188 -8941 19792 70559 68148 57981 58838 65463 38524 -30613 -36479 -75273 -65102 -56897 -43711
15175 -43711 -39359 -64722 -72064 -39611 -21858 -20929 -17630 -47211 -63901 -80898 -79453 -91241 -95982
15162 -95982 -25944 22936 7020 -9361 17017 29951 29473 -35575 -80363 -74181 -73619 -58993 -94910
15149 -94910 -81596 -75372 -37540 -12899 43421 25475 18919 58482 85082 83231 82929 56151 47610
15136 47610 27538 21311 14124 -12994 -29441 -58845 -45022 -36988 -22468 -10996 -9669 4810
15124 4810 23389 -16553 -42486 -13976 -21663 -2204 -44433 -50296 -31052 -66276 -61925 -53761 -33813
15111 -33813 -60042 -84138 -122271 -153473 -145682 -112407 -113603 -68440 -55752 -45683 -1799 1881
15099 1881 -49618 -49233 -53018 -59129 -82622 -37907 12716 32588 64257 19484 -63558 -78100 -65143
15086 -65143 -70466 -96864 -86974 -21456 -4779 -67394 -54314 -79038 -99378 -94753 -26587 -33664
15074 -33664 -23378 -4556 -11855 42434 45190 55410 45537 42628 45808 72870 59568 69222 43576
15061 43576 19110 -28730 -77553 -97700 -112061 -89854 -82446 -76639 -25222 31416 28554 -23116
15049 -23116 -18227 -24376 -18995 20154 6741 -6778 -34049 -28286 -21099 -1939 -2642 -5037 -5039 53566
15035 53566 81381 -38568 -57324 -33671 -12583 -25285 -41868 -10589 -11533 5661 28745 39985
15023 39985 12682 22933 -4820 -72538 -68384 -69702 -80785 -54416 -20128 -29010 6973 -1636
15011 -1636 -51783 -39928 -72631 -62093 12100 71303 31479 -1566 -48927 -83627 -101573 -108319
14999 -108319 -75549 -43072 -52358 -42521 254 1919 23885 50093 4532 10865 -3381 -8276
14987 -8276 -6338 -6655 14188 8570 7464 20996 1150 -64022 -83328 -75498 -32865 -26690 -3240
14974 -3240 -61620 -99490 -35294 1027 20418 -16173 -12275 -26133 -47301 21899 62765 51003
14962 51003 8952 4960 11042 10678 23256 1947 -51303 -69017 -47461 -15710 -33704 -94964
14950 -94964 -59847 -28000 -35094 -18216 -23074 -18311 -48139 -97089 -72120 -70619 -61267 -78771 -40605
14937 -40605 30091 21543 -1011 -40071 -5676 -14866 -36618 -31142 -56560 -54124 -61725 -58634 -39451
14924 -39451 -75957 -53083 -25194 -55623 -87015 -80327 -81886 -72917 -63065 -39746 4159 17707
14912 17707 80704 87633 64143 1003 -12243 -54769 -81830 -44313 -53209 -22617 14027 25809
14900 25809 33650 33425 6687 -43018 -42532 -447 -19884 -28901 -35347 -33398 -21030 7153 -30502
14887 -30502 -44694 -80968 -87790 -116117 -98384 -105164 -90220 -115940 -104577 -85700 -77712 -46725
14875 -46725 -54512 -64816 -53549 -50826 -38993 20969 44674 31419 -27497 -72061 -82293 -40523
14863 -40523 -46552 -40480 -48523 -41970 -64214 -98873 -67054 -91878 -78390 -75926 -95681 -121884 -70049
14850 -70049 -82945 -141198 -129224 -132085 -117738 -104373 -123248 -135177 -133355 -100910 -85243 -58634
14838 -58634 -61472 -103701 -131035 -141892 -139743 -79431 -24414 -6053 -55643 -47894 -22263 -10256
14826 -10256 -8844 -56492 -40588 -19446 -170 76247 91511 76764 3997 -47801 -72612 -95033
14814 -95033 -73849 -75134 -52208 -44705 -59726 -6689 31927 34714 31383 47539 55965 45444 8086
14801 8086 -46290 -82213 -68455 -47520 -77793 -85032 -42062 -39460 -4974 -39364 -57371 5967
14789 5967 57404 20733 -18686 -94255 -105693 -62098 -34475 -46985 1232 12658 44392 52367
14777 52367 4073 -1027 -6658 -65935 -109049 -118506 -149503 -115869 -28617 36962 -19178 -63210
14765 -63210 -101059 -94586 -57299 -49312 -47886 -52964 -59779 -45714 -83602 -94587 -64684 -30614 -75823
14752 -75823 -122008 -96317 -35077 -20323 -54486 -62816 -64473 -69822 -102949 -88947 -57297 -18562
14740 -18562 -19573 -44712 -72479 -49706 29236 72461 52478 -9895 -10942 -15280 -38264 -26503
14728 -26503 22611 -18741 -60818 -45277 -33938 -54638 -95404 -35432 -1014 -9389 12723 -23568
14716 -23568 -66213 -59210 -28767 27855 15227 25419 8464 22814 20945 12356 15431 18401 31619
14703 31619 28432 42885 89811 90872 84506 5707 -47993 -62970 -65529 -51821 -29621 -62490
14691 -62490 -64368 -23871 29570 49105 51371 33390 -5904 -30829 -98734 -121787 -89430 -15437
14679 -15437 32801 22150 9207 17452 33007 -47241 -92147 -76409 -63086 -13804 9370 12702
14667 12702 51566 77062 62591 16690 53361 51116 40447 44332 -28948 -55756 -29008 8796
14655 8796 -44490 -56147 -14990 -28508 -65504 -88211 -42172 -11785 -62804 -20939 12179 -9514
14643 -9514 -116734 -95702 -39185 -36041 -42321 -34381 -7140 -26457 -52100 -63089 -45946 -22193
14631 -22193 4834 -16788 -40682 -21268 -19440 -26731 -38853 -2718 -35879 -49109 -65719 -97368
14619 -97368 -55572 -23938 -21021 -20183 -57721 -102103 -98659 -88819 -69540 -43112 -64966 -35736 -58975
14606 -58975 -67756 -34341 -85455 -85825 -56032 -5766 -52840 -80763 -66969 -28557 -38914 -94232
14594 -94232 -73730 -83478 -68746 -59657 -65955 -67282 -104374 -111822 -90649 -104064 -76505 -123045 -150082
14581 -150082 -147795 -104467 -88442 -96453 -46256 4242 34625 -12867 -61085 -45759 -17912 -55716
14569 -55716 -95578 -109325 -93802 -54314 -37629 -42631 -58960 -1788 54197 79586 72955 37180
14557 37180 -62174 -105763 -92731 -72956 -91206 -45003 33202 2692 17544 36724 11983 -1633
14545 -1633 10343 -53295 -91288 -78160 -12949 10588 19712 -28561 -62647 -23540 -8249 -70965
14533 -70965 -85310 -72977 -42401 -54336 -8657 31015 54165 43639 10551 27294 16864 -53469
14521 -53469 -71542 -66021 -37649 -9933 -22570 -50805 -90377 -54264 18772 62539 55986 5956
14509 5956 -1823 11286 40487 39221 -36899 -42126 -42789 -73233 -60877 -52918 -45742 -41019 -41198 -65140
14495 -65140 -81035 -101073 -108819 -104247 -63092 -67589 -57751 -41603 10907 41787 10528 5107 -25639
14482 -25639 -65827 -34730 -31003 -93955 -73169 -46686 -86217 -116938 -80859 -109183 -74954 -6220
14470 -6220 -67079 -118912 -94428 -39378 -2992 14408 33037 26826 9679 -19130 -28109 -42533
14458 -42533 -66237 -69538 -31322 -42152 -66608 -86462 -84517 -52490 -25111 -2956 -12334 -19170
14446 -19170 -8714 9417 3820 6400 -5740 62553 36363 3702 -36248 -67508 -66796 -71023 -74574
14433 -74574 -51745 -107324 -106115 -109675 -57622 7066 9426 -18139 -30691 -22384 8287 -3616
14421 -3616 -634 -12903 -42494 -80747 -90764 -90941 -43327 20295 27670 35551 -7333 -47257 -38696
14408 -38696 -72518 -84906 -106791 -92562 -12515 16311 26128 73994 80418 49088 -11681 -32273
14396 -32273 -24558 -68123 -13097 6489 3024 6551 -11468 -100256 -105309 -102557 -63597 -66680 -92440
14383 -92440 -52579 -50244 -45926 -17789 -33625 -58031 -79116 -90168 -52907 -53947 -93993 -95757
14371 -95757 -82774 -56206 -82247 -63527 -43577 -64922 -41074 -39080 -28980 -10891 -6496 -40919
14359 -40919 -3161 26784 -3568 -88778 -81735 -34413 -56106 -142978 -111130 -72346 -75936 -84542
14347 -84542 -114462 -86505 -65551 -64150 -43634 -21592 -5103 22456 16117 3308 -40910 -59793
14335 -59793 -877 19878 15772 -40731 -95458 -72985 -48184 -95731 -26332 25463 24971 -24356
14323 -24356 -32292 -3313 39020 60214 -9071 -54947 -33684 -38685 -24594 -25785 -31890 -18772
14311 -18772 -14187 -41277 -52838 -33735 -39731 -2975 43166 47341 25932 -2765 -895 -13496
14299 -13496 -37839 12160 -36024 -35577 -47968 -6240 64235 36292 -45687 -52529 -48799 -60158
14287 -60158 2056 78150 91354 98778 111044 106181 23321 11614 27165 49495 50810 22400
14275 22400 -7846 -19145 -23407 3055 -17239 -34392 -70891 -49726 -2954 11874 16047 -16104
14263 -16104 -25940 -38749 -35912 -54950 -75450 -101787 -123629 -119286 -68155 -21441 -43623 -24901
14251 -24901 -37829 -98553 -112571 -66104 -22091 -8143 -8122 -31394 -44331 -61441 -41186 -68372
14239 -68372 -122995 -139901 -138069 -74073 13133 63867 50598 61482 76264 69024 11767 25737
14227 25737 60167 60440 140542 157024 86686 85493 68452 46269 43063 72211 3587 -41279
14215 -41279 -51497 -2429 9405 -2416 -38669 -24264 7051 2709 28596 93296 106103 39644
14203 39644 34482 88143 69671 71377 100874 134764 183024 160817 152673 213677 279507 262368
14191 262368 316837 372614 474945 561092 652098 764104 885595 946231 1019120 1087115 1140656
14180 1140656 1127642 1109197 1104611 1147428 1092913 1066802 1036387 993983 938720 842808 756229
14169 756229 719342 688645 633263 576919 579013 575801 547677 510571 488665 464201 438277 454066
14157 454066 456359 397874 325580 314116 311868 288356 287936 286433 295022 242989 207125 235237 228923
14144 228923 191442 213277 209601 217760 234672 172944 131852 96890 116223 130811 146975 142078
14132 142078 168265 171875 181913 158567 104976 106539 70244 53184 71861 55151 34177 6688
14120 6688 -20989 -25214 -123 37173 42921 25019 -11894 -36936 -62660 -89761 -46939 -62179
14108 -62179 -82608 -40389 6640 -15737 -29216 -32793 1582 30346 32767 32890 -19231 -72858
14096 -72858 -82664 -83692 -39214 -31291 -8499 3422 -13568 -55701 -61242 12720 39564 30099 2535
14083 2535 -12954 -65313 -53364 -42871 -17775 13761 30336 23254 -2314 21612 52453 88880
14071 88880 85337 44887 46526 37782 48366 -5080 -72576 -65881 19440 105642 134791 115897
14059 115897 54320 -3130 -33693 -10128 -8974 -27671 -13924 -12877 -6684 32752 85531 91195
14047 91195 64361 43112 53566 70389 82445 79795 70971 51274 53228 51214 70032 31937
14035 31937 14513 33549 72410 56147 -8427 -80198 -75819 -67332 -3684 66000 105391 95550
14023 95550 60464 -24687 -4246 -3886 -53481 -70436 -29818 8913 26589 11158 -49230 -67918
14011 -67918 -64970 -50047 -33242 -88239 -102459 -40745 33354 73069 23733 -6924 -70237 -95499
13999 -95499 -71811 -24773 -9049 -19337 3438 32025 22845 45210 1196 -12650 -30331 -36038
13987 -36038 22163 -6281 -14634 -40001 -34253 46215 67198 33070 -35950 -30646 -495 25084
13975 25084 25713 1823 39856 39502 -8142 -46062 -25516 -31361 -41792 -36152 125 107753 160961
13962 160961 72843 39979 98165 140973 146528 132069 151272 184086 204583 227380 222266 191113
13950 191113 180540 144172 160741 240709 337042 320874 253387 190961 212038 206821 176975 150206
13938 150206 153261 155633 145151 134279 114787 100500 129093 181418 185653 186750 182314 177996 182625
13925 182625 203649 228868 193171 134447 115600 127571 79769 101549 96920 113940 180620 226114
13913 226114 271323 288678 274014 274951 338267 309326 247750 183047 164757 226696 319459 319667
13901 319667 336881 293255 262604 242230 224903 203296 90688 80876 78954 69575 84197 98711
13889 98711 143988 124067 115394 128824 111688 116362 81044 55336 83995 103527 104308 91854
13877 91854 82943 81096 72313 84053 109051 112194 161909 174593 147447 81837 64756 74820
13865 74820 67471 53934 28337 22790 48578 46082 -6087 -33358 18696 54516 74215 46393
13853 46393 31631 21910 23166 27226 12701 -42102 -57396 -31778 -9110 7869 -36703 -58520
13841 -58520 -62029 -5970 44190 43601 -16667 -52993 -54686 -30265 5693 -22646 -23994 -37052 -52688
13828 -52688 23081 57024 50879 59054 51758 58761 -21141 -94034 -74644 -13167 -12006 -20109 11158
13815 11158 21433 -25235 17970 22943 20282 21201 41057 5794 -3867 15508 17777 10668 2971
13802 2971 -21125 3915 73634 97579 117275 61057 -5958 44499 70507 45991 56809 -6633
13790 -6633 -1352 -18572 -63262 -10320 17347 17866 -21009 -21973 -53298 -88217 -64756 -3580 -12713
13777 -12713 -38998 -91586 -70796 -45852 3814 14199 16452 -3833 -38680 -28837 21864 42810
13765 42810 23914 57328 69679 79324 96156 37514 -2580 31343 93518 121900 163628 156755
13753 156755 116594 139341 157327 162724 170533 215060 181276 160610 167714 113189 35685 41028
13741 41028 24914 52853 130682 156126 135653 96145 46971 61558 58418 7576 -39254 -21172
13729 -21172 -37059 7795 65636 87461 49748 44443 28806 -1624 6193 7952 67566 102770
13717 102770 56342 9938 -41735 -24258 4117 29573 -15007 -1563 35976 67386 70746 64107
13705 64107 72621 43948 19140 57038 89609 115353 140348 128062 90124 72519 55063 25098
13693 25098 -37464 -69572 -64364 5189 35518 73863 41776 -26976 -42406 -33157 -61142 -23637
13681 -23637 38652 44521 23475 14377 40676 -10860 -42576 9647 102535 120106 120796 81000
13669 81000 32398 23042 51281 92277 27657 -23800 58501 105831 87030 16103 -45470 -13464
13657 -13464 20154 37931 58075 52292 61312 41269 10439 64903 94823 103646 82114 39038
13645 39038 35465 -15920 -64232 16385 92443 123792 116503 99836 53252 28103 31686 59819
13633 59819 96452 43803 30489 23620 17250 48220 106224 100787 42137 99009 124756 116678
13621 116678 93582 98059 121335 142725 147931 156864 134438 116572 127004 103198 91167 115158
13609 115158 101173 81128 75451 86339 110904 111453 121797 64179 32695 60415 88728 87366
13597 87366 69708 60522 122825 144365 158189 150466 173441 188229 127305 112542 129056 124396
13585 124396 88237 86230 128660 130350 71090 81083 74936 57305 29409 34022 91613 92782 77819
13572 77819 98043 95450 116513 116396 139587 176387 223663 215794 233309 280797 279370 247077 170869
13559 170869 72600 108350 151032 169221 143880 167272 184329 130219 91982 101249 143092 121445
13547 121445 109396 88214 156107 240018 255947 233351 180855 147524 125519 175014 182913 164879
13535 164879 181720 210057 230404 202089 174631 182137 93613 111070 148098 128306 92437 169123
13523 169123 156578 123295 102689 84999 79654 62836 77179 127254 111189 87927 130051 136656
13511 136656 151708 172536 147577 65685 44929 84079 136761 167471 130869 97188 114063
13500 114063 110306 49276 64615 99423 124936 43329 6759 25636 -2191 -21225 -27861 -21157
13488 -21157 -4393 -11686 -32668 39929 74872 52133 48499 72396 113025 125830 119284 150215
13476 150215 187059 177365 178263 166359 172219 165200 165338 142696 163415 204748 171946 179034 184433
13463 184433 136236 127581 67246 -27894 -73021 -94324 -95018 -90720 -72280 -60732 -65952 -19762
13451 -19762 32547 43646 48602 72487 91659 31715 -83473 -104367 -109040 -34701 -8988 -30173
13439 -30173 -2140 62826 106254 99287 77824 115117 62376 67292 96685 148672 139752 71914
13427 71914 29575 21137 32483 64130 69899 54095 7882 22673 26679 51913 16893 58178
13415 58178 67118 99792 52440 1340 -26768 -26656 -9512 -11506 -14521 28793 99111 118942 113567
13402 113567 114818 123675 133314 139540 88388 24319 55613 83514 73249 52877 69380 51378
13390 51378 64178 127688 119982 101295 106334 133700 113584 73344 54124 23313 8816 16221
13378 16221 8466 -4568 17824 37891 45614 107219 123695 43436 6689 53652 64996 34333
13366 34333 6452 -22547 -20205 37541 68096 56827 39737 60661 93469 142807 118137 103252
13354 103252 100729 114407 134182 182923 205866 189075 158562 74121 14903 32064 72232 115504
13342 115504 106515 32782 -14330 10879 90884 113849 122046 103280 108644 79841 105801 146123
13330 146123 138861 77447 57050 60617 26000 86016 130293 132265 130214 220392 234305 275352
13318 275352 267509 212948 153706 94954 93784 140778 104891 49654 32259 54715 49338 71249
13306 71249 74971 93036 118849 141183 149444 155110 158665 193226 251339 209832 270242 300455
13294 300455 273087 286637 290030 306460 279968 276868 256517 227795 203334 235954 202755 129189
13282 129189 99598 128961 146289 129662 136447 109544 96273 111126 157777 182204 166808 183142
13270 183142 148303 173173 201964 198185 196824 191277 190744 177700 180803 129695 90489 130073 174247
13257 174247 201842 198821 190435 155896 121510 120424 124097 138337 185236 215539 123224 118632
13245 118632 130830 166482 147022 103324 105924 112999 111038 143947 134802 109959 118651 156469
13233 156469 201209 183265 187870 174405 212004 234013 210287 168800 133458 84111 112744 160333
13221 160333 196489 152851 119693 126122 134856 136994 198469 168634 191453 234860 239269 232810
13209 232810 236167 212844 221320 227606 222631 239382 293135 334172 375155 350806 335507 322851
13197 322851 335339 407851 430087 439485 429421 463286 472945 530795 616800 764554 968956
13186 968956 1142866 1335617 1615930 2024398 2445726 3068569 3786638 4441946 5014679 5369015
13176 5369015 5537864 5503887 5182342 4674712 4151504 3623957 3149005 2828582 2519169 2228407
13166 2228407 2024863 1878281 1769803 1636203 1563109 1495700 1421819 1379436 1331298 1251103
13156 1251103 1231238 1206953 1161719 1140688 1124004 1087241 1045939 1058696 1060179 1087484 1096601 1069584
13144 1069584 1039635 1034304 994213 957746 971842 938462 939751 888903 828943 781394 787372 746858
13132 746858 692480 706216 684355 630729 627001 619944 549071 481347 472134 466476 430116 454111
13120 454111 481638 468944 442750 396229 389907 375072 304556 278047 296896 305653 320413 320654
13108 320654 330903 329874 367514 378193 308479 313720 288810 232831 255492 255228 235041 146484
13096 146484 126453 192320 270589 295951 258528 249497 257678 310971 393500 489666 528861 509313
13084 509313 544474 620420 693327 764033 955866 1208909 1390956 1594574 1849346 1984827
13074 1984827 2104789 2185187 2123593 1994061 1853738 1671833 1436169 1267991 1150835 1072675
13064 1072675 1015691 925040 903528 912159 888930 809556 711088 672862 674702 653058 653578 613539
13052 613539 561860 560431 616264 626398 576523 544622 547624 508396 503924 520103 574670 546877
13040 546877 569731 577816 577985 532994 502277 473084 453260 439453 407915 425060 411968 394713
13028 394713 397495 452044 437393 400393 368218 327477 345943 282523 241262 267642 240898 249296
13016 249296 279103 332677 351863 310296 340488 358480 373890 390514 331461 288442 238054
13005 238054 222425 221639 196101 166523 223528 244117 207730 246718 218465 205141 192880 196702
12993 196702 222320 248895 233947 223874 262380 277395 240296 242323 229159 174756 175024 187198
12981 187198 209078 243770 228339 169678 103303 141427 152838 162935 214443 187018 200783
12970 200783 188036 188091 184676 176352 199611 177218 170755 178286 160088 144246 143606 174072 175496
12957 175496 181705 211228 235796 286669 353779 388226 354043 393919 398551 355859 339024 396413
12945 396413 377370 386982 428163 418302 399351 364517 423431 435565 404528 395180 362339 344743
12933 344743 368522 372850 341311 337382 372788 397427 354200 353444 371060 374222 448128 445021 383341
12920 383341 399872 420958 431457 468440 530532 622915 650765 671910 707721 765803 782898
12909 782898 855711 931222 951922 987224 1016904 1009847 1003823 990801 934263 862690 793013 778314
12897 778314 751033 686372 610087 592556 578765 537015 527855 537195 570964 535402 477451 415706
12885 415706 457574 526067 505802 502846 470743 448989 455819 494056 570768 563894 582638 595032
12873 595032 642706 731057 821320 914624 916298 953666 1067369 1248733 1472335 1710857 1994345
12862 1994345 2333063 2610292 2716162 2712654 2581745 2373134 2144749 1911336 1694843 1513932
12852 1513932 1329597 1237629 1250824 1212443 1140561 1113426 1115565 1063967 1081292 1054283 1022126
12841 1022126 1036324 1004534 969453 1023402 1033712 1009348 960198 915560 874082 865277 823811
12830 823811 788752 748763 706827 705052 668746 672715 679963 689571 692920 716113 712106 677182 697615
12817 697615 722614 688819 648214 664826 737463 746216 763806 741346 713892 686228 686673 695729
12805 695729 644194 644499 696300 711299 672632 684001 743293 716682 730558 726565 704757 726976
12793 726976 768005 770531 767987 803091 830837 878630 910984 920941 933641 970422 1038823 1131668
12781 1131668 1220256 1273486 1281312 1323734 1306854 1237015 1160984 1112625 1082104 1038817 1002684
12770 1002684 930205 954299 966800 988823 993991 1015512 1120846 1145512 1137104 1212705 1287696
12759 1287696 1411304 1536870 1658721 1781602 1865422 1926280 2015048 2144865 2191664 2157790
12749 2157790 2110928 2005320 1963341 1936057 1938609 1955621 1902671 1910992 1963227 2047518 2115301
12738 2115301 2123846 2218338 2275098 2361419 2408493 2459050 2517566 2586477 2646425 2691762 2727313
12727 2727313 2716902 2703085 2758813 2831053 2887237 2955487 3011742 2981346 3020733 3072256 3153499
12716 3153499 3218019 3280130 3316091 3380377 3469010 3479206 3522996 3640941 3682115 3749383 3744325
12705 3744325 3774486 3817661 3805966 3868806 3922641 4027306 4154261 4315303 4402754 4454402 4538262
12694 4538262 4661886 4748012 4828544 5046823 5214853 5404632 5617868 5711489 5884125 6104226
12684 6104226 6358164 6615863 6875259 7154377 7604958 8099357 8617327 9205077 9815185
12675 9815185 10554439 11443219 12446056 13678677 15181368 16961904 19030193 21458156
12667 21458156 24315499 27703790 31651667 36282117 41900956 48996979 58248041 70797652
12659 70797652 88004811 111236842 141385208 177894375 218706677 261193012 302041827
12652 302041827 337031769 362152843 374588705 373231487 358830586 333857279 302003421
12645 302003421 267315668 232817406 201054209 174061953 152714792 136457687 124065160
12638 124065160 114458131 106702864 100262471 94820243 90059802 85766051 81964987 78625600
12630 78625600 75689227 73124571 70953647 69136157 67721307 66605180 65723871 65040357
12622 65040357 64507935 64078487 63608440 63079876 62444217 61626295 60576929 59237711 57640294
12613 57640294 55780681 53681264 51480906 49191181 46837603 44551733 42393631 40254593
12605 40254593 38222600 36252037 34375352 32642300 31150569 29818927 28720019 27886971
12597 27886971 27352746 26919021 26243648 25107308 23754350 22489432 21538929 20707649 19813236
12588 19813236 18800952 17851489 16952724 16146858 15515949 15018716 14755004 14565140 14390979
12579 14390979 14151821 13784925 13391252 12961635 12626753 12379911 12200722 12095131 12059726
12570 12059726 12135643 12162169 12080375 11787356 11382042 11151006 11088040 11158100 11289363 11509323
12560 11509323 11851083 12267261 12717879 13342603 14243383 15480321 16997130 18045865 17812696
12551 17812696 16519489 15079091 14021788 13382582 12852363 12277687 11688710 11119346 10685248
12542 10685248 10365039 10191096 10150766 10271950 10387768 10221282 9912657 9545206 9240585
12533 9240585 9036072 8871931 8741995 8665231 8654371 8679264 8692444 8573318 8282347 7962391
12523 7962391 7677163 7530154 7474094 7529564 7687237 7888147 8056030 8169881 8211566 8235014
12513 8235014 8466186 8836171 9091150 8891103 8178196 7315782 6634002 6051655 5677523
12504 5677523 5503507 5417977 5361375 5222252 5029957 4783293 4574412 4415268 4317219 4306581
12494 4306581 4313906 4312424 4333624 4367766 4400373 4479859 4584828 4647829 4676052 4689933 4649219
12483 4649219 4500086 4298930 4111533 3946215 3887099 3843378 3743566 3623442 3557205 3557903 3484533
12472 3484533 3372888 3236085 3119337 2998505 2888526 2814052 2718331 2652289 2610381 2570680
12462 2570680 2464897 2389030 2290091 2198525 2178979 2182756 2123120 2084099 2057013 2060886 2086890
12451 2086890 2101338 2033115 2023643 2000796 1885925 1815985 1769033 1706812 1664761 1622589 1585591
12440 1585591 1528892 1533881 1517111 1537918 1490046 1454855 1396761 1393441 1340483 1325070 1315260 1358773
12428 1358773 1321104 1273894 1280438 1329958 1291006 1206845 1165420 1162917 1147228 1085883 1042482 1061952
12416 1061952 1103363 1135049 1168763 1149003 1025593 955358 951090 890283 772691 777863 815317
12405 815317 785972 727042 728448 771148 791473 836192 835279 804405 836637 803316 784770 764904
12393 764904 742075 652695 630075 573238 531057 554008 564520 517920 472069 444040 405293
12382 405293 383025 375366 406197 406863 457351 474698 436747 441028 404037 358095 324147 272879
12370 272879 295284 322743 322810 294221 318774 325688 304073 260141 207650 220550 218792 210302 211276
12357 211276 214903 186052 246196 277179 267934 270099 246200 273567 342775 369319 464741 549007
12345 549007 609125 641625 647628 682050 710321 695700 712280 706187 710563 733933 726403 726639 719962
12332 719962 704508 702702 671991 637315 645796 660736 725439 772807 805444 867715 937194 918771
12320 918771 855942 879355 958308 1039374 1031578 1024203 1097566 1184771 1210329 1198376 1184788 1175979
12308 1175979 1151941 1125710 1140011 1144475 1143952 1123472 1058287 1013052 1012685 1043840 1043527 996365 989388
12295 989388 972328 1005837 1002751 997368 998569 1013790 985773 925011 935889 957694 956169 952428
12283 952428 953249 986990 1044631 1119383 1156675 1183388 1209031 1252102 1322904 1451891 1627817
12272 1627817 1815940 1986019 2128910 2154802 2112980 2066303 1977070 1795379 1677921 1533874
12262 1533874 1452842 1459430 1468664 1456618 1383347 1376579 1393926 1345170 1276644 1220504 1223832 1223935
12250 1223935 1202980 1164124 1114735 1084013 1091981 1092772 1116620 1126883 1063646 1037219 1015125 1087358
12238 1087358 1072015 1080269 1159891 1241858 1291758 1331974 1357064 1408328 1527286 1643331 1826432
12227 1826432 1986358 2131617 2311838 2487706 2626435 2766620 2875228 2900159 2825602 2667565
12217 2667565 2525180 2349251 2119629 1862036 1662878 1587447 1501429 1442456 1382324 1323347
12207 1323347 1264832 1170197 1081504 1002720 1039621 1041208 1054991 1063660 1041806 1010540 959214 992786
12195 992786 1000213 982540 956159 954320 860428 849393 885948 876332 861071 827717 855390 836163
12183 836163 813250 783764 808359 788846 765311 767525 750677 725901 723834 710469 696767 682741
12171 682741 683002 665894 624031 648898 670055 670692 632252 555222 541397 509505 481226 502750
12159 502750 505813 495881 545580 547254 459173 496650 536149 476195 477101 503873 573355 535306
12147 535306 501412 486992 479815 485099 473251 513177 554559 543285 508397 523982 626026 632198
12135 632198 659030 688964 725875 789086 831867 835493 885208 918165 885536 839622 780365 756550
12123 756550 733818 744866 766654 741372 731528 726547 746351 816872 751906 768860 777016 808865
12111 808865 806605 795320 819023 833290 852836 809945 788678 794303 858128 933953 942964 854655
12099 854655 846579 858204 915581 956175 1009897 1093694 1199389 1304989 1309845 1314136 1350982 1393264
12087 1393264 1350692 1245677 1228407 1283633 1207605 1113350 1101073 1077409 1075594 1059784 1098266
12076 1098266 1124136 1132251 1081978 1028507 1063325 1027578 971671 968179 966226 946450 1000866 1011100
12064 1011100 965863 983516 1000000 1042797 1078921 1066512 1019837 974981 950568 923529 945803
12053 945803 1004992 988917 964256 1004581 1058740 1073529 1059031 1037815 1010184 997491 1017885
12042 1017885 999075 999789 940780 903989 909372 940024 959325 942744 913116 942208 953796 970830
12030 970830 955747 988108 1008725 976038 1020984 1040913 1026398 1057888 1069850 1082966 1099076
12019 1099076 1048805 978574 949907 921470 922211 933238 956910 972733 971421 971721 958894 995283
12007 995283 1033253 1076845 1031249 1001254 1058318 1080000 1069238 1151057 1181303 1171687 1168052 1152473
11995 1152473 1180360 1214383 1211976 1214110 1245575 1298574 1341605 1350767 1332906 1350541 1383491 1407359
11983 1407359 1409844 1456049 1462215 1473714 1570193 1608842 1646057 1641485 1660002 1719736 1754411 1810732
11971 1810732 1853667 1848936 1923094 2004697 2081569 2178737 2285209 2361645 2412112 2460034 2574347
11960 2574347 2586954 2619576 2713107 2757430 2876314 2995016 3116458 3274107 3424713 3620755
11950 3620755 3844446 4029905 4167755 4283267 4336665 4326076 4276781 4253917 4323035 4439268
11940 4439268 4485877 4565567 4649972 4736960 4847247 4924635 5033895 5229946 5431644 5638093
11930 5638093 5762873 5852614 5896779 5967364 5996215 5973906 6057830 6233242 6364500 6466504
11920 6466504 6561065 6660443 6832929 7041955 7327821 7586693 7901951 8271605 8810118 9450662
11910 9450662 9997260 10519672 11150396 11651920 12104012 12566682 13066287 13566677 14135577
11901 14135577 14770152 15534653 16393772 17298674 18196940 19017059 19699010 20296198 20909241
11892 20909241 21472446 22062901 22758264 23538232 24613301 26081575 27851094 30084784 32978061
11883 32978061 36738611 41682438 48335553 57061284 68182370 81425248 95715083 109051570
11875 109051570 118738978 122642712 120428683 113814587 105509842 98011915 92476125 88831087
11867 88831087 86792563 86056903 86354194 87603668 89873605 92977792 96546648 100072750
11859 100072750 103049055 105245727 106663110 107747206 108983118 110693596 113049595 116146629
11851 116146629 119942415 123992106 127649533 130346974 131893417 132649197 133259992 134489236
11843 134489236 136911726 141025254 147158604 155712000 167508583 183888739 206136941
11836 206136941 234829390 268189606 301205558 326261558 336511699 329690420 309468967
11829 309468967 282917061 256566762 234258556 216813834 203754327 194188668 187532701
11822 187532701 183412154 181499777 181239292 181698012 181873745 180881183 178337197 174548419
11814 174548419 170240637 166098208 162586290 159893682 157913433 156496093 155259556 153789665
11806 153789665 151747487 149043565 146020898 143164993 140929857 139496604 138907767 139162789
11798 139162789 140207582 142425746 146323593 152509929 161092072 171145084 180342794 185547358
11790 185547358 184439374 176692933 164188782 149655885 135479618 123028641 112675673
11783 112675673 104302913 97638298 92250329 87808385 84119928 80955373 78199554 75762347
11775 75762347 73615999 71692516 69822912 67946446 65968813 63919036 61806069 59666270
11767 59666270 57537742 55478762 53476755 51583765 49828441 48226751 46834984 45511591
11759 45511591 44244100 42847075 41315281 39730170 38189556 36631758 35009356 33452029
11751 33452029 31953930 30546259 29227556 27942070 26722004 25570776 24488394 23543279
11743 23543279 22735416 21960829 21163976 20431916 19754820 19108857 18515791 17909011 17338721
11734 17338721 16716041 16055525 15471953 14865153 14262465 13761207 13309431 12875431 12471681
11725 12471681 12102087 11812691 11532417 11268497 11028449 10868866 10676089 10395947 10120191
11716 10120191 9737999 9402494 9068931 8686588 8317995 8032377 7750560 7476455 7207596
11707 7207596 6922244 6714471 6487692 6317026 6146945 5964503 5785413 5603881 5446857
11698 5446857 5249219 5070181 4958740 4804909 4691367 4529488 4381900 4330318 4207765 4043267
11688 4043267 3910150 3825691 3806115 3769178 3720869 3605325 3543493 3553924 3561867 3493288 3360315
11677 3360315 3284898 3201300 3138482 3109402 3040848 3012460 3021123 2949501 2930163 2972115 2955084
11666 2955084 2906650 2862871 2851559 2862249 2807128 2782206 2739119 2714883 2697400 2636273 2554524
11655 2554524 2528956 2593647 2615380 2666264 2649338 2608520 2565491 2546908 2502718 2433627 2425706
11644 2425706 2381903 2297676 2224811 2183564 2156066 2116609 2111135 2157357 2132055 2055392 2072199
11633 2072199 2072784 2010532 1989721 1978756 1991646 1977866 1975814 1944572 1946478 1981309 1995522 1981606
11621 1981606 1955466 1886735 1816214 1781144 1756827 1716981 1705008 1756992 1693747 1628823 1600134
11610 1600134 1589351 1557299 1477203 1466502 1429117 1406451 1391137 1367842 1349614 1372583 1320116
11599 1320116 1311981 1320669 1302000 1268371 1251082 1221689 1152532 1164164 1189296 1135618 1151274 1106225
11587 1106225 1027340 1012774 1003169 948814 916947 884166 923195 949198 918695 855490 763533
11576 763533 785018 807813 797726 759055 709683 698984 673940 659427 668104 698791 680549 625798
11564 625798 589047 624585 627354 585189 598774 563597 527902 536025 480974 436478 475214 528597
11552 528597 500959 486496 417165 407849 455240 422441 398365 385996 383380 463066 541432 516755
11540 516755 540904 585115 597628 565959 496585 461753 452683 471005 497593 473510 536210 590215
11528 590215 641684 590084 560706 565796 592172 605110 609545 600965 561514 549123 520098 552362
11516 552362 599352 663632 658204 637433 631935 627141 614958 659457 620633 582013 562061 579423
11504 579423 632323 665453 659968 689000 710306 620368 578159 587192 596432 601057 598641 624079
11492 624079 601403 499204 450736 484326 569428 639027 645915 611487 558691 542330 601323
11481 601323 594297 593451 581954 612689 573785 556765 537430 546009 548156 582419 569790 544252
11469 544252 533545 532927 514711 522855 537809 578264 577760 586220 624091 619033 608108 552826 467466
11456 467466 395241 399569 440647 460110 442149 429701 456874 503004 495625 534850 525527 523149
11444 523149 573990 593948 536033 425273 386142 437504 469878 524564 572490 648057 712231
11433 712231 785118 783895 774441 801319 810749 760815 708691 698550 697997 658856 655198 678228 709567
11420 709567 675434 668011 629967 603779 582359 598797 674525 710980 744574 738793 796690 842943
11408 842943 796348 738506 841224 949846 953603 945961 943964 936799 942470 994129 1027046 1029081
11396 1029081 1015539 1086212 1168294 1262134 1415459 1570200 1802820 1968988 2037082 1995328
11386 1995328 1923961 1764274 1591281 1498485 1392363 1249283 1145424 1109627 1080328 1031657
11376 1031657 1016491 1009780 987451 999691 987902 944553 971778 977055 941235 923589 885880 912763
11364 912763 943887 978597 1004020 1009435 1000913 986315 957467 956148 960329 1005451 1049336 1062962
11352 1062962 1012698 984740 1025070 1095947 1149796 1166532 1114254 1072681 1041342 972907 885162
11341 885162 818411 739275 716385 759267 759304 719651 715117 731617 682185 692836 727388 715671
11329 715671 699993 664797 654500 638587 622283 607126 588435 610786 577095 531871 531615 540422
11317 540422 522390 497371 476985 452026 424045 408209 400624 376229 331080 351789 375651 434065
11305 434065 441768 403909 442585 518921 567217 632577 615903 540389 467241 463328 425048 351289
11293 351289 296161 267117 253820 250003 267836 262186 245523 226679 284800 281551 266719 242241
11281 242241 225695 202769 167692 96370 118443 164128 211159 240936 277741 248338 220643
11270 220643 296728 290703 276993 273214 241515 232943 242460 233711 248295 219675 158368 131720
11258 131720 109799 132596 150306 170566 184925 205321 208785 166615 125590 143837 120784 211176
11246 211176 254838 176308 122336 119069 87446 134097 183405 179863 164972 191283 167623 91233
11234 91233 68356 84938 120332 99034 79618 87531 92309 103956 127493 185614 243760 262726
11222 262726 246639 225668 172688 172114 163146 142394 153922 137336 135672 86563 54962 60971
11210 60971 35769 53271 55512 81876 145935 153427 105095 90144 97043 107481 95414 126291
11198 126291 147311 112831 142345 114538 75684 86472 102525 104285 69137 105777 135512 151016
11186 151016 116126 94174 113580 100349 53203 43167 -24840 -58693 20563 30120 30884 79414
11174 79414 119798 111859 15288 10254 52389 7987 -25444 27702 83451 150479 139596 130654
11162 130654 157405 112569 91443 113131 109072 93964 149313 201741 137263 108233 143204 177474
11150 177474 157103 109703 63011 30757 104778 135608 108805 89899 69971 84098 60858
11139 60858 65809 114936 106076 115653 85782 91268 94946 70222 9593 -25599 5814 10762 37056
11126 37056 27992 39667 72418 54624 83918 122815 120076 117617 56050 4357 38054 72998
11114 72998 147780 240766 251983 164891 110298 74523 22660 19219 -22022 6271 61545 65647
11102 65647 62257 52112 95039 136166 134001 122617 121033 131823 143591 145830 148684 172484 120508
11089 120508 67067 67624 70065 70617 98637 122948 85803 53919 107024 128091 109965 79183
11077 79183 65604 56749 33056 -47960 -18040 14507 37185 55380 76175 56130 64377 101369
11065 101369 111555 88516 6443 -6340 37036 38823 13120 19720 55289 115278 124584 123767
11053 123767 86468 61898 43933 70446 45795 52331 75635 29787 34201 71880 43386 87077
11041 87077 124195 89825 59041 50149 82908 107800 87244 95585 89574 77321 116335 133552
11029 133552 108971 91460 101590 104077 70030 26553 21107 43204 110930 113889 98701 106996
11017 106996 97521 130495 144229 161881 155427 98321 35094 23794 48051 51482 60040 58298
11005 58298 46790 87596 120382 117782 121879 143420 153076 154838 131703 84718 89801 75250 40016
10992 40016 71524 142080 176225 130709 52882 -23818 9148 16287 21106 50834 48987 34164
10980 34164 32570 103906 110843 76529 38471 -567 -7134 35496 40840 14705 64218 107664
10968 107664 118175 138129 142485 114886 101991 63659 70998 73869 42878 37798 39856 83819
10956 83819 58979 -10662 -1550 10987 17439 21541 -62539 -34673 25746 77872 118311 79895
10944 79895 82043 63643 61705 37829 12284 -19693 -30251 -8190 7783 707 15826 109
10932 109 25622 38339 54506 52949 70193 66129 76404 55829 45006 30504 70539 102526
10920 102526 126953 146170 142417 109872 58428 54589 11502 38722 73286 78114 25086 20637
10908 20637 44331 36822 53718 18824 21815 43173 -17826 -26346 24681 72016 87595 60812
10896 60812 31937 -37675 -30516 -1334 6153 15111 42915 109334 73484 -755 -27967 -8100
10884 -8100 31478 75250 90629 65565 70829 84981 96931 108549 93214 49326 45097 42812
10872 42812 39018 87531 54412 -23901 -62337 -57364 -65621 -80806 -37440 8644 5495 12766 23882
10859 23882 26091 62490 56079 15637 -16523 -2503 27148 72338 52352 18080 -30035 -34729
10847 -34729 11020 67598 73325 90776 101254 89955 131240 112993 110145 118306 107180 111265
10835 111265 135656 130091 104834 85967 69969 72116 85669 59722 32738 31892 65851 106295
10823 106295 152265 123465 88994 88130 77376 56326 35264 86820 98014 86367 154907 170757
10811 170757 166094 128122 72143 73258 87584 90826 105297 155963 152189 125780 151089 108803
10799 108803 81153 70750 19065 -43484 -17284 64546 92601 123554 103930 93867 81456
10788 81456 23643 11548 60535 35256 15176 32531 109072 138403 57519 263 11664 9737
10776 9737 -34650 43794 66603 54413 35204 49153 49321 48925 99913 95892 94779 99897 97058
10763 97058 153990 184421 171381 168577 234059 288903 282467 205813 130741 133651 87674 53569
10751 53569 104256 158623 140135 130546 193535 156994 89862 112752 149433 175332 173967 102378
10739 102378 85026 121071 98308 85063 68427 85599 107969 57480 86718 82125 62725 89201
10727 89201 86050 113807 106474 49190 57216 34614 33627 46083 46439 60493 69171 126117 97453
10714 97453 79413 92443 109418 149764 175893 184530 198342 215102 152703 106292 47338 60631
10702 60631 70958 90596 107638 90911 104425 120766 71830 49247 71830 101485 80191 90101
10690 90101 98292 76199 49716 89566 91822 133253 143089 141388 121326 118643 87715 51248 92580
10677 92580 88762 63260 53700 35248 62650 100503 112630 129129 97637 86176 69642 42645
10665 42645 28297 53702 76717 143723 213326 206070 175544 169509 135820 116901 85909 75109
10653 75109 77578 77817 77107 102661 113350 100857 88217 98575 153865 129942 159793 165391 140234
10640 140234 149985 210846 204461 146666 79817 83728 69653 134504 201849 166857 68585 95773
10628 95773 149422 137133 123374 166968 206847 196439 253145 277553 229608 196426 206862 251706
10616 251706 225574 230722 241962 235157 203216 206951 157644 153431 157370 165686 148293 221373 233188
10603 233188 243111 239114 246320 250827 290206 312016 319420 321601 314479 319969 330825 333217 281926
10590 281926 262775 232591 276416 326384 321279 243361 216702 204158 228416 233873 231464 253416
10578 253416 246017 242723 277405 300811 278046 302373 314185 289824 279181 311645 326994 349384
10566 349384 355270 350147 351609 337694 313069 342471 368595 349489 348069 328086 314062 355533
10554 355533 340520 340080 362968 340848 294854 254097 237602 268514 279226 313139 356769 336635
10542 336635 331957 334195 344966 349016 324948 330211 302177 278302 271298 305371 329309 368115
10530 368115 329246 320142 328347 370371 441072 369083 325486 249583 261104 285123 268497 312129
10518 312129 352018 303063 205546 172822 140306 150893 237103 256427 215272 187922 184678 202508
10506 202508 207124 190831 193237 177176 111437 149309 179177 221268 266038 285709 263538 212691
10494 212691 248960 291437 287708 290018 245210 193803 126350 118911 115636 128653 176380 183206
10482 183206 197462 164891 211869 163182 127404 120118 160745 255788 266446 215680 218397 186928
10470 186928 150143 184546 224008 232177 220622 159673 135053 126635 166603 182617 236958 156723
10458 156723 104160 118478 129253 154170 200568 166541 161873 161142 124585 120105 82325 43794
10446 43794 69429 147822 219695 235824 215375 196746 211123 173419 158766 130364 160630 183357
10434 183357 197649 214278 226104 232707 256403 244370 219003 196478 178111 166222 130640 94191
10422 94191 148248 142100 154675 202010 209082 252901 265630 259165 226582 137412 147380 143287 121389
10409 121389 100884 76205 125305 146281 136945 169414 205348 266203 256357 233044 248239 239353
10397 239353 189597 201198 206470 210128 193246 191623 231688 247028 240676 206192 205080 210011 137900
10384 137900 135110 176751 186345 180702 166406 194590 215037 239707 222665 197734 193401 216631
10372 216631 232297 260055 219361 156424 139192 181411 221901 233120 249249 237936 193281
10361 193281 204906 201144 214814 244081 260855 274866 256953 245218 213068 228793 255550 259607
10349 259607 231271 225558 251571 247585 236534 286381 345002 307109 250652 243463 246531 292478
10337 292478 291467 272825 202012 186204 201092 218121 265074 314010 344504 323042 322123 341963
10325 341963 318862 267230 257847 279769 321139 323530 294392 330068 295926 257817 151423 114352
10313 114352 96716 161800 226375 271393 299594 278842 282813 261222 241829 227784 224985 172562
10301 172562 180282 201877 242881 279249 300986 302775 311937 298843 252571 237614 204494 247049
10289 247049 305499 349397 378842 423256 499039 575106 633438 585142 533140 500498 464386
10278 464386 453320 475615 501013 477893 454680 397709 406695 403404 366641 310439 307868 323171
10266 323171 336485 378228 347519 318125 321905 362454 375917 360671 330296 380353 422940 393224
10254 393224 391688 372627 376210 425565 477545 475145 553928 658205 687321 723827 830371 872761
10242 872761 922555 988531 1038250 1099711 1125618 1151592 1184328 1166986 1117770 1064145 995798
10231 995798 880563 785734 710890 708055 782429 762311 699654 695970 703825 685852 661260 659373
10219 659373 627891 599593 557470 531129 538679 525498 544844 575374 629607 654508 698737 725580
10207 725580 778986 805770 828007 862456 940027 965817 1073441 1230975 1355335 1511207 1638338
10196 1638338 1691823 1732055 1772102 1767283 1711962 1586504 1531636 1402030 1244497 1131203 1085276
10185 1085276 963909 903799 836776 796969 805528 776161 783330 746933 678503 646135 620903
10174 620903 609205 692334 725540 730856 758578 718258 657020 649123 673432 667637 684806 736051
10162 736051 787892 787755 837937 906716 983093 1043945 1110191 1178387 1283082 1366746 1446991 1494905
10150 1494905 1515194 1446078 1309767 1183817 1097130 1106299 1075495 961453 859020 795965 806266
10139 806266 770309 685025 626848 640553 643124 607932 552647 559790 594334 578284 603260 587051
10127 587051 589085 566636 591497 638473 651628 654022 635574 606536 542448 543378 576532 584952
10115 584952 612088 618703 650590 688557 706037 717456 735035 803466 797679 775049 756663 749776
10103 749776 662373 606216 572443 565470 610703 668727 690675 676487 635662 611438 584231 559352
10091 559352 515142 523268 539986 535631 543976 556405 583753 609523 661838 710903 804013 859690
10079 859690 941329 934509 896742 863878 814955 823514 841683 853955 858291 825959 777635 754302
10067 754302 696061 689289 744232 796365 819457 795894 819563 868930 893297 918709 958803 979075
10055 979075 951966 954303 969648 957370 942512 944819 986965 966224 941877 943532 951434 990484
10043 990484 1006421 1035255 1137128 1210218 1240611 1289951 1399667 1404446 1389674 1381188 1410890
10032 1410890 1444486 1390225 1314936 1260902 1232143 1201700 1155145 1112656 1109623 1148019 1159478
10021 1159478 1185900 1194164 1152526 1123929 1146186 1127876 1133726 1148727 1152383 1167181 1158036 1105469
10009 1105469 1062630 1022274 1015832 1015964 1027813 1036269 1008572 1054610 1030414 947372 970177 1076928
9997 1076928 1134981 1131488 1163708 1197497 1221207 1222821 1186438 1128472 1129556 1110781 1118998 1133805
9985 1133805 1159152 1140804 1123565 1063561 1011927 1016046 1108464 1092113 1119961 1157832 1169767 1184494
9973 1184494 1248113 1289157 1271685 1249296 1234745 1242270 1226907 1225923 1209222 1207719 1149689 1132890
9961 1132890 1120280 1168063 1153905 1156560 1180708 1206018 1278974 1341356 1380054 1422694 1376425 1341613
9949 1341613 1350200 1368774 1414865 1432126 1432563 1416238 1441496 1414592 1384818 1438152 1471221 1470749
9937 1470749 1456336 1408765 1424002 1432550 1467931 1522237 1580006 1601956 1626027 1656017 1676855 1696221
9925 1696221 1742054 1737128 1724242 1771459 1781276 1800972 1883006 1937422 1997397 2074165 2091006 2099328
9913 2099328 2156595 2339127 2454367 2490971 2611921 2707264 2801112 2912104 3000065 3090438 3126446
9902 3126446 3198281 3335064 3504305 3698553 3907002 4067822 4242058 4506068 4736935 4957009
9892 4957009 5254364 5492182 5761609 6051548 6326203 6556351 6645352 6624808 6578515 6570679
9882 6570679 6592942 6606217 6611729 6563341 6524658 6549870 6665464 6807052 7049627 7338888 7614353
9871 7614353 7951281 8488375 9065814 9809749 10773124 11876698 12994056 13975051 14670264
9862 14670264 15002117 15211375 15377625 15422512 15222623 14827376 14308313 13809037 13408971 13177547
9852 13177547 13032225 12930324 12837946 12729910 12760221 12874520 13132692 13459579 13898811 14388680
9842 14388680 14971015 15734920 16498102 17389987 18437932 19597511 20977410 22540778 24488584
9833 24488584 26863542 29715868 33441029 38241666 44505625 52717019 63208962 76215076
9825 76215076 91580320 108255657 123546458 133325268 134369905 127106847 115584710 103828788
9817 103828788 93738160 85963362 80467551 77064829 75579301 75845672 77912903 81902553
9809 81902553 87797822 95557732 104524648 113835554 122782573 130888406 137493714 142159157
9801 142159157 144818748 145875810 145778856 144994054 143868177 142412167 140891992 139504870
9793 139504870 138256224 137336457 137079969 137867703 140475537 145940424 155510383 170719226
9785 170719226 193084460 223521435 261242413 302344031 338577983 359159384 356526302
9778 356526302 333100117 299139318 264844454 235708599 213137195 196607512 184996879
9771 184996879 177334612 172936181 170998882 170719683 171253523 172153544 173563184 175802544
9763 175802544 178778459 182037330 185181603 187704450 189157078 189286509 187793277 184057376
9755 184057376 177779735 169417965 159991236 150611309 142454439 136046946 131230949 127837247
9747 127837247 125724649 125033018 126032191 129093690 134580181 142686585 153349732 165150764
9739 165150764 175165194 179568183 175664823 164706236 150589761 136490596 123758108
9732 123758108 112815184 103713239 96130616 89785884 84500526 79978424 76007003 72492551
9724 72492551 69339891 66400276 63662278 61030123 58526878 56229877 53998295 51876763
9716 51876763 49960239 48191828 46535898 45106446 43820623 42727429 41894617 41065360
9708 41065360 40294483 39631537 38993311 38394217 37918633 37499880 37072049 36558999 35860524
9699 35860524 34996031 33967826 32806331 31348661 29598614 27758305 25973726 24404066
9691 24404066 23034018 21808599 20741364 19807107 18877610 17988869 17211969 16495029 15847691
9682 15847691 15319164 14861344 14477854 14138922 13810913 13559825 13362045 13094162 12891823
9673 12891823 12635282 12346377 11952892 11484834 11142410 10828242 10493231 10134810 9762998
9664 9762998 9478533 9191269 8923826 8592581 8290981 7973779 7738122 7495226 7232837 7021483
9654 7021483 6829390 6548077 6269040 5998439 5760864 5515612 5328010 5201162 5041122 4937510
9644 4937510 4911207 4854443 4781410 4719096 4665146 4572339 4513109 4471260 4371995 4238714 4090266
9633 4090266 4007931 3932136 3879876 3776433 3736056 3698775 3627160 3542583 3453366 3402332 3406246
9622 3406246 3400055 3353848 3403785 3452681 3447894 3468681 3516043 3583251 3632673 3686514 3774387 3826201
9610 3826201 3891354 4000011 4140532 4293083 4404803 4449134 4490433 4571422 4635402 4820640
9600 4820640 5019286 5337998 5851850 6614826 7494061 8063790 8099422 7791532 7411667 7065971
9590 7065971 6743627 6354271 6013475 5721907 5530887 5461907 5486910 5643593 5941877 6384430
9580 6384430 6864824 7370859 7875107 8399466 8876453 9173248 9216987 9214928 9122777 8988905
9570 8988905 8850593 8655369 8545835 8458576 8438821 8439869 8397399 8333662 8264072 8390509 8721441
9559 8721441 9334893 10251882 11450183 13069775 15100672 17239852 18698992 18619774 17049803
9550 17049803 15000257 13271569 11944027 10934799 10176601 9647849 9365720 9313927 9296762
9541 9296762 9343153 9282493 9232960 9264336 9333737 9508340 9728141 9902922 10063930 10225068
9531 10225068 10304289 10288393 10096059 9674222 9197202 8708374 8150572 7603318 7185697 6899576
9521 6899576 6758739 6722446 6787863 6975413 7199946 7479355 7846748 8148763 8446353 8745045
9511 8745045 8934864 8687087 7976723 7170052 6518771 6072798 5740612 5460422 5290368 5166630
9501 5166630 5025863 4908503 4788577 4605338 4394930 4170440 3927581 3750313 3660024 3563317
9491 3563317 3445709 3369044 3260453 3141214 3034330 2937726 2846577 2827955 2781237 2713365 2684873
9480 2684873 2628710 2598684 2604952 2641643 2684103 2690315 2668863 2667323 2662800 2635970 2690938 2720337
9468 2720337 2675406 2579248 2531890 2499052 2425907 2330060 2243492 2168066 2093904 2073497 2063381
9457 2063381 2072304 2020566 2015078 2016138 1990213 2011267 2067776 2087573 2128557 2140538 2149405 2181281
9445 2181281 2150947 2138192 2092257 2053738 2019326 1931682 1822302 1767846 1726223 1788722 1795164
9434 1795164 1818689 1845901 1822896 1838052 1816723 1806041 1804108 1801546 1767751 1735728 1732107 1721191
9422 1721191 1696820 1686316 1713275 1723519 1765712 1774402 1739467 1672494 1649114 1669900 1696770 1751481
9410 1751481 1814779 1840562 1924991 2138033 2285736 2403956 2504268 2614253 2663428 2633086
9400 2633086 2580195 2507236 2376803 2180672 2086716 2025556 1925035 1863458 1838447 1804867 1783816
9389 1783816 1727274 1689627 1711760 1756251 1734624 1728084 1753125 1753787 1697842 1657212 1654776 1632798
9377 1632798 1602492 1617983 1628039 1611076 1634847 1670006 1695909 1726567 1713147 1694862 1776524
9366 1776524 1930815 2122212 2252286 2383179 2563282 2721626 2839642 2869084 2814017 2773252
9356 2773252 2696358 2550464 2454179 2363887 2238173 2089489 1977830 1863670 1769064 1708730
9346 1708730 1732473 1758907 1781746 1762315 1720896 1692650 1673727 1665454 1693703 1704998 1683140 1707146
9334 1707146 1694176 1660615 1645535 1701002 1718576 1699107 1723256 1747848 1726292 1724844 1799561 1876864
9322 1876864 1939380 2037687 2132480 2220106 2295369 2355832 2381571 2345194 2240303 2197662 2163917
9311 2163917 2207447 2224672 2120385 2023023 1954646 1934280 1896080 1827754 1848142 1893345 1903434
9300 1903434 1899667 1852973 1847742 1849318 1762068 1748978 1763422 1804984 1760493 1745463 1773824 1814754
9288 1814754 1860449 1876026 1899563 1935472 1883945 1895542 1888485 1899704 1921103 1911181 1957112 2026243
9276 2026243 2038588 2091237 2131433 2098896 2153526 2215393 2195104 2190313 2241575 2296040 2262942 2265498
9264 2265498 2255870 2176551 2162016 2160833 2150310 2127282 2079862 2028593 2016691 1997492 1976570 1982147
9252 1982147 2087711 2153507 2138259 2145127 2143477 2116349 2134605 2176592 2169783 2162774 2140972 2145930
9240 2145930 2141664 2170565 2216844 2202767 2228735 2278499 2273605 2274572 2290078 2301192 2324257 2355756
9228 2355756 2414974 2376755 2368563 2402536 2342549 2318264 2325022 2367199 2414112 2461967 2465235 2483342
9216 2483342 2489953 2428629 2426741 2464300 2408603 2397336 2474618 2500469 2529309 2575415 2583806 2606984
9204 2606984 2643114 2649911 2648604 2649893 2684531 2675436 2675167 2696796 2740688 2788795 2789128 2766888 2757560
9191 2757560 2727891 2732560 2722722 2763794 2783973 2782391 2801841 2840013 2863428 2857412 2911382 2886803
9179 2886803 2932154 2945609 2940801 2990774 3071561 3163468 3176955 3207031 3180573 3215275 3214919 3205530
9167 3205530 3182895 3223762 3268770 3326048 3358630 3400020 3399008 3418568 3511092 3522210 3545188 3575804
9155 3575804 3589343 3611565 3673222 3723902 3707068 3697668 3727889 3778269 3818415 3866336 3905574 3947609
9143 3947609 3986614 3983062 4005918 4068609 4176589 4270604 4326928 4316859 4345738 4409066 4426989
9132 4426989 4383903 4393297 4463922 4529982 4611689 4645917 4725736 4806952 4914096 4982620 5017294
9121 5017294 5028458 5074407 5144844 5181065 5233624 5246421 5250604 5347873 5466770 5557599 5629891
9110 5629891 5701711 5789563 5813329 5896786 5996449 6051532 6053158 6114265 6165273 6218292 6338491
9099 6338491 6496224 6578949 6629910 6752375 6844806 6998523 7130360 7268253 7390921 7468006
9089 7468006 7529386 7648634 7754511 7840301 7943352 8061234 8183783 8296775 8417787 8530520
9079 8530520 8602384 8710122 8870987 9042842 9190325 9298956 9429553 9591246 9815201 9980372
9069 9980372 10191949 10360806 10500561 10656595 10849709 10970593 11104957 11272338 11518481 11727130
9059 11727130 11967215 12181385 12396768 12623137 12854093 13121865 13368970 13582976 13793897
9050 13793897 14033942 14314538 14582656 14810238 15103906 15407855 15725051 16019594 16330939
9041 16330939 16650934 16944341 17271645 17600175 18000387 18409870 18768994 19172195 19622056
9032 19622056 20066069 20483620 20906593 21376020 21823194 22301849 22790510 23303624 23831694
9023 23831694 24344860 24925361 25469741 26093220 26766294 27418789 28027597 28622360 29315381
9014 29315381 30062815 30805580 31610714 32426371 33222453 34048416 34845079 35655485 36596619
9005 36596619 37575389 38543858 39516837 40492011 41534049 42601635 43667287 44775308 45882978
8996 45882978 47052474 48282511 49500189 50764965 52015588 53265305 54558471 55794009
8988 55794009 57012189 58219752 59561512 60866799 62176384 63501523 64802337 65971328
8980 65971328 67183802 68357889 69475497 70581621 71626252 72602924 73606182 74480923
8972 74480923 75293100 76079774 76658397 77308182 77812428 78194213 78583896 78884327 78994229
8963 78994229 79093673 79155501 79065178 78843799 78624641 78293475 77900918 77447501 76897233 76263699
8953 76263699 75634465 74949684 74208797 73479345 72716036 71904248 71058382 70180186 69309916
8944 69309916 68360011 67352263 66346098 65415930 64481314 63529396 62529042 61515520 60464301
8935 60464301 59447686 58516088 57518629 56499858 55478925 54497262 53499781 52526840 51637597
8926 51637597 50702935 49749714 48751973 47825940 47001845 46116462 45168474 44201299 43266864
8917 43266864 42393775 41522758 40700844 39876931 39046058 38200466 37394580 36561482 35821573
8908 35821573 35132691 34372155 33658515 32929950 32218885 31583261 30970326 30327993 29681694
8899 29681694 29015323 28346273 27752830 27216312 26725054 26226492 25712402 25239349 24878420
8890 24878420 24448854 23925387 23332176 22752815 22182783 21693859 21241657 20793618 20357210
8881 20357210 19926909 19504858 19111209 18793926 18446274 18088408 17667553 17210896 16808250
8872 16808250 16519212 16283613 16001176 15643899 15321463 15053089 14783766 14421847 14159331
8863 14159331 13960987 13715897 13443658 13170970 12896272 12667269 12409329 12227878 12104523
8854 12104523 11876249 11638569 11448764 11265569 11067070 10831326 10640591 10486893 10331358
8845 10331358 10181347 10003037 9809801 9615632 9442767 9254676 9096608 8998923 8894658 8723336
8835 8723336 8579787 8411158 8250220 8138776 7986962 7855883 7786847 7741239 7642490 7500334
8825 7500334 7388828 7270003 7167069 7020892 6931870 6853410 6802146 6700098 6598854 6528486
8815 6528486 6481891 6362578 6291722 6221648 6218652 6152620 6029095 5990968 5951808 5893568 5769592
8804 5769592 5695699 5630042 5539855 5408296 5314640 5241587 5228896 5197782 5134015 5109708 5086807
8793 5086807 5012400 4952694 4949115 4902419 4834400 4764864 4735391 4695846 4677798 4615606 4544527 4541808
8781 4541808 4490624 4433886 4373035 4320385 4290899 4219755 4138391 4106425 4150238 4123767 3981187
8770 3981187 3966045 3960630 3924894 3856310 3809711 3793008 3733419 3673222 3635427 3597673 3592271 3514786
8758 3514786 3490164 3466120 3398745 3368817 3372447 3370777 3335521 3333329 3331959 3272656 3237980 3164062
8746 3164062 3103350 3002981 2964560 2914184 2912167 2912757 2928263 2917082 2905561 2899277 2892988 2888737
8734 2888737 2834243 2809011 2734598 2654971 2639333 2672510 2653059 2626722 2569779 2533020 2500456
8723 2500456 2473380 2461976 2432351 2471256 2416278 2367419 2354976 2364068 2369193 2302678 2202093 2189996
8711 2189996 2241869 2197693 2205333 2212723 2213123 2213067 2181449 2130036 2064727 2080670 2059026 1966310 1960903
8698 1960903 1974364 1998757 2023810 2012134 1984960 1992050 2001696 1973245 1908418 1893904 1905978 1883843
8686 1883843 1884070 1883518 1873987 1905825 1854346 1861417 1897474 1896397 1828075 1774828 1757037 1725330 1706039
8673 1706039 1685276 1698690 1708913 1652141 1607250 1608734 1641516 1635014 1629871 1627210 1615963 1603038
8661 1603038 1631205 1611043 1621414 1577634 1554168 1594358 1600120 1544555 1547163 1552737 1541493 1528891
8649 1528891 1558240 1620977 1591842 1557180 1493275 1468518 1458585 1426939 1402175 1459180 1526190 1537294
8637 1537294 1492689 1480360 1463248 1412331 1414563 1425716 1449734 1487556 1495464 1496036 1476853 1430782
8625 1430782 1412072 1429489 1454876 1481162 1471530 1480002 1497432 1512936 1510983 1488156 1530771 1533430
8613 1533430 1505812 1464854 1489982 1493032 1411515 1358066 1357888 1356968 1370454 1383391 1394668 1335103
8601 1335103 1266139 1264370 1267124 1308120 1330987 1309055 1279570 1230697 1221807 1141855 1120066 1140749
8589 1140749 1165729 1165960 1122292 1114482 1151168 1129809 1147860 1145443 1139689 1147692 1196473 1160805 1087506
8576 1087506 1026471 995726 985542 1049044 1044814 1021613 1018704 1005300 994230 942145 937010 974833
8564 974833 971016 934835 940964 943231 964969 1013803 1085336 1130869 1166651 1225782 1231700 1133267
8552 1133267 1093941 1005718 936426 945609 934908 920505 877792 905341 853016 795372 775520 807109
8540 807109 831622 845374 891823 911303 897158 905245 829766 735310 705349 746975 754765 750415
8528 750415 755112 784851 760546 756253 763524 786401 742778 788691 815662 786720 832045 842569
8516 842569 803574 763337 713239 684063 678420 723550 685801 698840 723718 699733 699916 690555
8504 690555 683300 679670 639745 661595 691175 737489 711778 720619 728556 753808 731333 686261
8492 686261 630211 604383 608871 628094 577848 592756 622816 584839 602242 617547 632204 659335
8480 659335 660291 596331 521696 524450 516034 513905 569027 640395 666746 684249 682869 674276 667792
8467 667792 619634 570189 576637 582935 537550 522239 483007 504550 563994 614398 589720 571759
8455 571759 594242 601828 576737 551705 500929 481138 516889 531386 577854 624672 624349 585808
8443 585808 555327 511047 425367 451342 443148 459814 464135 490572 460865 489263 453381 417243
8431 417243 443644 414201 424398 424562 419182 484481 534717 471948 406197 378914 366320 379395
8419 379395 374822 389146 398354 380271 388754 382900 403758 445435 416118 385232 358914 366972 430119
8406 430119 425269 402361 338040 324624 335642 348516 399702 453378 442224 429500 493243 494243
8394 494243 462544 433233 413224 431433 440518 427158 419223 348147 336610 355111 412012 472242
8382 472242 440172 424619 392306 428164 450947 404559 394695 350344 356521 426377 411051 411226
8370 411226 408370 404908 388986 358692 297257 259089 260445 281684 286068 323055 379289 385506 384748
8357 384748 407300 405318 375656 347274 365601 415531 386196 314357 285128 298010 297502 296286
8345 296286 318363 358332 343976 325370 339503 291965 271520 316821 348612 327683 298358 318411
8333 318411 318360 265437 235312 254390 287482 307255 327685 296885 352953 335718 311798 309181
8321 309181 313758 330383 299776 319765 322529 342034 344147 328654 337159 330332 304695 263697 252590
8308 252590 290553 306669 299765 275509 253253 268379 278847 320973 322775 223471 236730 250422
8296 250422 201275 173677 169107 216079 201666 174822 168173 169224 218939 256225 278989 291747
8284 291747 288245 269575 226425 224325 149089 174911 223502 200252 182282 218288 220137 222488
8272 222488 198719 177505 186787 204365 210581 247658 272562 275399 252535 245105 208517 217578 172269
8259 172269 188033 241368 280003 307344 273638 235671 236567 266638 290545 306417 253062 224050
8247 224050 284653 298983 246452 173802 167669 192669 225651 212509 173142 151701 177431 196063
8235 196063 218997 193409 184162 182738 210349 253061 233448 233931 193118 192184 221149 253905 220431
8222 220431 210253 233465 293735 310067 281758 227999 228045 210967 201308 217274 232849 246617
8210 246617 266271 256508 222887 265941 322545 303214 213346 198493 257819 273948 214549 213075
8198 213075 212820 187756 185905 158374 204125 242737 255409 213133 210495 192620 140231 146853 200581
8185 200581 196748 164027 160250 117022 118252 101569 130532 95876 101468 147099 171411 199000
8173 199000 221069 236000 268351 287155 292818 224424 152308 157224 130409 97881 119369 122341
8161 122341 140466 182528 197102 191174 207015 238360 261677 299577 337006 322098 250249 130242
8149 130242 61911 96206 75034 53514 119795 182591 179478 160175 145455 149599 96782 98757
8137 98757 115739 161768 173769 159446 183849 189277 225148 162764 97394 123070 182860 242370
8125 242370 230695 195060 177431 165578 142255 143762 120149 99123 141777 164636 165365 181094
8113 181094 204575 171824 137017 135064 60774 15264 61712 128814 157481 88521 73411 78481
8101 78481 137694 170467 213348 247796 252947 222572 215716 247149 198531 170929 172198 179368 157709
8088 157709 170136 151541 117349 153435 182770 230578 206227 175355 172009 169136 156433 183407
8076 183407 168535 168879 201451 205979 254135 237171 177518 147155 206766 212731 244086 210675
8064 210675 199615 248251 221211 165070 149550 123366 153794 120532 125197 138398 166520 222363
8052 222363 293772 284069 241357 216532 222152 186965 148643 162475 183177 221224 189787 204447
8040 204447 161356 155855 181961 198914 219593 155807 63424 30675 99918 174280 161836 157849
8028 157849 143809 149653 114256 80113 97325 123588 171242 221065 294674 298287 201670 178517
8016 178517 225476 233860 273341 264646 262803 266684 270382 255410 191488 179431 176272 163566 173203
8003 173203 142170 121909 108612 171831 205006 218660 213053 180655 172264 187545 205393 230757
7991 230757 238347 218376 219351 192778 177934 153820 169934 119045 76539 78896 77622 151363 213407
7978 213407 210982 244416 268633 275313 253397 202554 161391 130705 179210 195360 186518 153578
7966 153578 106521 120163 127021 134632 121716 132888 121591 24992 28676 57755 65759 46567
7954 46567 60242 71038 113830 121940 92130 83010 92879 111084 97429 132885 158079 136933
7942 136933 129909 167653 161750 172731 185888 123095 89851 51535 59074 60347 107290 158872
7930 158872 188760 157066 152592 166769 149838 126429 136831 170777 159659 156705 163686 134482
7918 134482 101319 151073 189890 148571 117477 83075 60804 128135 237485 217179 190953
7907 190953 203317 176402 188410 164370 110638 107129 92755 46925 42403 65852 92972 74570
7895 74570 77911 54201 88533 118722 118518 119782 108488 110440 136140 177371 151873 86988 72832
7882 72832 67202 89883 79114 64894 25541 -26358 14906 52931 50895 39593 25348 54810
7870 54810 71321 73684 88468 61287 127569 165319 161471 105093 86721 96739 123359 136216
7858 136216 197280 201784 162796 130441 110692 95904 92918 74152 53265 63160 89911 62430
7846 62430 48634 40084 45571 32937 21206 10722 23972 -20339 -6841 1617 -11714 37495
7834 37495 -4443 -23728 -46530 11305 82039 109773 69185 45587 34539 49930 88073 117985
7822 117985 109744 69156 4207 -5778 6683 39810 46658 58680 48311 74981 103301 97977
7810 97977 89307 78575 66703 45901 -11299 -31367 -30304 -3162 34698 21925 36287 75916
7798 75916 78759 91192 37708 1505 -7770 -46573 4203 94686 76954 97041 135646 137910
7786 137910 127066 78993 33812 -15223 -25957 -13465 -14729 -33543 -5619 6272 -29957 -14637
7774 -14637 72178 58890 55128 51947 65432 74669 106206 187715 177003 132431 100896 103733 45241
7761 45241 29084 27111 14225 -22393 -4037 23027 8609 57555 96798 95872 103451 61739 80509
7748 80509 74054 81058 85437 108659 109387 73854 42869 21296 33392 74845 66082 64232 75239
7735 75239 121896 114492 50121 -7867 33371 54191 352 -36633 76085 136947 128765 89906
7723 89906 81755 65187 45692 14689 -18738 -42063 -56029 -69059 -35525 38332 38335 47208 17323
7710 17323 44461 39138 16811 -17135 19998 66109 38534 26411 44786 59714 91038 135741
7698 135741 157654 151383 144940 144598 102278 75790 60807 60658 81086 33903 -14555 -7445 -8197
7685 -8197 -1128 36204 57740 106240 45365 -26643 -38318 -11346 48643 70160 33227 2613
7673 2613 35233 32974 5478 -68441 -46522 16247 35433 -4658 -9232 -47912 -37292 -20472
7661 -20472 -3912 36151 69888 84722 42227 -25305 14570 48791 53116 20860 -42608 -14887
7649 -14887 24057 7855 36812 14445 -48802 -22246 69033 111693 95635 13319 -1027 40878
7637 40878 74716 71416 -20848 -643 15313 -10939 -6130 46136 57867 41636 40496 -8974
7625 -8974 -58735 -21419 12119 -34088 -77006 -28861 38354 47567 36824 37289 -169 14213 9722
7612 9722 2588 13991 -12067 3334 63576 42706 -29646 -122452 -132086 -50215 29013 42621
7600 42621 -23586 -54479 -32074 -21215 -5713 16444 12858 20930 96992 107514 45336 34320
7588 34320 -17738 -19160 -17761 -11526 -51650 -61444 -34112 -14848 -8826 -10645 -58994 -58826 723
7575 723 9210 11110 -21732 -33987 9706 13501 8553 -44404 -51601 -42284 -41784 3222 19497 -5355
7561 -5355 3285 29777 38852 33617 24442 -18302 33678 113669 151812 147724 74729 36857 10951
7548 10951 16256 16311 -4581 -26925 3860 22062 8024 19285 78381 115181 139619 89265 56258
7535 56258 56747 42925 2501 21421 75179 62746 10545 -23230 12017 11010 16156 11425 -5240
7522 -5240 41007 61939 53073 7730 -18240 6549 26812 26375 24203 15828 -25725 -55508 -76587
7509 -76587 -24670 21634 19126 -61287 -100907 -70126 -10309 22242 46931 12345 -22423 -23888
7497 -23888 -13023 24417 97970 79263 61444 22707 22215 10068 16307 -32152 -62430 -28467
7485 -28467 1926 -465 12386 49389 59792 44684 19826 22011 24925 8065 -3848 16117
7473 16117 13608 35622 25319 -4901 -25439 9598 37014 21226 -19703 -31467 -31161 -14741
7461 -14741 -15848 -22494 -25077 23652 30324 16807 -17785 -53341 -18605 53555 44682 19420 27722
7448 27722 10860 -4076 -20423 14148 83399 36452 -34609 -44091 28095 27417 -30576 -53923
7436 -53923 -14423 14408 -48960 -37831 28206 19721 26738 -33506 4977 51328 90965 31002
7424 31002 15754 14537 40852 29830 12036 16804 39358 42236 38972 12641 -51136 -58969 -57412
7411 -57412 -88790 -67804 -56057 -70488 -66267 -16809 -11141 2469 34756 3926 -8752 -19059
7399 -19059 -25355 -45263 -27107 -34311 -22024 -45722 -43803 7193 61661 27900 48365 42437 28259
7386 28259 60313 12092 -5630 32292 22712 21055 55295 52184 8025 -27372 -14282 24429
7374 24429 12613 -54836 -12691 -9555 -49587 -2777 53936 24036 -1126 34231 4923 -63679
7362 -63679 -65754 -16644 58329 14491 -30374 -29266 -60182 -119161 -72810 28601 40854 19034
7350 19034 -46923 -33212 -1779 13060 -33902 -1361 -21657 -16800 36212 50338 110232 127583
7338 127583 130639 118268 73977 89084 47854 -1755 20749 19278 8549 -29723 -20543 47115
7326 47115 56157 4477 2889 41844 72278 34626 -27382 -44127 -43307 -31889 -55036 -39994 17343
7313 17343 42311 9013 -42070 -15202 8214 48309 53029 1047 -19334 -26809 20499 29985
7301 29985 -7884 17718 40712 51168 97446 105369 20241 12657 38059 53219 23128 551
7289 551 17292 27676 91025 178593 188538 165520 107200 74364 783 -77289 -54411 -13289
7277 -13289 44041 40246 28165 711 -2695 -50639 -16933 -52994 -58893 -81508 -68881 -24352
7265 -24352 -51976 -49124 14548 10725 -4927 -18995 -5745 12350 23744 14483 11056 -50190 -130732
7252 -130732 -127469 -103327 -106243 -92908 -57566 18024 48365 -17125 -84456 -106998 -110177 -51147
7240 -51147 -11118 -20599 -17628 -20424 -8436 -7645 23106 48415 24311 49383 64557 43861 1148
7227 1148 -19202 23064 4651 -1273 -616 32127 50978 17251 -48372 -47879 -29818 6585 19431
7214 19431 40602 30568 4014 57538 74857 -5032 -39182 -9003 16548 -6560 -22313 8316
7202 8316 11442 -33890 -33437 -1200 12762 -12927 -41954 -13214 50925 42444 34018 53035 29792
7189 29792 39055 62194 28193 -26187 -35131 -68324 -78097 -85566 -80934 -78434 -99048 -65317 -3304
7176 -3304 -2923 -34916 -41213 -58579 -79939 -38221 22256 17045 -6994 -27139 -52125 -3605 24535
7163 24535 4995 -24679 -82387 -78534 -69831 -53183 -112397 -113954 -68193 -76636 -38106 -4949 -48769
7150 -48769 -37680 -31117 -29397 -36708 1095 29911 25705 -16993 -34168 -64024 -90286 -75617 -67965
7137 -67965 -91407 -70006 -23712 26046 31610 28037 36723 59525 99129 89344 71565 68967 68412
7124 68412 104573 50523 32776 47413 9130 -18344 -2777 34739 55863 41514 18671 13455
7112 13455 -6867 -37109 -47604 -75074 -48026 -68910 -67796 -39958 47497 33114 -12690 12261
7100 12261 40968 1109 18443 -4770 4370 -9899 -788 2001 4259 17662 15373 38067 -15740
7087 -15740 -55869 -46352 -22887 562 16206 56239 58902 -18707 -39731 -79630 -80302 -66857 -58890
7074 -58890 -5241 -29579 -45283 -29931 -39071 9093 27198 -18729 -37689 -28546 -71665 -88896
7062 -88896 -14263 -28692 -82255 -69420 14994 25498 17451 28569 16596 -6525 23519 -33418
7050 -33418 -32564 3086 22037 -6521 989 -39335 -71182 -49193 -12466 -21261 -19325 -27425 -32236
7037 -32236 -4954 2574 -26991 -29674 -58679 -96481 -80665 -73238 -108637 -128772 -51432 5216
7025 5216 24007 8484 11209 6016 9694 15134 16866 64619 62764 29617 47214 79699 85693
7012 85693 118677 109714 74079 6966 -46757 -52187 -44165 -28723 -7620 20197 -27920 -21974 -23165
6999 -23165 -13975 -5013 -65712 -119508 -158293 -142596 -110858 -107510 -21780 6187 -6156 -13190 34423
6986 34423 75411 129568 46498 39797 30000 -21042 -60842 -86147 -88379 -108364 -94723 -71917
6974 -71917 -25627 -31326 -20886 -10114 -45 -9448 -57098 -24001 -30738 -46625 -15536 23672
6962 23672 37131 -24173 -39751 17599 55161 23093 2960 22470 65392 88726 61163 47028
6950 47028 29248 -10331 -38263 13160 43743 20055 -3352 -16096 58595 57439 10244 -5825
6938 -5825 -45295 -76459 -49780 209 28146 36448 8866 -5970 26652 21623 -15180 -24517 -63250
6925 -63250 -92026 -85815 -117040 -187861 -149557 -112734 -96105 -12387 61140 54003 1141 20375
6913 20375 35885 -14170 -46350 -107585 -101151 -101861 -86890 -90234 -38617 -16258 -24862 -52848 -62063
6900 -62063 -38727 -51837 -48653 -34741 -56981 -39252 -39163 -26554 -38759 -3414 -38113 -67128 -135651
6887 -135651 -136559 -108170 -104877 -81169 -67936 -59937 939 37316 -20927 -39431 -28889 -31331 8712
6874 8712 6970 30693 66740 60454 37616 -8137 21064 2851 32742 31886 1772 -8225 -64158
6861 -64158 -94374 -45230 -64852 -69562 -43624 -54129 -85942 -66724 -12861 -9981 -57366 -77497
6849 -77497 -66482 -96499 -68126 -46788 -21291 -73858 -70599 -40422 7223 35119 4852 -49801
6837 -49801 -31898 -19683 21431 49282 36335 61946 72348 46029 -9267 -56032 -20136 10360
6825 10360 21324 -30145 -89728 -133832 -114535 -57865 -70052 -28253 -56791 -35266 2887 7615
6813 7615 13186 51737 35995 30687 23964 -32195 -37593 5388 43172 7099 -16060 -8332 -38767
6800 -38767 -43874 26255 19814 12554 4546 -24547 -35459 -33059 -25531 8616 83496 41352 13487
6787 13487 -20916 6511 12835 -4993 15123 17677 52535 56845 46399 50743 13771 5635 14163
6774 14163 52637 77983 46432 34113 17164 42163 47031 11361 -4214 -15916 -21251 28672
6762 28672 9758 -8424 5958 -1178 44904 75844 69831 26743 21948 16454 27647 -55103 -36522
6749 -36522 46113 93655 87501 43097 26717 -45047 -33069 -6868 -18139 12858 42690 33274
6737 33274 27925 22523 -15223 -49311 22600 84183 84478 70358 17689 22408 88529 111812 77383
6724 77383 26566 -28168 3273 -4636 -39174 -27156 -37405 -115101 -82158 -67065 -99783 -72796
6712 -72796 -26855 2652 34071 39729 -1437 -26553 -23981 2998 6899 -27073 -38081 -10621
6700 -10621 9510 32500 47512 35222 -17524 -1668 -16083 -76240 -103128 -45954 -19505 -32420
6688 -32420 -73050 -61636 -53384 -85604 -112200 -108928 -36046 11958 19719 -13784 -29520 -44249
6676 -44249 -38075 55718 62527 31838 36971 14453 -51400 -89833 -86473 -85619 -42187 34718 25610
6663 25610 21564 20457 -3983 -86296 -70680 -40323 -31200 -17769 -38810 -15133 20226 24010 -13054
6650 -13054 -4926 6153 -20117 -65650 -53409 -55014 -92240 -85644 -110546 -125002 -61759 -61198 -79139
6637 -79139 8032 11803 -47534 15007 -24296 -142505 -125125 -86796 -46101 -20734 -71547 -101900
6625 -101900 -94239 -69404 -2036 -12574 -28716 -26903 838 30238 32328 -7371 -23661 -13444
6613 -13444 -33181 -77952 -89301 -35326 9726 12280 -2588 8483 1875 -41535 -111408 -156944
6601 -156944 -183192 -122776 -66605 -69180 -1772 12580 -50038 -123588 -95042 -37578 49454 33614
6589 33614 8540 18154 -46487 -111315 -91882 -107426 -121163 -108582 -101045 -62666 -39614 -40594 -15886
6576 -15886 104556 132487 61679 13991 10773 -27839 -10153 40535 57267 55043 36685 45208
6564 45208 4267 -10835 -27710 1121 -24284 -45009 -27725 -97245 -107180 -36076 -18256 -30674
6552 -30674 -25674 -55772 -91420 -100347 -35668 -19289 -946 29016 -19548 -70219 -58732 -28610
6540 -28610 -12893 -23146 -3093 -22765 -10939 43694 34421 -3521 1682 82495 99540 57868
6528 57868 -6229 -28045 -21417 -7826 -15637 -30239 -63750 -50427 -21886 -27645 -52245 -41556
6516 -41556 -31071 -27661 -52697 -89432 -83911 -77413 -83635 -54113 -34206 -11804 26521 -12547 -31382
6503 -31382 -50544 -46118 -23617 42516 -1356 -37695 -79096 -83247 -67391 -49502 -9903 4042
6491 4042 -3675 15784 7062 -21690 -23741 -12126 -10100 -53758 -38731 3789 37227 64083 47992
6478 47992 6663 -21980 -28394 -10506 33075 51091 55445 52036 17090 27261 26607 16107 -41941
6465 -41941 -50297 -24816 9273 49010 79026 29799 39698 37585 31769 -23490 -83750 -86190 -35414
6452 -35414 -19146 -35363 -17873 -18528 -6093 45142 68463 12274 -37212 -26270 -14353 -727
6440 -727 -35593 -51877 -54735 -30428 22892 42845 -2458 -18341 -29585 -60259 -43117 -38858 -11344
6427 -11344 -24470 -41335 -11490 86193 40930 -9417 -25418 -58689 -83233 -99655 -108457 -103866
6415 -103866 -48037 -21547 -29232 -51342 -16632 47930 55072 5258 -48412 -36254 -32646 -21929
6403 -21929 7518 -45448 -50892 -70839 -89129 -119955 -127203 -113145 -107191 -80163 -82048 -41861 -29129
6390 -29129 -56081 -63757 -54977 -42264 -29086 -77282 -48530 -24157 -5486 33116 10182 32730
6378 32730 17438 -32067 -52200 17462 90331 60440 1310 62070 97793 48807 11203 15282
6366 15282 12880 21155 74739 49692 4056 -27759 -8695 -21216 1503 -12482 5322 -46905
6354 -46905 -83168 -19257 -10864 -54555 -51148 -39672 -8451 -40590 -47771 -61428 -51201 11030
6342 11030 34235 61175 58288 22500 -16240 -8460 -40040 -46666 -54111 -50014 -70462 -120671 -122369
6329 -122369 -115766 -81606 -82571 -41401 -40567 -77193 -71546 -16305 7894 -27962 -43701 -54107 -54542
6316 -54542 -46350 -12756 -35312 -52154 -11716 -25550 -73577 -75999 -76050 -88572 -49003 -30211 7497
6303 7497 14403 -31788 -56537 -73732 -67398 -28827 -18459 4738 -11445 21934 22602 -21272 -6907
6290 -6907 -20616 -17675 -17780 -14050 -23315 14470 28773 -19673 -18567 -8525 -50461 -124520 -89759
6277 -89759 -13987 33869 58613 74577 45563 5925 3666 -41055 -44175 7720 47227 35035
6265 35035 38624 69475 30308 -3070 4345 39682 -3497 -22862 -10723 -756 -8424 -62115 -77877
6252 -77877 -49914 -36398 -49890 -68077 -43618 -23538 -45027 -66470 -70308 -90779 -86749 -36544
6240 -36544 -40701 -18627 -19936 -73837 -73369 14837 77085 28649 -13020 -35038 -40157 -58630 -86595
6227 -86595 -89483 -90647 -125727 -94026 -70342 -35936 -52308 -114278 -91028 -57452 -9710 -11328
6215 -11328 -72332 -73803 -14080 4493 19513 9093 36588 20394 -22342 204 22604 -17724
6203 -17724 -39877 -79818 -61037 -35822 -37550 -5323 37618 24100 -6076 11423 -25705 -92737
6191 -92737 -64353 -36445 -14944 -14433 14212 10137 47846 108631 58764 8117 -29411 -3104
6179 -3104 15156 15562 48781 16147 -22429 -52492 -82369 -62784 -55588 -4362 35524 84178 77949
6166 77949 31660 -58231 -97808 -87930 -64493 -86723 -78236 -66127 -42366 -38544 -19289 24447
6154 24447 31705 53561 85438 60286 8180 -31717 -62392 -61871 -50171 -50643 -21465 -30666 11040
6141 11040 33493 44340 39805 9760 22307 -17257 -21904 -37722 -61155 -71482 -85607 -118067
6129 -118067 -104785 -47768 -19289 28722 -11214 907 -5887 3077 27578 8960 -15579 -3949
6117 -3949 6999 18610 15966 7351 -41212 -66192 -58278 12394 42415 36530 -1789 8485 60704
6104 60704 77385 87739 25534 -48622 -76884 -83855 -90553 -81179 -78481 -21569 40227 29087 47938
6091 47938 41051 -24511 -64275 -33052 3879 25875 70700 76518 63307 65899 16978 20490 14831
6078 14831 16392 -20495 -34503 -4643 -16846 -34471 -34404 -61312 -54723 -37121 -55191 -81224 -53533
6065 -53533 -15646 2358 21046 -38174 -89667 -98286 -42360 -3646 -20102 -33785 -20440 -56884
6053 -56884 -43111 -3949 25109 39581 72386 87914 57248 95004 99101 9857 -42239 -42481
6041 -42481 -60970 -59308 -86649 -61779 -31019 -5050 -969 -81380 -112843 -105138 -134562 -113657
6029 -113657 -111442 -67930 -31168 14643 35888 9690 -15958 -18026 -15718 2387 12997 -875
6017 -875 -11337 51240 58887 6307 -51385 -21580 -11288 -31734 4173 27968 -37937 -87116
6005 -87116 -127561 -99513 -54054 -48758 -34511 -24171 -49417 -28352 -25545 -80279 -129424 -82551
5993 -82551 -24635 -22438 -14502 20295 32367 -19627 -23416 -31960 -38394 -12570 -24266 -53986 -60079
5980 -60079 -21095 -19454 -51648 -100706 -107606 -45801 -16929 -14889 4867 46752 56847 38078
5968 38078 -26877 -72432 -99003 -99516 -56885 -24168 -8833 40678 77735 83679 69302 16858
5956 16858 -27762 -72325 -80721 -82703 -77416 5515 9826 -45396 -16448 22510 -12441 -56523 -65727
5943 -65727 -56645 27909 31104 39125 38618 31534 15576 3102 -42569 -98759 -75654 -29299 -37083
5930 -37083 -50375 -71593 -82524 -46657 1984 2780 -27228 -21380 -12523 20464 16245 4444 24282
5917 24282 59277 50943 13503 -23092 -38301 -39041 10195 41783 8804 -2848 -22249 -47776
5905 -47776 -52290 -89432 -119129 -103533 -110408 -116542 -78134 -32047 6780 41130 28368 6742
5893 6742 -2961 -20547 -40589 -50182 -29117 -7006 11298 16773 -7887 -6986 -31922 -38324 -60995
5880 -60995 -74735 -77568 -93551 -65695 -74848 -78726 -62290 -57155 -100395 -114129 -62764 16959 18885
5867 18885 43483 18414 -29613 -43878 -11891 29226 61050 46577 36688 35664 -20 -31919
5855 -31919 -4545 -39760 -35597 32581 31528 88035 109276 47431 -7021 12854 -5960 17115
5843 17115 63714 73007 15808 -23923 -46838 -44766 -46492 -37407 -19773 19829 38566 93127 101861
5830 101861 71886 60805 87041 55742 79396 90640 107561 44366 29346 90137 47882 -29711
5818 -29711 -54987 -62502 -60631 -97809 -110107 -136548 -111015 -58388 -46644 -77034 -99019 -97111
5806 -97111 7089 52251 15140 4224 -2456 20875 -35949 -19005 -30051 -22575 -39415 -17250
5794 -17250 27392 39012 -5386 -27718 -27416 -27041 -65299 -106371 -39334 -31339 -64245 -23019 6952
5781 6952 7246 -3223 -31623 -30444 -17133 -36733 -44515 -40620 -58631 -75302 -80061 -87652 -23841
5768 -23841 -1714 -56515 -102834 -130715 -44135 44391 69609 32466 41972 43654 55834 101901
5756 101901 85414 -2761 -33795 -3543 -38382 -45977 -11148 404 -4079 -28441 -49596 -37482
5744 -37482 -10618 -1968 -58101 -537 101550 97193 89964 137397 122616 46594 43144 80809
5732 80809 70598 16661 17849 10399 -12510 20347 23703 1977 38024 61192 51251 64141 44491
5719 44491 4410 38554 60179 -18972 -69029 -93080 -98876 -29363 8034 -20549 -42871 23127
5707 23127 43305 -9568 22255 11511 -59083 -90187 -93110 -76219 -70033 -22763 -12204 -22676
5695 -22676 36496 -9039 -32937 -63318 -102251 -84267 -29975 16531 5897 -74736 -56178 2445
5683 2445 -34504 -30763 35832 17951 21119 19736 4163 58646 32064 18849 -25040 -32468 -23483
5670 -23483 -3844 -23626 -3258 -626 42492 20045 -21668 -35836 -67940 -53983 -27180 -43219
5658 -43219 -18193 -40333 -63704 -7182 -1870 -7184 3023 40042 57781 47046 38960 2645
5646 2645 -23699 -65988 -86553 -104399 -90925 -93571 -13757 -40548 -31486 -3926 -37871 -54727
5634 -54727 -71677 -99991 -72239 -33804 -56264 -45008 -91181 -141413 -112487 -110378 -97779 -67692
5622 -67692 -32489 -3346 -6912 -4483 -2299 49683 60944 37870 27370 51735 93538 81369
5610 81369 39604 5193 28460 91368 64198 -12919 -44708 -107570 -75186 -27654 2706 6927
5598 6927 -5350 -17555 -27998 -50313 -47422 -51980 -79827 -73448 -61987 -32142 -29627 -34937 13732
5585 13732 30438 2751 16861 18842 4961 -13545 -66816 -89875 -31426 -57849 -69841 -59896
5573 -59896 -100016 -131248 -146540 -140096 -109182 -73234 -60447 -56178 -73416 -78681 -64204 -33059
5561 -33059 -27387 -10079 -46635 -78410 -62332 -85328 -81780 -47505 -17664 25957 5396 -22853
5549 -22853 -30589 -87233 -90483 -39638 -83927 -88637 -88911 -79717 -48793 -24119 -5068 -50089 -132084
5536 -132084 -126768 -61485 -100412 -101692 -75627 -32009 -79872 -88093 -43179 -24851 -45014 -58088
5524 -58088 -65635 -3993 41656 60861 19389 -18747 -38526 4999 5369 -3752 -18941 -27537 -14881
5511 -14881 -18827 -41625 -64474 -42355 -883 23578 20580 5278 11418 14319 21761 -11520 -62882
5498 -62882 -55666 -69529 -53708 -9396 19093 64285 62304 37170 12499 -26898 -29211 -89434
5486 -89434 -47238 -29148 12022 -2913 -5514 -148 -35121 -44710 -160 1355 36436 58505 5464
5473 5464 -45282 -76008 -32527 14822 19925 -27221 -86977 -66967 -7405 -54523 -40205 -24258
5461 -24258 -50132 -51066 -47722 -25042 -1193 3058 10330 -15277 -1783 -15135 -100096 -48296 7847
5448 7847 7374 3954 8227 -51160 -87303 -39524 -19249 -36605 -11719 29083 80401 80377 51340
5435 51340 13978 6056 1894 12786 73706 46299 25097 -2021 -36013 -485 -23380 -28405
5423 -28405 18315 -24607 -29087 -43020 -56963 -66632 -48774 -38922 -34661 -92156 -78692 -59715 -99012
5410 -99012 -98500 -107663 -106239 -20044 -36376 -37586 -2700 -22617 -59147 -112033 -97272 -44985 -24
5397 -24 29944 16553 -37606 -24649 -59476 -83634 -87924 -72618 -53907 -33095 632 -19325 -30175
5384 -30175 8190 -12058 -2579 29990 27652 16051 29810 16631 -43278 -80293 -60684 -53908
5372 -53908 -58686 -22070 -40291 -56847 -62315 -31548 -35477 -51987 -76587 -48360 5194 22775
5360 22775 -19444 -37717 -76256 -147297 -159946 -141547 -91904 -46844 -82689 -140451 -100485 -86875
5348 -86875 -84282 -92810 -88540 -106579 -57735 -8295 4950 13014 379 -7413 -45900 -4083 60403
5335 60403 -809 -26212 -22788 -29026 -18238 -17548 -51422 -81436 -56254 -9475 1155 -2314 -38307
5322 -38307 -50433 -2666 -9299 -859 7553 20383 -17364 -6758 -4216 -54427 -54555 -3668 40741
5309 40741 15036 11394 21237 95309 102481 38250 10868 -5393 20013 9002 -79202 -92659
5297 -92659 -94166 -74062 -17220 -35152 -78000 -61527 -49111 -70617 -26939 3995 5006 13703
5285 13703 4074 -63861 -106321 -66265 15751 21086 49817 26798 -10988 -41488 -55094 -33807
5273 -33807 -6836 17336 32787 34464 61093 24747 -41576 -62169 -97024 -91315 -97679 -106698 -103746
5260 -103746 -83927 -133015 -135873 -54600 -60301 -45458 31739 28180 -48357 -41135 -12216 -30318
5248 -30318 -55287 -91721 -25309 22884 2147 -2938 -30462 -63586 -56595 -28113 -16866 -50119
5236 -50119 -81746 -48968 -16036 -41393 -36271 -42450 -48352 -42941 -78303 -48361 -9679 -23600 -7133
5223 -7133 33373 41365 5698 -44238 -38009 -26728 -1481 25515 25370 -7014 -63683 -57917 -1467
5210 -1467 -2763 38405 28968 51675 64452 52461 51451 18350 -780 -8639 -17817 -1217 16278
5197 16278 63258 63948 15433 -6430 -21450 -104120 -165527 -148615 -117276 -79997 -73542 -101004
5185 -101004 -72684 -74373 -46582 -27443 -15703 14839 8309 -20850 34485 29534 20711 31036
5173 31036 31792 28311 47181 77477 37731 -62920 -133452 -111886 -98037 -19897 65511 70528
5161 70528 43346 15100 43958 35979 -43155 -97009 -71617 -81414 -77502 -23784 66778 55308
5149 55308 30979 -40981 -63579 -41143 -43935 -19251 -39727 -15291 -21007 -39996 -50707 -44398
5137 -44398 -56875 -126506 -143215 -97852 -53117 -24513 28205 22202 4289 -18716 -39498 -47911
5125 -47911 -5523 1067 10108 41002 8191 -36598 -53941 -58563 -38359 43239 43627 68443 84859
5112 84859 5956 -23869 -53493 -79164 -85335 -51907 -39604 -57193 -27426 -57795 -51221 -37896
5100 -37896 -8553 -3839 -60700 -97552 -101954 -80039 -23304 -15162 26061 40492 48096 34343 21999
5087 21999 2190 -29167 53155 19947 -10858 -33843 -37657 -55253 -52529 -65172 -57485 -44762
5075 -44762 -79986 -65531 -18864 28625 61849 58235 80994 28290 -40575 -72287 -19584 18285
5063 18285 47919 45347 55736 36837 17546 4410 -43325 -31474 31143 52431 36733 5065
5051 5065 -15087 38000 66829 28828 -12027 -46140 -21413 38666 41094 2462 -29490 -76033
5039 -76033 -105489 -36015 1357 -31335 -10376 5005 -22888 -53781 -24763 -18330 -15006 -42634
5027 -42634 -43197 -28049 -13235 -4481 -19111 -25002 -52991 733 13698 -779 -32890 -46441 -90935
5014 -90935 -46122 43823 28966 16959 -36839 -50038 -7190 -3033 -28760 -36473 13838 41905
5002 41905 80043 78159 25846 33465 62080 17551 -17987 -58789 -21106 -13584 -21985 -129814
4990 -129814 -138718 -102893 -61263 -65643 -103156 -79108 -78426 -61271 -13050 1650 -24108 -24550 22623
4977 22623 30579 24509 30302 11852 -9029 -47748 -68091 20291 39887 44023 54233 89552 62426
4964 62426 5608 3503 62698 29144 -5865 32451 -12720 6351 33404 5964 -47031 -16498
4952 -16498 19170 -45311 -33607 6167 -14580 -43880 -45947 -8773 26210 -1593 -46254 -82516
4940 -82516 -113533 -54274 -50219 -64418 -69303 -50191 -112447 -126988 -123206 -82602 -25771 17877
4928 17877 50686 59455 35753 44120 73868 65725 76124 57707 31132 -20810 -19614 -9244 -49085
4915 -49085 -17938 20694 13927 19113 25079 16651 -3968 -5557 -49743 -119083 -122836 -106852 -103507
4902 -103507 -83817 -33299 12432 34463 8950 -11530 -31287 -7348 14107 -51763 -69488 -19803
4890 -19803 33207 21739 59873 63140 8691 378 23149 46380 33964 8595 -6503 -33541
4878 -33541 -222 -40327 -76571 -61512 -80542 -85675 -67995 -11647 320 -52610 -81766 -71653
4866 -71653 -62817 -58976 -107635 -164011 -95918 -42158 -51193 -50115 -48255 -52006 -38381 -79330 -59235
4853 -59235 -47467 -109538 -107567 -40427 35550 39513 11467 -13362 32026 20201 12837 35273
4841 35273 25288 7099 -33984 -52111 -99471 -98588 -58000 9754 72494 83794 45163 -13282
4829 -13282 -57768 -78393 -59190 17853 59709 11434 -25093 -6552 31066 5243 4375 1149
4817 1149 -7328 40818 153328 150027 109114 58591 5821 -33337 -60364 -57290 -15035 -44544
4805 -44544 -60404 -73617 -11826 16699 -16219 -99632 -80388 -77339 -39346 12427 -10086 -19788
4793 -19788 -38661 -65634 -69713 -72515 -42679 -18770 -17016 3588 -12042 8159 27768 15755
4781 15755 -12313 -23083 -14727 3220 -38059 -35237 10279 10986 6508 -55856 -130703 -148715 -90445
4768 -90445 -27165 -59243 -58508 -31195 -13497 -27694 14926 22903 468 -18973 -6532 -61184
4756 -61184 -94490 -30900 5562 13464 65333 64190 34203 18013 16858 13456 10915 35039 25026
4743 25026 -24040 34279 62135 40742 29321 64237 49403 -14395 -34790 -35823 -4687 23105
4731 23105 14128 -10079 -9831 7076 24767 42783 42117 4209 -37208 -9549 24635 5087 -39477
4718 -39477 -44407 -41627 -13490 20290 77818 55375 34239 -7397 -18156 -61494 -96317 -81848
4706 -81848 -4380 27462 49266 6349 -15126 -31317 -66287 -128336 -108114 -33384 5332 -33354
4694 -33354 28551 41184 19859 6219 25968 77867 79369 24253 -8598 -27505 -57555 -32360
4682 -32360 -10946 -54169 -43603 -18601 -981 -21448 -44455 -70625 -47186 -21313 -12210 -3070
4670 -3070 -26774 10698 40539 31412 2990 -13880 22613 9275 -29853 -22404 44505 13186
4658 13186 -83536 -55554 11320 70873 100804 89401 39448 -7127 -34686 -4985 22568 78599
4646 78599 81392 69738 -16318 -56676 -93136 -77026 -20672 5992 33861 31041 10517 -10143
4634 -10143 7650 -790 5446 9407 -39013 -97475 -54278 -29335 -7143 28084 -28114 -39701
4622 -39701 19068 9290 20898 -2098 20446 57782 27764 47183 33132 -30512 -15421 33105
4610 33105 2088 -68046 -44861 -68401 -117539 -28734 -29934 -70264 -78152 -56767 -40063 -39274 -67570
4597 -67570 -16665 11080 18809 -37424 -56018 -56999 -61502 -24317 -2755 -29328 -42798 -52255 -21857
4584 -21857 -46868 -28454 -25918 -54001 -80600 -87977 -13491 10696 -13651 -4593 -6493 40478 49263
4571 49263 63461 27714 -9897 -17699 -17593 6242 52093 87179 38081 -35385 12336 17180 -25309
4558 -25309 -10718 34105 52116 71909 57235 14553 25784 45015 12824 10667 45918 61047
4546 61047 17557 -9047 5889 -37416 -55159 -60457 -100014 -90144 -45958 -10450 -42160 -49516
4534 -49516 -29811 -22413 -1070 2830 -16303 5800 46151 48717 16093 12167 -28181 -4420 21032
4521 21032 21214 299 -13185 -26566 -27734 -22339 32129 1993 -29952 -24199 -24018 -51719 -41785
4508 -41785 -39515 -51910 -47556 -27374 -29916 -18141 24095 -16147 -12551 -40419 -39268 -9334 13398
4495 13398 -32234 -23173 -48596 -71121 -47554 -48131 -76010 -95756 -77094 -83641 -22560 -4925 -53426
4482 -53426 -68954 -60825 -20147 -18655 -48363 -78067 -110327 -138286 -80646 -11897 -21793 -28826 -3855
4469 -3855 20030 51708 37966 39715 5742 -40171 -64557 -73475 -49943 1199 46061 56515
4457 56515 92119 89204 18085 -55558 -46046 17073 18846 -26559 -55170 -124000 -151054 -103719
4445 -103719 -48467 -49660 10647 44506 -40507 -52565 -20605 -9013 -59610 -66867 1017 -32275
4433 -32275 -47039 -28613 17988 31913 45689 17075 66823 100023 96702 99163 38413 -18270
4421 -18270 6744 -2272 -5712 -25695 -38746 -114848 -176918 -177774 -130611 -122213 -107317 -24391 -42601
4408 -42601 -46988 -41330 -31413 -58087 -70765 -36575 -72139 -102099 -54780 -50896 -4484 -41820 -53218
4395 -53218 -76961 -45815 -50581 -24113 24151 75768 75591 44703 80762 73264 15633 15966 25061
4382 25061 -32747 -29745 -21846 -41767 -21542 -69148 -66530 -92209 -73672 -66777 -77044 -69766 -49025
4369 -49025 -49573 -101448 -84586 7708 74363 55973 -19076 -77980 -81658 -47349 -63782 -88344
4357 -88344 -77562 -87551 -63275 -26560 -24855 -53330 4347 24109 -22273 -27201 -21036 -19830 15303
4344 15303 -10058 -62974 -54453 -18073 13415 63577 20937 5988 11582 -57850 -77237 -108009
4332 -108009 -52880 82571 118878 75291 46710 22862 31189 21466 34259 30326 49145 22128
4320 22128 25262 45091 3007 -44800 -61413 -41415 -8381 9010 637 -21464 -83176 -137433
4308 -137433 -123607 -65666 -46730 -59461 -44193 -28748 17182 16669 -38074 -97112 -107131 -119127
4296 -119127 -81100 -35994 -41363 12524 55333 43511 27342 23305 15768 47821 21831 19459
4284 19459 67797 49284 71935 49934 10876 18444 37339 59166 75531 72627 32600 14208
4272 14208 -2257 2332 -19201 2273 6174 -36555 -68402 -69807 -84762 -63988 -60645 -83157 -57279
4259 -57279 -70691 -89437 -121285 -76283 -7818 42368 -12494 -61659 -28433 15159 3200 -19267
4247 -19267 -570 -30628 -59375 -78608 -56993 -72435 -58237 613 26739 37323 -35953 -95355
4235 -95355 -64560 -43465 -71022 -60073 -53327 -28527 -44774 -51195 -45249 -17006 -30081 -56615
4223 -56615 -42824 -36652 -63637 -75572 -22973 10318 -29608 -24746 -25111 -30968 15565 16758 32938
4210 32938 83823 81674 54691 67681 58775 86623 72144 61843 48816 54679 77940 103161
4198 103161 45173 41867 40202 29482 1106 -11728 -13123 10081 -31950 -60797 -74335 -56120
4186 -56120 -2457 71276 64696 27367 10797 68062 104737 82176 26464 18473 18209 -5564 13743
4173 13743 5384 7351 970 -24637 -14541 -55285 -72037 -38032 -29202 -48870 -34721 -70818 -51731
4160 -51731 -40757 -28014 9198 57739 20572 -42065 -109860 -36813 -6172 9359 -18717 -1690
4148 -1690 -4396 -24940 -56843 -26451 14507 16615 -42103 -85079 -98323 -75484 -41579 4358
4136 4358 36774 42514 33682 48095 104587 144544 73484 -7743 -37764 -5866 34232 56214
4124 56214 36171 269 -731 34301 69892 38677 3095 -18973 -22620 -7882 -23272 -39966
4112 -39966 -108243 -109339 -60761 -75146 -51864 6753 5006 10110 4206 15897 52373 62207 69953
4099 69953 32442 -47600 -55349 -3273 -2400 -34830 9872 32355 21656 22219 38599 84485 81625
4086 81625 57178 38983 19007 14220 22794 17022 -22061 -37134 -62177 -73616 -69266 -93800 -103188
4073 -103188 -35876 -19105 -11317 2266 4158 -6914 16491 -4443 13203 56106 36030 2686
4061 2686 -43950 -22612 21686 -19629 -40751 -32989 -9694 25619 16081 79909 86897 38211 3646
4048 3646 -1624 30073 16213 -38157 -60657 -57101 -29146 -11535 28012 26816 24820 14281 10754
4035 10754 6657 -17930 -51562 -62968 -67929 -48854 -14664 -4708 -21912 -65798 -70114 -54965 -17160
4022 -17160 -26397 -56765 -65080 -70525 -101586 -112456 -75560 -63486 -71493 -102306 -73596 -34390 22648
4009 22648 85440 76001 -4426 -16800 8357 80158 56266 36775 20237 23173 8619 9171 -5905
3996 -5905 -12256 -18138 -7783 36159 73245 78477 58241 83410 63426 -3298 -14147 4031 24809
3983 24809 8454 26410 -11255 -21928 10112 48242 60031 49366 63232 42475 -3733 -4416
3971 -4416 -24672 -60856 -58042 -25329 -6171 16578 20779 23540 -17056 -44183 -25487 1228 26486
3958 26486 28514 6119 -12576 -28450 -36654 -12796 -16325 -53953 -71276 -115938 -129822 -126363 -142308
3945 -142308 -103921 -52359 -50723 -70481 -24759 29000 36471 -638 -69695 -70443 -31096 -78374
3933 -78374 -80319 -83234 -66972 -6245 22379 -7297 -26695 -17166 -10821 14660 -21232 -48716 -67530
3920 -67530 -36287 -82310 -48236 19228 17562 18099 60736 42543 3740 39983 -12605 -40020
3908 -40020 -72521 -99885 -64550 -57660 -82560 -37374 -18208 -9708 12422 -27962 -29092 -34508 -47635
3895 -47635 -20201 34739 65757 -4966 -15862 58974 57230 55191 78221 63875 32629 -9529
3883 -9529 -68136 -90080 -56122 -41904 -56636 -108841 -37941 2762 25687 -4698 -9768 -2901
3871 -2901 -58265 -57007 -39394 -74268 -97411 -39554 -7953 -33683 -4731 -28669 -64224 -53667
3859 -53667 -37127 -6926 10855 33673 25055 -898 -38701 -116686 -118534 -81803 -115755 -130002
3847 -130002 -117200 -85867 -55082 -58159 -30539 -19654 -3091 -64292 -102401 -85991 -93119 -557
3835 -557 37866 -553 21518 27642 25658 -12729 -40230 -26713 -17447 20350 65117 30929 -11315
3822 -11315 -11873 -9082 -26205 -86829 -132066 -124269 -90434 -56115 -56744 -45890 -47154 -103800 -110122
3809 -110122 -28889 -32201 -76058 -38484 -23365 33987 57494 -804 -15134 -50412 -59401 -14730
3797 -14730 188 -13315 -31917 -34292 -61074 -74428 -49642 -48254 -27933 -28953 -42419 -37585 4734
3784 4734 29238 16613 17932 18611 -8491 -51658 -45588 -43505 -8403 -6147 -15018 -17608 -37158 -53801
3770 -53801 -17556 -36668 -17723 797 -37387 -24002 -5459 -21747 -81428 -120360 -94162 -158350
3758 -158350 -158209 -122172 -98501 -98054 -121814 -84023 -29377 -48880 -69675 -37604 -14737 4953
3746 4953 15648 6523 27748 11678 5366 7953 -28176 -14756 8022 -21059 -26306 -33306 -73025
3733 -73025 -109049 -136351 -151843 -152683 -90948 -61414 -57037 -38361 -7187 15149 35288 87569
3721 87569 100307 88489 47063 -149 35187 41392 4860 24460 62228 49617 21511 -2560
3709 -2560 -4920 -20177 -36121 -5169 16728 11740 8274 -23441 -59047 -33003 -39062 -5908 30584
3696 30584 56986 55304 51636 31418 34821 37381 15567 43457 40476 -16684 -28124 -36450 -34771
3683 -34771 -52579 -48719 -37927 -41884 -41446 -91205 -29856 -17594 -5214 -34058 -10649 -19285 -22982
3670 -22982 -21464 -39028 -20297 25604 25524 7131 -36962 -9695 57 -1446 -35976 -35037 -29721 -41099
3656 -41099 -57082 -49731 -28773 24938 35211 4307 24874 52157 52034 62504 34343 -14329
3644 -14329 -70107 -78312 -29279 9448 40740 -1379 -36525 -31365 -43609 -84593 -43822 -15505
3632 -15505 -39614 -69249 -28022 -55861 -89976 -103679 -97411 -102866 -100190 -86561 -34691 68837
3620 68837 90825 39225 34943 18089 11865 19244 24725 81232 51312 -65766 -67343 -41228 -37103
3607 -37103 -75568 -74482 -63808 -77965 -17798 -34015 -74336 -48520 979 -5330 19312 74164
3595 74164 75250 39440 25231 -11560 -43710 -75901 -26074 -9376 -12537 -31674 -34091 5065
3583 5065 -28557 -20543 10452 27708 62409 84551 21715 -8987 3139 -6260 -75956 -64884
3571 -64884 -18215 4591 12710 60851 105278 103528 47240 55629 62150 47157 38810 26124 61667
3558 61667 94486 74763 32924 40915 78624 66795 18189 1235 20803 16628 6749 3978 -11870
3545 -11870 -15528 -1860 8336 50616 68681 1119 -50529 -79132 -74784 -67009 -66788 -61519 -49960
3532 -49960 -45816 2614 10691 18952 11934 18466 -4869 8879 29120 17437 -24782 11121 60889
3519 60889 24397 4897 -17271 -62240 -26264 3379 8456 -11319 18698 29015 18313 -60979
3507 -60979 -17934 15207 -22607 -9370 28299 75132 91197 75548 85457 10404 -53557 -38706
3495 -38706 11209 49851 39902 1030 11566 32567 32904 -26293 -35195 5074 29441 46294 34792
3482 34792 -30891 -4866 20503 -2683 26245 31307 84909 93673 44422 9066 -51346 -62528
3470 -62528 -70549 -29358 -8485 20258 12770 1237 -28506 -46871 -36988 -4974 -5205 -42697 -73907
3457 -73907 -23195 54772 126767 121249 63758 33115 13274 10820 -25531 -34 52442 77734
3445 77734 76453 69704 30397 21995 6438 -62435 -90190 -26323 9913 42109 783 -58859
3433 -58859 -53234 -21278 -27864 -34394 -78313 -64451 -45867 -56213 -49275 -61982 -39599 -2300 14511
3420 14511 18805 19991 3712 -23756 -31812 -93129 -93537 -8071 -5823 -28118 8064 34858 -2330
3407 -2330 -22683 -102567 -114936 -69016 -23899 -6815 6253 15871 13639 -4299 16686 22233 -13514
3394 -13514 -66494 -16564 -5732 -18808 -26628 -60731 -57880 -99205 -63732 2856 6145 15916 41670
3381 41670 31904 24277 -33200 -92605 -39440 -7457 74320 139230 102185 101776 51190 33835 41481
3368 41481 23271 37050 103894 84571 45223 32141 -9000 5547 40939 26781 29941 57350
3356 57350 58511 -22617 -65339 -33827 -47160 -26760 -28417 -27307 -10602 -21216 1162 62317
3344 62317 110342 101580 52223 23759 317 -24936 -63237 -115191 -41852 -16231 18427 58712
3332 58712 21216 26196 -6768 -18520 -52230 -1072 45103 60439 -806 -56789 -49904 -68440
3320 -68440 -18529 24327 726 46597 20552 -25388 -60668 -50845 20323 21833 -21146 -46414
3308 -46414 -12412 15921 20232 11244 -4577 14937 9489 18967 29810 6884 -21174 -55719 -58297
3295 -58297 -34796 -25056 -9531 25303 -10958 -38133 -70393 -96368 -56491 -19666 15799 23649
3283 23649 31445 28841 -9490 -7167 -12697 5385 -24547 -14349 -20800 -41338 -34373 2444 55959
3270 55959 29182 -53777 -68824 -62871 -57102 -47785 -12206 32609 31650 -27543 -18789 8968 -4533
3257 -4533 -3533 -28331 34181 60275 34834 18600 3978 -2041 -38825 -121942 -90394 -55101
3245 -55101 11529 30296 18250 -36900 -27396 4073 9329 -23272 -5351 14434 -21707 2187
3233 2187 8146 -1964 13771 31106 31181 12809 -35477 -70058 -80320 -64023 -64106 -42338 32350
3220 32350 64446 65672 -5556 -12193 45153 6028 33914 66790 102708 51117 30899 48427
3208 48427 47998 8549 -73389 -84324 -50565 -46685 -60429 -45669 -54622 -70071 -50126 -13 -30568
3195 -30568 -11086 -12488 1913 2451 35624 40653 20309 36632 21274 14993 -5683 -25214 5159
3182 5159 40533 -23821 -55129 -40965 593 11707 -30302 -76759 -83748 -24957 -79127 -115940
3170 -115940 -81255 -43788 -63433 -36008 -31836 -60202 -31464 220 67509 46503 31002 16063
3158 16063 25546 21070 43352 52070 34662 13527 -18800 8156 66486 65714 53933 49232 36415
3145 36415 100593 87868 65220 78416 43895 7839 59450 59688 25156 -9503 8760 4015
3133 4015 -15611 4287 35490 36916 36417 25505 -14272 -49278 -19123 -22236 -48 43171 -2001
3120 -2001 -7916 5252 28356 9484 7503 -23601 -21222 -24156 18727 52657 2024 10121 19366
3107 19366 28140 40152 31558 56834 96260 71960 52093 100905 99197 15625 443 -3761 -23789
3094 -23789 -32699 -61993 36934 64099 39920 40910 7600 -34387 -26254 32702 83161 26697 10171
3081 10171 -15131 6414 68984 112073 80629 63023 33996 -9232 -32792 -75343 -76813 -94880
3069 -94880 -39260 16457 -58267 -122076 -104368 -57781 -47235 -52111 43122 67169 35146 27127
3057 27127 24869 16546 26534 -3784 -63987 -64198 -34487 11976 5700 3333 13047 33800 27542 15169
3043 15169 -51118 -49770 -76802 -114172 -100431 -91157 -87282 -67736 -40696 573 -8676 7332 14473
3030 14473 42152 5431 21711 30460 -41724 -58042 -40332 -30286 -17560 750 -12978 34279
3018 34279 41481 -3353 -5884 13553 1611 -79765 -84356 -57304 -55391 -32770 -44071 -20203 -38118
3005 -38118 -95539 -138512 -67705 -17096 14645 21722 -2253 -9800 3346 27614 55637 50568
2993 50568 72784 41503 44113 92758 99578 73039 51006 37738 48648 76258 89863 17525
2981 17525 -8059 2286 2854 -3309 15323 -40904 -77582 -101810 -59482 -58738 -56887 10832 42207
2968 42207 29591 8730 -37518 -12321 1506 -31595 -31536 -16543 -35161 -28201 -40313 -28053 -14419
2955 -14419 37274 20771 43247 52410 41735 49811 85431 82424 138123 139104 119138 96031 70495
2942 70495 12469 -55002 -72712 -92117 -74777 -30403 38539 54064 44453 41533 4907 -8788
2930 -8788 30730 44192 -39533 -37730 -23379 -34328 -57767 -43570 7144 45362 5547 50143
2918 50143 81378 19366 -6802 -4714 -4683 14315 26762 -93 1835 56406 48423 25096 -1886
2905 -1886 -26472 -79613 -75831 -51303 -49528 -41494 -16882 6101 19209 -16310 3889 -2291 9207
2892 9207 32900 41638 71271 57562 19907 -16187 12200 19027 64905 78819 33956 24915 7444
2879 7444 4905 28125 10363 10164 -40304 -98804 -70319 -27174 2856 11482 -881 -5936 -27
2866 -27 24467 -31791 -29744 -19487 -64075 -79719 -71811 -45961 -39935 17302 13163 36773 39670
2853 39670 42168 83969 15010 -20095 -26143 -42318 -44416 -40718 -82804 -94571 -62884 -36458 20562
2840 20562 18574 1125 44553 94229 93855 53759 35156 -23064 -24818 -8426 38283 76841 60640
2827 60640 32590 26477 25850 65635 18115 -8334 25415 -40302 -33066 40693 109918 126469 96021
2814 96021 32748 44805 37386 24083 35875 70473 58374 50040 13036 22735 27096 60991 68229
2801 68229 41489 25698 15376 -4919 -59886 -87885 -44204 -16309 -50635 -67255 -18177 20880
2789 20880 40735 -15225 -64748 -12046 -17268 15720 69146 123074 112626 80040 6451 -5457
2777 -5457 -34252 -1815 33766 31422 19718 86408 72942 44148 11186 -5570 5161 41407
2765 41407 22224 -7156 7101 -45450 -93066 -81019 -41077 -19650 -52556 -43060 -8239 49852
2753 49852 14101 -23263 -60246 -70227 -86084 -43578 29622 22536 6229 -23559 -24998 -7311
2741 -7311 9407 15248 -62474 -42836 -32571 -40074 -42922 20419 8579 -12686 -17568 -10292 87922
2728 87922 126732 96258 48901 19135 16705 39547 91052 104866 77591 49763 51237 14797
2716 14797 16072 -10451 -121659 -120985 -46572 -33916 -78079 -104400 -133148 -98778 -47445 1027
2704 1027 -11702 -74303 -75153 -86532 -68800 -49447 -30975 -47779 -50613 -3350 -21507 -15914 -12583
2691 -12583 61597 71167 43710 42158 -2116 -30582 -48393 -31371 6583 17274 17545 10446 -54492
2678 -54492 -85972 -79973 -72031 -106944 -79518 -53445 -63466 -84825 -102170 -98110 -123683 -126209 -94164
2665 -94164 -36549 -21694 -4337 7799 22097 -37024 -30419 -28390 -28063 5749 13912 80928 112115
2652 112115 39227 -11438 -6242 -16280 46057 34391 53013 63959 77483 105976 70199 24030
2640 24030 34707 14631 -18031 95 5723 37081 2478 -1358 -13288 -95066 -74249 -28069
2628 -28069 -47166 -77839 -47168 -22610 -62243 -78453 -56661 -61062 -101175 -96164 -44817 -14322
2616 -14322 27243 35098 -10870 -33242 -28054 -52915 -96300 -88063 -64975 -36866 -19323 -20994 91
2603 91 15308 -4047 40125 47189 47316 47481 49005 -11856 -30990 -1245 -7280 42723 98723 97272
2589 97272 55311 22729 1728 -23516 -67667 -83837 -4963 38989 -3409 -30409 25842 -19376
2577 -19376 -23647 -35569 -47223 -67719 -114716 -109403 -51856 -5389 1885 -39953 -12690 14953
2565 14953 29380 63119 31687 -28651 -13487 -8393 21564 37900 72295 103959 47992 16578
2553 16578 3185 5059 51691 73087 86796 20565 18235 35320 -15224 -45386 -50175 -7269
2541 -7269 -19998 -30122 -20347 -29705 -58167 -40997 -65844 -81057 -47404 -17362 -62734 -55321 -24880
2528 -24880 -1318 -23044 -7737 284 -35509 40210 111358 122872 131316 101433 35619 43587
2516 43587 20607 50291 22562 5560 1337 -2712 23206 21561 10838 20000 11490 28535 67875
2503 67875 45704 32209 47829 26538 2977 3576 -13213 -23271 30146 37172 -7950 32419
2491 32419 44039 12581 -16967 -17898 82522 93551 72759 107436 87169 39250 -41232 -8532
2479 -8532 47281 55469 -25049 -78659 -87532 -62651 -30902 22361 -44215 -16416 1867 -18646
2467 -18646 -80440 -122024 -29770 -8248 -47614 -83593 -89483 -77425 -76306 -68315 -45676 -9190
2455 -9190 -304 14262 46157 80712 78458 85748 53131 43757 23520 43202 31835 -19834 -18729
2442 -18729 -15965 57749 34621 -3076 -37657 712 74411 56958 14076 -19142 14752 55694
2430 55694 64593 94873 89524 49276 8776 -7382 -23961 -274 -512 30858 16229 -18642 -104
2417 -104 -12358 -52067 -29578 -2228 -11640 13679 -31967 -26173 -41390 -19747 -19015 -59651 -81326
2404 -81326 -41332 -34409 -35868 -52142 -10627 26178 -43166 -9100 27914 -12660 -45496 -89303
2392 -89303 -79910 -48586 -21504 15854 2234 -33166 -12550 -465 -49178 -43802 -41722 12857
2380 12857 23067 -3103 -59276 -28210 5863 -31058 -17385 -56026 -95254 -53099 -22601 1574
2368 1574 45354 58427 33496 58568 52766 37619 -8165 -31888 -9488 -16481 -34027 -13201
2356 -13201 20118 13540 3491 -21308 23416 42685 26084 -14309 -28714 21832 -11080 -73735
2344 -73735 -27962 -2153 1850 22808 30688 31796 72123 108544 100912 84687 66427 44315 -8171
2331 -8171 -5326 38130 79842 81032 43808 61141 87003 119571 88556 58448 95835 93235 69199
2318 69199 115922 104423 80733 65719 51248 14068 14562 1324 434 19204 22971 33651 -4559
2305 -4559 -1206 32436 81752 59194 52413 64151 31505 16144 6112 6919 16838 4241 22949
2292 22949 -28116 -51546 -61893 -72764 -28276 -6019 3655 35359 14872 38351 25394 7736
2280 7736 20849 5046 5654 22173 30639 -12110 -41317 -46041 -22498 -26230 -30937 -19796 -68538
2267 -68538 -70140 -24882 22156 61456 81194 41633 37105 79347 143787 123687 85268 9712
2255 9712 6746 29481 57774 59203 60217 11004 -14106 43564 49891 30710 42590 38918 10347
2242 10347 -4186 32814 83010 40747 -15092 -85138 -101705 -55549 -31663 227 32443 -19651
2230 -19651 -19927 -45810 -58227 6673 50051 71593 7615 -81899 -58126 -3452 17707 38831
2218 38831 78207 45285 46749 16274 14576 8630 3316 -18187 -54553 -48089 -27958 -15301 -20700
2205 -20700 -24170 -29773 -4404 2508 23412 36641 -1331 -21812 -29942 47786 40567 -6604 26083
2192 26083 979 -80850 -151737 -164509 -137351 -152769 -120960 -117354 -41488 -4955 31428 79376
2180 79376 98851 124232 113473 64982 38749 57948 59802 134664 168293 95641 66824 25641
2168 25641 -33152 -24063 -76095 -50937 -54479 -26739 -16201 9316 -5663 21787 41787 55509
2156 55509 11737 -35942 -31429 -19282 -35456 -66048 -59903 -32028 -44782 -93099 -104762 -39210
2144 -39210 36962 70041 -5907 -382 34055 28719 -3846 -1646 24732 32408 22236 -27779 4230
2131 4230 42241 5162 -29034 -16033 54682 58515 40839 25776 57494 85610 22557 15074
2119 15074 20283 2948 -9750 -23408 33874 48832 7499 -18629 -36918 -68385 -60787 -9544
2107 -9544 101172 85946 62164 51350 56477 33307 -9400 -66841 -124650 -149557 -94600 -449
2095 -449 5573 -46338 -82469 -13867 52835 41617 78163 66743 -2674 -39986 -28851 -76976
2083 -76976 -38726 -1605 31543 77193 80965 91313 43180 16869 24986 -2082 -14580 -21574
2071 -21574 -7727 -62208 -108990 -67646 -87149 -96951 -79606 -81672 -58327 19437 72956 62508
2059 62508 82692 47869 14233 -23339 -67158 -44551 -10073 25882 35629 31751 22470 62820
2047 62820 57536 38104 60741 82050 86743 84586 72779 50393 69818 69395 87131 115852 90682
2034 90682 41009 14000 26520 32307 -13134 -51081 -45681 6936 -9821 -66905 -61293 -87075
2022 -87075 -88970 -72570 -79396 -104760 -74807 -17805 -1567 -41272 -45998 -8402 44677 90855
2010 90855 54232 38938 74932 9569 -66634 -50548 4574 37397 67288 68345 47294 72665
1998 72665 50986 48648 42863 49706 73804 42835 -46534 -68322 -46322 13345 50496 9161
1986 9161 -17138 -4724 -5732 15879 43058 -10164 -46487 -88609 -108020 -34533 -50192 -39503
1974 -39503 -14236 -10581 -57190 -48921 -2553 -47104 -68861 -72991 -14259 26439 -17422 -60392
1962 -60392 -69192 -11 36262 50105 92420 34752 -1951 -26980 -21103 -69104 -23701 11196
1950 11196 15930 -15210 -10444 -48943 -93001 -81829 -31420 23026 10417 -76754 -77408 -105575 -103322
1937 -103322 -92917 -20531 -27877 -25246 -7436 -56337 -28200 23420 16179 18928 -12874 -32895
1925 -32895 -54155 -94198 -59042 -61066 -30571 -59 22786 38579 37611 79869 81407 77799 53769
1912 53769 37971 37358 73633 68627 69115 40658 33587 19037 18140 32677 41615 55245 20811 -36599
1898 -36599 -12676 6677 15987 54003 116203 78328 43413 51707 59701 109155 115426 53248 -2998
1885 -2998 44119 51495 61277 34590 36504 50399 31358 -14895 13782 61116 67421 64706 27406
1872 27406 -34694 -73626 -27505 15933 14208 21845 -17830 -50034 3724 40177 44625 57900
1860 57900 94652 47842 15952 23348 75742 112407 90592 51734 22069 26061 46253 86723
1848 86723 18474 -14566 3331 32128 60558 42433 11401 -21697 -42357 13665 32056 40625
1836 40625 48338 33804 49113 98542 127239 75952 41761 26300 -19611 -31328 -18520 -5369
1824 -5369 -27088 -31796 -31170 115 31829 64792 39553 -6039 -13699 -10876 -16791 -11133 -28263
1811 -28263 4665 -20732 -10985 4590 12494 -21254 -65397 -50287 -38421 -24010 23383 46271
1799 46271 37752 10150 14673 83105 102932 72310 29375 -13066 -43952 -8842 56563 18445
1787 18445 -31595 -15615 -17867 -13606 -3064 -7476 -918 -16042 -16506 8180 -30959 -4056 25901
1774 25901 4296 -10903 -13021 -51566 -52085 7835 33790 18971 -32990 -49309 35670 63305
1762 63305 88255 69760 10201 -5663 52517 105322 82019 14452 -39734 -38449 -22706 -46073
1750 -46073 871 2193 -10211 8247 10049 11541 9449 86885 105520 76761 110274 103600 96576
1737 96576 105472 129839 79381 32597 -4838 19151 51098 42942 13545 -2526 -8832 -8762 26093
1724 26093 -11019 -49356 -26455 -42623 9405 21401 58895 88007 79155 83664 96990 130284
1712 130284 110506 63868 44245 39105 79692 75882 -10560 -33461 -47449 -33852 -32226 -15851
1700 -15851 2583 -33275 -46103 5148 47818 91732 20235 -1086 57457 71691 61844 75406
1688 75406 50889 32464 -6040 -12190 -27790 -102934 -103741 -129470 -93677 -4873 -10022 78627 92991
1675 92991 46303 -16687 -4517 18342 10075 -16729 -58414 -61368 -20736 22865 65232 74604
1663 74604 33801 17235 -1133 -2270 -31634 -45110 -51702 3836 27294 57595 56224 53445 35475
1650 35475 -3530 -27917 -45084 -33112 1102 -12472 -26356 13266 -2537 16381 -4912 -4365
1638 -4365 79316 88124 41310 4696 -21134 -56455 -76263 -72928 -109071 -134423 -104785 -19372
1626 -19372 -15817 3696 -18882 -7377 41639 63768 77552 68949 36194 43629 43634 40142 33021 7931
1612 7931 -36592 -99102 -86812 -67758 -54728 -23601 42892 81719 53740 18046 24932 64417
1600 64417 70329 100504 108986 113558 107704 124715 86731 14254 -27345 -3485 41778 11601 -10811
1587 -10811 3898 -34 -56738 -13654 1506 41718 78424 122287 62970 38352 46848 106098
1575 106098 69986 12568 10116 78010 100832 106833 89619 71352 66694 66269 63084 47852 37766
1562 37766 50081 110956 164891 152110 92124 80779 41711 22820 53210 79280 66486 88756
1550 88756 107629 80892 63793 18574 21100 21569 9078 13656 -9017 -63579 -31683 17715 19671
1537 19671 -731 14202 40400 48353 25758 27913 35924 4312 -53833 -33832 -62445 -33645
1525 -33645 -25174 25925 111500 109119 63288 30935 -2309 22774 99964 99630 73735 -16691 -19161
1512 -19161 -11335 -9955 -27441 -12461 17228 64192 88078 67048 35429 42683 87247 90632 54278
1499 54278 43209 90443 110567 84099 14998 -18404 11496 8498 7498 34759 37272 -24056
1487 -24056 -10848 -4359 23984 -36018 10427 59096 18323 -12528 -21473 -62183 -32986 -6129
1475 -6129 10114 -2828 -5407 -36660 -73197 -71515 -31464 -4188 65703 75398 42348 -25095 -23005
1462 -23005 1383 15670 11834 -34511 -41852 -444 36600 36421 21165 24289 49145 77003 74711
1449 74711 58983 67393 32790 7146 21349 43476 46235 54728 41631 -37961 -17968 -7823
1437 -7823 6804 -8472 -18977 -15928 12082 -18534 -13693 -18225 -36573 -52681 -104995 -98617 -67747
1424 -67747 -96255 -105522 -58846 -34327 -34653 -12299 28528 88307 114390 64712 45603 63361
1412 63361 3322 -75074 -41700 -40779 -24791 -20918 -33726 16536 -27691 -65647 -8698 97646
1400 97646 104194 89280 91540 51758 55771 72780 75900 31779 63965 80004 60417 60960 92859
1387 92859 78222 56197 73255 45020 8185 -32082 -18130 -8687 14187 8894 19381 -20543
1375 -20543 -4034 3765 -28359 -25637 29687 39194 -2028 -27965 22987 50631 23232 2990
1363 2990 -29797 -20922 12424 88904 130568 92158 93707 122133 74435 192 -67493 -69701 -65955
1350 -65955 -84283 -70566 -82840 -126895 -100507 -68901 -36984 -25493 -61446 -77362 -55078 10648
1338 10648 21529 27007 -22312 -85374 -55910 14507 23133 71025 76575 74757 55598 44934 35376
1325 35376 31823 -33403 -90758 -47365 -4256 -28449 -1593 31022 78557 52712 68987 51327
1313 51327 4270 23334 41505 29221 40550 69212 23117 74716 116276 116505 115522 64675 76611
1300 76611 103097 110949 141662 100089 102702 65614 37947 20110 1773 -27403 25607 26953
1288 26953 5601 48547 62765 40408 58809 19365 21627 12158 -8954 -39210 -9882 4380
1276 4380 -33814 -42252 -82644 -78671 -29105 -23040 -35826 -60304 -32138 -6838 -23115 -21096 -2275
1263 -2275 23833 29878 53413 100847 104235 101540 98120 92276 68660 -6235 -7915 34468 -16987
1250 -16987 -29630 -15942 -26915 -123681 -106032 -26501 10864 -156 40786 66793 78720 30037
1238 30037 -73472 -61070 -51476 -49040 -40131 -44726 13497 33869 58084 49056 32589 3792 28327
1225 28327 36554 9085 3517 1546 2914 -77833 -75916 -24436 -26860 14718 2533 -24929 -25390
1212 -25390 63947 89114 91490 109633 86967 67837 93862 75485 71160 58818 23068 -34459
1200 -34459 13888 24539 13084 29004 -25977 -32876 -5916 -5085 -13539 5286 24768 2133 -3568
1187 -3568 -4178 61399 62984 367 -13667 3334 21139 2577 -37392 -25418 2408 48410 11318
1174 11318 -25602 1864 29878 38518 8529 16298 67612 85125 48952 10711 -9625 -40119
1162 -40119 -70696 -82162 -90856 -94410 -53756 -2272 -3229 -15214 19661 12705 -26054 -7944 40549
1149 40549 74944 71569 64311 94023 52922 46524 2969 -52285 -2652 8645 -36675 4253
1137 4253 69030 77316 77477 56853 -28471 -86673 -149074 -129783 -107257 -87680 -74627 -48849 -33584
1124 -33584 -30587 -34825 16195 18294 -51193 19072 43977 27078 -12735 -14783 16718 41806 44919
1111 44919 59009 48892 33974 22639 15748 25243 89677 86224 53552 1119 -27034 -8049
1099 -8049 -7306 -60853 -36225 -35901 -25443 -1091 19738 -7570 3371 38794 79517 65663 64996
1086 64996 55728 37924 39932 6964 18418 28959 35699 53513 40824 39810 35924 8803 -12683
1073 -12683 -71473 -94950 -65592 -62747 -52662 -76898 -78617 -103972 -145546 -156513 -78263 13665
1061 13665 52437 72988 106811 89883 65016 46497 -37043 -61824 -28502 323 46452 60386
1049 60386 66100 43643 68410 23279 9439 -181 -26202 -60267 -1674 41045 15901 31049
1037 31049 3148 -42858 -80723 -72461 -26894 21557 35804 42858 3810 -69195 -42067 -4272
1025 -4272 18548 41019 58763 39441 53477 46278 68767 98420 51869 -11194 -26238 -23855
1013 -23855 -18237 -35041 -76756 -70383 -37441 -43563 -37318 -26230 26704 17029 -10899 -22844 11800
1000 11800 4980 -12640 31053 51793 44786 18333 -3775 -56610 -79303 16689 70614 26970
988 26970 21030 67942 106739 113398 103377 94042 92990 50813 976 -39693 -3394 13127 76518
975 76518 101832 60480 2217 20793 25606 37139 51344 35617 -23185 -29934 3220 62533
963 62533 69962 27288 42886 17098 -41837 -52207 -93266 -127168 -38931 35506 33878 38103 25164
950 25164 -6476 -52907 -78147 -3762 54803 31927 -1555 22622 -5006 7425 6689 -6100
938 -6100 14641 46557 34381 9117 -35426 -2138 49429 37795 42417 84356 51816 35314
926 35314 32385 49600 13383 13432 -30087 -57820 -79886 -98251 -92578 -105671 -105826 -57477 37011
913 37011 22859 -19380 -2125 23573 8349 -6013 -34512 -33084 -25633 -20155 -11822 -46050 -94024
900 -94024 -19705 71678 71884 92117 74493 62179 96453 90805 140061 164883 107847 74647 84808
887 84808 63282 17466 27114 23767 52939 48518 -4466 -46073 -65100 -20486 47817 69487 62302
874 62302 101601 102315 62720 51404 54298 29725 53576 67746 43832 11834 -29769 -16245 39967
861 39967 49124 10773 -24992 -24329 -11955 12817 13760 -48799 -91387 -72068 -55056 -38395 4215
848 4215 2394 -3925 28642 12110 9053 -5796 -29843 -23393 -417 13115 53142 34809 2161
835 2161 -54661 -49259 -9667 -27123 -19512 30979 76554 25980 -29683 -6316 -11539 -6332 8693
822 8693 3557 -53382 -50040 -48595 -51346 -73559 -100982 -93994 -108207 -27097 -48969 -48138 -30222 -32071
808 -32071 -2981 6662 -32075 -46084 -60253 3654 6341 -20109 -43637 -54738 -41490 -65251
796 -65251 -45598 -26559 -67216 -76735 -81994 -50317 -4533 19066 2313 43369 -27103 -22931 1270
783 1270 -12857 7296 -14126 -41554 -28676 37763 84542 135974 83692 -11609 -20279 -7254
771 -7254 -1310 999 -4080 -2499 28897 4363 34070 20323 -45999 -67948 -19726 30181 15914
758 15914 12827 -5193 -54749 -23662 -17420 -19456 1731 8970 45083 28095 -5741 -49389 -40406
745 -40406 -59072 -44321 8941 13585 -15051 -63598 -67204 -51696 -65956 -67795 -53538 -10978 20189
732 20189 -21783 -44196 -21073 -21511 -26719 -20820 38513 17664 3622 -10701 9116 33071 -4109
719 -4109 -31858 -47362 -28809 43513 16298 -17394 -12576 3394 -22526 -88849 -97978 -100429 -57281
706 -57281 -5781 14006 5258 -14787 -3532 -18614 -54139 -20419 10922 -16433 -39897 -27412
694 -27412 -7734 7222 -11225 43560 60983 59386 33420 10910 13471 4473 -6527 -17750 -9717
681 -9717 -10805 -39959 -70473 -46300 -38145 -89700 -104373 -112261 -118354 -66154 -63294 -72911 -64503 -93486
667 -93486 -97740 -84061 -92785 -112812 -80078 -32307 -57346 -36554 -3222 -26828 -40276 -95893
655 -95893 -84391 -35181 -23094 -38464 -51855 -20231 8872 -15109 763 -8910 -3331 8914
643 8914 16454 6169 12246 7612 -708 34170 73363 70791 97241 131237 111240 21096 -42659
630 -42659 -78419 -96853 -83858 -84544 -17528 -1322 -20145 -28910 -49017 -66799 -95753 -105451 -46442
617 -46442 -1636 -14434 -19673 -65819 -50123 -226 5423 -32405 -61131 -110268 -67479 -86554
605 -86554 -113185 -104024 -105767 -77950 -49672 -60717 -92666 -70731 -66256 -65140 -59757 -29966 -57927
592 -57927 -71918 -105508 -25508 -16529 9698 33589 43753 31347 5097 57021 -6444 2858
580 2858 -14520 -24195 -28807 -14227 22424 24153 8326 -18823 -9903 838 6609 -35472 -28961
567 -28961 -59871 -91322 -85239 -37563 -26590 -36708 -27038 -33975 -18103 -16163 44528 37757 -38476
554 -38476 -57737 -54627 -95908 -59213 -26571 -38845 -44702 -72107 -61987 -55978 -46306 -20229 -63041
541 -63041 -57948 -42887 -32122 -11837 -3751 -13224 8440 -5859 -8264 27443 38941 -35879 -43813
528 -43813 -50102 -69281 -75101 -25050 -42502 -14570 -21552 -48396 -39171 -52393 -37968 18236 35081
515 35081 54441 30102 23686 -11928 -71781 -61379 -58686 -71317 -63636 -64855 -98797 -87618 -45760
502 -45760 -5355 -38935 -21715 15611 3758 20084 36093 11955 -17352 -37970 -45882 -59158
490 -59158 -45596 -15434 -21737 -46854 -60292 -51284 42721 30332 -5979 -22170 29759 70696
478 70696 66727 6869 -26271 -46773 -81510 -107111 -77492 -35951 -17023 -53928 10095 38253
466 38253 16146 22937 -1223 -16701 17959 44288 -4475 -41018 -58304 -35248 -9652 2649
454 2649 -4770 6832 31864 3081 11870 6368 3465 -50870 -84970 -81452 -90291 -72736 -59657
441 -59657 -22068 -1970 -25925 -37229 -25295 15602 7707 4364 -744 8055 -40973 -52739 16711
428 16711 44644 38122 32983 25180 -3024 -44404 -100805 -68456 -84724 -82895 -112619 -68330 -49230
415 -49230 -14283 -29983 -23476 -2722 30327 14551 -26133 -77312 -58528 47111 42155 1599
403 1599 -8626 -19046 -21103 -41245 -17946 31372 26278 66535 135144 91385 -18315 -31924
391 -31924 -37580 -64203 -78150 -74163 -86254 -112143 -92359 -48320 -36584 -23386 -48339 -59148
379 -59148 -89772 -90545 -86001 -55305 7218 6010 -4420 -33785 -10354 -17629 -81718 -95737 -72350
366 -72350 3858 36014 26776 -26915 -43209 -30309 -15272 38201 9546 -40167 -107712 -133817
354 -133817 -108485 -30024 -36992 10728 69139 19445 -49589 -105816 -101169 -36483 548 5572
342 5572 -70996 -134062 -142515 -167248 -135952 -121209 -74560 -85198 -122294 -118503 -83049 -45288 -48057
329 -48057 -12475 7037 26545 3700 2938 -15897 -28869 -16647 540 -32831 -4669 29562
317 29562 28317 5715 35569 25925 25630 -6640 2708 -33669 -54644 -57599 -44426 -42015 -36674 -31184
303 -31184 -19574 16850 -6641 3755 -35632 -93472 -121434 -97750 -63514 -29335 -23565 -21825
291 -21825 9688 -23516 -22829 -28776 -27076 -56638 -104834 -32230 841 26109 17540 8925 2832
278 2832 -37887 -30670 26111 22568 8267 18610 18113 11591 43732 41600 1087 -4872 -40639 -106030
264 -106030 -93081 -68221 -58655 -61184 -61436 -54497 -43783 -21212 -7296 35573 18419 -27562 10927
251 10927 11703 -10875 -4097 9651 -26679 -14148 -32891 -65649 -49999 -9795 19627 16633 42001
238 42001 44660 48385 13217 -36976 -57471 -50572 -76669 -70278 -62416 -53687 -32616 -72113 -50992
225 -50992 -74201 -100192 -95855 -106598 -62353 -47661 -40461 -30409 -1760 -23949 -45772 -34696
213 -34696 -11806 -25599 -404 -17648 -19592 -340 -6678 -35184 -54304 -28584 -20339 -12668 -4695
200 -4695 -2346 -16143 -50521 -91636 -84558 -41990 -7910 12526 4741 -37068 -33942 -66876 -50169
187 -50169 -33287 -80717 -29903 -14468 -55709 -53212 -29255 -18815 -35864 -34219 -38481 -6052 -24123
174 -24123 -50204 -14910 30127 30857 -11271 -44501 -55109 -73491 -60210 -60025 -71644 -57299 -27462
161 -27462 -63539 -63685 -58626 -54795 -59001 -81965 -91334 -82813 -93487 -93218 -91294 -74154 -103365 -70798
147 -70798 -24745 -46410 -34466 -27688 -48911 -53797 -40513 -79569 -92073 -74135 -46767 -37248 -26974
134 -26974 -24412 -45344 -83843 -126511 -120193 -90238 -59465 -67313 -75458 -71457 -72717 -65695 -44536
121 -44536 -8157 -44598 -19032 14883 11005 -3070 2300 11157 -3105 -15507 -4014 4971 24978
108 24978 22648 9310 42708 84745 70867 53316 35233 -9676 -27319 -36468 -8724 24455
96 24455 39020 42738 1121 -824 -19484 -14937 -4501 -3155 3950 11167 7482 3574 17119 1714
82 1714 -61679 -93544 -59671 -31754 -13754 2315 -7633 -67391 -52444 5141 26341 -5847 -21047
69 -21047 -44835 -39865 20549 20568 -10523 2117 8870 -26291 -49073 -33712 -73360 -62926 -48939
56 -48939 -53369 -54757 -59994 -64056 -42449 -16298 18010 -14410 -39833 -61964 -50570 -60596 -46510
43 -46510 -42374 -80905 -70957 -26377 -28922 -45431 -72615 -83807 -78965 -50619 -40701 -56652 -56072 -67347
29 -67347 -83237 -57671 -45932 -46072 -26850 -41711 -64199 -56979 -23174 -22436 -22778 -29320 -25504 -2249
15 -2249 -3897 -42437 -33325 -13760 -40819 -73165 -68635 -46684 -9117 9314 -11905 -29277 -36985
2 -36985 -27762 9899
0 9899
$$ Imaginary data points
##PAGE= N=2
##DATA TABLE= (X++(I..I)), XYDATA
32767 185603 177863 201508 227298 241257 262299 286665 337464 381175 353434 323379 302676 291428
32755 291428 291484 297831 291572 296070 296817 335619 326420 321139 329458 330656 322390 361669 363242 394421
32741 394421 402779 354331 347226 366453 380541 379177 416891 430179 399487 413006 399243 388547
32729 388547 405288 399770 412739 391847 409949 412047 433320 463706 466674 455326 434668 417464
32717 417464 389074 400186 474198 485654 444234 446271 415221 431930 472888 437695 414133 454665
32705 454665 463004 471216 464375 452538 464678 474861 480369 486136 510390 502859 517868 481992 452512
32692 452512 447594 471931 476214 498574 515375 548188 582848 621515 651116 627092 576155 561539
32680 561539 566194 546396 548301 544940 534919 538213 527672 537400 563547 591588 554610 546941 560248
32667 560248 590823 607510 607039 623509 651041 657055 636403 611335 620863 628251 670335 696727
32655 696727 703540 713235 707666 690832 657094 708853 768386 808915 800791 768437 704661 678515
32643 678515 652206 683035 692591 650317 653575 682207 679183 649849 639885 712960 786551 790588
32631 790588 774474 733733 700758 720123 771213 795181 773126 766502 780363 787885 769309 748768
32619 748768 753224 748026 755297 752759 760771 826947 824962 806399 794722 736308 706109 756899 786438
$$ [...]
##END NTUPLES=NMR SPECTRUM
##END=
