##TITLE=Analysis number 312248
Compound Code cc 41414
Book Reference 378/158/1
Project Code adrs
Chemist Name benw
##JCAMPDX= 6.0         $$ Bruker NMR JCAMP-DX V2.0
##DATA TYPE= NMR SPECTRUM
##DATA CLASS= NTUPLES
##ORIGIN= Bruker BioSpin GmbH
##OWNER= NMR
$$ XWIN-NMR		Version 3.5
$$ Fri Jul 29 11:33:10 2005 GMT Daylight Time (UT+1h)  MAYBRIDGE\NMR@NMR_250MHZ
##.OBSERVE FREQUENCY= 250.131544655141
##.OBSERVE NUCLEUS= ^1H
##.ACQUISITION MODE= SIMULTANEOUS (DQD)
##.ACQUISITION SCHEME= undefined
##.AVERAGES= 16
##.DIGITISER RES= 18
##SPECTROMETER/DATA SYSTEM= dpx250
##.PULSE SEQUENCE= zg30
##.SOLVENT NAME= DMSO
##.SHIFT REFERENCE= (INTERNAL, DMSO, 0, 16.522)
##AUDIT TRAIL= $$ (NUMBER, WHEN, WHO, WHERE, WHAT)
$$ ##TITLE= Audit trail, XWIN-NMR		Version 3.5
$$ ##JCAMPDX= 5.01
$$ ##ORIGIN= Bruker BioSpin GmbH
$$ ##OWNER= NMR
$$ C:\u/data/dgb/nmr/ADRS/6860/pdata/1/auditp.txt
$$ ##AUDIT TRAIL=  $$ (NUMBER, WHEN, WHO, WHERE, WHAT)
(   1,<2005-07-29 11:32:53.12 +100>,<MAYBRIDGE\NMR>,<NMR_250MHZ>,
      <created by zg, POWCHK disabled, PULCHK disabled
       configuration hash MD5:
       62 19 C7 07 E1 42 D1 B7 37 6C 3D D0 77 39 F9 E6
       data hash MD5: 64K
       D6 ED 33 C9 2A 68 72 79 11 B9 3B CD 7E 21 80 7A>)
(   2,<2005-07-29 11:33:03.31 +100>,<MAYBRIDGE\NMR>,<NMR_250MHZ>,
      <Start of raw data processing
       ef LB = 0.3 FT_mod = 6 PKNL = 1 SI = 32K 
       data hash MD5: 32K
       39 F0 BA 12 16 BF B1 7A 8D EC C7 C5 B6 8D 16 2C>)
(   3,<2005-07-29 11:33:05.21 +100>,<MAYBRIDGE\NMR>,<NMR_250MHZ>,
      <apk 
       data hash MD5: 32K
       BE 91 82 1A E2 7B 59 D2 A7 EC C3 68 00 55 12 BC>)
(   4,<2005-07-29 11:33:05.95 +100>,<MAYBRIDGE\NMR>,<NMR_250MHZ>,
      <abs ABSG = 5 
       data hash MD5: 32K
       53 BD 45 77 3E 70 76 4D 6E D7 CC 83 65 1C 19 C7>)
$$ ##END=
$$ 
$$ hash MD5
$$ 1A 0C 85 A0 BB 2D 16 25 64 60 89 D4 62 89 1C C4
##$RELAX= 
##$RELAX= 
##$RELAX= 
##$RELAX= 
##$RELAX= 
##$RELAX= 
##$RELAX= 
$$ Bruker specific parameters
$$ --------------------------
##$DU= <C:\u>
##$EXPNO= 6860
##$NAME= <ADRS>
##$PROCNO= 1
##$TYPE= <nmr>
##$USER= <dgb>
##$AMP= (0..31)
100 100 100 100 100 100 100 100 100 100 100 100 100 100 100 100 100 100 
100 100 100 100 100 100 100 100 100 100 100 100 100 100 
##$AQSEQ= 0
##$AQ_mod= 3
##$AUNM= <au_zg>
##$AUTOPOS= <17 >
##$BF1= 250.13
##$BF2= 250.13
##$BF3= 250.13
##$BF4= 250.13
##$BF5= 500.13
##$BF6= 500.13
##$BF7= 500.13
##$BF8= 500.13
##$BYTORDA= 1
##$CFDGTYP= 0
##$CFRGTYP= 5
##$CHEMSTR= <none>
##$CNST= (0..31)
1 1 145 1 1 1 1 1 1 1 1 1 1 1 1 1 1 1 1 1 1 1 1 1 1 1 1 1 1 1 1 1 
##$CPDPRG= <>
##$CPDPRG1= <>
##$CPDPRG2= <>
##$CPDPRG3= <>
##$CPDPRG4= <mlev>
##$CPDPRG5= <mlev>
##$CPDPRG6= <mlev>
##$CPDPRG7= <mlev>
##$CPDPRG8= <mlev>
##$CPDPRGB= <>
##$CPDPRGT= <>
##$D= (0..31)
0 1 0 0 0 0 0 0 0 0.06 0 0 0 0 0 0 0.0002 0 0 0 0 0 0 0 0 0 0 0 0 0 0 
0 
##$DATE= 1122633172
##$DBL= (0..7)
120 120 120 120 120 120 120 120 
##$DBP= (0..7)
150 150 150 150 150 150 150 150 
##$DBP07= 0
##$DBPNAM0= <>
##$DBPNAM1= <>
$$ [...]
##$SUBNAM6= <"">
##$SUBNAM7= <"">
##$SUBNAM8= <"">
##$SUBNAM9= <"">
##$SW= 20.6930455092707
##$SWIBOX= (0..15)
0 0 3 0 0 0 0 0 0 0 0 0 0 0 0 0 
##$SW_h= 5175.983436853
##$TD= 65536
##$TD0= 1
##$TE= 295.16
##$TE2= 300
##$TE3= 300
##$TEG= 300
##$TL= (0..7)
0 120 120 120 120 120 120 120 
##$TP= (0..7)
150 150 150 150 150 150 150 150 
##$TP07= 0
##$TPNAME0= <>
##$TPNAME1= <>
##$TPNAME2= <>
##$TPNAME3= <>
##$TPNAME4= <>
##$TPNAME5= <>
##$TPNAME6= <>
##$TPNAME7= <>
##$TPOAL= (0..7)
0.5 0.5 0.5 0.5 0.5 0.5 0.5 0.5 
##$TPOFFS= (0..7)
0 0 0 0 0 0 0 0 
##$TUNHIN= 0
##$TUNHOUT= 0
##$TUNXOUT= 0
##$USERA1= <user>
##$USERA2= <user>
##$USERA3= <user>
##$USERA4= <user>
##$USERA5= <user>
##$V9= 5
##$VALIST= <valist>
##$VCLIST= <CCCCCCCCCCCCCCC>
##$VD= 0
##$VDLIST= <DDDDDDDDDDDDDDD>
##$VPLIST= <PPPPPPPPPPPPPPP>
##$VTLIST= <TTTTTTTTTTTTTTT>
##$WBST= 1024
##$WBSW= 4
##$XGAIN= (0..3)
0 0 0 0 
##$XL= 0
##$YL= 0
##$YMAX_a= 419305
##$YMIN_a= -658314
##$ZGOPTNS= <>
##$ZL1= 120
##$ZL2= 120
##$ZL3= 120
##$ZL4= 120
##$ABSF1= 16.522
##$ABSF2= -4.171173
##$ABSG= 5
##$ABSL= 3
##$ALPHA= 0
##$AQORDER= 0
##$ASSFAC= 0
##$ASSFACI= 0
##$ASSFACX= 0
##$ASSWID= 0
##$AUNMP= <proc_1d>
##$AZFE= 0.1
##$AZFW= 0.1
##$BCFW= 0
##$BC_mod= 0
##$BYTORDP= 0
##$COROFFS= 0
##$CY= 12.5
##$DATMOD= 1
##$DC= 0
##$DFILT= <>
##$DTYPP= 0
##$F1P= 14.0000005364418
##$F2P= -0.99999901652339
##$FCOR= 0.5
##$FTSIZE= 32768
##$FT_mod= 6
##$GAMMA= 0
##$GB= 0
##$INTBC= 1
##$INTSCL= 1
##$ISEN= 128
##$LB= 0.3
##$LEV0= 0
##$LPBIN= 0
##$MAXI= 10000
##$MC2= 0
##$MEAN= 0
##$ME_mod= 0
##$MI= 0
##$NCOEF= 0
##$NC_proc= -2
##$NLEV= 6
##$NOISF1= 0
##$NOISF2= 0
##$NSP= 0
##$NTH_PI= 0
##$NZP= 0
##$OFFSET= 16.522
##$PC= 1
##$PHC0= -90.2824
##$PHC1= 3.845842
##$PH_mod= 1
##$PKNL= yes
##$PPARMOD= 0
##$PSCAL= 4
##$PSIGN= 0
##$REVERSE= no
##$SF= 250.13
##$SI= 32768
##$SIGF1= 0
##$SIGF2= 0
##$SINO= 400
##$SIOLD= 32768
##$SREGLST= <1H.DMSO>
##$SSB= 0
##$STSI= 32768
##$STSR= 0
##$SW_p= 5175.98343685301
##$SYMM= 0
##$S_DEV= 0
##$TDeff= 65536
##$TDoff= 0
##$TI= <Analysis number 999999
Compound Code 99
Book Reference 9
Project Code 9>
##$TILT= no
##$TM1= 0
##$TM2= 0
##$TOPLEV= 0
##$USERP1= <user>
##$USERP2= <user>
##$USERP3= <user>
##$USERP4= <user>
##$USERP5= <user>
##$WDW= 1
##$XDIM= 32768
##$YMAX_p= 274751123
##$YMIN_p= -24692
$$ End of Bruker specific parameters
$$ ---------------------------------
##NTUPLES= NMR SPECTRUM
##VAR_NAME=  FREQUENCY,     SPECTRUM/REAL,   SPECTRUM/IMAG
##SYMBOL=    X,             R,               I
##VAR_TYPE=  INDEPENDENT,   DEPENDENT,       DEPENDENT
##VAR_FORM=  AFFN,          ASDF,            ASDF
##VAR_DIM=   32768,         32768,           32768
##UNITS=     HZ,            ARBITRARY UNITS, ARBITRARY UNITS
##FACTOR=    0.157963299565203, 1,           1
##FIRST=     4132.6476996994, 0,             0
##LAST=      -1043.33573715361, 0,           0
##MIN=       -1043.33573715361, -24692,      0
##MAX=       4132.6476996994, 274751123,     0
$$ Real data points
##PAGE= N=1
##DATA TABLE= (X++(R..R)), XYDATA
$$ [...]
$$ plain form
18548 36827 25700 23889 23116 23652 24883 29089 31660 31533 32133 33795 35070 38110 38977 38144 31165 23531
18532 23531 20140 23323 31237 29444 29222 28232 26357 26570 24443 21114 22820 30358 32054 36247 27210
18517 27210 20040 19094 18488 9939 8398 12828 18946 14314 15858 21677 17529 14114 17461 24173 25184
18502 25184 21363 21354 29296 35838 30016 31028 31442 31770 28097 30552 41056 39477 28737 35190 39495
18487 39495 39096 44039 48856 57218 56276 60504 73504 80836 87780 100789 113937 112127 117457 118235
18473 118235 111651 103763 93721 81482 76141 67798 57228 46516 39614 44513 39284 35435 35677
18460 35677 32557 33726 36395 35889 34528 29648 28090 26992 26909 28838 28944 22100 25930 29102 32869
18445 32869 36309 41228 43409 43502 45148 45376 50660 62139 66617 76091 89619 101962 120821 148398
$$ packed form
18548C6827j1127j811p73N36J231M206K571j27O00J662J275L040Q67q33o979p634
18532B3531l391L183P914j793k22r90j875K13k127l329J706P538J696M193r037
18517B7210p170r46o06q549j541M430O118m632J544N819m148l415L347O712J011
18502B5184l821rP942O542n822J012M14L28l673K455J0504j579j0740O453M305
18487C9495l99M943M817Q362r42M228J3000P332O944J3009J3148j810N330P78
18473A18235o584p888j0042j2239n341q343j0570j0712o902M899n229l849K42
18460C5677l120J169K669n06j361m880j558j098q3J929J06o844L830L172L767
18445C2869L440M919K181R3J646K28N284J1479M478R474J3528J2343J8859K7577
$$ plain form
18431 148398 177566 214026 249325 279501 304975 307778 305717 292601 277661 261501 251575 240845
18419 240845 235714 230074 232846 228774 233326 254037 285770 319338 347552 363403 371694 370051 349201
18406 349201 322199 304039 291008 283805 279589 275823 281857 297402 319856 339537 359768 374195
18394 374195 381905 388231 377598 351344 320074 283939 242077 203876 169318 139502 121066 103656
18382 103656 88871 80711 71590 61195 55126 54979 54114 52522 40799 41577 40555 40916 41052 42765 45072
18367 45072 49226 47035 41706 39139 45851 57138 61630 57058 57597 61962 70546 72097 75627 79943
18353 79943 90438 92257 101873 124643 153394 178046 193477 210060 227265 257239 280803 294165
18341 294165 303221 309086 306329 287719 265338 246844 221557 190371 165373 150531 121112 101828
$$ packed form
18431A48398K9168L6460L5299L0176K5474K803k061j3116j4940j6160r926j0730
18419B40845n131n640K772m072M552K0711L1733L3568K8214J5851Q291j643k0850
18406C49201k7002j8160j3031p203m216l766O034J5545K2454J9681K0231J4427
18394C74195P710O326j0633k6254l1270l6135m1862l8201l4558k9816j8436j7410
18382A03656j4785q160r121j0395o069j47q65j592j1723P78j022L61J36J713K307
18367D5072M154k191n329k567O712J1287M492m572N39M365Q584J551L530M316
18353G9943J0495J819R616K2770K8751K4652J5431J6583J7205K9974K3564J3362
18341B94165R056N865k757j8610k2381j8494k5287l1186k4998j4842k9419j9284
$$ plain form
18329 101828 91157 77698 67383 59378 55527 54646 59265 55240 47863 39561 38162 47152 48763 45681
18315 45681 47621 46058 39369 46023 52641 50873 43655 41591 38771 35493 37397 42957 39333 39970 43018
18300 43018 35467 30589 34412 36695 37758 42424 43147 42074 44860 45604 46190 40742 39036 37713 41109
18285 41109 39487 36797 38962 39048 39590 38152 43306 41082 34574 35889 40790 45046 49728 52597 49320
18270 49320 40548 35737 42977 49285 49942 52859 54130 54411 54132 50606 46567 47700 51245 52027 49618
18255 49618 51652 54025 59032 55530 51638 57086 57068 48551 46995 45055 41734 47809 50092 52338 55988
18240 55988 60024 56498 53230 57971 60791 55714 48766 42485 36226 35276 45081 56337 61105 56371
18226 56371 60455 69419 82244 103079 130062 155174 173267 182292 185408 185353 178270 164092 140931
$$ packed form
18329A01828j0671j3459j0315q005l851q81M619m025p377q302j399Q990J611l082
18315D5681J940j563o689O654O618j768p218k064k820l278J904N560l624O37L048
18300D3018p551m878L823K283J063M666P23j073K786P44N86n448j706j323L396
18285D1109j622k690K165Q6N42j438N154k224o508J315M901M256M682K869l277
18270D9320q772m811P240O308O57K917J271K81k79l526m039J133L545P82k409
18255D9618K034K373N007l502l892N448j8q517j556j940l321O075K283K246L650
18240E5988M036l526l268M741K820n077o948o281o259r50R805J1256M768m734
18226E6371M084Q964J2825K0835K6983K5112J8093R025L116n5p083j4178k3161
$$ plain form
18213 140931 124195 116505 107714 103603 105360 106709 101126 107316 124485 141552 155873 175964 194396
18200 194396 204118 219855 225935 216250 198036 181465 161066 148985 140741 127037 119736 122041 126648
18187 126648 133496 139502 153473 169548 193493 211739 218917 219259 217489 214379 192585 169856 152966
18174 152966 136504 121445 108716 103292 103408 101834 100754 104345 110338 125954 150183 167100 180048
18161 180048 184019 181513 180117 164728 143190 125689 114375 102047 86731 75330 64351 64250
18149 64250 57419 58594 69011 74989 78358 69894 68000 66428 59900 60393 58948 61455 65676 64994 74952
18134 74952 77895 80854 89633 95351 93801 82964 87060 89233 88645 85110 82194 79501 71024 72287
18120 72287 75195 75105 76955 71927 73238 76706 78754 81922 79770 73822 76671 81734 85927 91096 90122
$$ packed form
18213A40931j6736p690q791m111J757J349n583O190J7169J7067J4321K0091J8432
18200A94396R722J5737O080r685j8214j6571k0399j2081q244j3704p301K305M607
18187A26648O848O006J3971J6075K3945J8246P178L42j770l110k1794k2729j6890
18174A52966j6462j5059j2729n424J16j574j080L591N993J5616K4229J6917J2948
18161A80048L971k506j396j5389k1538j7501j1314j2328j5316j1401j0979j01
18149F4250o831J175J0417N978L369q464j894j572o528M93j445K507M221o82R958
18134G4952K943K959Q779N718j550j0837M096K173n88l535k916k693q477J263
18120G2287K908r0J850n028J311L468K048L168k152n948K849N063M193N169r74
$$ plain form
18105 90122 88258 93646 96689 101700 101214 97740 94336 91908 93482 98633 100800 99268 99245 99316 99582 100848
18089 100848 106483 113465 115941 119276 125269 129384 136920 149898 168467 188935 222125 239110 246497
18076 246497 255626 264267 277568 290506 294001 279585 253332 223172 197021 180659 163871 142225
18064 142225 120873 106170 98508 95263 95898 98838 103988 113284 120075 129363 139118 143096 138694 134147
18050 134147 135279 131226 121852 112301 109714 106275 101352 100733 96761 95077 92723 89125 88829 95267 103670
18035 103670 112375 108186 109738 104633 98146 96803 102089 117864 143820 180407 217430 261535 294770
18022 294770 312732 318800 321389 327403 325105 308651 284243 256966 225159 195487 171892 148982
18010 148982 139430 130344 119002 115488 105754 106894 115372 118920 115165 106612 105124 110672 113281 109239
$$ packed form
18105I0122j864N388L043N011m86l474l404k428J574N151K167j532k3P1K66J266
18089A00848N635O982K476L335N993M115P536J2978J8569K0468L3190J6985P387
18076B46497R129Q641J3301J2938L495j4416k6253l0160k6151j6362j6788k1646
18064A42225k1352j4703p662l245O35K940N150R296O791R288R755L978m402m547
18050A34147J132m053r374r551k587l439m923o19l972j684k354l598k96O438Q403
18035A03670Q705m189J552n105o487j343N286J5775K5956L6587L7023M4105L3235
18022B94770J7962O068K589O014k298j6454k4408k7277l1807k9672k3595k2910
18010A48982r552r086j1342l514r734J140Q478L548l755q553j488N548K609m042
$$ plain form
17996 109239 115908 123912 125014 135752 144838 144433 138753 137221 139703 144190 150290 156310 158049 161252
17982 161252 167910 179743 187425 195371 204013 211517 211550 203190 197334 204473 202866 207436 218302 225806
17968 225806 223851 230401 237144 242165 249111 251180 251076 254503 258560 258730 257211 262484 261680 258369 250417
17953 250417 246512 241112 245876 241821 240472 248996 252697 260735 269854 271690 273166 284477 296494 311389
17939 311389 328640 346845 358161 369649 392262 422795 457692 490605 527771 561242 603791
17928 603791 657440 711088 763081 817629 879353 929727 984579 1045537 1114415 1191841 1277302
17917 1277302 1373499 1489280 1641577 1842005 2118361 2505245 3068808 3926669 5259277
17908 5259277 7327613 10285569 13736131 16869992 19587716 22566740 26069206 29299613
$$ packed form
17996A09239O669Q004J102J0738R086m05n680j532K482M487O100O020J739L203
17982A61252O658J1833P682P946Q642P504L3q360n856P139j607M570J0866P504
17968B25806j955O550O743N021O946K069j04L427M057J70j519N273q04l311p952
17953B50417l905n400M764m055j349Q524L701Q038R119J836J476J1311J2017J4895
17939C11389J7251J8205J1316J1488K2613L0533L4897L2913L7166L3471M2549
17928F03791N3649N3648N1993N4548O1724N0374N4852O0958O8878P7426Q5461
17917A277302R6197J15781J52297K00428K76356L86884N63563Q57861J332608
17908E259277K068336K957956L450562L133861K717724K979024L502466L230407
$$ plain form
17900 29299613 31122571 31238898 30352511 29186176 27698831 25350298 22189655 18770969
17892 18770969 15451287 12404427 9803867 7744450 6187605 5051341 4236714 3679583
17884 3679583 3314703 3086358 2944478 2861767 2819306 2793694 2783717 2773263 2768497 2774907 2793432
17873 2793432 2851454 2951499 3095509 3300323 3586942 3980063 4525685 5305446 6439287
17864 6439287 8118016 10658679 14453930 19783635 26411068 33472036 40005784 44867507
17856 44867507 47309212 47410004 45766740 43603007 41822986 40366021 39105208 38790993
17848 38790993 40065702 42425531 44550392 45699876 46537839 48361994 51686899 55585958
17840 55585958 58778447 60744324 60793002 58372225 53573274 46933579 39499298 32209867
$$ packed form
17900B9299613J822958J16327q86387j166335j487345k348533l160643l418686
17892A8770969l319682l046860k600560k059417j556845j136264q14627n57131
17884C679583l64880k28345j41880q2711m2461k5612r977j0454m766O410J8525
17873B793432N8022J00045J44010K04814K86619L93121N45622P79761J133841
17864F439287J678729K540663L795251N329705O627433P060968O533748M861723
17856D4867507K441705J00792j643264k163733j780021j456965j260813l14215
17848C8790993J274709K359829K124861J149484Q37963J824155L324905L899059
17840E5585958L192489J965877M8678k420777m798951o639695p434281p289431
$$ plain form
17832 32209867 25652601 20121192 15706085 12301475 9718415 7778622 6323043 5232276
17824 5232276 4399236 3766243 3292221 2931295 2653091 2434854 2255024 2113063 2000398
17815 2000398 1917932 1834821 1746450 1649579 1541278 1425123 1299513 1168917 1055056 953555
17805 953555 859501 779972 721301 670105 625697 590061 553964 522275 493832 470009 456119
17794 456119 450582 440744 422704 411777 401401 396397 395383 392451 382222 366115 358002 353772 343092
17781 343092 332054 331291 326225 323627 321827 315586 311929 310584 316452 327743 353385 385589 422453
17768 422453 458992 485097 504944 494675 465637 429707 388242 355444 324988 294122 272706
17757 272706 265190 257003 252049 257696 260362 278818 316910 365725 405431 431091 446523 445179 429750
$$ packed form
17832C2209867o557266n531409m415107l404610k583060j939793j455579j090767
17824E232276q33040o32993m74022l60926k78204k18237j79830j41961j12665
17815B000398q2466q3111q8371r6871j08301j16155j25610j30596j13861j01501
17805I53555r4054p9529n8671n1196m4408l5636l6097l1689k8443k3823j3890
17794D56119n537r838j8040j0927j0376n004j014k932j0229j6107q113m230j0680
17781C43092j1038p63n066k598j800o241l657j345N868J1291K5642L2204L6864
17768D22453L6539K6105J9847j0269k9038l5930m1465l2798l0456l0866k1416
17757B72706p516q187m954N647K666J8456L8092M8815L9706K5660J5432j344j5429
$$ plain form
17744 429750 400507 372487 337325 304803 275100 254305 238567 226952 219239 211679 212298 213621
17732 213621 214629 211786 208384 209390 216055 217515 230919 243284 261650 274741 290415 314439 336723
17719 336723 354643 368755 380756 387662 384696 384511 369527 340342 312223 298325 286915 283926
17707 283926 298730 315483 328194 331918 330281 322860 309453 292745 264935 243915 223973 207351
17695 207351 196618 181378 169882 166483 173431 187528 202795 215251 227959 241376 243349 246659
17683 246659 244757 228285 223173 225601 225439 227556 239573 250196 263970 275608 271363 256734 239225
17670 239225 218223 193320 171578 159154 140465 120619 112040 107793 105899 95113 85665 82198
17658 82198 83547 80453 80036 76351 77858 72892 64853 60507 60905 61357 63366 57681 51063 49767 46196
$$ packed form
17744D29750k9243k8020l5162l2522k9703k0795j5738j1615p713p560O19J323
17732B13621J008k843l402J006O665J460J3404J2365J8366J3091J5674K4024K2284
17719C36723J7920J4112J2001O906k966j85j4984k9185k8119j3898j1410k989
17707B83926J4804J6753J2711L724j637p421j3407j6708k7810k1020j9942j6622
17695B07351j0733j5240j1496l399O948J4097J5267J2456J2708J3417J973L310
17683B46659j902j6472n112K428j62K117J2017J0623J3774J1638m245j4629j7509
17670B39225k1002k4903k1742j2424j8689j9846q579m247j894j0786r448l467
17658H2198J349l094m17l685J507m966q039m346L98M52K009n685o618j296l571
$$ plain form
17643 46196 39077 39689 46123 43970 41766 50771 44300 42576 45702 42379 46615 57426 61162 66150
17629 66150 75206 77641 81282 78374 72634 70395 78786 95520 116628 131557 146783 163435 181121
17616 181121 202054 208073 206021 197417 184527 174186 170602 168435 173279 181878 190375 198100 206509
17603 206509 212929 206435 193116 179676 164170 148662 128980 113521 98913 98031 90626 89865 83265
17590 83265 81766 85786 75366 67799 66821 73363 71926 69867 67174 71688 74879 68342 64303 70250
17576 70250 68396 63562 56672 52163 50004 46900 48802 51373 44403 42411 46155 45952 39713 37419 34075
17561 34075 27259 29743 37352 42102 43482 40905 41996 42629 43038 40573 40652 38671 30637 33098 41993
17546 41993 45219 46218 48116 45060 45102 43360 39907 38562 45530 56892 68818 72948 81774 92190
$$ packed form
17643D6196p119O12O434k153k204R005o471j724L126l323M236J0811L736M988
17629F6150R056K435L641k908n740k239Q391J6734K1108J4929J5226J6652J7686
17616A81121K0933O019k052q604j2890j0341l584k167M844Q599Q497P725Q409
17603B06509O420o494j3319j3440j5506j5508j9682j5459j4608q82p405p61o600
17590H3265j499M020j0420p567r78O542j437k059k693M514L191o537m039N947
17576G0250j854m834o890m509k159l104J902K571o970j992L744k03o239k294l344
17561C4075o816K484P609M750J380k577J091O33M09k465P9j981q034K461Q895
17546D1993L226R99J898l056M2j742l453j345O968J1362J1926M130Q826J0416
$$ plain form
17532 92190 105932 128134 151687 170421 180291 185330 185462 174359 155387 139158 127764 123015 120449
17519 120449 122541 121737 134280 141808 150342 164431 161299 146817 131735 120775 107997 90935 74093
17506 74093 66174 62936 60028 48644 33203 19051 22288 25610 27532 32180 32792 29969 30957 34601
17492 34601 42904 47741 47995 41031 45955 49544 46253 49238 56792 65191 73226 77886 80207 85296 99130
17477 99130 114918 132049 145891 159363 166917 166725 162091 145856 133960 122278 108208 107668 121767
17464 121767 129627 141101 155329 161019 166411 166104 152190 141784 140196 124194 107670 97033 87335
17451 87335 82393 77637 74168 70414 64512 57285 49872 49669 51371 49862 52738 51686 57277 59238 58294
17436 58294 58432 59324 63749 71272 77138 79670 80477 79606 85754 89370 90903 96487 106341 115136 128370
$$ packed form
17532I2190J3742K2202K3553J8734R870N039J32j1103j8972j6229j1394m749k566
17519A20449K092q04J2543P528Q534J4089l132j4482j5082j0960j2778j7062j6842
17506G4093p919l238k908j1384j5441j4152L237L322J922M648O12k823R88L644
17492C4601Q303M837K54o964M924L589l291K985P554Q399Q035M660K321N089J3834
17477I9130J5788J7131J3842J3472P554j92m634j6235j1896j1682j4070n40J4099
17464A21767P860J1474J4228N690N392l07j3914j0406j588j6002j6524j0637r698
17451H7335m942m756l469l754n902p227p413k03J702j509K876j052N591J961r44
17436E8294J38Q92M425P523N866K532Q07q71O148L616J533N584R854Q795J3234
$$ plain form
17421 128370 155720 197502 245711 296005 337054 367995 368841 349213 319266 283209 243462 203044
17409 203044 176939 161739 153736 145221 132704 130561 139936 146321 154305 165708 171182 181717 194780
17396 194780 188470 183235 178050 173841 168585 156761 143499 137272 134787 123695 118990 111531 107289
17383 107289 98340 93972 92654 96901 107773 109450 111660 109294 109234 105964 102269 101710 106443 115397 130140
17368 130140 151594 173728 199833 239511 291743 326963 343417 350354 347141 325359 297973 271948
17356 271948 244996 222710 215441 211914 212373 217836 226895 239846 255992 267885 291218 310560 322977
17343 322977 322012 323114 326251 338517 341903 333601 328660 326165 314307 291334 262044 243756 228016
17330 228016 217019 209495 207715 212936 212361 211870 204529 202667 200816 197147 187244 186219 176394 163963
$$ packed form
17421A28370K7350M1782M8209N0294M1049L0941Q46j9628k9947l6057l9747m0418
17409B03044k6105j5200q003q515j2517k143R375O385P984J1403N474J0535J3063
17396A94780o310n235n185m209n256j1824j3262o227k485j1092m705p459m242
17383A07289q949m368j318M247J0872J677K210k366o0l270l695n59M733Q954J4743
17368A30140K1454K2134K6105L9678N2232L5220J6454O937l213k1782k7386k6025
17356B71948k6952k2286p269l527M59N463R059J2951J6146J1893K3333J9342J2417
17343C22977r65J102L137J2266L386q302m941k495j1858k2973k9290j8288j5740
17330B28016j0997p524j780N221n75m91p341j862j851l669r903j025r825j2431
$$ plain form
17316 163963 146917 133894 132263 136203 136755 132840 129714 134065 136161 140506 144070 147618 153841 150447
17302 150447 153494 154238 147972 148590 163789 168589 164907 164675 160465 165535 173788 183164 196544 212139
17288 212139 229653 245972 272391 298698 325754 360609 393806 424025 447754 461550 463934 454523
17276 454523 448520 442051 433875 435372 433150 424155 425699 428246 428244 430883 447704 472884 510936 555680
17262 555680 601459 639416 671854 699573 727221 764184 810593 860263 901136 946361 1002503
17251 1002503 1067457 1141713 1213836 1281988 1360628 1457081 1572915 1718950 1906371 2148654
17241 2148654 2437392 2778724 3230427 3870868 4796076 6163305 8252718 11536401 16508300
17232 16508300 22788358 28448716 32235926 35218361 38299902 40183560 39120372 35858242
$$ packed form
17316A63963j7046j3023j631L940N52l915l126M351K096M345L564L548O223l394
17302A50447L047P44o266O18J5199M800l682k32m210N070Q253R376J3380J5595
17288B12139J7514J6319K6419K6307K7056L4855L3197L0219K3729J3796K384r411
17276D54523o003o469q176J497k222q995J544K547kK639J6821K5180L8052M4744
17262E55680M5779L7957L2438K7719K7648L6963M6409M9670M0873M5225N6142
17251A002503O4954P4256P2123O8152P8640R6453J15834J46035J87421K42283
17241B148654K88738L41332M51703O40441R25208J367229K089413L283683M971899
17232A6508300O280058N660358L787210K982435L081541J883658j063188l262130
$$ plain form
17224 35858242 32005942 28355411 25559018 24497302 25985136 30202915 35525749 39273104
17216 39273104 41287695 43146175 44685114 43825073 39933457 34576164 28895754 23336886
17208 23336886 18315970 14194472 11003260 8597772 6817681 5495406 4489852 3726152
17200 3726152 3144236 2696208 2351146 2084995 1883008 1727537 1595961 1476455 1368847
17191 1368847 1272994 1186230 1105173 1019851 933166 846668 769483 701999 636184 585981 550572
17180 550572 508958 473524 445461 422278 403139 389680 375492 355630 337609 317840 303227
17169 303227 293306 283543 283450 290345 293561 282923 269424 266692 268331 269139 262347 254963 250320 250292 248548
17154 248548 254843 266468 268726 277061 292353 308980 321327 331948 340229 340838 332245 309418 289733
$$ packed form
17224C5858242l852300l650531k796393j061716J487834M217779N322834L747355
17216C9273104K014591J858480J538939q60041l891616n357293n680410n558868
17208B3336886n020916m121498l191212k405488j780091j322275j005554p63700
17200C726152n81916m48028l45062k66151k01987j55471j31576j19506j07608
17191A368847r5853q6764q1057q5322q6685q6498p7185o7484o5815n0203l5409
17180E50572m1614l5434k8063k3183j9139j3459j4188j9862j8021j9769j4613
17169C03227r921r763r3O895L216j0638j3499k732J639Q08o792p384m643k8j744
17154B48548O295J1625K258Q335J5292J6627J2347J0621Q281O09q593k2827j9685
$$ plain form
17141 289733 275235 261472 250320 239364 240960 248987 261044 276467 294442 299540 294046 282503
17129 282503 270592 267181 263905 246556 224526 202632 194392 185756 173165 164148 164504 168447 177677
17116 177677 184466 184333 188514 190137 190581 188881 191010 192358 190831 192502 196913 204335 210333 223436
17102 223436 234010 245673 243714 239051 232322 226485 232732 234685 236538 239708 247707 245486 249154 248162
17088 248162 247419 245835 245939 241906 236773 236878 244667 245418 253660 258628 260921 275473 291384 314921
17074 314921 343955 382012 434483 484417 529887 569525 607732 632563 631674 617157 602970 600706
17062 600706 607464 635209 682186 737424 805646 889924 982299 1071759 1173150 1273760 1379988
17051 1379988 1504034 1654803 1847720 2094294 2429963 2915406 3629074 4728831 6485487
$$ packed form
17141B89733j4498j3763j1152j0956J596Q027J2057J5423J7975N098n494j1543
17129B82503j1911l411l276j7349k2030k1894q240q636j2591r017L56L943R230
17116A77677O789j33M181J623M44j700K129J348j527J671M411P422N998J3103
17102B23436J0574J1663j959m663o729n837O247J953J853L170P999k221L668r92
17088B48162p43j584J04m033n133J05P789P51Q242M968K293J4552J5911K3537
17074C14921K9034L8057N2471M9934M5470L9638L8207K4831q89j4517j4187k264
17062F00706O758K7745M6977N5238O8222Q4278R2375Q9460J01391J00610J06228
17051A379988J24046J50769J92917K46574L35669M85443P13668J099757J756656
$$ plain form
17042 6485487 9257402 13263698 17888191 21835070 24844235 26647599 26237099 23941497
17034 23941497 20918813 17828525 15033906 12948726 11899382 12087821 13698697 16552772
17026 16552772 19613574 21973665 23607980 23825694 22126458 19303590 16160523 13066976
17018 13066976 10272059 7985852 6229718 4917871 3953036 3242954 2724594 2346608 2076496
17009 2076496 1879014 1735223 1635074 1567302 1515541 1473489 1453292 1443105 1445688 1452626 1466952
16998 1466952 1499700 1546580 1628836 1750863 1933929 2187874 2553828 3105626 3948818 5290600
16988 5290600 7445190 10678783 14714432 18406439 21218660 23148811 23325596 21623707
16980 21623707 19039704 16287503 13729175 11701921 10536580 10436190 11589070 13983882
$$ packed form
17042F485487K771915M006296M624493L946879L009165J803364m10500k295602
17034B3941497l022684l090288k794619k085180j049344J88439J610876K854075
17026A6552772L060802K360091J634315K17714j699236k822868l143067l093547
17018A3066976k794917k286207j756134j311847r64835p10082n18360l77986k70112
17009B076496j97482j43791j00149o7772n1761m2052k0197j0187K583O938J4326
16998A466952L2748M6880Q2256J22027J83066K53945L65954N51798Q43192J341782
16988E290600K154590L233593M035649L692007K812221J930151J76785j701889
16980B1623707k584003k752201k558328k027254j165341j00390J152880K394812
$$ plain form
16972 13983882 16863480 19195698 20888926 21531356 20385870 17965190 15125192 12270410
16964 12270410 9630449 7411620 5687464 4395039 3438573 2741471 2231053 1858832 1590335
16955 1590335 1390893 1243723 1122579 1014113 918756 835651 752177 678546 612938 556227
16945 556227 517878 490294 474417 462504 447814 435125 423539 397165 366240 344350 325625
16934 325625 302594 280298 259861 244273 231089 216651 209359 206607 205670 201116 203506 198747 197639
16921 197639 195348 185031 185026 187760 187465 181741 173809 167114 168608 173131 172476 170856 171732 164013 152961
16906 152961 145442 141961 155033 156767 152534 146024 145696 150757 155542 147931 136534 131688 121505 117810
16892 117810 114353 113861 113149 116328 118798 118437 110366 107452 107497 105767 104122 104444 107930 113444 114524 113364
$$ packed form
16972A3983882K879598K332218J693228O42430j145486k420680k839998k854782
16964A2270410k639961k218829j724156j292425r56466o97102n10418l72221k68497
16955A590335j99442j47170j21144j08466r5357q3105q3474p3631o5608n6711
16945E56227l8349k7584j5877j1913j4690j2689j1586k6374l0925k1890j8725
16934C25625k3031k2296k0437j5588j3184j4438p292k752r37m554K390m759j108
16921A97639k291j0317nK734k95n724p932o695J494M523o55j620Q76p719j1052
16906A52961p519l481J3072J734m233o510l28N061M785p611j1397m846j0183l695
16892A17810l457m92p12L179K470l61q071k914M5j730j645L22L486N514J080j160
$$ plain form
16876 113364 108125 103923 103319 102061 99392 93021 88892 87909 94036 104297 116855 113623 119843 129135
16862 129135 132920 144395 167058 187151 213189 240443 261156 266029 271947 275514 286828 291078
16850 291078 277169 252336 227309 203541 179537 159362 156743 154808 154993 163462 178025 191884
16838 191884 209971 220184 219921 216053 220146 221621 219695 206464 190447 170666 146237 128379 112744
16825 112744 99360 93128 87177 80180 75623 79008 83837 79954 74182 72169 76422 83827 82226 80534
16811 80534 86325 91514 97049 101831 107252 105552 105465 109425 115526 118936 116835 113633 115874 117745 119328
16796 119328 114039 109444 105583 104262 106169 95879 84252 78943 69968 61957 54897 41880 42757 47382
16782 47382 45148 49339 47345 45775 42742 38388 40319 39508 40148 40379 41393 33978 29214 38973 46619
$$ packed form
16876A13364n239m202o04j258k669o371m129r83O127J0261J2558l232O220R292
16862A29135L785J1475K2663K0093K6038K7254K0713M873N918L567J1314M250
16850B91078j3909k4833k5027k3768k4004k0175k619j935J85Q469J4563J3859
16838A91884J8087J0213k63l868M093J475j926j3231j6017j9781k4429j7858j5635
16825A12744j3384o232n951o997m557L385M829l883n772k013M253P405j601j692
16811H0534N791N189N535M782N421j700q7L960O101L410k101l202K241J871J583
16796A19328n289m595l861j321J907j0290j1627n309q975q011p060j3017Q77M625
16782D7382k234M191j994j570l033m354J931q11O40K31J014p415m764R759P646
$$ plain form
16767 46619 39787 32318 30763 32178 34617 42063 41820 38208 37159 38187 42505 48891 56154 58591 60996
16752 60996 66123 73005 71542 74616 77961 82395 93759 115201 142017 172434 197737 231127 271729
16739 271729 318746 375410 419013 445274 457587 466771 471007 459406 427895 393417 364265 338637
16727 338637 317870 316015 328237 350437 374750 392821 408832 423023 431495 435812 418689 392337
16715 392337 365145 328491 291849 265947 248203 220722 191807 162816 140989 123650 106001
16704 106001 89844 79493 68365 56311 51362 48625 40430 37959 31827 25951 21109 25020 26692
16691 26692 28854 29217 30832 25987 24155 26202 29426 28358 24067 15361 12260 22498 27098 32728
16677 32728 32126 27072 17055 14684 12317 13037 16881 19150 25355 30809 27267 23898 30840 33384 37869
$$ packed form
16767D6619o832p469j555J415K439P446k43l612j049J028M318O386P263K437K405
16752F0996N127O882j463L074L345M434J1364K1442K6816L0417K5303L3390M0602
16739B71729M7017N6664M3603K6261J2313R184M236j1601l1511l4478k9152k5628
16727C38637k0767j855J2222K2200K4313J8071J6011J4191Q472M317j7123k6352
16715C92337k7192l6654l6642k5902j7744k7481k8915k8991k1827j7339j7649
16704A06001j6157j0351j1128j2054m949k737q195k471o132n876m842L911J672
16691B6692K162L63J615m845j832K047L224j068m291q706l101J0238M600N630
16677C2728o02n054j0017k371k367P20L844K269O205N454l542l369O942K544M485
$$ plain form
16662 37869 40774 39669 38315 42871 44496 38248 34520 35031 37740 41128 40556 38114 39347 41816 39474
16647 39474 35767 30914 29791 24351 20620 25411 29047 27974 34241 41076 43058 45822 42666 42169 37315
16632 37315 33998 31069 32562 32349 30397 28300 34029 38583 38156 32432 30674 34968 40156 47148 46225
16617 46225 40966 43778 50051 54870 63959 70230 72389 71986 77702 87860 91423 97294 91358 85858
16603 85858 84378 86429 83544 77418 76002 80579 94448 108906 116222 120293 126672 126263 124550 121672
16589 121672 122881 121922 121294 129569 137348 143697 142751 136450 131035 127766 115914 104523 93570 85915
16575 85915 84491 78274 70697 64142 64842 68554 60953 51525 46734 39305 38170 36514 40691 39567 35722
16560 35722 41095 40570 33376 37650 46138 49321 50679 49078 46886 48206 55732 60592 72820 81349
$$ packed form
16662C7869K905j105j354M556J625o248l728N11K709L388n72k442J233K469k342
16647C9474l707m853j123n440l731M791L636j073O267O835J982K764l156m97m854
16632C7315l317k929J493k13j952k097N729M554m27n724j758M294N188O992r23
16617D6225n259K812O273M819R089O271K159m03N716J0158L563N871n936n500
16603H5858j480K051k885o126j416M577J3869J4458P316M071O379m09j713k878
16589A21672J209r59o28Q275P779O349r46o301n415l269j1852j1391j0953p655
16575H5915j424o217p577o555P00L712p601r428m791p429j135j656M177j124l845
16560C5722N373n25p194M274Q488L183J358j601k192J320P526M860J2228Q529
$$ plain form
16546 81349 94620 109527 129940 142799 150827 162314 159248 150514 141700 131305 119385 114920 116078
16533 116078 120762 125226 131223 149331 162526 163417 156470 140634 129343 116284 101378 85733 70842
16520 70842 65146 59550 52833 39342 32736 30555 35410 37468 38754 30609 27180 33830 34534 38022
16506 38022 44253 46347 38422 33864 33764 30344 27063 28347 35239 41284 44116 45424 51110 60449 77886
16491 77886 93655 112467 126607 134466 139641 136849 122677 112546 99722 90726 80971 74927 67927
16478 67927 70353 79113 88398 96401 101540 97765 91715 85230 74942 64220 58657 53343 52387 50602
16464 50602 51607 37802 28247 27982 25910 18424 14417 18099 17383 12188 9904 18671 30009 30155 30971
16449 30971 37340 41516 37716 33880 41535 41241 41987 46049 44929 53670 62099 67328 70454 66317 73832
$$ packed form
16546H1349J3271J4907K0413J2859Q028J1487l066q734q814j0395j1920m465J158
16533A16078M684M464N997J8108J3195Q91o947j5836j1291j3059j4906j5645j4891
16520G0842n696n596o717j3491o606k181M855K058J286q145l429O650P04L488
16506C8022O231K094p925m558j00l420l281J284O892O045K832J308N686R339J7437
16491G7886J5769J8812J4140P859N175k792j4172j0131j2824q996r755o044p000
16478F7927K426Q760R285Q003N139l775o050o485j0288j0722n563n314r56j785
16464E0602J005j3805r555k65k072p486m007L682p16n195k284Q767J1338J46Q16
16449C0971O369M176l800l836P655k94P46M062j120Q741Q429N229L126m137P515
$$ plain form
16434 73832 80564 81928 83123 80856 77412 74714 68619 71077 74812 75990 75588 79094 83006 86746 103209
16419 103209 115563 116363 119912 126238 132393 137091 136011 133276 133349 123933 117131 111539 104830 98350 97851
16404 97851 103693 106406 111365 121896 131131 136311 133127 127026 132982 139259 143340 144041 145996 139860
16390 139860 131027 119785 112216 111531 110289 106063 107627 111054 120799 123974 123178 123503 127079 128136 134848
16375 134848 145158 146607 140547 136403 138326 147740 149418 146997 145125 144900 148771 151768 161580 174635
16361 174635 190699 200097 208969 221373 235626 248482 262719 276451 289483 306783 323574 339184
16349 339184 355997 378933 409568 442616 474843 520611 571214 625534 672375 731528 812347
16338 812347 897365 977932 1048735 1121952 1212003 1323148 1443862 1584974 1735279 1904325
$$ packed form
16434G3832O732J364J195k267l444k698o095K458L735J178m02L506L912L740J6463
16419A03209J2354Q00L549O326O155M698j080k735P3r416o802n592o709o480m99
16404I7851N842K713M959J0531R235N180l184o101N956O277M081P01J955o136
16390A39860q833j1242p569o85j242m226J564L427R745L175p96L25L576J057O712
16375A34848J0310J449o060m144J923R414J678k421j872k25L871K997R812J3055
16361A74635J6064R398Q872J2404J4253J2856J4237J3732J3032J7300J6791J5610
16349C39184J6813K2936L0635L3048L2227M5768N0603N4320M6841N9153Q0819
16338H12347Q5018Q0567P0803P3217R0051J11145J20714J41112J50305J69046
$$ plain form
16328 1904325 2112903 2388438 2760219 3282820 4033444 5159128 6960933 9932546 14613445
16319 14613445 20916026 26979498 30589781 32102853 33177224 34847871 36857566 37358080
16311 37358080 35188600 31327997 26857909 22288009 18124111 14871642 12726864 11739345
16303 11739345 12039633 13940957 17835797 23412317 28616944 31411006 32373630 33103369
16295 33103369 34482515 36079932 36014077 33346066 29156702 24445974 19679908 15302358
16287 15302358 11710227 8962735 6941673 5473740 4410243 3636998 3076288 2651889
16279 2651889 2318226 2031431 1793842 1607371 1457682 1321609 1196795 1089689 1007440 938435
16269 938435 881762 833078 797691 771823 746638 717492 685143 650542 613490 574296 533673
$$ packed form
16328A904325K08578K75535L71781N22601P50624J125684J801805K971613M680899
16319A4613445O302581O063472L610283J513072J074371J670647K009695N00514
16311C7358080k169480l860603m470088m569900m163898l252469k144778r87519
16303A1739345L00288J901324L894840N576520N204627K794062R62624P29739
16295C3103369J379146J597417o5855k668011m189364m710728m766066m377550
16287A5302358l592131k747492k021062j467933j063497p73245n60710m24399
16279B651889l33663k86795k37589j86471j49689j36073j24814j07106q2249o9005
16269I38435n6673m8684l5387k5868k5185k9146l2349l4601l7052l9194m0623
$$ plain form
16258 533673 497353 473731 448136 417327 395352 381649 363024 343920 329894 318817 301156
16247 301156 292112 285722 267708 256028 250116 240979 235657 232790 215601 203256 187738 185489 180804
16234 180804 167784 155576 148002 150060 149228 148609 144533 137874 130959 122202 109165 101986 98901 104428
16220 104428 100196 95298 95152 97566 88214 86667 85446 87055 89129 88557 88633 80396 72017 68464 68754
16205 68754 77205 81862 82202 81706 85416 83837 84952 85536 90281 92426 91427 93079 90774 91361 89214 89760
16189 89760 86789 78788 74593 77849 78395 83480 86902 87956 92079 95739 98794 98629 94938 91208 85635
16174 85635 86129 80649 74545 71024 69648 71473 69405 69657 64953 64159 59976 51339 44349 38515 38784
16159 38784 37020 33957 37341 37139 37617 34845 31853 37534 35849 38281 38778 36678 31159 29949 28044
$$ packed form
16258E33673l6320k3622k5595l0809k1975j3703j8625j9104j4026j1077j7661
16247C01156r044o390j8014j1680n912r137n322k867j7189j2345j5518k249m685
16234A80804j3020j2208p574K058q32o19m076o659o915q757j3037p179l085N527
16220A04428m232m898j46K414r352j547j221J609K074n72P6q237q379l553K90
16205F8754Q451M657L40m96L710j579J115N84M745K145r99J652k305N87k147N46
16189H9760k971q001m195L256N46N085L422J054M123L660L055j65l691l730n573
16174H5635M94n480o104l521j376J825k068K52m704p94m183q637o990n834K69
16159C8784j764l063L384k02M78k772k992N681j685K432M97k100n519j210j905
$$ plain form
16144 28044 27452 30192 30717 36637 37793 36414 40539 42169 43898 43387 45842 47701 47918 44584 37824
16129 37824 31577 32846 41130 44409 43373 41340 30717 25065 22412 20768 17880 19850 15520 18348
16115 18348 19501 18734 19281 17111 10084 10498 19905 23800 21300 15675 10107 4852 2030 5645 3865
16100 3865 3267 8150 7353 11755 8996 -1387 -7618 -2114 -3997 -3602 341 8368 16228 11981 11848
16085 11848 17386 24192 22257 17779 19704 23896 25534 24200 16340 12121 9563 5930 15831 23388
16071 23388 23938 19625 17181 19468 28097 29194 34113 31325 31909 36915 36815 34680 34709 32364 28192 21110
16055 21110 17803 18831 13099 15188 22975 24258 22883 16587 9037 16004 17697 13099 16360 14076
16041 14076 19434 14236 11938 17246 25284 19874 13080 13853 14444 9843 7715 5853 1764 -5298 -5510
$$ packed form
16144B8044n92K740N25N920J156j379M125J630J729n11K455J859K17l334o760
16129C7824o247J269Q284L279j036k033j0623n652k653j644k888J970m330K828
16115A8348J153p67N47k170p027M14R407L895k500n625n568n255k822L615j780
16100C865n98M883p97M402k759j0383o231N504j883L95L943Q027P860m247j33
16085A1848N538O806j935m478J925M192J638j334p860m219k558l633R901P557
16071B3388N50m313k444K287Q629J097M919k788N84N006j00k135K9k345m172p082
16055B1110l307J028n732K089P787J283j375o296p550O967J693m598L261k284
16041A4076N358n198k298N308Q038n410o794P73N91m601k128j862m089p062k12
$$ plain form
16026 -5510 -1013 2764 -4157 -2461 6286 5471 9363 12908 5511 617 -279 697 -935 1273 4116
16011 4116 5882 8313 9406 10428 10864 12153 10538 4883 1833 5686 8887 7261 6346 11172 1532
15996 1532 -3948 7240 7383 8776 2348 5171 10037 17241 18778 4877 7300 8816 9177 -564 1634
15981 1634 6303 2401 -352 -3805 -4371 -6375 -8936 -16039 -19669 -17955 -6559 327 3991 1819 -5256
15966 -5256 -9603 -8263 -6512 -6981 -10232 -10074 -1303 -386 -1124 -8989 -6011 -2701 2861 2119 -2212 -1391
15950 -1391 3422 4416 1418 -4848 -3482 -3520 -3322 -5514 -6495 -2878 -5525 -8892 -12466 -11678 -11564 -4618
15934 -4618 -3356 -5545 -4159 -649 -6714 -2233 6181 4036 498 1052 359 -868 -7470 -13988 -13538
15919 -13538 -14543 -17227 -12724 -10493 -11163 -8496 -12794 -7487 -1750 3620 -525 5698 6540 3935 203
$$ packed form
16026e510M497L777o921J696Q747q15L892L545p397m894q96R76j632K208K843
16011D116J766K431J093J022M36J289j615n655l050L853L201j626r15M826r640
15996A532n480J1188J43J393o428K823M866P204J537j3901K423J516L61r741K198
15981A634M669l902k753l453n66k004k561p103l630J714J1396O886L664k172p075
15966e256m347J340J751m69l251J58Q771R17p38p865K978L310N562p42m331Q21
15950a391M813R94k998o266J366l8J98k192r81L617k647l367l574P88J14O946
15934d618J262k189J386L510o065M481Q414k145l538N54o93j227o602o518M50
15919a3538j005k684M503K231o70K667m298N307N737N370m145O223Q42k605l732
$$ plain form
15904 203 -6172 -7537 -1655 1072 561 -3170 -6397 -8644 -8429 -10779 -7698 -7620 -1801 6785 4379 -267
15888 -267 -6671 -3591 -844 -2466 -4660 3820 2926 2788 1264 1602 4649 4164 10282 9267 10868 9781
15872 9781 7097 7246 10915 13353 7862 -1688 -2124 832 2094 3086 5095 4479 6542 4167 4573 1219
15856 1219 -1627 -7679 -9692 1458 -179 -6041 -3557 1731 1491 2082 321 -694 -3544 -1268 3898
15841 3898 6157 6772 7888 13058 13135 13159 8012 2095 5298 2858 -2788 -6456 -5289 370 3719 -2080
15825 -2080 -3923 -3705 39 6068 2726 4694 7136 10185 12638 11653 7462 -133 -3367 -2057 -7966
15810 -7966 -5367 635 -1485 -6045 -7977 -5534 2606 5245 5576 3213 -3797 -6165 -3832 742 -1356
15795 -1356 -1971 234 3000 5454 8270 11211 13340 16324 20868 21528 11240 4895 15675 23686 26560
$$ packed form
15904B03o375j365N882K727n11l731l227k247K15k350L081P8N819Q586k406m646
15888b67o404L080K747j622k194Q480q94j38j524L38L047m85O118j015J601j087
15872I781k684J49L669K438n491r550m36K956J262R92K009o16K063k375M06l354
15856A219k846o052k013J1150j637n862K484N288k40N91j761j015k850K276N166
15841C898K259O15J116N170P7K4n147n917L203k440n646l668J167N659L349n799
15825b080j843K18L744O029l342J968K442L049K453r85m191p595l234J310n909
15810g966K599O002k120m560j932K443Q140K639L31k363p010k368K333M574k098
15795a356o15K205K766K454K816K941K129K984M544O60j0288o345J0780Q011K874
$$ plain form
15780 26560 33889 37622 37537 50542 62454 83112 105468 134103 160019 172392 181614 195942 212791
15767 212791 222583 213972 198750 183329 176747 191579 229142 313215 461534 648442 750312
15756 750312 737413 689923 619599 525798 432243 366893 319894 284942 256640 223117 190792
15745 190792 164928 131067 104287 84177 77448 71147 56337 46233 36233 28751 26871 29262
15733 29262 28098 29431 19614 14490 21475 29590 38457 45022 45177 48168 45659 40050 39163 38637 36671
15718 36671 34415 47001 68717 89822 112932 151475 205718 257257 286793 291575 269698 237870
15706 237870 203146 168578 134270 105780 82166 64831 54157 40727 30927 30116 27829 23161
15694 23161 17284 16737 14908 16829 15773 12347 12564 13612 13958 9400 3502 6824 346 -5490 -2488
$$ packed form
15780B6560P329L733q5J3005J1912K0658K2356K8635K5916J2373R222J4328J6849
15767B12791R792q611j5222j5421o582J4832L7563Q4073J48319J86908J01870
15756G50312j2899m7490p0324r3801r3555o5350m6999l4952k8302l3523l2325
15745A90792k5864l3861k6780k0110o729o301j4810j0104j0000p482j880K391
15733B9262j164J333r817n124O985Q115Q867O565J55K991k509n609q87n26j966
15718C6671k256J2586K1716K1105K3110L8543N4243N1539K9536M782k1877l1828
15706B37870l4724l4568l4308k8490k3614j7335j0674j3430r800q11k287m668
15694B3161n877n47j829J921j056l426K17J048L46m558n898L322o478n836L002
$$ plain form
15679 -2488 8120 15714 13863 6219 6979 2926 -2245 1697 -1468 -4218 -487 -58 -2131 4425 4566
15664 4566 5735 7281 3156 2466 -223 760 7709 14627 14021 9694 5170 -1076 -3238 -4739 -3412
15649 -3412 1095 301 6093 2791 -3610 -6754 -6663 -5508 -5304 -7740 -3438 455 2098 1254 76 -1018
15633 -1018 -2277 -3450 -2134 -571 -4906 -4948 2278 7387 7696 4654 457 -3439 -2430 2199 -4378
15618 -4378 -10950 -13524 -14248 -12715 -12229 -5188 -3786 -7575 -13431 -19566 -23743 -18159 -12582 -8098 -661
15603 -661 6152 7989 9109 8765 8834 12702 10825 6112 4212 1043 -3951 -13806 -16164 -9592 -4555 -1891
15587 -1891 248 -5220 -5747 -4356 -3792 -1151 3279 4 -1385 -4779 -7932 -9538 -2255 -4980 -10306
15572 -10306 -6892 -6741 -4369 -2758 -1181 2882 8116 9124 7006 -782 -3939 -6194 -1768 207 5583
$$ packed form
15679b488J0608P594j851p644P60m053n171L942l165k750L731M29k073O556J41
15664D566J169J546m125o90k689R83O949O918o06m327m524o246k162j501J327
15649c412M507p94N792l302o401l144R1J155K04k436M302L893J643q44j178j094
15633a018j259j173J316J563m335m2P226N109L09l042m197l896J009M629o577
15618d378o572k574p24J533M86P041J402l789n856o135m177N584N577M484P437
15603f61O813J837J120l44O9L868j877m713j900l169m994r855k358O572N037K664
15587a891K139n468n27J391N64K641M430l275j389l394l153j606P283k725n326
15572a0306L414J51K372J611J577M063N234J008k118p788l157k255M426J975N376
$$ plain form
15557 5583 4704 5085 7470 14154 12005 19533 29971 30295 33627 57031 84287 108347 141584 182736
15543 182736 211774 224858 245217 254798 261543 254708 236513 203891 176202 149604 126598 116219
15531 116219 107197 99366 98815 106608 128626 157064 184781 207977 225283 235202 238543 244412 246303
15518 246303 231472 203667 167480 131305 100275 78476 68983 52449 39071 30360 27698 21566
15506 21566 21965 15434 7591 9961 13115 15252 10028 7604 8644 8008 8047 6962 5118 6789 5972 4254
15490 4254 -567 -2397 -5354 -9753 -7716 -6895 -8589 -10419 -5233 -4424 -10441 -7860 -2435 -3096 -449
15475 -449 5313 9324 3551 -2969 -6064 -3208 541 6507 2886 -115 -3886 -7110 -8873 -671 1124
15460 1124 -2325 -792 2898 517 141 60 -746 -1840 -3887 -7529 -5867 -6713 -3489 -583 -4764 -4198
$$ packed form
15557E583q79L81K385O684k149P528J0438L24L332K3404K7256K4060L3237M1152
15543A82736K9038J3084K0359R581O745o835j8195l2622k7689k6598k3006j0379
15531A16219r022p831n51P793K2018K8438K7717K3196J7306R919L341N869J891
15518B46303j4831k7805l6187l6175l1030k1799r493j6534j3378q711k662o132
15506B1566L99o531p843K370L154K137n224k424J040o36L9j085j844J671q17j718
15490D254m821j830k957m399K037Q21j694j830N186Q09o017K581N425o61K647
15475d49N762M011n773o520l095K856L749N966l621l001l771l224j763Q202J795
15460A124l449J533L690k381l76q1q06j094k047l642J662q46L224K906m181N66
$$ plain form
15444 -4198 -1879 -10773 -6759 -1803 -3370 -8695 -12500 -10820 -9140 -9589 -9222 -5665 -503 -2284 -875
15429 -875 -3858 -4497 -639 -5051 -8430 -7472 -4180 2876 4734 5853 4099 3639 6831 3606 9804 13380
15413 13380 7557 9877 12771 9230 7515 7416 10571 13903 11644 2828 -5413 -8769 -8571 -7862 -10873
15398 -10873 -9249 -2437 2423 4048 36 95 5403 10378 12271 5310 -2075 -2615 -3546 -7748 -10138
15383 -10138 -11088 -8856 -4753 -2488 -1243 -599 -1011 1885 4580 1220 11846 10676 2651 925 -2787
15368 -2787 -1632 -167 540 -4263 -8679 -827 5805 2325 -2583 266 -8391 -13034 -1716 1039 -1850
15353 -1850 -6280 -7170 -822 -5677 -10154 -14557 -16581 -10675 -4029 -4481 -2196 -134 -671 714 -4564
15338 -4564 -5334 -1491 1308 2792 4083 3853 1923 2867 -397 -4979 -1311 1089 5740 7656 5307
$$ packed form
15444d198K319q894M014M956j567n325l805J680J680m49L67L557N162j781J409
15429h75k983o39L858m412l379R58L292P056J858J119j754m60L192l225O198L576
15413A3380n823K320K894l541j715r9L155L332k259q816q241l356J98P09l011
15398a0873J624O812M860J625m012N9N308M975J893o961p385n40r31m202k390
15383a0138r50K232M103K265J245O44m12K896K695l360J0626j170q025j726l712
15368b787J155J465P07m803m416P852O632l480m908K849q657m643J1318K755k889
15353a850m430q90O348m855m477m403k024N906O646m52K285K062n37J385n278
15338d564p70L843K799J484J291k30j930R44l264m582L668K400M651J916k349
$$ plain form
15323 5307 -1262 -8262 -6150 -499 4417 -362 -5992 -1691 4385 2769 -768 -684 1338 1977 5089
15308 5089 6453 5794 9910 13890 9929 12733 7088 3252 -4544 -10635 -14448 -11397 -4780 -934 1084
15293 1084 1649 -3551 759 4474 -1015 3215 3287 -4482 -7854 -12391 -17326 -17333 -13806 -12740 -12251 -9895
15277 -9895 -5830 -3872 -8973 -1880 3018 4321 4674 4740 -23 -7027 -1444 -2405 -1365 236 -550 -6398
15261 -6398 -11919 -5618 3180 11473 5179 2100 1451 -2275 -5805 -2006 -6259 -10099 -7135 -4063 -4195
15246 -4195 -8046 -7510 -5002 -7555 -11448 -12608 -9597 -10277 -8862 -14752 -11502 -6450 -3208 -1805 -10890
15231 -10890 -21174 -21278 -13507 -9204 -2546 1096 413 2227 4261 3176 -3618 -4182 -2422 -4589 -4107
15216 -4107 -388 4893 1554 -7045 -8151 -929 4524 2690 1338 -3744 -6547 -4503 -3240 -1547 4853
$$ packed form
15323E307o569p000K112N651M916m779n630M301O076j616l537Q4K022O39L112
15308E089J364o59M116L980l961K804n645l836p796o091l813L051O617L846K018
15293A084N65n200M310L715n489M230P2p769l372m537m935pL527J066M89K356
15277i895M065J958n101P093M898J303L53O6m763p004N583r61J040J601p86n848
15261f398n521O301Q798Q293o294l079o49l726l530L799m253l840K964L072j32
15246d195l851N36K508k553l893j160L011o80J415n890L250N052L242J403r085
15231a0890j0284j04P771M303O658L642o83J814K034j085o794n64J760k167M82
15216d107L719N281l339q599j106P222N453j834j352n082k803K044J263J693O400
$$ plain form
15201 4853 672 -6879 -15685 -4733 1368 4105 7272 11782 11609 4244 1747 -1133 447 2085 4481
15186 4481 11286 10707 10733 10124 4900 1240 4676 11425 13516 9370 2014 7022 3690 644 -3614 2427
15170 2427 6693 7009 1666 -807 -1789 2388 7796 10840 9379 2946 6518 2530 -5870 -3093 842
15155 842 4834 7865 11178 12294 8785 4021 2411 461 342 -2435 -7190 -4186 -6601 -6262 -4774
15140 -4774 82 2874 3736 5447 6021 2113 2389 915 -2601 401 -2764 -8357 -8755 -2228 -1269 2077
15124 2077 1557 -2642 -4293 511 1886 6677 2267 -588 7405 9729 8873 7636 8653 13076 13677
15109 13677 8707 4210 4999 6551 -1515 -3020 -63 5478 4136 686 -723 -4945 3522 6492 -2655
15094 -2655 -2367 -471 -2608 1819 -1311 -7264 -8562 -7210 -5091 -2047 431 4703 -1187 -1543 -2457
$$ packed form
15201D853m181p551q806J0952O101K737L167M510j73p365k497k880J580J638K396
15186D481O805n79K6o09n224l660L436O749K091m146p356N008l332l046m258O041
15170B427M266L16n343k473r82M177N408L044j461o433L572l988q400K777L935
15155H42L992L031L313J116l509m764j610j950j19k777m755L004k415L39J488
15140d774M856K792Q62J711N74l908K76j474l516L002l165n593l98O527R59L346
15124B077n20m199j651M804J375M791m410k855P993K324q56j237J017M423O01
15109A3677m970m497P89J552q066j505K957N541j342l450j409m222Q467K970r147
15094b655K88J896k137M427l130n953j298J352K119L044K478M272n890l56r14
$$ plain form
15079 -2457 -3692 -4398 -3695 -2856 317 2483 4748 6117 5792 6670 4483 -1778 -2184 -781 40 1607
15063 1607 283 -7455 -9285 -5475 -7846 -4671 -2363 -5801 -3758 -5650 -4695 -2054 2113 7213 6068
15048 6068 410 278 181 -2774 829 10156 15478 10228 4342 -1841 -743 -4577 -4597 778 -704 -892
15032 -892 -2664 -7478 -5082 1061 6356 1042 -2118 -1552 -1196 -4971 3556 6770 9967 7674 6610
15017 6610 5842 2339 4759 444 2022 3535 2314 170 -9670 -5522 -5215 -1561 2610 9685 10723
15002 10723 11006 10669 6660 10258 7448 4249 10152 5995 -3011 -1439 -115 738 6034 10511 5793
14987 5793 8234 12622 11021 12383 8983 9200 8179 6328 -968 -1672 4178 7074 1286 1553 2600
14972 2600 5620 6695 7885 11506 11121 287 -5072 -5516 2140 2535 6701 10577 8714 5175 -2424
$$ packed form
15079b457j235p06P03Q39L173K166K265J369l25Q78k187o261m06J403Q21J567
15063A607j324p738j830L810k371L175K308l438K043j892R55K641M167N100j145
15048F068n658j32r7k955L603R327N322n250n886o183J098l834k0N375j482j88
15032h92j772m814K396O143N295n314l160N66L56l775Q527L214L197k293j064
15017F610p68l503K420m315J578J513j221k144r840M148L07L654M171P075J038
15002A0723K83l37m009L598k810l199N903m157r006J572J324Q53N296M477m718
14987E793K441M388j601J362l400K17j021j851p296p04N850K896n788K67J047
14972B600L020J075J190L621l85j0834n359m44P656L95M166L876j863l539p599
$$ plain form
14957 -2424 -3035 5708 11308 15017 12474 694 -7100 -4640 -3327 -5055 -5660 -4719 -297 4621 -870
14942 -870 -2379 -1176 1471 2639 1792 -1989 -2155 1412 4534 3704 3104 3444 5556 6578 3094 -2838
14926 -2838 -5049 7431 14360 10183 11496 9939 8362 9840 11732 4352 4917 4179 5043 3521 1742
14911 1742 2940 197 -1065 -4482 -10832 -6323 -2480 -3600 1621 2245 3980 4490 3495 4062 7930 3372
14895 3372 6732 9760 2074 -5205 -2775 2426 8260 9764 5038 488 -2413 -715 -749 -6141 5010
14880 5010 13226 13651 11879 9005 16073 13803 11172 8391 7212 13229 17420 13178 7602 5318 4376
14865 4376 6617 3343 6980 10974 8152 1443 -961 8245 13392 10387 12359 13859 9055 4662 5888
14850 5888 4700 8020 13557 11422 5273 5379 6836 12788 13711 11860 9540 3936 -132 -8774 -11190
$$ packed form
14957b424o11Q743N600L709k543j1780p794K460J313j728o05R41M422M918n491
14942h70j509J203K647J168q47l781j66L567L122q30o00L40K112J022l484n932
14926b838k211J2480O929m177J313j557j577J478J892p380N65p38Q64j522j779
14911A742J198k743j262l417o350M509L843j120N221O24J735N10r95N67L868m558
14895C372L360L028p686p279K430N201N834J504m726m550k901J698l4n392J1151
14880E010Q216M25j772k874P068k270k631k781j179O017M191m242n576k284r42
14865D376K241l274L637L994k822o709k404R206N147l005J972J500m804m393J226
14850E888j188L320N537k135o149J06J457N952R23j851k320n604m068q642k416
$$ plain form
14835 -11190 -2363 2080 -43 3776 9381 5540 1647 -1569 -419 -3489 -2870 -3810 -3914 186 -3132
14820 -3132 -12203 -14580 -11782 1836 4349 145 -3326 -3934 -976 1413 1967 1085 -193 -1685 -917
14805 -917 4968 9513 10905 7955 7554 4282 2904 -736 2480 -888 1223 1929 6884 14114 11005
14790 11005 10220 13092 12432 7498 1556 -2482 1742 3209 -2112 3226 6094 6131 152 2315 6584
14775 6584 4708 3424 5059 5195 3146 830 -3848 -4498 -7210 -6041 1450 8468 13580 11054 8285
14760 8285 3557 9021 6515 4815 664 648 7821 11887 8517 4381 6464 6284 10653 11939 11328 12031
14744 12031 11740 13326 3764 -3606 -524 8099 12822 12689 5995 9089 6800 5952 10700 8179 7143
14729 7143 10494 13103 5650 9363 14612 8210 6049 9297 8971 9726 9138 9883 8727 3987 453 6322
$$ packed form
14835a1190Q827M443k123L819N605l841l893l216J150l070O19r40j04M100l318
14820c132r071k377K798J3618K513m204l471o08K958K389N54q82j278j492P68
14805i17N885M545J392k950m01l272j378l640L216l368K111P06M955P230l109
14790A1005p85K872o60m934n942m038M224J467n321N338K868L7n979K163M269
14775F584j876j284J635J36k049k316m678o50k712J169P491P018N112k526k769
14760H285m728N464k506j700m151j6P173M066l370m136K083j80M369J286o11P03
14744A2031k91J586r562p370L082Q623M723j33o694L094k289q48M748k521j036
14729G143L351K609p453L713N249o402k161L248l26P55n88P45j156m740l534N869
$$ plain form
14713 6322 5217 9030 11654 9551 12343 12388 9074 15654 21163 20629 25530 22438 14710 11040 9791
14698 9791 7400 4945 5402 14279 14538 11351 13356 15141 18892 12271 17251 19406 13484 12571 15175
14683 15175 13996 18329 20419 24228 25183 20262 13825 14803 19534 20820 16093 10611 11685 13467 14792
14668 14792 12213 9349 4587 5669 9819 6270 5097 11695 13013 13507 15539 20919 17434 18646 18555
14653 18555 24396 22554 20139 19684 22099 25738 27397 26184 24063 21556 15557 14846 18530 19923 20566
14638 20566 21718 16278 9207 11948 17855 23564 26068 23789 16101 12574 17224 14172 8408 11291
14624 11291 13280 11978 10772 7559 11906 19462 19177 18905 17901 19720 25556 24235 20912 28397 29402
14609 29402 27167 23397 19446 22850 20480 23948 29249 26373 20526 17096 18761 22949 23928 23296 26663
$$ packed form
14713F322j105L813K624k103K792M5l314O580N509n34M901l092p728l670j249
14698I791k391k455M57Q877K59l187K005J785L751o621M980K155n922r13K604
14683A5175j179M333K090L809R55m921o437R78M731J286m727n482J074J782J325
14668A4792k579k864m762J082M150l549j173O598J318M94K032N380l485J212r1
14653A8555N841j842k415m55K415L639J659j213k121k507n999p11L684J393O43
14638B0566J152n440p071K741N907N709K504k279p688l527M650l052n764K883
14624A1291J989j302j206l213M347P556k85k72j004J819N836j321l323P485J005
14609B9402k235l770l951L404k370L468N301k876n847l430J665M188R79o32L367
$$ plain form
14594 26663 35242 39208 31484 21676 15813 14342 17540 20294 19095 18349 17977 17078 17865 21112 21866 15087
14578 15087 8585 8116 15054 17316 18056 21224 25639 23238 21149 21798 20795 12494 16918 23927 20959
14563 20959 19830 24871 21204 20787 22977 22146 24220 21386 14992 19808 18948 20218 21163 19309 20414
14548 20414 23242 18789 21748 19070 13498 15327 16709 13549 15512 19298 17626 14642 16254 17335
14534 17335 11491 13208 19134 24564 20963 19704 18545 19851 19927 23299 20116 23750 27718 30191 36110
14519 36110 40654 33595 33765 34088 43298 45177 42792 33872 27108 22576 17792 17014 25469 29185 26418
14504 26418 22351 24866 25379 25909 26268 32373 31364 27573 27304 20640 19832 21447 17380 13283 15454 23138
14488 23138 23483 17826 21372 26932 26702 20597 16036 23374 21330 19973 27163 24486 26831 26268 23476
$$ packed form
14594B6663Q579L966p724r808n863j471L198K754j199p46l72q99P87L247P54o779
14578A5087o502m69O938K262P40L168M415k401k089O49j003q301M424P009k968
14563B0959j129N041l667m17K190q31K074k834o394M816q60J270R45j854J105
14548B0414K828m453K959k678n572J829J382l160J963L786j672k984J612J081
14534A7335n844J717N926N430l601j259j159J306P6L372l183L634L968K473N919
14519C6110M544p059J70L23R210J879k385q920o764m532m784p78Q455L716k767
14504B6418m067K515N13N30L59O105j009l791k69o664q08J615m067m097K171P684
14488B3138L45n657L546N560k30o105m561P338k044j357P190k677K345n63k792
$$ plain form
14473 23476 27251 26831 23440 18394 17739 21524 22606 22243 16556 15398 14429 11603 10922 18699 17562 16556
14457 16556 12355 14079 15568 12380 12598 17064 20159 20194 19538 17417 18612 24819 32345 30771 33173
14442 33173 33752 28570 24519 22538 28063 21689 22260 28120 20832 17932 23101 27176 28167 27798 29873
14427 29873 28589 23483 18904 20299 29024 33005 32339 27713 28929 32333 34281 32762 26499 19750 13565
14412 13565 23506 22839 11382 15964 24053 26908 30699 29337 26542 19084 23255 19847 21594 20334
14398 20334 22787 27480 24489 23458 26932 27908 30948 33916 35997 25933 22407 20018 18287 21863
14384 21863 23907 25381 24171 21251 17578 20243 30431 33849 32734 28437 29224 28598 23560 23555 23125 21197
14368 21197 20121 26125 29612 32440 30854 37168 37872 31956 31030 33959 30101 31620 28503 19502 20070
$$ packed form
14473B3476L775m20l391n046o55L785J082l63n687j158r69k826o81P777j137j006
14457A6556m201J724J489l188K18M466L095L5o56k121J195O207P526j574K402
14442C3173N79n182m051j981N525o374N71N860p288k900N169M075R91l69K075
14427B9873j284n106m579J395Q725L981o66m626J216L404J948j519o263o749o185
14412A3565R941o67j1457M582Q089K855L791j362k795p458M171l408J747j260
14398B0334K453M693k991j031L474R76L040K968K081j0064l526k389j731L576
14384B1863K044J474j210k920l673K665J0188L418j115m297P87o26n038nm30j928
14368B1197j076O004L487K828j586O314P04n916r26K929l858J519l117r001N68
$$ plain form
14353 20070 17782 19346 22475 21402 29916 32742 31729 28092 26877 24626 16900 12436 12196 21540 32401
14338 32401 36935 38234 47813 47372 41773 34257 23159 20996 27548 33483 34401 31912 30681 27775 29521
14323 29521 21710 21454 26755 28206 31985 35415 36761 36378 35939 35713 41136 41330 45544 46684 37475 27702
14307 27702 29209 33616 36913 37260 42415 50625 56038 58436 52336 44618 44394 55763 52042 42435 37967
14292 37967 40463 48978 55668 54763 53128 53375 60574 61887 63224 71061 85298 101090 125089 155646
14278 155646 183384 199552 198911 194153 189150 171374 149177 132478 116292 103710 98883 88947 84506
14265 84506 86380 86657 89644 105770 130836 158945 183267 196922 197560 186088 167654 152098 131064
14252 131064 115534 104482 89482 71458 63088 59870 57065 53933 52039 52932 53184 50859 49887 58383
$$ packed form
14353B0070k288J564L129j073Q514K826j013l637j215k251p726m464k40R344J0861
14338C2401M534J299R579m41n599p516j1098k163O552N935R18k489j231k906J746
14323B9521p811k56N301J451L779L430J346l83m39k26N423J94M214J140r209r773
14307B7702J507M407L297L47N155Q210N413K398o100p718k24J1369l721r607m468
14292C7967K496Q515O690r05j635K47P199J313J337P837J4237J5792K3999L0557
14278A55646K7738J6168o41m758n003j7776k2197j6699j6186j2582m827r936m441
14265H4506J874K77K987J6126K5066K8109K4322J3655O38j1472j8434j5556k1034
14252A31064j5530j1052j5000j8024q370l218k805l132j894Q93K52k325r72Q496
$$ plain form
14238 58383 60469 54574 53392 56323 59272 54671 56222 58064 48574 43043 44662 45869 47990 52625
14224 52625 55538 57534 52096 50273 47134 49868 54926 56388 53362 54401 51833 49524 50303 52361 46282
14209 46282 42361 47441 50571 47732 44198 41831 39825 45680 45814 48978 54340 47412 38037 37046 44830
14194 44830 40663 41761 47246 44000 46194 54743 55234 54195 49855 49217 52503 47827 44145 40998 44212
14179 44212 48545 56470 60084 56438 57644 53049 51132 54332 54298 56910 57165 59202 64273 59816 61187
14164 61187 65613 61994 57725 61881 64037 59171 67724 74450 78431 73565 62505 62316 56344 56582 55492
14149 55492 56838 60478 62626 59074 54477 57550 68625 75558 67221 65859 68374 64265 58749 60546
14135 60546 66293 68547 68676 72152 76168 74886 75120 67788 66066 72899 71551 70772 71518 77495 84260
$$ packed form
14238E8383K086n895j182K931K949m601J551J842r490n531J619J207K121M635
14224E2625K913J996n438j823l139K734N058J462l026J039k568k309P79K058o079
14209D6282l921N080L130k839l534k367k006N855J34L164N362o928r375r91P784
14194D4830m167J098N485l246K194Q549M91j039m340o38L286m676l682l147L214
14179D4212M333P925L614l646J206m595j917L200l4K612K55K037N071m457J371
14164F1187M426l619m269M156K156m866Q553O726L981m866j1060j89n972K38j090
14149E5492J346L640K148l552m597L073J1075O933q337j362K515m109n516J797
14135F0546N747K254J29L476M016j282K34p332j722O833j348p79P46N977O765
$$ plain form
14120 84260 80773 81522 84452 80172 75525 76379 80285 72541 78145 82135 86047 88281 87073 89264 87651
14105 87651 88243 89900 89774 83592 81081 80509 81373 74416 72039 70708 75707 82770 84677 80139 84857
14090 84857 93196 94382 95358 86562 78205 80269 78628 81361 83101 84778 91464 97176 93982 94498 93162
14075 93162 92177 92889 94220 93254 94730 98827 102212 99445 100615 101645 99424 98781 101890 97918 96432
14060 96432 95191 94302 95204 95533 98985 98128 98133 109789 112176 106727 109570 103159 91976 88613 90246 89768
14044 89768 98907 102203 96560 94076 91734 96172 94047 89352 93081 97958 96277 94341 102721 111035
14030 111035 109935 109409 107530 108658 103597 110622 115763 114388 111658 112866 108266 109361 115781 121235
14016 121235 122868 120504 117903 119750 125390 126517 124266 118549 125082 129390 134767 137495 139163 136255
$$ packed form
14120H4260l487P49K930m280m647Q54L906p744N604L990L912K234j208K191j613
14105H7651N92J657j26o182k511n72Q64o957k377j331M999P063J907m538M718
14090H4857Q339J186R76q796q357K064j641K733J740J677O686N712l194N16j336
14075I3162r85P12J331r66J476M097L385k767J170J030k221o43L109l972j486
14060I6432j241q89R02L29L452q57NJ1656K387n449K843o411j1183l363J633m78
14044H9768R139L296n643k484k342M438k125m695L729M877j681j936Q380Q314
14030A11035j100n26j879J128n061P025N141j375k730J208m600J095O420N454
14016A21235J633k364k601J847N640J127k251n717O533M308N377K728J668k908
$$ plain form
14002 136255 131254 128505 132691 135369 138757 138383 138105 135052 136591 138513 139176 141904 139591 140545 148439
13987 148439 150452 151096 150166 152118 148718 142387 147314 155030 157638 162620 161182 164935 168002 168315 177364
13972 177364 176772 169645 169118 169916 169433 179922 184030 179013 172242 177700 183679 179797 181075 188534 196968
13957 196968 197541 195954 194193 192955 193704 192051 190728 189490 188169 189414 193242 206331 205027 203038
13943 203038 204545 203661 198328 200623 207325 212016 212177 215109 220248 219105 215180 217968 215371 218533 230559
13928 230559 236621 242475 243712 239334 235782 237348 241618 244004 247145 242907 243379 243865 242930 241724 245510
13913 245510 252905 249736 247657 253313 258845 265017 272709 272228 269859 269523 269029 257319 250092 256518 270669
13898 270669 275518 269618 269305 272958 272877 276074 281490 288058 292246 298356 298726 297225 303100 301500 300844
$$ packed form
14002A36255n001k749M186K678L388l74k78l053J539J922O63K728k313R54P894
13987A48439K013O44r30J952l400o331M927P716K608M982j438L753L067L13R049
13972A77364n92p127n27P98m83J0489M108n017o771N458N979l882J278P459Q434
13957A96968N73j587j761j238P49j653j323j238j321J245L828J3089j304j989
13943B03038J507q84n333K295O702M691J61K932N139j143l925K788k597L162J2026
13928B30559O062N854J237m378l552J566M270K386L141m238M72M86r35j206L786
13913B45510P395l169k079N656N532O172P692m81k369l36m94j1710p227O426J4151
13898B70669M849n900l13L653q1L197N416O568M188O110L70j501N875j600o56
$$ plain form
13883 300844 306489 313806 320521 330597 338419 347424 348832 353039 358045 363419 371462 375266 378463 385133
13869 385133 401546 408124 407520 407916 417202 424777 434600 442849 450400 460046 469483 475565 478450 482657
13855 482657 494859 507531 510888 517873 536980 552313 567584 572052 578643 594867 610265 626147
13843 626147 635856 646661 657987 671652 681976 695554 711301 722188 727795 728333 731453 744839
13831 744839 756803 770815 787973 798803 809964 818950 827814 844439 860935 876419 889543 902020
13819 902020 910198 923963 943587 960663 983687 1002236 1021451 1043190 1059843 1070769 1097162 1124341
13807 1124341 1146370 1164461 1185792 1215011 1246203 1275243 1312714 1348287 1376639 1406312 1439852
13796 1439852 1475665 1518055 1558172 1598874 1640888 1677587 1722789 1774488 1823216 1877038 1930778
$$ packed form
13883C00844N645P317O715J0076P822R005J408M207N006N374Q043L804L197O670
13869C85133J6413O578o04L96R286P575R823Q249P551R646R437O082K885M207
13855D82657J2202J2672L357O985J9107J5333J5271M468O591J6224J5398J5882
13843F26147R709J0805J1326J3665J0324J3578J5747J0887N607N38L120J3386
13831G44839J1964J4012J7158J0830J1161Q986Q864J6625J6496J5484J3124J2477
13819I02020Q178J3765J9624J7076K3024J8549J9215K1739J6653J0926K6393K7179
13807A124341K2029J8091K1331K9219L1192K9040L7471L5573K8352K9673L3540
13796A439852L5813M2390M0117M0702M2014L6699M5202N1699M8728N3822N3740
$$ plain form
13785 1930778 1981512 2039679 2101449 2170704 2241843 2312865 2392486 2485545 2567836 2646964 2741197
13774 2741197 2838253 2943991 3050137 3158290 3273600 3398986 3538558 3682974 3834658 3999800
13764 3999800 4172559 4357914 4549135 4756725 4976544 5214479 5471197 5732740 6015868
13755 6015868 6327161 6660358 7015616 7396497 7812456 8260387 8747065 9272124 9839032
13746 9839032 10457375 11139111 11876476 12678944 13563402 14534270 15595231 16743539 18003478
13737 18003478 19373138 20875309 22508728 24277043 26193923 28250016 30434187 32725367
13729 32725367 35092121 37502018 39902256 42215361 44356726 46247765 47810057 48957820
13721 48957820 49645710 49830121 49505603 48705156 47464362 45854278 43953904 41829738 39573086
$$ packed form
13785A930778N0734N8167O1770O9255P1139P1022P9621R3059Q2291P9128R4233
13774B741197R7056J05738J06146J08153J15310J25386J39572J44416J51684J65142
13764C999800J72759J85355J91221K07590K19819K37935K56718K61543K83128
13755F015868L11293L33197L55258L80881M15959M47931M86678N25059N66908
13746I839032O18343O81736P37365Q02468Q84458R70868J060961J148308J259939
13737A8003478J369660J502171J633419J768315J916880K056093K184171K291180
13729C2725367K366754K409897K400238K313105K141365J891039J562292J147763
13721D8957820O87890J84411l24518q00447j240794j610084j900374k124166k256652
$$ plain form
13712 39573086 37253633 34919988 32620950 30394859 28260442 26250560 24376299 22630487
13704 22630487 21011588 19517578 18144524 16881082 15719432 14653250 13682096 12791049
13696 12791049 11972023 11223959 10538305 9918891 9341321 8803404 8308497 7848730 7433586
13687 7433586 7047922 6684523 6347438 6031779 5746119 5473862 5220118 4989049 4775374
13678 4775374 4567075 4371565 4189485 4015218 3851644 3699723 3562178 3438083 3311579
13669 3311579 3192606 3089436 2982327 2877095 2780310 2689156 2598071 2512368 2439433 2360935
13659 2360935 2278794 2205865 2143081 2076641 2010189 1958130 1906791 1853686 1803335 1753102 1709739
13648 1709739 1666933 1624976 1584666 1547149 1506873 1458767 1427423 1404430 1364662 1328313 1296632
$$ packed form
13712C9573086k319453k333645k299038k226091k134417k009882j874261j745812
13704B2630487j618899j494010j373054j263442j161650j066182r71154q91047
13696A2791049q19026p48064o85654o19414n77570n37917m94907m59767m15144
13687G433586l85664l63399l37085l15659k85660k72257k53744k31069k13675
13678D775374k08299j95510j82080j74267j63574j51921j37545j24095j26504
13669C311579j18973j03170j07109j05232r6785r1154r1085q5703p2935p8498
13659B360935q2141p2929o2784o6440o6452n2059n1339n3105n0351n0233m3363
13648A709739m2806m1957m0310l7517m0276m8106l1344k2993l9768l6349l1681
$$ plain form
13637 1296632 1274270 1244998 1213248 1184753 1162866 1137635 1117021 1093163 1068037 1046934 1027628
13626 1027628 1005709 987084 965763 947717 937297 926457 911305 890715 873302 856887 841597
13615 841597 828021 821782 813003 806045 795168 782324 771130 766283 760636 747638 731964 719710
13603 719710 709636 704768 695316 682869 674022 668977 664205 659055 647393 634276 619990 602075 590212
13590 590212 588181 576564 562787 557037 547815 537995 531128 525584 512816 506015 499760 495792 491793
13577 491793 483663 471164 462546 455287 448875 445713 442719 439260 436636 434122 428506 427635 424219 418581
13563 418581 412358 412054 414590 409907 405518 396668 387623 383951 377246 374033 370188 360808 354741 351781
13549 351781 345272 336660 330905 334025 334833 335441 334641 330041 322691 308495 308519 303057 291033 285457 283754
$$ packed form
13637A296632k2362k9272l1750k8495k1887k5231k0614k3858k5126k1103j9306
13626A027628k1919j8625k1321j8046j0420j0840j5152k0590j7413j6415j5290
13615H41597j3576o239q779o958j0877j2844j1194m847n647j2998j5674j2254
13603G19710j0074m868r452j2447q847n045m772n150j1662j3117j4286j7915j1863
13590E90212k031j1617j3777n750r222r820o867n544j2768o801o255l968l999
13577D91793q130j2499q618p259o412l162k994l459k624k514n616q71l416n638
13563D18581o223l04K536m683m389q850r045l672o705l213l845r380o067k960
13549C51781o509q612n755L120Q08O08q00m600p350j4196K4n462j2024n576j703
$$ plain form
13534 283754 290767 287246 276136 263598 257389 252915 255836 256548 258105 249265 240310 238509 242402 236357
13520 236357 237071 236481 236521 234925 232116 226844 227655 224489 227110 226169 224206 222654 218840 213487 213959 217646
13504 217646 210785 207144 201010 193912 196614 197802 197860 199037 201937 206110 209114 209691 206860 206083 205265
13489 205265 207216 203533 195693 189100 185926 184064 186216 182951 179822 174228 169305 171750 174960 180180
13475 180180 186362 180572 175524 178647 176086 170640 169940 168347 164207 154308 149762 150801 149693 146942
13461 146942 150706 151685 149613 149505 150350 146153 139952 141492 146187 145645 143376 144728 139882 134817 132361
13446 132361 137475 139175 140718 131891 129845 128937 132625 135142 135484 133109 126086 126137 123404 120423 121509
13431 121509 124539 124010 127824 126049 134639 139938 135137 130173 127406 120544 112223 107441 111138 117020
$$ packed form
13534B83754P013l521j1110j2538o209m474K921P12J557q840q955j801L893o045
13520B36357P14n90M0j596k809n272Q11l166K621r41j963j552l814n353M72L687
13504B17646o861l641o134p098K702J188N8J177K900M173L004N77k831p77q18
13489B05265J951l683p840o593l174j862K152l265l129n594m923K445L210N220
13475A80180O182n790n048L123k561n446p00j593m140r899m546J039j108k751
13461A46942L764R79k072j08Q45m197o201J540M695n42k269J352m846n065k456
13446A32361N114J700J543q827k046r08L688K517L42k375p023N1k733k981J086
13431A21509L030n29L814j775Q590N299m801m964k767o862q321m782L697N882
$$ plain form
13417 117020 122579 121739 120778 120446 118183 115703 119164 118785 118420 117585 112070 105287 103862 105470 110831 117613
13401 117613 118310 113540 109651 112346 114123 108384 109815 107703 99875 98156 96845 98363 96403 89850
13387 89850 86418 85580 81234 81376 85200 92581 90976 85284 85970 85187 87714 94814 92984 89078 84752
13372 84752 82276 83913 83564 82785 85447 86328 84801 84929 86900 87074 86870 88278 85252 83634 81044 81598
13356 81598 86775 85508 78516 74868 75001 70769 68121 70695 71810 69084 70724 78183 82049 79999 81704
13341 81704 85101 88404 85866 82685 82903 85454 87372 91128 89553 89362 91768 87361 85732 89757 96818
13326 96818 98800 105426 104584 108654 113326 115872 118568 118542 114305 113656 115007 114939 119981 117377 110011 104885
13310 104885 111189 113896 108447 105861 99535 96044 89693 81696 74162 76859 81814 76653 72779 68831
$$ packed form
13417A17020N559q40r61l32k263k480L461l79l65q35n515o783j425J608N361O782
13401A17613O97m770l889K695J777n739J431k112p828j719j311J518j960o553
13387H9850l432q38m346J42L824P381j605n692O86p83K527P100j830l906m326
13372H4752k476J637l49p79K662Q81j527J28J971J74k04J408l026j618k590N54
13356H1598N177j267o992l648J33m232k648K574J115k726J640P459L866k050J705
13341H1704L397L303k538l181K18K551J918L756j575j91K406m407j629M025P061
13326I6818J982O626q42M070M672K546K696k6m237o49J351o8N042k604p366n126
13310A04885O304K707n449k586o326l491o351p997p534K697M955n161l874l948
$$ plain form
13296 68831 73390 76922 77628 77657 75306 78593 82513 78655 76287 74116 69545 64971 66249 66312 67391 68233
13280 68233 66043 62394 65102 67538 71278 71835 65057 63196 65549 62427 61326 61405 60303 63798 65644
13265 65644 65390 53237 55482 59485 58969 64354 68321 65157 62963 62360 63803 69786 73015 77108 71813
13250 71813 71410 71112 73075 74142 68225 67590 65059 66783 66241 65891 62957 68076 67615 65451 67447 74970
13234 74970 75668 79011 77926 74895 69446 66799 64876 72182 74871 71975 69203 69736 72261 70255 71733
13219 71733 72222 62983 68455 71920 65581 61081 67112 69804 72432 68970 68413 69709 72604 69599 64793
13204 64793 63548 73668 75935 80947 79320 69903 68310 70853 69134 64142 61247 64252 60881 64368
13190 64368 66379 63208 65202 64702 68561 70919 72530 70772 68118 71254 67733 64828 64891 64278 69453
$$ packed form
13296F8831M559L532P06K9k351L287L920l858k368k171m571m574J278O3J079Q42
13280F8233k190l649K708K436L740N57o778j861K353l122j101P9j102L495J846
13265F5644k54j2153K245M003n16N385L967l164k194o03J443N983L229M093n295
13250G1813m03k98J963J067n917o35k531J724n42l50k934N119m61k164J996P523
13234G4970O98L343j085l031n449k647j923P306K689k896k772N33K525k006J478
13219G1733M89r239N472L465o339m500O031K692K628l462n57J296K895l005m806
13204F4793j245J0120K267N012j627r417j593K543j719m992k895L005l371L487
13190F4368K011l171J994n00L859K358J611j758k654L136l521k905O3o13N175
$$ plain form
13175 69453 71226 71927 67758 65392 63681 58039 62495 73210 84702 89288 83527 77839 73750 66268
13161 66268 68928 78533 77543 77106 71199 62404 61116 65678 68622 69771 71032 69699 62691 63801 61142
13146 61142 56821 55192 61022 67470 76421 76525 69820 67842 69430 67433 62240 60162 62626 63961 65336
13131 65336 65291 59639 57047 65992 68079 70512 66416 59444 58684 55888 52270 55188 59156 62794 65671
13116 65671 59729 60045 62410 52510 54079 63392 67595 63989 57829 55109 51306 52737 56281 56851 50776
13101 50776 52347 55999 58061 53877 55548 60183 55009 59224 61963 61240 56042 55427 61809 64298 61575
13086 61575 61904 65219 64208 64386 68904 69869 62431 56875 57776 60300 62218 61251 61296 58991 57294 53354
13070 53354 54747 60150 60720 53667 55607 60356 63501 60194 52087 52703 57602 61818 58777 56853 57996
$$ packed form
13175F9453J773P01m169k366j711n642M456J0715J1492M586n761n688m089p482
13161F6268K660R605r90m37n907q795j288M562K944J149J261j333p008J110k659
13146F1142m321j629N830O448Q951J04o705j978J588j997n193k078K464J335J375
13131F5336m5n652k592Q945K087K433m096o972p60k796l618K918L968L638K877
13116F5671n942L16K365r900J569R313M203l606o160k720l803J431L544N70o075
13101E0776J571L652K062m184J671M635n174M215K739p23n198o15O382K489k723
13086F1575L29L315j011J78M518R65p438n556R01K524J918r67M5k305j697l940
13070E3354J393N403N70p053J940M749L145l307q107O16M899M216l041j924J143
$$ plain form
13055 57996 57147 55510 52484 59076 62730 66185 69179 72573 76723 81621 85236 93102 92857 91044 89320
13040 89320 79199 72808 72439 71866 68618 62874 60047 61171 60733 62536 61469 58744 56938 59313 59488
13025 59488 58719 60543 61295 59345 62121 59607 58863 60712 63459 67474 70243 74859 81714 85870 92474
13010 92474 88130 88792 90823 90563 77099 70454 71751 76566 77293 72804 69510 65266 62347 56828 57797
12995 57797 64230 71137 74283 72666 65415 60498 63856 70122 65605 64915 62414 63942 63619 66306 76066
12980 76066 80700 75735 72146 72939 72312 66912 67403 70653 69203 67372 64558 61561 62571 61646 59345
12965 59345 60278 56881 50654 51253 54868 50652 53863 69688 73991 73287 69340 72284 68303 64728 60569
12950 60569 56064 58661 58933 55031 60019 61584 57646 51819 46371 45607 47817 48355 50748 52332 49563
$$ packed form
13055E7996q49j637l026O592L654L455K994L394M150M898L615P866k45j813j724
13040H9320j0121o391l69n73l248n744k827J124m38J803j067k725j806K375J75
13025E9488p69J824P52j950K776k514p44J849K747M015K769M616O855M156O604
13010I2474m344O62K031k60j3464o645J297M815P27m489l294m244k919n519R69
12995E7797O433O907L146j617p251m917L358O266m517o90k501J528l23K687R760
12980G6066M634m965l589P93o27n400M91L250j450j831k814k997J010r25k301
12965E9345R33l397o227N99L615m216L211J5825M303p04l947K944l981l575m159
12950F0569m505K597K72l902M988J565l938n827n448p64K210N38K393J584k769
$$ plain form
12935 49563 46855 51175 51420 47269 48608 52078 53135 50103 50165 55234 59396 58934 63018 62150 61631 66265
12919 66265 63786 61945 62797 54961 54467 54260 58748 66609 70687 69986 72397 78460 76567 69591 64001
12904 64001 63015 64228 63405 61028 61248 65748 77934 87757 100032 109473 108190 114187 111309 108492 115074
12889 115074 122950 129480 133873 132614 136518 143259 151773 165801 176813 186628 205943 233351 265606
12876 265606 300087 336410 382401 444869 523921 612403 702331 780501 827211 852572 862160 883848
12864 883848 939775 1056677 1240347 1453782 1611181 1656876 1576986 1410950 1213232 1007384
12854 1007384 817203 656149 532358 436637 362292 309718 268493 233687 203051 181264 168484
12843 168484 161189 153968 151254 151392 159188 157080 151032 149209 150970 151027 155390 157097 153905 151399 144640
$$ packed form
12935D9563k708M320K45m151J339L470J057l032O2N069M162m62M084q68n19M634
12919F6265k479j841Q52p836m94k07M488P861M078p01K411O063j893o976n590
12904F4001r86J213q23k377K20M500J2186R823J2275R441j283N997k878k817O582
12889A15074P876O530M393j259L904O741Q514J4028J1012R815J9315K7408L2255
12876B65606L4481L6323M5991O2468P9052Q8482Q9928P8170M6710K5361R588K1688
12864H83848N5927J16902J83670K13435J57399M5695p9890j66036j97718k05848
12854A007384j90181j61054j23791r5721p4345n2574m1225l4806l0636k1787j2780
12843A68484p295p221k714J38P796k108o048j823J761N7M363J707l192k506o759
$$ plain form
12828 144640 139128 135770 131822 124396 122353 119868 117140 116854 116680 114216 109049 115208 119223 121910 117505
12813 117505 117100 123838 128866 126740 126840 131869 125965 117142 108973 99196 96634 103390 104596 103440 95860
12798 95860 94606 88507 89447 88821 87797 84120 77337 69859 69800 80787 84793 80675 78189 77234 78818
12783 78818 84766 84328 83842 89910 94202 92378 92622 98174 98075 96770 106314 109294 113648 111717 110585 114641
12767 114641 123224 128276 132719 140541 137233 124711 110136 99820 87977 82181 82092 79936 79808 81188
12753 81188 78781 76826 80602 86993 91131 87245 89620 88379 79391 80741 91252 95714 95400 99528
12739 99528 102655 105668 110123 118532 130334 138413 154227 183298 217525 264229 331770 403640 477144
12726 477144 534089 552183 534320 500581 449310 395419 339024 290512 256699 226512 203346
$$ packed form
12828A44640n512l358l948p426k043k485k728k86j74k464n167O159M015K687m405
12813A17505m05O738N028k126J00N029n904q823q169r777k562O756J206j156p580
12798I5860j254o099R40o26j024l677o783p478n9J0987M006m118k486r55J584
12783G8818N948m38m86O068M292j824K44N552r9j305R544K980M354j931j132M056
12767A14641Q583N052M443P822l308j2522j4575j0316j1843n796q9k156j28J380
12753H1188k407j955L776O391M138l886K375j241q988J350J0511M462l14M128
12739I9528L127L013M455Q409J1802Q079J5814K9071L4227M6704O7541P1870P3504
12726D77144N6945J8094j7863l3739n1271n3891n6395m8512l3813l0187k3166
$$ plain form
12715 203346 191302 180517 170861 168219 164089 162839 156274 158955 164548 168403 175502 185251 197034
12702 197034 211131 225319 230341 229403 228724 229882 237047 255454 290259 330066 351094 341879 322964
12689 322964 295096 264889 239644 222582 212765 211439 215378 223595 240221 257181 278581 298614
12677 298614 327859 359466 394432 442831 501497 566850 648167 729542 803845 849939 861350
12666 861350 845992 802661 739212 670770 603112 542240 494541 451103 409040 377480 349919
12655 349919 326476 303846 284177 268678 254824 245238 238905 226405 218442 226867 232445 253400
12643 253400 265792 278691 300089 325826 366205 411585 471165 542533 624910 718427 820693
12632 820693 910908 975349 990919 970667 921528 862313 807701 745444 679945 609645 545117
$$ packed form
12715B03346j2044j0785r656k642m130j250o565K681N593L855P099R749J1783
12702A97034J4097J4188N022r38o79J158P165J8407L4805L9807K1028r215j8915
12689C22964k7868l0207k5245j7062r817j326L939Q217J6626J6960K1400K0033
12677B98614K9245L1607L4966M8399N8666O5353Q1317Q1375P4303M6094J1411
12666H61350j5358m3331o3449o8442o7658o0872m7699m3438m2063l1560k7561
12655C49919k3443k2630j9669j5499j3854r586o333j2500p963Q425N578K0955
12643B53400J2392J2899K1398K5737M0379M5380N9580P1368Q2377R3517J02266
12632H20693R0215O4441J5570k0252m9139n9215n4612o2257o5499p0300o4528
$$ plain form
12621 545117 486705 439741 409696 391789 375246 362077 343508 317776 290536 248064 213907
12610 213907 183991 160486 148974 146640 154731 167401 167611 171458 172362 166224 165422 167520 170916 181972
12596 181972 193757 206709 211923 208400 202173 188923 180045 169494 152441 138937 124839 110623
12584 110623 106619 115227 133784 156197 176405 202735 220016 232718 239784 241175 236961 243887 249259
12571 249259 261300 274161 285738 298542 310488 322980 321879 313333 304231 294871 290226 277202
12559 277202 261968 257069 247341 245234 253807 274655 308229 344616 376092 420417 469710 522162
12547 522162 565382 604765 618725 610830 593653 564973 528989 505525 500387 504862 520366 545529
12535 545529 579237 609852 647706 688140 746036 839631 966666 1128728 1337797 1562968 1747721
$$ packed form
12621E45117n8412m6964l0045j7907j6543j3169j8569k5732k7240m2472l4157
12610B13907k9916k3505j1512k334Q091J2670K10L847R04o138q02K098L396J1056
12596A81972J1785J2952N214l523o227j3250q878j0551j7053j3504j4098j4216
12584A10623m004Q608J8557K2413K0208K6330J7281J2702P066J391m214O926N372
12571B49259J2041J2861J1577J2804J1946J2492j101q546r102r360m645j3024
12559B77202j5234m899r728k107Q573K0848L3574L6387L1476M4325M9293N2452
12547E22162M3220L9383J3960p895j7177k8680l5984k3464n138M475J5504K5163
12535E45529L3708L0615L7854M0434N7896R3595J27035J62062K09069K25171J84753
$$ plain form
12524 1747721 1839019 1831715 1743317 1589413 1411775 1235570 1080109 949285 836820 752094
12514 752094 690020 639061 600866 573637 557159 535737 511805 505256 501559 498986 501570 507246
12502 507246 513071 521864 530340 540742 546621 561509 575977 595030 615728 635285 649189 659196
12490 659196 663961 663046 675100 689311 702866 722612 740636 767770 785573 801010 823031 830756
12478 830756 838176 853752 872856 907098 953050 1002758 1059148 1132774 1213176 1289294 1372985 1452895
12466 1452895 1524455 1595052 1674704 1770477 1871917 1988081 2111179 2233135 2378905 2544168
12456 2544168 2742221 2949164 3147776 3344143 3526724 3719653 3935636 4185113 4472175
12447 4472175 4816800 5237838 5753629 6377059 7129227 8039693 9184115 10642885 12510877
$$ packed form
12524A747721R1298p304q8398j53904j77638j76205j55461j30824j12465q4726
12514G52094o2074n0959l8195k7229j6478k1422k3932o549l697k573K584N676
12502E07246N825Q793Q476J0402N879J4888J4468J9053K0698J9557J3904J0007
12490F59196M765r15J2054J4211J3555J9746J8024K7134J7803J5437K2021P725
12478H30756P420J5576J9104L4242M5952M9708N6390P3626Q0402P6118Q3691P9910
12466A452895P1560P0597P9652R5773J01440J16164J23098J21956J45770J65263
12456B544168J98053K06943J98612J96367J82581J92929K15983K49477K87062
12447D472175L44625M21038N15791O23430P52168R10466J144422J458770J867992
$$ plain form
12438 12510877 14847887 17714911 21213734 25629759 31591836 40247135 53512352 74406560
12430 74406560 106878230 153257130 207211562 252446767 274751123 270453132 246575702
12423 246575702 212481515 174772430 138598715 107568104 82989523 64268816 50257703
12416 50257703 39779225 31832237 25681141 20852151 17057612 14085557 11750535 9923004
12408 9923004 8478939 7335215 6412887 5659337 5035834 4519274 4090051 3727069 3410584
12399 3410584 3124099 2858010 2620624 2422260 2239811 2068650 1919889 1790136 1676648
12390 1676648 1577496 1485802 1404829 1323897 1247955 1170170 1109498 1056062 1021051 1007265 995397
12379 995397 982697 972424 960486 950426 938693 927905 903363 881046 855096 819636 782304
$$ packed form
12438A2510877K337010K867024L498823M416025N962077Q655299J3265217K0894208
12430G4406560L2471670M6378900N3954432M5235205K2304356m297991k3877430
12423B46575702l4094187l7709085l6173715l1030611k4578581j8720707j4011113
12416E0257703j0478478p946988o151096m828990l794539k972055k335022j827531
12408I923004j444065j143724r22328p53550o23503n16560m29223l62982l16485
12399C410584k86485k66089k37386j98364j82449j71161j48761j29753j13488
12390A676648r9152r1694q0973q0932p5942p7785o0672n3436l5011j3786j1868
12379I95397j2700j0273j1938j0060j1733j0788k4542k2317k5950l5460l7332
$$ plain form
12368 782304 745693 712887 670771 634104 607626 591795 569094 543807 517904 495478 482118
12357 482118 470184 452507 435104 421196 405245 390001 377592 364825 359895 349799 341378 339339
12345 339339 328803 317251 305064 303193 289975 275921 271122 262315 254341 249418 242983 228153 217581
12332 217581 211039 205292 199097 199799 202036 200047 200443 204103 203676 199123 200194 206513 225803 240371
12318 240371 260323 288698 313953 334857 362613 390181 418761 441058 447600 433803 411127 386251
12306 386251 377950 372818 375524 392630 403405 407661 395731 370250 333623 301328 278872 263853
12294 263853 247162 228356 212048 201144 197167 183125 167386 159671 150656 147562 145870 147780 149628
12281 149628 149620 154631 162271 157480 155600 157467 152898 146356 150196 167270 186320 207306 223635 224950
$$ packed form
12368G82304l6611l2806m2116l6667k6478j5831k2701k5287k5903k2426j3360
12357D82118j1934j7677j7403j3908j5951j5244j2409j2767m930j0096q421k039
12345C39339j0536j1552j2187j871j3218j4054m799q807p974m923o435j4830j0572
12332B17581o542n747o195P02K237j989L96L660m27m553J071O319J9290J4568
12318B40371J9952K8375K5255K0904K7756K7568K8580K2297O542j3797k2676k4876
12306C86251q301n132K706J7106J0775M256j1930k5481l6627l2295k2456j5019
12294B63853j6691j8806j6308j0904l977j4042j5739p715r015l094j692J910J848
12281A49628qN011P640m791j880J867m569o542L840J7074J9050K0986J6329J315
$$ plain form
12267 224950 229293 224814 221057 214519 202251 190298 171351 154384 147778 138664 128925 121101 118389
12254 118389 119343 123118 123787 112780 104614 103331 112868 122788 128501 133545 139642 153295 159929 160964
12240 160964 144432 126740 113772 97728 80526 71498 66218 54284 41777 27204 9781 -3097
12228 -3097 -14417 -21090 -16028 -15046 -9549 -4695 -7297 -6769 2274 8697 13668 14890 25038 36604
12214 36604 43488 49152 56184 67081 77891 79285 81000 82929 82870 75148 69512 71051 63949 59997
12200 59997 62989 60177 51602 45516 48980 57602 61190 63361 58903 54890 52247 48043 45219 52985
12186 52985 56841 50354 53734 53191 49636 51617 55918 64314 80794 85791 73175 66467 59800 51554
12172 51554 49980 45970 43384 45367 46389 45588 48860 51608 46008 46553 47584 43714 39342 44517 41287
$$ packed form
12267B24950M343m479l757o538j2268j1953j8947j6967o606r114r739p824k712
12254A18389R54L775O69j1007q166j283R537R920N713N044O097J3653O634J035
12240A60964j6532j7692j2968j6044j7202r028n280j1934j2507j4573j7423j2878
12228c097j1320o673N062R82N497M854k602N28R043O423M971J222J0148J1566
12214C6604O884N664P032J0897J0810J394J715J929n9p722n636J539p102l952
12200E9997K992k812q575o086L464Q622L588K171m458m013k643m204k824P766
12186E2985L856o487L380n43l555J981M301Q396J6480M997j2616o708o667q246
12172E1554j574m010k586J983J022q01L272K748n600N45J031l870m372N175l230
$$ plain form
12157 41287 37484 22086 9999 12861 7014 269 7630 10606 15503 21509 24580 23028 22403 27142
12143 27142 30523 24747 22688 25267 23540 22597 18851 17811 21044 17793 18630 18951 28235 31667 29941
12128 29941 36520 44091 48505 52308 47447 45522 48073 50659 53791 58338 61805 62937 57302 51498
12114 51498 44126 40123 36575 33911 39659 42927 45710 48934 50594 43990 41658 37253 37108 48109
12100 48109 58019 56383 59912 62990 69171 71043 65643 54170 42410 30311 21195 15723 9825 3937
12086 3937 2887 1446 7051 14967 21658 23924 28598 28949 26356 21362 20637 29384 32851 41799 49324
12071 49324 52537 58582 59372 61249 65775 73206 76677 71294 67970 66134 64930 67003 71294 71125 68897
12056 68897 71642 70676 67809 72710 75192 77814 71286 67041 71335 72472 77166 72248 75167 78768 80313
$$ packed form
12157D1287l803j5398j2087K862n847o745P361K976M897O006L071j552o25M739
12143B7142L381n776k059K579j727r43l746j040L233l251Q37L21R284L432j726
12128B9941O579P571M414L803m861j925K551K586L132M547L467J132n635n804
12114E1498p372m003l548k664N748L268K783L224J660o604k332m405j45J1001
12100D8109R910j636L529L078O181J872n400j1473j1760j2099r116n472n898n888
12086C937j050j441N605P916O691K266M674L51k593m994p25Q747L467Q948P525
12071D9324L213O045P90J877M526P431L471n383l324j836j204K073M291j69k228
12056F8897K745r66k867M901K482K622o528m245M294J137M694m918K919L601J545
$$ plain form
12041 80313 76168 77197 87263 97895 106222 107710 108841 113899 121879 126125 133917 137877 140580 138933
12027 138933 142451 148199 149215 150184 157856 167897 180110 185686 200206 214597 228032 237310 248626
12014 248626 261057 274000 284936 291604 305418 319139 336456 360357 380322 405438 437023 467523
12002 467523 500565 536125 577373 632085 689082 746642 823556 913866 1022289 1162056 1332265
11991 1332265 1550808 1847209 2228489 2687462 3182891 3632231 4007558 4360449 4755451
11982 4755451 5254857 5898456 6716967 7693942 8743667 9723942 10451956 10792207 10715704
11973 10715704 10251792 9487435 8549862 7547056 6559837 5639236 4811971 4100424 3492216
11964 3492216 2987101 2561726 2220007 1932228 1687975 1481943 1310829 1165347 1043801
$$ packed form
12041H0313m145J029J0066J0632Q327J488J131N058P980M246P792L960K703j647
12027A38933L518N748J016R69P672J0041J2213N576J4520J4391J3435R278J1316
12014B48626J2431J2943J0936O668J3814J3721J7317K3901J9965K5116L1585L0500
12002D67523L3042L5560M1248N4712N6997N7560P6914R0310J08423J39767J70209
11991A332265K18543K96401L81280M58973M95429M49340L75327L52891L95002
11982D755451M99406O43599Q18511R76975J049725R80275P28014L40251p6503
11973A0715704m63912p64357r37573j002806r87219r20601q27265p11547o08208
11964C492216n05115m25375l41719k87779k44253k06032j71114j45482j21546
$$ plain form
11955 1043801 939518 852082 773477 705721 649205 595627 552005 511859 475709 443116 412995
11944 412995 386419 350525 325955 312555 300593 277284 255896 241383 232708 223274 208354 194102
11932 194102 189166 178432 174196 169039 164386 159062 148220 147550 146335 134318 127831 121812 114521 114936
11918 114936 113129 112081 107689 97670 90347 88023 83799 74605 74117 68913 64981 69174 67720 70982
11904 70982 67747 61995 63867 60624 54693 55994 56139 53080 59588 58058 52743 53842 48371 38912 37699
11889 37699 39897 36633 38555 34797 33189 32649 30656 31231 26045 24990 24741 26897 27913 29189 27055
11874 27055 26529 16200 18621 27956 32790 31389 24353 26793 28460 26710 25245 26748 24286 20502
11860 20502 17725 18900 21720 22423 22427 22287 29523 35242 26923 23677 28320 25884 19424 17357 20587 19105
$$ packed form
11955A043801j04283q7436p8605o7756n6516n3578m3622m0146l6150l2593l0121
11944D12995k6576l5894k4570j3400j1962k3309k1388j4513q675r434j4920j4252
11932A94102m936j0734m236n157m653n324j0842o70j215j2017o487o019p291M15
11918A14936j807j048m392j0019p323k324m224r194m88n204l932M193j454L262
11904G0982l235n752J872l243n931J301J45l059O508j530n315J099n471r459j213
11889C7699K198l264J922l758j608n40j993N75n186j055k49K156J016J276k134
11874B7055n26j0329K421R335M834j401p036K440J667j750j465J503k462l784
11860B0502k777J175K820P03Mj40P236N719q319l246M643k436o460k067L230j482
$$ plain form
11844 19105 16138 10054 8940 9594 8197 9123 12828 15504 20738 16717 7100 11718 17286 12970 10057
11829 10057 6709 6675 8365 8582 -36 -5988 -5919 3562 10794 10944 5682 5579 823 3229 16247 22981
11813 22981 23106 19861 18225 19558 21454 23639 17032 11680 5357 5157 4994 1761 -1666 3970 7127
11798 7127 7197 10479 11012 9819 10936 11834 14205 9496 8697 6212 5221 2101 14 5222 8373 2199
11782 2199 -320 -3894 -2375 -3635 2793 4742 3334 3567 6476 5563 -1594 -1467 7776 13458 11110
11767 11110 8055 6938 6451 5831 7422 408 -2236 6556 10937 13574 17660 11308 12933 18135 16812
11752 16812 14974 14619 9460 3547 4347 4858 6743 8137 1718 1022 1174 3944 3347 2281 1072 2213
11736 2213 2286 2246 5276 9823 11451 12518 13764 20720 20637 12862 8655 6485 8397 8660 9279 7634 463
$$ packed form
11844A9105k967o084j114O54j397R26L705K676N234m021r617M618N568m316k913
11829A0057l348l4J690K17q618n952O9R481P232J50n262j03m756K406J3018O734
11813B2981J25l245j636J333J896K185o607n352o323k00j63l233l427N636L157
11798G127P0L282N33j193J117Q98K371m709p99k485r91l120k087N208L151o174
11782B199k519l574J519j260O428J949j408K33K909r13p157J27R243N682k348
11767A1110l055j117m87o20J591p014k644Q792M381K637M086o352J625N202j323
11752A6812j838l55n159n913Q00N11J885J394o419o96J52K770n97j066j209J141
11736B213P3m0L030M547J628J067J246O956q3p775m207k170J912K63O19j645p171
$$ plain form
11719 463 -2731 -516 38 2834 9523 10405 8698 7516 10715 8150 4342 2811 420 3546 8046
11704 8046 12404 19003 21965 20753 19077 19123 15643 14867 17833 21000 25329 19474 7566 -1068 1777
11689 1777 4149 1514 -508 -1208 -4495 -119 4134 6445 6638 7337 5157 -1392 -3830 -3137 -2716 -3520
11673 -3520 1767 2350 2630 2216 5151 11774 12758 7407 -1899 -774 3824 6427 4774 5919 7414 7732
11657 7732 11344 12915 12779 11066 15042 22209 23313 23351 25467 25717 24709 21499 22083 22445 14368 9643
11641 9643 10718 11040 6608 4392 9470 11798 7751 2598 -2629 -2888 -4181 -7096 -3923 2789 4505
11626 4505 -640 -6465 -5369 -5887 -3814 5035 9616 9261 5438 7171 -2769 -8797 -7927 -4430 2890
11611 2890 6813 6394 7558 12643 12735 11208 8022 9153 5293 4495 5809 9695 3772 4103 9183 9064
$$ packed form
11719D63l194K215N54K796O689Q82j707j182L199k565l808j531k391L126M500
11704H046M358O599K962j212j676M6l480p76K966L167M329n855j1908q634K845
11689A777K372k635k022p00l287M376M253K311J93O99k180o549k438O93M21q04
11673c520N287N83K80m14K935O623R84n351r306J125M598K603j653J145J495L18
11657G732L612J571j36j713L976P167J104L8K116K50j008l210N84L62q077m725
11641I643J075L22m432k216N078K328m047n153n227k59j293k915L173O712J716
11626D505n145n825J096n18K073Q849M581l55l823J733r940o028Q70L497P320
11611B890L923m19J164N085R2j527l186J131l860p98J314L886n923L31N080j19
$$ plain form
11595 9064 9062 9022 10236 7388 442 -1799 -1645 -4081 -3120 -3507 -7978 -9655 -11573 -9325 -6674 -7763 -6037
11578 -6037 -6786 -6365 -5782 -9273 -15046 -16389 -15902 -13841 -8309 -8526 -9202 -3764 -4802 -2315 -958 -5343
11562 -5343 -7712 -9896 -9548 -1515 -1309 -2152 141 3207 3096 -758 -1560 -1615 -4090 -8757 -6328 -3900
11546 -3900 3176 3310 1145 3146 5859 8248 8154 10822 7130 9131 11674 6925 8595 11074 11193 8602
11530 8602 2628 2313 -748 -2995 -7237 -5787 -11549 -9454 -11944 -17715 -13080 -8679 -6954 -14061 -13644
11515 -13644 -11504 -8605 -8476 -17215 -12211 -12190 -14496 -19487 -17827 -8382 -13076 -16874 -18356 -15401 -8359
11500 -8359 -5897 2778 3679 6694 4639 9050 6231 3764 6285 8968 12141 15536 20313 30604 36802
11485 36802 32094 28511 30623 32706 28654 23036 13786 12071 16670 16141 12775 13832 6753 -1720 -6155
$$ packed form
11595I064km0J214k848o946k241J54k436R61l87m471j677j918K248K651j089J726
11578f037p49M21N83l491n773j343M87K061N532k17o76N438j038K487J357m385
11562e343k369k184L48Q033K06q43K293L066j11l854q02n5k475m667K429K428
11546c900P076J34k165K001K713K389r4K668l692K001K543m749J670K479J19k591
11530H602n974l15l061k247m242J450n762K095k490n771M635M401J725p107M17
11515a3644K140K899J29q739N004K1k306m991J660R445m694l798j482K955P042
11500h359K462Q675R01L015k055M411k819k467K521K683L173L395M777J0291O198
11485C6802m708l583K112K083m052n618r250j715M599n29l366J057p079q473m435
$$ plain form
11470 -6155 553 6912 10713 5746 2515 2305 3454 12024 13084 8484 6442 4202 6622 9485 4967
11455 4967 4921 12627 16264 13302 16237 23925 16187 12102 12268 14512 19252 16816 18387 29350 40929
11440 40929 46748 60721 70175 76880 81224 89352 102134 105654 104026 103892 99677 92061 82100 71768
11426 71768 61663 50914 42239 34646 30456 27671 21246 11248 11415 13350 11257 6030 10874 10922 7930
11411 7930 5296 3516 8502 7202 11993 17723 13578 10024 7323 2920 7503 12936 9638 11463 12271
11396 12271 13603 8777 8327 14108 20695 24337 32656 43971 50609 52536 64192 66076 65866 75675
11382 75675 74912 65223 53841 46913 42416 34890 24000 13111 10127 8450 8362 10150 5927 -2017
11368 -2017 -2693 -6289 -6176 -10339 -13307 -14435 -12074 -9135 -8110 -6170 -4866 -10387 -9761 -9694 -10433 -15564
$$ packed form
11470f155O708O359L801m967l231k10J149Q570J060m600k042k240K420K863m518
11455D967m6P706L637k962K935P688p738m085J66K244M740k436J571J0963J1579
11440D0929N819J3973R454O705M344Q128J2782L520j628j34m215p616r961j0332
11426G1768j0105j0749q675p593m190k785o425r998J67J935k093n227M844M8k992
11411G930k634j780M986j300M791N730m145l554k701m403M583N433l298J825Q08
11396A2271J332m826m50N781O587L642Q319J1315O638J927J1656J884k10R809
11382G5675p63r689j1382o928m497p526j0890j0889k984j677q8J788m223p944
11368b017o76l596J13m163k968j128K361K939J025J940J304n521O26O7p39n131
$$ plain form
11352 -15564 -17068 -13188 -4404 295 -3960 -13260 -10118 -5447 -6821 -13002 -14483 -9351 -5127 -4565 -8956
11337 -8956 -6157 -9878 -11025 -6828 -11546 -12355 -6010 -9775 -9851 -4581 -9514 -15017 -12778 -5980 6145
11322 6145 6519 5214 679 647 4937 537 -3068 -7579 -2066 2331 -1213 715 6976 12492 9025
11307 9025 3263 -517 -2329 -6100 -11209 -3323 2710 554 -2690 -4121 -1308 -2754 1427 4120 2310
11292 2310 -415 243 622 -3444 -8030 -8235 -9060 -8016 -8350 -9596 -5756 -7325 -13198 -11919 -10369 -6724
11276 -6724 -3858 -4692 -3013 -2100 -5364 -14408 -16668 -7115 -5686 -8008 -10136 -9562 -699 2027 -4782
11261 -4782 -7589 -5063 290 -2338 -3485 -7977 -8082 -7596 -7971 -3620 -1254 -3040 -5702 -6545 -12199 -11554
11245 -11554 -12666 -7628 -5392 -4336 -4955 -3888 -7611 -8721 -8962 -5867 -1802 -5193 -1556 1873 6251
$$ packed form
11352a5564j504L880Q784M699m255r300L142M671j374o181j481N132M224N62m391
11337h956K799l721j147M197m718q09O345l765p6N270m933n503K239O798J2125
11322F145L74j305m535l2M290m400l605m511N513M397l544J928O261N516l467
11307I025n762l780j812l771n109P886O033k156l244j431K813j446M181K693j810
11292B310k725O58L79m066m586k05q25J044l34j246L840j569n873J279J550L645
11276f724K866q34J679R13l264r044k260R553J429k322k128N74Q863K726o809
11261d782k807K526N353k628j147m492j05M86l75M351K366j786k662q43n654O45
11245a1554j112N038K236J056o19J067l723j110k41L095M065l391L637L429M378
$$ plain form
11230 6251 3250 2489 -1609 -2119 862 773 -4555 -7554 -4094 -4855 -7621 -5034 -3388 -337 4634 3895
11214 3895 -1525 -8770 -11412 -10948 -14717 -11117 -4266 -3529 -3461 2800 6885 6220 2449 -5176 -7436 -5652
11198 -5652 -852 1713 5148 2270 3503 6495 930 -12762 -9941 -1451 2195 1479 203 -4647 -5989
11183 -5989 -4907 -4385 -2745 -2662 -4784 -6489 -4923 -256 228 2025 5433 3631 298 -244 -1485 -4561
11167 -4561 -10220 -12194 -13353 -6976 -4389 -5631 -9782 -5334 -3979 -3554 -5364 -12671 -13761 -9799 -3824
11152 -3824 -4194 -5681 -5116 -1442 -6505 -9139 -13494 -15782 -5334 6310 1934 -5714 -7657 -5091 5150
11137 5150 6853 804 -1539 -3487 -6665 1295 -3031 -4967 -6378 -5317 -1480 6528 6868 -1613 -622
11122 -622 -4239 -3054 1698 -1995 -3769 -4226 -8290 -10441 -14861 -14123 -13632 -11870 -6243 -4510 -2388 -158
$$ packed form
11230F251l001p61m098n10K981q9n328k999L460p61k766K587J646L051M971p39
11214C895n420p245k642M64l769L600O851P37O8O261M085o65l771p625k260J784
11198e652M800K565L435k878J233K992n565j3692K821Q490L646p16j276m850j342
11183e989J082N22J640Q3k122j705J566M667M84J797L408j802l333n42j241l076
11167d561n659j974j159O377K587j242m151M448J355M25j810p307j090L962N975
11152c824l70j487N65L674n063k634m355k288J0448J1644m376p648j943K566J0241
11137E150J703o049k343j948l178P960m326j936j411J061L837Q008L40q481R91
11122f22l617J185M752l693j774m57m064k151m420P38M91J762N627J733K122K230
$$ plain form
11106 -158 -4426 -14765 -19034 -14040 -7109 -5831 -2110 -1889 -3569 -3456 -5140 -7769 -4682 -707 -2622
11091 -2622 -2091 -5371 -9833 -8531 -6000 -2498 -1084 -2185 -6602 -6563 -2910 -3206 -626 3453 21 -2348
11075 -2348 -13828 -18803 -15279 -10040 -1311 -8690 -10554 -3366 -2615 -5285 -11929 -14177 -14678 -13045 -11361
11060 -11361 -6882 2008 5685 955 1694 -2931 -2028 928 -2331 515 6558 7085 6459 5617 4885 11754
11044 11754 10486 10505 14923 15385 19459 17663 14470 17180 22055 22352 23476 30090 33793 37977 36297
11029 36297 33623 30371 28255 29010 32467 38185 39441 38811 44041 48376 48867 48078 47810 48340 44324 34417
11013 34417 36146 39765 39293 37516 32691 30216 24499 24923 30237 28212 26335 20831 24283 28621 21230
10998 21230 20380 21889 18768 17353 14007 10075 10655 12049 9407 8128 2162 2057 4824 11746 17565
$$ packed form
11106a58m268j0339m269M994O931J278L721K21j680J13j684k629L087L975j915
11091b622N31l280m462J302K531L502J414j101m417L9L653k96K580M079l432k369
11075b348j1480m975L524N239Q729p379j864P188P51k670o644k248n01J633J684
11060a1361M479Q890L677m730P39m625R03K956l259K846O043N27o26q42p32O869
11044A1754j268J9M418M62M074j796l193K710M875K97J124O614L703M184j680
11029C6297k674l252k116P55L457N718J256o30N230M335M91p89k68N30m016r907
11013C4417J729L619m72j777m825k475n717M24N314k025j877n504L452M338p391
10998B1230q50J509l121j415l346l932N80J394k642j279n966j05K767O922N819
$$ plain form
10983 17565 16503 21305 26911 29707 32355 37189 42095 42028 44685 47473 52371 54211 53149 51039 45875
10968 45875 45042 51501 54544 47152 43308 38124 36482 33848 30915 30196 23118 19051 22358 24198 14639
10953 14639 16143 18168 13683 14536 19637 21743 13911 12233 11681 9089 6082 1996 8959 17040 22548
10938 22548 24948 28154 24916 26443 24649 26675 33023 34674 37751 45178 57002 62377 68888 78718
10924 78718 90442 96135 102063 103658 104798 104043 102025 94712 89646 83809 82585 81504 76335 69211
10910 69211 57557 53393 51114 51585 52703 52956 48415 45962 42920 41826 45161 42507 38247 38596 34187
10895 34187 26830 28043 32078 38508 42877 43983 47674 49114 48730 54514 65876 79440 93120 111597
10881 111597 132059 160247 194414 223580 240067 244726 235654 211961 191182 178852 159679 139780
$$ packed form
10983A7565j062M802N606K796K648M834M906o7K657K788M898J840j062k110n164
10968D5875q33O459L043p392l844n184j642k634k933p19p078m067L307J840r559
10953A4639J504K025m485Q53N101K106p832j678n52k592l007m086O963Q081N508
10938B2548K400L206l238J527j794K026O348J651L077P427J1824N375O511R830
10924G8718J1724N693N928J595J140p55k018p313n066n837j224j081n169p124
10910F9211j1654m164k279M71J118K53m541k453l042j094L335k654m260L49m409
10895C4187p357J213M035O430M369J106L691J440l84N784J1362J3564J3680J8477
10881A11597K0462K8188L4167K9166J6487M659r072k3693k0779j2330j9173j9899
$$ plain form
10869 139780 125612 111746 98131 88421 81160 68836 56645 49566 44708 34905 27784 24177 21777
10856 21777 22251 21736 15530 6976 6387 7897 7332 5849 9215 26416 30591 23076 21897 17550 15242
10841 15242 10800 9974 7688 6786 13344 21784 16617 11061 11577 15508 13012 4512 4344 7460 18746
10826 18746 17559 12340 8773 11793 14061 9664 4616 10957 11830 11582 13197 12071 9291 6981 11767
10811 11767 11096 9432 9458 14357 11393 9824 7188 9839 8462 3848 2974 6265 7271 11709 12692 5939
10795 5939 -502 -2335 2160 4372 3136 6385 13467 8134 2252 11843 18152 21857 16766 10630 7671
10780 7671 8883 7167 4649 5573 3506 -1223 -4078 2462 8910 15144 12861 4522 1400 834 918 -1065
10764 -1065 -8616 -9720 -9618 -8798 -1675 5706 5300 3417 6823 5784 6073 -1067 -2280 -6022 -12362 -17723
$$ packed form
10869A39780j4168j3866j3615r710p261j2324j2191p079m858r803p121l607k400
10856B1777M74n15o206q554n89J510n65j483L366J7201M175p515j179m347k308
10841A5242m442q26k286r02O558Q440n167n556N16L931k496q500j68L116J1286
10826A8746j187n219l567L020K268m397n048O341Q73k48J615j126k780k310M786
10811A1767o71j664K6M899k964j569k636K651j377m614q74L291J006M438R83o753
10795E939o441j833M495K212j236L249P082n333n882R591O309L705n091o136k959
10780G671J212j716k518R24k067m729k855O540O448O234k283q339l122n66Q4j983
10764a065p551j104J02Q20P123P381m06j883L406j039K89p140j213l742o340n361
$$ plain form
10748 -17723 -16081 -12047 -10223 -3057 8950 16861 13010 6790 5078 8681 8259 11884 14034 14225 15544
10733 15544 14871 17110 21475 19494 16492 18883 18580 13840 16467 26607 33968 31900 33901 38614 48285
10718 48285 51903 51925 55227 60289 61478 56160 44674 37001 42718 45486 46928 49344 46529 36997 31615
10703 31615 27197 31501 29922 23189 25207 24167 25662 24906 24319 25167 27114 32355 37733 37728 39774 46826
10687 46826 41795 36022 33377 38991 45234 46779 48436 54970 57593 58414 66706 82936 91552 94913
10673 94913 102736 122841 147217 180490 235420 303369 373452 436911 474054 476139 450978 406632
10661 406632 356475 308163 262179 214895 177631 149758 131777 114730 104905 97111 91473 92608
10649 92608 94657 92018 87676 89090 86013 87994 85206 81701 83977 86678 90737 94656 102416 109794
$$ packed form
10748a7723J642M034J824P166J2007P911l851o220j712L603m22L625K150J91J319
10733A5544o73K239M365j981l002K391l03m740K627J0140P361k068K001M713R671
10718D8285L618K2L302N062J189n318j1486p673N717K768J442K416k815r532n382
10703C1615m418M304j579o733K018j040J495p56n87Q48J947N241N378nK046P052
10687D6826n031n773k645N614O243J545J657O534K623Q21Q292J6230Q616L361
10673I4913P823K0105K4376L3273N4930O7949P0083O3459L7143K085k5161m4346
10661D06632n0157m8312m5984m7284l7264k7873j7981j7047r825p794n638J135
10649I2608K049k639m342J414l077J981k788l505K276K701M059L919P760P378
$$ plain form
10635 109794 119640 132008 148896 161225 172947 185461 198182 218320 238807 257842 279281 319676
10623 319676 370067 433326 523430 646693 811139 1039379 1326508 1673756 2043030 2372667
10613 2372667 2616735 2746628 2780400 2768822 2760519 2805733 2951610 3248562 3724023 4361643
10603 4361643 5061838 5643450 5960258 5997187 5841717 5586192 5332772 5181647 5211701 5478566
10593 5478566 6023844 6800027 7620806 8218932 8396407 8157672 7636605 6979413 6331937
10584 6331937 5798494 5448928 5331314 5447529 5736157 6058859 6221155 6115397 5751950
10575 5751950 5226270 4636485 4074102 3604223 3255126 3041781 2963643 2969788 2978517 2924076
10565 2924076 2757787 2507925 2199665 1867242 1545223 1251537 1003887 809092 659677
$$ packed form
10635A09794R846J2368J6888J2329J1722J2514J2721K0138K0487J9035K1439M0395
10623C19676N0391O3259R0104J23263J64446K28240K87129L47248L69274L29637
10613B372667K44068J29893L3772j1578q303M5214J45877K96952M75461O37620
10603D361643P00195N81612L16808L6929j55470k55525k53420j51125L0054K66865
10593E478566N45278P76183Q20779N98126J77475k38735n21067o57192o47476
10584F331937n33443l49566j17614J16215K88628L22702J62296j05758l63447
10575E751950n25680n89785n62383m69879l49097k13345p8138O145Q729n4441
10565B924076j66289k49862l08260l32423l22019k93686k47650j94795j49415
$$ plain form
10556 659677 540940 448868 375777 316288 264093 227190 201781 177415 155325 144063 133886
10545 133886 124714 116010 104941 96562 89027 86865 82890 71120 58612 53912 57013 54904 49098
10532 49098 46164 40867 35469 39752 35002 28668 26292 26896 28284 26348 25863 24205 20409 19630 17525
10517 17525 14131 16268 17157 19110 21957 10003 4566 3364 4725 8735 7153 4286 6007 8655
10503 8655 9670 9640 8642 12696 11996 4834 -2447 -8412 -5977 -1821 4556 2520 1957 2162 12049 17383
10487 17383 17406 25968 21825 14569 12899 9092 8445 8060 10187 8120 7848 12582 10510 9433 12490 6770
10471 6770 9269 14922 15487 13109 16284 21296 22088 20824 20287 21850 19127 17557 15651 11824 11966 10454
10455 10454 6237 8937 12552 8563 3801 7045 6622 1003 3120 4571 7815 10398 4753 4232 5110
$$ packed form
10556F59677j18737r2072p3091n9489n2195l6903k5409k4366k2090j1262j0177
10545A33886r172q704j1069q379p535k162l975j1770j2508m700L101k109n806
10532D9098k934n297n398M283m750o334k376O04J388j936m85j658l796p79k105
10517A7525l394K137Q89J953K847j1954n437j202J361M010j582k867J721K648
10503H655J015l0r98M054p00p162p281n965K435M156O377k036n63K05R887N334
10487A7383K3Q562m143p256j670l807o47l85K127k067k72M734k072j077L057n720
10471F770K499N653N65k378L175N012P92j264n37J563k723j570j906l827J42j512
10455A0454m217K700L615l989m762L244m23n619K117J451L244K583n645n21Q78
$$ plain form
10440 5110 6597 1942 1552 -1075 -1628 1709 -606 -2987 2350 -1394 -4736 -5074 -3625 -5671 -7063
10425 -7063 -9720 -8173 -8378 -2338 1621 1546 878 1833 1531 -979 -3971 4 -3623 -10340 -16689 -14554
10409 -14554 -6098 -4519 -10328 -13660 -14318 -12189 -2685 1177 -2072 -6479 -2347 -1770 3528 -2382 -4892
10394 -4892 -83 982 -3121 -9006 -8852 -10062 -7560 -11801 -13440 -17455 -17615 -11407 -4072 1158 -782
10379 -782 -9492 -7010 -3259 558 1212 507 3356 -2094 2677 3017 3739 -788 -3869 -1551 4366 4073
10363 4073 14724 17125 11433 11381 11157 6226 -1700 -5541 -7264 -6741 -6941 -3290 -6910 -2932 1733 -1364
10347 -1364 -4975 564 4262 4048 5043 2837 649 905 907 -2538 -7637 -9030 -10285 -20451 -17475 -9414
10331 -9414 -7041 -7044 -11599 -17351 -15491 -10717 -12069 -11701 -6493 -909 -6487 -3915 -4662 -9561 -6943 -2962
$$ packed form
10440E110J487m655l90k627n53L337k315k381N337l744l342l38J449k046j392
10425g063k657J547k05O040L959p5o68R55l02k510k992L975l627o717o349K135
10409a4554Q456J579n809l332o58K129R504L862l249m407M132N77N298n910k510
10394d892M809J065m103n885J54j210K502m241j639m015j60O208P335N230j940
10379g82q710K482L751L817O54p05K849n450M771L40P22m527l081K318N917k93
10363D073J0651K401n692n2k24m931p926l841j723N23k00L651l620L978M665l097
10347a364l611N539L698k14R95k206k188K56Kl445n099j393j255j0166K976Q061
10331i414K373lm555n752J860M774j352L68N208N584n578K572p47m899K618L981
$$ plain form
10315 -2962 -5728 -7681 -4234 -2105 -4800 -6693 -11368 -14435 -15172 -3005 -461 -8734 -6607 -2724 -742
10300 -742 -7639 -10742 -8722 -8710 -10705 -5594 2716 745 -5834 -8452 -6848 -8005 -12776 -9476 -4190
10285 -4190 -3286 -3742 -1105 -6485 -7698 -4390 -6765 -15547 -14888 -9376 -3711 -5985 -8801 -8988 -6677 -3287
10269 -3287 -1936 -2291 -698 -7599 -14138 -10612 -7690 -3891 -9104 -13413 -14008 -8085 -4587 -8845 -12644
10254 -12644 -12563 -13034 -12062 -16414 -12984 -7236 -7397 -7736 -7071 -2934 -4288 -10664 -7918 -7997 -12803 -9914 -7016
10237 -7016 2679 362 -7707 -10529 -10004 -8325 -9042 -12765 -13410 -6841 -2173 -732 -2151 -4108 -5847
10222 -5847 -9598 -15333 -14438 -15564 -11178 -4454 -6892 -4105 -905 -1732 -7718 -10162 -1169 -1987 -3192
10207 -3192 -7616 -9551 -11851 -16250 -17220 -17630 -13850 -16174 -14590 -9815 -4481 1922 1580 -13 -711 1012
$$ packed form
10315b962k766j953L447K129k695j893m675l067p37J2167K544q273K127L883J982
10300g42o897l103K020J2j995N111Q310j971o579k618J604j157m771L300N286
10285d190R04m56K637n380j213L308k375q782O59N512N665k274k816j87K311L390
10269c287J351l55J593o901o539L526K922L799n213m309n95N923L498m258l799
10254a2644Q1m71R72m352L430N748j61l39O65M137j354o376K746p9m806K889K898
10237g016R695k317q069k822N25J679p17l723o45O569M668J441j419j957j739
10222e847l751n735Q95j126M386O724k438K787L200q27n986k444Q993q18j205
10207c192m424j935k300m399r70m10L780k324J584M775N334O403l42j593o98J723
$$ plain form
10191 1012 3736 8521 11462 2345 -8378 -5797 -4784 -3042 1550 1177 1512 -599 3581 5082 9285
10176 9285 11488 7536 -2611 -3240 114 2513 863 4961 9728 9361 13268 17489 21538 26300 22050
10161 22050 18025 15569 8090 10285 14380 18951 31293 38911 36750 37108 36527 31251 24509 27767 29677
10146 29677 30429 31801 30799 33294 36915 35891 35773 30326 33038 35451 24310 9792 4370 5600
10132 5600 6231 7438 7176 4770 6135 11193 11376 7447 5797 2530 2175 -145 -3908 -7080 -3014 1738
10116 1738 -4112 -12344 -9637 -12551 -13518 -10750 -4126 -11149 -12010 -14778 -13991 -16114 -13129 -6680 -4664
10101 -4664 -8091 -9194 -8709 -13062 -14282 -12184 -9512 -7108 -6074 -11198 -16060 -6202 -6318 -6106 -6343 -7858
10085 -7858 -6288 -3462 -7836 -16443 -10504 -9796 -10154 -13021 -9749 -1366 1161 -3179 -8328 -13622 -17286
$$ packed form
10191A012K724M785K941r117j0723K581J013J742M592l73L35k111M180J501M203
10176I285K203l952j0147o29L354K399j650M098M767l67L907M221M049M762m250
10161B2050m025k456p479K195M095M571J2342P618k161L58n81n276o742L258J910
10146B9677P52J372j002K495L621j024j18n447K712K413j1141j4518n422J230
10132E600O31J207k62k406J365N058J83l929j650l267l55k320l763l172M066M752
10116A738n850q232K707k914r67K768O624p023q61k768P87k123K985O449K016
10101d664l427j103M85m353j220K098K672K404J034n124m862R858j16K12k37j515
10085g858J570K826m374q607N939P08l58k867L272Q383K527m340n149n294l664
$$ plain form
10070 -17286 -11176 -854 -4058 -9427 -8375 -1490 1400 -8103 -8764 -13526 -15314 -3596 -141 -4530
10056 -4530 -9753 -11556 -10949 -10696 -7942 -10448 -6736 -5494 -7032 -10309 -7781 -9243 -15430 -14731 -11765
10041 -11765 -10708 -5295 119 -421 3910 4127 -904 -7465 -5293 -5477 -5847 1010 -2843 -5896 -4474
10026 -4474 -3263 -2199 -4533 -5732 -5973 -5028 -3958 -3455 989 1475 -273 605 9441 16041 21255 26468
10010 26468 26490 39455 52509 59833 62883 62090 59381 63137 69202 75413 74300 67388 55469 44379
9996 44379 32584 27290 20394 17269 6918 3293 1151 6007 6576 7948 6806 1640 -1472 1174
9982 1174 -8008 -14974 -14156 -10411 -4953 485 4329 -2525 -2875 2178 4961 7913 12666 22953 37921
9967 37921 53367 67596 74006 76580 64597 51188 43160 33033 31919 29569 19688 10402 10197 6999
$$ packed form
10070a7286O110J0322l204n369J052O885K890r503o61m762j788J1718L455m389
10056d530n223j803O07K53K754k506L712J242j538l277K528j462o187O99K966
10041a1765J057N413N414n40M331K17n031o561K172j84l70O857l853l053J422
10026d474J211J064k334j199k41R45J070N03M444M86j748Q78Q836O600N214N213
10010B6468K2J2965J3054P324L050p93k709L756O065O211j113o912j1919j1090
9996D4379j1795n294o896l125j0351l625k142M856N69J372j142n166l112K646
9982A174r182o966Q18L745N458N438L844o854l50N053K783K952M753J0287J4968
9967C7921J5446J4229O410K574j1983j3409q028j0127j114k350r881r286k05l198
$$ plain form
9953 6999 3913 2257 3917 9414 12913 10756 3920 6210 5376 3845 8083 12974 11313 11437 17746
9938 17746 31299 52992 94049 147991 194059 194448 178110 155249 131598 101397 76016 55456
9926 55456 41361 33563 27856 21346 13949 8626 7343 2359 -4243 -5121 1712 4895 -588 -6563 -12984
9911 -12984 -12367 -14720 -13187 -11945 -9768 -7167 -7062 -10150 -8035 -7226 -7216 -5659 318 -2317 -1254 2664
9895 2664 -828 -5713 -2383 -7082 -7550 -6957 -8561 -10683 -6822 -2147 -7199 -10235 -10011 -4713 -4974 -2934
9879 -2934 -3437 4207 6306 5966 6288 -1290 -4507 -8836 -4566 1077 976 529 139 -423 -1741 -1271 4302
9862 4302 -2410 -1788 -8713 -12115 -6423 -6278 -8538 -10908 -7905 -5338 -5956 -5481 -8894 -6725 -9622 -8114
9846 -8114 -1523 -4422 -12744 -16209 -11845 -3603 -7945 -10182 -2734 -935 -4039 -4120 -8172 -10059 -9240 -10209
$$ packed form
9953F999l086j656J660N497L499k157o836K290q34j531M238M891j661J24O309
9938A7746J3553K1693M1057N3942M6068L89j6338k2861k3651l0201k5381k0560
9926E5456j4095p798n707o510p397n323j283m984o602q78O833L183n483n975o421
9911a2984O17k353J533J242K177K601J05l088K115Q09J0J557N977k635J063L918
9895B664l492m885L330m699m68N93j604k122L861M675n052l036K24N298k61K040
9879b934n03P644K099l40L22p578l217m329M270N643j01m47l90n62j318M70N573
9862D302o712O22o925l402N692J45k260k370L003K567o18M75l413K169k897J508
9846h114O591k899q322l465M364Q242m342k237P448J799l104q1m052j887Q19r69
$$ plain form
9830 -10209 -8518 -2682 -3733 -10424 -10213 -8567 -5712 -5896 -3670 -235 4216 4973 4736 839 1059 790
9814 790 257 1175 -1047 -1818 1769 2303 1303 -511 -4199 -8041 -16378 -11360 -2039 -4782 -3893 -1929
9798 -1929 -2162 -6763 -1429 7778 7446 6479 3940 -855 -6876 -4072 2175 5612 8576 1012 -1700 -5299
9782 -5299 -17093 -16625 -7425 -1548 4332 5431 4517 4491 7040 6327 -3749 -8642 -5716 1738 1155 -4807
9766 -4807 -9363 -12230 -9518 -8074 -13438 -17364 -17013 -11377 -8323 -12957 -18765 -13805 -10436 -9275 -12707
9751 -12707 -10465 -13258 -14034 -10803 -8659 -7517 -8809 -11221 -2610 3735 -1130 -2915 -13632 -16870 -13492
9736 -13492 -6148 -7676 -10546 -6898 -6912 -9503 -11981 -9550 -10463 -10885 -10141 -12693 -13331 -14598 -10516 -6784
9720 -6784 -9299 -10763 -6261 -3292 -8571 -11362 -11078 -7420 -3935 -8357 -2438 -8688 -12000 -16979 -18699
$$ packed form
9830a0209J691N836j051o691K11J646K855j84K226L435M451P57k37l897K20k69
9814G90n33R18k222p71L587N34j000j814l688l842q337N018R321k743Q89J964
9798a929k33m601N334R207l32r67k539m795o021K804O247L437K964p564k712l599
9782e299j1794M68R200N877N880J099r14k6K549p13j0076m893K926P454n83n962
9766d807m556k867K712J444n364l926L51N636L054m634n808M960L369J161l432
9751a2707K242k793p76L231K144J142j292k412Q611O345m865j785j0717l238L378
9736a3492P344j528k870L648j4k591k478K431r13m22P44k552o38j267M082L732
9720f784k515j464M502K969n279k791K84L658L485m422N919o250l312m979j720
$$ plain form
9705 -18699 -16743 -11707 -9786 -11158 -8238 -11281 -13991 -6528 -2615 459 828 -5046 -14929 -10271 -6530
9690 -6530 -9391 -17844 -18710 -12900 -15983 -18092 -15025 -12398 -10297 -9606 -8230 -10821 -11712 -4756 1544 6662
9674 6662 5966 10360 17031 15598 10336 2670 4028 1286 -2302 -784 -2478 -7082 -8416 -8678 -12330
9659 -12330 -12884 -16200 -10034 -6571 -4195 -4637 -5103 -4510 -6758 -8950 -10502 -7743 -4762 -5229 -6011 -757
9643 -757 -1528 -3618 -4224 -7477 -12718 -14670 -5920 -3731 -7662 -1692 -5290 -4663 -7705 -13493 -12088 -5258
9627 -5258 -3890 -8077 -4503 -8911 -13282 -7884 -2293 -1190 1985 -4457 -3629 -1816 -4603 -7328 -10560
9612 -10560 -8088 -14814 -14545 -8239 -5307 -4459 1807 -15 1509 1437 2924 8549 6046 -492 770 5910
9596 5910 11218 4994 3463 5510 4457 -2697 -3987 -7495 -7270 -3251 -4992 -5737 -4094 -1259 -8119
$$ packed form
9705a8699J956N036J921j372K920l043k710P463L913L074L69n874r883M658L741
9690f530k861q453q66N810l083k109L067K627K101O91J376k591q91O956O300N118
9674F662o96M394O671j433n262p666J358k742l588J518j694m604j334k62l652
9659a2330n54l316O166L463K376m42m66N93k248k192j552K759K981m67p82N254
9643g57p71k090o06l253n241j952Q750K189l931N970l598O27l042n788J405O830
9627e258J368m187L574m408m371N398N591J103L175o442Q28J813k787k725l232
9612a0560K472o726K69O306K932Q48O266j822J524p2J487N625k503o538J262N140
9596E910N308o224j531K047j053p154j290l508K25M019j741p45J643K835o860
$$ plain form
9581 -8119 -16909 -14793 -12291 -8199 -6269 -4519 -8278 -11573 -155 4545 -4212 -7858 -6288 -5634 -5232
9566 -5232 -8277 -4061 -765 -5009 -1694 3280 8656 10397 8525 1332 -2972 -4054 141 -188 -2024
9551 -2024 -175 798 -6544 -12032 -10105 -11785 -5635 -7393 -12802 -14606 -10934 -8800 -955 5127 6443
9536 6443 1332 -3380 -2682 -942 -5279 -8893 -17043 -17945 -8148 3662 -889 -2536 220 -3378 -5286
9521 -5286 1096 4226 -408 -3809 -5305 2777 7037 9081 4738 4608 8551 8245 4419 2296 2190 -2679
9505 -2679 -4910 3488 5588 1832 -1838 -5641 -4521 3139 -539 108 252 3554 3187 6586 7109 8192
9489 8192 3807 3087 6204 4706 -8 -1409 -10992 -11930 -5770 -7216 -11949 -15907 -13949 -7980 -3450
9474 -3450 -5638 -7409 -8248 -7477 -8516 -12715 -6935 -5423 -10220 -6804 -6652 -5497 -595 -2621 -6855 -5620
$$ packed form
9581h119q790K116K502M092J930J750l759l295J1418M700q757l646J570O54M02
9566e232l045M216L296m244L315M974N376J741j872p193m304j082M195l29j836
9551b024J849R73p342n488J927j680O150j758n409j804L672K134P845O082J316
9536F443n111m712O98J740m337l614q150r02R797J1810m551j647K756l598j908
9521e286O382L130m634l401j496Q082M260K044m343j30L943l06l826k123j06m869
9505b679k231Q398K100l756l670l803J120P660l678O47J44L302l67L399N23J083
9489H192m385p20L117j498m714j401r583r38O160j446m733l958J958N969M530
9474c450k188j771q39P71j039m199N780J512m797L416J52J155M902k026m234J235
$$ plain form
9458 -5620 -7230 -8850 -6457 -11799 -14282 -10491 -3835 -9833 -12804 -5136 -13693 -15405 -16697 -11959 -1250
9443 -1250 6268 8214 8501 11807 12632 14594 13648 10486 12437 13851 14240 20290 21374 19873 17448 12376
9427 12376 12063 21079 31741 39426 50235 67275 83718 96001 102462 91427 78335 66393 54621
9414 54621 32855 20435 21380 16829 18488 28122 21211 13320 10173 9512 13416 18123 15871 9225 9205
9399 9205 6977 11688 14199 15026 11527 9904 4751 1788 9348 8161 201 -3682 -3544 5334 6502
9384 6502 7558 1534 -4502 -3092 4061 4937 4928 9401 10970 5643 724 -6654 -3710 3445 5844 4837
9368 4837 3061 4583 3603 5829 4407 8245 8627 5294 1404 -3285 -1253 8548 18700 18886 15967
9353 15967 11941 10282 9130 9048 5926 8954 6828 2469 813 -5480 -8117 -7530 673 541 -1119 -4993
$$ packed form
9458e620j610j620K393n342k483L791O656n998k971P668q557j712j292M738J0709
9443a250P518J946K87L306Q25J962r46l162J951J414L89O050J084j501k425n072
9427A2376l13R016J0662P685J0809J7040J6443J2283O461j1035j3092j1942j1772
9414E4621k1766j2420R45m551J659R634o911p891l147o61L904M707k252o646k0
9399I205k228M711K511Q27l499j623n153k963P560j187p960l883J38Q878J168
9384F502J056o024o036J410P153Q76rM473J569n327m919p378K944P155K399j007
9368D837j776J522r80K226j422L838L82l333l890m689K032R801J0152J86k919
9353A5967m026j659j152q2l122L028k126m359j656o293k637N87Q203j32j660l874
$$ plain form
9337 -4993 -973 5906 9921 5197 -1282 -3693 -4324 -987 3009 3388 7442 6862 9859 9484 6109 6663
9321 6663 13162 16626 14886 10264 9151 6842 7342 4167 -1129 -1838 3734 9544 14609 17575 15666
9306 15666 8125 9355 15380 10697 4416 5829 8115 3144 9 -2269 -1972 -536 96 9460 11086
9291 11086 8575 11940 16631 21550 20466 15357 11227 9789 13516 8599 6715 8469 14093 13272 14851
9276 14851 16760 16029 10475 9378 5158 3860 2298 4983 10641 15614 14966 12527 7085 8032 14149
9261 14149 16784 20677 25875 17862 12060 15065 22323 25720 25109 22759 20667 15825 17853 16352 14556
9246 14556 18032 18971 25410 28448 18970 17536 23168 25141 25548 23640 25078 26063 23634 21622 13722
9231 13722 11733 12828 7690 13307 15865 10071 15106 18608 21925 20060 19257 27325 28695 26673 28900
$$ packed form
9337d993M020O879M015m724o479k411o31L337L996L79M054n80K997l75l375N54
9321F663O499L464j740m622j113k309N00l175n296p09N572N810N065K966j909
9306A5666p541J230O025m683o281J413K286m971l135k278K97J436O32R364J626
9291A1086k511L365M691M919j084n109m130j438L727m917j884J754N624q21J579
9276A4851J909p31n554j097m220j298j562K685N658M973o48k439n442R47O117
9261A4149K635L893N198q013n802L005P258L397o11k350k092m842K028j501j796
9246A4556L476R39O439L038r478j434N632J973M07j908J438R85k429k012p900
9231A3722j989J095n138N617K558n794N035L502L317j865q03Q068J370k022K227
$$ plain form
9216 28900 28727 21967 16616 19599 21710 16411 13713 10153 16114 18678 26183 25306 23280 20182 20062
9201 20062 20459 20698 25896 27544 22753 15467 12146 13249 9523 3819 5842 7383 9723 11402 12805
9186 12805 16215 14074 10240 9750 10711 4825 1803 5390 12216 20701 19340 16211 12045 10104 10115 15572
9170 15572 19051 13777 9813 3391 6933 8524 9629 10681 5033 1875 9318 7256 3982 8233 10517
9155 10517 8093 7820 7242 9315 12132 16602 12540 9208 3642 6559 11409 5216 5268 3500 5239 4157
9139 4157 4693 6132 9478 16318 19639 24857 23899 13202 13803 17243 15449 8935 10428 11150 18802 18155
9123 18155 12758 6402 9540 13396 12694 9948 9449 15154 15639 16588 14286 14255 17370 15269 15791 14005
9107 14005 16560 16493 20985 18803 9746 8842 8702 988 2504 11935 18578 17420 14664 14825 16720 17019
$$ packed form
9216B8900j73o760n351K983K111n299k698l560N961K564P505q77k026l098j20
9201B0062L97K39N198J648m791p286l321J103l726n704K023J541K340J679J403
9186A2805L410k141l834m90R61n886l022L587O826Q485j361l129m166j941J1N457
9170A5572L479n274l964o422L542J591J105J052n648l158P443k062l274M251K284
9155A0517k424k73n78K073K817M470m062l332n566K917M850o193N2j768J739j082
9139D157N36J439L346O840L321N218r58j0697O01L440j794o514J493P22P652o47
9123A8155n397o356L138L856p02k746m99N705M85R49k302l1L115k101N22j786
9107A4005K555o7M492k182r057r04j40p714J516R431O643j158k756J61J895K99
$$ plain form
9091 17019 16588 18406 20801 19988 19602 17845 20222 16305 7695 2869 7276 13758 15122 9100 1770
9076 1770 -1466 2613 7139 12102 10745 6404 2799 -2651 -2093 -2142 2381 10760 16114 14855 14141 10444
9060 10444 9056 9769 10548 11411 11149 12581 16172 11602 6921 -2195 901 9156 8064 8362 14293 19539
9044 19539 13236 7783 5174 -1675 510 11238 19588 18245 19021 23078 16974 17603 17305 17809 19998
9029 19998 20578 18100 16107 16790 18752 15989 19183 18319 14758 10910 9081 10052 13215 12592 10255 7291
9013 7291 7964 8878 11962 14873 15591 11696 10304 5714 8596 17422 15265 6671 3147 601 761 3721
8997 3721 9806 10862 8374 4110 -638 -2608 2446 11375 10273 5275 3725 5124 11022 20823 24675
8982 24675 20026 19810 23119 19947 18143 11455 8832 3530 5168 13864 13018 7692 6749 8355 7914 7100
$$ packed form
9091A7019m31J818K395q13l86j757K377l917q610m826M407O482J364o022p330
9076A770l236M079M526M963j357m341l605n450N58m9M523Q379N354j259p14l697
9060A0444j388P13P79Q63k62J432L591m570m681r116L096Q255j092K98N931N246
9044A9539o303n453k609o849K185J0728Q350j343P76M057o104O29k98N04K189
9029A9998N80k478j993O83J962k763L194q64l561l848j829R71L163o23k337k964
9013G291O73R14L084K911P18l895j392m590K882Q826k157q594l524k546J60K960
8997C721O085J056k488m264m748j970N054Q929j102m998j550J399N898R801L852
8982B4675m649k16L309l172j804o688k623n302J638Q696q46n326r43J606m41q14
$$ plain form
8966 7100 4956 2136 160 -68 5 1467 8142 7147 5350 8406 8966 8016 6966 1050 4145 11450
8950 11450 16826 14963 7747 2501 589 2284 -3532 -2154 9442 13012 10401 8613 7033 11637
8936 11637 10943 2748 -2670 -6198 -5339 -2614 745 8427 11347 7385 4705 2110 -1901 -2798 -3785 133
8920 133 -1477 -2439 105 2061 1559 -3853 -3398 2548 2502 265 -293 3973 7613 8227 9366 25 -4937
8903 -4937 -5962 -6465 -8247 -8822 -11118 -9434 -10082 -5627 -3155 -2811 1535 7577 12805 12444 6017 9041
8887 9041 5512 1145 -5240 -4559 4520 5857 2528 9554 8561 411 2856 5614 1384 3110 3464 8310
8871 8310 12001 7738 3946 4202 6316 4586 6996 8992 17253 30280 47874 67823 99135 146764
8857 146764 197418 224806 224250 212417 190157 159104 125306 92151 78010 74417 59389 40169
$$ packed form
8966G100k144k820j976k28P3J462O675r95j797L056N60r50j050n916L095P305
8950A1450N376j863p216n246j912J695n816J378J1596L570k611j788j580M604
8936A1637o94q195n418l528Q59K725L359P682K920l962k680k595m011q97r87L918
8920A33j610r62K544J956n02n412M55N946m6k237n58M266L640O14J139r341m962
8903d937j025n03j782n75k296J684o48M455K472L44M346O042N228l61o427L024
8887I041l529m367o385O81R079J337l329P026r93q150K445K758m230J726L54M846
8871H310L691m263l792K56K114j730K410J996Q261J3027J7594J9949L1312M7629
8857A46764N0654K7388n56j1833k2260l1053l3798l3155j4141l593j5028j9220
$$ plain form
8845 40169 31178 32299 25847 23089 21130 17865 14718 12023 9161 9864 11601 12172 11272 9382 9487 4428
8829 4428 371 -144 -4704 -5681 -2622 4314 12435 18191 18882 14935 21075 13633 7126 4168 6878 15350
8813 15350 18607 16025 16080 9675 4561 4319 4353 -1389 -7668 -2565 1996 15281 23198 17234 10582 8539
8797 8539 8360 4146 -1650 -4645 -3576 -6240 -8418 -13468 -11263 -5051 -4278 -6591 -6815 -2369 -2038 62
8781 62 6335 10519 11949 8138 -685 -3225 5965 14425 14869 16719 19030 18629 16310 14765 10855 13166
8765 13166 17932 12116 12930 12583 5241 5225 8310 6864 9031 16446 21533 19106 16493 20155 23262 17693
8749 17693 16422 16803 17256 22144 23977 26008 21243 16268 18057 17952 13521 8963 6730 10157 10784 13559
8733 13559 17170 18150 13107 19585 20388 21197 17894 18546 24836 28132 26908 30259 37936 44607 40108 36602
$$ packed form
8845D0169q991J121o452k758j959l265l147k695k862P03J737N71r00j890J05n059
8829D428m057n15m560r77L059O936Q121N756O91l947O140p442o507k958K710Q472
8813A5350L257k582N5o405n114k42L4n742o279N103M561J3285P917n964o652k043
8797H539j79m214n796k995J069k664k178n050K205O212P73k313k24M446L31K100
8781F2O273M184J430l811q823k540R190Q460M44J850K311m01k319j545l910K311
8765A3166M766n816Q14l47p342j6L085j446K167P415N087k427k613L662L107n569
8749A7693j271L81M53M888J833K031m765m975J789j05m431m558k233L427O27K775
8733A3559L611R80n043O478Q03Q09l303O52O290L296j224L351P677O671m499l506
$$ plain form
8717 36602 36866 36046 36025 37869 42111 34217 25447 26431 25367 20084 17226 21272 22627 26233 31718 37425
8701 37425 39978 39520 43078 41954 39665 48670 58181 49460 46984 43239 42997 48877 45196 47665 53820
8686 53820 57950 55527 57115 63347 65033 55207 51819 51017 52357 54886 60118 63082 68516 74221 77916
8671 77916 83845 79032 74314 72423 70336 70395 66666 58667 62600 68608 71752 73445 72687 72396 68224 69419
8655 69419 69056 72292 82158 83374 88588 97248 104954 105476 111407 116914 119746 117483 115868 122588 129657
8640 129657 131550 128605 126183 126642 132928 135468 144244 148648 150645 152809 158777 172179 189048 200838
8626 200838 215516 231652 250421 272901 296286 320523 339670 351677 364047 380607 398324 408270
8614 408270 409238 409231 403357 391964 384322 373778 359354 346882 333886 327027 319226 307619 302382 299232
$$ packed form
8717C6602K64q20k1J844M242p894q770R84j064n283k858M046J355L606N485N707
8701C7425K553m58L558j124k289R005R511q721k476l745k42N880l681K469O155
8686E3820M130k423J588O232J686r826l388q02J340K529N232K964N434N705L695
8671G7916N929m813m718j891k087N9l729p999L933O008L144J693p58k91m172J195
8655F9419l63L236R866J216N214Q660P706N22N931N507K832k263j615O720P069
8640A29657J893k945k422M59O286K540Q776M404J997K164N968J3402J6869J1790
8626B00838J4678J6136J8769K2480K3385K4237J9147J2007J2370J6560J7717R946
8614D08270R68pn874j1393p642j0544j4424j2472j2996o859p801j1607n237l150
$$ plain form
8600 299232 292514 292910 289349 281116 274674 271681 263586 244309 230203 217456 195844 181626 169962
8587 169962 157527 147604 143524 127666 115217 107961 101306 97325 91914 87166 83442 72353 63636
8574 63636 56358 50258 46347 40253 31298 33163 36329 34517 34172 33300 32919 35356 38032 35368 29048
8559 29048 29960 35242 37815 32530 31026 35719 37966 37988 33085 26641 21732 16333 14894 10580 7210
8544 7210 7870 10699 14660 16257 16065 10381 4817 6201 7397 7496 8926 8227 281 -4979 -12954 -11437
8528 -11437 -9728 -6295 -2455 583 1529 283 506 -23 -4106 -5817 -1544 3810 387 1843 7507
8513 7507 8887 14405 20476 18955 20746 14147 12458 10393 12185 10791 9524 8930 -277 -1718 994
8498 994 -3621 -4241 -323 4484 8581 8899 13693 13353 10654 5327 6956 13385 19025 21501 23638 16054
$$ packed form
8600B99232o718L96l561q233o442k993q095j9277j4106j2747k1612j4218j1664
8587A69962j2435r923m080j5858j2449p256o655l981n411m748l724j1089q717
8574F3636p278o100l911o094q955J865L166j812l45q72l81K437K676k664o320
8559B9048R12N282K573n285j504M693K247K2m903o444m909n399j439m314l370
8544G210O60K829L961J597j92n684n564J384J196R9J430o99p946n260p975J517
8528a1437J709L433L840L038R46j246K23n29m083j711M273N354l423J456N664
8513G507J380N518O071j521J791o599j689k065J792j394j267n94r207j441K712
8498I94m615o20L918M807M097L18M794l40k699n327J629O429N640K476K137p584
$$ plain form
8482 16054 13154 14725 15141 12580 16983 17330 13571 12066 14643 19229 24313 26213 22568 16079 12544
8467 12544 12430 8802 9812 14035 17366 23115 21742 19245 18068 15777 19546 17999 13411 11792 12088
8452 12088 8451 4873 9334 10709 12903 12862 9828 8955 11864 20177 25225 26781 25559 26782 28240
8437 28240 26537 23240 22526 28465 25266 17920 18542 22501 28001 25397 18404 13465 9133 6154 5388
8422 5388 6351 13817 22889 22600 20720 18786 17061 14975 16441 14569 13242 11709 10708 6375 5584 5143
8406 5143 3852 -1836 -3775 -4031 2252 3414 688 1160 6472 9719 11099 6734 4505 10832 23251
8391 23251 25830 23531 21213 22355 20269 26609 28969 20477 21352 19054 19530 14749 13362 14534 15249
8376 15249 16640 14458 14094 8180 1370 -582 1531 2562 5379 4076 1097 2746 5746 6374 3206
$$ packed form
8482A6054k900J571M16k561M403L47l759j505K577M586N084J900l645o489l535
8467A2544j14l628J010M223L331N749j373k497j177k291L769j547m588j619K96
8452A2088l637l578M461J375K194m1l034q73K909Q313N048J556j222J223J458
8437B8240j703l297p14N939l199p346O22L959N500k604o993m939m332k979p66
8422E388R63P466R072k89j880j934j725k086J466j872j327j533j001m333p91m41
8406E143j291n688j939k56O283J162k726M72N312L247J380m365k229O327J2419
8391B3251K579k299k318J142k086O340K360q492Q75k298M76m781j387J172P15
8376A5249J391k182l64n914o810j952K113J031K817j303k979J649L000O28l168
$$ plain form
8361 3206 3766 4278 5194 12188 13180 15376 20160 8351 -4102 -5301 3163 4116 5665 5113 5898 11976
8345 11976 12294 14268 18357 13288 3464 -1585 4384 5718 4987 10870 14706 17263 22722 19250 11727
8330 11727 9187 5996 2582 -598 678 -2349 -4482 6454 13722 10193 3372 6699 7018 12532 7933
8315 7933 5872 6837 9725 11718 9214 9561 12506 7343 6683 4086 4544 5819 2511 4198 1093 9897
8299 9897 15976 16726 11037 8653 7533 9753 8338 3414 216 5125 11614 15391 17244 15707 17418
8284 17418 15416 16227 13345 8505 7389 12216 12194 4801 7793 3731 -840 2951 6721 1678 -4273
8269 -4273 -7086 -9590 -8874 -3549 1186 2957 7183 12282 19916 21957 19024 19420 12833 5296 10923
8254 10923 9960 10379 12954 13736 16278 16006 6643 11129 7370 6363 8176 10353 11834 9015 8267 13599
$$ packed form
8361C206N60N12R16O994R92K196M784j1809j2453j199Q464R53J549n52P85O078
8345A1976L18J974M089n069r824n049N969J334p31N883L836K557N459l472p523
8330A1727k540l191l414l180J276l027k133J0936P268l529o821L327L19N514m599
8315G933k061R65K888J993k504L47K945n163o60k597M58J275l308J687l105Q804
8299I897O079P50n689k384j120K220j415m924l198M909O489L777J853j537J711
8284A7418k002Q11k882m840j116M827k2p393K992m062m571L791L770n043n951
8269d273k813k504P16N325M735J771M226N099P634K041k933L96o587p537N627
8254A0923r63M19K575P82K542k72r363M486l759j007J813K177J481k819p48N332
$$ plain form
8238 13599 14839 14681 8530 1415 1378 2178 6107 5501 1684 1579 -3282 -7511 1199 2580 6032 5324
8222 5324 -1704 -6852 -6662 -2879 1029 498 2771 2974 3774 5341 9127 12336 8489 331 -1562 -1755
8206 -1755 634 2613 4054 -2029 -10455 -9073 -3790 1040 -931 -4256 -508 5399 8496 3957 4825
8191 4825 7521 3873 3078 7121 2843 -4242 -6549 -698 -2282 -1728 6587 3402 546 6407 7702
8176 7702 8399 4308 4557 5926 548 -4420 1357 3463 3553 5803 16788 38893 68614 92270 96137
8161 96137 87735 78396 63468 50687 44122 32461 27085 18032 10418 14497 15192 10247 4922 2737
8147 2737 4297 3953 -3932 -423 5997 2669 -1881 1591 -777 -3277 -4807 -7974 -2613 6699 12716
8132 12716 14634 11816 8783 5908 13089 17837 23215 32660 40652 54301 68358 75637 74447 75429
$$ packed form
8238A3599J240j58o151p115l7Q00L929o06l817j05m861m229Q710J381L452p08
8222E324p028n148J90L783L908n31K273K03Q00J567L786L209l847q158j893j93
8206a755K389J979J441o083q426J382N283M830j971l325L748N907L097m539Q68
8191D825K696l648p95M043m278p085k307N851j584N54Q315l185k856N861J295
8176G702O97m091K49J369n378m968N777K106R0K250J0985K2105K9721K3656L867
8161I6137q402r339j4928j2781o565j1661n376r053p614M079O95m945n325k185
8147B737J560l44p885L509O420l328m550L472k368k500j530l167N361R312O017
8132A2716J918k818l033k875P181M748N378R445P992J3649J4057P279j190R82
$$ plain form
8118 75429 69168 53780 38808 25245 21817 13668 5046 2195 -115 2775 5174 8096 8487 3514
8104 3514 -59 1452 4169 864 3828 1605 -3867 -5380 -7271 -13197 -13113 -5014 -5166 -11095 -11940 -13669
8088 -13669 -6792 1052 3181 1289 5819 12659 11086 4519 3117 5649 4575 3577 4776 805 4615
8073 4615 2957 6827 12712 14399 11466 11585 24418 28418 28779 31167 32969 30224 32798 37951 36446
8058 36446 38826 46397 54249 55773 59756 70997 74859 84254 95173 107916 114011 116303 123386 128538
8044 128538 123166 122633 121644 126894 130531 131881 134981 137018 133293 129092 126572 131938 128059 118664 118865
8029 118865 118952 111844 111962 114380 109190 106478 111546 112430 112408 112903 112378 113979 122717 132321 147259 159777
8013 159777 175755 212681 256488 324416 411649 514921 610781 658105 654220 609741 545432 467995
$$ packed form
8118G5429o261j5388j4972j3563l428q149q622k851k310K890K399K922L91m973
8104C514l573J511K717l305K964k223n472j513j891n926Q4Q099j52n929q45j729
8088a3669O877P844K129j892M530O840j573o567j402K532j074r98J199l971L810
8073D615j658L870N885J687k933J19J2833M000L61K388J802k745K574N153j505
8058C6446K380P571P852J524L983J1241L862R395J0919J2743O095K292P083N152
8044A28538n372n33r89N250L637J350L100K037l725m201k520N366l879r395K01
8029A18865Q7p108J18K418n190k712N068Q84k2M95n25J601Q738R604J4938J2518
8013A59777J5978L6926M3807O7928Q7233J03272R5860M7324l885m4479o4309p7437
$$ plain form
8001 467995 393704 339352 297117 265494 245238 238314 230101 216764 197243 179473 168461 156775
7989 156775 147399 136031 121685 112524 101876 95157 94317 92435 100214 101462 104529 101652 99283 99190
7975 99190 104945 117669 128620 146425 172369 199051 229796 263388 297650 348911 420269 463849
7963 463849 477646 470997 440552 397833 349608 304030 256069 217828 184340 160944 143875 136434
7951 136434 136173 124935 117064 114586 107049 90819 81049 75514 74375 65413 56198 54823 51431 47383
7937 47383 43756 43956 48103 56662 60256 70991 91385 100705 103853 95747 86384 76601 64971 59957
7923 59957 57972 50870 50084 58337 59059 65704 70720 74280 82038 78784 74872 67063 51998 43154 35852
7908 35852 22101 14760 10366 14196 12541 2747 -3272 -7689 -5130 916 -3426 -9710 -7683 -1756
$$ packed form
8001D67995p4291n4352m2235l1623k0256o924q213j3337j9521j7770j1012j1686
7989A56775r376j1368j4346r161j0648o719q40j882P779J248L067k877k369r3
7975I9190N755J2724J0951J7805K5944K6682L0745L3592L4262N1261P1358M3580
7963D63849J3797o649l0445m2719m8225m5578m7961l8241l3488k3396j7069p441
7951A36434k61j1238p871k478p537j6230r770n535j139q962r215j375l392m048
7937D7383l627K00M147Q559L594J0735K0394R320L148q106r363r783j1630n014
7923E9957j985p102p86Q253P22O645N016L560P758l254l912p809j5065q844p302
7908C5852j3751p341m394L830j655r794o019m417K559O046m342o284K027N927
$$ plain form
7894 -1756 -1792 106 -1140 -2575 -4606 -9386 -11583 -9139 -6923 2390 -1148 -4634 -945 2420 3549
7879 3549 1394 -3121 -4261 -6710 -4965 -5783 -10641 -7466 -2005 547 -3414 -8769 -10476 -5184 -5175 -8999
7863 -8999 -11349 -11824 -14175 -15518 -15115 -15260 -20723 -18303 -14020 -14424 -18369 -13462 -5802 416 -4829 -5536
7847 -5536 -849 4469 -349 -4317 -988 3530 999 -2557 -5436 183 1942 -1267 -5213 -17509 -20435
7832 -20435 -14076 -9227 -4878 -3132 -6050 -8359 141 6236 851 -1131 -2097 -5773 -2018 27 3778
7817 3778 2492 6014 6605 -67 -1580 2068 931 -1803 -6054 -9377 -9705 -13223 -16140 -17079 -10518 -6712
7801 -6712 -8464 -1757 -2553 -7323 -8544 -7189 -7887 -11316 -9560 -9098 -8970 -8119 -9696 -10560 -9819 -7753 -7002
7784 -7002 -2747 -4154 -5549 -2837 -4453 -5109 -1057 5894 4533 -4913 -7711 -13346 -8021 -2634 -3071
$$ packed form
7894a756l6J898j246j435k031m780k197K444K216R313l538l486L689L365J129
7879C549k155m515j140k449J745q18m858L175N461K552l961n355j707N292Rl824
7863h999k350m75k351j343M03j45n463K420M283m04l945M907P660O218n245p07
7847e536M687N318m818l968L329M518k531l556k879N619J759l209l946j2296k926
7832b0435O359M849M349J746k918k309Q500O095n385j982r66l676L755K045L751
7817C778j286L522N91o672j513L648j137k734m251l323l28l518k917r39O561L806
7801f712j752O707p96m770j221J355o98l429J756M62J28Q51j577q64P41K066P51
7784g002M255j407j395K712j616o56M052O951j361r446k798n635N325N387m37
$$ plain form
7769 -3071 -7823 -7716 -2726 490 -2144 -8140 -12111 -9775 -10100 -9954 -7428 -7022 -7286 -11086 -12573 -13766
7753 -13766 -11163 -6935 -6472 -12098 -10899 -12068 -9741 -10224 -16339 -18103 -7852 -4585 -6613 -2363 -3335
7738 -3335 -6688 -5453 -5733 -7228 -11466 -18700 -14480 -12473 -9580 -5158 -6440 -1949 496 -10220 -11797
7723 -11797 -5867 -2221 -5241 -9186 -5059 -5020 -4258 -5627 -6487 -4053 -1038 1821 605 -7058 -8381 -16063
7707 -16063 -23018 -21417 -9899 -1016 5461 6964 -143 -4006 -2894 -5647 -5075 932 8957 3151 1225
7692 1225 3447 -1158 -4878 -3359 1013 5892 4279 732 -785 2259 -7004 -6157 -5173 -3924 -11473
7677 -11473 -10983 -8681 -5002 -9934 -13413 -9457 -4560 -8590 -4850 517 -3776 -945 -533 -1160 -953 1281
7661 1281 904 -3507 -7971 -14719 -18058 -11996 -8913 -12308 -11729 -6364 -7528 -12042 -13355 -14721 -14609 -10169
$$ packed form
7769c071m752J07M990L216k634n996l971K336l25J46K526M06k64l800j487j193
7753a3766K603M228M63n626J199j169K327m83o115j764J0251L267k028M250r72
7738c335l353J235k80j495m238p234M220K007K893M422j282M491K445j0716j577
7723a1797N930L646l020l945M127L9P62j369q60K434L015K859j216p663j323p682
7707a6063o955J601J1518Q883O477J503p107l863J112k753N72O007Q025n806j926
7692A225K222m605l720J519M372M879j613l547j517L044r263Q47R84J249p549
7677a1473M90K302L679m932l479L956M897m030L740N367m293K831M12o27K07K234
7661A281l77m411m464o748l339O062L083l395N79N365j164m514j313j366J12M440
$$ plain form
7645 -10169 -6826 -1739 1984 -351 -324 -1187 -1388 -229 -704 -2719 -3724 -2002 -1453 -5115 -6313 -5800
7629 -5800 -7620 -11435 -5675 1580 5537 7926 13031 11283 7942 9283 8110 4805 -3349 -6553 -7733
7614 -7733 -3422 -88 -7487 -6863 -8077 -5751 -2794 1655 3321 1528 -3997 -1048 -297 285 1375 2724
7598 2724 -3691 -5615 -1349 706 -2758 -1318 4137 5347 2530 -3057 -5960 -3954 -2085 -3810 -5721
7583 -5721 -9310 -11756 -14994 -17851 -12710 -11103 -6239 -6627 295 6371 4237 -5249 -8471 -5917 -7164
7568 -7164 -13014 -20041 -17020 -14336 -14330 -10643 -8689 -5136 -4060 -6761 -9438 -12526 -7194 2161 6946 3630
7552 3630 -5943 -9591 -4923 -5877 -5468 -698 2210 1930 -1651 3242 1402 -1759 -2665 -7264 -4799 -655
7536 -655 5747 3648 -194 2737 340 -2420 469 1458 -1142 -3520 -3505 225 -483 -2458 -8467 -8956
$$ packed form
7645a0169L343N087L723k335K7q63k01J159m75k015j005J722N49l662j198N13
7629e800j820l815N760P255L957K389N105j748l341J341j173l305q154l204j180
7614g733M311L334p399O24j214K326K957M449J666j793n525K949P51N82J090J349
7598B724o415j924M266K055l464J440N455J210k817n587k903K006J869j725j911
7583e721l589k446l238k857N141J607M864l88O922O076k134r486l222K554j247
7568g164n850p027L021K684OL687J954L553J076k701k677l088N332R355M785l316
7552C630r573l648M668r54M09M770K908k80l581M893j840l161r06m599K465M144
7536f55O402k099l842K931k397k760K889R89k600k378J5L730p08j975o009m89
$$ plain form
7520 -8956 -7478 -4041 568 -2843 -3454 -2998 -8934 -10280 -9579 -10289 -8002 -11253 -18034 -13165 -4643 -4500
7504 -4500 -9693 -2884 -3376 -6189 142 -540 -139 -373 -7032 -12095 -8313 -5914 -301 3923 2329 -1989
7488 -1989 3671 8976 6534 -7398 -19904 -8143 -394 -2507 -1086 -2634 -4573 -5112 -4409 -8409 -10587
7473 -10587 -8277 -4692 -9296 -8177 -10525 -14627 -19238 -18328 -12684 -11330 -2932 2755 -7636 -16910 -11821
7458 -11821 -13943 -9235 -5043 -269 -2808 -8978 -15809 -18104 -12275 -10268 -9412 -7839 -10487 -9410 -5612
7443 -5612 -6197 -1880 -53 -4300 -852 6213 922 -7174 -8080 -16289 -18920 -14399 -9444 -9850 -12000 -9401
7427 -9401 -5095 -6781 -9541 -3886 -2351 -741 -2500 -2096 -5471 -8489 -2394 -679 1340 3343 -4319
7412 -4319 -10124 -3411 382 -4554 -6902 -2648 -9127 -12699 -12887 -12158 -6416 -254 -2624 -1513 -2017 -7583
$$ packed form
7520h956J478L437M609l411o11M56n936j346P01p10K287l251o781M869Q522J43
7504d500n193O809m92k813O331o82M01k34o659n063L782K399N613M224j594m318
7488a989N660N305k442j3932j2506J1761P749k113J421j548j939n39P03m000k178
7473a0587K310L585m604J119k348m102m611R10N644J354Q398N687j0391r274N089
7458a1821k122M708M192M774k539o170o831k295N829K007Q56J573k648J077L798
7443e612n85M317J827m247L448P065n291q096r06q209k631M521M955m06k150K599
7427i401M306j686k760N655J535J610j759M04l375l018O095J715K019K003p662
7412d319n805O713L793m936k348M254o479l572j88P29N742O162k370J111n04n566
$$ plain form
7396 -7583 -12710 -9496 -7830 -6098 -12622 -18053 -14533 -11577 -10528 -11420 -12102 -15230 -16205 -15979 -12654 -12578
7380 -12578 -7864 -6682 -9345 -12017 -15803 -11272 -11192 -14662 -14679 -15468 -17981 -11138 -6862 903 5731 4499
7364 4499 -3840 -4475 -2144 -2699 -3199 -5330 -949 -7451 -9785 -6457 -4055 -1936 -3076 -7428 -8891 -12728
7348 -12728 -9312 -5554 -387 982 -2222 -1500 3996 5926 -5572 -13526 -10641 -9088 -6887 -1094 -4201
7333 -4201 -1076 -2049 2315 4081 -4122 -5974 2422 2692 -4126 -8390 -4567 -5589 -9146 -9436 -6512 -9898
7317 -9898 -11628 -5837 -8184 -4084 5251 2468 1087 -3455 -14158 -18805 -16180 -17866 -10429 -7805 -9376
7302 -9376 -16420 -19923 -16950 -17414 -14883 -17300 -13144 -7503 -8040 -5087 -3441 -7188 -11799 -6108 -1388
7287 -1388 -2637 -200 2123 1254 -7002 -8511 -5735 1473 6289 7732 4346 2552 -8243 -15287 -8187
$$ packed form
7396g583n127L214J666J732o524n431L520K956J049q92o82l128r75K26L325P6
7380a2578M714J182k663k672l786M531Q0l470j7p89k513O843M276P765M828j232
7364D499q339o35K331n55n00k131M381o502k334L328K402K119j140m352j463l837
7348a2728L416L758N167J369l204P22N496J930j1498p954K885J553K201N793l107
7333d201L125r73M364J766q203j852Q396K70o818m264L823j022l557k90K924l386
7317i898j730N791k347M100R335k783j381m542j0703m647K625j686P437K624j571
7302i376p044l503K973m64K531k417M156N641n37K953J646l747m611N691M720
7287a388j249K437K323q69q256j509K776P208M816J443l386j794j0795p044P100
$$ plain form
7272 -8187 2654 6294 4688 5779 4244 -700 -5767 -5929 -2159 -905 -2569 -2397 -7675 -4838 -4097
7257 -4097 -3879 -4924 -2022 3941 5882 4473 4142 4875 2342 3463 5874 8440 6294 -2190 -5108 -4806
7241 -4806 -6960 -9488 -9310 -14648 -9205 -1298 -2670 -10184 -5075 5218 2710 2954 -291 -4216 -6052
7226 -6052 -8353 -12121 -8166 -5070 -1657 -6025 -13661 -17666 -11572 -6988 -7573 -7924 -8522 -7008 -3559 -6376
7210 -6376 -16310 -13896 -4838 -4083 -3390 -9112 -4463 -4342 -4244 -1923 -1905 78 -1073 -1802 -112 980 -1033
7193 -1033 -4507 2333 6994 3200 7403 5930 -218 7327 8654 1444 1086 1267 -3152 -6542 -6311 -3641
7177 -3641 -581 105 -606 -2781 1 5442 -1081 -11056 -13394 -14409 -11956 -6880 -10222 -16416 -16245 -8557
7161 -8557 -8729 -8488 -6845 -6805 -5169 -3563 -2813 -3371 -3164 -42 2109 -1064 -4686 -5067 -11692 -12974 -6978
$$ packed form
7272h187J0841L640j606J091j535m944n067j62L770J254j664J72n278K837P41
7257d097K18j045K902N963J941j409l31P33k533J121K411K566k146q484k918L02
7241d806k154k528J78n338N443P907j372p514N109J0293k508K44l245l925j836
7226f052k301l768L955L096L413m368p636m005O094M584n85l51n98J514L449k817
7210f376r934K414R058P55O93n722M649J21R8K321J8J983j151p29J690J092k013
7193a033l474O840M661l794M203j473o148P545J327p210l58J81m419l390K31K670
7177c641L060O86p11k175K782N441o523r975k338j015K453N076l342o194J71P688
7161h557j72K41J643M0J636J606P50n58K07L122K151l173l622l81o625j282N996
$$ plain form
7144 -6978 -7426 -448 -1726 -4426 1845 5222 -2158 -2946 2667 6152 3484 950 -2437 -4203 -6874
7129 -6874 -5379 2733 11016 8248 -2739 -5633 -3895 -9682 -5145 -2645 -2338 -2821 -4522 -3944 -396
7114 -396 -3058 -8948 -7123 -5417 -4998 -9849 -6293 -2916 6117 904 -8553 -7062 -8646 -10166 -4344
7099 -4344 -7255 -6187 -6414 -9107 -1905 5949 6377 4358 3847 1354 -5058 -9434 -6957 -5235 -10025 -954
7083 -954 233 -8758 -10939 -5473 -8995 -9795 -7754 -4693 -3289 -2048 -7566 -6566 -2660 -5566 -4147
7068 -4147 -2746 -5425 -4899 -4524 2171 -423 -5538 -5483 -6710 -8283 -6947 -7275 -5833 -6141 -4108 -871
7052 -871 -6202 -13373 -11261 -8178 -6252 -6049 939 644 -117 1679 2511 2547 623 -6007 -7981 -5040 -13567
7035 -13567 -13847 -9858 -4434 -4578 3223 -653 -2502 3108 2653 -3998 -6435 -10086 -8865 -7626 -10513
$$ packed form
7144f978m48O978j278k700O271L377p380p88N613L485k668k534l387j766k671
7129f874J495Q112Q283k768j0987k894J738n787M537K500L07m83j701N78L548
7114c96k662n890J825J706M19m851L556L377R033n213r457J491j584j520N822
7099d344k911J068k27k693P202P854M28k019n11k493o412m376K477J722m790R071
7083i54J187q991k181N466l522q00K041L061J404J241n518J000L906k906J419
7068d147J401k679N26L75O695k594n115N5j227j573J336l28J442l08K033L237
7052h71n331p171K112L083J926K03O988k95p61J796Q32L6j924o630j974K941q527
7035a3567k80L989N424j44P801l876j849N610m55o651k437l651J221J239k887
$$ plain form
7020 -10513 -12153 -8119 -3146 5266 8563 5530 5199 6007 -3269 -5743 234 1064 3464 4740 5395 6393
7004 6393 1800 -5917 -11378 -7301 -6941 -5386 1703 9851 13334 11343 8806 -389 -11023 -14026 -9637
6989 -9637 -10737 -5701 -2697 -12292 -18785 -19678 -15428 -14215 -13495 -8171 -10209 -5625 917 3879 634
6974 634 -3216 -3744 -6439 -11852 -11935 -9414 -12358 -13976 -13475 -11068 -6043 -4500 -4137 -6297 -9045 -8044
6958 -8044 -6668 -7436 -2059 -2182 3122 2964 652 4405 5977 995 -5964 -8431 -8983 -6517 -3413 -3127
6942 -3127 -2579 -2435 467 -1092 -8617 -11645 -7273 -4658 -2919 -3302 -10227 -16336 -17331 -18469 -14349 -15141
6926 -15141 -12102 -7673 -7577 -2502 879 -1875 -32 760 -4434 -4277 -3848 -3444 -2737 -2118 1873 1257 -724
6909 -724 -6584 -12126 -14396 -15576 -12719 -1211 4271 5560 1498 -4971 -8934 -11751 -5355 1062 -1247
$$ packed form
7020a0513j640M034M973Q412L297l033l31Q08r276k474N977Q30K400J276O55R98
7004F393m593p717n461M077L60J555P089Q148L483j991k537r195j0634l003M389
6989i637j100N036L004r595o493q93M250J213P20N324k038M584O542K962l245
6974F34l850n28k695n413q3K521k944j618N01K407N025J543L63k160k748J001
6958h044J376p68N377j23N304j58k312L753J572m982o959k467n52K466L104K86
6942c127N48J44K902j559p525l028M372K615J739l83o925o109r95j138M120p92
6926a5141L039M429R6N075L381k754J843P92n194J57M29M04P07O19L991o16j981
6909g24n860n542k270j180K857J1508N482J289m062o469l963k817O396O417k309
$$ plain form
6894 -1247 -5526 -10868 -10383 -5505 -8021 -12618 -13062 -11051 -7869 -3801 2639 4931 5264 2705 1117 626
6878 626 6921 1943 -3563 -6210 -3579 -1303 -3296 -11717 -2575 1375 0 -2551 -5812 -14361 -16995
6863 -16995 -18414 -8102 -153 4831 7725 1822 -2590 -8486 -6315 -2880 -10146 -8694 -9925 -5197
6849 -5197 -918 -6911 -12375 -12541 -14449 -17133 -16050 -3859 3095 10732 9960 4249 6445 5356 -7730
6834 -7730 -10253 -3940 5466 3758 3622 3990 2234 -620 -4044 -4845 -1873 3206 2649 -2648 -7281 -10141
6818 -10141 -13229 -11598 -12541 -9872 -7382 -6079 -7397 -7782 -4575 -1311 1224 455 3118 4776 8095
6803 8095 6920 1577 -4183 -8114 -10305 -7854 -2273 926 5155 6482 -2331 -7569 -4125 -5351 -6821
6788 -6821 2483 5734 -1048 -912 -3010 1168 4978 3902 8230 11898 8211 -1405 -3459 -7121 -8848
$$ packed form
6894a247m279n342M85M878k516m597m44K011L182M068O440K292L33k559j588m91
6878F26O295m978n506k647K631K276j993q421R142L950j375k551l261q549k634
6863a6995j419J0312P949M984K894n903m412n896K171L435p266J452j231M728
6849e197M279n993n464j66j908k684J083J2191O954P637p72n711K196j089j3086
6834g730k523O313R406j708j36L68j756k854l424q01K972N079n57n297m633k860
6818a0141l088J631r43K669K490J303j318l85L207L264K535p69K663J658L319
6803H095j175n343n760l931k191K451N581L199M229J327q813n238L444j226j470
6788f821R304L251o782J36k098M178L810j076M328L668l687r616k054l662j727
$$ plain form
6773 -8848 -9632 -13898 -9864 -1939 -4964 -11571 -11322 -6774 -5237 -8779 -7280 -5160 -4316 -9206 -13153 -9058
6757 -9058 -6553 -5643 -8003 -4346 -9097 -8750 670 5719 1908 -10563 -4794 3880 -2394 -6775 -2423
6742 -2423 -994 2633 4862 -237 -4009 276 5050 4070 5744 -1216 -9836 -11160 -3118 -1382 1429
6727 1429 -456 3399 261 -6152 -9553 -2212 -3910 -8874 -4606 1395 299 -3648 -5017 -3995 -8187
6712 -8187 -10531 -10737 -11487 -3140 3300 3988 1609 2910 4427 6498 7637 2477 -2479 -1742 1874 -31
6696 -31 3567 210 2613 3982 573 1203 6765 2977 2577 3185 -7597 -9481 -5958 4796 10313 8193
6680 8193 9970 10098 6037 2936 2303 -3353 -5861 -4870 -8463 -14520 -12965 -9116 -13702 -11182 -9093 -4539
6664 -4539 5084 5208 10505 9858 3619 -1756 218 -1819 -4973 -6684 -8177 -12266 -7432 -1641 -770 -2996
$$ packed form
6773h848p84m266M034P925l025o607K49M548J537l542J499K120Q44m890l947M095
6757i058K505R10k360L657m751L47R420N049l811j2471N769Q674o274m381M352
6742b423J429L627K229n099l772M285M774r80J674o960q620j324Q042J736K811
6727A429j885L855l138o413l401P341j698m964M268O001j096l947j369J022m192
6712h187k344k06p50Q347O440O88k379J301J517K071J139n160m956P37L616j905
6696c1L598l357K403J369l409O30N562l788m00O08j0782j884L523J0754N517k120
6680H193J777J28m061l101o33n656k508R91l593o057J555L849m586K520K089M554
6664d539R623J24N297o47o239n375J974k037l154j711j493m089M834N791Q71k226
$$ plain form
6648 -2996 -3742 -4153 -8096 -16632 -13383 -9407 -1277 3122 1089 -3523 -5101 -4395 -6057 -5438 -3218 24
6632 24 1443 -5761 -2012 -726 -1662 1781 2667 -4226 -7010 -7913 -11215 -2687 504 -4226 -10775 -15876
6616 -15876 -14049 -13241 -15185 -8958 -8348 -10821 -6000 -8991 -4581 -940 3035 10408 8779 3114 2956
6601 2956 -2254 -9047 -7693 -10472 -9027 -2796 -2334 -5482 -5250 -2806 -1757 -1721 -3409 666 1194 -1722
6585 -1722 -762 -1416 -1539 -739 5248 6519 6374 8765 7768 4552 6710 9653 9547 8632 13461 10392 6034
6568 6034 5435 4508 869 245 -4073 -6736 -3479 -6237 -6089 -6047 -4199 6399 1575 2214 8752 6061
6552 6061 4525 5115 10163 13945 12303 2688 -3401 2568 11799 6279 4285 6362 7724 3121 -68
6537 -68 -6530 -8375 -6774 -8298 -11158 -10731 -7745 -6305 -11287 -10289 -11980 -13207 -17769 -20226 -20601 -13429
$$ packed form
6648b996p46m11l943q536L249L976Q130M399k033m612j578P06j662O19K220L242
6632B4J419p204L749J286r36L443Q86o893k784r03l302Q528L191m730o549n101
6616a5876J827Q08j944O227O10k473M821k991M410L641L975P373j629n665j58
6601B956n210o793J354k779J445O231M62l148K32K444J049L6j688M075N28k916
6585a722R60o54j23Q00N987J271j45K391r97l216K158K943j06r15M829l069m358
6568F034n99r27l639o24m318k663L257k758J48M2J848J0598m824O39O538k691
6552F061j536N90N048L782j642r615o089N969R231n520j994K077J362m603l189
6537f8o462j845J601j524k860M27K986J440m982R98j691j227m562k457l75P172
$$ plain form
6521 -13429 -7152 -10769 -8413 -9590 -13997 -17639 -12728 -6514 -1420 -3073 -5517 -7660 -11329 -15453 -7214
6506 -7214 -274 -3190 -8743 -9926 -8168 -1665 1924 -620 -1274 4384 3750 -2480 -1695 1747 1650 -6929
6490 -6929 -15340 -9325 238 3497 6072 949 288 7119 4987 -4288 -5599 1518 -317 -1094 -5319
6475 -5319 -12595 -12941 -10925 -13653 -7885 -4086 -2177 -3343 -9168 -11060 -7025 -4007 -118 -2549 -6516
6460 -6516 -3521 -5911 -12014 -20419 -17848 -12494 -3591 -4628 1137 -2857 -10891 -12274 -6815 -6352 -9145
6445 -9145 -11826 -10650 -11121 -7478 -2783 -2683 -6293 -8441 -8695 -6678 -6373 -11164 -10843 -9057 -6703 -2886
6429 -2886 -673 278 675 -5181 -5747 -7027 858 7215 11372 12482 8307 5463 5951 6122 6347 4410
6413 4410 7370 12147 10360 7434 -3767 -9805 -9240 -2969 3815 2162 -4256 -10522 -7019 -2603 -7418
$$ packed form
6521a3429O277l617K356j177m407l642M911O214N094j653k444k143l669m124Q239
6506g214O940k916n553j183J758O503L589k544o54N658o34o230P85L442r7q579
6490f929q411O015R563L259K575n123o61O831k132r275j311P117j835p77m225
6475e319p276l46K016k728N768L799J909j166n825j892M035L018L889k431l967
6460f516K995k390o103q405K571N354Q903j037N765l994q034j383N459M63k793
6445i145k681J176m71L643M695J00l610k148k54K017L05m791L21J786K354L817
6429b886K213R51L97n856n66j280P885O357M157J110m175k844M88J71K25j937
6413D410K960M777j787k926j1201o038N65O271O784j653o418o266L503M416m815
$$ plain form
6398 -7418 -13698 -16222 -11475 -3213 -4830 -6519 -6933 -4543 2976 2471 -1621 -6729 -11085 -9179 166
6383 166 3502 5213 6100 4034 -1896 -4798 2775 -3365 -1533 4293 4307 6056 6158 6648 378 2307
6367 2307 3473 -1428 -3755 -9413 -5775 -4446 -6884 -3364 440 -5914 -3754 -7846 -12329 -6832 -3199
6352 -3199 -2195 5211 3995 -4923 -8284 -4468 -1179 -292 -7287 -10133 -14627 -12833 -9121 -4242 2999
6337 2999 6158 1697 -724 -5234 -5164 -1916 -2899 -151 -2101 -3289 -2123 -5321 -4336 -6218 -5186 -4238
6321 -4238 345 -5038 -5379 -5039 -4370 -9111 -7222 -4351 -3033 2530 12505 4179 1823 -1238 -3239 -4834
6305 -4834 2137 6298 4860 1930 -1928 -4110 -7377 -8804 -13175 -14188 -6721 1032 1678 -8112 -3184
6290 -3184 2728 -1421 -3820 -4523 -3358 1398 -3776 -14313 -17875 -10527 -10581 -11008 -11041 -11960 -14298 -12621
$$ packed form
6398g418o280k524M747Q262j617j689m14K390P519n05m092n108m356J906R345
6383A66L336J711Q87k066n930k902P573o140J832N826J4J749J02M90o270J929
6367B307J166m901k327n658L638J329k438L520L804o354K160m092m483N497L633
6352c199J004P406j216q918l361L816L289Q87o995k846m494J794L712M879P241
6337B999L159m461k421m510P0L248r83K748j950j188J166l198R85j882J032R48
6321d238M583n383l41L40O69m741J889K871J318N563R975q326k356l061k001j595
6305d834O971M161j438k930l858k182l267j427m371j013P467P753O46r790M928
6290c184N912m149k399p03J165M756n174j0537l562P348n4m27l3r19k338J677
$$ plain form
6274 -12621 -10506 -5262 3874 2479 -1499 -918 3456 6139 915 -2427 -5079 -8311 942 5971 8597
6259 8597 -59 -5155 -5488 -2060 2500 84 2793 3503 4485 -4407 -9797 -6405 -5858 -3937 -4549 -4766
6243 -4766 1556 -2778 -4782 -6106 -842 3109 946 -758 1515 -2998 1107 3900 7070 5562 5325
6228 5325 4058 5015 2679 -1560 -7932 -10045 -9857 -11376 -16846 -11834 -12637 -11114 -12615 -12410 -11734 -10272
6212 -10272 -8590 -10181 -7228 1575 2177 1003 -4658 819 176 -1619 -6638 -10322 -6391 -7339 -6867 -4891
6196 -4891 -5311 38 -831 1257 1568 -5381 -5400 -4619 -2471 -4541 -2240 453 -11354 -13594 -14508 -16555
6180 -16555 -16537 -11750 -8928 -6528 -10841 -14160 -16812 -11721 -9229 -8686 -7109 -5991 -1760 -218 -4360
6165 -4360 -7125 -7723 -5709 -8722 -9861 -10444 -6719 -4770 -8333 -8264 -9142 -10888 -12788 -8818 -8821 -8885 -2258
$$ packed form
6274a2621K115N244R136j395l978N81M374K683n224l342k652l232R253N029K626
6259H597q656n096l33L428M560k416K709P10R82q892n390L392N47J921o12k17
6243d766O322m334k004j324N264L951k163j704K273m513M105K793L170j508k37
6228E325j267R57k336m239o372k113J88j519n470N012q03J523j501K05O76J462
6212a0272J682j591K953Q803O02j174n661N477o43j795n019l684L931r48M72J976
6196d891m20N349q69K088L11o949j9P81K148k070K301K693j1807k240r14k047
6180a6555J8M787K822K400m313l319k652N091K492N43J577J118M231J542m142
6165d360k765n98K014l013j139n83L725J949l563O9q78j746j900L970lo4O627
$$ plain form
6148 -2258 -2771 -5936 -5041 762 4076 -348 -3527 -8891 -15367 -15395 -14584 -9841 -8651 -9689 -11583 -14231
6132 -14231 -16047 -15305 -6821 -8612 -9444 -6816 -5043 -3990 970 4200 804 -1180 1247 -3457 -4711
6117 -4711 -2562 -2373 3444 8249 8079 9621 5357 8129 7088 7512 4278 -777 1661 4851 1269 -5481
6101 -5481 -9442 -9442 -9198 -8278 -7636 -3394 -5170 -8108 -10406 -9962 -8266 -8809 -4625 1992 2388 2502 3917
6084 3917 7340 2384 2240 3228 7947 1417 -5817 -9872 -5279 -3491 909 -1268 1988 2176 -4493 -2602
6068 -2602 -2714 -4403 -6960 -4715 -8030 -7298 -3802 -5829 -4905 -1942 -4750 111 1863 -3456 -5928 -3918
6052 -3918 2193 9778 7278 3825 5228 511 81 -980 -6824 -17184 -18713 -8819 1255 8181 9018
6037 9018 9644 11248 2897 -2720 -9541 -8309 -3711 -9722 -4195 483 1699 -806 -4318 -3657 -381
$$ packed form
6148b258n13l165Q95N803L314m424l179n364o476k8Q11M743J190j038j894k648
6132a4231j816P42Q484j791q32K628J773J053M960L230l396j984K427m704j254
6117d711K149J89N817M805j70J542m264K772j041M24l234n055K438L190l582o750
6101e481l961%K44R20O42M242j776k938k298M44J696n43M184O617L96J14J415
6084C917L423m956j44R88M719o530p234m055M593J788M400k177L256J88o669J891
6068b602j12j689k557K245l315P32L496k027R24K963k808M861J752n319k472K010
6052c918O111P585k500l453J403m717m30j061n844j0360j529R894J0074O926Q37
6037I018O26J604q351n617o821J232M598o011N527M678J216k505l512O61L276
$$ plain form
6022 -381 6518 5336 1960 532 -1025 4713 -5047 -9819 -3583 4617 4920 -4026 -11144 -10935 -8260 -8525
6006 -8525 -1555 6053 2670 1500 3287 3631 6449 5424 2776 6720 9328 5811 -722 -5928 -5752
5991 -5752 -8354 2160 6581 1002 -5008 -4962 -3399 -381 -1516 -1894 -6875 -10597 -10599 -7473 -11702 -11736 -11398
5974 -11398 -10825 -5058 208 2452 -2029 -9818 -11395 -14167 -7270 -1804 2791 -518 -7392 -6535 -4102
5959 -4102 -794 1017 2887 10103 6337 5738 4332 2876 -3790 -3464 -724 -2132 -4341 -5394 -5127 -2206
5943 -2206 4909 2607 2344 -1875 -4082 -2507 -3004 -8151 -5392 -1811 -5426 -7548 -596 -86 -2688 -6900
5927 -6900 -4614 -1156 4259 5046 1983 1436 -4107 -6572 -6678 -6188 -1970 -856 -1166 -1618 -5483 -2080
5911 -2080 2660 5001 6378 11820 13547 13042 16639 12577 11637 9563 3780 1310 1594 -1425 -4898 -6404
$$ packed form
6022c81O899j182l376j428j557N738r760m772O236Q200L03q946p118K09K675k65
6006h525O970P608l383j170J787L44K818j025k648L944K608l517o533n206J76
5991e752k602J0514M421n579o010M6J563L018j135l78m981l722kL126m229l4L38
5974a1398N73N767N266K244m481p789j577k772O897N466M595l309o874Q57K433
5959d102L308J811J870P216l766n99j406j456o666L26K740j408k209j053K67K921
5943b206P115k302k63m219k207J575m97n147K759L581l615k122O952N10k602m212
5927f900K286L458N415P87l063n47n543k465j06M90M218J114l10m52l865L403
5911b080M740K341J377N442J727n05L597m062r40k074n783k470K84l019l473j506
$$ plain form
5895 -6404 -5040 -7454 -7897 -795 -737 -74 5033 14717 10702 2689 -9422 -12201 -14039 -7639 -3768 -3219
5879 -3219 675 -1945 -6609 -2751 378 -3267 -137 2612 6137 10650 10144 5361 230 -1576 -1057
5864 -1057 -7672 -6304 -3267 -3411 -5526 -2607 -3694 -4459 -1993 3217 -2874 -11128 -7749 2776 3433
5849 3433 4533 1523 3887 4484 1813 -4082 -4767 -6671 -6435 -8001 -8290 -8211 -7158 -4472 -5576 -2270
5833 -2270 -4230 -4065 -1018 -5042 -1084 2972 5848 3789 669 2201 -1848 -4405 -1126 1027 -7199
5818 -7199 -4323 2649 -1989 -4447 -7998 -4546 -5485 -59 1069 -1680 -3988 -35 520 767 -4530 -7499
5802 -7499 -2034 -2337 -5051 -8524 -3135 2084 4893 -2775 -2453 1810 3102 1818 -2957 -5590 -4725 3996
5786 3996 -528 -1993 3222 3630 192 -4513 -7544 -1974 -6461 -5485 -1543 1966 -144 4137 4377 -5193
$$ packed form
5895f404J364k414m43P102N8O63N107R684m015q013j2111k779j838O400L871N49
5879c219L894k620m664L858L129l645L130K749L525M513n06m783n131j806N19
5864a057o615J368L037j44k115K919j087p65K466N210o091q254L379J0525O57
5849C433J100l010K364N97k671n895o85j904K36j566k89P9J053K686j104L306
5833b270j960J65L047m024L958M056K876k059l120J532m049k557L279K153q226
5818g199K876O972m638k458l551L452r39N426J128k749k308L953N55K47n297k969
5802g499N465l03k714l473N389N219K809p668L22M263J292j284m775k633Q65Q721
5786C996m524j465N215M08l438m705l031N570m487R76L942L509k110M281K40r570
$$ plain form
5770 -5193 -4790 -518 -5195 -3385 -3464 -2843 -7141 -14026 -6910 -7578 -4647 1090 770 -5073 -5123 -5642 -12418
5753 -12418 -8411 -7810 -2902 -2876 -1221 -2248 -6164 -10531 -14535 -12836 -12423 -8575 -6708 -4258 -508 6361
5737 6361 4977 1316 -938 -3272 -3998 -5299 -6809 -12786 -14992 -11942 -4326 5526 10399 9218 10386
5722 10386 11528 9548 6980 -6138 -9879 -6654 -8174 -8639 -5511 -7996 -15796 -18709 -13801 -8180 -7605
5707 -7605 -8482 -8909 -9098 -6389 695 8449 10254 9986 2182 -1288 -2808 -6739 -4900 150 -1849 -7208
5691 -7208 -6762 -2505 2197 -4828 -8051 -4758 -3555 158 3470 -253 -2791 -1129 4780 6963 2478
5676 2478 1530 3372 1766 -1764 -5547 -12282 -7971 -6196 -10759 -13400 -8532 -3877 1305 2767 3677
5661 3677 6052 4053 4918 3758 -1568 -4401 -1236 1730 -5896 -4177 6417 7412 219 971 979 2625
$$ packed form
5770e193M03M272m677J810p9O21m298o885P116o68K931N737l20n843n0n19o776
5753a2418M007O01M908K6J655j027l916m367m004J699M13L848J867K450L750O869
5737F361j384l661k254k334p26j301j510n977k206L050P616R852M873j181J168
5722A0386J142j980k568j3118l741L225j520m65L128k485p800k913M908N621N75
5707g605q77m27j89K709P084P754J805k68p804l470j520l931J839N050j999n359
5691g208M46M257M702p025l223L293J203L713L312l723k538J662N909K183m485
5676B478r48J842j606l530l783o735M311J775m563k641M868M655N182J462R10
5661C677K375j999Q65j160n326k833L165K966p626J719J0594R95p193P52QJ646
$$ plain form
5645 2625 1194 -5336 -10441 -9569 -6256 -6396 -6892 -1028 -302 -1734 828 1863 -2975 -2258 1372 1264
5629 1264 -4155 -4530 -3094 -5390 -6700 -5611 244 2567 -950 -3114 -32 3749 223 3543 3598 1055
5613 1055 3948 6777 4148 785 173 4480 -444 -8701 -10331 -2827 2731 2479 -1878 -5450 -4055
5598 -4055 -2874 -4891 -5958 -4762 -8764 -11918 -11369 -11263 -8577 -6677 -3192 -2026 -6738 -5228 -2767
5583 -2767 -9005 -8422 -5775 -11563 -11832 -13391 -15052 -14467 -15625 -16323 -11476 -5563 -7712 -11837 -4633 4625
$$ packed form
5645B625j431o530n105Q72L313j40m96N864P26j432K562J035m838P17L630j08
5629A264n419l75J436k296j310J089N855K323l517k164L082L781l526L320N5k543
5613A055K893K829k629l363o12M307m924q257j630P504N558k52m357l572J395
5598d055J181k017j067J196m002l154N49J06K686J900L485J166m712J510K461
5583b767o238N83K647n788k69j559j661N85j158o98M847N913k149m125P204R258
$$ [...]
##END NTUPLES=NMR SPECTRUM
##END=
