##TITLE=Analysis number 326512
Compound Code cc 53646
Book Reference 518/69
Project Code adrs
Chemist Name colinb
##JCAMPDX= 6.0         $$ Bruker NMR JCAMP-DX V2.0
##DATA TYPE= NMR SPECTRUM
##DATA CLASS= NTUPLES
##ORIGIN= Bruker BioSpin GmbH
##OWNER= nmr
$$ XWIN-NMR		Version 3.5
$$ Fri Feb  9 10:02:27 2007 GMT Standard Time (UT+0h)  MAYBRIDGE\nmr@NMR_250MHZ
##.OBSERVE FREQUENCY= 250.131544655141
##.OBSERVE NUCLEUS= ^1H
##.ACQUISITION MODE= SIMULTANEOUS (DQD)
##.ACQUISITION SCHEME= undefined
##.AVERAGES= 16
##.DIGITISER RES= 18
##SPECTROMETER/DATA SYSTEM= dpx250
##.PULSE SEQUENCE= zg30
##.SOLVENT NAME= CDCl3
##.SHIFT REFERENCE= (INTERNAL, CDCl3, 0, 16.522)
##AUDIT TRAIL= $$ (NUMBER, WHEN, WHO, WHERE, WHAT)
$$ ##TITLE= Audit trail, XWIN-NMR		Version 3.5
$$ ##JCAMPDX= 5.01
$$ ##ORIGIN= Bruker BioSpin GmbH
$$ ##OWNER= nmr
$$ C:\u/data/dgb/nmr/ADRS/610/pdata/1/auditp.txt
$$ ##AUDIT TRAIL=  $$ (NUMBER, WHEN, WHO, WHERE, WHAT)
(   1,<2007-02-09 10:02:06.85 +000>,<MAYBRIDGE\nmr>,<NMR_250MHZ>,
      <created by zg, POWCHK disabled, PULCHK disabled
       configuration hash MD5:
       49 4B E0 1D 92 C2 6B 37 9F E6 65 BC 52 41 86 1D
       data hash MD5: 64K
       39 4B 5E 14 3B BD F5 23 00 AC E5 1F 35 91 93 A0>)
(   2,<2007-02-09 10:02:18.43 +000>,<MAYBRIDGE\nmr>,<NMR_250MHZ>,
      <Start of raw data processing
       ef LB = 0.3 FT_mod = 6 PKNL = 1 SI = 32K 
       data hash MD5: 32K
       19 C9 81 E1 EC EC CD F5 00 F4 43 76 B4 EF F9 BB>)
(   3,<2007-02-09 10:02:19.99 +000>,<MAYBRIDGE\nmr>,<NMR_250MHZ>,
      <apk 
       data hash MD5: 32K
       34 AF C3 80 01 E1 7B D8 14 2F 51 0D 99 FC 60 69>)
(   4,<2007-02-09 10:02:20.68 +000>,<MAYBRIDGE\nmr>,<NMR_250MHZ>,
      <abs ABSG = 5 
       data hash MD5: 32K
       E9 F3 0D B5 EB AE E5 A9 40 AE C8 C7 79 DE 9F CD>)
$$ ##END=
$$ 
$$ hash MD5
$$ 35 41 84 DE B6 4C 04 C2 51 C6 39 81 4B 81 B9 F1
##$RELAX= 
##$RELAX= 
##$RELAX= 
##$RELAX= 
##$RELAX= 
##$RELAX= 
##$RELAX= 
$$ Bruker specific parameters
$$ --------------------------
##$DU= <C:\u>
##$EXPNO= 610
##$NAME= <ADRS>
##$PROCNO= 1
##$TYPE= <nmr>
##$USER= <dgb>
##$AMP= (0..31)
100 100 100 100 100 100 100 100 100 100 100 100 100 100 100 100 100 100 
100 100 100 100 100 100 100 100 100 100 100 100 100 100 
##$AQSEQ= 0
##$AQ_mod= 3
##$AUNM= <au_zg>
##$AUTOPOS= <29 >
##$BF1= 250.13
##$BF2= 250.13
##$BF3= 250.13
##$BF4= 250.13
##$BF5= 500.13
##$BF6= 500.13
##$BF7= 500.13
##$BF8= 500.13
##$BYTORDA= 1
##$CFDGTYP= 0
##$CFRGTYP= 5
##$CHEMSTR= <none>
##$CNST= (0..31)
1 1 145 1 1 1 1 1 1 1 1 1 1 1 1 1 1 1 1 1 1 1 1 1 1 1 1 1 1 1 1 1 
##$CPDPRG= <>
##$CPDPRG1= <>
##$CPDPRG2= <>
##$CPDPRG3= <>
##$CPDPRG4= <mlev>
##$CPDPRG5= <mlev>
##$CPDPRG6= <mlev>
##$CPDPRG7= <mlev>
##$CPDPRG8= <mlev>
##$CPDPRGB= <>
##$CPDPRGT= <>
##$D= (0..31)
0 1 0 0 0 0 0 0 0 0.06 0 0 0 0 0 0 0.0002 0 0 0 0 0 0 0 0 0 0 0 0 0 0 
0 
##$DATE= 1171015324
##$DBL= (0..7)
120 120 120 120 120 120 120 120 
##$DBP= (0..7)
150 150 150 150 150 150 150 150 
##$DBP07= 0
##$DBPNAM0= <>
##$DBPNAM1= <>
$$ [...]
##$SUBNAM7= <"">
##$SUBNAM8= <"">
##$SUBNAM9= <"">
##$SW= 20.6930455092707
##$SWIBOX= (0..15)
0 0 3 0 0 0 0 0 0 0 0 0 0 0 0 0 
##$SW_h= 5175.983436853
##$TD= 65536
##$TD0= 1
##$TE= 294.16
##$TE2= 300
##$TE3= 300
##$TEG= 300
##$TL= (0..7)
0 120 120 120 120 120 120 120 
##$TP= (0..7)
150 150 150 150 150 150 150 150 
##$TP07= 0
##$TPNAME0= <>
##$TPNAME1= <>
##$TPNAME2= <>
##$TPNAME3= <>
##$TPNAME4= <>
##$TPNAME5= <>
##$TPNAME6= <>
##$TPNAME7= <>
##$TPOAL= (0..7)
0.5 0.5 0.5 0.5 0.5 0.5 0.5 0.5 
##$TPOFFS= (0..7)
0 0 0 0 0 0 0 0 
##$TUNHIN= 0
##$TUNHOUT= 0
##$TUNXOUT= 0
##$USERA1= <user>
##$USERA2= <user>
##$USERA3= <user>
##$USERA4= <user>
##$USERA5= <user>
##$V9= 5
##$VALIST= <valist>
##$VCLIST= <CCCCCCCCCCCCCCC>
##$VD= 0
##$VDLIST= <DDDDDDDDDDDDDDD>
##$VPLIST= <PPPPPPPPPPPPPPP>
##$VTLIST= <TTTTTTTTTTTTTTT>
##$WBST= 1024
##$WBSW= 4
##$XGAIN= (0..3)
0 0 0 0 
##$XL= 0
##$YL= 0
##$YMAX_a= 433356
##$YMIN_a= -544281
##$ZGOPTNS= <>
##$ZL1= 120
##$ZL2= 120
##$ZL3= 120
##$ZL4= 120
##$ABSF1= 16.522
##$ABSF2= -4.171173
##$ABSG= 5
##$ABSL= 3
##$ALPHA= 0
##$AQORDER= 0
##$ASSFAC= 0
##$ASSFACI= 0
##$ASSFACX= 0
##$ASSWID= 0
##$AUNMP= <proc_1d>
##$AZFE= 0.1
##$AZFW= 0.1
##$BCFW= 0
##$BC_mod= 0
##$BYTORDP= 0
##$COROFFS= 0
##$CY= 12.5
##$DATMOD= 1
##$DC= 0
##$DFILT= <>
##$DTYPP= 0
##$F1P= 14.0000005364418
##$F2P= -0.99999901652339
##$FCOR= 0.5
##$FTSIZE= 32768
##$FT_mod= 6
##$GAMMA= 0
##$GB= 0
##$INTBC= 1
##$INTSCL= 1
##$ISEN= 128
##$LB= 0.3
##$LEV0= 0
##$LPBIN= 0
##$MAXI= 10000
##$MC2= 0
##$MEAN= 0
##$ME_mod= 0
##$MI= 0
##$NCOEF= 0
##$NC_proc= -2
##$NLEV= 6
##$NOISF1= 0
##$NOISF2= 0
##$NSP= 0
##$NTH_PI= 0
##$NZP= 0
##$OFFSET= 16.522
##$PC= 1
##$PHC0= 230.4217
##$PHC1= 5.056917
##$PH_mod= 1
##$PKNL= yes
##$PPARMOD= 0
##$PSCAL= 4
##$PSIGN= 0
##$REVERSE= no
##$SF= 250.13
##$SI= 32768
##$SIGF1= 0
##$SIGF2= 0
##$SINO= 400
##$SIOLD= 32768
##$SREGLST= <1H.CDCl3>
##$SSB= 0
##$STSI= 32768
##$STSR= 0
##$SW_p= 5175.98343685301
##$SYMM= 0
##$S_DEV= 0
##$TDeff= 65536
##$TDoff= 0
##$TI= <Analysis number 999999
Compound Code 99
Book Reference 9
Project Code 9>
##$TILT= no
##$TM1= 0
##$TM2= 0
##$TOPLEV= 0
##$USERP1= <user>
##$USERP2= <user>
##$USERP3= <user>
##$USERP4= <user>
##$USERP5= <user>
##$WDW= 1
##$XDIM= 32768
##$YMAX_p= 435804069
##$YMIN_p= -26514
$$ End of Bruker specific parameters
$$ ---------------------------------
##NTUPLES= NMR SPECTRUM
##VAR_NAME=  FREQUENCY,     SPECTRUM/REAL,   SPECTRUM/IMAG
##SYMBOL=    X,             R,               I
##VAR_TYPE=  INDEPENDENT,   DEPENDENT,       DEPENDENT
##VAR_FORM=  AFFN,          ASDF,            ASDF
##VAR_DIM=   32768,         32768,           32768
##UNITS=     HZ,            ARBITRARY UNITS, ARBITRARY UNITS
##FACTOR=    0.157963299565203, 1,           1
##FIRST=     4132.6476996994, 0,             0
##LAST=      -1043.33573715361, 0,           0
##MIN=       -1043.33573715361, -26514,      0
##MAX=       4132.6476996994, 435804069,     0
$$ Real data points
##PAGE= N=1
##DATA TABLE= (X++(R..R)), XYDATA
$$ [...]
$$ plain form
17223 1797 -394 -4177 -10045 -10172 -7650 -9709 -7687 -2224 -1613 -4425 -2812 -4722 -7198 -3934 -1946
17208 -1946 -812 -5951 -10368 -12785 -12682 -10957 -8886 -7274 -5821 -4817 -1319 -5495 -10323 -7854 -2319
17193 -2319 -4521 -2593 -3784 -6139 -1133 6558 5027 4262 3369 -3078 -10449 -6544 1338 7032 935
17178 935 -2170 -493 1727 -884 -2092 2317 7705 9498 4234 -1641 -1253 4235 902 -3071 -8115
17163 -8115 -9912 -10508 -7948 -11562 -5066 3424 5090 -1647 -9196 -6837 -5497 -9050 -11205 -7385 -5795
17148 -5795 -11577 -9848 -4016 3177 8919 13023 13040 11363 8786 2421 2073 3364 2806 -5880 -12316 -15825
17132 -15825 -16706 -10980 -8190 -3291 -184 -1516 -7576 -10516 -6970 -1546 -4710 -10258 -13699 -11279 -9472
17117 -9472 -368 6869 -602 -4458 999 -3168 -485 1775 -3454 -3048 3575 2510 -8293 -8288 -2952
$$ packed form
17223A797k191l783n868j27K522k059K022N463O11k812J613j910k476L264J988
17208a946J134n139m417k417J03J725K071J612J453J004L498m176m828K469N535
17193b319k202J928j191k355N006P691j531p65q93o447p371L905P882N694o097
17178I35l105J677K220k611j208M409N388J793n264n875L88N488l333l973n044
17163h115j797n96K560l614O496Q490J666o737p549K359J340l553k155L820J590
17148e795n782J729N832P193N742M104J7j677k577o365l48J291n58q686o436l509
17132a5825q81N726K790M899L107j332o060k940L546N424l164n548l441K420J807
17117i472R104P237p471l856N457m167K683K260n229M06O623j065j0803NN336
$$ plain form
17102 -2952 -2368 -1144 -271 4646 4092 8662 11013 2285 -5221 -7503 -3698 -1966 -4048 -3284 -2778 6991
17086 6991 7877 6757 9514 4892 -6008 -1080 -6039 -9688 -19588 -22982 -17513 -8429 -4140 -2788 -2746
17071 -2746 -1917 -5726 1089 1908 -483 -6444 -6587 -448 3772 3663 -1050 -4635 -6937 -10961 -14562 -8482
17055 -8482 -3483 -13225 -13718 -2035 239 1830 5606 5146 17 -10070 -11179 -15244 -12226 -6943 -2399
17040 -2399 -1154 -1735 2450 4371 2779 -6384 -9752 -9813 -7746 -4097 -6356 -7843 -8509 -8614 -8140 -13772
17024 -13772 -9673 705 547 -3433 -3092 -1698 6520 4901 -3904 -5532 -3234 1031 6516 8192 -2033
17009 -2033 -1871 3149 9510 4282 1877 3136 4744 7379 1346 -4862 -1237 2808 -1248 -2890 -4870
16994 -4870 1360 7505 2863 9239 8757 -1469 -6653 -11894 -9705 -11949 -11499 -10180 -10372 -7117 -6075
$$ packed form
17102b952N84J224Q73M917n54M570K351q728p506k282L805J732k082P64N06R769
17086F991Q86j120K757m622j0900M928m959l649r900l394N469R084M289J352M2
17071b746Q29l809O815Q19k391n961j43O139M220j09m713l585k302m024l601O080
17055h482M999r742m93J1683K274J591L776m60n129j0087j109m065L018N283M544
17040b399J245n81M185J921j592r163l368o1K067L649k259j487o66j05M74n632
17024a3772M099J0378j58l980L41J394Q218j619q805j628K298M265N485J676j0225
17009b033J62N020O361n228k405J259J608K635o033o208L625M045m056j642j980
16994d870O230O145m642O376m82j0226n184n241K189k244M50J319j92L255J042
$$ plain form
16979 -6075 -9558 -6205 -5805 -7395 -14533 -15079 -12156 -5788 606 -2027 -6638 -5252 294 1545 -253
16964 -253 -6926 -3123 3635 2761 1094 -3203 -392 2338 841 -5051 -2263 3958 1415 -3675 -4052
16949 -4052 -115 4750 6603 6988 5032 726 7980 10796 10289 4618 -2185 -698 1595 4731 5798
16934 5798 3603 3658 1417 3794 6703 9387 9292 8569 3117 1959 4836 788 -9646 -9697 -7658 -4990
16918 -4990 -1589 -2104 -4698 -6918 -7546 -4765 28 5755 5656 5688 4440 4146 -4356 -9724 -10148 -6765 -13903
16901 -13903 -17773 -16283 -12085 -4295 -1864 1497 -3798 -9942 -10517 -1997 -2501 -4091 -6928 -7282 -5872
16886 -5872 -8460 -12796 -12294 -8082 -3513 -557 -2506 -8359 -10182 -12023 -14872 -9604 -4467 -6449 -5853
16871 -5853 -3275 3234 5565 1180 -8442 -12534 -11462 -1640 8258 11939 6613 7338 4444 2399 4533
$$ packed form
16979f075l483L353M00j590p138n46K923O368O394k633m611J386N546J251j798
16964b53o673L803O758q74j667m297K811K730j497n892K788O221k543n090l77
16949d052L937M865J853L85j956m306P254K816n07n671o803J487K293L136J067
16934E798k195N5k241K377K909K684r5p23n452j158K877m048j0434n1K039K668
16918d990L401n15k594k220o28K781M793N727r9L2j248k94q502n368m24L383p138
16901a3903l870J490M198P790K431L361n295o144n75Q520n04j590k837l54J410
16886e872k588m336N02M212M569K956j949n853j823j841k849N268N137j982N96
16871e853K578O509K331m385r622m092J072R822R898L681n326P25k894k045K134
$$ plain form
16856 4533 3825 -276 -6109 -10018 -3075 -2607 -7885 117 -4525 -7641 -12213 -14091 -14913 -10092 -247
16841 -247 3779 1361 -1163 -7455 -8302 -4237 -2781 -9857 -9256 -6829 -1457 9068 11761 -2057 -9117
16826 -9117 -10143 -4130 -4638 -9941 -3899 -8227 -16050 -9085 -1803 -3265 -7877 -6527 -3875 -3777 -1059
16811 -1059 3249 5521 4140 -4229 -15775 -7390 794 716 -3979 -4144 1742 791 2507 -1883 -12273
16796 -12273 -15719 -8954 -11137 -13167 -15192 -10870 -9306 -5462 -5486 -6042 -1713 -2087 -7667 -6161 -7973
16781 -7973 -12264 -16754 -20458 -19332 -17668 -14935 -9107 -7431 -9790 -4702 -5739 -8969 -9225 -15461 -14864
16766 -14864 -9703 -7526 -8575 -15862 -13294 -3645 -7084 -7224 -3437 -2057 2586 10835 3254 -3144 -7754
16751 -7754 -8718 -12433 -15856 -17018 -15061 -22382 -21944 -13110 -8417 -5482 -4145 -5253 -7490 -8386 -7297
$$ packed form
16856D533p08m101n833l909O943M68n278Q002m642l116m572j878q22M821R845
16841b47M026k418k524o292q47M065J456p076O01K427N372J0525K693j3818p060
16826i117j026O013n08n303O042m328p823O965P282j462m612J350K652R8K718
16811a059M308K272j381q369j1546Q385Q184p8m695j65N886r51J716m390j0390
16796a2273l446O765k183k030k025M322J564L844k4n56M329l74n580J506j812
16781g973m291m490l704J126J664K733N828J676k359N088j037l230k56o236N97
16766a4864N161K177j049p287K568R649l439j40L787J380M643Q249p581o398m610
16751g754r64l715l423j162J957p321M38Q834M693K935J337j108k237q96J089
$$ plain form
16736 -7297 -5799 -7892 -9531 -1732 -1665 -2441 -7738 -8533 -4719 -4046 -6930 -8816 -15931 -14694 -7441 -2042
16720 -2042 -1153 1778 -3107 -12015 -16521 -12151 -6053 -1613 -5122 -2859 -2405 2973 -2412 -2171 3448
16705 3448 -245 -5963 -10738 -12832 -14007 -11510 -12436 -6367 -10964 -8635 -5552 -4689 -4379 -5312 -2354 -786
16689 -786 -2746 -2091 -4852 -4960 -7963 -8030 -5206 -3481 299 2003 -3788 -5766 -10532 -12003 -11136 -12115
16673 -12115 -12368 -6494 1173 6160 -1720 -9511 -11706 -15132 -10613 -3778 -1589 -1526 -3029 -2645 -1789 -2537
16657 -2537 -4443 -3817 -2631 -916 -1985 -4646 -541 7262 9225 23 2507 3664 4242 2122 -3140
16642 -3140 549 886 -127 -6316 -13927 -18043 -18001 -3784 6621 7584 956 -1125 -2066 -2069 -5017 -4746
16626 -4746 -2489 -9462 -10719 -2980 -3231 3172 9299 3090 -3506 -8182 -6351 -2852 -10492 -19819 -18516
$$ packed form
16736g297J498k093j639P799O7p76n297p95L814O73k884j886p115J237P253N399
16720b042Q89K931m885q908m506M370O098M440l509K263M54N378n385K41N619
16705C448l693n718m775k094j175K497r26O069m597K329L083Q63L10r33K958J568
16689g86j960O55k761j08l003o7K824J725L780J704n791j978m766j471Q67r79
16673a2115k53N874P667M987p880p791k195l426M519O835K189O3j503L84Q56p48
16657b537j906O26J186J715j069k661M105P803J963r202K484J157N78k120n262
16642c140L689L37j013o189p611m116M2J4217J0405R63o628k081r41lk948K71
16626d746K257o973j257P739k51O403O127o209o596m676J831L499p640r327J303
$$ plain form
16611 -18516 -5748 -979 -1085 1330 -1876 -2881 5299 4699 -2009 -7706 -8449 -6409 -2378 -8534 -8847
16596 -8847 -4732 -3212 -3796 -1627 -3117 -5555 -4289 -6760 -9019 -11125 -1741 -302 -826 -4801 -3443
16581 -3443 -5516 -6254 730 10239 9129 -1440 -4108 -3962 -2184 -498 2127 2157 -5 518 -134 2164
16565 2164 6404 6577 -905 -981 -2897 -5196 -4599 -6063 -3195 6164 5061 2613 3026 -3186 -2013 -3606
16549 -3606 -5258 -5291 -1407 -931 -4924 -4643 -679 10291 13607 8964 211 -826 -5220 -8671 -11035
16534 -11035 -17997 -15329 -7817 -3909 -3625 -5849 -13309 -10461 -2949 -142 -2301 -3510 -7474 -13030 -12821
16519 -12821 -13074 -15535 -11635 -7063 -6583 -6775 -8281 -12414 -18032 -16053 -9310 -4615 623 231 2440
16504 2440 2558 -49 -3011 -4326 2224 10431 8938 5797 8431 2873 438 -3804 -7533 -8336 -10366
$$ packed form
16611a8516J2768M769j06K415l206j005Q180o00o708n697p43K040M031o156l13
16596h847M115J520n84K169j490k438J266k471k259k106R384J439n24l975J358
16581c443k073p38O984R509j110j0569k668J46J778J686K625L0k162N23o52K298
16565B164M240J73p482p6j916k299N97j464K868R359j103k448M13o212J173j593
16549c606j652l3L884M76l993K81L964J0970L316m643q753j037m394l451k364
16534a1035o962K668P512L908K84k224p460K848P512K807k159j209l964n556K09
16519a2821k53k461L900M572M80j92j506m133n618J979O743M695N238l92K209
16504B440J18k607k962j315O550Q207j493l141K634n558k435m242l729q03k030
$$ plain form
16489 -10366 -3708 -7545 -5743 -4810 -3021 -9580 -13096 -10952 -12619 -10419 -10145 1039 9592 8651 4831
16474 4831 -35 -3911 -5353 -6552 -3810 -3082 -3207 -2600 2027 1243 5398 7882 10899 10361 7308 2729
16458 2729 -422 784 773 2766 5964 9374 4568 -5027 -9084 -8077 -11385 -16922 -20517 -21340 -18232
16443 -18232 -15534 -12737 -13422 -8152 -3726 -3140 5263 2632 -11046 -15899 -13474 -9708 -2616 60 4919
16428 4919 -2663 -7356 -8443 -7517 -4275 -6269 -3680 -4994 -7287 -8803 -1859 -8507 -5074 -3330 -6673
16413 -6673 -8848 -1829 2697 -430 -3072 -12905 -8130 925 1702 2004 4968 6083 2683 -4672 -3380
16398 -3380 1767 -6944 -14002 -17049 -21584 -19621 -14248 -14573 -16133 -16809 -13953 -5846 -1125 -5341 -7086
16383 -7086 -5452 -1638 943 -332 -2120 -4575 -6076 2392 8481 8754 6448 125 -940 7053 10054
$$ packed form
16489a0366O658l837J802R33J789o559l516K144j667K200K74J1184Q553r41l820
16474D831m866l876j442j199K742P28j25O07M627p84M155K484L017n38l053m579
16458B729l151J206j1J993L198L410m806r595m057J007l308n537l595q23L108
16443a8232K698K797o85N270M426N86Q403k631j3678m853K425L766P092K676M859
16428D919p582m693j087R26L242j994K589j314k293j516O944o648L433J744l343
16413f673k175P019M526l127k642r833M775R055P77L02K964J115l400p355J292
16398c380N147q711p058l047m535J963N373l25j560o76K856Q107M721m216j745
16383g086J634L814K581j275j788k455j501Q468O089K73k306o323j065P993L001
$$ plain form
16368 10054 2434 933 -1462 -772 2744 -1175 -1703 -3492 -12346 -8056 3474 6432 10614 9788 7640
16353 7640 5470 -924 -366 4490 2158 -3531 -6656 -5681 -3041 -4246 -7364 -7542 -4706 -2536 -2059 322
16337 322 -2072 411 -1363 3624 6786 5925 4608 354 -3227 1287 1722 -2747 -2588 1131 522 -1394
16321 -1394 -6271 -5711 -6301 -6947 -4478 -2738 -1845 -5858 -4204 1713 7276 12371 11416 5417 7870 11793
16305 11793 15153 11549 9954 12478 9603 -1921 -895 1323 3010 2705 1362 1984 124 -2101 -2275
16290 -2275 -11236 -10662 -2458 1930 4628 -652 -873 -877 -250 -2508 759 1170 -1278 2052 -1580 -852 4913
16273 4913 157 -5341 -3086 -6215 -9748 -14606 -10408 -9971 -9685 -4586 -2862 -12315 -13664 -6913 -1445
16258 -1445 -243 -2937 -2031 -2867 -8002 -15795 -18591 -12319 -1532 3311 7255 3921 -4094 -6792 -8087
$$ packed form
16368A0054p620j501k395O90L516l919n28j789q854M290J1530K958M182q26k148
16353G640k170o394N58M856k332n689l125R75K640j205l118j78K836K170M77K381
16337C22k394K483j774M987L162q61j317m254l581M514M35m469J59L719o09j916
16321a394m877N60n90o46K469J740Q93m013J654N917N563N095r55n999K453L923
16305A1793L360l604j595K524k875j1524J026K218J687l05j343O22j860k225j74
16290b275q961N74Q204M388K698n280k21mO27k258L267M11k448L330l632P28N765
16273D913m756n498K255l129l533m858M198M37K86N099J724r453j349O751N468
16258a445J202k694R06q36n135p793k796O272J0787M843L944l334q015k698j295
$$ plain form
16243 -8087 -10502 -11288 -9619 -7758 -7817 -9402 -9871 -8329 -7291 -4661 693 1749 -2750 -6123 -5468 -3421
16227 -3421 -4481 -132 2689 3344 -641 -6044 -5488 -2795 228 2200 -2483 2430 3066 132 6310
16212 6310 3364 -6650 -7218 -7811 -3469 -9563 -10028 1191 4211 3259 184 3150 2975 2433 453 1782
16196 1782 2846 559 -1001 -1496 3406 4877 -1430 -4624 -4629 1338 -3126 -1108 2682 2098 1627 3526
16180 3526 -6670 -6568 -3476 -170 -2375 471 2121 1688 2813 5186 1344 -711 -17 674 -1614
16165 -1614 3213 7162 5097 2535 -245 -3563 -9529 -6682 -1523 -6261 -12674 -10167 -4095 -2506 -3772
16150 -3772 -7270 -7512 -4059 3131 1746 4473 1338 -620 -4694 -8131 -2562 -329 -4058 -3028 -1013
16135 -1013 3072 9818 10772 4565 7707 2710 -1439 7486 7286 4829 4839 -7560 -10157 -10699 -15658 -16766
$$ packed form
16243h087k415p86J669J861n9j585m69J542J038K630N354J056m499l373O55K047
16227c421j060M349K821O55l985n403N56K693L023J972m683M913O36k934O178
16212F310k946j0014n68n93M342o094m65J1219L020r52l075K966j75n42j980J329
16196A782J064k287j560m95M902J471o307l194nN967m464K018L790n84m71J899
16180C526j0196J02L092L306k205K846J650m33J125K373l842k055O94O91k288
16165a614M827L949k065k562k780l318n966K847N159m738o413K507O072J589j266
16150c772l498k42L453P190j385K727l135j958m074l437N569K233l729J030K015
16135a013M085O746R54o207L142m997m149Q925k00k457J0j2399k597n42m959j108
$$ plain form
16119 -16766 -16479 -8765 -4596 -9261 -7837 -9220 -1402 86 -12939 -16597 -7469 -9053 -9017 -13535 -17092
16104 -17092 -11940 -10109 -10036 -7527 -8235 -8015 -8269 -3807 -1294 2294 9085 3127 -2526 -436 -2116 -2126
16088 -2126 1756 -2285 1275 5513 2704 3728 4813 -1977 -7905 -6346 -7800 -5824 -4971 -4240 -1646
16073 -1646 -7436 -4002 -3575 -474 -1822 -2824 -4490 911 880 -1541 -7724 -13274 -10280 -13012 -11005
16058 -11005 -6670 -11828 -10076 -9385 -5942 -4119 -3822 -7060 -8440 -8835 -5737 -1512 -1054 -6551 -8205
16043 -8205 -4389 -1986 -1859 -503 -2992 -5094 -7029 -4589 -11782 -15051 -10315 -7811 -9439 -9268 -11190
16028 -11190 -10367 -6173 -6558 -7643 -10223 -6888 -11194 -9462 -8637 -8868 -5735 435 794 -3667 -7505 -11791
16012 -11791 -12252 -9721 -3768 1419 -2433 -1882 334 -4675 -10496 -20323 -19538 -9116 -3376 -2384 6968
$$ packed form
16119a6766K87P714M169m665J424j383P818J488j3025l658R128j584L6m518l557
16104a7092N152J831P3K509p08K20k54M462K513L588O791n958n653K090j680j0
16088b126L882m041L560M238k809J024J085o790n928J559j454J976Q53P31K594
16073a646n790L434M27L101j348j002j666N401l1k421o183n550K994k732K007
16058a1005M335n158J752O91L443J823K97l238j380l95L098M225M58n497j654
16043h205L816K403J27J356k489k102j935K440p193l269M736K504j628J71j922
16028a1190Q23M194l85j085k580L335m306J732Q25k31L133O170L59m461l838m286
16012a1791m61K531N953N187l852N51K216n009n821r827P85J0422N740R92R352
$$ plain form
15997 6968 3342 -4050 -2109 262 -6606 -5958 -2319 1363 741 -2801 -3932 -6558 339 2731 -1707
15982 -1707 4886 5590 -1340 -2978 -1729 -6271 -5496 1201 -4043 -4302 -880 1174 2363 509 -2382
15967 -2382 -8576 -12768 -15632 -15803 -16570 -11290 -3707 -5987 -2537 1096 4584 3675 2929 -2658 -3090 -2719
15951 -2719 -6539 -6463 -7276 -8485 -6819 -6494 -6804 -5234 -5637 -4465 1726 1135 5010 3935 -183 -4920
15935 -4920 -3033 -800 -3324 -13867 -15519 -8285 -4624 -7784 -8454 -7367 -6150 -2360 -4392 -5259 -11095
15920 -11095 -10566 -9825 -7050 -5256 -11574 -16253 -14818 -14045 -10254 -7569 -7485 -11329 -10645 -14085 -5660 -3798
15904 -3798 -4454 -3017 -8386 -8830 -6508 -5950 -9751 -4681 -3028 -2005 -7829 -11930 -8344 -7031 -9580
15889 -9580 -8313 2789 4186 -4331 -3032 962 5186 9597 5482 -3792 -11960 -6896 739 48 -3690
$$ packed form
15997F968l626p392J941K371o868O48L639L682o22l542j131k626O897K392m438
15982a707O593P04o930j638J249m542P75O697n244k59L422K054J189j854k891
15967b382o194m192k864j71p67N280P583k280L450L633L488r09p46n587m32L71
15951b719l820P6q13j209J666L25l10J570m03J172O191n91L875j075m118m737
15935d920J887K233k524j0543j652P234L661l160o70J087J217L790k032q67n836
15920a1095N29P41K775J794o318m679J435P73L791K685Q4l844O84l440Q425J862
15904c798o56J437n369m44K322N58l801N070J653J023n824m101L586J313k549
15889i580J267J1102J397q517J299L994M224M411m115r274q168N064P635o91l738
$$ plain form
15874 -3690 -1986 -2569 1738 -1652 -3193 -815 -9464 -16662 -7811 -4502 -1585 345 5437 3671 4300
15859 4300 359 -2696 -3177 -8849 -10659 -7958 -5517 -2501 2667 2877 5987 2205 -7646 -4511 -8582
15844 -8582 -9135 -3424 -4969 -7898 -8185 -9588 -12129 -8194 -12086 -15079 -12617 -8053 -12443 -12063 -8933
15829 -8933 -12378 -6401 -349 792 -381 -3420 -2754 5801 3113 708 -7141 -10682 -8134 -9728 -8487
15814 -8487 -3807 -3960 -9712 -10975 -10481 -6008 -783 3190 5763 5075 1298 -4175 -6437 -5851 -10689 -15711
15798 -15711 -16035 -15984 -13001 -10331 -3055 401 -4290 -3950 -902 -3078 -3596 -3928 -235 411 1168 2693
15782 2693 2013 -6886 -10900 -10121 -10291 -11880 -10236 -8444 -11992 -6631 -7337 -2021 -3946 -4628 2028 -3702
15766 -3702 -11433 -12511 -10937 -16278 -14837 -12545 -4739 563 -1449 -12071 -13890 -10849 -9732 -7430
$$ packed form
15874c690J704n83M307l390j541K378q649p198Q851L309K917J930N092j766O29
15859D300l941l055m81n672j810K701K441L016N168K10L110l782r851L135m071
15844h582n53N711j545k929k87j403k541L935l892k993K462M564m390L80L130
15829h933l445N977O052J141j173l039O66Q555k688k405p849l541K548j594J241
15814h487M680j53n752j263M94M473N225L973K573o88l777n473k262N86m838n022
15798a5711l24N1K983K670P276L456m691L40L048k176n18l32L693O46P57J525
15782B693o80q899m014P79j70j589J644J792l548N361p06N316j925o82O656n730
15766c702p731j078J574n341J441K292P806N302k012j0622j819L041J117K302
$$ plain form
15752 -7430 -6613 3681 -2028 -7313 -4033 -784 -4887 -10149 -11110 -6996 -8047 -11936 -8250 -4457 -1689
15737 -1689 -2336 3080 891 126 -2815 -5662 -594 -3713 -6452 -10565 -12249 -4731 -4174 -6198 -6578 -7947
15721 -7947 1200 3358 -2218 -8645 -5763 -8056 -11691 -5363 398 1475 2612 1593 -1085 782 -1848
15706 -1848 -2630 1507 3768 11351 17386 5820 2789 3456 -948 1516 10025 9499 1753 -9432 -10348
15691 -10348 -8653 -15563 -11444 -7747 -10913 -8408 -6619 -2862 5446 5998 1098 -784 1529 4380 1742
15676 1742 -5199 -6524 -15295 -25928 -22072 -15979 -12408 -10412 -9147 -3149 -451 1432 4086 -2745
15662 -2745 -2628 -2512 -1907 3312 -2274 -5073 -3505 -152 -905 -2631 -6017 -9138 -12885 -9353 -3526 4266
15646 4266 343 -5460 -9719 -11909 -9291 -12411 -15705 -12475 -6782 -7190 -18616 -18771 -9913 -4945 -9656
$$ packed form
15752g430Q17J0294n709n285L280L249m103n262r61M114j051l889L686L793K768
15737a689o47N416k189p65k941k847N068l119k739m113j684P518N57k024l80j369
15721g947R147K158n576o427K882k293l635O328N761J077J137j019k678J867k630
15706a848p82M137K261P583O035j1566l031O67m404K464Q509n26p746j1185r16
15691a0348J695o910M119L697l166K505J789L757Q308N52m900j882K313K851k638
15676A742o941j325q771j0633L856O093L571J996J265N998K698J883K654o831
15662b745J17J16O05N219n586k799J568L353p53j726l386l121l747L532N827P792
15646D266l923n803m259k190K618l120l294L230N693m08j1426j55Q858M968m711
$$ plain form
15631 -9656 -6846 -1733 -6519 -2207 5660 -874 -7376 -16392 -14725 -14267 -9789 -1726 4870 -1505 -4605
15616 -4605 -3525 -2103 1053 7462 5548 2521 3272 3446 1879 -2836 -4165 -1095 -2000 -3293 -4835
15601 -4835 -4628 -6513 -8798 -205 -1748 -9849 -13930 -17370 -17579 -18547 -17236 -15749 -19785 -9203 -6487
15586 -6487 -9917 -15388 -17231 -7767 -8490 -9939 -19408 -22794 -15231 -7691 -4948 -1835 -1995 -6190 -12690
15571 -12690 -16901 -12779 -5601 -5212 -2591 -828 -4510 -6218 -3998 -2700 -353 -8228 -10846 -3330 -852
15556 -852 1986 -31 -4072 -5934 -1876 -1005 4457 3694 1289 4472 11020 13776 10053 7901 -95
15541 -95 -3348 -5734 -214 5634 193 -3666 -3733 -6663 -8546 -3151 -1924 -2092 -5758 -6780 -7191 -9210
15525 -9210 -4402 -8113 -13045 -9524 -5736 -8845 -3150 1643 1162 6682 7598 5818 340 -1800 -2460
$$ packed form
15631i656K810N113m786M312P867o534o502r016J667M58M478Q063O596o375l100
15616d605J080J422L156O409j914l027P51J74j567m715j329L070r05j293j542
15601d835K07j885k285Q593j543q101m081l440k09r68J311J487m036J0582K716
15586f487l430n471j843R464p23j449r469l386P563P540K743L113j60m195o500
15571a2690m211M122P178L89K621J763l682j708K220J298K347p875k618P516K478
15556h52K838k017m041j862M058Q71N462p63k405L183O548K756l723k152p996
15541i5l253k386N520N848n441l859o7k930j883N395J227j68l666j022m11k019
15525i210M808l711m932L521L788l109N695M793m81N520R16j780n478k140o60
$$ plain form
15510 -2460 337 -2039 -8748 -6735 -2416 -3671 1011 911 690 -525 -489 901 1131 -3091 -7770 -5288
15494 -5288 -2973 -5258 -3837 -3564 -4430 -5857 -3965 -2894 -3251 -1341 -3961 -5041 -3051 -4634 -3764 -1332
15478 -1332 -2687 -7555 -8263 -8162 -6326 -6913 -7954 -9755 -18265 -17616 -16647 -12875 -14238 -14860 -9681 -6209
15462 -6209 -1906 349 -10331 -8524 -6926 -7980 -6851 -10775 -12784 -11973 -14470 -14050 -13212 -17549 -14968
15447 -14968 -13654 -13505 -16888 -20685 -15966 -19004 -12031 -6194 -13031 -12393 -4435 -660 -5620 -5094 -2792
15432 -2792 -2259 78 6678 7900 -1615 -4433 -4678 2764 3534 -2175 -6585 -2131 5043 6753 -623
15417 -623 -3927 -2452 941 237 -2471 -2037 8031 8244 4134 -2857 -10064 -9853 -10225 1319 5796 3649
15401 3649 3344 2291 -4462 -8350 -3440 -1156 -3015 -5786 -1966 1024 -1889 -7292 -10332 -1137 542
$$ packed form
15510b460K797k376o709K013M319j255M682j00k21j215L6J390K30m222m679K482
15494e288K315k285J421K73q66j427J892J071l57J910k620j080J990j583Q70K432
15478a332j355m868p08J01J836n87j041j801q510O49R69L772j363o22N179L472
15462f209M303K255j0680J807J598j054J129l924k009Q11k497M20Q38m337K581
15447a4968J314J49l383l797M719l038O973N837o837O38P958L775m960N26K302
15432b792N33K337O600J222r515k818k45P442P70n709m410M454P174J710p376
15417f23l304J475L393p04k708M34J0068K13m110o991p207K11l72J1544M477k147
15401C649l05j053o753l888M910K284j859k771L820K990k913n403l040R195J679
$$ plain form
15386 542 -2659 -7578 -6328 2634 4377 4322 5361 2947 847 -1787 -5058 -2572 -1670 -244 2979 2488
15370 2488 1669 1226 -900 -799 -6698 -12808 -13168 -10908 -12330 -7371 -8839 -7965 -5758 -4644 -8322 -12844
15354 -12844 -11066 -11113 -7987 -3172 -3840 -2177 5585 -3389 -8003 -2001 -4291 -3265 -429 1835 1007
15339 1007 5072 2370 2016 725 4039 5348 5634 2084 -7188 -12578 -5292 3126 2370 -4863 -5779 -3089
15323 -3089 -1925 -1411 258 -937 -8237 -15964 -14745 -11937 -12536 -10979 -9226 -6409 -93 -38 -1789 -2750
15307 -2750 -3811 -2845 -4635 -1815 -7470 -4628 2850 -2834 -3088 2574 160 -6361 -7474 -6346 -7371
15292 -7371 -4965 -6966 -8531 -5040 2015 3542 -2809 -7049 -7088 -4768 -6148 -4387 -8152 -7009 -2479
15277 -2479 -5696 -13546 -8231 -5220 -1678 -1412 -6890 134 2380 2149 -3821 -8304 -2432 2441 3579
$$ packed form
15386E42l201m919J250Q962J743n5J039k414k100k634l271K486R02J426L223m91
15370B488q19m43k126J01n899o110l60K260j422M959j468Q74K207J114l678m522
15354a2844J778m7L126M815o68J663P762q974m614O002k290J026K836K264q28
15339A007M065k702l54j291L314J309K86l550r272n390P286Q418p56p233r16K690
15323c089J164N14J669j195p300p727J219K808n99J557J753K817O316N5j751r61
15307b750j061R66j790K820n655K842P478n684k54N662k414o521j113J128j025
15292g371K406k001j565L491P055J527o351m240l9K320j380J761l765J143M530
15277b479l217p850N315L011L542K66n478P024K246k31n970m483N872M873J138
$$ plain form
15262 3579 -1105 -5968 -6272 -2913 807 -2436 3242 535 1463 363 -4883 -11162 -6608 -4319 125
15247 125 3912 6069 3586 -5495 -7438 231 3440 9387 8554 5260 1452 9432 13118 6961 -1264
15232 -1264 -8222 -8438 -5950 -1864 -3194 -7705 -8389 -5560 -11173 -12595 -9174 -6531 1576 3389 -2571
15217 -2571 -4012 -2740 -7995 -6758 -3320 -1019 -8417 -6768 1833 467 4750 13246 6547 -3086 -5330
15202 -5330 -7226 -5100 3457 9140 9257 3596 -5529 -556 -2716 -6306 -8065 -11633 -11458 -12162 -8427
15187 -8427 -3456 -4765 -5567 -6306 5302 5873 2673 1389 -3602 -11627 -9215 -4624 1939 3827 -84
15172 -84 -5088 -3282 769 -2867 -1680 447 -2281 5195 15583 16452 8330 -2481 -9189 -3607 4207
15157 4207 -2201 -5533 543 2993 3156 -324 -3245 -11361 -12735 -5842 -2114 -3180 -985 -2394 -2975
$$ packed form
15262C579m684m863l04L359L720l243N678k707R28j100n246o279M554K289M444
15247A25L787K157k483r081j943P669L209N947q33l294l808P980L686o157q225
15232a264o958k16K488M086j330m511o84K829n613j422L421K643Q107J813n960
15217b571j441J272n255J237L438K301p398J649Q601j366M283Q496o699r633k244
15202e330j896K126Q557N683J17n661r125M973k160l590j759l568J75p04L735
15187h427M971j309q02p39J1608N71l200j284m991q025K412M591O563J888l911
15172h4n004J806M051l636J187K127k728P476J0388Q69q122j0811o708N582P814
15157D207o408l332O076K450J63l480k921q116j374O893L728j066K195j409n81
$$ plain form
15142 -2975 -5815 -16126 -14444 -8414 -14492 -20804 -21336 -16473 -12720 -10480 -5653 -10797 -7486 -4396 -1790
15127 -1790 -2970 600 2777 2808 116 -890 -3492 -8696 -8382 -7417 -7110 -5848 -5262 -4212 -180 836
15111 836 -1665 -2970 -5497 -3836 -5606 -5919 -7693 -4755 -2798 -6820 -12143 -14156 -12101 -7956 -6755
15096 -6755 -5060 -4253 -8750 -8597 -7387 -765 6151 -665 684 1969 -4125 -3865 179 -1012 -5632
15081 -5632 -3783 -773 -5884 488 2205 -4532 -3173 -6228 -2609 -272 3538 9253 9226 7297 10948
15066 10948 7755 4312 5095 -149 -4930 -7476 -6078 -4739 -1339 -927 -2886 -5872 -2627 -325 -2363
15051 -2363 -3440 3315 79 -8558 -6181 -6530 -1297 304 3362 682 -2164 -7920 -7204 -2748 2854
15036 2854 1875 1227 -3131 -6728 -5330 -1094 -3643 -5226 7049 9070 2809 -5136 -14124 -11313 -9157
$$ packed form
15142b975k840j0311J682O030o078o312n32M863L753K240M827n144L311L090K606
15127a790j180L570K177L1k692j006k602n204L14R65L07J262N86J050M032J016
15111H36k501j305k527J661j770l13j774K938J957m022n323k013K055M145J201
15096f755J695Q07m497J53J210O622O916o816J349J285o094K60M044j191m620
15081e632J849L010n111O372J717o737J359l055L619K337L810N715k7j929L651
15066A0948l193l443P83n244m781k546J398J339L400M12j959k986L245K302k038
15051b363j077O755l236q637K377l49N233J601L058k680k846n756P16M456N602
15036B854r79o48m358l597J398M236k549j583J2275K021o261p945q988K811K156
$$ plain form
15021 -9157 -8834 -11771 -12695 -14326 -5224 -527 370 2731 6802 6246 2972 2912 -544 -545 -241 -5195 -8261
15004 -8261 -9833 -14238 -5700 2062 -4904 -7167 -11687 -13690 -13087 -6869 -2070 444 1548 4414 4037
14989 4037 789 -2379 -1136 1500 -3022 -8066 -5497 482 -58 -4985 -3018 1 2624 -341 -9883
14974 -9883 -6868 -4430 -9997 -16371 -16491 -2453 1877 6094 11795 6650 -1429 -1208 -1686 -996 79
14959 79 -5064 -6706 -9817 -12273 -12235 -8042 -3608 1631 2074 -919 -3623 -11195 -8480 -12647 -10452 -8861
14943 -8861 -5985 -2534 -2402 -3630 -5532 -4686 -3194 -528 4002 2898 -1174 -3972 -2351 -3033 -1925
14928 -1925 3779 11658 8546 -416 -8723 -10352 -7326 -12648 -16265 -12973 -14521 -19970 -14729 -11604 -4658
14913 -4658 -851 -568 -732 -168 -5193 -6035 -3398 -3165 -5266 3300 14441 16097 10552 5285 5892 5739
$$ packed form
15021i157L23k937r24j631R102M697Q97K361M071n56l274o0l456jL04m954l066
15004h261j572m405Q538P762o966k263m520k003O03O218M799K514J104K866l77
14989D037l248l168J243K636m522n044K569N979n40m927J967L019K623k965r542
14974i883L015K438n567o374j20J4038M330M217N701n145q079K21m78O90J075
14959G9n143j642l111k456L8M193M434N239M43k993k704p572K715m167K195J591
14943h861K876L451J32j228j902Q46J492K666M530j104m072k798J621o82J108
14928a925N704P879l112q962q307j629L026n322l617L292j548n449N241L125O946
14913d658L807K83j64N64n025q42K637K33k101Q566J1141J656n545n267O07j53
$$ plain form
14897 5739 6134 1417 5625 6427 5132 -462 1277 1199 399 -2607 -4516 -6637 -3824 -7155 -7500 -5881
14881 -5881 -9462 -8558 -11392 -10159 -11997 -7874 -6178 -2451 4059 2533 3637 9111 11377 6676 -2944
14866 -2944 -1747 4240 8280 7082 6236 -1258 -7542 -7956 934 4625 2358 -974 -4550 -2208 3270
14851 3270 2191 2196 2919 2819 3886 4632 3066 699 355 -639 -3884 -3026 -1371 -2209 -9252 -9522 -4296
14834 -4296 -4790 -7802 -2225 2219 5446 6995 887 1991 3427 2731 761 -6291 -3948 -1402 -4321
14819 -4321 -7102 1606 9923 10041 2779 -6449 -13597 -4657 -740 -1523 -4110 947 -1221 -3056 -6668
14804 -6668 -4320 2609 4970 406 -6681 -1866 6263 2658 80 2234 7362 3664 258 1843 -1280
14789 -1280 -8912 -6450 -1193 3688 -1873 -11921 -14880 -6987 -2574 -3983 -5567 607 4670 914
$$ packed form
14897E739L95m717M208Q02j295n594J739p8q00l006j909k121K813l331l45J619
14881e881l581R04k834J233j838M123J696L727O510j526J104N474K266m701r620
14866b944J197N987M040j198q46p494o284m14Q890L691k267l332l576K342N478
14851C270j079NP23j00J067P46j566k367l44r94l245Q58J655q38p043k70N226
14834d296m94l012N577M444L227J549o108J104J436o96j970p052K343K546k919
14819d321k781Q708Q317J18p262r228p148Q940L917p83k587N057k168j835l612
14804f668K348O929K361m564p087M815Q129l605k578K154N128l698l406J585l123
14789a280p632K462N257M881n561j0048k959P893M413j409j584O174M063l756
$$ plain form
14775 914 4354 4354 4188 4261 -10191 -10836 -3028 217 3280 10496 7579 3309 2155 3764 1869 7250
14759 7250 5266 514 -3002 -5039 -5865 -6337 -2938 770 -2512 -4604 -7835 -13689 -10822 -8617 -4700
14744 -4700 3260 -2436 -75 11569 8543 -3300 -7403 -4505 -1174 -1445 -755 1977 7867 6858 7150
14729 7150 3559 -5458 -14434 -11528 -12782 -14202 -10259 -12037 -13787 -7464 -5917 -2399 1793 4213 3211
14714 3211 -2015 2520 1811 -5358 -4027 -7592 -5612 -927 311 -4693 -9726 -10856 -5681 -3249 -7977
14699 -7977 -5900 -9053 -9865 -6814 -3804 -5543 -4846 -5505 -10499 -13341 -6928 -1361 -3228 -10641 -17892
14684 -17892 -20824 -16871 -16021 -8278 149 4606 -3591 -10560 -10717 -8776 -12814 -18339 -16776 -9146 -491
14669 -491 4807 6241 5219 3003 -398 5239 5012 -1124 -1697 2787 9538 14033 14794 15074 13077 6149
$$ packed form
14775I14L440%j66P3j4452o45P808L245L063P216k917m270j154J609j895N381
14759G250j984m752l516k037q26m72L399L708l282k092l231n854K867K205L917
14744d700P960n696K361J1644l026j1843m103K898L331k71O90K732N890j009K92
14729G150l591r017q976K906j254j420L943j778j750O323J547L518M192K420j002
14714C211n226M535p09p169J331l565J980M685J238n004n033j130N175K432m728
14699g977K077l153q12L051L010j739O97o59m994k842O413N567j867p413p251
14684a7892k932L953Q50P743Q427M457q197o969j57J941m038n525J563P630Q655
14669d91N298J434j022k216l401N637k27o136n73M484O751M495P61K80j997o928
$$ plain form
14653 6149 792 -778 1169 3813 3539 1963 -4082 351 3291 -3419 -4997 3790 4169 -156 -4028
14638 -4028 -5890 -1953 -7550 -5697 -2217 572 2436 -148 9496 19297 5543 58 4975 6998
14624 6998 4669 3121 6790 5171 4820 6996 3511 -3653 -4457 -6883 -6224 -3641 -7449 -6775 -218 -2013
14608 -2013 2356 4719 4531 11630 14208 6573 6429 4264 1273 4927 -1503 927 383 -3105 -1710
14593 -1710 4372 5196 -1728 -2556 3886 6763 6297 9093 6098 -2222 -3385 -4966 -4360 -10226 -16649 -16610
14577 -16610 -8903 -1527 8421 12709 15447 18118 20023 17272 10349 3931 352 -3809 -4549 405 8826
14562 8826 12468 6183 -2461 -3785 -5170 -3616 -3623 -3576 557 4101 7172 -1834 -8263 -6639 -4044 3155
14546 3155 5925 -7912 -7268 -212 274 -2358 -562 -1046 2774 2117 -7421 -2835 4289 4708 7518 3924
$$ packed form
14653F149n357j570J947K644k74j576o045M433K940o710j578Q787L79m325l872
14638d028j862L937n597J853L480K789J864k584R644R801j3754n485M917K023
14624F998k329j548L669j619l51K176l485p164q04k426O59K583l808O74O557j795
14608b013M369K363j88P099K578p635j44k165k991L654o430K430n44l488J395
14593a710O082Q24o924q28O442K877m66K796k995q320j163j581O06n866o423L9
14577a6610P707P376R948M288K738K671J905k751o923o418l579m161p40M954Q421
14562H826L642o285q644j324j385J554pM7M133L544L071r006o429J624K595P199
14546C155K770j3837O44P056M86k632J796m84L820o57r538M586P124M19K810l594
$$ plain form
14530 3924 322 5045 4157 8377 10629 8689 8371 7894 149 -1008 330 -1979 4830 8364 3246
14515 3246 2006 7203 9959 8080 2385 5673 6332 2360 900 1283 5064 5847 6166 5189 4269 5185
14499 5185 6324 3879 -1217 -6558 -11513 -3236 -1158 -9059 -16263 -6015 979 -6470 -11911 -8356
14485 -8356 -2120 1516 4555 1247 1820 -1934 -1783 7962 9086 8664 9264 9046 4518 -5360 -7630 -5190
14469 -5190 -12651 -14855 -5036 2344 2871 -999 -5305 -5120 1223 -1136 1152 2340 3867 -51 2157
14454 2157 338 -1820 -4533 -1623 1688 1503 -1512 -5309 -4027 -5827 -11139 -12750 -9066 -9309 -11406
14439 -11406 -9166 -4635 -3071 -5555 -7588 -6118 -4770 3334 6622 5080 1411 285 828 10608 23891
14424 23891 18655 7016 12336 8581 -2098 -946 281 8411 12698 14805 7177 291 -666 -3129
$$ packed form
14530C924l602M723q88M220K252j940l18m77p745j157J338k309O809L534n118
14515C246j240N197K756j879n695L288O59l972j460L83L781P83L19r77r20R16
14499E185J139k445n096n341m955Q277K078p901p204J0248O994p449n441L555
14485h356O236L636L039l308N73l754J51R745J124m22O00k18m528r878k270K440
14469e190p461k204R819P380N27l870m306J85O343k359K288J188J527l918K208
14454B157j819k158k713K910L311j85l015l797J282j800n312j611L684k43k097
14439a1406K240M531J564k484k033J470J348Q104L288j542l669j126N43R780J3283
14424B3891n236j1639N320l755j0679J152J227Q130M287K107p628o886r57k463
$$ plain form
14410 -3129 -3624 -7517 -11398 -10721 -11131 -5350 -1453 -169 -481 -1796 -7558 -11539 -7604 -6435 -12553 -14047
14394 -14047 -11010 -8621 -9436 -6441 -3251 55 -617 -3913 -1193 -4373 -6759 -11814 -11370 -7751 -6623
14379 -6623 -11504 -12716 -14222 -5699 1060 -1385 -3528 -2934 -529 289 -99 -7118 -8633 -8904 -14753 -14311
14363 -14311 -9882 -10254 -6829 -2077 -6009 -9253 -5394 -4297 -6663 -12035 -21322 -14192 -4970 -3602 -7963
14348 -7963 -8257 -8679 -17202 -16164 -7074 -9517 -17694 -18577 -15205 -16216 -19643 -24684 -17877 -3621 -3075
14333 -3075 -8925 -12505 -6702 -3521 -5444 -2536 -4845 -2588 3912 4429 6527 10437 1061 -1051 -3568
14318 -3568 -5898 -2257 809 -596 -3895 -5602 -8169 -8348 -4309 -2908 -5580 -5370 -6007 -6760 -2813 5712
14302 5712 5637 -5270 -11380 -5378 -2789 25 -2002 -2102 516 3388 6281 3681 -1190 -3167 -2887
$$ packed form
14410c129m95l893l881O77m10N781L897J284l12j315n762l981L935J169o118j494
14394a4047L037K389q15K995L190L306o72l296K720l180k386n055M44L619J128
14379f623m881j212j506Q523O759k445k143N94K405Q18l88p019j515k71n849M42
14363a4311M429l72L425M752l932l244L859J097k366n372r287P130R222J368m361
14348g963k94m22q523J038R090k443q177q83L372j011l427n041O807J4256N46
14333c075n850l580N803L181j923K908k309K257O500N17K098L910r376k112k517
14318c568k330L641L066j405l299j707k567j79M039J401k672K10o37p53L947Q525
14302E712p5j0907o110O002K589K814k027j00K618K872K893k600m871j977K80
$$ plain form
14287 -2887 -669 -2790 -1988 4832 2623 -6823 -7962 -5447 -1909 673 307 -490 -8438 -9791 -5622
14272 -5622 -9582 -7013 -1722 -3521 -12801 -11302 -4464 -1255 -11312 -19073 -18367 -11801 -2792 -1664 -2773
14257 -2773 -4199 -556 4358 3090 -747 -5270 -10407 -11223 -5655 -925 1861 2422 929 935 -1958 -3536
14241 -3536 -7490 -12387 -14948 -15755 -13399 -11857 -9893 -12462 -14254 -7321 115 -1236 -1907 953 -592
14226 -592 -1483 -10667 -14639 -13685 -10468 -11320 -7665 -11529 -13676 -11593 -11344 -12510 -11906 -5532 -460 -1079
14210 -1079 1278 4104 -1687 -3576 -4999 -6621 -11898 -10998 -10346 -7138 -5059 -1125 -3897 -185 8809
14195 8809 3753 -4358 -7217 -4703 125 907 -2932 -265 63 -1027 -809 -9121 -13533 -9538 -5456
14180 -5456 -1828 -2415 -1052 -2748 1745 4049 2988 1028 340 2233 3917 1924 -3389 -10716 -18061
$$ packed form
14287b887K218k121Q02O820k209r446j139K515L538K582l66p97p948j353M169
14272e622l960K569N291j799r280J499O838L209j0057p761P06O566R009J128j109
14257b773j426L643M914j268l837m523n137q16N568M730K786N61j493Ok893j578
14241c536l954m897k561q07K356J542J964k569j792O933P436j351o71K860j545
14226e92q91r184l972R54L217q52L655l864k147K083K49j166O04O374N072o19
14210a079K357K826n791j889j423j622n277R00O52L208K079L934k772L712Q994
14195H809n056q111k859K514M828P82l839K667L28j090K18q312m412L995M082
14180e456L628n87J363j696M493K304j061j960o88J893J684j993n313p327p345
$$ plain form
14165 -18061 -13989 -9068 -5872 -7294 -11841 -9924 -2839 -5231 -6859 -2542 -3236 -1873 -5209 -8941 -13735
14150 -13735 -15654 -13886 -14825 -14886 -7634 -5146 -1419 1512 -2511 -12361 -13556 -19127 -21815 -13073 -3999
14135 -3999 -1032 -946 -5999 -11458 -14433 -10569 -6668 -7290 -12120 -15881 -12109 -9384 -10445 -2550 -9987
14120 -9987 -13758 -8322 -7584 -4602 -9180 -15985 -16564 -18213 -16239 -11500 -8621 -14577 -15413 -14753 -7497 -7448
14104 -7448 -7722 -6794 -2627 843 1324 -286 35 1627 -321 -4624 -6354 -4562 5563 7744 1881
14089 1881 -4895 359 4049 2442 -6200 -7719 -4035 2054 2240 -2799 -3871 -957 1526 -4070 -5894
14074 -5894 -3689 -4703 -4582 -3069 4942 3298 -3558 -7010 -9657 -6092 1213 -1750 -4597 -8652 -9605
14059 -9605 -8050 -13282 -10080 -1753 253 606 8383 8299 9440 18849 24319 22865 18445 11495 6684
$$ packed form
14165a8061M072M921L196j422m547J917P085k392j628M317o94J363l336l732m794
14150a3735j919J768r39o1P252K488L727K931m023r850j195n571k688Q742R074
14135c999K967Q6n053n459k975L864L901o22m830l761L772K725j061P895p437
14120i987l771N436P38K982m578o805n79j649J974M739K879n956q36O60P256M9
14104g448k74R28M167L470M81j610L21J592j948m303j730J792J0125K181n863
14089A881o776N254L690j607q642j519L684O089J86n039j072K914K483n596j824
14074e894K205j014J21J513Q011j644o856l452k647L565P305k963k847m055r53
14059i605J555n232L202Q327K006L53P777q4J141R409N470j454m420o950m811
$$ plain form
14044 6684 5647 5533 3199 1844 6085 6228 6702 -6 134 3191 -2398 -11590 -9007 -4475 -8473 -10816
14028 -10816 -11278 -3007 1219 358 -1459 -6298 -5767 -5690 -638 -398 2328 4014 5275 1047 3464 1933
14012 1933 -3595 -4575 -5983 -4192 -4924 -3126 -5763 -5921 -2201 -1241 841 6196 7891 6926 4634 -1735
13996 -1735 -6842 -13200 -11873 -187 6391 -3845 -6893 -1189 -2031 -4455 -1549 -3352 -258 1716
13982 1716 6183 2717 491 2347 8488 -823 -4784 -11293 -10440 -4485 -2262 -1873 -4130 -9643 -7021
13967 -7021 -4127 -3786 -4973 -8535 -8324 -5004 -2393 -6787 -6936 -3119 1113 3108 5725 1032 -2901
13952 -2901 1023 1004 -3523 -3082 -1854 4276 3771 2900 7514 2797 -1353 956 3248 -1376 -2090 965
13936 965 -484 2230 -3062 -5507 -8080 -1120 2537 1832 7862 5445 8550 4458 503 4796 2050
$$ packed form
14044F684j037j14k334j355M241J43M74o708J40L057n589r192K583M532l998k343
14028a0816m62Q271M226q61j817m839N31P7N052K40K726J686J261m228K417j531
14012A933n528r80j408J791p32J798k637j58L720R60K082N355J695r65k292o369
13996a735n107o358J327J1686O578j0236l048N704q42k424K906j803L094J974
13982A716M467l466k226J856O141r311l961o509Q53N955K223L89k257n513K622
13967g021K894L41j187l562K11L320K611m394j49L817M232J995K617m693l933
13952b901L924j9m527M41J228O130n05q71M614m717m150K309K292m624p14L055
13936I65j449K714n292k445k573O960L657p05O030k417L105m092l955M293k746
$$ plain form
13921 2050 -4888 -8140 -9344 -7637 -1210 1196 -526 -8696 -4364 55 -455 -2801 -803 2459 -1503
13906 -1503 -201 -1159 -2542 -926 6220 1471 -2644 -4484 2683 3842 2547 -729 91 842 7001
13891 7001 15520 10225 5750 7167 5751 5997 447 -8315 -11022 -11926 -16540 -15754 -10774 -7937 -3388
13876 -3388 666 1911 -600 -1561 -4926 -10541 -16646 -12820 -7735 -6740 -5373 -6878 -12715 -9140 -7144
13861 -7144 -8805 -4648 -3936 -7186 -9308 -5759 -1562 -2144 -129 6294 -203 -3864 -5514 -8914 -4956
13846 -4956 2519 8691 7894 7861 4418 -3538 -2305 8170 10616 7575 3333 1265 2685 -277 1169
13831 1169 499 539 1412 -79 453 -1096 -1317 -1093 -1858 -107 2594 4963 7222 2971 1561 1585 3195
13814 3195 3025 -5230 -2713 -1246 -1226 4871 10789 12556 7659 11455 8414 3325 439 2840 1278
$$ packed form
13921B050o938l252j204J707O427K406j722q170M332M419n10k346J998L262l962
13906a503J302r58j383J616P146m749m115j840P167J159j295l276Q20P51O159
13891G001Q519n295m475J417j416K46n550q762k707r04m614P86M980K837M549
13876c388M054J245k511r61l365n615o105L826N085R95J367j505n837L575J996
13861g144j661M157P12l250k122L549M197n82K015O423o497l661j650l400L958
13846d956P475O172p97l3l443p956J233J0475K446l041m242k068J420k962J446
13831A169o70M0Q73j491N32j549k21K24p65J751K701K369K259m251j410K4J610
13814C195j70q255K517J467K0O097N918J767m897L796l041n089k886K401j562
$$ plain form
13799 1278 -1355 -4824 -8149 -5833 -7408 -12632 -8329 -967 574 -1443 -34 6418 6696 3964 -3536
13784 -3536 -4905 -7901 -11017 -4044 565 -1690 -4271 -450 2965 574 -5345 -8475 -5616 -3114 532
13769 532 2506 -4772 -5130 -7916 -9281 -13968 -12062 -6133 -2387 -4137 -6009 -1656 8 4511 3134
13754 3134 5449 3076 -1864 2089 944 325 -7477 -3753 276 -2409 -2700 -2031 3741 5924 600
13739 600 -3716 -8275 -9473 -15743 -12639 -2906 3392 1880 -136 -1579 -1165 -1346 4686 8488 6054
13724 6054 1330 -1844 -1362 -549 -6109 -10204 -6623 1006 -10 6042 13553 11622 4068 2167 538
13709 538 1843 -354 -1344 -2103 -3697 -10929 -16501 -17501 -4949 8238 14124 11172 12469 12069 14235
13694 14235 12127 10270 7455 3410 3783 -2221 -180 -2895 -7297 -7929 -9489 -5277 3498 6549 4361
$$ packed form
13799A278k633l469l325K316j575n224M303P362J541k017J409O452K78k732p500
13784c536j369k996l116O973M609k255k581L821L415k391n919l130K859K502L646
13769E32J974p278l58k786j365m687J906N929L746j750j872M353J664M503j377
13754C134K315k373m940L953j145o19p802L724M029k685k91O69N772K183n324
13739F00m316m559j198o270L104R733O298j512k016j443M14j81O032L802k434
13724F054m724l174M82Q13n560m095L581P629j016O052P511j931p554j901j629
13709E38J305k197r90p59j594p232n572j000J2552J3187N886k952J297m00K166
13694A4235k108j857k815m045L73o004K041k715m402o32j560M212Q775L051k188
$$ plain form
13679 4361 1245 5229 7141 5621 8712 9380 11680 9024 7131 8311 14670 18966 12705 3030 -497
13664 -497 9500 13352 13209 13250 13865 20422 25683 27371 26744 20831 15540 10605 10002 14950 11507 13370
13648 13370 10586 11582 12165 6986 5867 5594 5785 638 -5375 -653 70 2900 -4615 -9143 -2577 990
13632 990 -1522 -147 1792 1269 -813 -730 -1026 -3313 -4543 6111 6579 -742 -8289 -7752 3158 12696
13616 12696 11297 9737 10780 12823 12178 8485 7534 6060 1767 -4067 -1647 2493 5440 3558 -185
13601 -185 4 6336 13008 7958 5142 4337 5188 4655 1564 1884 7703 10412 6538 -590 -5109 -11787
13585 -11787 -6506 -3133 -8943 -8814 -8984 -5427 2091 -571 -9373 -9427 -7068 -7203 -5878 -8020 -7487 -5122
13569 -5122 -5180 -10531 -8203 3505 6384 4961 4971 2031 2250 12200 8432 4295 -2326 160 993 606
$$ packed form
13679D361l116L984J912j520L091O68K300k656j893J180O359M296o261r675l527
13664d97R997L852j43M1O15O557N261J688o27n913n291m935o03M948l443J863
13648A3370k784R96N83n179j119k73J91n147o013M722P23K830p515m528O566L567
13632I90k512J375J939n23k082Q3k96k287j230J0654M68p321p547N37J0910R538
13616A2696j399j560J043K043o45l693r51j474m293n834K420M140K947j882l743
13601a85J89O332O672n050k816q05Q51n33l091L20N819K709l874p128m519o678
13585a1787N281L373n810J29j70L557P518k662q802n4K359j35J325k142N33K365
13569e122n8n351K328J1708K879j423J0k940K19R950l768m137o621K486Q33l87
$$ plain form
13553 606 3593 2019 -8414 -6937 906 2615 869 -2496 -7067 -5972 -9679 -12922 -15702 -12887 -11476
13538 -11476 -10781 -3608 -212 -1111 -1039 1819 5700 5930 2477 255 2915 2104 4440 -2183 -7421 -4469
13522 -4469 -6387 -2558 -709 -4812 -4058 -7999 -12149 -10025 -8196 -7810 -2559 2226 -3091 -6480 -3902
13507 -3902 -6113 -3601 -3214 -1261 2580 4294 -3656 -8391 -4104 50 -2353 -4059 -672 -114 1188
13492 1188 5801 11032 13542 8909 3693 2533 2783 2695 632 -3828 -3749 769 13447 14304 4215 -1424
13476 -1424 1175 234 9009 13746 12147 5003 1483 394 4778 -2217 -6032 -1248 -656 -2707 -2583
13461 -2583 -5916 -852 -1471 -81 -662 2585 7393 3983 9002 13870 4604 1912 5513 9411 4619
13446 4619 3447 4739 3292 650 -1246 -3715 -9257 -9579 -5298 -6323 -3032 -1899 -6807 -8951 -2507
$$ packed form
13553F06K987j574j0433J477P843J709j746l365m571J095l707l243k780K815J411
13538a1476O95P173L396q99P2K858L881K30l453k222K660q11K336o623n238K952
13522d469j918L829J849m103P54l941m150K124J829L86N251M785n317l389K578
13507c902k211K512L87J953L841J714p950m735M287M154k403j706L387N58J302
13492A188M613N231K510m633n216j160K50q8k063m460P9M518J2678Q57j0089n639
13476a424K599r41Q775M737j599p144l520j089M384o995l815M784N92k051J24
13461b583l333N064o19J390n81L247M808l410N019M868r266k692L601L898m792
13446D619j172J292j447k642j896k469n542l22M281j025L291J133m908k144O444
$$ plain form
13431 -2507 -10710 -17108 -12582 -8317 -1551 -4188 -4888 -4410 1620 2387 -1060 6774 6559 -4631 -8782
13416 -8782 -6925 -5918 -9660 -13973 -17614 -8680 -4038 -3766 -2040 3332 5076 4110 5117 -1013 -4067
13401 -4067 -5247 295 6231 5696 938 -1590 2443 11371 11721 2678 -1536 3393 9312 9581 1574
13386 1574 3672 6823 9403 -1827 -9338 -4643 -5713 -9972 -5867 -3051 1838 1159 -97 1132 6736
13371 6736 5883 3480 -7776 -12324 -10619 -9301 2659 3709 5672 3918 4538 10476 11570 6852 1481
13356 1481 1541 3714 6400 9974 12062 11397 11454 15557 12057 -349 -7389 -7296 -6544 -4012 -3633 -7561 -4956
13339 -4956 4575 4440 8083 9849 13963 6012 6734 8052 9106 9999 6672 1309 -2060 -4787 -427
13324 -427 -21 358 1695 1569 -2323 420 9488 10383 6755 720 -2326 -4847 -2691 -2801 -4658 -2365
$$ packed form
13431b507q203o398M526M265O766k637p00M78O030P67l447P834k15j1190m151
13416h782J857J007l742m313l641Q934M642K72J726N372J744r66J007o130l054
13401d067j180N542N936n35m758k528M033Q928L50r043m214M929N919K69q007
13386A574K098L151K580j1230p511M695j070m259M105K816M889o79j256J229N604
13371F736q53k403j1256m548J705J318J1960J050J963j754O20N938J094m718n371
13356A481O0K173K686L574K088o65N7M103l500j2406p040R3P52K532L79l928K605
13339d956R531j35L643J766M114p951P22J318J054Q93l327n363l369k727M360
13324d27M06L79J337j26l892K743R068Q95l628o035l046k521K156j10j857K293
$$ plain form
13308 -2365 305 9539 13059 11827 8894 1801 -1563 1734 829 289 -1170 -113 -4439 -5855 -4230
13293 -4230 -5807 -3760 4745 -719 -3894 -5384 -9415 -5008 1287 2681 3567 5545 6395 7097 5673
13278 5673 10408 14617 11151 6469 4730 210 -4395 -3580 -3103 -376 1062 -239 -4761 -4744 -4655 -6562
13262 -6562 -5968 305 5872 6648 2676 3369 4172 8602 10374 12353 5484 3730 4645 3255 10085 15401
13246 15401 15672 5758 -255 -1181 383 -2671 -1771 2120 5017 4726 4954 2037 921 3111 35 3691
13230 3691 7644 7203 1901 654 831 11042 18250 24963 22313 10514 9552 4303 6428 15512 14911
13215 14911 8416 11058 14041 8079 739 -2854 4236 16419 15210 4215 -27 4672 16048 17566
13201 17566 9903 13992 10804 8995 8404 4387 4787 10399 12636 9790 10259 919 -2829 5618 4953
$$ packed form
13308b365K670R234L520j232k933p093l364L297r05n40j459J057m326j416J625
13293d230j577K047Q505n464l175j490m031M407O295J394Q86J978Q50P02j424
13278E673M735M209l466m682j739m520m605Q15M77K727J438j301m522J7Q9j907
13262f562N94O273N567P76l972O93Q03M430J772J979o869j754R15j390O830N316
13246A5401K71r914o013r26J564l054R00L891K897k91K28k917j116K190l076L656
13230C691L953m41n302j247J77J0211P208O713k650j1799r62n249K125R084o01
13215A4911o495K642K983n962p340l593P090J2183j209j0995m242M699J1376J518
13201A7566p663M089l188j809n91m017M00N612K237k846M69r340l748Q447o65
$$ plain form
13186 4953 -1883 -203 1973 3299 7457 1264 4662 6103 8444 6983 8120 6998 5314 3985 5129
13171 5129 16565 13131 6349 4535 5766 14152 19217 10687 8337 8007 6359 5654 2912 5597 9762
13156 9762 7375 3102 7971 15643 13024 6197 -2106 -4685 4719 5762 2668 2635 10451 12461 15553
13141 15553 12765 10738 8221 9946 19918 24098 18592 12135 7872 5034 4212 1678 2161 4434 4083
13126 4083 4074 2384 13370 9235 -325 -2572 -1330 1210 1516 2371 1720 -1674 4419 4043 4487 8109
13110 8109 5888 2536 2489 4797 6016 15658 16084 14692 11601 16602 20897 14475 10546 14200 17984
13095 17984 13363 15121 18737 18813 18203 16507 18389 23405 18001 20797 25007 14838 4142 2572 5266
13080 5266 12494 12652 9022 8250 12327 10543 8391 12065 14067 15780 8979 8058 3168 1744 -157
$$ packed form
13186D953o836J680K176J326M158o193L398J441K341j461J137j122j684j329J144
13171E129J1436l434o782j814J231Q386N065q530k350l30j648p05k742K685M165
13156I762k387m273M869P672k619o827q303k579R404J043l094l3P816K010L092
13141A5553k788k027k517J725R972M180n506o457m263k838q22k534M83K273l51
13126D083rj690J0986m135r560k247J242K540L06Q55o51l394O093l76M44L622
13110H109k221l352m7K308J219R642M26j392l091N001M295o422l929L654L784
13095A7984m621J758L616P6o10j696J882N016n404K796M210j0169j0696j570K694
13080E266P228J58l630p72M077j784k152L674K002J713o801r21m890j424j901
$$ plain form
13065 -157 26 8331 13810 17351 15169 14687 11469 14257 19039 20120 16370 19662 19716 19572 19423 15614
13049 15614 11220 9889 13464 22707 22596 15218 16295 18316 14286 13935 14765 14543 11524 14313 15814
13034 15814 15712 12390 16897 20866 15795 5558 410 1671 1994 4629 7878 12978 14189 10687 12539
13019 12539 13849 20152 23416 20676 16884 16991 17965 19581 19681 20250 18017 14855 12980 3486 -3350
13004 -3350 2221 4276 5870 11649 18192 16603 20224 18760 18834 29518 34025 38686 40339 45021 50288
12989 50288 52187 51666 43727 32507 33334 35846 30860 35814 47625 46608 45125 42341 38846 44824
12975 44824 48994 54649 63140 67267 72735 85802 100560 111856 118174 138335 175504 226144 294719
12962 294719 377754 472690 572628 651692 719793 798917 882806 927713 903277 834105 753699
$$ packed form
13065a57J83Q305N479L541k182m82l218K788M782J081l750L292N4j44j49l809
13049A5614m394j331L575R243j11p378J077K021m030l51Q30k22l019K789J501
13034A5814j02l322M507L969n071j0237n148J261L23K635L249N100J211l502J852
13019A2539J310O303L264k740l792J07R74J616J00N69k233l162j875r494o836
13004c350N571K055J594N779O543j589L621j464P4J0684M507M661J653M682N267
12989E0288J899n21p939j1220Q27K512m986M954J1811j017j483k784l495N978
12975D4824M170N655Q491M127N468J3067J4758J1296O318K0161L7169N0640O8575
12962B94719Q3035R4936R9938P9064O8101P9124Q3889M4907k4436o9172q0406
$$ plain form
12951 753699 679963 596668 499627 395564 299610 224770 178255 153229 125672 103043 87730
12940 87730 85350 82509 75130 73486 62718 58481 54502 48521 49730 52955 43385 39449 36006 39295
12926 39295 36431 33115 29156 27336 24744 21494 16210 11123 11704 15400 16320 21957 21952 17547 16151 16012
12910 16012 8736 2091 11763 21444 27263 28674 26252 22600 24494 23980 24326 19442 9812 12224 13619
12895 13619 11634 7513 10766 20358 26891 30259 29571 22350 15045 17217 18235 21144 19819 18447 17166
12880 17166 18345 13971 16523 22521 25559 27313 22184 28048 34892 40661 44960 39698 38221 39068 48625
12865 48625 46731 41657 39095 36581 35102 42653 42253 43443 43363 40451 35252 36559 43017 42502 43216 40282
12849 40282 43952 42498 38696 36120 35688 42177 38275 28451 24500 22119 15846 11881 11704 14486 12072
$$ packed form
12951G53699p3736q3295r7041j04063r5954p4840m6515k5026k7557k2629j5313
12940H7730k380k841p379j644j0768m237l979n981J209L225r570l936l443L289
12926C9295k864l316l959j820k592l250n284n087N81L696R20N637nm405j396j39
12910A6012p276o645R672R681N819J411k422l652J894n14L46m884r630K412J395
12895A3619j985m121L253R592O533L368o88p221p305K172J018K909j325j372j281
12880A7166J179m374K552N998L038J754n129N864O844N769M299n262j477Q47R557
12865D8625j894n074k562k514j479P551m00J190q0k912n199J307O458n15P14k934
12849D0282L670j454l802k576m32O489l902r824l951k381o273l965j77K782k414
$$ plain form
12834 12072 7010 6136 7738 8164 12926 16757 21631 28508 29763 27249 27955 33486 38755 36026 28719
12819 28719 27174 28420 33083 35643 40838 43692 45109 47126 47673 46428 47808 50759 49846 46061 46242
12804 46242 50197 56753 59980 67124 65734 65469 68493 74026 76773 76809 80414 82668 86581 100976 118755
12789 118755 132438 140854 151484 157282 161158 159829 156122 152820 145960 131691 111894 95974 80153
12776 80153 68156 70922 67854 55098 45502 51534 57901 58633 53337 46088 40533 44653 52135 54901
12762 54901 53020 48577 52823 54184 56493 56061 57973 56671 52005 46499 45308 46209 42957 51912 54295
12747 54295 49753 46307 48164 47408 43358 45161 48457 45316 50507 59363 59888 59106 60788 61373 63018
12732 63018 69673 70497 79379 77877 75026 71206 60423 58438 58180 54233 53662 47864 40989 38898 37728
$$ packed form
12834A2072n062q74J602M26M762L831M874O877J255k514P06N531N269k729p307
12819B8719j545J246M663K560N195K854J417K017N47j245J380K951r13l785J81
12804D6242L955O556L227P144j390k65L024N533K747L6L605K254L913J4395J7779
12789A18755J3683Q416J0630N798L876j329l707l302o860j4269j9797j5920j5821
12776H0153j1997K766l068j2756r596O032O367P32n296p249n555M120P482K766
12762E4901j881m443M246J361K309m32J912j302m666n506j191R01l252Q955K383
12747E4295m542l446J857p56m050J803L296l141N191Q856N25p82J682N85J645
12732F3018O655Q24Q882j502k851l820j0783j985k58l947n71n798o875k091j170
$$ plain form
12717 37728 42799 51985 54742 53940 60637 62840 59140 64031 65192 62761 63852 61859 60580 60868 62514
12702 62514 59459 53099 49558 54791 56561 56269 57114 56287 52289 62125 65492 70460 71953 78253 90548
12687 90548 96941 95839 96014 97413 99931 108304 112481 116450 106711 102917 107151 113767 117327 119300 125952
12672 125952 131334 137373 151996 163629 176853 200990 221872 236579 255951 271235 283628 285487
12660 285487 285752 283526 269873 245007 227902 211751 203562 195236 182619 169661 164840 153638 149200
12647 149200 150802 151565 150174 148860 149202 151115 155441 159337 160918 159520 163381 161440 155888 156169 154827
12632 154827 154476 160342 157516 158713 168772 178682 180297 178334 187151 193100 206105 218895 222614 228484
12618 228484 230929 242739 252441 270339 290129 301348 313379 330814 346882 359719 365977 362790
$$ packed form
12717C7728N071R186K757q02O697K203l700M891J161k431J091j993j279K88J646
12702F2514l055o360l541N233J770k92Q45q27l998R836L367M968J493O300J2295
12687I0548O393j102J75J399K518Q373M177L969r739l794M234O616L560J973O652
12672A25952N382O039J4623J1633J3224K4137K0882J4707J9372J5284J2393J859
12660B85487K65k226j3653k4866j7105j6151q189q326j2617j2958m821j1202m438
12647A49200J602P63j391j314L42J913M326L896J581j398L861j941n552K81j342
12632A54827l51N866k826J197J0059R910J615j963Q817N949J3005J2790L719N870
12618B28484K445J1810R702J7898J9790J1219J2031J7435J6068J2837O258l187
$$ plain form
12606 362790 359888 372981 381370 378150 378308 383077 386452 386265 391681 402845 419676 435785 447011
12593 447011 462566 478421 492300 508728 526651 548794 569515 581310 596033 622747 650296
12582 650296 677195 702254 730919 768539 802131 849853 901583 951299 1009371 1066439 1136795
12571 1136795 1217690 1294654 1370107 1456854 1556526 1664653 1779678 1907024 2053719 2213792
12561 2213792 2387603 2603875 2848402 3130672 3471795 3891499 4417275 5058545 5810517
12552 5810517 6656204 7583175 8604322 9767211 11120262 12682713 14539421 16894382
12544 16894382 20149753 25022892 32684751 44637381 61623812 81551142 99759638
12537 99759638 113566070 125713271 140817600 157125359 165896771 161202305 146862342
$$ packed form
12606C62790k902J3093Q389l220J58M769L375j87N416J1164J6831J6109J1226
12593D47011J5555J5855J3879J6428J7923K2143K0721J1795J4723K6714K7549
12582F50296K6899K5059K8665L7620L3592M7722N1730M9716N8072N7068P0356
12571A136795Q0895P6964P5453Q6747R9672J08127J15025J27346J46695J60073
12561B213792J73811K16272K44527K82270L41123M19704N25776O41270P51972
12552E810517Q45687R26971J021147J162889J353051J562451J856708K354961
12544A6894382L255371M873139P661859J1952630J6986431J9927330J8208496
12537I9759638J3806432J2147201J5104329J6307759Q771412m694466j4339963
$$ plain form
12530 146862342 131856171 119883057 107273844 90316882 70469255 52310646 38730988
12523 38730988 29616302 23624584 19537832 16593042 14381668 12636445 11159241 9816415
12515 9816415 8589819 7505032 6565783 5737240 4996824 4351683 3829881 3411578 3083411
12506 3083411 2813486 2585104 2377676 2199161 2047467 1908811 1784936 1667058 1572327 1483763
12496 1483763 1404262 1336466 1270459 1204001 1159957 1121938 1077646 1036735 995677 952997 910060
12485 910060 870977 833859 799284 771625 749590 720203 688360 672222 650072 623530 603374
12474 603374 582753 565832 546688 527071 507029 488349 472873 455477 429652 409890 387630
12463 387630 371057 353508 335382 322777 312094 301802 286251 282247 286673 287656 288086 286968 281678
$$ packed form
12530A46862342j5006171j1973114j2609213j6956962j9847627j8158609j3579658
12523C8730988r114686n991718m086752k944790k211374j745223j477204j342826
12515I816415j226596j084787r39249q28543p40416o45141n21802m18303l28167
12506C083411k69925k28382k07428j78515j51694j38656j23875j17878r4731q8564
12496A483763p9501o7796o6007o6458m4044l8019m4292m0911m1058m2680m2937
12485I10060l9083l7118l4575k7659k2035k9387l1843j6138k2150k6542k0156
12474F03374k0621j6921j9144j9617k0042j8680j5476j7396k5825j9762k2260
12463C87630j6573j7549j8126j2605j0683j0292j5551m004M426R83M30j118n290
$$ plain form
12450 281678 276503 271125 263023 263688 263602 260302 262768 261575 261385 257195 259405 262988 258386 248864 240781
12435 240781 236784 238334 240752 239273 223729 210724 203324 194421 189788 184988 180380 177673 176507 182092
12421 182092 182248 182652 186869 188789 185930 181935 175756 170365 176424 175782 173179 167974 159114 159165 156325
12406 156325 144313 132773 122227 120644 109414 102111 99024 98334 94618 89505 87067 90544 97146
12393 97146 84872 78885 79739 84044 89426 86528 79042 78726 82402 78853 75733 70732 60487 62599
12379 62599 67273 75815 85843 90812 91843 91954 100006 103817 99751 99970 90158 80052 78388 73846
12365 73846 77528 78764 74621 64965 58279 59243 56453 54493 55296 58209 59264 63782 69045 72486 74581
12350 74581 78000 82728 84295 93132 92226 86383 74212 67282 63631 54570 52292 40027 29661 21641
$$ packed form
12450B81678n175n378q102O65q6l300K466j193j90m190K210L583m602r522q083
12435B40781l997J550K418j479j5544j3005p400q903m633m800m608k707j166N585
12421A82092J56M04M217J920k859l995o179n391O059o42k603n205q860N1k840
12406A56325j2012j1540j0546j583j1230p303l087o90l716n113k438L477O602
12393I7146j2274n987Q54M305N382k898p486l16L676l549l120n001j0245K112
12379F2599M674Q542J0028M969J031J11Q052L811m066K19r812j0106j664m542
12365G3846L682J236m143r656o686R64k790j960Q03K913J055M518N263L441K095
12350G4581L419M728J567Q837r06n843j2171o930l651r061k278j2265j0366q020
$$ plain form
12336 21641 21277 25017 29822 36638 36578 37728 36004 35584 42215 50454 52665 49719 53394 54527 51636
12321 51636 45573 45535 44205 49695 51591 45432 35760 35979 36560 33656 35575 34016 30925 36795 27122
12306 27122 29655 38374 39563 38048 35191 37688 37340 42046 38175 35160 30475 23673 27202 30484 33587
12291 33587 31012 31167 34173 35419 28073 26555 34982 48162 51462 46495 48569 55039 55081 54362 55184
12276 55184 53973 48048 42168 39242 40472 37956 33893 28480 26805 27226 29774 35051 33728 33707 31729
12261 31729 27006 30061 35035 30469 29280 27960 24109 18978 16431 13335 14877 21395 27259 28023 24289
12246 24289 29172 27975 22342 30280 37735 41034 34574 35788 36289 32249 34642 29219 25576 30177 41229
12231 41229 46060 36613 39389 37749 34920 30099 23836 21385 15207 7488 4612 4083 -347 462 -1444
$$ packed form
12336B1641l64L740M805O816o0J150j724m20O631Q239K211k946L675J133k891
12321E1636o063l8j330N490J896o159r672K19N81k904J919j559l091N870r673
12306B7122K533Q719J189j515k857K497l48M706l871l015m685o802L529L282L103
12291C3587k575J55L006J246p346j518Q427J3180L300m967K074O470M2p19Q22
12276E5184j211n925n880k926J230k516m063n413j675M21K548N277j323k1j978
12261C1729m723L055M974m566j189j320l851n131k547l096J542O518N864P64l734
12246B4289M883j197n633P938P455L299o460J214N01m040K393n423l643M601J1052
12231D1229M831r447K776j640k829m821o263k451o178p719k876n29m430Q09j906
$$ plain form
12216 -1444 -2714 1095 1234 3378 7318 12908 8627 3355 7127 7340 2250 -1901 4682 5417 6549
12201 6549 8079 4647 3932 6327 15345 21239 21793 19211 13968 6189 5265 10133 16908 14545 19282
12186 19282 14711 16389 21128 22580 25971 20323 21430 24700 14662 2025 2318 4811 7397 9103
12172 9103 11094 15028 12828 8223 7688 7779 15133 18819 21695 19655 14272 12439 16927 18464 18328 12436
12156 12436 11105 14142 19438 19739 17705 19120 14923 8614 9164 6808 13343 15653 13660 14069 20377
12141 20377 23628 23484 16763 10297 13699 16099 17553 14799 23266 30747 37868 35113 34881 27751 25467
12126 25467 25547 27565 31604 35087 43878 48339 57599 64688 77003 92847 113393 134865 166385 233488
12112 233488 321920 424559 523431 606526 685918 766593 851042 908830 901736 835066 755789
$$ packed form
12216a444j270L809J39K144L940N590m281n272L772K13n090m151O583P35J132
12201F549J530l432p15K395R018N894N54k582n243p779r24M868O775k363M737
12186A9282m571J678M739J452L391n648J107L270j0038j2637K93K493K586J706
12172I103J991L934k200m605n35R1P354L686K876k040n383j833M488J537j36n892
12156A2436j331L037N296L01k034J415m197o309N50k356O535K310j993M09O308
12141B0377L251j44o721o466L402K400J454k754Q467P481P121k755k32p130k284
12126B5467Q0K018M039L483Q791M461R260P089J2315J5844K0546K1472L1520O7103
12112B33488Q8432J02639R8872Q3095P9392Q0675Q4449N7788p094o6670p9277
$$ plain form
12101 755789 688090 615334 522413 411616 311052 233704 183948 149496 123301 99388 78733
12090 78733 65258 60565 52407 39794 40266 34864 30681 21526 20771 22578 15659 7555 1960 280
12076 280 2108 3194 2097 5624 4171 5929 15173 13471 9152 12852 13465 21128 22520 16968 24935
12061 24935 27708 31455 32879 30912 25875 16165 5595 -587 -1088 -5003 -52 3700 5090 4781 63
12046 63 -5242 2313 5913 5928 2900 -2133 -299 87 -1224 -3147 -6082 -2162 636 -1630 -2141 -2326
12030 -2326 -3151 -3698 -3053 -1367 341 3120 3554 2052 -469 519 4036 7787 12093 14074 16376 17638
12014 17638 18793 17674 16711 12165 6621 3879 6984 2067 93 3832 6205 4495 5101 7226 14251
11999 14251 20225 24694 20932 13429 12390 13327 11348 12167 17352 17786 11744 7623 6311 5335 5601 9495
$$ packed form
12101G55789o7699p2756r2921j10797j00564p7348m9756l4452k6195k3913k0655
12090G8733j3475m693q158j2613M72n402m183r155p55J807o919q104n595j680
12076B80J828J086j097L527j453J758R244j702m319L700O13P663J392n552P967
12061B4935K773L747J424j967n037r710j0570o182n01l915M951L752J390l09m718
12046F3n305P555L600J5l028n033J834L86j311j923k935L920K798k266n11j85
12030b326q25n47O45J686J708K779M34j502k521R88L517L751M306J981K302J262
12014A7638J155j119r63m546n544k742L105m917j974L739K373j710O06K125P025
11999A4251N974M469l762p503j039R37j979Q19N185M34o042m121j312r76K66L894
$$ plain form
11983 9495 14134 16926 17216 18002 19991 28415 43622 52855 72529 97961 116846 134080 142504 147636
11969 147636 152117 143920 131166 118230 104950 93657 77515 61347 44497 30588 18437 18201
11957 18201 17395 18692 19121 8598 2053 7849 8855 11772 10553 4875 248 -3214 -787 -4806 -1844
11942 -1844 -8876 -3208 1025 4286 8893 12973 10158 6405 6501 12522 12962 8617 10517 9744 8419 7459
11926 7459 10694 6354 2301 5876 2881 -2461 322 4735 5872 13280 14858 1924 13 3931
11912 3931 6298 10169 7441 7242 4058 -4476 -783 331 3726 2516 7849 9431 10005 8524 3617
11897 3617 -1076 -267 -1046 -5448 -3256 722 -2157 -449 3801 10188 8185 5286 6013 12960 16973
11882 16973 15251 7434 7595 5939 1538 2069 1480 -3316 2542 6431 9428 9872 10622 12111 8828 5757
$$ packed form
11983I495M639K792K90P86J989Q424J5207R233J9674K5432J8885J7234Q424N132
11969A47636M481q197j2754j2936j3280j1293j6142j6168j6850j3909j2151k36
11957A8201q06J297M29j0523o545N796J006K917j219n678m627l462K427m019K962
11942a844p032N668M233L261M607M080k815l753R6O021M40m345J900p73j325r60
11926G459L235m340m053L575k995n342K783M413J137P408J578j2934j911L918
11912C931K367L871k728j99l184q534L693J114L395j210N333J582N74j481m907
11897C617m693Q09p79m402K192L978k879J708M250O387k003k899P27O947M013
11882A6973j722p817J61j656m401N31n89m796N858L889K997M44P50J489l283l071
$$ plain form
11866 5757 963 2714 7170 6499 4511 -4382 -4361 -175 9539 7164 1776 4025 5187 10763 10649 1491
11850 1491 5703 8910 -3016 -6237 -4451 -1115 -2898 2315 5144 10534 11776 14224 9591 13194
11836 13194 13281 14305 20518 10807 2093 2204 1808 -7439 -9140 -7249 -7803 -6459 -4514 2057 3891 15054
11820 15054 19681 8657 5233 3240 4188 -2123 -6532 -8038 -6325 -4399 -3929 183 8191 6623 12272
11805 12272 13258 13897 9215 9940 13331 6747 -248 -2929 8909 12440 14002 11919 8657 4243 8996
11790 8996 8189 5236 10010 5043 -1740 -6599 -8481 -4269 -2811 -2112 6042 4291 1228 -2821 -1315
11775 -1315 3120 1133 -796 2754 3829 7397 8173 4786 4629 3866 2646 3855 7960 10005 7814
11760 7814 9364 8963 4542 4229 5489 5587 3667 4690 -401 2383 12210 10710 -367 1964 12235
$$ packed form
11866E757m794J751M456o71j988q893K1M186R714k375n388K249J162N576j14r158
11850A491M212L207j1926l221J786L336j783N213K829N390J242K448m633L603
11836A3194Q7J024O213r711q714J11l96r247j701J891n54J344J945O571J834J1163
11820A5054M627j1024l424j993R48o311m409j506J713J926M70M112Q008j568N649
11805A2272R86O39m682P25L391o584o995k681J1838L531J562k083l262m414M753
11790H996q07k953M774m967o783m859j882M212J458O99Q154j751l063m049J506
11775a315M435j987j929L550J075L568P76l387j57p63j220J209M105K045k191
11760G814J550m01m421l13J260R8j920J023n091K784R827j500j1077K331J0271
$$ plain form
11745 12235 9077 -1145 -1624 131 -2449 -5272 3135 1656 -1840 -1446 -3992 -9265 -4437 -1563 -6860
11730 -6860 -5897 3724 8509 9412 10950 10823 9695 6931 5231 -1000 -1368 -2901 -4476 -4067 -3595 -4462
11714 -4462 -125 5228 3472 -1695 -5220 -206 4467 5297 7998 1561 -6055 -12041 -8901 -751 4151
11699 4151 2233 -2038 630 2135 13858 16733 8684 -6071 -6441 6062 16113 11547 -1831 -9847
11685 -9847 -1895 747 7354 15116 8700 7670 9720 1151 -4828 -2335 -2847 -3681 -5256 -7152 -9654
11670 -9654 -14155 -2985 3643 -971 -105 5916 9355 11499 5969 -335 -5572 -5902 -12422 -9709 -9723
11655 -9723 -15336 -16163 -13023 -9261 -5400 -3884 -4215 -5889 -4947 862 -319 -3082 -7343 -7039 -2455 -3040
11639 -3040 -1488 -5137 -1651 -2126 -3883 -7844 -5604 -3927 648 6543 9473 8027 309 -2404 2225
$$ packed form
11745A2235l158j0222m79J755k580k823Q407j479l496L94k546n273M828K874n297
11730f860R63R621M785R03J538j27j128k764j700o231l68j533j575M09M72q67
11714d462M337N353j756n167l525N014M673Q30K701o437p616n986L140Q150M902
11699D151j918m271K668J505J1723K875q049j4755l70J2503J0051m566j3378q016
11685i847P952K642O607P762o416j030K050q569n979K493n12q34j575j896k502
11670i654m501J1170O628m614Q66O021L439K144n530o304n237l30o520K713j4
11655i723n613q27L140L762L861J516l31j674R42N809j181k763m261L04M584n85
11639c040J552l649L486m75j757l961K240J677M575N895K930j446p718k713M629
$$ plain form
11624 2225 -6090 -6842 -4380 355 7802 651 -2874 5036 1854 -1798 307 -1732 -629 -1206 3506
11609 3506 3137 -928 -5813 -5518 -9610 -5248 12205 14261 11204 2489 -4170 -51 1191 3227 1758
11594 1758 916 -963 3975 7434 7825 8965 9421 13895 9445 -3385 -3973 -1500 -8364 -4111 4790
11579 4790 4715 300 4660 7558 9549 4446 4486 4269 3966 1511 3494 4147 9501 4932 4820 7892 6356
11562 6356 4544 3659 3349 4902 4420 7573 9662 8477 6188 7269 9586 7030 -1924 -851 -986 -6691
11546 -6691 -4680 1575 4182 9006 5924 1590 8770 12890 14515 8334 5487 7158 7114 8725 7848
11531 7848 7305 8279 7512 2107 6612 18319 21966 17643 9945 7184 11429 7113 10835 11608 7119
11516 7119 1054 -2218 -303 2490 6308 862 689 7521 14272 17937 12612 2530 -446 156 6185
$$ packed form
11624B225q315p52K462M735P447p151l525P910l182l652K105k039J103n77M712
11609C506l69m065m885K95m092M362J7453K056l057q715o659M119J242K036j469
11594A758q42j879M938L459L91J140M56M474m450j2830n88K473o864M253Q901
11579D790p5m415M360K898J991n103M0k17l03k455J983O53N354m569j12L072j536
11562F356j812q85l10J553m82L153K089j185k289J081K317k556q954J073j35n705
11546f691K011O255K607M824l082m334P180M120J625o181k847J671m4J611q77
11531G848n43R74p67n405M505J1707L647m323p698k761M245m316L722P73m489
11516G119o065l272J915K793L818n446j73O832O751L665n325j0082k976O02O029
$$ plain form
11501 6185 11565 7043 3540 1469 3295 2549 -5805 -9041 -3001 347 6242 2059 864 5816 7918
11486 7918 12195 15173 8101 6395 7383 11434 6302 3529 4976 610 -3907 270 7127 11200 11308
11471 11308 14702 15203 15354 8493 7166 10021 8751 15870 14137 3230 -1500 -2525 -662 -779 -3581
11456 -3581 -1403 -308 -2293 1505 1658 2400 -1650 -1204 2992 7853 9666 9159 9611 8511 5630 -2869
11440 -2869 -10279 -13290 -3406 2455 3155 10124 5517 5984 11419 9762 7050 9268 12057 18265 13991
11425 13991 9491 8113 7555 3965 5790 5151 7480 1260 728 3909 8750 13553 15479 17114 14114
11410 14114 4638 -178 -5780 -5339 -626 -3444 -299 -864 7468 8120 7012 1078 -7540 -5778 677
11395 677 -1261 4907 9750 8173 9441 13959 6697 2723 342 3089 3208 2278 4124 12061 9823
$$ packed form
11501F185N380m522l503k071J826p46q354l236O040L348N895m183j195M952K102
11486G918M277K978p072j706R88M051n132k773J447m366m517M177O857M073J08
11471A1308L394N01J51o861j327K855j270P119j733j0907m730j025J863j17k802
11456c581K178J095j985L798J53P42m050M46M196M861J813n07M52j100k881q499
11440b869p410l011R884N861P00O969m607M67N435j657k712K218K789O208m274
11425A3991m500j378n58l590J825o39K329o220n32L181M841M803J926J635l000
11410A4114r476m816n602M41M713k818L145n65Q332O52j108n934q618J762O455
11395F77j938O168M843j577J268M518p262l974k381K747J19r30J846P937k238
$$ plain form
11380 9823 12145 9391 12411 15542 17832 20808 33351 34252 31608 25906 21240 11944 9732 14008 14004
11365 14004 17984 17106 15712 12730 9700 9220 8149 9375 12195 11480 7822 9875 11637 16088 20734
11350 20734 16879 9156 11540 14372 16744 28040 38549 43723 44595 39065 27906 17171 10375 12632
11336 12632 17179 15099 15209 17616 11657 8147 5134 5556 1789 6316 12284 12357 10262 11772 12044 11648
11320 11648 9283 7064 11976 16663 14226 12724 19605 14889 9790 8394 6339 2909 9372 14138
11306 14138 10589 3091 5541 1972 128 -4240 -5907 -2441 -3488 -5937 -5721 -6249 -6533 1020 5803
11291 5803 630 1137 2026 -436 512 3133 9250 8867 7123 8452 8584 6483 10278 13112 12025 7690
11275 7690 5862 4257 3022 5252 2292 2829 -2120 1555 10154 21737 24085 17372 11800 7216 13201
$$ packed form
11380I823K322k754L020L131K290K976J2543R01k644n702m666r296k212M276m
11365A4004L980q78j394k982l030m80j071J226K820p15l658K053J762M451M646
11350B0734l855p723K384K832K372J1296J0509N174Q72n530j1159j0735o796K257
11336A2632M547k080J10K407n959l510l013M22l767M527N968P3k095J510K72l96
11320A1648k365k219M912M687k437j502O881m716n099j396k055l430O463M766
11306A4138l549p498K450l569j844m368j667L466j047k449K16n28k84P553M783
11291E803n173N07Q89k462R48K621O117l83j744J329J32k101L795K834j087m335
11275G690j828j605j235K230k960N37m949L675Q599J1583K348o713n572m584N985
$$ plain form
11260 13201 16494 20502 16317 19648 16772 11900 10238 9789 9318 4354 5585 14447 19393 16643 10808
11245 10808 13766 21092 18698 20211 7360 5491 12708 17797 14118 5642 7070 15224 22035 23244
11231 23244 16661 20160 21033 17424 7146 4589 7594 13829 21050 13172 9906 5818 -3107 1208
11217 1208 7895 7468 12471 16895 19378 24923 21079 22944 32784 35338 31887 39182 44078 48175 56766
11202 56766 58915 55112 49971 43033 37056 27322 25172 28173 29630 28933 25138 21538 22817 17437 10522
11187 10522 10365 10196 15675 16487 12021 8304 4994 7131 10633 5777 -2309 -1156 10364 11356 9521
11172 9521 12893 10562 15523 24767 20815 18760 14224 10084 6550 3298 7106 8596 2786 6412 12674
11157 12674 15451 18958 17470 10548 9627 11171 9934 13168 17233 10557 5520 8291 7298 9178 8039
$$ packed form
11260A3201L293M008m185L331k876m872j662m49m71m964J231Q862M946k750n835
11245A0808K958P326k394J513j2851j869P217N089l679q476J428Q154O811J209
11231B3244o583L499Q73l609j0278k557L005O235P221p878l266m088q925M315
11217A208O687m27N003M424K483N545l844J865R840K554l451P295M896M097Q591
11202E6766K149l803n141o938n977r734k150L001J457o97l795l600J279n380o915
11187A0522j57j69N479Q12m466l717l310K137L502m856q086J153J1520R92j835
11172I521L372k331M961R244l952k055m536m140l534l252L808J490n810L626O262
11157A2674K777L507j488o922r21J544j237L234M065o676n037K771r93J880j139
$$ plain form
11142 8039 3704 9138 19521 18322 12005 8188 10585 15539 19953 14099 9510 7278 6491 9857 10232
11127 10232 12689 5792 9115 7079 13901 25797 32382 36670 30667 27915 30397 28706 27317 25650
11113 25650 30819 29803 21369 15374 16730 18472 16338 9948 5318 10040 11140 7785 6955 5735 9938
11098 9938 15878 16920 9858 11098 13915 8188 -3948 -1107 7935 13356 13387 9202 10281 8847 10167
11083 10167 7546 4709 1373 -1022 3313 11959 18422 21755 21547 20232 18946 16627 15221 21065 24633
11068 24633 23181 17483 8249 8767 3499 4923 14206 16987 19192 18257 15961 16658 6264 -326 1118
11053 1118 7356 7468 3151 -409 7189 16424 14699 12779 15796 16034 20911 20379 15648 11123 16215
11038 16215 18954 19586 21429 22256 18316 12419 7621 11410 14296 18836 24500 27106 21742 18892 20698
$$ packed form
11142H039m335N434J0383j199o317l817K397M954M414n854m589k232p87L366L75
11127A0232K457o897L323k036O822J1896O585M288o003k752K482j691j389j667
11113B5650N169j016q434n995J356J742k134o390m630M722J100l355q30j220M203
11098I938N940J042p062J240K817n727j2136K841R042N421L1m185J079j434J320
11083A0167k621k837l336k395M335Q646O463L333k08j315j286k319j406N844L568
11068B4633j452n698r234N18n268J424R283K781K205r35k296O97j0394o590J444
11053A118O238J12m317l560P598R235j725j920L017K38M877n32m731m525N092
11038A6215K739O32J843Q27l940n897m798L789K886M540N664K606n364k850J806
$$ plain form
11023 20698 11219 9874 11847 10504 15122 18771 20314 25657 30081 26205 27822 26066 23777 23065 24997
11008 24997 25733 19601 15983 17774 13483 14961 20985 24204 32111 37071 30206 27520 25385 24608 20348
10993 20348 12818 11846 14739 11864 11785 15901 19361 19992 16917 17976 13127 15156 13314 10935 5525
10978 5525 9978 15483 17197 13390 17852 20988 21652 26779 21184 17578 24610 26893 25698 23805 24099
10963 24099 24371 24987 19125 22762 23000 18554 18534 16655 19383 28193 25259 22187 24444 21292 18981 27073
10947 27073 30968 20730 14477 12581 12207 15441 19329 21685 13300 8706 11953 20794 28856 29685 27819
10932 27819 31982 28665 33998 35775 35127 33147 29148 32326 27679 30884 20998 14261 11540 10425 17854
10917 17854 22178 17385 10858 14804 20333 20829 17113 12600 19291 34016 57197 71200 73698 72913
$$ packed form
11023B0698r479j345J973j343M618L649J543N343M424l876J617j756k289p12J932
11008B4997P36o132l618J791m291J478O024L219P907M960o865k686k135p77m260
10993B0348p530r72K893k875p9M116L460O31l075J059m849K029j842k379n410
10978E525M453N505J714l807M462L136O64N127n595l606P032K283j195j893K94
10963B4099K72O16n862L637K38m446k0j879K728Q810k934l072K257l152k311Q092
10947B7073L895j0238o253j896l74L234L888K356q385m594L247Q841Q062Q29j866
10932B7819M163l317N333J777o48j980l999L178m647L205r886o737k721j115P429
10917A7854M324m793o527L946N529M96l716m513O691J4725K3181J4003K498p85
$$ plain form
10903 72913 77977 79484 75901 67893 62233 53989 49957 40205 35969 37826 45690 43304 42273 51375
10889 51375 59246 70060 76075 81387 88021 89656 93309 99618 99859 105994 116364 113503 117894 138701
10875 138701 166199 201257 252297 308950 401653 560183 812744 1231644 1806496 2328882
10865 2328882 2421886 2009224 1433778 984754 689715 500213 385240 309909 251720 216640
10855 216640 191670 161092 138518 120342 108400 101523 101431 103642 97681 86074 75532 58935 49739
10842 49739 56136 59095 56218 54539 60021 62992 59584 64083 54423 43936 48485 47289 40898 36498
10828 36498 33141 35853 41340 38335 35585 48464 54144 48601 47440 44421 37746 30869 29200 27724
10814 27724 25771 29990 29070 26603 29134 28261 26731 31255 32258 32371 33478 29844 28048 30246 30111
$$ packed form
10903G2913N064J507l583q008n660q244m032r752m236J857P864k386j031R102
10889E1375P871J0814O015N312O634J635L653O309K41O135J0370k861M391K0807
10875A38701K7498L5058N1040N6653R2703J58530K52561M18900N74852N22386
10865B328882R3004m12662n75446m49024k95039j89502j14973p5331n8189l5080
10855B16640k4970l0578k2574j8176j1942o877r2K211n961j1607j0542j6597r196
10842D9739O397K959k877j679N482K971l408M499r660j0487M549j196o391m400
10828C6498l357K712N487l005k750J2879N680n543j161l019o675o877j669j476
10814B7724j953M219r20k467K531q73j530M524J003J13J107l634j796K198j35
$$ plain form
10799 30111 31902 37995 45621 48478 49351 45182 41667 44429 49418 52342 45226 42602 43957 45349 51845
10784 51845 48964 49362 54786 57281 56613 63260 59157 59572 66024 69472 68455 63178 61862 63828 66995
10769 66995 64496 61952 64131 59312 55867 56983 62621 69793 74088 70561 65918 61209 61181 62093 47440
10754 47440 25877 7924 1163 4527 3064 6224 13581 23548 31146 33767 40061 41439 34440 39093
10740 39093 46045 45578 44599 43115 49504 54042 53581 59965 59691 58465 60624 64424 65820 59823 61116
10725 61116 67795 73918 77764 79876 85540 87264 86446 87121 82471 78811 77244 78876 79050 78524 83685
10710 83685 91573 91593 91362 95373 95276 99170 123711 153233 186822 241593 306981 341971 327874 275543
10696 275543 213658 171853 151807 143314 133765 127360 125671 116100 97610 88326 75859 68267 66780
$$ packed form
10799C0111J791O093P626K857Q73m169l515K762M989K924p116k624J355J392O496
10784E1845k881L98N424K495o68O647m103M15O452L448j017n277j316J966L167
10769F6995k499k544K179m819l445J116N638P172M295l527m643m709k8R12j4653
10754D7440k1563j7953o761L364j463L160P357R967P598K621O294J378o999M653
10740C9093O952m67r79j484O389M538m61O384k74j226K159L800J396n997J293
10725F1116O679O123L846K112N664J724q18O75m650l660j567J632J74n26N161
10710H3685P888K0k31M011r7L894K4541K9522L3589N4771O5388L4990j4097n2331
10696B75543o1885m1805k0046q493r549o405j689r571j8490r284j2467p592j487
$$ plain form
10683 66780 70350 74127 77864 86746 90242 95707 100162 93851 82801 77031 83850 94021 95846 95117
10669 95117 94774 96379 103097 98896 91692 79452 74137 74080 77367 83753 85508 86223 98133 92736 79466
10654 79466 72226 72696 78377 86942 93412 88708 64002 60440 76046 99838 119475 132736 138321
10641 138321 136222 129908 124703 123157 117230 109451 81836 50092 28589 16765 23122 40437 64461
10628 64461 86758 101038 109968 119010 129132 133639 122857 108630 104662 107886 109772 104111 108701
10615 108701 107919 107706 111693 113199 103465 99277 92859 91892 98148 95158 94657 92982 92868 110358 144449
10600 144449 182129 186516 171794 155965 148865 161548 172612 182730 190655 202049 213248 209512
10588 209512 208970 207548 213592 218133 220622 225578 240418 265511 289865 315250 351295 396506 456516
$$ packed form
10683F6780L570L777L737Q882L496N465M455o311j1050n770O819J0171J825p29
10669I5117l43J605O718m201p204j2240n315n7L287O386J755P15J1910n397j3270
10654G9466p240M70N681Q565O470m704k4706l562J5606K3792J9637J3261N585
10641A38321k099o314n205j546n927p779k7615l1744k1503j1824O357J7315K4024
10628F4461K2297J4280Q930R042J0122M507j0782j4227l968L224J886n661M590
10615A08701p82k13L987J506r734m188o418r67O256k990n01j675j14J7490L4091
10600A44449L7680M387j4722j5829p100J2683J1064J0118P925J1394J1199l736
10588B09512n42j422O044M541K489M956J4840K5093K4354K5385L6045M5211O0010
$$ plain form
10575 456516 533414 614883 660182 621361 519125 414584 339750 290732 264797 259081 265236
10564 265236 259305 254242 254099 251576 255732 256943 253384 246269 254632 258269 260748 265090 274319 275532
10550 275532 268446 257163 255679 258353 250709 241810 232116 231822 239026 244042 256159 273423 294302
10537 294302 318274 332592 344969 365723 379238 392356 403408 421051 435300 443949 452029 463258
10525 463258 485867 519079 551723 586006 608920 621298 623702 631506 634411 630271 616676 604040
10513 604040 597523 599999 609143 621119 636647 655537 687533 707121 722772 739390 760642 800302
10501 800302 844266 883167 915418 943896 973412 1016496 1064025 1098043 1116843 1139081 1187453
10490 1187453 1246795 1312098 1388254 1481396 1589063 1706057 1831747 1962919 2090883 2225816
$$ packed form
10575D56516P6898Q1469M5299l8821j02236j04541p4834m9018k5935n716O155
10564B65236n931n063j43k523M156J211l559p115Q363L637K479M342R229J213
10550B75532p086j1283j484K674p644q899r694k94P204N016J2117J7264K0879
10537B94302K3972J4318J2377K0754J3515J3118J1052J7643J4249Q649Q080J1229
10525D63258K2609L3212L2644L4283K2914J2378K404P804K905m140j3595j2636
10513F04040o517K476R144J1976J5528J8890L1996J9588J5651J6618K1252L9660
10501H00302M3964L8901L2251K8478K9516M3084M7529L4018J8800K2238M8372
10490A187453N9342O5303P6156R3142J07667J16994J25690J31172J27964J34933
$$ plain form
10480 2225816 2365293 2512948 2658854 2798013 2943998 3124969 3349642 3631396 3972209
10471 3972209 4361302 4802810 5302473 5902596 6644191 7605614 8810656 10079270 11020849
10462 11020849 11552294 12048988 12864227 14182530 16114463 18779619 22351144 27143186
10454 27143186 33669449 42739383 55832132 75883243 108511245 163234631 250123662
10447 250123662 358952958 435804069 424279218 337779087 236758155 160167398 110917416
10440 110917416 79824543 59558585 45957641 36560549 29791783 24736718 20902870
10433 20902870 17932405 15589590 13753173 12441906 11637431 11046260 10212889 9006370
10425 9006370 7740239 6691464 5888713 5268470 4783307 4401998 4097755 3835449 3583519
$$ packed form
10480B225816J39477J47655J45906J39159J45985J80971K24673K81754L40813
10471C972209L89093M41508M99663O00123P41595R61423J205042J268614R41579
10462A1020849N31445M96694Q15239J318303J931933K665156L571525M792042
10454B7143186O526263R069934J3092749K0051111L2628002N4723386Q6889031
10447B50123662J08829296P6851111j1524851q6500131j01020932p6590757m9249982
10440A10917416l1092873k0265958j3600944r397092o768766n055065l833848
10433B0902870k970465k342815j836417j311267q04475n91171q33371j206519
10425I006370j266131j048775q02751o20243m85163l81309l04243k62306k51930
$$ plain form
10416 3583519 3332488 3085073 2848442 2637085 2466704 2329035 2211277 2110505 2021070 1945371
10406 1945371 1885459 1832983 1780714 1716421 1651208 1588820 1521526 1440513 1354219 1277397 1214988
10395 1214988 1172156 1131700 1087874 1045679 1016244 996591 979143 948924 913286 871575 839030
10384 839030 817656 801085 780883 748062 712974 685174 648082 606196 573827 539703 496586
10373 496586 466548 445886 432720 419462 421928 422134 426926 435358 443792 436074 419217 406534 395859
10360 395859 389140 391608 400740 406179 402604 400279 397135 402219 403253 406403 413395 408407 389588 373489
10346 373489 360371 339702 327478 319302 308442 296979 283359 271000 269713 265941 262186 266203
10334 266203 273094 278547 274230 269419 271507 273477 273089 269179 273502 290175 296426 295710 285510 279310
$$ packed form
10416C583519k51031k47415k36631k11357j70381j37669j17758j00772q9435p5699
10406A945371n9912n2476n2269o4293o5213o2388o7294q1013q6294p6822o2409
10395A214988m2832m0456m3826m2195k9435j9653j7448l0219l5638m1711l2545
10384H39030k1374j6571k0202l2821l5088k7800l7092m1886l2369l4124m3117
10373D96586l0038k0662j3166j3258K466K06M792Q432Q434p718j6857j2683j0675
10360C95859o719K468R132N439l575k325l144N084J034L150O992m988j8819j6099
10346C73489j3118k0669j2224q176j0860j1463j3620j2359j287l772l755M017
10334B66203O891N453m317m811K088J970l88l910M323J6673O251p16j0200o200
$$ plain form
10320 279310 256369 205573 145023 110667 107944 110923 116097 131077 150207 163537 168535 160730
10308 160730 150520 144612 143630 135413 121646 115130 115378 114940 111093 118550 120631 125544 133391 138469
10294 138469 121876 88122 71776 86418 117621 143992 153162 158659 160802 161401 160978 154627 148187
10281 148187 139498 134478 128686 121622 116155 113120 111207 109619 106947 107005 106528 104470 99049 93162 88896
10266 88896 89464 90154 102954 125281 150812 167811 180311 172529 154988 119473 87581 69787 59942
10253 59942 69742 66428 52326 39994 38851 43080 54209 78296 103154 109330 95910 81424 72513
10240 72513 70969 74687 81997 81430 72232 64830 59010 49481 55763 67275 66364 71750 76845 71151 62454
10225 62454 49328 42650 37027 38542 45248 40304 39911 48592 54409 52750 41311 36860 40880 47268
$$ packed form
10320B79310k2941n0796o0550l4356k723K979N174J4980J9130J3330M998p805
10308A60730j0210n908r82q217j3767o516K48m38l847P457K081M913P847N078
10294A38469j6593l3754j6346J4642L1203K6371R170N497K143N99m23o351o440
10281A48187q689n020n792p064n467l035j913j588k672N8m77k058n421n887m266
10266H8896N68O90J2800K2327K5531J6999J2500p782j7541l5515l1892j7794r845
10253E9942R800l314j4102j2332j143M229J1129K4087K4858O176j3420j4486q911
10240G2513j544L718P310n67r198p402n820r529O282J1512r11N386N095n694q697
10225F2454j3126o678n623J515O706m944l93Q681N817j659j1439m451M020O388
$$ plain form
10211 47268 55142 57911 67848 76059 72287 63572 59920 51267 44513 42475 29653 23592 25413 41784
10197 41784 62116 77641 93209 100549 97583 100645 103159 93318 85629 70243 61886 57254 46930
10184 46930 42856 42401 40335 39370 41595 48187 58233 63674 56412 53558 51838 47628 42060 37750 36820
10169 36820 40923 48832 42453 40973 57116 79423 94812 104505 112370 124914 133785 128576 115694
10156 115694 107679 112761 107027 98743 83578 79942 82585 76658 72850 73730 70002 80763 86864 95278
10142 95278 102540 104460 112041 114358 111777 104815 99151 106187 131645 180867 271996 420679 597817
10129 597817 746528 772863 673825 502387 340572 231093 165801 122122 94380 72401 67267
10118 67267 65556 56144 46858 40781 38527 29347 22074 24524 29363 27289 26472 26672 28173 30177 30690
$$ packed form
10211D7268P874K769R937Q211l772q715l652q653o754k038j2822o061J821J6371
10197D1784K0332J5525J5568P340k966L062K514r841p689j5386q357m632j0324
10184D6930m074m55k066r65K225O592J0046N441p262k854j720m210n568m310r30
10169C6820M103P909o379j480J6143K2307J5389R693P865J2544Q871n209j2882
10156A15694q015N082n734q284j5165l636K643n927l808Q80l728J0761O101Q414
10142I5278P262J920P581K317k581o962n664P036K5458M9222R1129J48683J77138
10129E97817J48711K6335r9038j71438j61815j09479o5292m3679k7742k1979n134
10118F7267j711r412r286o077k254r180p273K450M839k074q17K00J501K004N13
$$ plain form
10103 30690 31045 35300 30296 26614 29649 33994 34930 25228 14957 15605 16573 20507 19390 25162 25378
10088 25378 17612 23664 23057 18024 17346 21569 28562 30938 36987 39030 34046 34523 34506 26737 25638 26193
10072 26193 28549 26869 22658 18934 14513 14762 21429 23518 26801 25441 27544 34521 35638 27034 19349
10057 19349 12604 13452 18242 21001 23929 21839 19178 23014 27727 25630 25763 26231 23698 23063 24617
10042 24617 23406 30056 43302 57223 59458 64512 64316 64879 62793 70256 78863 98450 119231 137171
10028 137171 169262 210490 275791 376384 533467 799561 1231044 1815205 2302356 2329301
10018 2329301 1887383 1335756 901260 616322 436304 315930 239203 198081 170668 144493
10008 144493 127041 110967 92371 76866 61904 57386 57906 58328 67487 63912 53103 46525 44474
$$ packed form
10103C0690L55M255n004l682L035M345R36r702j0271O48R68L934j117N772K16
10088B5378p766O052o07n033o78M223O993K376O049K043m984M77j7p769j099N55
10072B6193K356j680m211l724m421K49O667K089L283j360K103O977J117q604p685
10057A9349o745Q48M790K759K928k090k661L836M713k097J33M68k533o35J554
10042B4617j211O650J3246J3921K235N054j96N63k086P463Q607J9587K0781J7940
10028A37171L2091M1228O5301J00593J57083K66094M31483N84161M87151K6945
10018B329301m41918n51627m34496k84938j80018j20374p6727m1122k7413k6175
10008A44493j7452j6074j8596j5505j4962m518N20M22R159l575j0809o578k051
$$ plain form
9995 44474 41376 38033 26566 20687 15128 8787 994 -5724 -14457 -22724 -13969 342 17283 30774
9981 30774 29866 35159 38325 41851 41178 46286 46173 37930 30261 20392 21657 27028 24682 20950 17594
9966 17594 26601 21807 15147 7172 11956 15107 17989 26277 31858 49575 58669 72789 82687 76422
9952 76422 65388 58459 52575 42526 39957 37512 30951 31379 22253 20364 17511 21500 26575 23856
9938 23856 19251 21872 23276 18337 12354 9622 12980 13746 10835 11540 12798 15884 17871 19541 16600
9923 16600 14944 17402 17828 16141 20954 17282 10531 11506 5543 2863 7647 8803 19546 20662 16785
9908 16785 12881 8087 2691 8075 4479 639 4143 10241 17453 16780 15588 7720 3469 7173 10569
9893 10569 13854 15631 13981 7560 4652 7199 11014 4434 -2010 2256 -2100 -3812 634 -4359 -3770
$$ packed form
9995D4474l098l343j1467n879n559o341p793o718q733q267Q755J4311J6941J3491
9981C0774r08N293L166L526o73N108j13q243p669r869J265N371k346l732l356
9966A7594R007m794o660p975M784L151K882Q288N581J7717R094J4120R898o265
9952G6422j1034o929n884j0049k569k445o561M28r126j889k853L989N075k719
9938B3856m605K621J404m939n983k732L358P66k911P05J258L086J987J670k941
9923A6600j656K458M26j687M813l672o751R75n963k680M784J156J0743J116l877
9908A6785l904m794n396N384l596l840L504O098P212o73j192p868m251L704L396
9893A0569L285J777j650o421k908K547L815o580o444M266m356j712M446m993N89
$$ plain form
9878 -3770 -1518 3471 12370 13463 11222 10890 7343 6615 7653 6792 11758 17629 18290 13752 14482 15003
9862 15003 12418 14741 13496 3393 -252 8016 8162 8603 5582 -1262 3934 9180 11837 11651 7425
9847 7425 10349 11350 17673 22368 23117 20438 15000 8378 8575 10426 16617 19487 13759 11113 15663
9832 15663 19099 14937 11014 13589 22559 16029 9341 3623 7569 7652 2602 -8255 -10620 -7846 -5083
9817 -5083 8226 16295 14795 8444 11390 11439 10505 9055 11938 10022 -1138 -3287 3052 7376 6295
9802 6295 -754 1064 4340 7708 3656 -1145 1967 9293 9463 10862 7755 1703 2958 11491 15932
9787 15932 14857 12572 8635 2641 6392 10455 12383 13575 15818 16265 14390 10430 6781 32 -10752
9772 -10752 -10312 -2805 6409 972 5661 8262 13377 6976 6308 15211 15183 2441 3493 1139 1337 3633
$$ packed form
9878c770K252M989Q899J093k241l32l547p28J038q61M966N871O61m538P30N21
9862A5003k585K323j245j0103l645Q268J46M41l021o844N196N246K657j86m226
9847G425K924J001O323M695P49k679n438o622J97J851O191K870n728k646M550
9832A5663L436m162l923K575Q970o530o688n718L946Q3n050j0857k365K774K763
9817e083J3309Q069j500o351K946M9r34j450K883j916j1160k149O339M324j081
9802F295p049J818L276L368m052m801L112P326J70J399l107o052J255Q533M441
9787A5932j075k285l937n994L751M063J928J192K243M47j875l960l649o749j0784
9772a0752M40P507R214n437M689K601N115o401o68Q903k8j2742J052k354J98K296
$$ plain form
9756 3633 6820 12784 14532 12604 15603 13442 7953 7600 9619 12176 11815 8927 3451 2583 5125 10303
9740 10303 15500 13449 8446 560 197 486 799 3558 3647 2864 -1327 751 2614 1639 -955 2954
9724 2954 6613 15645 20259 13717 8973 10037 8364 3833 2556 8474 11630 13149 14966 18782 17311
9709 17311 11921 16033 17869 10361 4695 10422 14024 12957 13936 14596 7281 680 2039 3597 10853
9694 10853 7292 -3337 -1330 4954 20769 21560 12637 6408 9367 959 -4232 -6783 -2742 3268
9680 3268 4424 3696 560 1915 5913 1341 -518 3061 4253 420 2011 2926 5426 7686 13209
9665 13209 14299 9894 9944 4798 3558 4796 7732 20306 24285 19937 22036 28857 25872 22442 24868
9650 24868 24029 21795 21555 15786 13045 13688 19636 33790 30052 19924 8133 13152 14345 13312 15606
$$ packed form
9756C633L187N964J748j928K999k161n489l53K019K557l61k888n476q68K542N178
9740A0303N197k051n003p886l63K89L13K759Q9p83m191K078J863r75k594L909
9724B954L659R032M614o542m744J064j673m531j277N918L156J519J817L816j471
9709A7311n390M112J836p508n666N727L602j067R79O60p315o601J359J558P256
9694A0853l561j0629K007O284J5815P91q923o229K959q408n191k551M041O010
9680C268J156p28l136J355L998m572j859L579J192l833J591R15K500K260N523
9665A3209J090m405N0n146j240J238K936J2574L979m348K099O821k985l430K426
9650B4868q39k234k40n769k741O43N948J4154l738j0128j1791N019J193j033K294
$$ plain form
9635 15606 5082 -348 5803 10128 7873 6552 3976 11066 17090 14861 21746 20385 22307 20170
9621 20170 19942 13308 8789 9671 9758 6107 8174 14625 16567 15340 13715 11848 10436 6503 12849 20130
9605 20130 21848 17689 16698 15811 15588 16553 15411 17761 18694 17967 16233 12563 16957 14892 12890 16292
9589 16292 12889 7477 4168 7133 13714 14053 4501 4743 10134 16089 17542 9664 6255 11839 16812
9574 16812 18669 21221 18831 8379 -3778 -4145 2592 16061 15810 7867 9418 16726 22879 26209
9560 26209 17311 8574 -831 1904 11015 17139 15277 21157 22681 24048 26075 15211 8064 13496
9546 13496 19234 22427 21483 21867 25843 27459 27733 19298 9552 2339 4235 10822 12117 14354 19611
9531 19611 25021 30375 22013 14611 10577 6396 4003 2227 2820 3672 6048 9614 14519 16274 14348
$$ packed form
9635A5606j0524n430O151M325k255j321k576P090O024k229O885j361J922k137
9621B0170k28o634m519Q82Q7l651K067O451J942j227j625j867j412l933O346P281
9605B0130J718m159r91q87k23R65j142K350R33p27j734l670M394k065k002L402
9589A6292l403n412l309K965O581L39r552K42N391N955J453p878l409N584M973
9574A6812J857K552k390j0452j2157l67O737J3469k51p943J551P308O153L330
9560B6209q898q737r405K735R111O124j862N880J524J367K027j0864p147N432
9546A3496N738L193r44L84L976J616K74q435r746p213J896O587J295K237N257
9531A9611N410N354q362p402m034m181k393j776N93Q52K376L566M905J755j926
$$ plain form
9516 14348 13233 12787 11038 12695 11329 4556 820 7041 13538 21748 28065 23555 17545 20698 19174
9501 19174 16193 18941 18725 11162 16312 27756 29144 27423 28328 19544 19939 11384 6965 7648 10878
9486 10878 14339 19279 16628 14050 21020 25617 20334 16276 22537 32210 30009 30019 26049 28262 29012
9471 29012 28235 28737 22234 22358 27521 19060 21465 22019 27788 28106 28727 26900 20891 17045 14135 14349
9455 14349 14904 15512 23604 24940 24731 19036 18629 17462 19004 27362 31982 31389 30187 31830 26862 26283
9439 26283 30916 28591 23070 18544 19615 23798 19021 12255 14752 17193 27007 34922 36279 31678 29682
9424 29682 39642 38303 33664 33077 24827 21414 20213 17525 26282 27132 27811 30307 24656 22973 18854
9409 18854 20124 20773 19528 25300 26749 25243 25467 22583 21628 11799 17551 30291 34930 29852 31720
$$ packed form
9516A4348j115m46j749J657j366o773l736O221O497Q210O317m510o010L153j524
9501A9174k981K748k16p563N150J1444J388j721R05q784L95q555m419O83L230
9486A0878L461M940k651k578O970M597n283m058O261R673k201J0l970K213P50
9471B9012p77N02o503J24N163q461K405N54N769L18O21j827o009l846k910K14
9455A4349N55O08Q092J336k09n695m07j167J542Q358M620n93j202J643m968n79
9439B6283M633k325n521m526J071M183m777o766K497K441R814P915J357m601j996
9424B9682R960j339m639n87q250l413j201k688Q757Q50O79K496n651j683m119
9409A8854J270O49j245N772J449j506K24k884r55r829N752J2740M639n078J868
$$ plain form
9394 31720 33910 27979 25967 20018 18510 22789 27622 28922 24739 20416 18002 17084 20809 25361 25204
9379 25204 27765 34999 35206 35613 32324 27937 25661 26234 23325 23889 28278 32785 38277 35130 31872 27288
9363 27288 29305 34148 30102 23312 19237 17271 18293 26604 23006 14637 12086 16074 19270 17418 12509
9348 12509 18256 27935 31738 32825 29237 30657 34917 37377 32846 23531 27034 31351 26429 26040 32083
9333 32083 28934 25651 21957 19629 19547 21659 24282 30027 33906 29920 26389 20680 20653 24600 29261 33872
9317 33872 34121 33166 31580 32782 33456 30937 26564 27302 31051 35878 41520 36526 31491 33430 31212 33102
9301 33102 33389 30819 23028 23648 31499 37798 40813 45440 42811 34967 27881 24971 24441 20558 16072
9286 16072 19778 26814 29585 33272 31715 34895 33896 31890 32281 32770 36176 43228 44684 37808 36064
$$ packed form
9394C1720K190n931k012n949j508M279M833J300m183m323k414r18L725M552j57
9379B5204K561P234K07M07l289m387k276N73k909N64M389M507N492l147l258m584
9363B7288K017M843m046o790m075j966J022Q311l598q369k551L988L196j852m909
9348A2509N747R679L803J087l588J420M260K460m531r315L503M317m922l89O043
9333C2083l149l283l694k328q2K112K623N745L879l986l531n709k7L947M661M611
9317C3872K49r55j586J202O74k519m373P38L749M827N642m994n035J939k218J890
9301C3102K87k570p791O20P851O299L015M627k629p844p086k910n30l883m486
9286A6072L706P036K771L687j557L180r99k006L91M89L406P052J456o876j744
$$ plain form
9271 36064 36657 42484 49201 40488 31238 30809 30199 25743 25402 26730 29584 38062 42715 45095 44433 39712
9255 39712 40761 44088 37876 38250 45901 47258 48078 48521 46257 47576 45766 38599 37626 46180 45331 39032
9239 39032 33802 38157 39636 40074 40382 39466 37290 37508 32231 34425 41113 42398 46086 44359 45375 42540
9223 42540 43577 46913 47263 49783 47607 47890 41472 40681 48935 52306 54041 54712 46785 43969 47982 46380
9207 46380 48876 45564 35988 33875 42118 48450 46443 45293 47157 41906 42965 55858 55507 52481 56803
9192 56803 46705 41397 45658 50507 50493 47909 41248 49198 54899 55138 57454 56707 56311 58920 60664 53685
9176 53685 44301 44165 51392 53126 51746 53949 54405 57092 57354 54373 45101 49423 50924 53575 57764
9161 57764 61044 54123 52680 56465 61129 61580 58980 58866 60726 65061 63333 66293 68485 66487 60074
$$ packed form
9271C6064N93N827O717q713r250m29o10m456l41J328K854Q478M653K380o62m721
9255C9712J049L327o212L74P651J357Q20M43k264J319j810p167r73Q554q49o299
9239C9032n230M355J479M38L08r16k176K18n277K194O688J285L688j727J016k835
9223D2540J037L336L50K520k176K83o418p91Q254L371J735O71p927k816M013j602
9207D6380K496l312r576k113Q243O332k007j150J864n251J059J2893l51l026M322
9192E6803j0098n308M261M849j4k584o661P950N701K39K316p47l96K609J744o979
9176E3685r384j36P227J734j380K203M56K687K62k981r272M322J501K651M189
9161E7764L280o921j443L785M664M51k600j14J860M335j728K960K192j998o413
$$ plain form
9146 60074 63090 72965 76812 77325 91252 85176 73140 63662 56821 58068 59621 63818 68425 78892
9132 78892 83962 81252 77129 69914 70181 68984 70998 72754 77135 79749 75782 78159 79567 84081 87625
9117 87625 77532 73678 74095 76384 76001 75958 74612 77613 83544 81050 82460 80795 79536 81874 80924 79792
9101 79792 78858 76184 74774 72326 69264 74709 86802 85712 76884 80612 79040 79153 81200 74279 70726
9086 70726 74961 76540 83009 76315 76061 74633 76953 84999 89326 91413 93298 95444 87886 83343 85256
9071 85256 87000 86432 86669 85878 80475 80006 85724 87885 90904 86326 82639 85321 91390 97098 97700 91374
9055 91374 87284 91059 93507 89550 92639 100389 102295 101856 100668 94366 92744 92308 98862 97502 92794
9040 92794 102047 106502 105346 109510 104692 100854 105216 107314 102655 107255 102840 104170 110593 109394 103092
$$ packed form
9146F0074L016R875L847N13J3927o076j2036r478o841J247J553M197M607J0467
9132G8892N070k710m123p215K67j197K014J756M381K614l967K377J408M514L544
9117H7625j0093l854M17K289l83m3j346L001N931k494J410j665j259K338r50j132
9101G9792r34k674j410k448l062N445J2093j090q828L728j572J13K047o921l553
9086G0726M235J579O469o694k54j428K320Q046M327K087J885K146p558m543J913
9071H5256J744n68K37p91n403m69N718K161L019m578l687K682O069N708O02o326
9055I1374m090L775K448l957L089P750J906m39j188o302j622m36O554j360m708
9040I2794R253M455j156M164m818l838M362K098m659M600m415J330O423j199o302
$$ plain form
9025 103092 106523 113371 113800 119977 120731 116473 119027 116680 117490 118935 119523 123241 128095 125544 122982
9010 122982 130074 131008 121020 119030 126910 127672 122322 125420 124407 119266 119287 121581 126887 128506 129587
8995 129587 134121 135239 139617 143623 141868 141550 139686 139422 145663 149384 148785 146209 143922 151923 154893
8980 154893 151248 151979 149569 153370 153574 155715 161008 166665 166510 167024 165382 162899 161542 162640 163826
8965 163826 163792 162247 165531 171369 175252 177742 180963 180910 182411 187053 195601 198369 197795 194137 197401 210733
8949 210733 214883 210294 202739 198486 205199 205295 201549 198957 197413 202432 203963 200971 200242 204357 212921
8934 212921 217717 216766 212091 211936 218557 221725 221801 218958 221443 231512 238485 244074 244327 246464 249943
8919 249943 250332 247886 247616 246467 256017 263963 256333 254240 250482 254854 263636 268301 271325 278137 278612
$$ packed form
9025A03092L431O848M29O177P54m258K554k347Q10J445N88L718M854k551k562
9010A22982P092R34r988j990P880P62n350L098j013n141K1K294N306J619J081
8995A29587M534J118M378M006j755l18j864k64O241L721n99k576k287Q001K970
8980A54893l645P31k410L801K04K141N293N657j55N14j642k483j357J098J186
8965A63826l4j545L284N838L883K490L221n3J501M642Q548K768n74l658L264J3332
8949B10733M150m589p555m253O713R6l746k592j544N019J531k992p29M115Q564
8934B12921M796r51m675j55O621L168P6k843K485J0069O973N589K53K137L479
8919B49943L89k446k70j149R550P946p630k093l758M372Q782M665L024O812M75
$$ plain form
8904 278612 278996 281154 281647 285426 288653 287415 282575 284117 289008 290869 292635 299210 299396 296898 304379
8889 304379 307880 311124 309510 312479 316446 321864 328134 332740 340054 342340 340773 342178 343463 350152
8875 350152 357322 361277 364358 367683 377303 382935 390564 397022 403867 400468 403163 403274 410767 417030 417888
8860 417888 415534 419993 431168 436044 449349 456892 462983 468014 472617 477632 482674 487056 492176 502819
8846 502819 514538 514705 524313 544384 561439 574487 588842 593360 606393 619530 628792 647890 673299
8833 673299 709711 757380 821000 942489 1134750 1391992 1552671 1453926 1229941 1051419
8823 1051419 940540 871423 831263 811086 799845 797761 799358 805693 814624 812513 812709 830128 844188
8810 844188 851781 855643 860572 869137 884153 899076 915832 925126 938669 957943 980087 995335 1008606
$$ packed form
8904B78612L84K158M93L779L227j238m840J542M891J861J766O575J86k498P481
8889C04379L501L244j614K969L967N418O270M606P314K286j567J405J285O689
8875C50152P170L955L081L325R620N632P629O458O845l399K695J11P493O263Q58
8860D17888k354M459J1175M876J3305P543O091N031M603N015N042M382N120J0643
8846E02819J1719J67R608K0071J7055J3048J4355M518J3033J3137R262J9098K5409
8833F73299L6412M7669O3620J21489J92261K57242J60679r8745k23985j78522
8823A051419j10879o9117m0160k0177j1241k084J597O335Q931k111J96J7419J4060
8810H44188P593L862M929Q565J5016J4923J6756R294J3543J9274K2144J5248J3271
$$ plain form
8797 1008606 1029376 1048870 1066846 1083882 1100460 1112168 1134191 1157800 1177267 1202471 1228986
8786 1228986 1239711 1256517 1285527 1316953 1344683 1377591 1410543 1438312 1458197 1487423 1524742
8775 1524742 1557409 1589741 1627684 1661368 1700714 1741061 1783824 1820500 1867035 1909669 1952936
8764 1952936 2005689 2060420 2116485 2175291 2227806 2278207 2335517 2399326 2471571 2539016 2601742
8753 2601742 2669063 2742451 2822103 2908928 2996014 3087275 3185291 3275566 3369663 3473550 3585959
8742 3585959 3704630 3826137 3940926 4063558 4193856 4327793 4469948 4622837 4776083 4934779
8732 4934779 5104993 5293233 5487856 5683179 5882606 6089052 6309045 6540894 6778443 7029734
8722 7029734 7296777 7567066 7840279 8130484 8432165 8736861 9051517 9371526 9709844 10043166
$$ packed form
8797A008606K0770J9494J7976J7036J6578J1708K2023K3609J9467K5204K6515
8786A228986J0725J6806K9010L1426K7730L2908L2952K7769J9885K9226L7319
8775A524742L2667L2332L7943L3684L9346M0347M2763L6676M6535M2634M3267
8764A952936N2753N4731N6065N8806N2515N0401N7310O3809P2245O7445O2726
8753B601742O7321P3388P9652Q6825Q7086R1261R8016R0275R4097J03887J12409
8742C585959J18671J21507J14789J22632J30298J33937J42155J52889J53246J58696
8732D934779J70214J88240J94623J95323J99427K06446K19993K31849K37549K51291
8722G029734K67043K70289K73213K90205L01681L04696L14656L20009L38318L33322
$$ plain form
8712 10043166 10377083 10715310 11063426 11409919 11760754 12104237 12443486 12770772 13078056
8703 13078056 13368730 13644944 13903072 14133280 14330937 14490290 14618847 14717053 14777317 14797594
8693 14797594 14783382 14732760 14633827 14497315 14337642 14144611 13925224 13676057 13398245 13105777
8683 13105777 12787511 12464422 12132807 11796517 11450682 11105103 10759497 10410865 10063861
8674 10063861 9727762 9396614 9074387 8752494 8443005 8148443 7861463 7581764 7317300
8665 7317300 7066564 6815117 6571688 6339957 6116117 5899732 5695229 5502782 5310655 5132069
8655 5132069 4960997 4793322 4632473 4482990 4333662 4192736 4067285 3937729 3812806 3702109
8645 3702109 3591476 3484353 3380904 3272605 3176214 3083786 2998834 2911626 2821761 2738509 2669431
$$ packed form
8712A0043166L33917L38227L48116L46493L50835L43483L39249L27286L07284
8703A3078056K90674K76214K58128K30208J97657J59353J28557R8206O0264K0277
8693A4797594j4212n0622r8933j36512j59673j93031k19387k49167k77812k92468
8683A3105777l18266l23089l31615l36290l45835l45579l45606l48632l47004
8674A0063861l36099l31148l22227l21893l09489k94562k86980k79699k64464
8665G317300k50736k51447k43429k31731k23840k16385k04503j92447j92127j78586
8655E132069j71072j67675j60849j49483j49328j40926j25451j29556j24923j10697
8645C702109j10633j07123j03449j08299r6391r2428q4952q7208q9865q3252o9078
$$ plain form
8634 2669431 2606006 2535676 2467539 2407394 2345233 2280562 2224619 2169846 2111313 2058105 2006807
8623 2006807 1956734 1908667 1865935 1823514 1782183 1740649 1703468 1664628 1625216 1590571 1559563
8612 1559563 1522699 1486445 1452392 1421541 1388746 1365484 1340818 1314560 1285915 1261027 1236266
8601 1236266 1212557 1195533 1179852 1152184 1128922 1113369 1092955 1069268 1042057 1022461 1004736
8590 1004736 984314 966434 949503 937931 916251 898176 884502 882760 874293 853452 830822 816016
8578 816016 801460 788331 777366 767904 755004 748778 746122 731179 720613 710491 705306 694121
8566 694121 681522 671763 665758 654448 642716 633623 621269 618668 614127 608306 596960 595008 595458
8553 595458 590545 585304 585036 584430 573239 564305 557620 548951 543087 536275 529815 521998 503059 495085
$$ packed form
8634B669431o3425p0330o8137o0145o2161o4671n5943n4773n8533n3208n1298
8623B006807n0073m8067m2732m2421m1331m1534l7181l8840l9412l4645l1008
8612A559563l6864l6254l4053l0851l2795k3262k4666k6258k8645k4888k4761
8601A236266k3709j7024j5681k7668k3262j5553k0414k3687k7211j9596j7725
8590A004736k0422j7880j6931j1572k1680j8075j3674j742q467k0841k2630j4806
8578H16016j4556j3129j0965r462j2900o226k656j4943j0566j0122n185j1185
8566F94121j2599r759o005j1310j1732r093j2354k601m541n821j1346j952M50
8553E95458m913n241k68o06j1191q934o685q669n864o812o460p817j8939p974
$$ plain form
8539 495085 488711 477540 466506 458710 454361 445872 443904 443409 433516 428568 418518 409183 405898 399727
8525 399727 394193 381700 383071 379535 376165 373231 367195 368455 366368 361076 357759 355209 353413 344557
8511 344557 336742 326082 319217 319198 317518 322554 326179 317728 311755 301468 294927 296524 288452 284243
8497 284243 286985 281963 278118 278175 280267 283168 274478 268928 261229 259443 259188 258316 256010 252645 250320
8482 250320 242563 240121 246322 244740 240121 238673 238900 240767 234542 230391 227721 223143 223474 221171 220161
8467 220161 223384 226369 221066 216452 209493 205913 207648 206957 205043 201360 204717 204036 203544 196741 197193
8452 197193 198661 190857 185668 183529 178468 178082 176362 174417 169820 167825 166544 175008 181840 178074 170992
8437 170992 166270 166908 167796 167407 170141 171392 164660 165551 166653 163640 156112 146398 148884 151768 144847
$$ packed form
8539D95085o374j1171j1034p796m349q489j968m95r893m948j0050r335l285o171
8525C99727n534j2493J371l536l370k934o036J260k087n292l317k550j796q856
8511C44557p815j0660o865j9j680N036L625q451n973j0287o541J597q072m209
8497B84243K742n022l845N7K092K901q690n550p699j786k55q72k306l365k325
8482B50320p757k442O201j582m619j448K27J867o225m151k670m578L31k303j010
8467B20161L223K985n303m614o959l580J735o91j914l683L357o81m92o803M52
8452A97193J468p804n189k139n061l86j720j945m597j995j281Q464O832l766p082
8437A70992m722O38Q88l89K734J251o732Q91J102l013p528r714K486K884o921
$$ plain form
8422 144847 144617 152846 152963 151810 147576 139635 137341 135193 136320 141750 147663 141751 142519 148016 143588
8407 143588 136453 136198 135448 137514 141958 139453 135205 133592 129652 133457 132520 129736 127581 126547 123201
8392 123201 122846 125426 127682 128867 132432 130238 117515 109148 102017 102209 98775 101278 99862 96238 102517
8377 102517 104189 103152 106382 108245 108012 109692 102441 97120 91643 93453 93223 90775 101229 112440
8363 112440 114374 113610 114649 121234 126949 127413 115652 103832 102399 102967 105304 100272 88011 83852
8349 83852 83695 86758 92976 87895 81183 75477 81240 85066 83830 80027 85075 89418 91004 91077 88182
8334 88182 83086 81889 83499 84640 86816 84495 78102 72509 79254 80659 75293 77182 77838 79546 83013
8319 83013 80708 82506 79050 74711 73335 70281 65785 64679 67871 69535 71635 68824 64653 63628 61115
$$ packed form
8422A44847k30Q229J17j153m234p941k294k148J127N430N913n912P68N497m428
8407A43588p135k55p50K066M444k505m248j613l940L805r37k784k155j034l346
8392A23201l55K580K256J185L565k194j2723q367p131J92l434K503j416l624O279
8377A02517J672j037L230J863k33J680p251n321n477J810k30k448J0454J1211
8363A12440J934p64J039O585N715M64j1761j1820j433N68K337n032j2261m159
8349H3852j57L063O218n081o712n706N763L826j236l803N048M343J586P3k895
8334H8182n096j197J610J141K176k321o393n593O745J405n366J889O56J708L467
8319H3013k305J798l456m339j376l054m496j106L192J664K100k811m171j025k513
$$ plain form
8304 61115 59926 61962 65805 66198 68962 67945 64024 60000 55802 52418 62785 62316 57654 53651 64552
8289 64552 69738 67216 63053 61255 65745 68603 67382 64383 58400 63919 66698 62639 54025 52145 49150
8274 49150 49317 53828 50049 50827 51943 59837 58077 57990 56853 60569 63777 63198 72889 87338 106592
8259 106592 127754 135528 126996 108994 103577 92129 79422 69071 61736 60514 56430 55643 57227
8246 57227 49199 51743 59121 58030 57562 55369 51667 47148 45762 43172 51176 58606 59068 60256 59494
8231 59494 57113 53632 45364 42787 44256 49230 47155 47530 54505 57153 56380 59113 67629 78338 95032
8216 95032 103934 99437 82123 71917 63278 62218 52690 45675 48808 48674 46122 38752 41850 43806
8202 43806 39222 36707 41532 41864 41658 49844 49900 44478 39600 40209 42330 43211 39021 42416 46073 37923
$$ packed form
8304F1115j189K036L843L93K764j017l921m024m198l384J0367m69m662m003J0901
8289F4552N186k522m163j798M490K858j221k999n983N519K779m059q614j880k995
8274D9150J67M511l779P78J116P894j760q7j137L716L208n79R691J4449J9254
8259A06592K1162P774q532j8002n417j1448j2707j0351p335j222m084p87J584
8246E7227q028K544P378j091m68k193l702m519j386k590Q004P430M62J188p62
8231E9494k381l481q268k577J469M974k075L75O975K648p73K733Q516J0709J6694
8216I5032Q902m497j7314j0206q639j060r528p015L133j34k552p370L098J956
8202D3806m584k515M825L32k06Q186N6n422m878O09K121Q81m190L395L657q150
$$ plain form
8186 37923 32959 35784 39477 44046 41518 32058 30239 41124 47557 44990 46524 46208 42245 48102 52236
8171 52236 46903 40507 40069 42705 47951 45530 46870 51781 54874 48641 43367 41828 41147 37297 39185
8156 39185 39863 35292 29085 30048 33397 31434 31753 36353 40712 36096 34460 36069 24907 26277 34022
8141 34022 35491 39087 42738 48197 43874 38267 36737 38653 34867 32022 27858 23458 19077 32739
8127 32739 37153 33529 39990 40574 31298 27277 26827 26719 21342 27182 28597 29006 27542 26912 25508 29740
8111 29740 32913 32880 31172 31495 26130 21881 21353 20365 20153 23442 25691 29891 28407 24282 23809 20372
8095 20372 18050 19757 19428 19210 17453 21001 22142 26235 25769 29310 29614 31681 34235 35370 30908 32953
8079 32953 29431 28317 29312 19916 15935 23066 32180 33562 35481 33926 29104 20398 20615 23858 21739
$$ packed form
8186C7923m964K825L693M569k528r460j819J0885O433k567J534l16l963N857M134
8171E2236n333o396m38K636N246k421J340M911L093o233n274j539o81l850J888
8156C9185O78m571o207R63L349j963L19M600M359m616j636J609j1162J370P745
8141C4022J469L596L651N459m323n607j530J916l786k845m164m400m381J3662
8127C2739M414l624O461N84r276m021m50j08n377N840J415M09j464o30j404M232
8111B9740L173l3j708L23n365m249n28r88k12L289K249M200j484m125m73l437
8095B0372k322J707l29k18j757L548J141M093m66L541L04K067K554J135m462K045
8079C2953l522j114R95r396l981P131R114J382J919j555m822q706K17L243k119
$$ plain form
8064 21739 21281 19723 20508 29328 30961 20857 16577 21147 16791 19848 20725 12742 10064 7499 9964
8049 9964 20729 29571 27774 23219 25158 26778 28849 30142 36554 42031 49350 51978 54235 46900 44230
8034 44230 42811 37036 33193 37330 37414 31028 27965 29222 28648 36364 42579 45429 38217 29888 35966
8019 35966 38106 37107 37614 29108 31089 30031 30558 35669 39916 39047 34430 36034 33447 28918 27082 32233
8003 32233 31055 30981 36634 38077 42735 49602 58676 67362 69000 62802 56272 46848 44568 46704 41915
7988 41915 40821 40179 40883 35230 32774 29977 29172 30514 29863 22727 25144 29461 29240 28665 32013 34877
7972 34877 30719 31185 34995 38299 36007 27471 32214 39047 37533 30929 30559 32655 33092 30963 33643
7957 33643 37379 44224 46738 50569 55461 54114 55023 53541 55894 53197 43529 39511 40074 41056 43111
$$ packed form
8064B1739m58j558P85Q820J633j0104m280M570m356L057Q77p983k678k565K465
8049I964J0765Q842j797m555J939J620K071J293O412N477P319K628K257p335k670
8034D4230j419n775l843M137Q4o386l063J257n74P716O215K850p212q329O078
8019C5966K140r99N07q506J981j058N27N111M247q69m617J604k587m529j836N151
8003C2233j178p4N653J443M658O867R074Q686J638o198o530r424k280K136m789
7988D1915j094o42P04n653k456k797q05J342o51p136K417M317k21n75L348K864
7972C4877m158M66L810L304k292q536M743O833j514o604l70K096M37k129K680
7957C3643L736O845K514L831M892j347R09j482K353k697r668m018N63R82K055
$$ plain form
7942 43111 41618 34469 28908 27944 24486 28359 37217 35998 36481 34876 34028 35249 35995 38481 41647 45771
7926 45771 38516 32950 31061 34943 35035 38600 39987 35714 30959 33206 35781 36136 34825 39291 40901
7911 40901 41059 43439 38822 41064 40200 38805 33563 34684 35995 37087 42899 40216 39702 41217 40140
7896 40140 31030 29543 32237 30520 30170 30761 24055 18668 26674 31092 32108 33558 32134 31457 23701
7881 23701 20599 23005 25011 25354 31815 32355 27777 27727 23308 21089 25743 30086 35820 29311 27233 23742
7865 23742 26270 25135 32127 26784 24649 30594 31166 31753 36932 33747 25332 21976 29354 29416 33996 37165
7849 37165 32021 25587 19041 13347 10164 8497 11183 15269 21176 21267 22132 23600 30461 31211 29891 28113
7833 28113 22914 15130 16891 24707 28608 26965 23885 22126 23725 28234 25630 16545 12583 14484 18880
$$ packed form
7942D3111j493p149n561r64l458L873Q858j219M83j605q48J221P46K486L166M124
7926D5771p255n566j889L882R2L565J387m273m755K247K575L55j311M466J610
7911D0901J58K380m617K242q64j395n242J121J311J092N812k683n14J515j077
7896D0140r110j487K694j717l50N91o706n387Q006M418J016J450j424o77p756
7881B3701l102K406K006L43O461N40m578n0m419k219M654M343N734o509k078l491
7865B3742K528j135O992n343k135N945N72N87N179l185q415l356P378O2M580L169
7849C7165n144o434o546n694l183j667K686M086N907R1Q65J468O861P50j320j778
7833B8113n199p784J761P816L901j643l080j759J599M509k604r085l962J901M396
$$ plain form
7818 18880 20096 21349 20060 19131 15868 9128 8258 7186 2534 1512 8544 12913 14789 15806 15117
7803 15117 14219 14523 21344 24270 18642 15321 10929 12681 19898 17457 11966 4842 7047 12130 14934
7788 14934 13771 11403 4031 4336 6496 12368 13814 5924 8425 15455 16988 15445 12636 12716 13603 14843
7772 14843 19191 11801 7021 10979 15540 14389 1201 -4032 -5956 -7842 -5433 -900 -4823 -5192 -1401
7757 -1401 2125 5610 3071 -4588 -1556 -1203 -3197 5197 5170 -6249 -6747 -2503 -1863 -32 1932 7459
7741 7459 11953 11852 16943 22356 22856 19413 17169 17028 8494 -7128 -3458 2386 3417 1026 6293
7726 6293 14467 15738 15597 16416 12104 6000 8631 5542 5145 6137 11024 11133 11460 8438 9809 7984
7710 7984 13998 12191 8253 3987 -987 -3866 1298 4161 5581 6861 8424 14857 22125 18989 15607
$$ packed form
7818A8880J216J253j289r29l263o740q70j072m652j022P032M369J876J017o89
7803A5117q98L04O821K926n628l321m392J752P217k441n491p124K205N083K804
7788A4934j163k368p372L05K160N872J446p890K501P030J533j543k809Q0Q87J240
7772A4843M348p390m780L958M561j151j3188n233j924j886K409M533l923l69L791
7757a401L526L485k539p659L032L53j994Q394k7j1419m98M244O40J831J964N527
7741G459M494j01N091N413N00l443k244j41q534j5622L670N844J031k391N267
7726F293Q174J271j41Q19m312o104K631l089l97R92M887J09L27l022J371j825
7710G984O014j807l938m266m974k879N164K863J420J280J563O433P268l136l382
$$ plain form
7695 15607 13632 3910 -13690 -10845 -378 1939 5780 6183 6358 9161 5086 5160 8929 11516 6443
7680 6443 4226 7793 4502 6469 11534 15132 14556 16235 16976 16320 10845 6220 2405 6927 8185 -1098
7664 -1098 -6130 -5943 5449 14011 5747 -2335 1195 7924 18216 21081 17195 10113 4990 895 -672
7649 -672 6105 7633 7878 724 2010 6341 3995 985 -3297 -8215 -7593 -581 -1120 -5993 -3047 2635
7633 2635 1369 -5310 -4780 -3853 -5219 537 124 269 -2508 1424 10235 12072 11586 9847 8559 8112
7617 8112 7725 11323 5152 -991 -4677 -3770 -4639 -4835 -7067 -6962 -7948 -9024 -6931 -4219 3687 4872
7601 4872 4909 8471 9648 10189 3033 -3670 1617 7878 9456 12902 9998 2237 1385 252 4850 8058
7585 8058 7679 7503 10998 17589 16134 8150 7146 2146 2187 3014 -371 -5210 -7984 -4274 -2521 2696
$$ packed form
7695A5607j975r722j7600K845J0467K317L841M03J75K803m075P4L769K587n073
7680F443k217L567l291J967N065L598n76J679P41o56n475m625l815M522J258r283
7664a098n032J87J1392Q562q264q082L530O729J0292K865l886p082n123m095j567
7649f72O777J528K45p154J286M331k346l010m282m918O22P012n39m873K946N682
7633B635j266o679N30R27j366N756m13J45k777L932Q811J837m86j739j288m47
7617H112l87L598o171o143l686R07q69j96k232J05r86j076K093K712P906J185
7601D872L7L562J177N41p156o703N287O261J578L446k904p761q52j133M598L208
7585H058l79j76L495O591j455p984j004n000M1Q27l385m839k774L710J753N217
$$ plain form
7569 2696 6930 6962 12799 14690 10520 5698 3512 6971 6430 8400 1768 12 2034 2240 4947 -1641
7553 -1641 523 -2255 3364 8561 10300 5105 3360 12405 13958 14207 9646 4870 -379 -997 434
7538 434 7490 11977 5245 6554 5245 8187 15534 5432 328 -9200 -12248 -7462 -6770 -2926 -3241
7523 -3241 -12532 -18103 -10343 -2818 2131 3231 6776 7119 6992 3061 2114 2484 3 -2792 -1684 -1010
7507 -1010 1021 7437 9147 8415 6043 5618 2932 -2933 -4614 -7315 -5647 -2905 1673 2180 720 -1292
7491 -1292 -4249 -6612 -4838 -4218 1675 8129 13240 10411 1336 -2055 -7936 -12934 -9002 3446 13892
7476 13892 10782 2390 -3689 -6043 4662 8830 8364 4976 -3427 -7076 -4454 -571 -4004 1635 5075
7461 5075 2059 4275 -1346 1694 576 -3511 -9962 -3983 1045 4508 3918 -5827 -7192 -4037 -7327
$$ packed form
7569B696M234L2N837J891m170m822k186L459n41J970o632j756K022K06K707o588
7553a641K164k778N619N197J739n195j745R045J553K49m561m776n249o18J431
7538D34P056M487o732J309j309K942P347j0102n104r528l048M786O92L844l15
7523c241r291n571P760P525M949J100L545L43j27l931r47L70k481k795J108O74
7507a010K031O416J710p32k372m25k686n865j681k701J668K742M578N07j460k012
7491a292k957k363J774O20N893O454N111k829r075l391n881m998L932J2448J0446
7476A3892l110q392o079k354J0705M168m66l388q403l649K622L883l433N639L440
7461E075l016K216n621L040j118m087o451N979N028L463n90r745j365L155l290
$$ plain form
7446 -7327 -7126 -2872 -6042 -8576 -8941 -7199 -6123 -4371 -6189 -7435 -9549 -6370 -5486 -3810 -8167 -5290
7430 -5290 -257 4835 6840 3875 7274 6252 4533 -872 -3174 -3034 -8873 -16476 -8765 -5210 -4374
7415 -4374 -4418 -3381 5994 1786 -4198 -6247 -5600 -10115 -9955 -6293 2539 6255 3285 2931 4748 3658
7399 3658 11008 17830 21908 22963 23059 22974 18746 10360 9782 6588 1203 8565 8621 -7811 -9522 -3142
7383 -3142 -898 7297 3178 1258 3090 -752 -4373 -4340 2230 1933 5383 4381 6163 3240 3322 455
7367 455 3928 10332 6813 778 -2822 -41 -5063 -6819 5537 4537 -678 3357 4084 3166 5666
7352 5666 7275 5880 11320 11206 7539 1914 -1809 -1404 -4061 -6368 -6132 -3833 197 -2846 -10320 -13621
7336 -13621 -6028 -986 1300 1839 -1716 -10848 -17004 -8450 -1872 2917 5016 3887 -1791 -8981 -10849
$$ packed form
7446g327K01M254l170k534l65J742J076J752j818j246k114L179Q84J676m357K877
7430e290N033N092K005k965L399j022j719n405k302J40n839p603P711L555Q36
7415d374m4J037R375m208n984k049O47m515J60L662Q832L716k970l54J817j090
7399C658P350O822M078J055R6q5m228q386n78l194n385P362N6j6432j711O380
7383c142K244Q195m119j920J832l842l621L3O570k97L450j002J782k923Q2k867
7367D55L473O404l519o035l600K781n022j756J2356j000n215M035P27r18K500
7352E666J609j395N440j14l667n625l723M05k657k307K36K299M030l043p474l301
7336a3621P593N042K286N39l555r132o156Q554O578M789K099j129n678p190j868
$$ plain form
7321 -10849 -2624 445 5281 5412 7905 10134 4893 -7001 -11676 -11055 -11328 -13112 -9606 -6168 -1217
7306 -1217 1479 -973 -3326 -4317 -7886 -4445 -8410 -1718 4677 726 5573 12417 10363 4284 7673
7291 7673 13066 7871 5026 4543 -78 8969 5557 3710 7021 2339 488 604 2395 65 -1411
7276 -1411 -3614 -3284 -3683 -809 807 -4364 -7045 -5073 -2889 3400 8885 12788 14466 13302 10353
7261 10353 8791 4387 4764 4434 6179 3686 -3596 -2174 -5031 -6791 -4422 755 1608 -7756 -6452
7246 -6452 -7007 6160 13139 7964 5802 5905 2317 -1927 -5747 2020 2406 3708 -2002 915 -983
7231 -983 -3368 -3804 -3084 454 6715 8549 7332 9356 14985 7727 4635 3361 864 -1415 -1379 -1224
7215 -1224 739 -1643 1180 5842 5010 4355 4138 1781 -1579 -2983 1639 -679 -3343 -8194 -7290 -3181
$$ packed form
7321a0849Q225L069M836J31K493K229n241j1894m675O21k73j784L506L438M951
7306a217K696k452k353r91l569L441l965O692O395l951M847O844k054o079L389
7291G673N393n195k845m83m621R047l412j847L311m682j851J16J791k330j476
7276a411k203L30l99K874J616n171k681J972K184O289N485L903J678j164k949
7261A0353j562m404L77l30J745k493p282J422k857j760K369N177Q53r364J304
7246f452n55J3167O979n175k162J03l588m244l820P767L86J302n710K917j898
7231i83k385m36P20L538O261J834j217K024N629p258l092j274k497k279L6J55
7215a224J963k382K823M662q32o55k17k357l360j404M622k318k664m851R04M109
$$ plain form
7199 -3181 -963 -6700 -8787 -1966 4551 6999 3394 -7102 -7964 -1238 5355 5446 5505 -2163 1178 5314
7183 5314 586 -2612 2760 7888 6153 177 -9304 -5495 -5122 -2024 -2122 -1655 -3512 -2521 -5153 198
7167 198 -5664 -12414 -16638 -1978 1122 305 4316 6593 423 -1824 616 483 774 4079 3277 4480
7151 4480 6673 6467 7089 6598 4359 -2604 -2274 1951 8674 9074 9674 3111 -632 1123 2056 965 2954
7134 2954 6238 3275 -5831 -4985 -11183 -16066 -6704 -945 910 -1087 334 2501 778 -7051 -6635
7119 -6635 -2794 -4070 -10375 -7926 -9280 -7852 -3640 -4201 -4155 -2875 -1688 410 6341 6711 3451 226
7103 226 -4269 -3970 4286 9887 8462 3594 -1105 -6839 -7714 -10081 -9097 -4187 -4254 -4329 -6166 -781 -1963
7086 -1963 -7923 -4361 -4815 -6206 1128 2161 1789 4799 9039 7319 4750 -1507 -4246 -3352 -6576 -9230
$$ packed form
7199c181K218n737k087O821O517K448l605j0496q62O726O593R1N9p668L341M136
7183E314m728l198N372N128j735n976r481L809L73L098r8M67j857R91k632N351
7167A98n862o750m224J4660L100q17M011K277o170k247K440j33K91L305q02J203
7151D480K193k06O22m91k239o963L30M225O723M00O00o563l743J755R33j091J989
7134B954L284k963r106Q46o198m883R362N759J855j997J421K167j723p829M16
7119f635L841j276o305K449j354J428M212n61M6J280J187K098N931L70l260l225
7103B26m495K99Q256N601j425m868m699n734q75k367R84M910o7p5j837N385j182
7086a963n960L562m54j391P334J033l72L010M240j720k569o257k739Q94l224k654
$$ plain form
7070 -9230 -5181 -2228 3011 8947 5904 -170 351 -239 1010 3007 9589 5614 198 2163 -585
7055 -585 -3713 2973 5801 6302 999 -2453 2243 -1453 -2323 446 8440 13071 9773 3586 109 2986
7039 2986 3890 1560 4697 -4170 -7491 -3557 6508 5131 -442 -5244 -14707 -13624 -8074 -2211 -4724
7024 -4724 -2246 2745 7177 4216 -430 -5451 -3862 -566 -815 -4701 -7190 -2169 1218 721 -657
7009 -657 -4022 -8004 -3210 708 -3689 -6821 -4036 -2696 613 4595 6384 6558 6685 8778 10778 3175
6993 3175 803 4159 -1308 -2912 -68 741 2800 10575 17366 5355 -5101 -15443 -18731 -13490
6979 -13490 -8019 -2146 759 3818 2405 -2672 -2220 -3215 -8599 -227 -3842 -2691 6834 7304 611
6964 611 -6355 -7692 -1191 2966 798 1231 2090 28 -721 -4395 -5900 -4954 -2688 -6661 -5401 -2950
$$ packed form
7070i230M049K953N239N936l043o074N21n90J249J997O582l975n416J965k748
7055e85l128O686K828N01n303l452M696l696q70K769P994M631l298o187l477K877
7039B986R04k330L137q867l321L934J0065j377n573m802r463J083N550N863k513
7024d724K478M991M432k961m646n021J589L296k49l886k489N021L387m97j378
7009f57l365l982M794L918m397l132K785J340L309L982J789J74J27K093K000p603
6993C175k372L356n467j604K844Q09K059P775O791j2011j0456j0342l288N241
6979a3490N471N873K905L059j413n077M52r95n384Q372l615J151R525M70o693
6964F11o966j337O501M157k168M33Q59k062p49l674j505R46K266l973J260K451
$$ plain form
6948 -2950 -1041 4090 8576 9591 11002 18737 17044 16565 14775 8717 3596 -1033 -337 5485 11909
6933 11909 12930 6977 -1833 -5064 -2300 -1413 -73 -1903 -7245 -6739 -3249 -2343 -3605 -6432 -6499 -4239
6917 -4239 -5747 -3975 7047 10876 1854 1911 1315 6975 7760 2085 -4063 -10567 -7216 -4737 -2618 -2020
6901 -2020 -2977 3625 3644 210 3644 3353 -873 -4579 -1144 -3119 -4318 -1071 -2168 -7148 -9530 -4742
6885 -4742 -365 -2461 -2553 -5089 -5960 -8794 -5853 -7080 -9813 -8315 -3449 -1706 -2390 516 1670 3302
6869 3302 2351 -3444 -8844 -13599 -13485 -9085 -3391 -6040 -3174 5632 11300 6920 375 -641 -3842
6854 -3842 -5085 -1616 2886 10337 12336 1845 -6881 169 5210 4911 1990 1582 -3474 -6035 -12022
6839 -12022 -17060 -16954 -11302 3479 11962 14494 4020 -1510 -2544 1293 1724 163 2982 9205 9781
$$ packed form
6948b950J909N131M486J015J411P735j693m79j790o058n121m629O96N822O424
6933A1909J021n953q810l231K764Q87J340j830n342N06L490R06j262k827o7K260
6917d239j508J772J1022L829r022N7n96N660P85n675o148o504L351K479K119N98
6901b020r57O602J9l434L434k91m226l706L435j975j199L247j097m980k382M788
6885d742M377k096r2k536q71k834K941j227k733J498M866J743o84K906J154J632
6869C302r51n795n400m755J14M400N694k649K866Q806N668m380o545j016l201
6854c842j243L469M502P451J999j0491q726P050N041k99k921m08n056k561n987
6839a2022n038J06N652J4781Q483K532j0474n530j034L837M31j561K819O223N76
$$ plain form
6824 9781 -1189 -6352 -1459 3356 16251 19677 18210 12372 4185 -917 -12 3636 -100 -3362 -829
6809 -829 3341 7702 2995 -2229 -2014 -4388 -5150 -1369 -2882 -10122 -10716 -6930 2329 4148 -2583 -4635
6793 -4635 2381 9664 8629 4276 7972 9211 1815 -4044 -5341 -6347 -5197 -5455 -4742 -3691 -1958
6778 -1958 -4595 -5719 -9923 -12479 -12751 -10919 -11334 -8324 -7958 -4403 -1066 -3354 -7424 -10045 -8202 -480
6762 -480 3211 2351 -4868 -5791 -3646 -3970 -8490 -9266 -6512 -5705 -9587 -4985 6131 9175 241 294 7904
6745 7904 13252 9279 5740 7320 6545 -127 -2820 5192 7909 1421 -2004 -8773 -13459 -17327 -16096
6730 -16096 -9544 -10241 -11909 -14846 -11509 -10439 -5200 -3136 -8022 -14993 -9984 -1270 3541 5575 4117
6715 4117 1972 4327 6586 4489 4480 3108 3028 3276 -747 -3478 -4680 -9960 -10036 -1627 4416 3156 105
$$ packed form
6824I781j0970n163M893M815J2895L426j467n838q187n102R05L648l736l262K533
6809h29M170M361m707n224K15k374p62L781j513p240n94L786R259J819o731k052
6793d635P016P283j035m353L696J239p396n859j297j006J150k58P13J051J733
6778a958k637j124m204k556k72J832m15L010L66L555L337k288m070k621J843P722
6762d80L691q60p219r23K145l24m520p76K754Q07l882M602J1116L044q934N3P610
6745G904N348l973l539J580p75o672k693Q012K717o488l425o769m686l868J231
6730a6096O552o97j668k937L337J070N239K064m886o971N009Q714M811K034j458
6715D117k145K355K259k097rj372q0K48m023k731j202n280p6Q409O043j260l051
$$ plain form
6698 105 194 326 587 -7263 -4530 -7931 -17425 -18074 -10921 -3339 427 -2456 -166 1211 -3457 2782
6682 2782 8193 9208 5851 85 -316 -1661 -5559 -5028 -6387 -9424 -8203 -1249 -59 737 2732 -98
6666 -98 -2654 3711 6808 5401 -2302 -7278 -11513 -17386 -17553 -11588 -5749 -1232 4354 4320 2238 -2929
6650 -2929 -10064 -14882 -12482 -10048 -13596 -6384 -7026 -8534 -8879 -8411 -5582 -2577 4801 13331 4764 -7281
6634 -7281 -8492 -995 5968 4122 2734 868 -4820 -6442 -12723 -9259 -8250 -4812 4127 11454 9324
6619 9324 849 -1135 1247 1848 -2212 -2862 37 1236 -2484 -2732 1279 6039 7860 1119 -6614 -8959
6603 -8959 -2610 2339 -1124 -7256 -395 4853 2624 -8605 -11584 -10296 -6091 -2509 -2504 -5962 -9178
6588 -9178 -7757 -6750 -3120 1567 265 -812 -2039 -5604 -12429 -6793 -1587 -151 -7861 -5745 -6789
$$ packed form
6698A05Q9J32K61p850K733l401r494o49P153P582L766k883K290J377m668O239
6682B782N411J015l357n766m01j345l898N31j359l037J221O954J190P96J995k830
6666i8k556O365L097j407p703m976m235n873j67N965N839M517N586l4k082n167
6650b929p135m818K400K434l548P212o42j508l45M68K829L005P378Q530q567j2045
6634g281j211P497O963j846j388j866n688j622o281L464J009L438Q939P327k130
6619I324q475j984K382O01m060o50K899J199l720k48M011M760J821o741p733k345
6603h959O349M949l463o132O861N248k229j1229k979J288M205L582Nl458l216
6588i178J421J007L630M687j302j077j227l565o825N636N206J436p710K116j044
$$ plain form
6573 -6789 -7748 -8291 -421 4940 6491 7379 1214 -2547 -8956 -6151 -953 4687 155 2830 6787 -1126
6557 -1126 -1018 -5049 -4787 -10502 -12850 -9614 -10102 -10363 507 1208 3452 2299 -2973 -7757 -11101 -3911
6541 -3911 -2323 -6517 -6466 -5932 -6974 -4565 -1243 4121 350 564 8958 11162 10448 9811 -2589 -2032
6525 -2032 -8319 -11007 -7870 -4432 564 6599 3812 2886 4237 487 -20 -5234 -4050 -4019 -8317 -8843
6509 -8843 -10496 -7985 -5415 -10457 -6458 -7254 -13048 -15597 -13630 -11762 -10226 -8463 -8570 -6454 -630
6494 -630 -1831 -8427 -6344 -6260 -4895 -4109 -7893 -10464 -5800 1632 634 -3440 3662 771 -1712 0
6478 0 1988 7144 7537 8058 3836 8334 9264 5967 9886 12955 8662 5264 -1291 -6011 -7456 -12527
6462 -12527 -18355 -13023 -15896 -14713 -11430 -4958 2789 6212 5670 2455 3461 686 -379 -4284 -4404
$$ packed form
6573f789r59n43P870N361J551Q88o165l761o409K805N198N640m532K675L957p913
6557a126J08m031K62n715k348L236m88k61J0870P01K244j153n272m784l344P190
6541c911J588m194N1N34j042K409L322N364l771K14Q394K204p14o37j2400N57
6525b032o287k688L137L438M996O035k787r26J351l750n07n214J184L1m298n26
6509h843j653K511K570n042L999p96n794k549J967J868J536J763j07K116N824
6494f30j201o596K083Q4J365P86l784k571M664P432r98m074P102k891k483J712
6478@J988N156L93N21m222M498R30l297L919L069m293l398o555m720j445n071
6462a2527n828N332k873J183L283O472P747L423n42l215J006k775j065l905j20
$$ plain form
6447 -4404 -5651 -2824 6008 7096 587 -984 -1336 -1562 -3531 -8928 -4283 -4951 -6393 -12671 -12006 -3321
6431 -3321 -3274 -8500 -10281 -8052 -9939 -4533 2750 5646 1871 -15022 -7559 -2318 -2401 216 -5288 -9469
6415 -9469 421 852 -10226 -18452 -19432 -10214 -8633 1781 5028 -1355 -3029 5101 6083 1988 6765
6400 6765 9112 1378 160 5680 9210 5525 4396 3212 -1148 -269 1533 -2351 -2859 -1584 -7513
6385 -7513 -14456 -11882 -8021 -13514 -10005 -8975 -8948 -4608 -2270 -4307 -5444 -2763 -835 1362 -2726
6370 -2726 -2460 2518 6501 2693 1962 -4530 -12410 -9328 -1730 850 1835 2404 -899 4077 7927 7611
6354 7611 935 -4309 -8122 -16518 -16413 -13155 -8381 -8667 -8768 -9910 -9625 -2792 5224 4936 1475 2004
6338 2004 1012 -4004 -5759 -11041 -7477 2207 7743 1026 -764 -661 655 -857 -452 -1526 -7952 -10641
$$ packed form
6447d404j247K827Q832J088o509j571l52k26j969n397M645o68j442o278O65Q685
6431c321M7n226j781K229j887N406P283K896l775j6893P463N241q3K617n504m181
6415i469R890M31j1078q226r80R218J581J0414L247o383j674Q130R82m095M777
6400F765K347p734j218N520L530l685j129j184m360Q79J802l884n08J275n929
6385g513o943K574L861n493L509J030K7M340K338k037j137K681J928K197m088
6370b726K66M978L983l808p31o492p880L082P598K580R85N69l303M976L850l16
6354G611o676n244l813q396J05L258M774k86j01j142K85O833Q016k88l461N29
6338B004r92n016j755n282L564R684N536o717j790J03J316j512M05j074o426k689
$$ plain form
6322 -10641 -10826 -14870 -15199 -7965 1083 -354 -7167 -4168 84 2297 2762 -748 -6620 -11445 -10892 -6158
6306 -6158 -278 5837 8371 8091 -752 -6838 -4578 -1204 -6180 -2692 3632 3686 2204 1148 3799 8337
6290 8337 5754 4042 1697 -1898 -5426 -6648 -7657 -5957 -11166 -2914 -1070 -4993 -8890 -5942 -2019
6275 -2019 -6295 -7392 -11379 -10176 -4376 -1929 -2367 -257 -8649 -12427 -7395 -5854 -10846 -6809 -11266
6260 -11266 -10174 -4793 -3421 -448 313 478 -759 -3241 -4539 -5902 -1862 4093 2365 -1188 -613
6245 -613 1591 6193 1102 963 4329 3897 6125 3312 3438 1366 3466 -742 -3770 4290 7196 6794
6229 6794 6441 5753 -1217 -3495 -955 -745 1087 3919 4828 2673 1872 3233 1215 -3820 -12157 -11244
6213 -11244 -5875 -10498 -7247 -5488 -3096 -5998 -9368 -7565 -3679 -2251 1146 5396 5492 -1158 -5525
$$ packed form
6322a0641j85m044l29P234R048j437o813K999M252K213M65l510n872m825N53M734
6306f158N880O115K534k80q843o086K260L374m976L488O324N4j482j056K651M538
6290H337k583j712k345l595l528j222j009J700n209Q252J844l923l897K948L923
6275b019m276j097l987J203N800K447m38K110q392l778N032J541m992M037m457
6260a1266J092N381J372K973P61J65j237k482j298j363M040N955j728l553N75
6245f13K204M602n091j39L366m32K228k813J26k072K100m208l028Q060K906m02
6229F794l53o88o970k278K540K10J832K832R09k155q01J361k018n035q337R13
6213a1244N369m623L251J759K392k902l370J803L886J428L397M250R6o650m367
$$ plain form
6198 -5525 -14559 -16230 -10927 -9752 -12763 -10764 -13768 -16269 -14050 -8294 -6167 -5585 -5278 -7339 -8046 -8120
6182 -8120 -12929 -9516 -6903 -2142 -484 -930 -3162 -2736 -2601 -2197 -1558 3224 435 -6519 -9765 -4609
6166 -4609 2651 -6683 -16596 -10419 -5742 -2830 -4691 -4591 -7854 -13730 -9734 -7272 -4757 -4610 -6777
6151 -6777 -4078 -3355 -1235 -60 4314 3682 -2867 -8697 -15592 -13499 -6308 -5533 -7151 -8833 -7352 -6475
6135 -6475 -6175 -8743 -10450 -4197 -2571 468 1525 1711 599 -4572 -9851 -9333 -4424 2340 5890 1681
6119 1681 1873 -1748 -1591 646 -31 -3212 -4340 -6444 -6929 -7027 -7410 -5966 -11456 -18997 -25594 -19549 -12837
6102 -12837 -4126 -4977 -8530 98 5759 5650 -2946 -10424 -13427 -20430 -22550 -24345 -14160 -7131 -6189
6087 -6189 -7580 -6255 6551 11077 10380 12144 8604 11768 8074 1980 3396 2444 1358 -927 -4054
$$ packed form
6198e525r034j671N303J175l011J999l004k501K219N756K127N82L07k061p07p4
6182h120m809L413K613M761J658m46k232M26J35M04O39M782k789o954l246N156
6166d609P260r334r913O177M677K912j861J00l263n876L996K462K515J47k167
6151f777K699P23K120J175M374o32o549n830o895K093P191P75j618j682J481Q77
6135f475L00k568j707O253J626L039J057J86j112n171n279N18M909O764L550m209
6119A681J92l621J57K237o77l181j128k104m85r8l83J444n490p541o597O045O712
6102a2837Q711q51l553Q628N661j09q596p478l003p003k120j795J0185P029R42
6087f189j391J325J2806M526o97J764l540L164l694o094J416r52j086k285l127
$$ plain form
6072 -4054 -570 -1140 -1428 -3247 1780 2136 7542 8485 5082 4672 7249 -583 -7545 -6980 -3756 -2329
6056 -2329 -2647 -2653 -1539 -4746 -5193 -6202 -4593 -3347 -170 4738 1596 -4377 -8671 -10722 -15893 -17646
6040 -17646 -13387 -3355 1707 536 5726 9742 3627 -671 -3244 -3674 -3660 -10991 -10189 -3751 1279
6025 1279 -162 227 2488 3042 1662 -3888 -6894 -4722 1535 -2447 -1882 -6945 -11369 -7099 -6992 -3447
6009 -3447 -3435 -792 7274 6319 -1603 -2716 -7944 -10849 -5610 1234 3796 5633 1661 -8069 -10669 -1822
5993 -1822 2866 4328 -2394 -353 2540 2639 3938 1768 -3624 -3426 -3182 -852 -6860 -3963 -2841 -4552
5977 -4552 320 1308 6912 9343 5689 5039 7286 6564 7285 2255 -2169 -2466 -10239 -12952 -9899 -7465
5961 -7465 -3938 -5268 -650 -2902 -3664 -938 1247 -1507 -4294 -8380 -9302 -8228 -973 542 6331
$$ packed form
6072d054L484n70k88j819N027L56N406R43l403m10K577p832o962N65L224J427
6056b329l18oJ114l207m47j009J609J246L177M908l142n973m294k051n171j753
6040a7646M259J0032N062j171N190M016o115m298k573m30J4p331Q02O438N030
6025A279j441L89K261N54j380n550l006K172O257l982N65n063m424M270J07L545
6009c447J2K643Q066r55p922j113n228k905N239O844K562J837l972r730k600Q847
5993a822M688J462o722K041K893R9J299k170n392J98K44K330o008K897J122j711
5977d552M872R88N604K431l654o50K247p22P21n030m424k97p773k713L053K434
5961g465L527j330M618k252p62K726K185k754k787m086r22J074P255J515N789
$$ plain form
5946 6331 6729 -1746 -5590 -9710 -11740 -9562 -13198 -10129 -5986 -1221 1238 1524 3911 2002 1205 -2611
5930 -2611 -8572 -9586 -7889 -10474 -6478 -2945 -2058 1355 3134 303 -7719 -9065 -9599 -10893 -9444
5915 -9444 -4475 -900 -2831 -2681 -8721 -16824 -18846 -21674 -21956 -17000 -7951 -4000 -275 1599 -1295
5900 -1295 -8311 -10961 -1213 1979 -30 -2534 -2613 -1393 1691 -6967 -8060 -1641 1504 238 1956
5885 1956 -1297 -6415 -9704 -11888 -5936 -5276 -12272 -13366 -8356 -8904 -6737 -5766 785 4507 2110 1739
5869 1739 11519 11250 1526 -1725 -3934 -7298 -10666 -7791 -4807 4194 5867 1766 395 -1850 -9666
5854 -9666 -11255 -10212 -12411 -10651 -3511 -2622 -5368 -2458 -3921 -8522 -1742 -3285 -3503 -9021 -4599
5839 -4599 -1741 -696 -3073 -11001 -10882 -10554 -8436 -6526 -4367 -6841 -12568 -11203 -10773 -4030 1064 4954
$$ packed form
5946F331L98q475l844m120k030K178l636L069M143M765K459K86K387j909p97l816
5930b611n961j014J697k585L996L533Q87L413J779k831q022j346n34j294J449
5915i444M969L575j931J50o040q103k022k828k82M956R049L951L725J874k894
5900a295p016k650R748L192k009k504p9J220L084q658j093O419L145j266J718
5885A956l253n118l289k184N952O60o996j094N010n48K167R71O551L722k397l71
5869A739R780k69r724l251k209l364l368K875K984R001J673m101j371k245p816
5854i666j589J043k199J760P140Q89k746K910j463m601O780j543k18n518M422
5839d599K858J045k377p928J19L28K118J910K159k474n727J365M30O743N094L890
$$ plain form
5823 4954 7596 5857 2910 5496 2021 2418 -1810 -7398 -11159 -16293 -16938 -18620 -22629 -13716 -8790
5808 -8790 -7310 -1115 -2331 -997 804 7820 9060 8682 825 -2820 1411 -4404 -5599 -2234 -294
5793 -294 -4944 -1831 4283 7037 3562 -750 -7984 -22110 -25518 -18808 -20302 -16865 -12789 -10875 -8345
5778 -8345 -6369 -5884 -5559 -5236 -2725 -2673 -1774 -2049 -9907 -11778 -4118 -3868 -8413 -11231 -9665 -5396 1228
5761 1228 -6521 -2846 -1800 -4770 -2114 -1211 -2150 -3015 -5249 -6318 -9542 -9057 -5595 -7628 -4580 -5063
5745 -5063 -9126 -1816 2021 1845 -5773 -10309 -9118 -9993 -10087 -5646 -7156 -408 6908 4629 -3644 -9709
5729 -9709 -8580 -1176 -2847 -3660 -5425 -2095 1006 2185 -5523 -12916 -10961 -5372 -4697 -6331 -6133 -4276
5713 -4276 -9696 -9679 -7487 -8047 -9275 -13099 -11285 -10790 -15871 -16642 -10812 -6407 -6875 -7216 -5951 -4237 -9458
$$ packed form
5823D954K642j739k947K586l475L97m228n588l761n134o45j682m009Q913M926
5808h790J480O195j216J334J801P016J240l78p857l645M231n815j195L365J940
5793b94m650L113O114K754l475m312p234j4126l408O710j494L437M076J914K530
5778h345J976M85L25L23K511N2Q99k75p858j871P660K50m545k818J566M269O624
5761A228p749L675J046k970K656R03r39q65k234j069l224M85L462k033L048m83
5745e063m063P310L837j76p618m536J191q75r4M441j510O748P316k279q273o065
5729i709J129P404j671q13j765L330L101J179p708p393J955N589O75j634J98J857
5713d276n420J7K192n60j228l824J814M95n081p71N830M405m68l41J265J714n221
$$ plain form
5696 -9458 -9210 -9578 -11751 -9415 -5059 367 362 3279 7617 3098 -2004 -1722 -4241 -3252 724 -418 -4076
5679 -4076 -1841 1041 4173 3288 1502 -5167 -9625 -4826 -2811 3342 6803 7670 6135 5877 2860 -4147
5663 -4147 -7810 -6295 364 14100 18481 9655 -3604 -5076 2426 6380 10513 13773 4318 -1485
5649 -1485 -3811 -6803 -1537 -1188 -3019 -172 3513 1192 -296 -3539 -3309 -743 -6136 -6590 1433 4097
5633 4097 5424 5499 1275 -651 -86 735 -1130 2183 3255 -3368 -5636 -1173 2296 -1619 -9621 -12950
5617 -12950 -5980 -897 -8204 -4712 -8239 -13839 -5476 -571 -2495 -3082 -6835 -7914 -4153 -6209 -3449
5602 -3449 -452 -1215 -4471 -7519 -6252 -7201 -10970 -17167 -12630 -7733 -10088 -6165 1848 -1347 -5541
5587 -5541 -4610 1026 12507 12268 2383 -1535 -8348 -14105 -13837 -8271 -8078 -3110 1040 2160 2240 6808
$$ packed form
5696i458K48l68k173K336M356N426nK917M338m519n102K82k519R89L976j142l658
5679d076K235K882L132q85j786o669m458M799K015O153L461Q67j535k58l017p007
5663d147l663J515O659J3736M381q826j3259j472P502L954M133L260r455n803
5649a485k326k992N266L49j831K847L685k321j488l243K30K566n393m54Q023K664
5633D097J327P5m224j926N65Q21j865L313J072o623k268M463L469l915q002l329
5617a2950O970N083p307L492l527n600Q363M905j924n87l753j079L761k056K760
5602c449K997p63l256l048J267r49l769o197M537M897k355L923Q013l195m194
5587e541R31N636J1481k39r885l918o813n757K68N566J93M968M150J120Q0M568
$$ plain form
5571 6808 5768 -2039 4111 10830 9004 7610 -93 -4834 -4099 -8258 -8326 -4800 -3690 -7582 -7201 805
5555 805 -7 -1234 -8150 -14170 -12478 -12687 -14193 -8110 -708 3207 2865 4358 2056 -1869 -5829 -8983
5539 -8983 -6182 -1147 1534 7772 9681 4844 -2805 -1777 2480 1395 -4035 -12160 -17692 -10776 428
5524 428 3186 4739 7622 6367 5740 7629 8118 4230 5880 3321 2530 3881 5147 4367 -745 -12
5508 -12 -1927 -1616 -873 -4285 -8696 -8117 -2370 1861 -5334 -3639 1892 726 -7398 -2097 -1520 -9483
5492 -9483 -12844 -5141 -4416 -6137 -7578 -10243 -10341 -13831 -11105 -3342 -6061 -8675 -9685 -2192 2933 5623
5476 5623 637 -5579 -6227 -3484 -2404 -3091 -5448 -5378 2080 7324 828 -2010 -3759 -5213 790 3047
5460 3047 -111 -1198 2265 6269 1578 -896 145 -2742 -5561 -4332 -9185 -10253 -9759 -2614 -1935
$$ packed form
5571F808j040p807O150O719j826j394p703m741P35m159o8L526J110l892L81Q006
5555H05q12j227o916o020J692k09j506O083P402L915l42J493k302l925l960l154
5539h983K801N035K681O238J909m837p649J028M257j085n430q125n532O916J1204
5524D28K758J553K883j255o27J889M89l888J650k559p91J351J266p80n112P33
5508a2j915L11P43l412m411N79N747M231p195J695N531j166q124N301N77p963
5492i483l361P703P25j721j441k665r8l490K726P763k719k614j010P493N125K690
5476E623m986o216o48K743J080o87k357P0P458N244o496k838j749j454O003K257
5460C047l158j087L463M004m691k474J041k887k819J229m853j068M94P145O79
$$ plain form
5445 -1935 -7487 -6133 -10592 -6502 3938 10955 10364 1964 -802 -7656 -14890 -11525 -7602 -10945 -12143
5430 -12143 -8586 -7877 -9622 -15155 -15482 -11765 -6342 -8412 -2772 -332 4091 -2476 -8786 -8028 -427
5415 -427 -449 -5841 -4800 -181 -3837 -8820 -6032 4185 1803 -152 7298 5092 2522 2359 -1260 3942
5399 3942 5607 1884 -1977 -4684 -5937 -3625 -1832 -2688 -1895 -1820 -2679 -862 2075 401 -1439 -5428
5383 -5428 -6690 -4743 3519 1016 -8424 -10178 -11406 -9886 -2155 6142 6520 -2491 -804 5758 3661
5368 3661 -1135 -5346 -10432 -9799 -4439 2452 4775 3442 -334 -10509 -13498 -11428 -9383 -6996 -5205
5353 -5205 -7178 -6831 2186 12571 17100 10339 1026 -1409 -343 3206 3385 -3251 -7745 -10916 -4391
5338 -4391 51 -215 -5169 -11343 -14571 -9069 -4462 -2039 -4965 -3828 3714 7580 7784 4590 3467
$$ packed form
5445a935n552J354m459M090J0440P017n91q400k766o854p234L365L923l343j198
5430a2143L557P09j745n533l27L717N423k070N640K440M423o567o310P58P601
5415d27k2n392J041M619l656m983K788J0217k382j955P450k206k570j63l619N202
5399C942J665l723l861k707j253K312J793q56P93P5q59J817K937j674j840l989
5383e428j262J947Q262k503r440j754j228J520P731Q297L78r011J687O562k097
5368C661m796m211n086O33N360O891K323j333l776j0175k989K070K045K387J791
5353e205j973L47R017J0385M529o761r313k435J066L549J79o636m494l171O525
5338d391M442k66m954o174l228N502M607K423k926J137P542L866K04l194j123
$$ plain form
5323 3467 1668 -7270 -15101 -16549 -13596 -8138 -1419 -1747 3606 -107 -6743 -6383 -4211 -3849 -4491 -10271
5307 -10271 -10161 -4480 -4739 -9616 -6782 -4187 -3186 -6086 -8998 -11009 -4595 -5327 -8350 -5530 -5446 -5981
5291 -5981 -1797 2608 3385 -5892 -11661 1423 4589 -265 -197 8767 1017 -4954 -10134 -9612 -11130 -13365
5275 -13365 -14172 -11268 -2487 -2870 -8101 -10903 -9950 -4029 -5467 -7865 -10635 -14957 -13112 -7213 -4696
5260 -4696 -9436 -11041 -7631 -12551 -9393 -4070 -6057 -3407 2696 2160 4217 1983 -1468 -614 -2515
5245 -2515 -1972 408 -3513 -5577 -9638 -9586 -5930 2792 5404 3507 7743 9856 4541 4217 3719 -735
5229 -735 -8440 -9994 -8122 -6722 -26 3418 8464 8962 2457 6517 7889 4508 -2774 -4597 -3965 -1658
5213 -1658 463 7234 13115 8986 483 -2625 -3818 -2074 -2658 -5810 -3538 -4838 -3409 -2692 -6620
$$ packed form
5323C467j799q938p831j448K953N458O719l28N353l713o636L60K172L62o42n780
5307a0271J10N681k59m877K834K595J001k900k912k011O414p32l023K820Q4n35
5291e981M184M405P77r277n769J3084L166m854O8Q964p750n971n180N22j518k235
5275a3365q07K904Q781l83n231k802R53N921j438k398k770m322J845N899K517
5260d696m740j605L410m920L158N323j987K650O103n36K057k234l451Q54j901
5245b515N43K380l921k064m061N2L656Q722K612j897M236K113n315l24m98m454
5229g35p705j554J872J400O696L444N046M98o505M060J372l381p282j823O32K307
5213a658K121O771N881m129q503l108j193J744n84l152K272j300J429P17l928
$$ plain form
5198 -6620 -5882 -1138 2538 4828 8809 357 2746 143 -8742 -8516 -11371 -15078 -11171 -1995 2660
5183 2660 422 3227 2151 786 -3193 -2131 2963 7960 1926 -3009 -3708 -519 4425 5615 3987
5168 3987 -1987 -1500 500 -484 -4488 -4236 -3443 -2305 -1061 -2809 -5852 -5050 -7580 -2075 1752 3558
5152 3558 3077 2125 -7080 -464 801 -2456 -1346 -8382 -3456 6303 12507 8924 5896 2445 8531
5137 8531 4459 1090 -1239 -1718 -3596 -6207 -2175 -393 -3874 -3645 -2357 -5212 2985 10693 5366
5122 5366 991 -2546 -1270 -949 -2147 -1444 -5571 -11389 -10232 -6740 -7926 -10459 -9833 -8525 -1605 1573
5106 1573 -1135 -3425 1111 3402 -3892 -10571 -11113 -3777 4491 -1757 -1425 -1274 1413 5525 1100 -369
5090 -369 1482 -1983 1973 -4227 -2516 -4206 -5700 -4033 -6699 -3286 -835 -5350 -8046 -6011 -6552
$$ packed form
5198f620P38M744L676K290L981q452K389k603q885K26k855l707L907R176M655
5183B660k238K805j076j365l979J062N094M997o034m935o99L189M944J190j628
5168C987n974M87K000r84m004K52P93J138J244j748l043Q02k530N505L827J806
5152C558m81r52r205O616J265l257J110p036M926R759O204l583l028l451O086
5137H531m072l369k329m79j878k611M032J782l481K29J288k855Q197P708n327
5122E366m375l537J276L21j198P03m127n818J157L492j186k533O26J308O920L178
5106A573k708k290M536K291p294o679n42P336Q268o248L32J51K687M112m425j469
5090c69J851l465L956o200J711j690j494J667k666L413K451m515k696K035n41
$$ plain form
5075 -6552 793 9726 11246 12473 7923 466 -3049 -5415 -5627 -4844 1356 5066 3207 -1935 -8221
5060 -8221 -6758 5671 8907 6067 5880 5024 7769 5090 4185 5410 9882 4035 -4958 -204 672 687
5044 687 732 -4855 -2207 2192 2350 -10001 -13237 -11293 -12207 -5301 -1925 -418 4277 3877 2648 2732 -2443
5027 -2443 -2220 -3400 -3879 1331 5309 7893 4351 181 -5353 -5357 -358 352 -1967 -2223 953 1904 -498
5010 -498 -3033 -971 171 -1582 -3691 -8226 -4917 -7558 -8064 -10402 -17923 -13605 -14145 -16159 -14300 -13221
4994 -13221 -12464 -4350 -2384 -4184 -4416 -10125 -7749 -8359 -5478 -1037 -545 1887 546 335 3532 2458
4978 2458 593 979 8384 6879 1967 -1432 -2184 -4424 780 1246 -759 -4884 -8792 -4720 -2183 -42
4962 -42 3573 -2875 -6737 -8899 -6199 -5781 -3473 1213 16228 15919 185 -3218 -4191 -2978 -2692 -995
$$ packed form
5075f552P345Q933J520J227m550p457l515k366k12P83O200L710j859n142o286
5060h221J463J2429L236k840j87q56K745k679r05J225M472n847q993M754Q76J5
5044F87M5n587K648M399J58j2351l236J944r14O906L376J507M695m00j229Q4n175
5027b443K23j180m79N210L978K584l542m170n534mM999P10k319k56L176R51k402
5010d98k535K062J142j753k109m535L309k641n06k338p521M318n40k014J859J079
4994a3221P57Q114J966j800k32n709K376o10K881M441M92K432j341k11L197j074
4978B458j865L86P405j505m912l399p52k240N204M66k005m125l908M072K537K141
4962d2L615o448l862k162K700M18K308M686J5015l09j5734l403r73J213K86J697
$$ plain form
4946 -995 1605 7376 7080 1890 -2198 -12214 -12675 -10430 -5485 -7669 -9737 -6709 -8237 -6562 -4714
4931 -4714 66 -5523 -7286 -11702 -8393 -1321 1268 5058 2923 -736 -1354 329 226 1207 3000 -3250
4915 -3250 -4376 -3539 -1511 1066 4200 -1006 -14670 -19238 -6099 -4139 -7598 -10764 -6962 -3685 2308
4900 2308 856 1061 -1691 -5248 -1040 -2979 -8234 -14510 -7415 -3260 -6055 -8175 -8908 -7316 -6102
4885 -6102 -2697 -3 -4651 -9517 -12490 -8167 -568 6200 6578 3978 1358 851 9552 11430 7823
4870 7823 6747 9393 6940 2120 6199 9839 6533 -2729 -5430 -3430 -4541 -6926 -5830 -5125 -2898
4855 -2898 -8367 -11910 -8546 -3358 -3471 -2480 -1908 -2567 -5741 -7012 -2323 1091 4266 8656 7077 6568
4839 6568 6793 6944 1915 -1414 -3495 -3822 -5539 -4092 1439 2266 488 3096 1993 -4851 -6217 -7412
$$ packed form
4946i95K600N771k96n190m088j0016m61K245M945k184k068L028j528J675J848
4931d714M780n589j763m416L309P072K589L790k135l659o18J683j03R81J793o250
4915c250j126Q37K028K577L134n206j3664m568J3139J960l459l166L802L277N993
4900B308j452K05k752l557M208j939n255o276P095M155k795k120p33J592J214
4885f102L405K694m648m866k973M323P599O768L78k600k620n07Q701J878l607
4870G823j076K646k453m820M079L640l306r262k701K000j111k385J096P05K227
4855b898n469l543L364N188j13R91N72o59l174j271M689L414L175M390j579n09
4839F568K25J51n029l329k081l27j717J447N531Q27j778K608j103o844j366j195
$$ plain form
4823 -7412 -9436 -5451 126 1260 2699 5104 8109 5369 1920 -2219 -4899 -1634 6199 4717 6344
4808 6344 3614 -6382 -12670 -11782 -13971 -14549 -8404 -4412 1332 2847 -8211 -16897 -10767 699 4267
4793 4267 6548 9626 5433 788 -4738 -7979 -7634 -10707 -15973 -10683 -10976 -13413 -5027 5265 3585
4778 3585 -837 -5847 -3878 -2769 1589 11774 9562 2882 -4500 -11233 -8847 -4908 -6544 2831 6624
4763 6624 -99 -7291 -5034 -6478 -5449 -455 1948 -8610 -5090 -2089 -5407 -5527 -4195 -152 2854
4748 2854 -1384 -2677 1983 4517 8402 7107 1172 -7059 -7640 1220 4539 1935 -3971 -3045 -1509
4733 -1509 2345 1107 2703 3634 3159 -203 -2144 1207 2526 2771 3484 4940 2631 -2371 -4161 -1471
4717 -1471 -1946 -1438 -1934 -3702 1385 2333 -2523 -2390 -4850 77 4053 -3414 -12174 -11617 -6910 -5349
$$ packed form
4823g412k024L985N577J134J439K405L005k740l449m139k680L265P833j482J627
4808F344k730r996o288Q88k189n78O145L992N744J515j1058q686O130J1466L568
4793D267K281L078m193m645n526l241L45l073n266N290k93k437Q386J0292j680
4778C585m422n010J969J109M358J0185k212o680p382o733K386L939j636R375L793
4763F624o723p192K257j444J029M994K403j0558L520L001l318j20J332M043L006
4748B854m238j293M660K534L885j295n935q231n81Q860L319k604n906R26J536
4733a509L854j238J596R31m75l362j941L351J319K45P13J456k309n002j790K690
4717a471m75N08m96j768N087R48m856J33k460M927L976p467q760N57M707J561
$$ plain form
4701 -5349 -12939 -14818 -10043 -1759 -616 -754 4002 6391 4393 -2674 -5357 -8472 -9373 -2807 -213
4686 -213 -682 4666 -488 1687 9559 11400 10282 4233 3280 -4815 -9784 -10225 -3158 -1282 -198 3083
4670 3083 4991 6731 5451 -6154 1517 5190 -307 -777 4770 10113 5545 -2709 -2437 3163 6567
4655 6567 3316 4686 3708 -24 1656 -3471 -3689 1127 600 -1645 -5214 -2123 4186 1208 3212 -1507
4639 -1507 -5388 -4001 1004 2901 856 -4643 -6747 -1990 2477 -3404 2043 770 2764 3506 4744
4624 4744 3154 6641 4431 -2793 -5889 -10750 -8685 -7933 -6931 -215 1461 -3174 -6878 -11153 -4008
4609 -4008 1633 -2554 -1962 -3618 -5374 3178 3724 2985 178 3500 5372 3176 -1691 -361 3443 5929
4593 5929 -1876 -8516 -7380 -4313 -1339 -5736 -6408 -11825 -19095 -9431 -3465 -4251 -5102 -9149 -13896 -17517
$$ packed form
4701e349p590j879M775Q284J143j38M756K389j998p067k683l115r01O566K594
4686b13m69N348n154K175P872J841j118o049r53q095m969m41P067J876J084L281
4670C083J908J740j280j1605P671L673n497m70N547N343m568q254K72N600L404
4655F567l251J370r78l732J680n127k18M816n27k245l569L091O309k978K004m719
4639a507l881J387N005J897k045n499k104M757M467n881N447j273J994P42J238
4624D744j590L487k210p224l096m861K065P52J002O716J676m635l704m275P145
4609d008N641m187N92j656j756Q552N46p39k807L322J872k196m867J330L804K486
4593E929p805o640J136L067K974m397o72n417p270R664N966p86q51m047m747l621
$$ plain form
4577 -17517 -13616 -15169 -12905 -2135 2181 -298 -3111 -4260 -74 3979 420 -5709 -10919 -10317 -3567
4562 -3567 -3150 -1990 -4451 -9257 -10323 -560 7139 13033 13033 9557 6333 6741 2376 83 2714 2990
4546 2990 7662 8860 14002 16473 15664 12800 1026 -5374 -4224 648 287 -5964 -8563 -12307 -13746
4531 -13746 -9979 -3464 -1350 28 717 -298 1489 1021 -1502 -1205 -6435 -5878 -4669 -2885 2301 2277
4515 2277 -3314 -7499 -12154 -17637 -19093 -13360 -7485 -6373 -5777 -3553 -2823 -4144 -9019 -11667 -10776 -5203
4499 -5203 4367 9091 5423 646 3253 5499 9015 15449 10442 1527 -7339 -6347 942 708 -3883
4484 -3883 -4462 -7489 -11670 -7093 -10844 -12852 -10737 -8783 -5103 865 8220 8136 -1782 -6357 -4253 -637
4468 -637 930 -1986 1263 4682 7786 13397 14335 11266 8877 4458 8830 12156 4418 -2013 -2717 -1171
$$ packed form
4577a7517L901j553K264J0770M316k479k813j149M186M053l559o129n210O02O750
4562c567M17J160k461m806j066R763P699N894%l476l224M08m365k293K631K76
4546B990M672J198N142K471q09k864j1774o400J150M872l61o251k599l744j439
4531a3746L767O515K114J378O89j015J787m68k523K97n230N57J209J784N186k4
4515B277n591m185m655n483j456N733N875J112N96K224P30j321m875k648Q91N573
4499e203R570M724l668m777K607K246L516O434n007q915q866R92P289k34m591
4484c883n79l027m181M577l751k008K115J954L680N968P355q4r918m575K104L616
4468f37J567k916L249L419L104N611R38l069k389m419M372L326p738o431p04J546
$$ plain form
4452 -1171 3879 -7726 -15666 -13236 -10973 -4588 -1314 1255 4258 7217 -2450 -5504 -7264 -9569 -8197
4437 -8197 -4555 -10526 -8154 -2932 -3055 -7603 -2942 418 2639 2969 1607 5698 12908 6234 3576
4422 3576 8166 -355 -3414 3353 3336 2910 -2788 -8429 -2078 4094 -3094 -10020 -10473 -1112 5006 2655
4406 2655 -831 175 214 2859 7183 -198 -3241 2428 3841 2119 -2708 -2286 -2482 4791 4641 1456
4390 1456 4876 381 -887 -701 5241 12008 8503 1417 -3058 -3657 -4024 2330 5366 -1309 -2477 -5069
4374 -5069 -8077 -9629 -3088 -1669 -7210 -13426 -9840 -13529 -15410 -14675 -12540 -4143 -6493 -10151 -5228
4359 -5228 -3558 -6189 -3065 1909 4275 949 -7811 -6122 -4661 -2390 -3170 -4215 1557 47 5977
4344 5977 3573 -5113 -3810 5448 10116 4955 6316 5380 5596 5235 605 1425 -418 -4733 -2571 -709
$$ packed form
4452a171N050j1605p940K430K263O385L274K569L003K959r667l054j760k305J372
4437h197L642n971K372N222j23m548M661L360K221L30j362M091P210o674k658
4422C576M590q521l059O767j7m26n698n641O351O172p188o926m53R361O118k351
4406B655l486J006L9K645M324p381l043N669J413j722m827M22j96P273j50l185
4390A456L420m495j268J86N942O767l505p086m475n99l67O354L036o675j168k592
4374e069l008j552O541J419n541o216L586l689j881P35K135Q397k350l658M923
4359e228J670k631L124M974K366l326q760J689J461K271p80j045N772j510N930
4344E977k404q686J303R258M668n161J361r36K16l61m630Q20j843m315K162J862
$$ plain form
4328 -709 -3259 3477 3181 1836 1570 7311 16973 17863 12866 13096 13864 13153 12566 10634 4819 -426 1151
4311 1151 3630 2163 1744 -1022 -1136 -53 1831 515 363 4578 3291 -543 -4151 2553 3213 -1687
4295 -1687 503 -1871 -6021 -3846 61 5708 2349 -1010 -1726 -5884 1150 2927 -984 -5321 -5326 -7236
4279 -7236 -770 8104 7555 2466 -1531 2114 289 4563 7886 4111 3678 5417 5501 7155 410 -4563
4263 -4563 -4807 -2022 110 3519 3416 1800 4417 4450 -958 -2993 -1959 -1329 1711 1852 -3897 -10015
4247 -10015 -9523 -9812 -6982 -2196 -7461 -5934 -4226 -2030 808 -3813 1137 5213 -1383 -3409 241
4232 241 537 1118 4113 -2242 -7429 -8154 -8264 -7137 -2511 913 8781 4144 -614 -1293 4509 3870 -7403
4215 -7403 -10896 -5980 -2138 2510 7696 6148 6927 11422 14588 12065 4925 -1598 -7392 -12072 -10162
$$ packed form
4328g09k550O736k96j345k66N741R662Q90m997K30P68p11n87j932n815n245J577
4311A151K479j467m19k766j14J083J884j316j52M215j287l834l608O704O60m900
4295a687K190k374m150K175L907N647l359l359p16m158P034J777l911m337nj910
4279g236O466Q874n49n089l997L645j825M274L323l775m33J739Q4J654o745m973
4263d563k44K785K132L409j03j616K617L3n408k035J034O30L040J41n749o118
4247a0015M92k89K830M786n265J527J708K196K838m621M950M076o596k026L650
4232B41K96N81K995o355n187p25j10J127M626L424P868m637m758o79N802o39j1273
4215g403l493M916L842M648N186j548P79M495L166k523p140o523n794m680J910
$$ plain form
4200 -10162 -7250 -2954 -9770 -12179 -11501 -7220 857 9641 9287 11743 12411 13989 18480 18621 14902 10636
4184 10636 7464 9746 -1192 -6764 -11368 -9518 -8652 -9026 -12227 -5402 3938 4735 4182 7010 11897
4169 11897 12732 8514 3662 3598 3352 2993 7982 2483 -784 -5921 -4604 -4008 370 -807 -3851 6043
4153 6043 6816 3597 2988 -2234 -520 4411 5063 2721 -4483 -10053 -8849 -2275 360 -424 -4806 404
4137 404 2551 2508 450 1343 2378 419 -2724 1814 -7852 -13813 -6586 -6744 -4026 -3941 -4831 -11511 -14121
4120 -14121 -6357 -3106 2301 9021 9157 2893 1355 5665 4359 237 -3408 -7588 -5471 -4617 -7522
4105 -7522 -8733 -2629 11628 15423 10888 5225 3737 5845 3506 2856 -594 -4106 -3052 -222 3997
4090 3997 1229 424 1853 896 -4805 -8289 -9786 -9493 -5657 -6583 -3275 87 -1273 2931 7165 4408
$$ packed form
4200a0162K912M296o816k409O78M281Q077Q784l54K456O68J578M491J41l719m266
4184A0636l172K282j0938n572m604J850Q66l74l201O825R340P97n53K828M887
4169A1897Q35m218m852o4k46l59M989n499l267n137J317N96M378j177l044R894
4153F043P73l219o09n222J714M931O52k342p204n570J204O574K635p84m382N210
4137D04K147m3k058Q93J035j959l143M538r666n961P227j58K718Q5q90o680k610
4120a4121P764L251N407O720J36o264j538M310j306m122l645m180K117Q54k905
4105g522j211O104J4257L795m535n663j488K108k339o50l450l512J054K830M219
4090C997k768q05J429r57n701l484j497K93L836r26L308L362j360M204M234k757
$$ plain form
4074 4408 -1968 -1717 -3347 -8817 -9790 -10309 -11302 -9334 -9752 -11968 -7936 5484 9877 10228 8369 2542
4058 2542 3910 7331 -1388 -8165 -4847 -2260 -2088 -1492 -545 1753 6319 -4036 -5555 -5512 -5462 -5304 -8120
4041 -8120 -6142 -3811 -1345 798 3513 -1517 -871 2952 7375 5377 11546 5334 4957 795 -3950
4026 -3950 -8246 -12944 -15001 -11935 -6432 872 4502 -2351 -1846 6774 2180 -1927 -3418 -7336 -10596
4011 -10596 -13109 -18968 -12057 -10057 -7327 -8816 -7484 -3433 42 4 754 -3840 -10628 -14067 -6020
3996 -6020 -3505 196 4202 2918 -880 -4166 103 -3062 -5983 -4865 -1481 -220 -2831 -8118 -8884
3981 -8884 -9845 -4693 -7265 -12948 -17263 -16733 -15565 -3525 -265 -7653 -3169 885 6662 11573 8866
3966 8866 4286 3919 6325 6868 8801 5181 -590 -3699 -6854 -9158 -7508 -2924 -3427 -2355 -3155 -3893
$$ packed form
4074D408o376K51j630n470r73n19r93J968m18k216M032J3420M393L51j859n827
4058B542J368L421q719o777L318K587J72N96R47K298M566j0355j519M3N0J58k816
4041h120J978K331K466K143K715n030O46L823M423j998O169o212l77m162m745
4026c950m296m698k057L066N503P304L630o853N05Q620m594m107j491l918l260
4011a0596k513n859O911K000K730j489J332M051L475l8P50m594o788l439Q047
3996f020K515L701M006j284l798l286M269l165k921J118L384J261k611n287p66
3981h884r61N152k572n683m315N30J168J2040L260p388M484M054N777M911k707
3966H866m580l67K406N43J933l620n771l109l155k304J650M584n03J072q00p38
$$ plain form
3950 -3893 -5368 -3866 -490 -2311 -4715 -5197 -3703 -3008 1200 2967 4246 -4156 -4943 -7291 -4428 -1271
3934 -1271 -1563 -2996 -157 804 3142 -1242 -3016 -5139 -6288 -1432 2944 -1825 -4136 -500 6372
3919 6372 3797 2031 9217 3410 -9937 -11311 -17829 -11527 -4288 -4720 -9471 -2306 -346 -4178 -2026
3904 -2026 -1118 -7072 -9650 -15070 -19750 -12443 -2299 2937 7172 7020 8160 11321 17211 12559 3011
3889 3011 -3782 156 9372 4376 -4425 -9687 -3455 5360 5619 3034 -4069 -7608 -9064 -11012 -10016
3874 -10016 -12817 -19143 -17468 -14516 -2701 6076 3666 2622 7632 7369 -12 -2223 -1239 -8878 -3606
3859 -3606 2559 4314 -2600 -6363 -3074 -2731 -599 596 7144 2725 767 -1630 -1335 -3146 1447
3844 1447 8822 4058 -1506 -2044 -959 -2861 39 -381 279 -658 3131 -2512 503 4277 9628 7788
$$ packed form
3950c893j475J502L376j821k404m82J494O95M208J767J279q402p87k348K863L157
3934a271k92j433K839R61K338m384j774k123j149M856M376m769k311L636O872
3919F372k575j766P186n807j3347j374o518O302P239m32m751P165J960l832K152
3904b026R08n954k578n420m680P307J0144N236M235j52J140L161N890m652r548
3889C011o793L938R216m996q801n262O232Q815K59k585p103l539j456j948R96
3874a0016k801o326J675K952J1815Q777k410j044N010k63p381k211R84p639N272
3859c606O165J755o914l763L289L43K132J195O548m419j958k397K95j811M593
3844A447P375m764n564n38J085j902K900m20O60r37L789n643L015L774N351j840
$$ plain form
3828 7788 -577 -130 -1077 -139 3681 11772 14123 10630 9062 13088 4665 2914 -456 -1249 -6173 -8914
3812 -8914 -8733 -9220 -5678 1280 1997 3383 3438 556 4425 5112 1562 3655 8894 15671 10889 6153
3796 6153 5236 3699 2624 4721 -1682 2451 1705 -2611 -2075 -4092 -2160 1079 1352 563 2575 515
3780 515 -925 843 3179 3176 1290 963 -892 -3205 -261 1167 1186 -1370 2421 5624 864 2559 2826
3763 2826 -882 -3710 -3009 -1439 -365 -4768 -7232 -673 5685 6611 4429 7345 4974 7636 6145
3748 6145 3265 7686 9909 4114 -4398 1270 -259 -3871 -4847 -3325 -6 5115 10311 7883 -1940
3733 -1940 2927 637 870 2934 -2014 -4725 -4261 -5106 -3280 177 7808 7545 -3681 -5665 -726 974
3717 974 5187 -2226 -14673 -10791 -11 1298 2196 3102 4378 4688 6900 -626 -13493 -10855 -777
$$ packed form
3828G788q365M47r47R38L820Q091K351l493j568M026q423j751l370p93m924k741
3812h914J81m87L542O958P17J386N5k882L869O87l550K093N239O777m782m736
3796F153r17j537j075K097o403M133p46m316N36k017J932L239K73p89K012k060
3780E15j440J768K336lj886l27j855k313K944J428J9k556L791L203m760J695K67
3763B826l708k828P01J570J074m403k464O559O358R26k182K916k371K662j491
3748F145k880M421K223n795q512N668j529l612r76J522L319N121N196k428r823
3733a940M867k290K33K064m948k711M64q45J826L457P631k63j1226j984M939J700
3717I74M213p413j2447L882J0780J309Q98R06J276L10K212p526j2867K638J0078
$$ plain form
3702 -777 -926 -6282 -4943 -3535 -6329 -2887 490 1800 3388 7743 4727 -2592 -5078 -2611 3821
3687 3821 9498 5930 4656 2458 -2125 -3240 -512 -896 -7413 -4692 -7619 -8391 -5697 -6872 -7105 -13813
3671 -13813 -16246 -10196 -4831 -2789 -1213 -2181 3344 1831 -4396 -4642 -5072 -3362 208 6472 892
3656 892 -1668 3621 2841 -3684 -8885 -5282 401 853 -7096 -3994 -1002 -1508 -4492 -4410 -4850 -3702 -3108
3639 -3108 -6023 -7665 -3002 -2071 -4604 -11067 -10048 -6325 -5770 -14237 -17430 -12551 -8303 -11456 -14885
3624 -14885 -5669 -2938 587 3461 1778 -1051 -2254 -3939 2160 1782 3493 638 -4213 262 -1948
3609 -1948 -8822 -10874 -3499 3468 4689 5989 6476 7246 5568 6332 4918 11863 8274 495 4053 6342
3593 6342 3744 -584 -5164 -8279 -3994 3482 8979 11131 6670 687 -1194 -3364 -3050 -61 3517
$$ packed form
3702g77j49n356J339J408k794L442L377J310J588M355l016p319k486K467O432
3687C821N677l568j274k198m583j115K728l84o517K721k927p72K694j175k33o708
3671a3813k433O050N365K042J576r68N525j513o227k46m30J710L570O264n580
3656H92k560N289p80o525n201L603N683M52p949L102K992n06k984Q2m40J148N94
3639c108k915j642M663R31k533o463J019L723N55q467l193M879M248l153l429
3624a4885R216K731L525K874j683k829j203j685O099l78J711k855m851M475k210
3609a948o874k052P375O967J221J300M87P70j678P64j414O945l589p779L558K289
3593F342k598m328m580l115M285P476N497K152m461n983j881k170L14K989L578
$$ plain form
3578 3517 3236 1997 -4604 -4035 -5449 -2973 1102 445 -1846 -3384 -2536 2597 -407 -8066 -11633 -7701
3562 -7701 2715 2014 -3563 918 2813 503 1122 5712 7451 8002 786 -4059 -11302 -9241 -1460
$$ packed form
3578C517k81j239o601N69j414K476M075o57k291j538Q48N133l004p659l567L932
3562g701J0416p01n577M481J895k310O19M590J739N51p216m845p243K061P781
$$ [...]
##END NTUPLES=NMR SPECTRUM
##END=
