##TITLE=Analysis number 326087
Compound Code cc 56309
Book Reference 513/9/39
Project Code adrs
Chemist Name ronp
##JCAMPDX= 6.0         $$ Bruker NMR JCAMP-DX V2.0
##DATA TYPE= NMR SPECTRUM
##DATA CLASS= NTUPLES
##ORIGIN= Bruker BioSpin GmbH
##OWNER= nmr
$$ XWIN-NMR		Version 3.5
$$ Wed Jan 24 12:46:20 2007 GMT Standard Time (UT+0h)  MAYBRIDGE\nmr@NMR_250MHZ
##.OBSERVE FREQUENCY= 250.131544655141
##.OBSERVE NUCLEUS= ^1H
##.ACQUISITION MODE= SIMULTANEOUS (DQD)
##.ACQUISITION SCHEME= undefined
##.AVERAGES= 16
##.DIGITISER RES= 18
##SPECTROMETER/DATA SYSTEM= dpx250
##.PULSE SEQUENCE= zg30
##.SOLVENT NAME= CDCl3
##.SHIFT REFERENCE= (INTERNAL, CDCl3, 0, 16.522)
##AUDIT TRAIL= $$ (NUMBER, WHEN, WHO, WHERE, WHAT)
$$ ##TITLE= Audit trail, XWIN-NMR		Version 3.5
$$ ##JCAMPDX= 5.01
$$ ##ORIGIN= Bruker BioSpin GmbH
$$ ##OWNER= nmr
$$ C:\u/data/dgb/nmr/ADRS/1700/pdata/1/auditp.txt
$$ ##AUDIT TRAIL=  $$ (NUMBER, WHEN, WHO, WHERE, WHAT)
(   1,<2007-01-24 12:45:49.47 +000>,<MAYBRIDGE\nmr>,<NMR_250MHZ>,
      <created by zg, POWCHK disabled, PULCHK disabled
       configuration hash MD5:
       49 4B E0 1D 92 C2 6B 37 9F E6 65 BC 52 41 86 1D
       data hash MD5: 64K
       C6 93 A3 2D 9E 3D BF CE EE 78 1C 34 D9 E9 E8 C8>)
(   2,<2007-01-24 12:46:07.92 +000>,<MAYBRIDGE\nmr>,<NMR_250MHZ>,
      <Start of raw data processing
       ef LB = 0.3 FT_mod = 6 PKNL = 1 SI = 32K 
       data hash MD5: 32K
       FD D2 9B 52 DF B0 31 44 CD 41 8C A3 19 37 25 47>)
(   3,<2007-01-24 12:46:09.73 +000>,<MAYBRIDGE\nmr>,<NMR_250MHZ>,
      <apk 
       data hash MD5: 32K
       17 8A 84 6A 0B 6B EA E6 12 16 A4 02 4E F1 C3 D9>)
(   4,<2007-01-24 12:46:10.42 +000>,<MAYBRIDGE\nmr>,<NMR_250MHZ>,
      <abs ABSG = 5 
       data hash MD5: 32K
       69 15 9D DA 55 19 F4 BC 49 92 ED 47 F8 97 62 E3>)
$$ ##END=
$$ 
$$ hash MD5
$$ 9E 1D 3F A8 F5 32 79 94 6B 0C C7 57 18 AD 92 BB
##$RELAX= 
##$RELAX= 
##$RELAX= 
##$RELAX= 
##$RELAX= 
##$RELAX= 
##$RELAX= 
$$ Bruker specific parameters
$$ --------------------------
##$DU= <C:\u>
##$EXPNO= 1700
##$NAME= <ADRS>
##$PROCNO= 1
##$TYPE= <nmr>
##$USER= <dgb>
##$AMP= (0..31)
100 100 100 100 100 100 100 100 100 100 100 100 100 100 100 100 100 100 
100 100 100 100 100 100 100 100 100 100 100 100 100 100 
##$AQSEQ= 0
##$AQ_mod= 3
##$AUNM= <au_zg>
##$AUTOPOS= <21 >
##$BF1= 250.13
##$BF2= 250.13
##$BF3= 250.13
##$BF4= 250.13
##$BF5= 500.13
##$BF6= 500.13
##$BF7= 500.13
##$BF8= 500.13
##$BYTORDA= 1
##$CFDGTYP= 0
##$CFRGTYP= 5
##$CHEMSTR= <none>
##$CNST= (0..31)
1 1 145 1 1 1 1 1 1 1 1 1 1 1 1 1 1 1 1 1 1 1 1 1 1 1 1 1 1 1 1 1 
##$CPDPRG= <>
##$CPDPRG1= <>
##$CPDPRG2= <>
##$CPDPRG3= <>
##$CPDPRG4= <mlev>
##$CPDPRG5= <mlev>
##$CPDPRG6= <mlev>
##$CPDPRG7= <mlev>
##$CPDPRG8= <mlev>
##$CPDPRGB= <>
##$CPDPRGT= <>
##$D= (0..31)
0 1 0 0 0 0 0 0 0 0.06 0 0 0 0 0 0 0.0002 0 0 0 0 0 0 0 0 0 0 0 0 0 0 
0 
##$DATE= 1169642746
##$DBL= (0..7)
120 120 120 120 120 120 120 120 
##$DBP= (0..7)
150 150 150 150 150 150 150 150 
##$DBP07= 0
##$DBPNAM0= <>
##$DBPNAM1= <>
$$ [...]
##$SUBNAM7= <"">
##$SUBNAM8= <"">
##$SUBNAM9= <"">
##$SW= 20.6930455092707
##$SWIBOX= (0..15)
0 0 3 0 0 0 0 0 0 0 0 0 0 0 0 0 
##$SW_h= 5175.983436853
##$TD= 65536
##$TD0= 1
##$TE= 294.16
##$TE2= 300
##$TE3= 300
##$TEG= 300
##$TL= (0..7)
0 120 120 120 120 120 120 120 
##$TP= (0..7)
150 150 150 150 150 150 150 150 
##$TP07= 0
##$TPNAME0= <>
##$TPNAME1= <>
##$TPNAME2= <>
##$TPNAME3= <>
##$TPNAME4= <>
##$TPNAME5= <>
##$TPNAME6= <>
##$TPNAME7= <>
##$TPOAL= (0..7)
0.5 0.5 0.5 0.5 0.5 0.5 0.5 0.5 
##$TPOFFS= (0..7)
0 0 0 0 0 0 0 0 
##$TUNHIN= 0
##$TUNHOUT= 0
##$TUNXOUT= 0
##$USERA1= <user>
##$USERA2= <user>
##$USERA3= <user>
##$USERA4= <user>
##$USERA5= <user>
##$V9= 5
##$VALIST= <valist>
##$VCLIST= <CCCCCCCCCCCCCCC>
##$VD= 0
##$VDLIST= <DDDDDDDDDDDDDDD>
##$VPLIST= <PPPPPPPPPPPPPPP>
##$VTLIST= <TTTTTTTTTTTTTTT>
##$WBST= 1024
##$WBSW= 4
##$XGAIN= (0..3)
0 0 0 0 
##$XL= 0
##$YL= 0
##$YMAX_a= 407760
##$YMIN_a= -537617
##$ZGOPTNS= <>
##$ZL1= 120
##$ZL2= 120
##$ZL3= 120
##$ZL4= 120
##$ABSF1= 16.522
##$ABSF2= -4.171173
##$ABSG= 5
##$ABSL= 3
##$ALPHA= 0
##$AQORDER= 0
##$ASSFAC= 0
##$ASSFACI= 0
##$ASSFACX= 0
##$ASSWID= 0
##$AUNMP= <proc_1d>
##$AZFE= 0.1
##$AZFW= 0.1
##$BCFW= 0
##$BC_mod= 0
##$BYTORDP= 0
##$COROFFS= 0
##$CY= 12.5
##$DATMOD= 1
##$DC= 0
##$DFILT= <>
##$DTYPP= 0
##$F1P= 14.0000005364418
##$F2P= -0.99999901652339
##$FCOR= 0.5
##$FTSIZE= 32768
##$FT_mod= 6
##$GAMMA= 0
##$GB= 0
##$INTBC= 1
##$INTSCL= 1
##$ISEN= 128
##$LB= 0.3
##$LEV0= 0
##$LPBIN= 0
##$MAXI= 10000
##$MC2= 0
##$MEAN= 0
##$ME_mod= 0
##$MI= 0
##$NCOEF= 0
##$NC_proc= -4
##$NLEV= 6
##$NOISF1= 0
##$NOISF2= 0
##$NSP= 0
##$NTH_PI= 0
##$NZP= 0
##$OFFSET= 16.522
##$PC= 1
##$PHC0= 230.6331
##$PHC1= 5.452491
##$PH_mod= 1
##$PKNL= yes
##$PPARMOD= 0
##$PSCAL= 4
##$PSIGN= 0
##$REVERSE= no
##$SF= 250.13
##$SI= 32768
##$SIGF1= 0
##$SIGF2= 0
##$SINO= 400
##$SIOLD= 32768
##$SREGLST= <1H.CDCl3>
##$SSB= 0
##$STSI= 32768
##$STSR= 0
##$SW_p= 5175.98343685301
##$SYMM= 0
##$S_DEV= 0
##$TDeff= 65536
##$TDoff= 0
##$TI= <Analysis number 999999
Compound Code 99
Book Reference 9
Project Code 9>
##$TILT= no
##$TM1= 0
##$TM2= 0
##$TOPLEV= 0
##$USERP1= <user>
##$USERP2= <user>
##$USERP3= <user>
##$USERP4= <user>
##$USERP5= <user>
##$WDW= 1
##$XDIM= 32768
##$YMAX_p= 453696622
##$YMIN_p= -155765
$$ End of Bruker specific parameters
$$ ---------------------------------
##NTUPLES= NMR SPECTRUM
##VAR_NAME=  FREQUENCY,     SPECTRUM/REAL,   SPECTRUM/IMAG
##SYMBOL=    X,             R,               I
##VAR_TYPE=  INDEPENDENT,   DEPENDENT,       DEPENDENT
##VAR_FORM=  AFFN,          ASDF,            ASDF
##VAR_DIM=   32768,         32768,           32768
##UNITS=     HZ,            ARBITRARY UNITS, ARBITRARY UNITS
##FACTOR=    0.157963299565203, 1,           1
##FIRST=     4132.6476996994, 0,             0
##LAST=      -1043.33573715361, 0,           0
##MIN=       -1043.33573715361, -155765,     0
##MAX=       4132.6476996994, 453696622,     0
$$ Real data points
##PAGE= N=1
##DATA TABLE= (X++(R..R)), XYDATA
$$ [...]
24174C8907o9981n5570J4975L2194L810K1777M2039J0249j3283k6123k8242j7814
$$ 38907 -31074 -86644 -71669 -39475 -35665 -13888 28151 38400 25117 -1006 -29248 -47062
24162d7062J7601L316m606k958L0676k54k7115k5827P807M614P419j8534K4064
$$ -47062 -29461 -26145 -30751 -33709 -3033 -3287 -30402 -56229 -48422 -43808 -36389 -54923 -30859
24149c0859P999j2713Q95K6401k3405P229J0261L3418O2051J0702l0805n462j7277
$$ -30859 -22860 -35573 -34678 -8277 -31682 -24453 -14192 19226 81277 91979 61174 55712 38435
24136C8435q058k1065o2q576j3059k0816J1063N2049k0600m7789j7428L9140J5229
$$ 38435 30377 9312 9250 674 -12385 -33201 -22138 29911 9311 -38478 -55906 -16766 -1537
24123a537j8942j3024l6861K7328J3213J9970J5773J950k4888l9152j6072M9625
$$ -1537 -20479 -33503 -70364 -43036 -29823 -9853 5920 7870 -17018 -56170 -72242 -22617
24111b2617M4612j8553Q089j8740Q632J8019K654m2156k5482K3600r231r16J5095
$$ -22617 21995 3442 11531 -7209 1423 19442 22096 -20060 -45542 -21942 -31173 -32089 -16994
24098a6994q079j047K9015M682L432K5587j2803M450K118l8467l0618L2159J6892
$$ -16994 -25073 -26120 2895 7577 11009 36596 23793 28243 30361 -8106 -38724 -6565 10327
24085A0327k5598l3412l999Q001K2051J4143K4158J2975j7726j2058j234L5731
$$ 10327 -15271 -48683 -52682 -44681 -22630 -8487 15671 28646 10920 -1138 -2372 33359
24073C3359j443k2525K044J4022j360j9150M101L0844N192n6401n2421K905K7526
$$ 33359 31916 9391 11435 25457 24097 4947 9048 39892 45084 -11317 -63738 -60833 -33307
24060c3307N925j4460Q718K5523J4643m596O306n4541k3110J4088J4730L1318
$$ -33307 -27382 -41842 -33124 -7601 7042 2446 8752 -45789 -68899 -54811 -40081 -8763
24048h763L6063J478J7352k3362l5229M681L5524M202j5768k9565q442J0358K0127
$$ -8763 27300 28778 46130 22768 -12461 -7780 27744 31946 16178 -13387 -21829 -11471 8656
24035H656j9144j77r326K8433R427j7097j2323j2037K1849k579j7536k8599j645
$$ 8656 -10488 -10665 -19991 8442 17869 772 -11551 -23588 -1739 -4318 -21854 -50453 -52098
24022e2098l61L7495L660k3642J1999M960N403M199m131Q282K5797P921o470J803
$$ -52098 -52459 -14964 -11304 -34946 -22947 -17987 -12584 -8385 -12516 -4234 21563 29484 23014 24817
24008B4817k8742l5045M611L7803L177l1107l129K1324j0275M079k4431l7524
$$ 24817 -3925 -38970 -34359 3444 6621 -24486 -27615 -6291 -16566 -12487 -36918 -74442
23996g4442k6901q996M0909J4077J6532Q928j247l548K1397Q614K1198k6875L2383
$$ -74442 -101343 -110339 -69430 -55353 -38821 -29893 -31140 -34688 -13291 -4677 16521 -10354 22029
23983B2029J3593m3848k0216P394K1567k2347p410j5021Q945J5226J8770L3909
$$ 22029 35622 -8226 -28442 -21048 519 -21828 -29238 -44259 -35314 -20088 -1318 32591
23971C2591r210k2733k605L0110K3406j2416k8276J2555K8180L1279k0175k2901
$$ 32591 23381 648 -1957 28153 51559 39143 10867 23422 51602 82881 62706 39805
23959C9805k447k1217N648l592K3630P873j6563j0487O017k8015j1719K090n851
$$ 39805 37358 16141 21789 18197 41827 49700 33137 22650 28667 652 -11067 -8977 -14828
23946a4828j6691L2721J3415l708j2017k2429o258P034Q08L5339J0269k2841l2353
$$ -14828 -31519 1202 14617 10909 -1108 -23537 -29795 -22761 -21953 13386 23655 814 -31539
23933c1539j1598K6334j988J7645R705p621l4196m0786j0155M0906p93j7293j5781
$$ -31539 -43137 -16803 -18791 -1146 8559 938 -33258 -74044 -84199 -43293 -44086 -61379 -77160
23920g7160J975k4366O6194K7239k373k9759J183K2888j0648m36K7987L9748l2222
$$ -77160 -75185 -99551 -33357 -6118 -8491 -38250 -37067 -14179 -24827 -25263 2724 42472 10250
23907A0250j8166R498k5831J971K8172J3145J0546N562l2622J0675J6456R59J9736
$$ 10250 -7916 1582 -24249 -22278 5894 19039 29585 35147 2525 13200 29656 30615 50351
23894E0351j3807k9031K3198O754j5213j3747l9153N382L852J4307j6832j1887
$$ 50351 36544 7513 30711 37465 22252 8505 -30648 -25266 -21414 -7107 -23939 -35826
23882c5826m385M874J4712N577K3574L6475J0057k2610k4431j8411K543L9456
$$ -35826 -40211 -35337 -20625 -15048 8526 45001 55058 32448 8017 -10394 -7851 31605
23870C1605K2073n821k8771l7513k0542J2224K7667M341o475J013j0192Q418J1613
$$ 31605 53678 47857 19086 -18427 -38969 -26745 922 5263 -1212 -199 -10391 -1973 9640
23857I640K8453M673j2290j861K680K2093J6839m1395p2624n24K0791K1062J3886
$$ 9640 38093 42766 30476 28615 31295 53388 70227 28832 -43792 -44316 -23525 -2463 11423
23844A1423L1474J9790m6585J5454k0580j7903M741M928J2130j5165k2937R805
$$ 11423 42897 62687 16102 31556 10976 -6927 -2186 2742 14872 -293 -23230 -13425
23832a3425M2021M4388K7106o4961n2485k4623K8971J7309j3288K398M4699J5120
$$ -13425 28596 72984 100090 35129 -17356 -41979 -13008 4301 -8987 -6589 38110 53230
23820E3230K2842M708m8626l4422j5925J0518k9661k7537J3108K7736J5040J8507
$$ 53230 76072 80780 32154 -2268 -18193 -7675 -37336 -64873 -51765 -24029 -8989 9518
23808I518M889r838r248J8877L2926k1922q330l8282j4475k309Q05L8042N7988
$$ 9518 14407 4569 -4679 14198 47124 25202 16872 -21410 -35885 -38194 -37389 653 58641
23795E8641l3591l9373J1347J2853O103m2268j3140q983K2628J4221K4041K4699
$$ 58641 25050 -14323 -2976 9877 15980 -26288 -39428 -48411 -25783 -11562 12479 37178
23783C7178n582k4151k0650j8186J3888J7606M0501J397p056k3978K0873K6110
$$ 37178 31596 7445 -13205 -31391 -17503 103 40604 42001 34945 10967 31840 57950
23771E7950j3129k6211k0206J9172j0984k3895K9183M7892m0795m8109j2080K0649
$$ 57950 44821 18610 -1596 17576 6592 -17303 11880 59772 18977 -29132 -41212 -20563
23759b0563M0589J5882J0493l999m9884J3656k1613j6269K481K232K1652n122
$$ -20563 20026 35908 46401 42402 -7482 6174 -15439 -31708 -29227 -26995 -5343 -10465
23747a0465k0365j2584J24j7449J6473K4793K617o512n879K648Q978J0432k2466
$$ -10465 -30830 -43414 -43290 -60739 -44266 -19473 -16856 -23368 -29247 -26599 -17621 -7189 -29655
23734b9655j2922M3937J5650J900K3458j7193M4118j8158j2404k3235p284L8093
$$ -29655 -42577 1360 17010 18910 42368 25175 69293 51135 38731 15496 8212 46305
23722D6305L2545k276k466N755k3545m9417n839L9590M962k7321k6249l8786q978
$$ 46305 78850 76574 74108 79863 56318 6901 1062 40652 45614 18293 -7956 -46742 -55720
23709e5720M4905K5856k5473O808K8251M051N191P882j155n12R679M8137j837
$$ -55720 -10815 15041 -10432 -3624 24627 28678 33869 41751 40596 40084 49763 97900 96063
23696I6063j1917l2064k9148O466p88J3820K0429j2258l5115j5240k6704J0638
$$ 96063 84146 52082 22934 29400 28612 42432 62861 50603 15488 248 -26456 -15818
23684a5818J0472K8747J0561j6232p287o143J6730l3765m2460n908N921l5716
$$ -15818 -5346 23401 33962 17730 10443 4300 21030 -12735 -55195 -61103 -55182 -90898
23672i0898L956J3171J0600K2805L6002j0966r876n692k2922L0412L073r080j2035
$$ -90898 -86942 -73771 -63171 -40366 -4364 -15330 -25206 -30898 -53820 -23408 -20335 -29415 -41450
23659d1450j0843j8779j5126M8374N5268k20j3367p531l9914k8453Q031K5474
$$ -41450 -52293 -71072 -86198 -37824 17444 17224 3857 -3674 -43588 -72041 -64010 -38536
23647c8536q298J4119J9294m9593k6346K3828J8717O8322K7781n130o541k119
$$ -38536 -46834 -32715 -13421 -63014 -89360 -65532 -46815 21507 49288 44158 37617 35498
23635C5498O167k9941j3194L339o403l7487J4951l6800l3450K4522O1177J9924
$$ 35498 41665 11724 -1470 1869 -4534 -42021 -27070 -63870 -97320 -72798 -11621 8303
23623H303j5323J0630n233k0119j3874j1438J7266p114Q627K3517K4006j2870
$$ 8303 -7020 3610 -1623 -21742 -35616 -47054 -29788 -36902 -28275 -4758 19248 6378
23611F378J6780n797m2497O219j0224m1201J3077O1088j4923m0994P214P394N3814
$$ 6378 23158 17361 -25136 -18917 -29141 -70342 -57265 3823 -11100 -52094 -44880 -37486 16328
23598A6328J7878o4341n4847J2605M8908K1366M463k9893k2710P918J5801k125
$$ 16328 34206 -30135 -84982 -72377 -23469 -2103 2360 -27533 -50243 -42325 -26524 -28649
23586b8649M917j4544K4010j048j3750j1393k1110P260K227R011k2627j4784K2655
$$ -28649 -23732 -38276 -14266 -15314 -29064 -40457 -61567 -54307 -52080 -43069 -65696 -80480 -57825
23573e7825K7650k1886q84K8677L5616J8701k31J8820J3120n37j291j6534L444
$$ -57825 -30175 -52061 -52945 -24268 11348 30049 29818 48638 61758 61221 59930 43396 46840
23560D6840M827j6749k6206m7764j5365K3097L3507K0528m6366l2285J337O410
$$ 46840 51667 34918 8712 -39052 -54417 -31320 2187 22715 -23651 -55936 -54599 -48189
23548d8189P7168P6769j9919p3713m6896k0036M464j8142Q055K7387n507L554
$$ -48189 28979 105748 85829 12116 -34780 -54816 -50352 -68494 -60439 -33052 -38559 -35005
23536c5005k4837j0396M2403j610K1637K0479J2363l5389k1690k4907j4584K9695
$$ -35005 -59842 -70238 -27835 -29445 -7808 12671 25034 -10355 -32045 -56952 -71536 -41841
23524d1841L2962K344J2j1476l2025o296L1094M3445J3667l5380j126j0337j343
$$ -41841 -8879 -6535 -6523 -17999 -50024 -56320 -25226 18219 31886 -3494 -4620 -14957 -16300
23511a6300J1117M686j7664l3386k3964J6587L6097K9917J1320l7933j0054l20
$$ -16300 -5183 -497 -18161 -51547 -75511 -58924 -22827 7090 18410 -19523 -29577 -29897
23499b9897J8206n614j4975J8613K1693K278J8467K6531j3506p852j4589j7379
$$ -29897 -11691 -17305 -32280 -13667 8026 10304 28771 55302 41796 33944 19355 1976
23487A976k852O992K7631J3657M7538J4889n4775n0314k8259k6179J0133k05k3001
$$ 1976 -876 6116 33747 47404 94942 109831 55056 4742 -23517 -49696 -39563 -39768 -62769
23474f2769K1554k907l3255J9719M6144k888j2301m7092M217M8854K0402Q391
$$ -62769 -41215 -44122 -77377 -57658 -11514 -14402 -26703 -73795 -69578 -20724 -322 8069
23462H069K844J6153l8757j5110K6265q47J6131k3905J77K6492k8012m996l3807
$$ 8069 10913 27066 -11691 -26801 -536 -1383 14748 -9157 -8980 17512 -10500 -15496 -49303
23449d9303k0311J4720M3012J7995Q519k0873l84m1262r885j0259K4617J5735
$$ -49303 -69614 -54894 -11882 6113 14632 -6241 -6625 -47887 -57772 -68031 -43414 -27679
23437b7679P664J5620K8277k4803K414j9782l4463L7445K1848n72O469K1378J660
$$ -27679 -20015 -4395 23882 -921 1493 -18289 -52752 -15307 6541 5969 12438 33816 35476
23424C5476J758j7882M666J2846m453n7642l6362L2903J4921l992M513M7385l8054
$$ 35476 37234 19352 24018 36864 32411 -25231 -61593 -28690 -13769 -17761 -13248 34137 -3917
23411c917n5784j9104K7372K1748J3027k0505J2521J137k4939m571R197j5608
$$ -3917 -59701 -78805 -51433 -29685 -16658 -37163 -24642 -23505 -48444 -53015 -43818 -59426
23399e9426M0363m406j1682M7559K745j0691k7704l5928K991j2317j1026K6899
$$ -59426 -19063 -23469 -35151 12408 15153 4462 -23242 -59170 -56179 -68496 -79522 -52623
23387e2623N969J3667l9289o030J187P435N724N786L1197K0253j1852j7428P088
$$ -52623 -46654 -32987 -72276 -78306 -77119 -69684 -63960 -58174 -26977 -6724 -18576 -36004 -28916
23374b8916M3478m1377l3504j3831L787k0869J253M7512L2534J251j142j3185
$$ -28916 14562 -26815 -60319 -74150 -70363 -91232 -89979 -42467 -9933 -8682 -9824 -23009
23362b3009J7999K5854J8838N369j6175l8056j7691J7598j9777p920L5804l4064
$$ -23009 -5010 20844 39682 45051 28876 -9180 -26871 -9273 -29050 -36970 -1166 -35230
23350c5230N000L0334N7690K6823k2392l6728l8703L302P133j410r200n3168K6848
$$ -35230 -30230 104 57794 84617 62225 25497 -13206 -9904 -2771 -4181 -13381 -66549 -39701
23337c9701q379k883M1139N1063j184m997k82j8419R13K151j1786J5137J1823
$$ -39701 -48080 -50963 -9824 41239 40055 35058 34776 16357 17270 19421 7635 22772 34595
23324C4595K039l1592k5397K1133J2599j830J136K2172K8398K1549j5472l2599
$$ 34595 36634 5042 -20355 778 13377 11547 12683 34855 63253 84802 69330 36731
23312C6731k8451j4741k6359j1324K2781l347k5985Q229P647J9960J2462k4344
$$ 36731 8280 -6461 -32820 -44144 -21363 -24710 -50695 -42466 -34819 -14859 -2397 -26741
23300b6741J293L9263L8259n3322n1664M792J4775j2131J9807K9026m1288l3832
$$ -26741 -25448 13815 52074 -1248 -52912 -48120 -33345 -45476 -25669 3357 -37931 -71763
23288g1763L3166Q098k685O371j1539O356J6224J6835L207j2564j5895k0383k1847
$$ -71763 -38597 -30499 -33184 -26813 -38352 -31996 -15772 1063 4270 -8294 -24189 -44572 -66419
23275f6419J4970K6934o608M658Q667L6833k2212j6453j5810j9470L6324J9791
$$ -66419 -51449 -24515 -31123 -26465 -17798 19035 -3177 -19630 -35440 -54910 -18586 1205
23263A205j044K4152l3734k7779l0341K5055K844j1409M320K4701K2842K3292
$$ 1205 161 24313 -9421 -37200 -67541 -42486 -39642 -51051 -46731 -22030 812 24104
23251B4104j8516k3093J4129m998m0740j1260J2253K2990J2142j8335r403l714
$$ 24104 5588 -17505 -3376 -8374 -49114 -60374 -48121 -25131 -12989 -31324 -40727 -44441
23239d4441k6550j325N3893N6026k34k8371j8784l1934J4301j4594J976o77j1742
$$ -44441 -70991 -72316 -18423 37603 37369 8998 -9786 -41720 -27419 -42013 -40037 -40714 -52456
23226e2456R179n638N1158J3798l1218l115j90K0137j0338K1353M38m28J5697
$$ -52456 -43277 -48915 2243 16041 -15177 -18292 -18482 1655 -8683 12670 13108 12680 28377
23213B8377p618l8727j6976l574K2576K1371J4763j7960o560L467J5306j974r167
$$ 28377 20759 -17968 -34944 -38518 -15942 5429 20192 2232 -4328 -861 14445 12471 3304
23200C304L240J6506j8644K9449r362m34q808m626l733n2302j9352J0434J1823
$$ 3304 6544 23050 4406 33855 24493 24059 15251 10625 6892 -45410 -64762 -54328 -42505
23187d2505J4981l597K21K7446M9906k2256k2374J2382K7415J5006n577o750N1190
$$ -42505 -27524 -31121 -30900 -3454 46452 24196 1822 14204 41619 56625 51048 44298 95488
23174I5488M0451o929m0216m1258n3675m24J2191L5066N971k2747l3933k5068
$$ 95488 135939 129010 88794 47536 -6139 -6563 5628 40694 46665 23918 -10015 -35083
23162c5083K1392R709J1287K0570J8034k23L307m1401j3848j807o53j9957p834
$$ -35083 -13691 -3982 7305 27875 45909 45686 48993 7592 -6256 -8063 -8716 -28673 -36507
23149c6507K2938j4010n250P480j6720R841N1235J1645Q091k1416K0882K102j7563
$$ -36507 -13569 -27579 -32829 -25349 -42069 -32228 19007 30652 38743 17327 38209 40311 22748
23136B2748k3398J5471k264k3107J0471j9193K1068J2197p497l4233Q089j594
$$ 22748 -650 14821 12557 -10550 -79 -19272 1796 13993 6496 -27737 -19648 -21242
23124b1242M123k0350k6624J5088L9785L3167J1363j1118k0644J2917J1113o167
$$ -21242 -17119 -37469 -64093 -49005 -9220 23947 35310 24192 3548 16465 27578 21411
23112B1411L4099J7632p829j344k9588j2497q970M018l142j0217o312k9671K030
$$ 21411 55510 73142 65313 63969 34381 21884 12914 16932 13790 3573 -2739 -32410 -30380
23099c0380J3898n199j1616K3425L0423M74J6309L9711J5461K260l9982o021k6215
$$ -30380 -16482 -21681 -33297 -9872 20551 21025 37334 77045 92506 94766 54784 48763 22548
23086B2548m2049j6340J7322M387J3038J6786N269j3629Q876j0370n2419K452
$$ 22548 -19501 -35841 -18519 -14132 -1094 15692 20961 7332 16208 5838 -46581 -44129
23074d4129L0233O260j3816j1025j0932o032q865O0448P299j4934k6881r327K6091
$$ -44129 -13896 -7636 -21452 -32477 -43409 -49441 -58306 2142 9441 -5493 -32374 -41701 -15610
23061a5610O5847J5576J3430K8129m4797l3290J8034K017m8130k2268K7571J0525
$$ -15610 50237 65813 79243 107372 62575 29285 47319 49336 1206 -21062 6509 17034
23049A7034J5M356J7179q487O096j6051k1407j5292O335L6950M105K006l685k9365
$$ 17034 17049 21405 38584 30097 36193 20142 -1265 -16557 -10222 26728 30833 32839 29154 -211
23035b11l9871j681K5656j6402L6907Q369K452k0627q818j0652J5894K399J9583
$$ -211 -40082 -41763 -16107 -32509 4398 12767 15219 -5408 -14226 -24878 -8984 -6585 12998
23022A2998m07J2072j5824l8219k8223O661K9817L857k504K9510j91k9432o279
$$ 12998 12591 24663 8839 -29380 -57603 -50942 -21125 -17268 -19772 9738 9547 -19885 -26164
23009b6164O761J1955P133q070m2786J5218K0548M7854K8652j4268n9137j1626
$$ -26164 -19403 -7448 -315 -8385 -51171 -35953 -15405 32449 61101 46833 -12304 -23930
22997b3930J8410k0543J9666O429l7880N1941K532k0961K332Q778m847L1731J7142
$$ -23930 -5520 -26063 -6397 32 -37848 14093 16625 -4336 -2004 6774 1927 33658 50800
22984E0800j8298l7691N143L266M448r819l7666P39L1286o928j0558L4165J3506
$$ 50800 32502 -5189 -46 3220 7668 -2151 -39817 -39078 -7792 -14720 -25278 8887 22393
22971B2393k4683k6126R272j0899M888K3043q426j846o73j4732q37j3712k0249
$$ 22393 -2290 -28416 -19144 -30043 -25155 -2112 -10538 -12384 -13057 -27789 -28626 -42338 -62587
22958f2587M4439L196m0142j163N944m662O2384J4524o939M371o652j2906M1952
$$ -62587 -18148 -14952 -55094 -56257 -50313 -54975 7409 21933 14994 19365 12713 -193 41759
22945D1759K229j9272J3460q307l0862l358m995m312N1902K9209o7876m4071j6093
$$ 41759 43988 24716 38176 29869 -993 -4351 -9346 -13658 38244 67453 -423 -44494 -60587
22932f0587N397L5693K0624Q848R152K4914j6372m9799n687J7008K6677k4126
$$ -60587 -55190 -19497 1127 9975 19127 44041 27669 -22130 -27817 -10809 15868 -8258
22920h258j9629j1479P86J1463p801k2881j1310R930L1119j7881J164p958l1555
$$ -8258 -27887 -39366 -38580 -27117 -34918 -57799 -69109 -59179 -28060 -45941 -44777 -52735 -84290
22907h4290J4505L4273j098l5220L17J4931J1149N4254L7305j3330M188j2934
$$ -84290 -69785 -35512 -36610 -71830 -71513 -56582 -45433 8821 46126 32796 36984 24050
22895B4050j2759m901N575j868j697l0880L1808j1086j3319j3311j635j0523r163
$$ 24050 11291 6390 11965 10097 8400 -22480 9328 -1758 -15077 -28388 -30023 -40546 -49709
22882d9709K2815L8821J4654k1619J357N214k0384J693m5250n40K0988L6881j976
$$ -49709 -26894 11927 26581 4962 6319 11533 -8851 -7158 -52408 -52948 -31960 4921 2945
22869B945m2509l1739J0566K2448N740q266J5802j4896j9687k936M935K4418N7795
$$ 2945 -39564 -71303 -60737 -38289 -32549 -40815 -25013 -39909 -59596 -62532 -57597 -33179 24616
22856B4616p339M42K664j3744M422P326j3430l2850Q822K5051K693j1902K1722
$$ 24616 17277 17719 20383 6639 11061 18387 4957 -27893 -19071 5980 8673 -3229 18493
22843A8493K408K9913M1917n637k7933j7303k9771m5018j6622J2985l5389l0481
$$ 18493 20901 50814 92731 87094 59161 41858 12087 -32931 -49553 -36568 -71957 -102438
22831a02438M632O7694L8762l652k6276l3911J7611j0324K7245K3396p690q031
$$ -102438 -97806 -30112 8650 4998 -21278 -55189 -37578 -47902 -20657 2739 -4951 -12982
22819a2982Q289J1R133n357j1424Q400m2139l6826j8432L0987K3223j025j828
$$ -12982 -4693 -4682 4451 -906 -12330 -3930 -46069 -82895 -101327 -70340 -47117 -48142 -49970
22806d9970q966K2835R886j5679K3115L5426r598q531l0701N495n638p758k7j412
$$ -49970 -58936 -36101 -26215 -41894 -18779 16647 7049 -1482 -32183 -26688 -32326 -40084 -40111 -41523
22792d1523J828K6476K9453k1804q470o05l210K2500J8872r878n279O353N1370
$$ -41523 -39695 -13219 16234 -5570 -14040 -14645 -17855 4645 23517 13639 8360 14713 66083
22779F6083k8245j1837r132k6835k1962Q660K2913R01J1983J7786j1597j7258
$$ 66083 37838 26001 16869 -9966 -31928 -23268 -355 546 12529 30315 18718 1460
22767A460m922p470J093M3948j9681l2900K0655J1948J1093Q051J7932l811K4152
$$ 1460 -3462 -10932 -9839 34109 14428 -18472 2183 14131 25224 33275 51207 47396 71548
22754G1548n6921l4787k8321m3209n283L9188r39j3199K7842q868k2916l630o68
$$ 71548 14627 -20160 -48481 -91690 -96973 -57785 -58724 -71923 -44081 -52949 -75865 -79495 -80163
22741h0163J8770R743L4108K4288M886q205j422Q536p143K2091L690j7681k3174
$$ -80163 -61393 -51650 -17542 6746 11632 3427 2005 10541 3398 25489 29179 11498 -11676
22728a1676L2636M653k1510o943k8749l4913L0689K6933L6303K1958m4501n6068
$$ -11676 20960 25613 4103 -2840 -31589 -66502 -35813 -8880 27423 49381 4880 -51188
22716e1188J9471J5540q118P118N219j5639J8800P29j717j1920Q202j2465J305
$$ -51188 -31717 -16177 -24295 -17177 -11958 -27597 -8797 -8068 -9785 -21705 -13503 -25968 -24663
22703b4663J0496r157k2890J2446M997r142j4293J6033N368l7847m778j1055J8187
$$ -24663 -14167 -23324 -46214 -33768 -28771 -37913 -52206 -36173 -30805 -68652 -73430 -84485 -66298
22690f6298L1349J3164J1416K4724j7412m8014r326N9694r358l0175r147K8496
$$ -66298 -34949 -21785 -10369 14355 -3057 -51071 -60397 -703 -10061 -40236 -49383 -20887
22678b0887J6173J1863q293K8843L2429k3348l4243k2649j0229j9832j4858k6648
$$ -20887 -4714 7149 -1144 27699 60128 36780 2537 -20112 -30341 -50173 -65031 -91679
22666i1679r075L1402K2568j3824J4511L5249J9758k745J1730j8836K1893L4777
$$ -91679 -100754 -69352 -46784 -60608 -46097 -10848 8910 6165 17895 -941 20952 55729
22654E5729M403n1351k3939J5648K7394k4064j3678J3339Q727o183J5221L8479
$$ 55729 60132 8781 -15158 490 27884 3820 -9858 3481 12208 6025 21246 59725
22642E9725K8268j4106k3269j0167k374R105l2695j5144n882r906K8965o830K426
$$ 59725 87993 73887 50618 40451 38077 47182 14487 -657 -6539 -16445 12520 5690 8116
22629H116l1461k0041K4757j3048l3094j3067J4883J0579K5759k2891m28L3385
$$ 8116 -23345 -43386 -18629 -31677 -64771 -77838 -62955 -52376 -26617 -49508 -49936 -16551
22617a6551K5172J0727r34L6297R140n2896k1850m617m972k1218l4335k4691j491
$$ -16551 8621 19348 18414 54711 63851 10955 -10895 -15512 -20484 -41702 -76037 -100728 -102219
22604a02219K8526L2981J9207K0428J5205K1536L2838J0940j0314m1382l4065
$$ -102219 -73693 -40712 -21505 -1077 14128 35664 68502 79442 69128 27746 -6319
22593f319j8124L1865J8741k5503j6861k732K7648J1861j0910k1815j4805l1787
$$ -6319 -24443 7422 26163 660 -16201 -18933 8715 20576 9666 -12149 -26954 -58741
22581e8741k2023J5369j6465P593O2053K9809k6694O131j5918k251P802Q565k5169
$$ -58741 -80764 -65395 -81860 -74267 -12214 17595 -9099 -2968 -18886 -21137 -13335 -4770 -29939
22568b9939k2202J3360M0736r183l1378n0129J8450K6217j840N392J5446k5905
$$ -29939 -52141 -38781 1955 -7228 -38606 -88735 -70285 -44068 -45908 -40516 -25070 -50975
22556e0975J5968N792L9006K4912m731L8908n178l0758J1471J081k5822l534O1328
$$ -50975 -35007 -29215 9791 34703 29972 68880 63702 32944 44415 45496 19674 16140 77468
22543G7468q985j4526l7382j1083K8985o025l7035k73J338n37K2228j348L5003
$$ 77468 68483 53957 16575 5492 34477 28452 -8583 -8856 -7518 -8055 14173 12825 47828
22530D7828j441k7739j0522j4691J0782J166j6243K9484L5228j9553l5539j9189
$$ 47828 46387 18648 8126 -6565 4217 5383 -10860 18624 53852 34299 -1240 -20429
22518b0429m2667O708L0762M9998j3583p936J4782l2907j3877k0718j6289K6181
$$ -20429 -63096 -56388 -25626 24372 10789 2853 17635 -15272 -29149 -49867 -66156 -39975
22506c9975r393R235J9592P096l4120j196Q476k7467l628p174J6764K8642N233
$$ -39975 -49368 -40133 -20541 -13445 -47565 -48761 -40285 -67752 -71380 -78554 -61790 -33148 -27915
22493b7915M88p98q262J9114K4101p925p496M4562j9113n8978l409k0571J191
$$ -27915 -27427 -28225 -36487 -17373 6728 -1197 -8693 35869 16756 -42222 -45631 -66202 -65011
22480f5011L839M0662L3587J5245q568K1740K8683j3097m3757m0531J4099N270
$$ -65011 -61172 -20510 13077 28322 19754 41494 70177 57080 13323 -27208 -13109 -7839
22468g839J2298K0099m7179k1090R181j15M5489p519m6098M100M0372K0003o857
$$ -7839 4459 24558 -22621 -43711 -34530 -34645 10844 3325 -42773 -38673 1699 21702 14845
22455A4845j4331N568m79j870k2705n270j3803r074j9366L1566M8084J5210j9843
$$ 14845 514 6082 5603 3733 -18972 -24242 -38045 -47119 -66485 -34919 13165 28375 8532
22442H532l770j9154N344M21J933m328L0222J3297J4012j296J9493l7837j891
$$ 8532 4762 -14392 -9048 -8627 -6694 -11022 19200 32497 46509 45213 64706 26869 24978
22429B4978j3109K5385K7069l5393k5859L4716J8661K7602M0789J4190k6862l2040
$$ 24978 11869 37254 64323 28930 3071 37787 56448 84050 124839 139029 112167 80127
22417H0127j0473k0096n0767j6630J4806r019Q723j2308J7107J5848l3330O532
$$ 80127 69654 49558 -1209 -17839 -3033 -12052 -3329 -15637 1470 17318 -16012 -9480
22405i480k838l534J5723M4409j2398m5496k924r705j0456p340J4638J7393j3456
$$ -9480 -12318 -15852 -129 44280 31882 -13614 -16538 -26243 -36699 -44039 -29401 -12008 -25464
22392b5464j9017l54r83p021L6703K7296l0848k0765l828M7046O2493K2005m0065
$$ -25464 -44481 -44835 -45818 -52839 -16136 11160 -19688 -40453 -44281 2765 65258 87263 47198
22379D7198m5581J6794j6395O162N026l5585l9795K2704L4430J1542k2922o190
$$ 47198 1617 18411 2016 8178 13204 -22381 -62176 -39472 -5042 6500 -16422 -22612
22367b2612K2588l1734l7159J5908j2935J0194Q770J3780P390O3072n34l2679
$$ -22612 -24 -31758 -68917 -53009 -65944 -55750 -46980 -33200 -25810 37262 36728 4049
22355D049m766m4027j8107K2410L7373N4332J7671m2795k2068j5598j489J4750
$$ 4049 -717 -44744 -62851 -40441 -3068 51264 68935 26140 4072 -11526 -13015 1735
22343A735r658j7197J0504J7169k8869l218j508L796l4462K941J3753N145K9639
$$ 1735 -7923 -25120 -14616 2553 -26316 -29534 -31042 -27246 -61708 -58767 -45014 -39869 -10230
22330a0230K6081K026m9476l0844L9142J0558K1623o536R69j4583j019p689P835
$$ -10230 15851 17877 -31599 -62443 -23301 -12743 8880 2344 3313 -11270 -12289 -19978 -12143
22317a2143l5345J5036M5182J704o920j5800l3277L2886O2959J2946m4263p618
$$ -12143 -47488 -32452 12730 14434 7514 -8286 -41563 -8677 54282 67228 22965 15347
22305A5347l3904j5904J394n66k4970M2421J0596j0847n339J2693N201L8881K7850
$$ 15347 -18557 -34461 -33067 -33633 -58603 -16182 -5586 -16433 -21772 -9079 -3878 35003 62853
22292F2853l2988m5324L612J837k4498L6215K1712j8505L6897k306j7370J2889
$$ 62853 29865 -15459 -11847 -10010 -34508 1707 23419 4914 41811 39505 22135 35024
22280C5024J02m2416J4162M254J4233M4495O017L838k9449j6501m2131j1068J7017
$$ 35024 35126 -7290 6872 11126 25359 69854 75871 79709 50260 33759 -8372 -19440 -2423
22267b423l391l1424k3623J3536K3490J8413J2690K5623J111n1525k0798Q722
$$ -2423 -5814 -37238 -60861 -47325 -23835 -5422 7268 32891 34002 -17523 -38321 -29599
22255b9599M4667M7787m0286J1515K272m4549k4591j0437K46J02R22J3163j8510
$$ -29599 15068 62855 22569 34084 36356 -8193 -32784 -43221 -42975 -42873 -41951 -28788 -47298
22242d7298k9415J7822L8998L1671m2411m4579J5631L5920Q2737j4631j9584l5314
$$ -47298 -76713 -58891 -19893 11778 -30633 -75212 -59581 -23661 59076 44445 24861 -10453
22230a0453J8107R332j1909K5303j8926Q789J6292J1843m746j508m9356j8491
$$ -10453 7654 16986 5077 30380 11454 20243 36535 48378 43632 42124 -7232 -25723
22218b5723J8786r002j6873K8548k158k0179K017J6827j3146j2457J2716L4465
$$ -25723 -6937 -15939 -32812 -4264 -6422 -26601 -24584 -7757 -20903 -33360 -20644 13821
22206A3821J7010K1718q208L365k2467K00P737R854j2057k802O21m011J7779L1597
$$ 13821 30831 52549 44341 47706 25239 25439 33176 43030 30973 28171 28792 24781 42560 74157
22192G4157k1808n212k9686j7903M1003K3236j0273k9855k0923l8307l228K850
$$ 74157 52349 47137 17451 -452 40551 63787 53514 23659 2736 -35571 -38799 -35949
22180c5949K1794J4337R991k4820j630N8135K9519k0849n3001k4994P4k4326J3590
$$ -35949 -14155 182 10173 -14647 -16277 41858 71377 50528 -2473 -27467 -27393 -51719 -38129
22167c8129L0467j022k059j0357l3618P51L0972M1861k2560l6920l0872R925N5398
$$ -38129 -7662 -8684 -10743 -21100 -54718 -53967 -22995 18866 -3694 -40614 -71486 -61561 -6163
22154f163J6866K807P379M0460m0749J995j3115L974k4807j0911k1658k7559m725
$$ -6163 10703 13510 20889 61349 20600 22595 9480 13454 -11353 -22264 -43922 -71481 -76206
22141g6206j3214n329K4284J6711L4321r972j7161M8703N5823j1754p5372r684
$$ -76206 -89420 -94749 -70465 -53754 -19433 -29405 -46566 2137 57960 46206 -29166 -38850
22129c8850J5314K9723J4459K9628o242o914o113L324l6567l0320M5387O4215
$$ -38850 -23536 6187 20646 50274 44032 37118 31005 34329 -2238 -32558 12829 77044
22117G7044J2994k3416q816P74k1069j6783L39j2083k7784n322L179Q44p278M931
$$ 77044 90038 66622 57806 58580 37511 20728 21067 8984 -18800 -24122 -20943 -20099 -27377 -22446
22103b2446K0809K1324k0392M407Q149p490N948p547N860j4105q097j4967p714
$$ -22446 -1637 19687 -705 3702 11851 4361 10309 2762 8622 -5483 -13580 -28547 -36261
22090c6261J1174l799J7152K221m1743K8770J5897J9414k3907o169K4648K4065
$$ -36261 -25087 -28886 -11734 -9513 -51256 -22486 -6589 12825 -11082 -17251 7397 31462
22078C1462N253J6515o843O673J0670J6276J533k5070q997j7522L77L734k0031
$$ 31462 36715 53230 46387 53060 63730 80006 81539 56469 47472 29950 30327 34061 14030
22065A4030k4022M8422j615m7448l1542J795l55K2496n324j2812K3311J3187J4144
$$ 14030 -9992 38430 36815 -10633 -42175 -40380 -40735 -18239 -23563 -36375 -13064 123 14267
22052A4267L371P832k2527k1554L3568K7665K2811l5466j2114k3185R842L9427
$$ 14267 17638 25470 2943 -18611 14957 42622 65433 29967 17853 -5332 4510 43937
22040D3937N41m4801J6221K4668j7706j4154k1363J4364k3627m820j0874J2619
$$ 43937 44478 -323 15898 40566 22860 8706 -12657 1707 -21920 -26740 -37614 -24995
22028b4995N2205j534k5163L826R362k513L9213j5422l1782n549J2592K922J0311
$$ -24995 27210 25676 513 4339 13701 11188 50401 34979 3197 -2352 10240 13162 23473
22015B3473j7546j2670P3255P778j8657n8427K360K6988k8960J9562K7123m9594
$$ 23473 5927 -6743 66512 74290 55633 -2794 -434 26554 -2406 17156 44279 -5315
22003e315k9513L2263j8859M6748P094r312l382j3933k7936j2789j4887l1691
$$ -5315 -34828 -2565 -21424 25324 32418 23106 19724 5791 -22145 -34934 -49821 -81512
21991h1512M905J0561J8135J9994J0571R426J9572q615j6779j8492J3214M8045
$$ -81512 -76607 -66046 -47911 -27917 -17346 -7920 11652 3037 -13742 -32234 -19020 29025
21979B9025n0607m2746K0707L1353K598L7618K3455N235k1877l0176j4567M3011
$$ 29025 -21582 -64328 -43621 -12268 -9670 27948 51403 56638 34761 4585 -9982 33029
21967C3029L1171r653j3505j5459j90L0974K1123k366l1883j1435p532K2052J892
$$ 33029 64200 54547 41042 25583 25393 56367 77490 75124 43241 31806 24274 46326 48218
21954D8218k4292j40J2741P775P268O638k3643j196K3187m9760n909j0952j5640
$$ 48218 23926 23786 36527 44302 51570 58208 34565 33369 56556 6796 887 -10065 -25705
21941b5705J7535J9608O976M0825j3867j8565M0975J0305l7609l3194K16J2391
$$ -25705 -8170 11438 18414 59239 45372 26807 67782 78087 40478 7284 7500 19891
21929A9891K5605q032k4138K292o448K9888m540L2043k6464k3642J4888j8190
$$ 19891 45496 37464 13326 15618 9170 39058 34518 66561 40097 16455 31343 13153
21917A3153k4112O192j6420J5190L990j6153m9871k0479M9169O813J0570k570
$$ 13153 -10959 -4767 -21187 -5997 -2007 -18160 -68031 -88510 -39341 -32528 -21958 -24528
21905b4528l1710j8514K6692L0210K5734R989L342J3777k7714k9212L959m2956
$$ -24528 -56238 -74752 -48060 -17850 7884 17873 21215 34992 7278 -21934 -17975 -60931
21893f0931j917L9987K8081j9633k8946J1303J3608o814J3541k5490j0787K6578
$$ -60931 -62848 -22861 5220 -14413 -43359 -32056 -18448 -25262 -11721 -37211 -47998 -21420
21881b1420L4730m158J6174j0472J064j2821P04P223J9440J0631J3812J733n442
$$ -21420 13310 9152 25326 14854 15918 3097 3801 11024 30464 41095 54907 56640 51198
21868E1198j2972N7J539j6990p056k5734l478J3705k9975J0629p21k008o687K7786
$$ 51198 38226 38283 39822 22832 15776 -9958 -13436 269 -29706 -19077 -19798 -21806 -28493 -707
21854g07K5680K7714j6122l9637k7818p100J65J7206k4374l6177N143M2959N0802
$$ -707 24973 52687 36565 -3072 -30890 -37990 -37825 -20619 -44993 -81170 -76027 -33068 17734
21841A7734O321m8056M604J1628K6251m3468K682L8509j1529m3438M517j5419
$$ 17734 24055 -24001 -19397 -7769 18482 -24986 -22304 16205 4676 -38762 -34245 -49664
21829d9664m0692L0654L7353n651p666K1366K8097j762j4457J0184K9885J0910
$$ -49664 -90356 -59702 -22349 -28000 -35666 -14300 13797 12035 -2422 7762 37647 48557
21817D8557l4264J9058r413k0778l4218L314j7340o7764K8489J5473R503K8902
$$ 48557 14293 33351 23938 3160 -31058 -27744 -45084 -112848 -84359 -68886 -59383 -30481
21805c0481L0380J4926m134j4637k6358J7575p693n999J362Q576J5413j6872k1974
$$ -30481 -101 14825 10691 -3946 -30304 -12729 -20422 -26421 -25059 -16483 -1070 -17942 -39916
21792c9916j754N4884L4978j6628k0259J8534O319k1634N131j9679n821n636j185
$$ -39916 -41670 13214 48192 31564 11305 29839 36158 14524 19655 -24 -5845 -11481 -12666
21779a2666l227J5803L6845R507J3321k8069l6988j3799L343R556K8208J115j1254
$$ -12666 -15893 -90 36755 46262 59583 31514 -5474 -19273 -15930 -6374 21834 22949 11695
21766A1695K6417K811l0729j7901j4555k4785O449L5222m454J7230k009j6122
$$ 11695 38112 40923 10194 -7707 -22262 -47047 -40598 -5376 -9830 7400 5391 -10731
21754a0731p669O0995J3937k0304K81J5515m177j0705k5397q978p350j3128L8420
$$ -10731 -18400 42595 56532 36228 36509 52024 47847 37142 11745 2767 -4583 -17711 20709
21741B0709J4720j2666j3279K0182o17m3341j3257J3285J2755k0370Q351Q587
$$ 20709 35429 22763 9484 29666 29049 -14292 -27549 -14264 -1509 -21879 -13528 -4941
21729d941p868O919j5391K1522K7365k1517j2128k8963L172P29K6185M1937L8479
$$ -4941 -12809 -5890 -21281 241 27606 6089 -6039 -35002 -31830 -31101 -4916 37021 75500
21716G5500j529r214j8101j7806j2126K1283R756J1079l9500l1503J9157K3416
$$ 75500 73971 64757 46656 28850 16724 38007 47763 58842 19342 -12161 6996 30412
21704C0412pj0974q165m4155l7005M2256L3630K0359l4142R652m007k5644k2178
$$ 30412 30405 19431 11266 -32889 -69894 -27638 5992 26351 -7791 1861 -2146 -27790 -49968
21691d9968L6473J1184k4736K1496R288r083j2891k659J6656O763j5457p806J4649
$$ -49968 -13495 -2311 -27047 -5551 3737 -5346 -18237 -20896 -4240 2523 -12934 -20740 -6091
21678f091l4395j0768Q879N469j7919l8229R653K7220K7018K6199J1161J1534
$$ -6091 -40486 -51254 -42375 -36906 -54825 -93054 -83401 -56181 -29163 -2964 8197 19731
21666A9731n589q153k6158q979R352R26L098L4559K2013k4434l3395J4092l1821
$$ 19731 14142 5989 -20169 -29148 -19796 -18870 -15772 18787 40800 16366 -17029 -2937 -34758
21653c4758j9490M2819J2785p802L1036q449j5758J5302K3724j582n4485l3600
$$ -34758 -54248 -11429 1356 -6446 24590 16141 383 15685 39409 37827 -16658 -50258
21641e0258L6537n288j1202K8636o53j4914J6478q256L3034j1250k6062M410R13
$$ -50258 -13721 -19009 -30211 -1575 -2228 -17142 -664 -8920 24114 12864 -13198 -8788 -7875
21628g875p644k8169L0271K8648l1846k3745p23M981O933j1001J345m928J8842
$$ -7875 -15519 -43688 -13417 15231 -16615 -40360 -41083 -36102 -29169 -40170 -38825 -43753 -24911
21615b4911q276q436J6377K1730Q125M153M618J0618K5698K8946J681j5435J2933
$$ -24911 -33187 -41623 -25246 -3516 4609 8762 13380 23998 49696 78642 80323 64888 77821
21602G7821j3975J909k032j9594m681L924K711O263j4597m793p585k7096J3111
$$ 77821 63846 65755 63723 44129 39448 43372 46083 52346 37749 32956 25371 -1725 11386
21589A1386K3712k0750q379k6755l5700M694M1307J9709K0315k4615m1811l0574
$$ 11386 35098 14348 5969 -20786 -56486 -51792 -10485 9224 29539 4924 -36887 -67461
21577f7461m8461L5916O5025M0288j2116j6374j7857J0656k0701L907L7820j8898
$$ -67461 -115922 -80006 -14981 25307 13191 -3183 -21040 -10384 -31085 -27178 10642 -8256
21565h256k0717K0897K6843r198J539j756l1048l8892J3932k970k4179J2430L9630
$$ -8256 -28973 -8076 18767 9569 11108 9352 -21696 -60588 -46656 -49626 -73805 -61375 -21745
21552b1745j1020p87K4457J2329Q921j5604k6040K064l69r614K7775J8346M4531
$$ -21745 -32765 -33552 -9095 3234 12155 -3449 -29489 -27425 -27794 -37408 -9633 8713 53244
21539E3244J1410J643j8104k9697k065K4348K8699j9615j6471J3317j683m511
$$ 53244 64654 66297 48193 18496 16431 40779 69478 49863 33392 46709 45026 40515
21527D0515l3760l9822K0623L6954K2663k2336O964L3M942K1050r88j2161m885
$$ 40515 6755 -33067 -12444 24510 47173 24837 31801 31834 36776 57826 56838 44677 39792
21514C9792O813n8458l5037J5279M4384R082l624l3617k8407L052K4290K4030
$$ 39792 46605 -11853 -46890 -31611 12773 21855 18231 -15386 -43793 -40741 -16451 7579
21502G579L1416n994J2621j2505j4791J525j8059L3997r152o6755l3073M5821
$$ 7579 38995 33001 45622 33117 18326 19851 1792 35789 26637 -40118 -73191 -27370
21490b7370N31O089L6246K2474j4813J4636K1020k3087M5450J4957m0630q820
$$ -27370 -26839 -20750 15496 37970 23157 37793 58813 35726 81176 96133 55503 46683
21478D6683k1096J0439l37K4399K5633R777m948l2329l0663j520j6104j5757J2550
$$ 46683 25587 36026 35689 60088 85721 95498 90550 58221 27558 26038 9934 -5823 6727
21465F727k4873j8465K9434M2631Q367j5149O78q646j28j3099o799L936k7406
$$ 6727 -18146 -36611 -7177 35454 43821 28672 29350 20704 20576 7477 678 4614 -22792
21452b2792q169J908p789L0475L691j9246L946q508k0237J6451k9034j8628j0612
$$ -22792 -30961 -29053 -36842 -6367 -2676 -21922 -17976 -26484 -46721 -30270 -59304 -77932 -88544
21439h8544L7046p710O57k623o552O2989J7128p962L338l6186j1073J5759r771
$$ -88544 -51498 -59208 -58551 -61174 -67726 -4737 12391 4429 7767 -28419 -39492 -23733 -33504
21426c3504k227L2985L1141l721j1150L863l2475k561M0528O946j2338j3698j1059
$$ -33504 -35731 -2746 28395 24674 13524 17387 -15088 -17649 22879 29825 17487 3789 -7270
21413g270j1741j6708L0549K6660J7337K5756l0065m0928j5349n23N993M9758
$$ -7270 -19011 -35719 -5170 21490 38827 64583 34518 -6410 -21759 -22282 -16289 33469
21401C3469J256j6276k5189k829J9627l613R874K6207q090m1369k2993j9900O875
$$ 33469 34725 18449 -6740 -9569 10058 6445 16319 42526 34436 -6933 -29926 -49826 -42951
21388d2951J0116n775j4750Q504M1867j6629M7963K1465O967r693m4523j5361
$$ -42951 -32835 -38610 -53360 -44856 -2989 -19618 28345 49810 56777 47084 2561 -12800
21376a2800O914N959k0609m0029L558K1358J3329J7130m7738l804J9565J8964
$$ -12800 -5886 73 -20536 -60565 -57007 -35649 -22320 -5190 -52928 -56732 -37167 -18203
21364a8203M5205j1200J5614K1395k5341K0296J876k7624l060l554J8224m160
$$ -18203 27002 15802 31416 52811 27470 47766 49642 22018 18958 15404 33628 29468
21352B9468J451j3949j2930J7363k181Q111n809l1258K3531k4590l035L9712m6555
$$ 29468 30919 16970 4040 21403 19222 27333 21524 -9734 13797 -10793 -13828 25884 -20671
21339b0671j7864k8812l922J3811K4506K1180J0365J0185K2466l2967L3581P754
$$ -20671 -38535 -67347 -71269 -57458 -32952 -11772 -1407 8778 31244 -1723 31858 39612
21327C9612l896k3693l9455J3871K145L059l25J4734r086K8769K0480M22J4051
$$ 39612 35716 12023 -27432 -13561 -11416 -8357 -8682 6052 -3034 25735 46215 46637 60688
21314F0688j3368k4192Q178j3768P071J9553L8496J1812n1233l3586n3616k7619
$$ 60688 47320 23128 31306 17538 24609 44162 82658 94470 43237 9651 -43965 -71584
21302g1584J2344K1040K321j1810K3640R195L3541k0676k3967J6244J5420K4767
$$ -71584 -59240 -38200 -35879 -47689 -24049 -14854 18687 -1989 -25956 -9712 5708 30475
21290C0475J552k024L32m165N110K5855j724l8077m3858J6273j3229m1059r942
$$ 30475 32027 30003 30335 26170 31280 57135 55411 17334 -26524 -10251 -23480 -64539 -74481
21277g4481P2210Q056r499Q148J2635j5940J9995K1789L924j2942K230K619K3082
$$ -74481 -2271 5785 -3714 4434 17069 1129 21124 42913 46837 33895 36125 38744 61826
21264F1826k3324o755l2015J7157M4362j1361n0844j5607P0437n722j7788L4963
$$ 61826 38502 31747 -268 16889 61251 49890 -954 -16561 53876 48154 30366 65329
21252F5329M4056k6089l8381k629l135N333q629J2094L534l6629l478o316K2172
$$ 65329 109385 83296 44915 42286 39151 44484 35855 47949 51483 14854 11376 5060 27232
21239B7232j7651k383m078j2075J5891K193R065j9077p450R797k9110J3029J895
$$ 27232 9581 7198 3120 -8955 6936 9129 18194 -883 -8333 1464 -27646 -14617 -12722
21226a2722r82K8798P370l02o960L5021K9474j897l2612k3987k1122j6731k3200
$$ -12722 -13704 15094 22464 22162 15202 50223 79697 77800 45188 21201 79 -16652 -39852
21213c9852K740J5603O846l583k362J2261L6230J5867j8773k6788J2814M0016
$$ -39852 -37112 -21509 -14663 -18246 -20608 -8347 27883 43750 24977 -1811 11003 51019
21201E1019N040n629j4928k8311j4200j2857M7240m238n621O3499m983k9569q571
$$ 51019 56059 50430 35502 7191 -7009 -19866 27374 23136 17515 81014 76031 46462 37891
21188C7891j0319J4327N396L2703k713l5228m9399l9672o583L4285J3218p402
$$ 37891 27572 41899 47295 79998 77285 42057 -7342 -47014 -53597 -19312 -6094 -13496
21176a3496J5696K1449P84j982L9834j906k6870j1954J5146K3265O869K673j0980
$$ -13496 2200 23649 24433 22451 62285 60379 33509 21555 36701 59966 66835 69508 58528
21163E8528o146k0174N944l2557j0578j2124j843P567M3990o525k502L2756L2223
$$ 58528 52382 32208 38152 5595 -4983 -17107 -18950 -11383 32607 26082 23580 56336 88559
21150H8559L3354J0786J9209m2655n3112p684L1058K0779q862j6998l417O443
$$ 88559 121913 132699 151908 109253 56141 48457 79515 100294 91432 74434 71017 77460
21138G7460k394L2703K5964K6570k2026m2497l0734k1071p383M0815M9471J3721
$$ 77460 75066 107769 133733 160303 138277 95780 65046 43975 36592 77407 126878 140599
21126A40599j4355l94J2902L0752q187L2906M5207M8242J14422J71335K69459
$$ 140599 126244 125850 138752 169504 161317 194223 239430 287672 402094 573429 842888
21115H42888K60878K4388k41627k78043j96766r0095m6414q858l494k392p022
$$ 842888 1103766 1128154 886527 608484 411718 321623 275209 266351 262857 260465 253443
21104B53443M1751O8241Q5213J44646K25676K75246J63615j53116k72594k08952
$$ 253443 295194 363435 448648 593294 818970 1094216 1257831 1104715 832121 623169
21094F23169j21744r6632r5846k4734R430L3797Q2471J51838K31097K73107J53923
$$ 623169 501425 404793 308947 284213 293643 327440 409911 561749 792846 1065953 1219876
21083A219876r3387k34986k37240k15028r6787l4222m0486j290L8830J5559J4696
$$ 1219876 1126489 891503 654263 439235 342448 308226 267740 266450 305280 320839 335535
21072C35535P2877J19750J34625K46362K58261O1826j92005k61713k09627j29326
$$ 335535 408412 528162 662787 909149 1167410 1229236 1037231 775518 565891 436565
21062D36565o8772m9626n3618n4818o0689m4306m206P88R080J4370J9020k3992
$$ 436565 367793 318167 264549 209731 149042 104736 100530 101318 110398 124768 143788 119796
21050A19796k4974m3793k2028k121M383j442M436L62k1333M924L7008M6757j1100
$$ 119796 94822 51029 29001 26880 31263 29821 34257 34619 13286 18210 55218 101975 90875
21037I0875k5392k6690j324r832J5278j1603J6124k3864j4864M4439K1520j3323
$$ 90875 65483 38793 37469 27637 42915 31312 47436 23572 8708 53147 74667 61344
21025F1344K4548M572o219N054r726k1044P031L9506L92J317l7656n2261k7609
$$ 61344 85892 90464 84245 89299 79573 58529 65560 105066 105458 106775 69119 16858 -10751
21012a0751O52J2989J4301J2038K5199J8292l2631p6035j9747N9167K0190m4386
$$ -10751 -10099 2890 17191 29229 54428 72720 40089 -35946 -55693 3474 23664 -20722
21000b0722o982J5863K7279K0574k0159K5149P394K3236Q846k6764j4570l568
$$ -20722 -27704 -11841 15438 36012 15853 41002 48396 71632 80478 53714 39144 35576
20988C5576j6720k481K7617j6978n7511J854J792j156K2072L3882L3056K6217
$$ 35576 18856 16375 43992 27014 -30497 -28643 -26851 -28007 -5935 27947 61003 87220
20976H7220J1385K0661j1594m5347l6389k5952n743J0231J7121M7275j0082k0432
$$ 87220 98605 119266 107672 62325 25936 -16 -5759 4472 21593 68868 58786 38354
20964C8354l2875k4776J6375R110k8760k429L6521J9071L7732M5910N597K003
$$ 38354 5479 -19297 -2922 6188 -22572 -25001 11520 30591 68323 114233 119830 121833
20952A21833k0113j0497p321K851l851R644k2926j7637Q79l0388l976K5631R639
$$ 121833 101720 91223 83902 86753 82902 92546 69620 51983 52862 22474 18498 44129 53768
20939E3768K0648P880l1484l5903M1128O0158M5776l4808n4330l7123K6773L4831
$$ 53768 74416 82296 50812 14909 56037 116195 161971 127163 72833 35710 62483 97314
20927I7314k0213k9734J1974j5047O331K6981k4333k7267j0931J2559k8407k359
$$ 97314 77101 47367 59341 44294 50625 77606 53273 26006 15075 27634 -773 -3132
20915c132p175K0868J1122J5695K7443K1116m526n888K3303j6244l7610J5050
$$ -3132 -10307 10561 21683 37378 64821 85937 81411 75523 98826 82582 44972 60022
20903F0022k4672m801J6691N1761J9460R632J1663J1166k4217j6062p293l9922
$$ 60022 35350 30549 47240 99001 118461 128093 139756 150922 126705 110643 103350 63428
20891F3428m8913J1845L3754J1082R660K1358J5734j9841j7775J9984L1062l1214
$$ 63428 14515 26360 60114 71196 80856 102214 117948 98107 80332 100316 131378 100164
20879A00164o917L730j4374j491o282l973K9411m3361k5561j8307K7172N0965
$$ 100164 93247 96977 82603 81112 74830 70857 100268 56907 31346 13039 40211 91176
20867I1176K8505m9572k9835K006K9089N116K1791k372l5317M848j175l4694j0601
$$ 91176 119681 70109 40274 42280 71369 76485 98276 95904 60587 65435 64260 29566 18965
20854A8965K2180L3509J7189j144m016J9718K5351j4269l8336l2326R23l839j912
$$ 18965 41145 74654 91843 90699 86683 106401 131752 117483 79147 46821 47744 43905 41993
20841D1993k410Q168l924j256k3236j8357M5147J8024k0176O19J6060J7108j1167
$$ 41993 39583 47751 43827 42571 19335 978 46125 64149 43973 44592 60652 77760 66593
20828F6593J4652M3901K3080p516j8427j7295K5090K3294l3166j6197J8250l270
$$ 66593 81245 125146 148226 140710 122283 104988 130078 153372 120206 104009 122259 118989
20816A18989j4717j704o555k226O988j0139k224L0797K4758J3331l727j4569j4203
$$ 118989 104272 102568 96013 93787 100775 90636 88412 119209 143967 157298 153571 139002 124799
20803A24799k37M6288J0360n7386P066K207Q235j6139j9783o279M485J0573J6462
$$ 124799 124562 170850 181210 123824 130890 133097 141332 125193 105410 99131 103616 114189 130651
20790A30651K3161m4153l4327M6893M5446J110l0987O28o059r048k8122k4693
$$ 130651 153812 109659 75332 122225 167671 168781 137794 138422 132363 123315 95193 70500
20778G0500J9285M3060O3091J0084m82k1951N75r307L3729K3535j5313m0276l776
$$ 70500 89785 132845 195936 206020 205538 183587 184162 174855 208584 232119 216806 176530 172754
20765A72754K3464J4758K3907m0091o1634m0079J6034P469n575J155K296P156
$$ 172754 196218 210976 234883 194792 133158 93079 109113 116582 111007 112162 114458 121614
20753A21614j5706m9142o0444K4828O2601j2310R569N1623R023O418L4329J0574
$$ 121614 105908 56766 -3678 21150 83751 71441 81010 132633 141656 148074 182403 192977
20741A92977j9402M7560O1232j444N9423K9181l0253j2717l5826j5941m208o1308
$$ 192977 173575 221135 282367 280923 340346 369527 339274 326557 290731 274790 270582 209274
20729B09274j5531p739k4090p62K3983N1106J9621j6882j5213n0467q209J8297
$$ 209274 193743 186004 161914 161152 185135 236241 255862 238980 223767 173300 165091 183388
20717A83388J2931K5319N105K3306N6247J8158L2672L2696O4976K958J7351K9641
$$ 183388 196319 221638 226743 250049 306296 324454 357126 389822 454798 457756 475107 504748
20705E04748m53k3401o4896p8963n7308l4396L0096K9523Q025K2150P895J0494
$$ 504748 504295 480894 415998 337035 279727 245331 275427 304950 312975 335125 343020 353514
20693C53514k4661O6j2132l4520k1078N6618O195j673k4523j1137j6207m212j4277
$$ 353514 328853 328919 316787 282267 261189 317807 324002 322329 297806 286669 270462 266250 251973
20680B51973M7028N8041r43j2099k5160K5622M8891p728K1978K2444l374m2763
$$ 251973 299001 357042 356099 344000 318840 344462 393353 385625 407603 430047 426673 383910
20668C83910j7690k782J8170j4067j0249K2480Q682J235j2009Q878q961k8487
$$ 383910 366220 363438 381608 367541 357292 379772 388454 389689 377680 386558 377597 349110
20656C49110k5443j9868K1264O1725K6506J0060J6885J1922J196K2118K3329M7481
$$ 349110 323667 303799 325063 386788 413294 423354 440239 452161 453357 475475 498804 546285
20644E46285M7438J3381L9116L1503J4961P865L5344J3551Q86m771j6367p688
$$ 546285 593723 607104 646220 677723 692684 700549 735893 749444 750330 745559 729192 721504
20632G21504J2791l3753j1190k9628Q824q063q02l8884j5820l3260k7766L5693
$$ 721504 734295 700542 689352 659724 668548 660485 659683 620799 604979 571719 543953 579646
20620E79646L9003K8547L4381O0677O7414N1226K0595K4210j4101J3952K1743
$$ 579646 618649 647196 681577 742254 809668 860894 881489 905699 891598 905550 927293
20609I27293N4963P7626N6551M1326K526L4353P0438P571o9373l7070j9516m3582
$$ 927293 982256 1059882 1116433 1157759 1160285 1194638 1265076 1272647 1203274 1166204 1146688 1103106
20597A103106r516N4011P5995N8648O164L1964J4123K1028K2252Q5439Q6067P9416
$$ 1103106 1093590 1147601 1223596 1282244 1288408 1320372 1334495 1355523 1377775 1463214 1549281 1628697
20585A628697O2150M3647J21999J53204Q5701k1904Q702M8424P8265R8495J65765
$$ 1628697 1690847 1734494 1856493 2009697 2095398 2073494 2082196 2130620 2208885 2307380 2473145
20574B473145L14349M45985O14650Q98757R31110J90128l15400j89170J51795
$$ 2473145 2787494 3233479 3848129 4746886 5677996 5868124 5552724 5363554 5515349
20565E515349N40139O61708N48504N05762N55551L23499n4174j65188M111K02034
$$ 5515349 6055488 6717196 7265700 7771462 8327013 8650512 8596338 8431150 8435261 8637295
20555H637295L54183O79072J065330J278994J470082J703478K002676K634794
$$ 8637295 8991478 9670550 10735880 12014874 13484956 15188434 17191110 19825904
20547A9825904L577891M881487O616680R350906J4098679K2406782L7179776O2340875
$$ 19825904 23403795 28285282 34901962 44252868 58351547 80758329 117938105 180278980
20539A80278980R9567373J25728264M8122005q7486978j15486119q2459162n0286358
$$ 180278980 279846353 405574617 453696622 366209644 250723525 168264363 117978005
20532A17978005l0566993j9427311j2723317q863372o880563n465482m239204
$$ 117978005 87411012 67983701 55260384 46397012 39516449 34050967 29811763
20525B9811763l216118k287346j394875o01448o3683L01780Q36511J462198K375877
$$ 29811763 26595645 24308299 22913424 22311976 22248293 22550073 23386584 24848782 27224659
20516B7224659L806385N480728P587491J0773448J5762842K4686768M1671480
$$ 27224659 31031044 36511772 44099263 54872711 70635553 95322321 136993801
20509A36993801P0627666J11023760J22737744J1189426j08292546j13298382
$$ 136993801 207621467 318645227 441382971 452572397 344279851 230981469
20503B30981469p6743357m6783560k8884870j8692903j2489728q656649o561229
$$ 230981469 154238112 107454552 78569682 59876779 47387051 38730402 32169173
20496C2169173n221421m228542l372156k662105k001319j619241j393692j247937
$$ 32169173 26947752 22719210 19347054 16684949 14683630 13064389 11670697 10422760
20488A0422760j103607q26041m70385j61416O552K40684L03797k51410q00633
$$ 10422760 9319153 8493112 8022727 7861311 7867863 8108547 8412344 8160934 7360301
20479G360301q13366m04188j41015o6833J72590J12306o18621r37554o91631m69336
$$ 7360301 6546935 6142747 6001732 5934899 6107489 6219795 5601174 4663620 3971989 3502653
20469C502653l46184k19986j90365j60289j11897j04317j27412p9773j01923j32761
$$ 3502653 3156469 2936483 2746118 2585829 2473932 2369615 2242203 2162430 2060507 1927746
20459A927746j75271j44162p7105k9173m8216m3991r9429o1359p136m3375j8941
$$ 1927746 1752475 1608313 1531208 1502035 1453819 1409828 1310399 1249040 1241904 1198529 1179588
20448A179588k8353m0402r5839j16891n1213K3723K3914P3985L0642n9566l7664
$$ 1179588 1151235 1110833 1014994 898103 846890 870613 894527 968512 999154 939588 901924
20437I01924m9863r8642n9968P950M3615R337m1564l2685k573o165L8005N5707
$$ 901924 852061 753419 693451 701401 745016 754353 712789 680104 677531 671366 709371 765078
20425G65078L0610M573l5835J6486P2o3490N702M4341P480J5085L6984R1904Q6060
$$ 765078 795688 800261 764426 780912 780984 717494 723196 767537 775017 790102 827086 918990 1005050
20412A005050N0430N8261R2526L5268j2792O532q5527j17979k2990K4960l9548
$$ 1005050 1055480 1113741 1206267 1241535 1228743 1235275 1149748 1031769 1008779 1033739 994191
20401I94191n1857l7695m7844k8933j8427l257p090q187n0508j3256m0904n3862
$$ 994191 942334 904639 856795 827862 809435 806178 799088 790901 740393 727137 686233 632371
20389F32371q3284l6836k2074l2244l9168k9185k0096j5967l1633q726j3084k6589
$$ 632371 549087 512251 490177 457933 418765 389580 369484 353517 321884 313158 300074 273485
20377B73485p361k8206l3878j7777K386J4888j1120l538J4602k2460l118k9415
$$ 273485 266124 237918 204040 186263 188649 203537 192417 188879 203481 181021 177903 148488
20365A48488k6527j7155M7193M8294M3903n838k2039N276N957O0499L8296l1663
$$ 148488 121961 104806 151999 200293 244196 238358 216319 221595 227552 288051 326347 294684
20353B94684q072M3787M9258K8843J2741J1804N258l688L5055r205k4439K8265
$$ 294684 286612 330399 379657 408500 421241 433045 438303 434615 469670 460465 436026 464291
20341D64291N5942O2434M4036K8318l2085r6330r6550o2949m2855p638J148K9390
$$ 464291 520233 582667 626703 655021 622936 526606 430056 367107 324252 316614 317762 347152
20329C47152J281J384m071r14L9143j9503o5434j2034J017O489J1969K9919J689
$$ 347152 348433 349817 345746 344832 383975 364472 299038 287004 288021 294510 306479 336398 338087
20316C38087j4401k8930l7302j7988j007j1571k0934L8494M9267N9791N7490K7793
$$ 338087 323686 294756 257454 239466 238459 226888 205954 244448 293715 353506 410996 438789
20304D38789n24n7952k1192j4165J0897K3282N9425Q1324O9526Q7264k46k9936
$$ 438789 438265 380313 359121 344956 355853 379135 438560 519884 589410 676674 676428 646492
20292F46492n5901o3105o5012p3353m6075J568N3266L4314N495k7038K4546j1731
$$ 646492 590591 527486 462474 389121 343046 344614 397880 432194 437689 410651 435197 423466
20280D23466j8318n3184l6737j2758n274k0240p5289m0337J3213r411N2783K9979
$$ 423466 405148 351964 315227 302469 297195 276955 201666 161329 174542 165131 217914 247893
20268B47893K073M4769N6173J5204J2359m6691o7882j0434m2227m5842k0770J3485
$$ 247893 249966 294735 350908 366112 378471 331780 263898 253464 211237 165395 144625 158110
20256A58110k0395k4600m06K26j2460j2760N668q733n292J9792J2233J0543k6023
$$ 158110 137715 113115 112709 112935 100475 87715 93383 84650 79358 99150 111383 121926 95903
20243I5903k5964J6267j29l8997L6009N2992j8652J9062L455K780k1548K280K2911
$$ 95903 69939 86206 86077 47080 83089 136081 117429 136491 139946 142726 121178 123458 146369
20230A46369Q316R915J0614j755m3363n3946j1776p823k7784M7480O727m0269
$$ 146369 154685 164600 175214 173459 130096 76150 64374 56551 28767 76247 82974 42705
20218D2705J6559J2550K773Q364P0j5823P501M7944j82j0216j9309o826M8796
$$ 42705 59264 71814 74587 82951 83021 67198 74699 122643 122461 112245 92936 86110 134906
20205A34906M43n3393p2911j5108L0487N3402N4536P624j0024r780m0475l4763
$$ 134906 135349 81956 9045 -6063 24424 77826 132362 139986 129962 120182 79707 44944
20193D4944J7451K8186J1327p734m00L127J5758n414l4162p179N814L035l292
$$ 44944 62395 90581 101908 94174 93774 96901 112659 107245 73083 65904 71718 74753 71461
20180G1461n445L800m6511J1994M3544Q153N0959J4942k8032j9708m1319k9666
$$ 71461 66016 69816 23305 35299 78843 86996 137955 152897 124865 105157 63838 34172
20168C4172J3834J7629J5030K6079K5302K7496m7399l4090J2875J175j3089k376
$$ 34172 48006 65635 80665 106744 132046 159542 112143 78053 90928 92103 79014 76638
20156G6638P553j8593K620k4640j7279K5874J4399K7921j2801K3678r49j8651
$$ 76638 84191 65598 68218 43578 26299 52173 66572 94493 81692 105370 104421 85770
20144H5770k318L3858O0269m209l712j6403l159n582j5065k0194j2700R52M3m1194
$$ 85770 83452 117310 177579 173370 169658 153255 150096 144514 129449 109255 96555 97507 97550 56356
20130E6356K0815O3339M808N275N776K0497l2593l3263k7570n574K5113L3695
$$ 56356 77171 140510 145318 150593 156369 176866 144273 111010 83440 77866 102979 136674
20118A36674K102M696p619k2004Q753j2976J018M8521K4919K8269K8711L706m552
$$ 136674 138776 143472 135853 113849 122602 109626 110644 159165 184084 212353 241064 244770 240218
20105B40218K115k1348j6358J0469l0205p260K1715L6402j2335p015k596M553
$$ 240218 242333 220985 204627 215096 184891 177631 199346 235748 223413 216398 213802 218355
20093B18355K5810j8554O143j0315J8511L870m3780j1467l338l8875j8498L8634
$$ 218355 244165 225611 231754 221439 239950 243820 200040 188573 185235 146360 127862 166496
20081A66496N9640J1547j5900N578K6017J9859k5345n3730K6305M718l9966l7107
$$ 166496 226136 237683 221783 227361 253378 273237 247892 194162 220467 225185 185219 148112
20069A48112j9406j1851N2519L3819L6001q948j9744K2002j5237j9877K4831J4290
$$ 148112 128706 116855 169374 203193 239194 230246 210502 232504 217267 197390 222221 236511
20057B36511K0675k0908j2122M963K6286J7142r068l1846K3165J4276L997k5622
$$ 236511 257186 236278 224156 229119 255405 272547 263479 231633 254798 269074 273071 247449
20045B47449j7606R860j2200k1065J4609L918K0679J8208Q184k376j1711j7727
$$ 247449 229843 239703 227503 206438 221047 224965 245644 263852 272036 269660 257949 240222
20033B40222J5759Q554O24J538K0115j5372j7689L0925q425J6288J5590M6661
$$ 240222 255981 264535 265159 266697 286812 271440 253751 284676 276251 292539 308129 354790
20021C54790j7512j4314L4533M8566r773l844j0610Q734P409j1763k9943K5188
$$ 354790 337278 322964 357497 406063 396290 392446 381836 390570 397979 386216 356273 381461
20009C81461M0468p271J7283L4936j7981L8601K1834J9269K709L0790J6245k7574
$$ 381461 421929 414658 431941 466877 448896 487497 509331 528600 531309 562099 578344 550770
19997E50770K7431K0822k6171n4401k41J3305N0855M3443P498j1544n4906J1962
$$ 550770 578201 599023 572852 518451 518210 531515 582370 625813 633311 621767 566861 578823
19985E78823K5023p127R652K2767J6557P454M7580N1204J6932K2722O3270N7522
$$ 578823 603846 596719 606371 629138 645695 653149 700729 751933 768865 791587 854857 912379
19973I12379Q9785J81172K26882K57883K44970M3419j27251j95786j44990j25588
$$ 912379 1002164 1183336 1410218 1668101 1913071 1956490 1829239 1633453 1488463 1362875
19963A362875m7260J4954K7408K150M6871L4477O250N0313J32218K30826K91719
$$ 1362875 1315615 1330569 1357977 1360127 1406998 1441475 1447725 1498038 1630256 1861082 2152801
19952B152801K33421q3552k72797j97909q7155m1480m199k7923N6240J44367J88270
$$ 2152801 2386222 2302670 2029873 1831964 1744809 1703329 1699130 1671207 1727447 1871814 2060084
19941B060084K38079L22553M24115M32843J89061l560p533J27282J69064J81469
$$ 2060084 2298163 2620716 3044831 3477674 3666735 3663175 3655642 3782924 3951988 4133457
19931D133457K53040M28313M85145N10266N79101P79049J067450J405906J950775
$$ 4133457 4386497 4814810 5299955 5810221 6389322 7168371 8235821 9641727 11592502
19922A1592502K779864L834119M892386M666291L260087M126247P527138R020464
$$ 11592502 14372366 18206485 23098871 27765162 31025249 35151496 42678634 51699098
19914E1699098M924329J881124L327884P953956J1002682J0290083P374979N710385
$$ 51699098 56623427 58504551 61832435 69786391 80789073 91079156 98454135 104164520
19906A04164520P339149Q481498J0300358J998984p263383l918966M360007P40474
$$ 104164520 111503669 119985167 130285525 132284509 125021126 121102160 125462167 126202641
19898A26202641r219372j0038623n968540j554783J537606J68650r193262j0843034
$$ 126202641 116983269 106944646 100976106 99421323 100958929 101127579 91934317 81091283
19890H1091283l386487J386452n494903j3200138j1292225o413125m974716o661139
$$ 81091283 77704796 79091248 73596345 60396207 49103982 42690857 37716141 31055002
19882C1055002o671565n068943l423966k305175j482606q31823n01521p71841
$$ 31055002 24383437 19314494 15890528 13585353 12102747 11270924 10769403 9997562
19874I997562j079219r60865o94111m10409j55488j07022l29601m42316m54663
$$ 9997562 8918343 7957478 7263367 6852958 6697470 6590448 6260847 5818531 5363868
19865E363868l93217k44962j11171M8109K37370K24030o1807k17824j21409j0164
$$ 5363868 4970651 4725689 4614518 4662627 4899997 5124027 5062220 4844396 4722987 4712823
19855D712823J36691J30263Q974J5382Q4691J86754L46804N84963Q44831J272338
$$ 4712823 4849514 4979777 4988751 5004133 5088824 5275578 5622382 6207345 7052176 8324514
19845H324514J999756L211975N155605P326401P344889O155841O803428L458089
$$ 8324514 10324270 13536245 18691850 26018251 33363140 39518981 46322409 49780498
19837D9780498l428154m565131m287634n165843l739601l78140L298937N894561
$$ 49780498 46352344 41787213 37499579 32333736 28594135 28215995 31514932 37409493
19829C7409493O890194R026389Q034896L39401j945214J523880J10812p851430
$$ 37409493 44299687 53326076 61360972 61700373 59755159 61279039 61389851 53538421
19821E3538421r994201n716668k037907k656388l860170k031583N73954O46181
$$ 53538421 43544220 37827552 35789645 33133257 29273087 27241504 27815458 28461639
19813B8461639n15176P64225L740925L386168k447750n031806k799488l23991
$$ 28461639 27946463 28710688 32451613 35837781 33390031 28358225 25558737 25234746
19805B5234746o20042k326086j965390M965K445182N662480R000177J0304894
$$ 25234746 24614704 22288618 20323228 20328193 22773375 28435855 37436032 47740926
19797D7740926Q412614J924638n800834r131979q051432m471843n11281L589623
$$ 47740926 56153540 58078178 52277344 43145365 35093933 30622090 30110809 33700432
19789C3700432P660624R798049Q299447K926703j212437k193860j312802J706854
$$ 33700432 41361056 51159105 59458552 62385255 61172818 58978958 57666156 59373010
19781E9373010M41073n630572o583284n940948o605334n054611j714534J773078
$$ 59373010 59814083 54183511 47600227 41659279 35053945 29999334 28284800 30057878
19773C0057878L771993L253342L755725L456998k321343n528352n269428o313426
$$ 30057878 33829871 37083213 40838938 44295936 41974593 36446241 31176813 24863387
19765B4863387o452085m875867l208291k102260j430657j058899p26029m94416
$$ 24863387 18411302 13535435 10327144 8224884 6794227 5735328 5009299 4514883
19757D514883m25268l56381k98563k07833j01873r4029j10185r1227J7793J21009
$$ 4514883 4089615 3733234 3434671 3226838 3124965 3030936 2920751 2829524 2847317 2968326
19747B968326L13001O80016J080626J013941j89915r62021p92030k51498L30225
$$ 2968326 3281327 3961343 5041969 6055910 5865995 4903974 4111944 3860446 4190671
19738D190671R66070J135288k75467j509741j344034q47578m69645l30092k12107
$$ 4190671 5156741 6292029 6016562 4506821 3162787 2315209 1845564 1515472 1303365
19729A303365j08890j59635j31449p1791l6161j2187l6602p2628m0729m0437o4346
$$ 1303365 1194475 1034840 903391 831600 795439 783252 746650 674022 633293 592856 528510
19718E28510l2873J2723l513k0429J2843O70q110o8201q5988n712K0263O7759
$$ 528510 495637 508360 504847 484418 497261 497931 489821 421620 335632 329920 350183 417942
19706D17942P4428m9775l0852l1624l7326K5891K6833M865k469J3784J0232l0765
$$ 417942 492370 442595 411743 380119 342793 368684 395517 400382 397913 411697 421929 391164
19694C91164k4840K376M16J1364k6450k626k8394J8542L4431J7989M8510K422
$$ 391164 366324 368700 369116 380480 354030 351404 323010 341552 375983 393972 442482 444904
19682D44904m1540k2743k4455l2040o7890l783p00j4304m6131j987K3079J2896
$$ 444904 403364 380621 356166 324126 256236 252453 251753 237449 191318 189331 212410 225306
19670B25306K1278J4741l0927j9159m952j0035k3736l3246K1141K8762J0727k714
$$ 225306 246584 261325 230398 211239 206287 196252 172516 139270 160411 189173 199900 197186
19658A97186K305K0966K3455o9240m3046L4317L425l1830O111N944j549k4939
$$ 197186 199491 220457 243912 174672 131626 165943 169368 137538 143649 149593 148044 123105
19646A23105J1075L7068J1445p601j55j3114m181l1290n592L7371L0580J2650
$$ 123105 134180 171248 182693 175092 174937 161823 157642 126352 120760 158131 188711 201361
19634B01361l540j7153j7707r51P582J7628k0876n0369n8537P107K1352J9371
$$ 201361 197821 180668 162961 162010 169592 187220 166344 115975 57438 64545 85897 105268
19622A05268m624K7290j5536j3430Q795J8054J975M937n625m9323J0502O172j7099
$$ 105268 100644 127934 112398 98968 107763 125817 127792 132729 127104 77781 88283 94455 77356
19609G7356j1030K8884J3939K1954k2515o2232m8011k0205J2440N741P7821M3640
$$ 77356 66326 95210 109149 131103 108588 46356 -1655 -21860 -9420 -3679 74142 117782
19597A17782K2250m9060j9069J5563K7542l1979Q313J1825L1379Q529o0651k2045
$$ 117782 140032 90972 71903 87466 115008 83029 91342 103167 134546 143075 82424 60379
19585F0379q187L784J3573J7899j4038J190L2762M5594k5921l2700n4389m0019
$$ 60379 52192 55976 69549 87448 73410 74600 107362 152956 127035 94335 39946 -73
19573g3J4673L4234L7270j6587j8102j3828p200j8715J132M429J3379Q53n5724
$$ -73 14600 48834 86104 69517 51415 37587 30387 11672 12804 17233 30612 31465 -24259
19560b4259j4335L0988M7231P660L376L2663n929q068j298k2685p973k4506K8899
$$ -24259 -38594 -7606 39625 47285 50661 83324 77395 69327 68029 45344 37371 12865 41764
19547D1764o248j5598m869K1882l79j1680P239k6701o123K3980L7775O5737J6472
$$ 41764 35516 19918 15049 36931 36552 24872 32111 5410 -713 23267 61042 126779 143251
19534A43251l4258j298j0790l0806j3742J3909j2423j4446j1594j8327J0525K4391
$$ 143251 108993 107695 96905 66099 52357 66266 53843 39397 27803 9476 20001 44392
19522D4392J8844k8851J7192m530r259j8324j1984M996j071l8772K7427P483J999
$$ 44392 63236 34385 51577 47047 37788 19464 7480 12476 11405 -27367 60 7543 9542
19509I542n746L2883M6051O935o440k3903L6949M0859j0159j7617n410J7501q371
$$ 9542 3796 36679 82730 89665 83225 59322 96271 137130 126971 109354 103944 121445 113074
19496A13074l9464j8296J0407o37p5068J3899M5896L037J4248N799j550J2344
$$ 113074 73610 55314 65721 65084 -9984 3915 49811 52848 67096 72895 71345 83689
19484H3689n3138l1888P23K3577K0447J5996J5576l0324n6766J7315m3j4495j2229
$$ 83689 30551 -1337 -614 22963 43410 59406 74982 44658 -12108 5207 5164 -9331 -21560
19471b1560J1215K2717K7022M953O889j4219O550J7442Q383k9911m2433k9137
$$ -21560 -10345 12372 39394 44347 51236 37017 43567 61009 69392 39481 -2952 -32089
19459c2089L779J1205l180J7982K0791j2951k0407M4389J5406j4283n0057R88
$$ -32089 -28310 -17105 -20285 -2303 18488 5537 -14870 29519 44925 30642 -19415 -18427
19447a8427l7731j4948K1130L3686M0088l915J1669j8488L4902K4573j3830m677
$$ -18427 -56158 -71106 -49976 -16290 23798 19883 31552 13064 47966 72539 58709 54032
19435E4032K8936q422k7317k4311j7897j4040o776L7317O1681k4455k9845P799
$$ 54032 82968 74546 47229 22918 5021 -9019 -15795 21522 83203 58748 28903 36702
19423C6702M802K7402n008J2450Q459J8400K1476J238J8899J2826m7870K4301
$$ 36702 41504 68906 63898 76348 84807 103207 124683 125921 144820 157646 109776 134077
19411A34077K8287J0205O512M7048K2633j806L6631J8831M5368P5434R7226N0430
$$ 134077 162364 172569 179081 226129 248762 246956 283587 302418 347786 423220 520446 570876
19399E70876O2094K7425J1655K9873J3218J5746l9276m7775j4731K6231q238n9577
$$ 570876 632970 660395 672050 701923 715141 730887 691611 643836 629105 655336 647098 587521
19387E87521p6934k5788M6142R68J513n1942r088J0064l8159q2928l8344j4190
$$ 587521 510587 484799 530941 531909 533422 481480 472392 482456 444297 361369 323025 308835
19375C08835j4348r9994p9033L889q338o995j1331j9629l5268n257L674l437J6792
$$ 308835 294487 194493 115460 119349 111011 104016 92685 73056 37788 32531 36205 32768 49560
19362D9560j9040l4348m2714K8195K0533K9467K0609j7069J1052j7475j8017P474
$$ 49560 30520 -3828 -46542 -18347 2186 31653 52262 35193 46245 28770 10753 18227
19350A8227j2568k5477k7123n190R146M2388N3366m433j3716K552k766J8977J7390
$$ 18227 5659 -19818 -46941 -52131 -42985 -597 52769 48336 34620 37172 34406 53383 70773
19337G0773q17J4503M244j7756o956j4324p07J8051L7266K3504K7418L0079L4181
$$ 70773 69956 84459 88703 70947 63991 49667 48960 67011 104277 127781 155199 185278 219459
19324B19459j1122J3923q937K183K7888K9613j7791l2704n8734L2726J067J8309
$$ 219459 208337 222260 213323 215506 243394 273007 255216 222512 163778 196504 197571 215880
19312B15880O0977R433q671o491j2712l7525Q821L185j3140j309P28l6066j4547
$$ 215880 276857 286290 277619 271128 258416 220891 229712 232897 219757 218448 219176 183110 168563
19299A68563l3414J5510J6504k9358R756J7455K7535J3573J5169K149L802J4381
$$ 168563 135149 150659 167163 137805 147561 165016 192551 206124 221293 223442 227244 241625
19287B41625K6109J6928M2961K7300j9921p1760j8764K502q138q566L165L0l4304
$$ 241625 267734 284662 327623 354923 335002 263242 244478 246980 238842 230276 233441 233471 199167
19274A99167k7599j6110N412l0842K6066K713N0514L9030L6564O1395j4863o5310
$$ 199167 171568 155458 160870 130028 156094 158807 209321 248351 284915 346310 331447 266137
19262B66137n3704k8433j5709L572k6025k4463O2771P6152j7587K8145M176n4909
$$ 266137 212433 184000 168291 171863 145838 121375 184146 260298 242711 270856 275032 220123
19250B20123o5021l1028l736k7428l5747k7459J5157J8617o866K96l6918J4507
$$ 220123 155102 124074 120338 92910 57163 29704 44861 63478 56612 56908 19990 34497
19238C4497K1888K7318K3071k0096j8986j6817R20J7477J9811k0765m1718K2564
$$ 34497 56385 83703 106774 86678 67692 50875 51795 69272 89083 68318 26600 49164
19226D9164L6602j1102j1479k3125k6673k8594j8252l7803K4319N2423J5660k3460
$$ 49164 85766 74664 63185 40060 13387 -15207 -33459 -71262 -46943 5480 21140 -2320
19214b320l109J8477k1790j6434l225Q466j2103J1950N761M6144J9982k5921n0070
$$ -2320 -5429 13048 -8742 -25176 -28401 -19935 -32038 -20088 -14327 31817 51799 25878 -24192
19201b4192J6764K297M837K92J7822K5005q320J442j354L826J0330J2797k7336
$$ -24192 -7428 -5131 -294 -2 17820 42825 34505 35947 34593 38419 48749 61546 34210
19188C4210k8816J617j9005L7021J2599K0710R086j4980L3473L407L330n223j8495
$$ 34210 5394 7011 -11994 25027 37626 58336 67422 52442 85915 89322 92652 87429 68934
19175F8934l9949j6056O188j9406l355L3950N093m033J9789j6578j430j1431l2979
$$ 68934 28985 12929 19117 -289 -3644 30306 35399 31366 51155 34577 33147 21716 -11263
19162a1263J1458M2957m2199l7449O5420k1574K7603K4557J534j3511l7934L852
$$ -11263 195 43152 953 -36496 28924 7350 34953 59510 61044 47533 9599 13451
19150A3451K7564K7477J3209j3383k8703j0150k5224j9151M553J1610J9817o985
$$ 13451 41015 68492 81701 68318 39615 29465 4241 -14910 -10357 1253 21070 14085
19138A4085l731k5654l3917L0781N4215o857k2963k2833J452K4497J3788J5804
$$ 14085 10354 -15300 -49217 -18436 35779 28922 5959 -16874 -15422 9075 22863 38667
19126C8667L3993N66l0554l1440K8918M336j3441r974m2911K2873j6491J0183
$$ 38667 72660 73226 42672 11232 40150 44486 31045 21071 -21840 1033 -15458 -5275
19114e275M305j8243J5986K9272J29l5126J7761N41l251L7194q472k6101k4876
$$ -5275 -970 -19213 -3227 26045 26174 -8952 8809 9350 6099 43293 34821 8720 -16156
19101a6156K517K3437L1663l550O776j486K6170J2631j0829j5045m1554m5252
$$ -16156 -13639 9798 41461 37911 44687 43201 69371 82002 71173 56128 14574 -30678
19089c0678K1105L7982J0120k5515m908R07N143k0929J3956M912j325J1611P536
$$ -30678 -9573 28409 38529 13014 8106 9013 14156 -6773 7183 12095 10770 22381 29917
19076B9917k148l9109J0670k8518j0329M563J161J4783L0986K1908j603n7203
$$ 29917 27769 -11340 -670 -29188 -39517 -34954 -33793 -19010 11976 33884 32281 -24922
19064b4922l5798M2390K3986n1636k7110j937R415J4526O915P4374K0791K8377
$$ -24922 -60720 -18330 5656 -45980 -73090 -75027 -65612 -51086 -44171 30203 50994 79371
19052G9371J6386k6794n2629J6128j17Q705K5791J416k1286J6674J6150P923n108
$$ 79371 95757 68963 16334 32462 32345 41050 66841 68257 46971 63645 79795 87718 82610
19039H2610K3133p676j1571j741r367k5835l1391L2593N7902j709n856K0742j978
$$ 82610 105743 98067 86496 84755 75388 49553 18162 50755 108657 106948 101092 121834 119856
19026A19856o816J044J626M393J5348N840J0552n627j4477K5337M1310K2383l795
$$ 119856 113040 114084 115710 120103 135451 141291 151843 146216 131739 157076 198386 220769 216974
19013B16974K5282O5782L9747j3319j2337k8967N651K9754J7400N3909L8056J9774
$$ 216974 242256 308038 347785 334466 322129 293162 298813 328567 345967 399876 437932 457706
19001D57706L72J7108K7247M4122Q5861N2335K0544j0224m6047m9566n7575p9685
$$ 457706 458078 475186 502433 546555 632416 684751 705295 695071 649024 599458 541883 462198
18989D62198j09626q6340n2715m0451k6767p659J0642K2169k5366j4932q612j9793
$$ 462198 352572 266232 213517 173066 146299 138640 149282 171451 146085 131153 122541 102748
18977A02748k3713k6326K5724J5383K3753J0233q465L4466J735m513n818N7466
$$ 102748 79035 52709 78433 93816 117569 127802 119337 153803 155538 151025 145207 202673
18965B02673O7545K8202M0445L6852M4988J8573J2338j8228M355R092P2008O4554
$$ 202673 270218 298420 338865 375717 420705 439278 451616 433388 437743 446835 518843 583397
18953E83397O5896M4500M6879Q0968J27794J32579M6021k8308l6193j7575r7393
$$ 583397 649293 693793 740672 821640 949434 1082013 1128034 1099726 1063533 1045958 948565
18942I48565j41396j44691j21894j31431j09017n3900m3618l1869o032O717j65
$$ 948565 807169 662478 540584 409153 300136 246236 202618 170749 164717 171434 171269
18931A71269m070m9783l6444J8304L7Q083L945l6235L299j6138q278J9835Q093
$$ 171269 167199 117416 80972 99276 99313 107396 111341 75106 78405 62267 53989 73824 81917
18918H1917j788l1468K4868k2172j16L7843M8810J608j322l8655j6418Q357J2774
$$ 81917 80129 48661 73529 51357 51241 89084 137894 139502 138180 99525 83107 91464 104238
18905A04238R073P7441P0980O5712M7166R716M1658K9006K3720L0154M1257q0924
$$ 104238 113311 190752 261732 327444 374610 384326 425984 454990 478710 508864 550121 469197
18893D69197j23725n9316j7196j6504l1430j7220N647l2549q1365m3251J4485
$$ 469197 345472 286156 268960 252456 221026 203806 209453 176904 95539 52288 66773
18882F6773J5083J7449K5l210j0544k2232J2617j1777K4488J5867M457J94l7798
$$ 66773 81856 99305 99330 96120 85576 63344 75961 64184 88672 104539 108996 109190 71392
18869G1392j0876o496Q532J2473O707n2755L8534L6716O004j5166k5840P410M760
$$ 71392 60516 54020 62552 75025 81732 28977 67511 104227 110231 95065 69225 76635 81395
18856H1395K69J3274n80k0972J8285J4581k7612j7806J5192k1565j0919J3799
$$ 81395 81664 94938 94358 73386 91671 106252 78640 60834 76026 54461 43542 57341
18844E7341J0181Q372J3029p027J4943j0477l4448l3039k1074M4047N0251q071
$$ 57341 67522 75894 88923 81896 96839 86362 51914 18875 -2199 41848 92099 84028
18832H4028m403j2225k5763J2034M4010K960j9994p800Q729q743K1123J313j5352
$$ 84028 79625 67400 41637 53671 97681 100641 80647 72847 81576 72833 93956 95269 79917
18819G9917k7666L5756N1949k3459l2583O493J9432J6120K3859k2934k4150J1562
$$ 79917 52251 88007 139956 116497 83914 90407 109839 125959 149818 126884 102734 114296
18807A14296P569n175n488k8225k7605k0085l3067K8987K1562K5407j0184K0896
$$ 114296 121865 116690 111202 82977 55372 35287 2220 31207 52769 78176 67992 88888
18795H8888M7007J1587J7706K4884n22j3705k1947m7912k4953k5237J9975R559
$$ 88888 135895 147482 165188 190072 189550 175845 153898 105986 81033 55796 75771 85330
18783H5330J0006n79M8507P3560L4262J8832n061j2165p407j6575j3392J1154
$$ 85330 95336 94757 143264 216824 251086 269918 264857 252692 245285 228710 215318 226472
18771B26472M4025L8775Q3652J41798J41383O0209j36748j44955j13687q9707
$$ 226472 270497 309272 392924 534722 676105 736314 599566 454611 340924 251217
18761B51217j2010L4159l82l1529o8035o2928n361k6566O311J6525L9227k0318
$$ 251217 239207 273366 272984 241455 173420 110492 105131 78565 84876 101401 140628 120310
18749A20310m9225l3604M6134K3746N7595r58M128L6L7818m0269q290K4329N833
$$ 120310 71085 37481 83615 107361 164956 163998 168126 168162 205980 165711 157421 181750 187583
18736A87583j2028L7363K4985M927j2325k6300L3328O9175O4197L4060l539k3565
$$ 187583 175555 212918 237903 242830 230505 204205 237533 306708 370905 404965 401426 377861
18724C77861q6348k7013L557l3614o653M1706O2434M7644p39l6455n6052m2670
$$ 377861 291513 264500 268057 234443 227790 269496 331930 379574 378835 342380 286328 243658
18712B43658n0380m903K6543P265k2379o502k2428j5838j0130j5208m637K2622
$$ 243658 193278 188375 214918 222183 199804 193302 170874 155036 144906 129698 125061 147683
18700A47683O0803J4454k3800P285L2409O3560K1322l9488l8725j5116k2446k1472
$$ 147683 208486 222940 199140 206425 238834 302394 323716 284228 245503 230387 207941 186469
18688A86469L7223L3119K7968P720j645n136L637j5317m0759l2367N3893N8228
$$ 186469 223692 256811 284779 292499 290854 285718 289355 274038 233279 200912 254805 313033
18676C13033L1773l3432j4736k0462K4600L6202L2450J3139J1154j4998k9193
$$ 313033 344806 311374 296638 276176 300776 336978 369428 382567 393721 378723 349530
18665C49530L0245L664l3718j3752K0924J2102k1635r059p334K721M2404P0318
$$ 349530 379775 383439 349721 335969 356893 368995 347360 338301 330967 333688 376092 446410
18653D46410J4285O3694M6036l0539q0939m4040p209j3187k3963K0817K2988M1659
$$ 446410 460695 524389 570425 539886 458947 414907 407698 394511 370548 391365 414353 456012
18641D56012L6785P218l8480m4701l9385M491q879Q477J4364j4505K3924J566
$$ 456012 492797 500015 461535 416834 377449 381940 373061 381538 395902 381397 405321 406887
18629D06887m5873J227Q181k9308r789J1916J78J039J9257k0683J9960Q834j3689
$$ 406887 361014 362241 370422 341114 331325 343241 343419 344458 363715 343032 362992 371826 358137
18616C58137k5284J5822M193R43O786k9647j2573J8648K5159K0708M1024N2252
$$ 358137 332853 348675 352868 353811 360597 330950 318377 337025 362184 382892 423916 476168
18604D76168J1147J0841J4829J7611K9311J2459K5419R600M1840M8886N8310L9212
$$ 476168 487315 498156 512985 530596 559907 572366 597785 607385 649225 698111 756421 795633
18592G95633R227k4526P0502P7264N0506L5024K4887L5508N8349J09716P5260
$$ 795633 804860 780334 850836 928100 978606 1013630 1038517 1074025 1132374 1242090 1317350
18581A317350N0885R458J2090Q3176K3207o5179r7453j4112k3718N636K6269l986
$$ 1317350 1368235 1377693 1389783 1472959 1496166 1430987 1333534 1319422 1295704 1301340 1327609 1323623
18569A323623o1414m6364m1710J4295r195q7399p7562n3832r802J418k7122l4343
$$ 1323623 1262209 1215845 1174135 1188430 1179235 1091836 1014274 960442 950640 952058 924936 890593
18557H90593k2535J3110M2538M943J3999K7370M8638Q2598J32998J51111K15756
$$ 890593 868058 881168 923706 928649 942648 970018 1018656 1101254 1234252 1385363 1601119
18546A601119J85162J2684m1456k6906P49L985J9189N4142M7444Q9529J13605
$$ 1601119 1786281 1798965 1757509 1730603 1731352 1735337 1754526 1808668 1856112 1945641 2059246
18535B059246J69254K82783M39106O57040R13185Q18925N77114L37442k57056
$$ 2059246 2228500 2511283 2950389 3607429 4520614 5339539 5916653 6254095 5997039
18526E997039n59210m92053j95883J70513M55314P00626Q66389J137388J590324
$$ 5997039 5437829 4945776 4749893 4920406 5375720 6076346 6942735 8080123 9670447
18517I670447K275602K370627J535790J663469K172132J98596j903953j457560
$$ 9670447 11946049 14316676 15852466 17515935 19688067 19886663 17982710 16525150
18509A6525150p01760q20017k12043Q71351R76860P85637J478725J318074r13137
$$ 16525150 15823390 15003373 14791330 15662681 16639541 17425178 18903903 20221977 19308840
18500A9308840j764502j266419j372402j533122j051687m53093L8835M58394Q98199
$$ 19308840 17544338 16277919 14905517 13372395 12320708 11867615 11906450 12364844 13263043
18491A3263043J443825J887448J992528K236589K922700M566552P502601J1846677
$$ 13263043 14706868 16594316 18586844 20823433 23746133 28312685 35815286 47661963
18483D7661963J6865084J9306935J9537182J8836038J0632315P503074J3459257
$$ 47661963 64527047 83833982 103371164 122207202 132839517 140342591 153801848
18476A53801848K4418615J8729801p090483p428882Q866873K3984075K6584351
$$ 153801848 178220463 196950264 189859781 182430899 191297772 215281847 241866198
18469B41866198R855669l2492788m7948226l2325098j5275999j2437668j4327531
$$ 241866198 251721867 219229079 171280853 138955755 123679756 111242088 96914557
18462I6914557j0657950p518535p286029m380341M82250K042818K428586N752516
$$ 96914557 86256607 78738072 71452043 67071702 67553952 69596770 72025356 77777872
18454G7777872M614926n080556r283440p793073q920503j0203703q525515n904159
$$ 77777872 82392798 77312242 68028802 60235729 51315226 41111523 32586008 26681849
18446B6681849l787677k348064j361311n76495K37871R62421J894961L303234
$$ 26681849 22894172 20546108 19184797 18608302 18846173 19808594 21703555 25006789
18438B5006789N538924R361162J5172565K1481224K1959856J1544724o82448j731007
$$ 25006789 30545713 39906875 55079440 76560664 98520520 110065244 109382796 107651789
18430A07651789N001079L576492j0813063k2275078k3486726j7462314j1104604
$$ 107651789 112652868 116229360 105416297 83141219 59654493 42192179 31087575
18423C1087575o849594m119040k723135k705293k588916k048894j536268j140572
$$ 31087575 24237981 20118941 17395806 14690513 12101597 10052703 8516435 7375863
18415G375863q21222n69212l27810k18194j61582j89625k21735k29901k34444
$$ 7375863 6554641 5985429 5657619 5439425 5277843 5088218 4866483 4636582 4402138
18406D402138k64182l35805k85935k88967j71476j13916o8286K217J07866J48627
$$ 4402138 4137956 3802151 3516216 3227249 3055773 2941857 2873571 2875788 2983654 3132281
18396C132281J61796J84352K80061L79074N35315P67160J305781K214738L583285
$$ 3132281 3294077 3478429 3758490 4137564 4672879 5440039 6745820 8960558 12543843
18387A2543843N251188N570846K787307o65383j321050L71864O10725k475307
$$ 12543843 17795031 23365877 26153184 25487801 24166751 24538615 25149340 22674033
18379B2674033n021233m930556l487163k199181j428645r80640p17075n01886
$$ 22674033 17652800 12722244 9235081 7035900 5607255 4626615 3909540 3407654
18371C407654m69769m59825l22937k60772j99856q8745j8867K7464m3083p4299
$$ 3407654 2937885 2478060 2155123 1894351 1694495 1605750 1586883 1614347 1571264 1496965
18361A496965k0838m7415p3456r9036r8914j08392o4449j9697m6234j03068n1736
$$ 1496965 1476127 1428712 1355256 1256220 1157306 1048914 984465 964768 918534 815466 763730
18350G63730j7502k693k6615n3190l2135k4364J2332K6719K631J470K0917o777
$$ 763730 746228 743535 716920 663730 631595 607231 619563 646282 648913 650383 671300 664523
18338F64523m9721K8450L5874l402n799M8920J02320J09395J35316J60332P6319
$$ 664523 614802 643252 679126 675724 669925 718845 821165 930560 1065876 1226208 1302527
18327A302527K7118j4369m5819j42062j97347j97960j34972n9361n3180l7779
$$ 1302527 1329645 1315276 1269457 1127395 930048 732088 597116 537755 484575 446796
18317D46796k9657j8119k2557k3311l4163j4581j542O68R859l0544m639l4579
$$ 446796 417139 399020 376463 353152 318989 304408 302866 303534 313393 282849 278210 243631
18305B43631m2038K8040L9640K5691k7536J7172J6224J534J686k0225j6686j0420
$$ 243631 201593 229633 269273 294964 267428 284600 300824 302358 304044 283819 267133 256713
18293B56713j025j859J0276L9570J5231J6305J7095L1056N4097N1178O7237J34884
$$ 256713 255688 253829 264105 303675 318906 335211 352306 383362 437459 488637 555874 690758
18281F90758J17562o583m2364p757n0970m9180o7965p0087l9978q9708p5815j842
$$ 690758 808320 801737 759373 751616 700646 651466 583501 513414 473436 383728 307913 306071
18269C06071m842q849J038J7700K8643K7446Q990K5063l570j8733L77q756K3718
$$ 306071 301229 292380 293418 311118 339761 367207 376197 401260 397690 378957 379334 370578 394296
18256C94296L4827N146k733J2033m7554k7210k2105N632j9895k9929K4886N446
$$ 394296 429123 434269 431536 443569 396015 368805 346700 352332 332437 302508 327394 332840
18244C32840m065k3300J120P291N5155Q547M2883P1751Q2159R4242P9742L3666
$$ 332840 328775 305475 306595 313886 369041 377588 420471 492222 574381 668623 748365 782031
18232G82031M8393M2270j3405J9334O4216L0206j191j7944O0911N9109p6898r2729
$$ 782031 830424 872694 859289 878623 942839 973045 971854 953910 1014821 1073930 997032 904303
18220I04303p7040k5392J072k8330k2946o990j2113j6028K18k3165n9650l6982
$$ 904303 827263 801871 802943 774613 751667 744677 732564 716536 716754 693589 633939 596957
18208E96957k8796o2965m2891j0046k6978k3890l4464p4418P835K2729k0845m4657
$$ 596957 568161 505196 462305 452259 425281 401391 366927 292509 300344 323073 302228 257571
18196B57571R125m062k8384K9780K8673j1921K7071Q9097N9812J5692J7198K1738
$$ 257571 266696 262634 234250 264030 292703 280782 307853 396950 456762 472454 489652 511390
18184E11390L8106k411Q757M6141P287m8425R641P715N8154J3257k8414k3135
$$ 511390 549496 547085 555842 601983 609270 560845 570486 578201 636355 649612 621198 598063
18172E98063l1894l7349O649M907k8592j6543K099j6501m6026k5902J5358k0896
$$ 598063 566169 528820 535469 540376 511784 495241 497340 480839 434813 408911 424269 403373
18160D03373K4202k3210k3726j2715K0249L6883J9424n457J2651j5889n2118p770
$$ 403373 427575 404365 380639 367924 388173 425056 444480 439023 451674 435785 383667 375897
18148C75897j8672R623M0078K9695L803J0902J7985M3054N4418O0692M0528J5079
$$ 375897 357225 366848 406926 436621 440424 451326 469311 512365 566783 627475 668003 683082
18136F83082k0979J9435K5553K9328J6065J5849M4592Q8095R1128J04058J08644
$$ 683082 662103 681538 707091 736419 752484 768333 812925 901020 992148 1096206 1204850
18125A204850J05472J19859J81283J93194K47446K64690L21068L84145N85507
$$ 1204850 1310322 1430181 1611464 1804658 2052104 2316794 2637862 3022007 3607514
18116C607514Q59359J187268J732345K763415M838502Q779399J6045163K8267156
$$ 3607514 4466873 5654141 7386486 10149901 14988403 23767802 39812965 68080121
18108F8080121K9903828j1793703l1018305k1862152j2110996o732230l991755
$$ 68080121 97983949 86190246 55171941 33309789 21198793 14466563 10474808
18101A0474808k539935j669087j206970q66305o91902n31002m26847l31743k19765
$$ 10474808 7934873 6265786 5058816 4192511 3500609 2969607 2542760 2211017 1991252
18092A991252j41624j25944j47883j18947r0031q4235k6591l2195n6202n7818
$$ 1991252 1849628 1723684 1575801 1456854 1366823 1282588 1255997 1223802 1167600 1109782
18082A109782j26574p5383k9423k7122o4156o8739k5994K791j2648k4479p983
$$ 1109782 983208 907825 878402 851280 787124 718385 692391 695182 682534 658055 650072
18071F50072K5564j3214m0648k040K2844M1725q92j8049J69J6921M0172j6603
$$ 650072 675636 662422 621774 619734 642578 684303 683411 665362 665531 682452 722624 706021
18059G06021k301K557L2671M0968j8285j374L491M4279N3152L9408N0012J191
$$ 706021 703720 706277 738948 779916 761631 760257 763748 808027 861179 900587 950599 951790
18047I51790J6054o1R194R9601J12560Q9558Q5998J0941L3739J02930J66892J77720
$$ 951790 967844 967783 976977 1076578 1189138 1278696 1364694 1375635 1409374 1512304 1679196 1856916
18035A856916J88462J49331J44659J86222K37252K81242L16527M58261N86957
$$ 1856916 2045378 2194709 2339368 2525590 2762842 3044084 3360611 3818872 4405829
18026D405829Q05530J164833J593499J953762K406514L708420O380835J0876762
$$ 4405829 5211359 6376192 7969691 9923453 12329967 16038387 22419222 33295984
18018C3295984J8527855L0875133L7404800P570232k9991205l3219379k1882268
$$ 33295984 51823839 82698972 120103772 127674004 97682799 64463420 42581152
18011D2581152j2833776p755600m877424l048991j819103j005107n20824n82663
$$ 42581152 29747376 21991776 17114352 14065361 12246258 11241151 10720327 10137664
18003A0137664q39559o84181l32189O6902L14280M49938O23241R69695J561074
$$ 10137664 9298105 8613924 8281735 8348637 8662917 9112855 9736096 10705791 12266865
17994A2266865K371331L205217L888277N085290Q221026J4199792K4123846M1008864
$$ 12266865 14638196 17843413 21731690 26816980 35038006 49237798 73361644 114370508
17986A14370508O4946449O2793022q148440o3924198n9066109l7518162k2283650
$$ 114370508 179316957 242109979 233961539 170037341 110971232 73453070 51169420
17979E1169420j3679250q696089n600028l543418k172158j685534j959118k023182
$$ 51169420 37490170 28794081 23194053 19650635 17478477 15792943 13833825 11810643
17971A1810643j617624j104971o71798l78605k29421q9428K25404O18898J111407
$$ 11810643 10193019 9088048 8416250 8037645 7808224 7718796 7944200 8563098 9674505
17962I674505J537985J817603K565682M430143P682273J3236455K2709288L4551221
$$ 9674505 11212490 13030093 15595775 20025918 27708191 40944646 63653934 98205155
17954I8205155K6085084j4369197l4195866k6935801j6226051r584013n940112
$$ 98205155 124290239 109921042 75725176 48789375 32563324 22979311 17039199
17947A7039199l790167k438686j600023j067143r14285j034163j011607q17641
$$ 17039199 13249032 10810346 9210323 8143180 7228895 6194732 5183125 4365484
17939D365484n97217m48921l42102k51373k42122k09875r6281K2043K8253l0194
$$ 4365484 3768267 3319346 2977244 2725871 2483749 2273874 2177593 2199636 2227889 2197695
17929B197695l8584q4340j16800r6436j50010k06650k24518j42790r0379p3537
$$ 2197695 2159111 2074771 1957971 1861535 1711525 1504875 1280357 1137567 1047188 973651
17919I73651o7796m410j5589m2313j5037l7780n7093l8599l6148l7594m0441o353
$$ 973651 905855 901445 885856 843543 828506 790726 733633 695034 658886 621292 580851 574498
17907E74498k6214p0568l2773J819L1814n53l3044l1367k5031k9396j536N233
$$ 574498 548284 477716 444943 446762 478576 478023 444979 413612 388581 359185 357649 362882
17895C62882l122J6897K8166k9943l2053N2806M8411N0954J6840p8664n1681O492
$$ 362882 359760 376657 404823 374880 342827 395633 444044 494998 511838 433174 381493 387985
17883C87985M4744P2521M1884N0293K0945o9088r5198m9378j3166k5154n515k2697
$$ 387985 432729 505250 547134 597427 618372 549284 454086 404708 391542 366388 360873 338176
17871C38176l3383j0307m3486n8130j4775q640k7640J4970k8502j6252R226J2607
$$ 338176 304793 294486 251000 192870 178095 169455 141815 156785 128283 112031 121257 133864
17859A33864l434R095L6724k9451K569j1857Q917k4623P286K2284r730N691J093
$$ 133864 130430 139525 176249 146798 149367 137510 146427 121804 129090 151374 141644 147335 148428
17846A48428J4531n150P284k5373k2453j5558Q329K3433J8717l9690n0064r264
$$ 148428 162959 157809 165093 139720 117267 101709 110038 133471 152188 112498 62434 53170
17834E3170Q939k7887J722O185j759K0798J0538j5744R295M1428L8721m6983l3826
$$ 53170 62109 34222 35944 42129 40370 61168 71706 55962 65257 106685 145406 98423 64597
17821F4597m4908j2961J363K1812K8445j1718j4096j9211k214P696k677j0810
$$ 64597 19689 6728 8091 29903 58348 46630 32534 13323 11109 18805 16128 5318
17809E318l6129n440p984K845O547K6241N8130N059m947j0519n926j547L8929
$$ 5318 -30811 -36251 -44235 -41390 -34843 -8602 49528 54587 49640 39121 33195 31648 70577
17796G0577O850J8563K9336J1626J0397l4633l4023l0454j1492l699J2613o108
$$ 70577 77427 95990 125326 136952 147349 112716 78693 48239 36747 33048 45661 39553
17784C9553k3921R788j2587K359L5690k8672l1337O547Q314J1844Q678J0569M5972
$$ 39553 15632 25420 12833 15192 50882 22210 -9127 -2580 5734 17578 26256 36825 82797
17771H2797o230j5266m838L892j2713k0476l7516N476j1012j922O158K5154L6290
$$ 82797 76567 61301 56463 60355 47642 27166 -10350 -4874 -15886 -17808 -11650 13504 49794
17758D9794l0386l0221N0955J4916m9165l1419k9562M1759M9937j1966O222J3169
$$ 49794 19408 -10813 40142 55058 5893 -25526 -55088 -13329 36608 24642 30864 44033
17746D4033N205m408L009L3455K919j9075k5364p208j9998l603L3018J6854m0766
$$ 44033 49238 44830 47839 81294 84213 65138 39774 32566 12568 8965 41983 58837 18071
17733A8071j7809L3732O720J3280J671l7372J2264R125l6385M1026L8846m0686
$$ 18071 262 33994 40714 53994 55665 18293 30557 39682 3297 44323 83169 42483
17721D2483q265l0288K7135O0690p77l1935Q104m8949m9680j840J0847k0050k7853
$$ 42483 34218 3930 31065 91755 90978 59043 67147 18198 -31482 -33322 -22475 -42525 -70378
17708g0378K5442K2476J9924k0635m561J8942k9891m875K9382k616k4467k9946
$$ -70378 -44936 -22460 -2536 -23171 -27732 -8790 -38681 -43556 -14174 -16790 -41257 -71203
17696g1203J4953K3158J1807o522n385l5920o747O3978J7411l4255m1389N0012
$$ -71203 -56250 -33092 -21285 -27807 -33192 -69112 -75859 -11881 5530 -28725 -70114 -20102
17684b0102Q8676M991n2549k9479k8969J9995k775o581J3335J5385k3740k0093
$$ -20102 68574 73565 21016 -8463 -37432 -17437 -20212 -26793 -13458 1927 -21813 -41906
17672d1906L0005J7180o568j3331o772L861J8650J5093j1455k7548k862j2564
$$ -41906 -11901 5279 -1289 -14620 -21392 -17531 1119 16212 4757 -22791 -25653 -38217
17660c8217J2018j947J2058k3207k2495L2403O2057p180j5773j0012J4110J8774
$$ -38217 -26199 -28146 -16088 -39295 -61790 -29387 32670 25490 9717 -295 13815 32589
17648C2589J2393J6432k5467j8492L673L776m2010R601J8344R029k6063k1772
$$ 32589 44982 61414 35947 17455 21128 24904 -17106 -7505 10839 19868 -6195 -27967
17636b7967L997Q950j1834p958j3565j8175l178j5793l4589O4173P2768k005J4921
$$ -27967 -23970 -15020 -26854 -34812 -48377 -66552 -69730 -85523 -120112 -55939 16829 14824 29745
17623B9745J4165k1872M2116r328j7900q241M520J4708m1290k2706k326k1595
$$ 29745 43910 22038 64154 54826 36926 28685 33205 47913 6623 -16083 -18409 -40004
17611d0004M1472l4968l6042n434k3914j9832L4497R707J0108j0442j4775J2276
$$ -40004 1468 -33500 -69542 -74976 -98890 -118722 -84225 -74518 -64410 -74852 -89627 -77351
17599g7351j807M9352j7945j4269j451J3413N964j1245o702p501k147j294L914
$$ -77351 -79158 -29806 -47751 -62020 -63471 -50058 -44094 -55339 -62041 -69542 -71689 -72983 -69069
17586f9069J6020R976L1909J512j7913l3989l0158j0495J5494L0523k2774k4671
$$ -69069 -53049 -43073 -11164 -9652 -27565 -61554 -91712 -102207 -86713 -56190 -78964 -103635
17574a03635m465N9051p897p5275J1126M2120k0350l1865r215P0723J6227k2580
$$ -103635 -108100 -49049 -56946 -132221 -121095 -78975 -99325 -131190 -140405 -69682 -53455 -76035
17562g6035Q284K2997L7285J7174k0067k6276J891J7740K2117m0287j5394l5239
$$ -76035 -67751 -44754 -7469 9705 -10362 -36638 -34747 -17007 5110 -35177 -50571 -85810
17550h5810K9769O1330J0710k1655j4930J0940J0772J2454K5164M037l2239l743
$$ -85810 -56041 5289 15999 -5656 -20586 -9646 1126 13580 38744 42781 10542 6799
17538F799k1198O684J9076k747R828K2920L1479M24n4574L24R424K511k2423J3851
$$ 6799 -14399 -7715 11361 8614 18442 41362 72841 73265 18691 19015 28439 30950 8527 22378
17524B2378J2714L806P594j4355l855j6168J0994l8172j6829L8202L0254q168
$$ 22378 35092 38898 46492 32137 28282 12114 23108 -15064 -31893 6309 36563 28395
17512B8395j7829R086j2161O905j7179j4237L548r526L2129M274n5685J1126L8476
$$ 28395 10566 19652 7491 14396 -2783 -17020 -13472 -22998 9131 13405 -42280 -31154 7322
17499G322M875M811j4564K9961K2788m0513J575M9216O680r761J5248k2765n145
$$ 7322 12197 17008 2444 32405 55193 14680 16255 65471 72151 62390 77638 54873 49728
17486D9728M182N440k6774R842M2468P5090J21471J75487J28518k5040j53161
$$ 49728 53910 59350 32576 42418 84886 159976 281447 456934 585452 560412 407251
17475D07251j22125j11793l8066k6649m2178p7934J6961L1859L3622j3554l510
$$ 407251 285126 173333 135267 108618 66440 -11494 5467 37326 70948 57394 53884
17464E3884J5589j3497n2248j8760J5374J6422M0380R243K2452J842M1840L4169
$$ 53884 69473 55976 3728 -15032 342 16764 57144 66387 88839 90681 132521 166690
17452A66690K4617J06629J57927K63725L00226J92562o0016k48296k12003r3011
$$ 166690 191307 297936 455863 719588 1019814 1212376 1152360 904064 692061 599050
17442E99050O1113J3567j67333k23219j49229k8097k9123N1825j6155k6217l2237
$$ 599050 660163 673730 506397 283178 133949 105852 76729 128554 112399 86182 53945
17431E3945k9641n010j7293J9778m084j9360Q448M6343O414L5605M7598M4958
$$ 53945 24304 19294 2001 21779 17695 -1665 6783 53126 59540 95145 142743 187701
17419A87701O6084J05329J60540O3354q2015j09848j01972q0559n2669k7185n494
$$ 187701 253785 359114 519654 583008 500993 391145 289173 208614 155945 128760 123266
17408A23266R474o8158o1823J4585J5083l2478m2059j826L264j0619k092k2104
$$ 123266 132740 64582 2759 17344 32427 -51 -42110 -43936 -40672 -51291 -53383 -75487
17396g5487m587N6503J5753M477j2106l0117m9411J6092O3350K3596l3949J2933
$$ -75487 -80074 -23571 -7818 -3341 -15447 -45564 -94975 -78883 -15533 8063 -25886 -12953
17384a2953j50r729M4045J6691j7324j5074K2316j5663j8521m67k1767j1402n136
$$ -12953 -13103 -22832 21213 37904 20580 5506 27822 12159 -6362 -6829 -28596 -39998 -45134
17371d5134K0047K9349O504J6643O0401R740o031j4657N88j8030j3231k5967m0664
$$ -45134 -25087 4262 10766 27409 87810 97550 91519 76862 77450 59420 46189 20222 -20442
17358b0442n285k2605K035Q408J1804M1273L687j4642j4101k4557j8552K8299
$$ -20442 -25727 -48332 -46297 -37889 -26085 15188 18875 4233 -9868 -34425 -52977 -24678
17346b4678M0065j0407j2286m222J9718n075k6431N875K38m566J7235j7929l0450
$$ -24678 15387 4980 -7306 -11528 8190 3115 -23316 -17441 -17203 -21769 -4534 -22463 -52913
17333e2913L367L8334J5956l9561l6627M5625K0346k4804o356L4918p18k2129
$$ -52913 -49546 -11212 4744 -34817 -71444 -25819 -5473 -30277 -36633 -1715 -2433 -24562
17321b4562j0565j7469l2512J4559o955k2515J671k293M0386M4425q645Q349j2834
$$ -24562 -35127 -52596 -85108 -70549 -77504 -100019 -98348 -100641 -60255 -15830 -24475 -16126 -28960
17308b8960J4040O319R052J3801j5302k2996r578R855m5335j0720J6585K0123
$$ -28960 -14920 -8601 451 14252 -1050 -24046 -33624 -23769 -69104 -79824 -63239 -43116
17296d3116q022m0874O596J3028O231Q0045P0807J6252o0444j7856j0097k4006
$$ -43116 -51138 -92012 -85416 -72388 -66157 13888 84695 100947 40503 22647 12550 -11456
17284a1456K2916J4034p163j8019N258K5320K8036m2403n1507Q833M4160l811
$$ -11456 11460 25494 18331 312 5570 30890 58926 16523 -34984 -26151 18009 14198
17272A4198j6432j2336j894Q624j0057m2119n579K2887l5888n571P2821L9402
$$ 14198 -2234 -14570 -16464 -7840 -17897 -60016 -65595 -42708 -78596 -84167 -11346 28056
17260B8056Q938J4072k1085k8251O238M2656j1155n4458l255L252l1108J6669
$$ 28056 36994 51066 29981 1730 7968 50624 39469 -14989 -18244 -14992 -46100 -29431
17248b9431J3424k3626j1735J1884K6297m1714J8504r682j6785k114K2406K4740
$$ -29431 -16007 -39633 -51368 -39484 -13187 -54901 -36397 -46079 -62864 -64978 -42572 -17832
17236a7832j8670k9517K1756O116J0759J6465N366J577N917j4226l5800L1384
$$ -17832 -36502 -66019 -44263 -38147 -27388 -10923 -5557 -3980 1937 -12289 -48089 -16705
17224a6705J8646m3704l5286N0129O1756o66p398k4170m8330l9771n987L9859
$$ -16705 1941 -41763 -77049 -26920 34836 34170 26772 2602 -45728 -85499 -91486 -51627
17212e1627Q212J2382K3521m8797K102L2242q610j7127m8p205r534q186j1377
$$ -51627 -43415 -31033 -7512 -56309 -54207 -21965 -30575 -47702 -47750 -54955 -64489 -72675 -84052
17199h4052N8246K7137j7204o402j6447L664k293N774j713J4193J4861K1804j0765
$$ -84052 -25806 1331 -15873 -22275 -38722 -35058 -37351 -31577 -33290 -19097 -4236 17568 6803
17186F803J0958J1771O074J7080j4273n984k7447p376J4056o738k2550q383J9730
$$ 6803 17761 29532 35606 52686 38413 32429 4982 -2394 11662 4924 -17626 -26009 -6279
17173f279K5970L4248m975m9937J947k0261K286L9504K239j9544k7048j7371P587
$$ -6279 19691 53939 48964 -973 974 -19287 -17001 22503 24742 5198 -21850 -39221 -31634
17160c1634n7991n301N7510J3790Q64J9898j3721m8856J8409J9159K4611n9634
$$ -31634 -89625 -94926 -37416 -23626 -22762 -2864 -16585 -65441 -47032 -27873 -3262 -62896
17148f2896j8033N355J8266M2892K129J745K0035L185N920K4031m3866l3285j3307
$$ -62896 -80929 -75574 -57308 -14416 -12287 -10542 9493 12678 18598 42629 -1237 -34522 -47829
17135d7829K1291L2370R727j3884j4620K9549J4549l0115K0379Q691O55n3519
$$ -47829 -26538 5832 15559 1675 -12945 16604 31153 1038 21417 30108 30763 -22756
17123b2756m4699M4410J5090M450j306J8275J93J8946q681n1072j7108M596k1646
$$ -22756 -67455 -23045 -7955 -3505 -4811 13464 13657 32603 23922 -27150 -44258 -39662 -61308
17110f1308m80M467n268O344M4605N0681k0179j6017J5769K2140k1243J1473k3638
$$ -61308 -61788 -57321 -62589 -56245 -11640 39041 18862 2845 18614 40754 19511 30984 7346
17097G346l554k8579k7705J6346J9477L6585J4116k5614q740m7751k350j408o85
$$ 7346 3792 -24787 -52492 -36146 -16669 19916 34032 8418 -322 -48073 -50423 -51831 -52516
17084e2516Q163J350K4468J099l101k3635O155k87K2526j7685j8694l194L467
$$ -52516 -44353 -43003 -18535 -17436 -20537 -44172 -38017 -38304 -15778 -33463 -52157 -55351 -51884
17071e1884L8946O422L567j2785K224j5036j9162L7955K2699k5899m2645m945
$$ -51884 -12938 -6516 -2949 -15734 -13510 -28546 -47708 -9753 12946 -12953 -55598 -60543
17059f0543L6196L2968J1695J8266j1785L1878j0026N659m984p854l7600L69j6522
$$ -60543 -24347 8621 20316 38582 26797 58675 48649 54308 49324 41470 3870 4239 -12283
17046a2283O262J42j4516K39Q968K488j0055O696M321J3826J4695l2702j3773
$$ -12283 -6021 -5879 -20395 -20156 -11188 -8700 -18755 -12059 -7738 6088 20783 -11919 -25692
17033b5692j0831l067M7240L4470k1694Q155p848j7522m205M680R52k1986j3857
$$ -25692 -36523 -39590 7650 42120 20426 28581 20733 3211 -994 3686 4638 -17348 -31205
17020c1205J5760l697R642N157K6127k6557j1388r162l4417l056L0713J481m3011
$$ -31205 -15445 -19142 -9500 -4343 21784 -4773 -16161 -25323 -59740 -62796 -32083 -30602 -73613
17007g3613k3723j369K7879m37r78j7352K8243M4203L4455k1060p092R864K0131
$$ -73613 -97336 -98705 -70826 -71263 -72241 -89593 -61350 -17147 17308 -3752 -10844 -980 19151
16994A9151j702J4706p892l1141j7682K998p102j9483L3416M2777n623k0256k9517
$$ 19151 17449 32155 24263 -6878 -24560 -21562 -28664 -48147 -14731 28046 22423 2167 -27350
16981b7350J329k65J0692l2879k037R383L2595J5851l4298k6627l299L3320N783
$$ -27350 -26021 -26286 -15594 -48473 -50510 -41127 -8532 7319 -26979 -53606 -56905 -23585 -17802
16968a7802j0404l176J2203l8610R935R677j1308K3450Q114j780j3663j6855J3133
$$ -17802 -28206 -31382 -19179 -57789 -47854 -38177 -49485 -26035 -17921 -19701 -33364 -50219 -37086
16955c7086J5884J1474j4859M641K1952K6774J1794N138k9807j7693k4338j4156
$$ -37086 -21202 -9728 -24587 -19946 2006 28780 40574 45712 15905 -1788 -26126 -40282
16943d0282J0217L5517k1188j9125M2400L1836k8918l1305k9230j8001k493J9745
$$ -40282 -30065 5452 -15736 -34861 7539 39375 10457 -20848 -50078 -68079 -70572 -50827
16931e0827j167j1762k42q036N044p057J373l7251J4584M5191o243J156K7582
$$ -50827 -51994 -63756 -63998 -72034 -66990 -74047 -72674 -109925 -95341 -50150 -56393 -55237 -27655
16918b7655j566k6207o158R045M999K1071K7666j5839j6192j1712L6422J3765
$$ -27655 -29221 -55428 -61586 -52541 -47542 -26471 1195 -14644 -30836 -42548 -6126 7639
16906G639Q36o815j949j5457Q18N094K5648n116K0599n542j3766k8695J0732O052
$$ 7639 8475 1660 -289 -15746 -14928 -9834 15814 10698 31297 25755 11989 -16706 -5974 78
16892G8K3597J5403l1944j9012O782R318M850j4208j9058p79J0170N335k0598
$$ 78 23675 39078 7134 -11878 -5096 4222 9072 -5136 -24194 -24973 -14803 -9468 -30066
16879c0066M81L5009l1549j5505O848m93k5454o530P7487L8628j092n4439l4606
$$ -30066 -29585 5424 -26125 -41630 -34782 -35275 -60729 -67259 10228 48856 47764 -6675 -41281
16866d1281j4463l0768j3309J6622J0338m18R589o883J3747K1041j1205j8420
$$ -41281 -55744 -86512 -99821 -83199 -72861 -73279 -63690 -70573 -56826 -35785 -46990 -65410
16854f5410j9263m471L0740L8638j6926k1311J6098n358M1429j596j2816l1152
$$ -65410 -84673 -89144 -58404 -19766 -36692 -58003 -41905 -47263 -5834 -7430 -20246 -51398
16842e1398j7330R237Q603k0566M002O264k5354L3067M3218K3646r147j0332M4103
$$ -51398 -68728 -59491 -50888 -71454 -67452 -61188 -86542 -53475 -10257 13389 4242 -6090 38013
16829C8013k7351p981k6210k063J6360L368k4236K781j3069l2771j4029n346j9768
$$ 38013 10662 2681 -23529 -25592 -9232 -5864 -30100 -27319 -40388 -73159 -87188 -92534 -112302
16816a12302n507M6596L6812O777P018j2753N510m739k1810K3701M4608N806P34
$$ -112302 -117809 -71213 -34401 -27624 -20606 -33359 -27849 -32588 -54398 -30697 13911 19717 20451
16803B0451l2976r530L5474Q446k1927M481K2024k2233J5337n415j0626J3198
$$ 20451 -12525 -22055 13419 21865 -62 4419 26443 4210 19547 14132 3506 16704
16791A6704J6542n5047l0475o144k0654j6014M4602O723L1012P264j0941N774
$$ 16704 33246 -21801 -52276 -58420 -79074 -95088 -50486 -43763 -12751 -5487 -16428 -10654
16779a0654k3589L5630j713k0357J4291k2642k4996p485l22P414J2983L8875r582
$$ -10654 -34243 1387 -326 -20683 -6392 -29034 -54030 -61515 -61837 -54423 -41440 -2565 -12147
16766a2147l0712K3750J2242L6776N577L6392l5672l4036K1915o17l6376n1128
$$ -12147 -42859 -19109 -6867 29909 35486 71878 36206 2170 24085 23468 -12908 -64036
16754f4036o539j1820J6586M1472K7366j990K4924j3714J0500J8053q221j2631
$$ -64036 -70575 -82395 -65809 -24337 3029 1039 25963 12249 22749 40802 32581 19950
16742A9950k8720j9887L4806L1134k2027l4742J1687J8035J5746j573j4897k1768
$$ 19950 -8770 -28657 6149 37283 15256 -19486 -7799 10236 25982 24409 9512 -12256
16730a2256j4375O346K0427m951J0375k2141p0716q700K7255j0678N6157N0082
$$ -12256 -26631 -20285 142 -4809 5566 -16575 -87291 -95991 -68736 -79414 -23257 26825
16718B6825J6322l809k1123k6330k1658j0296l916Q77L0829P945k989j0560q113
$$ 26825 43147 39338 18215 -8115 -29773 -40069 -43985 -43108 -12279 -4334 -7323 -17883 -25996
16705b5996K61K409L0590K358l3064j5705M4091J9547o411j205O376n934J6500
$$ -25996 -25735 -23326 7264 9622 -23442 -39147 4944 24491 18080 16875 23251 17317 33817
16692C3817j4812R720r940o857J7758j9721l0001q070K0230K189J348L847p899
$$ 33817 19005 28725 18785 11928 29686 9965 -20036 -28106 -7876 -5687 -4339 -492 -8391
16679h391j9599r795q147K2017J814l3549j1808O538K3227K4768p353r101L7054
$$ -8391 -27990 -37785 -45932 -23915 -22101 -55650 -67458 -60920 -37693 -12925 -20278 -29379 7675
16666G675j3565l01L211j6013l001R810m044L364J06k1840k877j4060K2940J0435
$$ 7675 -5890 -6191 -2980 -18993 -21994 -12184 -16228 -12864 -12758 -34598 -37475 -51535 -28595 -18160
16652a8160J9678k7131q17L3367J1278j3335l0118J4800q48L950N370j6231j7036
$$ -18160 1518 -25613 -26430 6937 18215 4880 -25238 -10438 -11286 -7336 -1966 -18197 -35233
16639c5233j5916L3883K2218J9929k6806J7745M5416j5758o1504k5377o003L9524
$$ -35233 -51149 -17266 4952 24881 -1925 15820 61236 45478 -16026 -41403 -47406 -7882
16627g882m142l4984p151M1029K6994j8832m0749q198J5626K9982J8736j6244
$$ -7882 -12024 -47008 -54159 -13130 13864 -4968 -45717 -53915 -38289 -8307 10429 -5815
16615e815M849J4041O226m1507k3722K1548l823j9960j9447l19L4259M5326k2432
$$ -5815 -966 13075 19301 -22206 -45928 -24380 -28203 -48163 -67610 -67929 -33670 11656 -10776
16602a0776j2209r224J0774K5383l766K6948j9725l4697r495J705K4604L9096
$$ -10776 -22985 -32209 -21435 3948 182 27130 7405 -27292 -36787 -35082 -10478 28618
16590B8618l834n1026j7817O76J4534l520O03j2308L7245O201P518J4371L114
$$ 28618 24784 -26242 -44059 -43383 -28849 -32369 -31766 -44074 -6829 -628 6890 21261 24375
16577B4375k4351l0074p357M562P940K3268L3398l0700k6681J964K1156m3693
$$ 24375 24 -30050 -37407 -32845 -24905 -1637 31761 1061 -25620 -23656 -2500 -46193
16565d6193k7822J6608K6200k4732l8038j707J5182L5226J9379j8753L76J4666
$$ -46193 -74015 -57407 -31207 -55939 -93977 -95684 -80502 -45276 -25897 -44650 -44274 -29608
16553b9608Q570K6413j7403n2003p927L578K8513N8962L31j6644l1548L259L5622
$$ -29608 -21038 5375 -12028 -64031 -71958 -68380 -39867 19095 19426 2782 -28766 -25507 10115
16540A0115K8822N785m9938m6362L721L5224p022N144L0444j6631n3053O3654
$$ 10115 38937 44722 -5216 -51578 -47857 -12633 -19655 -14511 15933 -698 -53751 9903
16528I903R244l1352j3176r962o724m23J0162m0p727k1733k3210J7834L4129K850
$$ 9903 19147 -12205 -25381 -35343 -42067 -42490 -32328 -32368 -40095 -61828 -85038 -67204 -33075 -30225
16514c0225j3083j5491J2093K4590O7487k8785p9419P920m785k825j6735K1432
$$ -30225 -43308 -58799 -46706 -22116 45371 16586 -62833 -54913 -59698 -62523 -79258 -57826
16502e7826O7164J1378j2275j5261m006O737Q661L3739j2501n7682j2078K414
$$ -57826 9338 20716 8441 -6820 -10826 -4089 4572 38311 25810 -31872 -43950 -41536
16490d1536r170k1441o999M4698R378J7166K1769m389p420K3011j7203k4006J3584
$$ -41536 -50706 -72147 -79146 -34448 -25070 -7904 13865 9476 2056 25067 7864 -16142 -2558
16477b558J1710J511j9679k9081n3253k2085k6770L7712M3242j3549k9391j8069
$$ -2558 9152 10663 -9016 -38097 -91350 -113435 -140205 -102493 -59251 -72800 -102191 -120260
16465a20260K3836L0087j9353L9628O0524J3653j8614l9390k4390n113J0024J6754
$$ -120260 -96424 -66337 -85690 -46062 14462 28115 9501 -29889 -54279 -59392 -49368 -32614
16453c2614J5683K6933m3740J8309K3615j7851k4963J1538J1404K442p260k4208
$$ -32614 -16931 10002 -33738 -15429 8186 -9665 -34628 -23090 -11686 -9244 -16504 -40712
16441d0712q985k1623N105j1166j5896o256L2089L4936L1509K7418j2330l7422
$$ -40712 -49697 -71320 -66215 -77381 -93277 -99533 -67444 -32508 -999 26419 14089 -23333
16429b3333n289L330j1468q590K9625J895J7188l2637j9699M3347J6700l0401
$$ -23333 -28622 -25292 -36760 -45350 -15725 -13830 3358 -29279 -48978 -5631 11069 -19332
16417a9332j9459j3339M1779L7571K9851l0712k7868P872L458L8311m874j2939
$$ -19332 -38791 -52130 -10351 27220 57071 26359 -1509 6363 9821 48132 43258 30319
16405C0319j976q604M1262j4714j4752m434j7312n0315r055L1747R527J12l938
$$ 30319 28343 19739 61001 46287 31535 27101 9789 -40526 -49581 -17834 -8307 -8195 -12133
16392a2133o613J6119K9645K9885J1752q888K0371l1989l1731m8320l132K6302
$$ -12133 -18746 -2627 27018 56903 68655 59767 80138 48149 16418 -31902 -35034 -8732
16380h732j4407l2770Q0727J6987n8568k3936j065k0840K6163N684m2414p533
$$ -8732 -23139 -55909 24818 41805 -16763 -40699 -41764 -62604 -36441 -30757 -73171 -80704
16368h0704N3562O0293J4380j4002l959k551j1352l7472m6343J0153L0079Q861
$$ -80704 -27142 33151 47531 33529 29570 27019 15667 -21805 -68148 -57995 -27916 -19055
16356a9055l079J6338p459l0488J0034J7694J552K6694j079L301l0518j8435j545
$$ -19055 -22134 -5796 -13255 -43743 -33709 -16015 -14463 12231 11152 14453 -16065 -34500 -36045
16343c6045k8467n259M928L6217n903K8143K1933m5575k5123l554L6170N5712
$$ -36045 -64512 -69771 -64843 -28626 -34529 -6386 15547 -30028 -55151 -58705 -22535 33177
16331C3177J9078l7761O30k4029k1514j4651J9766m3285j1845L2713q474j2588
$$ 33177 52255 14494 15124 -8905 -30419 -45070 -25304 -68589 -80434 -47721 -56195 -68783
16319f8783K5359K2L044j5819k782k3827J7779j8646L079M9400K5203k2861m76
$$ -68783 -43424 -43402 -40358 -56177 -58959 -82786 -65007 -83653 -80574 -31174 -5971 -28832 -29308
16306b9308m826N452j6000M235o40J984j9468j2080M6556J5320P995L6185l5613
$$ -29308 -34134 -28682 -44682 -40447 -41087 -39103 -58571 -70651 -24095 -8775 -780 35405 -208
16293b08n1186r186K043O5789L8146m1856k2290r201j1241J1115k1147L099j4405
$$ -208 -51394 -60580 -58537 7252 45398 3542 -18748 -27949 -39190 -28075 -49222 -46123 -60528
16280f0528o986L2590k8454j9955r304J6545J3326N0189R219j0536K4419N796
$$ -60528 -67514 -34924 -63378 -83333 -92637 -76092 -62766 -12577 -3358 -13894 10525 16321
16268A6321R105N465l9667o1723k4755M3606K8396l2059j7480J5945L1794q499
$$ 16321 25426 30891 -8776 -70499 -95254 -51648 -23252 -55311 -72791 -56846 -25052 -33551
16256c3551j2764L4372J9647O481k4848L1555K3579J6261j1111L053O253j2264
$$ -33551 -46315 -11943 7704 14185 -10663 20892 44471 60732 49621 52674 58927 46663
16244D6663l1788j9500j6329O911j3281J093M3413N138r706j4744j6620r360j535
$$ 46663 14875 -4625 -20954 -14043 -27324 -26231 17182 22320 12614 -2130 -18750 -28110 -29645
16231b9645k829J1263%m1895n045L5304K0901Q372N625p283L3976l4731k3005
$$ -29645 -32474 -21211 -21211 -63106 -68151 -32847 -11946 -3574 2051 -5232 28744 -5987 -28992
16218b8992J6057P096k8636k4194j2017J1448O8081J7149k3274l4424j407j7092
$$ -28992 -12935 -5839 -34475 -58669 -70686 -59238 8843 25992 2718 -31706 -33113 -50205
16206e0205K6855K278J6955K6862k7622k5671r711k1046m4220J9531M5033J5423
$$ -50205 -23350 -21072 -4117 22745 -4877 -30548 -40259 -61305 -105525 -85994 -40961 -25538
16194b5538r348l243o01q683J4662J2235m8411P807R055k582p391j647K2838M1999
$$ -25538 -34886 -38129 -38730 -47413 -32751 -20516 -68927 -61120 -52065 -54647 -62038 -63685 -40847 1152
16180A152j0156l8701J7958L1426m839j7046J1459K0357j8182k242k2753J0487
$$ 1152 -9004 -47705 -29747 1679 -3160 -20206 -8747 11610 -6572 -8814 -31567 -21080
16168b1080M914j6026L982r60p972J9099J6835p728j1165l3422o104L5488k0674
$$ -21080 -16166 -32192 -28210 -29170 -37142 -18043 -1208 -8936 -20101 -53523 -59627 -24139 -44813
16155d4813l9989N1776O2618L2032j6659p1461k0404L3005J4688J0496J0961K4926
$$ -44813 -84802 -33026 29592 61624 44965 -26496 -46900 -13895 793 11289 22250 47176
16143D7176J519o905p954k5029l469N7615Q389k6484j5776j2981p07Q292j9815
$$ 47176 48695 41790 33836 8807 5338 62953 71342 44858 29082 16101 15394 23686 3871
16130C871k9079k3529l3503M292P7991k1680P648o816k861R547j1842l5544J6969
$$ 3871 -25208 -48737 -82240 -77948 43 -21637 -13989 -20805 -23666 -14119 -25961 -61505 -44536
16117d4536N3836j5316R171K1722m8112j6001J7202O805l267k255l02N3841L8072
$$ -44536 9300 -6016 3155 24877 -23235 -39236 -22034 -15229 -18496 -20751 -21053 32788 70860
16104G0860l0699k4798J5456k6502l7625k3450j6455K6959J1730m0553L985l356
$$ 70860 40161 15363 30819 4317 -33308 -56758 -73213 -46254 -34524 -75077 -71092 -74448
16092g4448q952K1779K0621J2583J293p907P058M2040L7253o309l3965m5761k8588
$$ -74448 -83400 -61621 -41000 -28417 -27124 -35031 -27973 14067 51320 45011 11046 -34715 -63303
16079f3303L1055K7226K5468J3225m0987m2441k381J9571K8499K0457j3710n3695
$$ -63303 -32248 -5022 20446 33671 -7316 -49757 -52138 -32567 -4068 16389 2679 -51016
16067e1016K0545j4788j1864k2320K4902L8009J6529j197k295O120L6515m0145
$$ -51016 -30471 -45259 -57123 -79443 -54541 -16532 -3 -1200 -3495 2625 39140 -1005
16055a005n0072O09M9047M7864L951o2446j044K9482K0636j8018k5299r478m0028
$$ -1005 -51077 -50468 -1421 46443 50394 -12052 -13096 16386 37022 19004 -6295 -15773 -55801
16042e5801l7257J5519J0517k055l643q45L5387N882j1715J2509J1408o712k8518
$$ -55801 -93058 -77539 -67022 -69077 -72720 -73565 -38178 -32296 -44011 -31502 -20094 -26806 -55324
16029e5324l9133J9646M8589J7130j6221K7896N0021j4744o2326k5661J6123j369
$$ -55324 -94457 -74811 -26222 -9092 -25313 2583 52604 37860 -24466 -50127 -34004 -35373
16017c5373l616m2486O1034R112j2245l2102j6407J5352L1012j1204j0447j710
$$ -35373 -38989 -81475 -20441 -11329 -23574 -55676 -72083 -56731 -25719 -36923 -47370 -49080
16005d9080J2013M149J4034j6310j1843L9735N4653l7086n5354j7173j6287m826
$$ -49080 -37067 -32918 -18884 -35194 -47037 -7302 47351 10265 -45089 -62262 -78549 -83375
15993h3375J0168J0896p875K4451L3629K139R590J8786J4151r482k7766k0023
$$ -83375 -73207 -62311 -70186 -45735 -12106 -9967 -377 18409 32560 23078 -4688 -24711
15981b4711o581j1290J5488q091j473Q976j315K6204O768k7403k0893k6528o173
$$ -24711 -31292 -42582 -27094 -35185 -36658 -27682 -28997 -2793 3975 -23428 -44321 -70849 -77022
15968g7022K2426M1045k378P828K6525J0050m478l0811k1523o928K0988l3833
$$ -77022 -54596 -13551 -15929 -8101 18424 28474 23996 -6815 -28338 -35266 -14278 -48111
15956d8111Q803j153n038j1919J2605J4095L5793L3411l00R75k099m5294K082
$$ -48111 -39308 -40461 -45499 -57418 -44813 -30718 5075 38486 38186 39161 37062 -8232 -6150
15943f150o337k3950L0643N1454O287n359N877J6523o065m1967k6811k3189n91
$$ -6150 -12487 -36437 -5794 45660 51947 46588 52465 68988 62923 20956 -5855 -29044 -29635
15930b9635P173K697J4231Q280r560P97j5248j6358m480l087q678P920o712L0267
$$ -29635 -22462 -19765 -5534 2746 -6814 -6017 -21265 -37623 -42103 -45190 -53868 -45948 -52660 -22393
15916b2393k1197K771n719J3617K6674j0203j6007K5949M013K8532n667l4025
$$ -22393 -43590 -40819 -46538 -32921 -6247 -16450 -32457 -6508 -2495 26037 20370 -13655
15904a3655k9660k4346K2057J7865l1028m1296N5962K2541k3587j6310k121N773
$$ -13655 -43315 -67661 -45604 -27739 -58767 -100063 -44101 -21560 -45147 -61457 -63578 -57805
15892e7805Q164J3846L8224K3381o655j4691n2137k4680L4320J7659K6339L8473
$$ -57805 -49641 -35795 2429 25810 19155 4464 -47673 -72353 -38033 -20374 5965 44438
15880D4438j5345J4228K3790l4284k5209j7975R278L2214q348m5194l1112J557
$$ 44438 29093 43321 67111 32827 7618 -10357 -1079 31135 22787 -22407 -53519 -51962
15868e1962J9378K1767n799j0167j7608R271L5156m2420l3607J809J3015K8735
$$ -51962 -32584 -10817 -16616 -26783 -44391 -35120 36 -42384 -75991 -74182 -61167 -32432
15856c2432J1603J96m104k940J8113j2697q933O833j4399J3483N5590j5475n4
$$ -32432 -20829 -20633 -24737 -27677 -9564 -22261 -31194 -24361 -38760 -25277 30313 14838 14784
15843A4784k1491l0336j7270M8434L4132R258r49r23k9676j5860J1041r513q03
$$ 14784 -6707 -37043 -54313 -5879 28253 37511 36562 35639 5963 -9897 1144 -8369 -9172
15830i172J6607J1894K2453R606Q059j4551l4119m905n454L924r175j6393L1561
$$ -9172 7435 19329 41782 51388 59447 44896 10777 5872 418 4342 -4833 -21226 10335
15817A0335n595m536k7795m0314j6234M5071L0962M60K5235K5455l9748l236m596
$$ 10335 4740 204 -27591 -67905 -84139 -39068 -8106 -7646 17589 43044 3296 60 -4536
15804d536J1763j8943m4618P869O371N595P3851J925l1919j9606k5888L05L3546
$$ -4536 7227 -11716 -56334 -48465 -42094 -36499 37352 39277 7358 -12248 -38136 -37831 -4285
15791d285L2286J1335j4083k4413O885J1763o177K1249j1814j9503k046j6816
$$ -4285 28001 39336 25253 840 7725 19488 13311 34560 22746 3243 1197 -15619
15779a5619K4116n072l6666k6155j3958n883k966R685L4720K8630J267k6480j1346
$$ -15619 8497 3425 -33241 -59396 -73354 -79237 -82203 -72518 -37798 -9168 -7901 -34381 -45727
15766d5727J8989L5023K7298j02q544J3311n285K6457j0445k9908p128r872j8830
$$ -45727 -26738 8285 35583 35481 26937 40248 34963 61420 50975 21067 13939 4067 -14763
15753a4763R585J6368k473n666j9210J0117L9444k2116k3220K428m79j546N671
$$ -14763 -5178 11190 8717 3051 -16159 -6042 33402 11286 -11934 -9506 -9985 -11531 -5860
15740e860M4561J5428k9257k0877o369l101j3824j4596P981L9275L175n0556j7975
$$ -5860 38701 54129 24872 3995 -2374 -5475 -19299 -33895 -25914 13361 16536 -34020 -51995
15727e1995K0151L1488J2845j3014k3283q538M6419N4848k0780o782j6980j7283
$$ -51995 -31844 -356 12489 -525 -23808 -32346 14073 68921 48141 41359 24379 7096
15715G096L0331M213r497m3862k0525k1150J5374J9745K5898J6913J8571k1049
$$ 7096 37427 41640 32143 -11719 -32244 -53394 -38020 -18275 7623 24536 43107 22058
15703B2058m748J2817J2178k2556m8682n530p659k6967p027L4630j810J0060Q318
$$ 22058 17310 30127 42305 19749 -28933 -34463 -42122 -69089 -76116 -41486 -43296 -33236 -24918
15690b4918k8099k4640J9038M4710k7539K690K4333K3910O539l2613j6973j1920
$$ -24918 -53017 -77657 -58619 -13909 -41448 -38758 -14425 9485 16024 -16589 -33562 -45482
15678d5482L7123K8308k4651P340J0112K4721m0645K1489O468l8789j2165l8301
$$ -45482 -8359 19949 -4702 2638 12750 37471 -3174 18315 24783 -14006 -26171 -64472
15666f4472j406M4785K0477p125l0217M35K3990l220k1141q390l212k9931j4866
$$ -64472 -65878 -21093 -616 -7741 -37958 -37523 -13533 -16753 -37894 -46284 -49496 -79427 -94293
15653i4293L3094O008L9409p884n6892R958K4634L9825j0337j5337J1530M505
$$ -94293 -61199 -55191 -15782 -23666 -80558 -70600 -45966 -6141 -16478 -31815 -20285 -15780
15641a5780j2532o585l39p555L2118j6396J0681k0377j7291k779J1568K4719L8970
$$ -15780 -28312 -34897 -35236 -42791 -10673 -27069 -16388 -36765 -54056 -56835 -45267 -20548 18422
15628A8422L7846J411j7346j3003k7539m3406J4364K9370l0984K0277J8337j8843
$$ 18422 56268 57679 40333 27330 -209 -43615 -29251 119 -30865 -10588 7749 -11094
15616a1094O779k0556j1767J4360k6520j560O0308R878j6717N824Q84K5988L381
$$ -11094 -4315 -24871 -36638 -22278 -48798 -50358 9950 19828 3111 8935 9819 35807 39188
15603C9188m6019r952N6039P499n5229k3448l07J7170L0371J7255o615J7431k668
$$ 39188 -6831 -16783 39256 46755 -8474 -31922 -32229 -15059 15312 32567 25952 43383 40715
15590D0715M508Q103q141j7218J4114J3758m3239l9257k7992O443K1845k7347
$$ 40715 45223 53326 45185 27967 42081 55839 12600 -26657 -54649 -48206 -26361 -53708
15578e3708O336j8943L2495J6488O96J0170o001j6098L8731J8568j6028j404l6120
$$ -53708 -47372 -66315 -33820 -17332 -16636 -6466 -12467 -28565 10166 28734 12706 11302 -24818
15565b4818k1947m344J5288J2002M41O08J9984M6925m877J1760N561l8604n3825
$$ -24818 -46765 -51109 -35821 -23819 -23378 -22770 -2786 44139 39262 51022 56583 17979 -35846
15552c5846j4911O489J5101J2565J9290k8219M194L2126r69N4675R081o1991q010
$$ -35846 -50757 -44268 -29167 -16602 2688 -25531 -21337 10789 9820 64495 73576 11585 3575
15539C575j0800p733j1785P584K4183J3013l5213l5876J4714j562J1563M0240
$$ 3575 -7225 -14958 -26743 -19159 5024 18037 -17176 -53052 -38338 -39900 -28337 11903
15527A1903L5906j5840l1598j535j8044j7044j2591J0352j0638Q544K657j7486
$$ 11903 47809 31969 371 -1164 -19208 -36252 -48843 -38491 -49129 -40585 -37928 -55414
15515e5414J9198r520Q113N1664J5882L1182j9482j9834J8275j7480p237J7552
$$ -55414 -36216 -45736 -37623 14041 29923 61105 41623 21789 40064 22584 15347 32899
15503C2899P618k449j9107J8915M974k6560l8726j7302J4870K8516J5426p995
$$ 32899 40517 38068 18961 37876 42850 16290 -22436 -39738 -24868 3648 19074 11079
15491A1079o536l8403m163L1334n349L165P808k0724P197K4577j433l255K2360
$$ 11079 4543 -33860 -38023 -6689 -12038 -8873 -1065 -21789 -14592 9985 8552 5297 27657
15478B7657K5107k8729n7949J0615L3375j9032j3249J1973p133J0204K1102L0386
$$ 27657 52764 24035 -33914 -23299 10076 -8956 -22205 -10232 -17365 -7161 13941 44327
15466D4327k7617l6877M6837Q340j8246l3183n8968L3731N8847J0596J3543l2986
$$ 44327 16710 -20167 26670 35010 16764 -16419 -75387 -41656 17191 27787 41330 8344
15454H344J2950j7014p859J8729r035l6537r15O1327J8208k1581m5765O462N0969
$$ 8344 21294 4280 -3579 15150 6115 -30422 -31337 29990 48198 26617 -19148 -12686 38283
15441C8283L4768n3144k9404J9634K3569J8694J3160N662k2848n921L8159n981
$$ 38283 73051 19907 -9497 10137 33706 52400 65560 71222 48374 42453 80612 74631
15429G4631q5705m1865J985n632L7220O9451k075j2794k1541J4851J4189o7841
$$ 74631 -11074 -52939 -50954 -56586 -19366 50085 48010 35216 13675 28526 42715 -25126
15417b5126k7845J0295Q4407j408k7846K411L0861J0452j276q917J1132O285l7007
$$ -25126 -52971 -42676 41731 40323 12477 14888 45749 56201 54925 46008 57140 63425 26418
15404B6418p1032k2944J0021N156M4400L0480K3540j0753k0712l3419p75Q977
$$ 26418 -44614 -67558 -57537 -52381 -7981 22499 46039 35286 14574 -18845 -19620 -10643
15392a0643L7779r900k9082k3345l197L0530K0785K6497m789j808J0557k6354
$$ -10643 27136 17236 -11846 -35191 -38388 -7858 12927 39424 34635 32827 43384 17030
15380A7030J6090l3735Q915k2328j8579M645M0674J4515j2212m6538j7030J7301
$$ 17030 33120 -615 8300 -14028 -32607 -27962 12712 27227 15015 -31523 -48553 -31252
15368c1252n070N264k75j2570K0755j7982K8617R579m704M4902k532k6043k5265
$$ -31252 -36322 -31058 -31333 -43903 -23148 -41130 -12513 -2934 -7638 37264 34732 8689 -16576
15355a6576J431K4121L231k0105k6294J3823P375K4863j6393j1031k4975J7552
$$ -16576 -15145 8976 12207 -7898 -34192 -20369 -12994 11869 -4524 -15555 -40530 -22978
15343b2978p244l8867l791K0612K9800N803p365M4719N688L565k4161J2063o557
$$ -22978 -30222 -69089 -72880 -52268 -22468 -16665 -24030 20689 26377 29942 5781 17844 11287
15330A1287j5447J556Q637j8741N032M640J0835n3l0579J8125j1037J1383k3911
$$ 11287 -4160 -2604 6033 -12708 -7676 -3036 7799 7746 -22833 -4708 -15745 -4362 -28273
15317b8273k8283l5470K1425Q523L1528K7409l874N14J6226l694j8308L070J0237
$$ -28273 -56556 -92026 -70601 -62078 -30550 -3141 -7015 -6501 9725 6031 -12277 -9207 1030
15304A030N3308J0796o4053Q143Q010J9910j7953o455l6231m107J1184Q241k925
$$ 1030 54338 65134 1081 9224 17234 37144 19191 12736 -23495 -27602 -16418 -8177 -11102
15291a1102p611J536P446l666k0949q098M1334J3045k9872l4388M0514L3439J7436
$$ -11102 -18713 -17177 -9731 -13397 -34346 -42444 -1110 11935 -17937 -52325 -11811 21628 39064
15278C9064j127L676p555p289m5763J6994N2617J0346J485O045J640k4927k7512
$$ 39064 37937 41613 34058 26769 -18994 -2000 50617 60963 62448 68493 70133 45206 17694
15265A7694l7330K371P461q823k4274j6179L6731L0103J6903n791j3193J9141
$$ 17694 -19636 -17265 -9804 -18627 -42901 -59080 -22349 7754 24657 18866 5673 24814
15253B4814l022J7054K3702K4668J2509j8052n3210l6850K6708L1169j7189J7082
$$ 24814 21792 38846 62548 87216 99725 81673 28463 -8387 18321 49490 32301 49383
15241D9383K501j0397L154l5600N279P731j4939K6727K5717L041l871l831l7718
$$ 49383 51884 41487 44641 9041 14320 22051 7112 33839 59556 62597 58726 54895 17177
15228A7177k7892J7535L7646K2531k9567j4059j1910n601R454k7844j0977j4879
$$ 17177 -10715 6820 44466 66997 37430 23371 11461 5860 15314 -12530 -23507 -38386
15216c8386l8747M5268J5468J6737K5394m6968l0658j2481J1848L2068k1544m673
$$ -38386 -77133 -31865 -16397 340 25734 -21234 -51892 -64373 -52525 -20457 -42001 -46674
15204d6674m152L428K9108j6985n229q728j1202M5973K8253Q956j9578l6566q953
$$ -46674 -50826 -47398 -18290 -35275 -40504 -49232 -60434 -14461 13792 22748 3170 -33396 -42349
15191d2349L0146j3649l3504O156M5897M3686j1600P910O018l7403k3117J2305
$$ -42349 -12203 -25852 -59356 -53200 -7303 36383 24783 32693 38711 1308 -21809 -9504
15179i504p913K1757M9419K5167l3187k2973J0408Q104r463K0040K1339n2624
$$ -9504 -17417 4340 53759 78926 45739 22766 33174 41278 31815 51855 73194 20570
15167B0570o4263q398J9858o503J7292j4805J651N8338L0940l4153l1176M5298
$$ 20570 -43693 -52091 -32233 -38736 -21444 -36249 -34598 23740 54680 20527 -10649 34649
15155C4649L5285k5531k2714k3448m123L0041O281r010J3731M9286K8622l2708
$$ 34649 69934 44403 21689 -1759 -5882 24159 30440 21430 35161 84447 113069 80361
15143H0361l2924j6636l4311n5684l1950K3179N0291K7354L903k2540J0129L1318
$$ 80361 47437 30801 -3510 -59194 -91144 -67965 -17674 9680 13583 -8957 1172 32490
15131C2490j3531j0557J9839K9118R436O507l8360r647m247k3132k4785j5765
$$ 32490 18959 8402 28241 57359 66795 73302 34942 25295 21048 -2084 -26869 -42634
15119d2634M1787K6067N198j4826k5152N867J3963j7377J6187M7436j0968R657
$$ -42634 -847 25220 30418 15592 -9560 -3693 10270 -7107 9080 56516 45548 55205
15107E5205k3026L846m3914k2071L333L5507J7595j8701K1610J377j3301j4012
$$ 55205 32179 36025 -7889 -29960 -26627 8880 26475 7774 29384 30761 17460 3448
15095C448L8506j3693n301M727j9004m486J319j2798L5996L6592K68n6430L075
$$ 3448 41954 28261 22960 27687 8683 4197 5516 -7282 28714 65306 65574 9144 12219
15082A2219p40j4629j6002r089j000J1675r73L374j7688P096L5764J6850J0792
$$ 12219 11479 -3150 -19152 -28241 -29241 -17566 -18539 -15165 -32853 -25757 10007 26857 37649
15069C7649P86l8779j4961L2058J1820j6418J2492K1139q112Q427O039k8340l5230
$$ 37649 38435 -344 -15305 16753 28573 12155 24647 45786 37674 46101 52140 23800 -11430
15056a1430k9069P199K3589l583j0978M932K5843P785k8693L673L4519L30L8461
$$ -11430 -40499 -33300 -9711 -13294 -24272 -19340 6503 14288 -14405 -10732 23787 24117 62578
15043F2578k1376r549k4013N277m656j0698J1855J7124k0970k2242J9827J3220
$$ 62578 41202 31653 7640 12917 8261 -2437 9418 26542 5572 -16670 3157 16377
15031A6377j1340K8958k0309r394q612K9457J7687K9409K902j4953o253K4926
$$ 16377 5037 33995 13686 4292 -4320 25137 42824 72233 75135 60182 53929 78855
15019G8855L7168j4559m9335l8301R382o486r156k5750k3755K7430K6649J6076
$$ 78855 116023 101464 52129 13828 23210 16724 7568 -18182 -41937 -14507 12142 28218
15007B8218l5999j5754M563J4341l456K6457j5973k1594q385r188M3992J7808
$$ 28218 -7781 -23535 -18972 -4631 -8087 18370 2397 -19197 -27582 -36770 7222 25030
14995B5030j545k7307n1491J480J5389j9980L1929L1254K0169j0587k54j3158
$$ 25030 23485 -3822 -55313 -53833 -38444 -58424 -26495 4759 24928 14341 14087 929
14983I29J4553m2315m5286j9320m01M5474M1666J6361K7429L097j8167j4762N0771
$$ 929 15482 -26833 -72119 -91439 -91840 -46366 -4700 11661 39090 42187 24020 9258 60029
14970F0029j7879L510N588j6498l5492l8596N6671L1558q174o398j2457l6452
$$ 60029 42150 45660 51248 34750 -742 -39338 17333 48891 40717 34319 21862 -14590
14958a4590o330j4976Q023N4207J6130k2431k2272L84J6012j5165o514O833j3262
$$ -14590 -20920 -35896 -27873 26334 42464 20033 -2239 -1855 14157 -1008 -7522 -689 -13951
14945a3951R534L1045M903j8594n742j5660k842L4304J0877k4463j863K0318n08
$$ -13951 -4417 26628 31531 12937 7195 -8465 -11307 22997 33874 9411 7548 27866 27358
14932B7358k8065j5292j1816l170j1534L3428K6575J5695o142j0335j5229p341
$$ 27358 -707 -15999 -27815 -30985 -42519 -9091 17484 33179 27037 16702 1473 -5868
14920e868j5974J496o05j1744Q229J4853K5504m276k5554J2422Q430J159j733
$$ -5868 -21842 -20346 -20951 -32695 -24466 -9613 15891 11615 -13939 -1517 6913 8072 6339
14907F339N64N472o8315k6743K6842L1649J9125K5587j5991j8948j2030K3963
$$ 6339 6903 12375 -55940 -82683 -55841 -24192 -5067 20520 4529 -14419 -26449 -2486
14895b486L5275o589l1964j5918l309m893R128J9297N2842M6653n1650o1983n634
$$ -2486 32789 26200 -5764 -21682 -24991 -29884 -20756 -1459 51383 98036 46386 -15597 -21231
14882b1231J0665q953N905m836J2699K8374k330q724Q660p801l3253J9419M3610
$$ -21231 -10566 -19519 -13614 -18450 -5751 22623 20293 11569 20229 12428 -20825 -1406 42204
14869D2204J2255k240K4142q284m4383k6417K8277l1401j2641Q175l758L018K6617
$$ 42204 54459 52219 76361 68077 23694 -2723 25554 -5847 -18488 -10313 -14071 -11053 15564
14856A5564L0825j018J5828k841p147n058j432o58k8347q308K9103M0614j9088
$$ 15564 46389 45371 61199 58358 51211 46153 44721 44063 15716 7408 36511 77125 58037
14843E8037p690k5694j6788j4856l1234N0164M9997J6203k336j7782K3909K6372
$$ 58037 50347 24653 7865 -6991 -38225 11939 61936 78139 75803 58021 81930 108302
14831A08302M4903N7396P9313J03128R5306r538M4655J2839m8779o8690p5708
$$ 108302 153205 210601 289914 393042 488348 478810 523465 536304 487525 418835 343127
14820C43127j03981o0179l1019l8859l9331l3470l816L9796j6610J149k6035J7146
$$ 343127 239146 178967 147948 109089 69758 36288 32472 72268 55658 56807 30772 47918
14808D7918J9808j5939L0519K041j3454j6255l3858l9706k7794J7038J2075K3587
$$ 47918 67726 51787 82306 84347 70893 54638 20780 -18926 -46720 -29682 -17607 5980
14796E980J2714j387J1852O254L640k0820j3013J1678p175j6129M5067K3291K1161
$$ 5980 18694 17307 29159 35413 39053 18233 5220 16898 9723 -6406 38661 61952 83113
14783H3113j096J2206k8356n3234l2213R840L781M995J8722J7432P239Q650k2916
$$ 83113 82017 94223 65867 12633 -19580 -9740 -5959 -964 17758 35190 42429 51079 28163
14770B8163k7965l026j9496p200L1635k9708k3447N145L8678j4196M5977L4855
$$ 28163 198 -2828 -22324 -29524 2111 -27597 -51044 -45899 -7221 -21417 24560 59415
14758E9415n055J6136K0567K4789k4332j7552j8819j8967m4755n5719M299J3592
$$ 59415 54360 70496 91063 115852 91520 73968 55149 36182 -8573 -64292 -59993 -46401
14746d6401K6190J4813M101K4077K3608l8180l351J464j6888j2902K8361k9122
$$ -46401 -20211 -5398 -1297 22780 46388 8208 4857 6321 -10567 -23469 4892 -24230
14734b4230m7991M4951R0953k3820j3493l9242L7173l04l0947p231K6782k364
$$ -24230 -72221 -27270 63683 39863 26370 -12872 24301 23997 -6950 -14181 12601 10237
14722A0237J416n979K170K1702L1550q350k8694k891K7280J2387m46j2339n754
$$ 10237 11653 5674 7844 29546 61096 52746 24052 21161 48441 60828 60382 48043 42289
14709D2289Q563R497R744L0039J184m2860j9319O320J29m36m885J3280J5097P492
$$ 42289 50852 60349 70093 100132 101316 58456 39137 45457 45586 45150 40265 53545 68642 76134
14695G6134j4821p232j7866k7787M0611L6760k4368l8158M895k641M463Q495k0214
$$ 76134 61313 54081 36215 8428 49039 85799 61431 23273 28168 25527 29990 38485 18271
14682A8271k8623l725M71J3693K1994j95P628n894r087p069J3696J5140P246l5312
$$ 18271 -10352 -14077 -13606 87 22081 21886 29514 23620 14533 7464 21160 36300 43546 8234
14668H234j8484L6603K0776K392j944k62O486M2130N932q513j7292L1121K2800
$$ 8234 -10250 26353 47129 49521 47577 47315 53801 95931 101863 93350 76058 107179 129979
14655A29979L2449J1832j0125p08k6938k7343m8254n265R258O32L2657J7102k2619
$$ 129979 162428 174260 164135 163427 136489 109146 60892 55627 64885 65517 98174 115276 92657
14642I2657M8322R4029N3303P5205Q8323N7608Q4697J00630Q5394R9094Q7773
$$ 92657 140979 235008 288311 363516 451839 509447 594144 694774 780168 879262 967035
14631I67035P4980L6772l466m8002m1863j05188j17725j29439l9734n2562m1436
$$ 967035 1042015 1078787 1075321 1027319 985456 880268 762543 633104 593370 540808 499372
14620D99372l949l0827n4218k7175n8581m0243J2555Q261o821m3273K7157P1142
$$ 499372 495423 464596 410378 383203 324622 284379 296934 305195 298374 255101 282258 353400
14608C53400K0498r111L4998M4553K4415N7961M7938M3139O3233O9093J16392
$$ 353400 373898 364787 399785 444338 468753 526714 574652 617791 681024 750117 866509
14597H66509R5868O5097o319K017L4763j6899o4252o4257q7767r0011j12930j08460
$$ 866509 962377 1027474 1021155 1023172 1057935 1041036 976784 912527 824760 734749 621819 513359
14585E13359p7420m1101l3139j9683m7284n2896p079J2589j6295j2919n6166n1363
$$ 513359 435939 394838 361699 342016 294732 241836 234757 247346 231051 218132 161966 110603
14573A10603l9204J7686M2659L7629O779k0861j0934j5948o7430n2393K3978L9197
$$ 110603 71399 89085 131744 169373 176152 155291 144357 128409 60979 8586 32564 71761
14561G1761K0908j209r557n34K0446n676j5515n3341j7777K5322L3511j1362N97
$$ 71761 92669 91460 81903 81369 101815 96139 80624 27283 9506 34828 68339 56977 57574
14548E7574j1777L2379L3141O086j7219k6164R428Q20Q98j3767K9762J8491j747
$$ 57574 45797 78176 111317 117403 100184 74020 83448 84268 85166 71399 101161 119652 117905
14535A17905k2596J3974q808j4514j1579P710M3452J0499N0452p857k5407j4173
$$ 117905 95309 109283 100475 85961 74382 82092 125544 136043 186495 178638 153231 139058
14523A39058o3961N763J7991k3224O851j0065l2315K3182K1123P501j6648k2218
$$ 139058 75097 80860 98851 75627 82478 72413 40098 63280 84403 91904 75256 53038
14511E3038k6530Q4P1426J7683k4045q057L2626j1997j8633p384q52k4653k9466
$$ 53038 26508 26592 98018 115701 91656 83599 116225 104228 85595 78211 77359 52706 23240
14498B3240K9197K0109L4820J2987J1273J5580j3231l1951r760J9232k5507k4489
$$ 23240 52437 72546 107366 120353 131626 147206 133975 102024 92264 111496 85989 61500
14486F1500K1323J0175k2470q116r226J0729J1366O892r183k0158Q610M143j6212
$$ 61500 82823 92998 70528 62412 53186 63915 75281 82173 72990 52832 61442 65585 49373
14473D9373l1521j591j2184J8610K1395K956r978j99P328J9912K7168j2803K3194
$$ 49373 17852 16261 4077 22687 44082 47038 37060 36861 44189 64101 91269 78466 101660
14460A01660k8317l4135P691q887k1573J5868K6750n795K0733K9275Q25L348M0284
$$ 101660 73343 39208 46899 38012 16439 32307 59057 53262 73995 103270 104095 107443 147727
14447A47727K1544m315j4240J8643O317k4668m6338k537M1736K5534j4705k9687
$$ 147727 169271 164956 150716 169359 175676 151008 104670 102133 143869 169403 154698 125011
14435A25011j9842n526K0572K589q657l4865l4505L250M559n079M071R04J1163
$$ 125011 105169 99643 120215 122804 114147 79282 44777 48027 52586 47507 51578 52482 63645
14422F3645K5797J4396o041L3492K7009k292l1730k7383Q778J0109k0187k3875
$$ 63645 89442 103838 97797 131289 158298 156006 124276 96893 105671 115780 95593 71718
14410G1718L3155J1303j1875l4459j0032N9687J3567j2719l670o853k9442k304
$$ 71718 104873 116176 104301 69842 59810 119497 133064 120345 116675 109822 80380 78076
14398G8076M9397J7492J1859L0478L0262m0132k8498J762k5979k3469L9460K6290
$$ 78076 127473 144965 156824 187302 217564 177432 148934 150696 124717 101248 140708 166998
14386A66998J5717P450r195k1757J5654K0693P6503J4344k5368k2890J2802J0691
$$ 166998 182715 190165 180970 159213 174867 195560 272063 286407 261039 238149 250951 261642
14374B61642m385l9169J2069l915l794K3793J6642p756j4330M700P618l9352m9678
$$ 261642 257257 218088 230157 226242 222448 246241 262883 255127 240797 245497 253115 213763 164085
14361A64085M5377K4445M618j7375J1181O757K2901J1356o385K5331K3054L8266
$$ 164085 209462 233907 238525 221150 232331 239088 261989 273345 266960 292291 315345 353611
14349C53611Q486j0924K205K7260j894J6874O987N3679m5119m0537J2581M73n5853
$$ 353611 362097 351173 353378 380638 378744 395618 402605 456284 411165 370628 383209 383682 327829
14336C27829p728Q455K22j1908p926O731J8117J8760j8263m3110n718K0437J3788
$$ 327829 320101 328556 328778 316870 308944 315675 333792 352552 334289 291179 285461 305898 319686
14323C19686L3788L4670k2888K034K2167M838l5562l8515K3557O055l5128J677
$$ 319686 353474 388144 365256 367290 389457 394295 358733 320218 343775 349830 314702 316379
14311C16379K8958L720o671j6676k9148J3542R012O419J5396K2407M0036L0227
$$ 316379 345337 349057 342386 325710 296562 310104 319116 325535 340931 363338 403374 433601
14299D33601M866o060L449q809M882K1698M7371K0539J1323j0805K7705K8549
$$ 433601 438467 432407 435856 427047 431929 453627 500998 521537 532860 522055 549760 578309
14287E78309k4288l604P3209K3715J808j8264m1007j5182q843j7559K1516L5876
$$ 578309 554021 550417 623626 647341 649149 630885 589878 574696 565853 548294 569810 605686
14275F05686l0916J9286P4734L4009k5583k8126K5451J8276L502l1182k2919J0788
$$ 605686 574770 594056 668790 702799 677216 649090 674541 692817 696319 665137 642218 653006
14263F53006K6809L2492L6449N947r270K3298N0333K8436P062K1748M6876O2118
$$ 653006 679815 712307 748756 754703 745433 768731 819064 847500 854562 876310 923186 985304
14251I85304L5038N3898M5796N5838L7629J7746l1132k8687J2122K4746O5210
$$ 985304 1020342 1074240 1120036 1175874 1213503 1231249 1200117 1171430 1183552 1208298 1273508
14240A273508K9632O765J4284N9826R5114M3350O7199P4599K8657M2814O1611
$$ 1273508 1303140 1309905 1324189 1384015 1479129 1522479 1589678 1664277 1692934 1735748 1797359
14229A797359M8758N6249P2619Q2251N0091M0436N1408Q4932J62493J54956J38687
$$ 1797359 1846117 1902366 1974985 2057236 2107327 2147763 2199171 2284103 2446596 2601552 2740239
14218B740239K35918K33633K31822J94560K57626L01463L71880L74408M00989
$$ 2740239 2976157 3209790 3441612 3636172 3893798 4195261 4567141 4941549 5342538
14209E342538M35926M75540O07201P13322P54443Q89110J096503J247554J455455
$$ 5342538 5778464 6254004 6861205 7574527 8328970 9218080 10314583 11562137 13017592
14200A3017592J736598K050184K339630K832776L453978M170221N178772O492579
$$ 13017592 14754190 16804374 19144004 21976780 25430758 29600979 34779751 41272330
14192D1272330Q160053J0055046J2152797J4175649J5830694J6965983J7240528
$$ 41272330 49432383 59487429 71640226 85815875 101646569 118612552 135853080
14185A35853080J6110705J3243477Q877716L887609r85606n382687r232767j2251306
$$ 135853080 151963785 165207262 174084978 177972587 176986981 171604294 162371527 150120221
14177A50120221j4013451j4426960j3576544j2006910j0118445q281635o688126
$$ 150120221 136106770 121679810 108103266 96096356 85977911 77696276 71008150
14170G1008150n311060m234365l339288k547804j878635j301070o86016p4686
$$ 71008150 65697090 61462725 58123437 55575633 53696998 52395928 51709912 51635226
14162E1635226N28414J143317J764444K437169L298669M307753N475816O913667
$$ 51635226 52163640 53306957 55071401 57508570 60807239 65114992 70590808 77504475
14154G7504475Q623921J0375610J2073350J3454545J4276998J4345542J3220007
$$ 77504475 86128396 96504006 108577356 122031901 136308899 150654441 163874448
14147A63874448J0678286O489527J281657l951102q566398j2388646j5436181
$$ 163874448 174552734 181042261 182323918 178372816 169806418 157417772 141981591
14140A41981591j7296986j7754820j6866833j4936918j2580736j0232341q185488
$$ 141981591 124684605 106929785 90062952 75126034 62545298 52312957 44127469
14133D4127469o533894n287327m332101l574141k989918k508153k111930j794516
$$ 44127469 37593575 32306248 27974147 24400006 21410088 18901935 16790005 14995489
14125A4995489j507919j350747j184536j015569q39372p40794o53914o30656n38531
$$ 14995489 13487570 12136823 10952287 9936718 9097346 8356552 7702638 7071982 6533451
14116F533451m95079m34168m06031l66100l51884k91203k41484j86341j69254
$$ 6533451 6038372 5604204 5198173 4832073 4480189 4188986 3947502 3761161 3591907
14107C591907j94755j55482j61523j28801j04006j23574j03526j37764j16931
$$ 3591907 3397152 3241670 3080147 2951346 2847340 2723766 2620240 2482476 2365545
14098B365545r1294l5787r286k1719M572K1126j1030J2665j920J3811k2083n121
$$ 2365545 2274251 2238464 2229178 2207459 2212031 2233157 2222127 2234792 2232872 2246683 2224600 2219479
14086B219479m1634n7334p2098j09255r7610q2354j43955j32525j09547j06822
$$ 2219479 2177845 2120511 2048413 1939158 1841548 1759194 1615239 1482714 1373167 1266345
14076A266345j32088n7315l5638m8119m8854m6091p6932o9247p305M672m757n5917
$$ 1266345 1134257 1076942 1041304 993185 944331 898240 821308 752061 744756 749428 744671 688754
14064F88754m4828l1008k1860J0268O479k070l0392j8056J374j3984K515l4603
$$ 688754 643926 612918 591058 601326 607805 605735 575343 557287 558661 544677 547192 512589
14052E12589l5760k4447N8434K8829l4968P244k9306l3773l8751m1754j9801J4464
$$ 512589 476829 452382 510816 539645 504677 511921 482615 448842 410091 368337 348536 363000
14040C63000o78k0305J5083J6999k0235m6586j7146p911K4899K3348o595j767
$$ 363000 362322 342017 357100 374099 353864 307278 290132 282221 307120 330468 323873 322106
14028C22106J2351j4275j2661p2672k1773Q441P724j7421k2133j6051k2451L320
$$ 322106 334457 320182 307521 234849 213076 221517 229241 211820 189687 173636 151185 154505
14016A54505R302M5236J7251j6699L171P195m659J304K5966N165l2020j9835k5930
$$ 154505 163807 209043 226294 209595 212766 219961 215302 216606 242572 247737 215717 195882 169952
14003A69952J1989L7993Q445k2177J1258M601l8089m4255j5123K3398K6108L0559
$$ 169952 181941 219934 228379 206202 217460 222061 183972 139717 124594 147992 174100 204659
13991B04659k3953k662k907m7046j5378K2808J1353k266m555k1865l0897j3030
$$ 204659 180706 178044 175137 128091 112713 135521 146874 144608 140053 118188 87291 74261
13979G4261k0344J1351Q569K6832J0716k0418J16J8477l2417R391n317J7976K3740
$$ 74261 53917 65268 73837 100669 111385 90967 91083 109560 77143 86534 81217 99193 122933
13966A22933K85J3908j2292j5774J7296m148k659L12l694o747K6737J7831K7444
$$ 122933 123218 137126 124834 109060 126356 122208 119549 119861 116167 109420 136157 153988 181432
13953A81432Q414M666j2761l1252o214K6291n455j1648m1948j4563K4921M2321
$$ 181432 189846 194512 181751 150499 144285 170576 165121 153473 111525 96962 121883 164204
13941A64204j8092J206j1727j7649P853J1113j3566P905j2594Q169R92k8430j770
$$ 164204 146112 147318 135591 117942 125795 136908 123342 131247 118653 126822 127814 99384 97614
13928I7614K6483n0863k0516K2737K561j1726r939j089k2520q623L8898m8399
$$ 97614 124097 73234 52718 75455 78016 66290 56351 55262 32742 24119 63017 14618
13916A4618Q169J7322J6947K5296J7629m9338l8103K6318L3252J9977l066r331
$$ 14618 22787 40109 57056 82352 99981 50643 12540 38858 72110 92087 89021 79690
13904G9690J1710m0421j2166k6584J9182J6995l5150j4511j2990j427L5252K1098
$$ 79690 91400 50979 38813 12229 31411 48406 13256 -1255 -14245 -15672 19580 40678
13892D0678R994N557p927n070l9959j1595k804j7913l2127j4486L8266M0708J9877
$$ 40678 50672 56229 48302 43232 3273 -8322 -11126 -29039 -61166 -75652 -37386 3322 23199
13879B3199p81o869J9752O066k8847Q701K639K1119m102K7461N26R422M659J6138
$$ 23199 22418 15549 35301 41367 12520 21221 23860 44979 40877 68338 68864 78286 82945 99083
13865I9083j6643l5054r334k2240l5338Q387n097J838k3128Q057L4406N171M1590
$$ 99083 82440 47386 38052 15812 -19526 -11139 -16236 -14398 -37526 -29469 4937 10108 51698
13852E1698J7508m284k8242P755l3075q543K0743L84k9738n604p23J3080k522
$$ 51698 69206 64922 36680 44435 11360 2817 23560 23944 -5794 -11398 -12121 959 -1563
13839a563J4170p97L174L2282K4599L68r104k2607J8835j3639m039K0333k5957
$$ -1563 12607 11810 14984 47266 71865 72233 63129 40522 59357 45718 41679 62012 36055
13826C6055l2385J6925J3473K6928J5022m8138m6417j7359J7838j2705k7299R062
$$ 36055 3670 20595 34068 60996 76018 27880 -18537 -35896 -18058 -30763 -58062 -49000
13814d9000O842K6282k821K6360M7622J6401l4390k9704k523p547J9520J5577
$$ -49000 -42158 -15876 -18697 7663 55285 71686 37296 7592 5069 -2478 17042 32619
13802C2619j599l2734R222J1558K755l4406%l301J5127J3410J0599K2780k1818
$$ 32619 31020 -1714 7508 19066 21821 -12585 -12585 -15886 -759 12651 23250 46030 24212
13789B4212J5577K6327K3476m99l3268k8363l0143R565K8594K2579J5629J3762
$$ 24212 39789 66116 89592 89093 55825 27462 -2681 6884 35478 58057 73686 87448
13777H7448L399k5637j5182k4512M7194j1937l6084K4611j7118k1317k1869j4429
$$ 87448 90847 65210 50028 25516 72710 60773 24689 49300 32182 10865 -11004 -25433
13765b5433k024K0120M3683j7571J1969J8497R539l325l6083k6060K3501p077
$$ -25433 -27457 -7337 36346 18775 30744 49241 58780 55455 19372 -6688 16813 9736
13753I736O473K1006J7895j6895J4532k364n323L9737L2799j7095l705L3130J2880
$$ 9736 16209 37215 55110 38215 52747 50383 45060 84797 117596 100501 96796 129926 142806
13740A42806J6769M0679K858M9729O9250O9019Q4360J27555J43222Q3871K5650
$$ 142806 159575 200254 203112 252841 322091 391110 475470 603025 746247 830118 855768
13729H55768J2357K6367L526l7378p0735l4022l1253n1808o1250l9541o5852m2257
$$ 855768 868125 894492 898018 860640 789905 755883 724630 672822 611572 572031 506179 463922
13717D63922j8942n1708m7334m7887l354J1862k9287j5723J7194l7921q042J6555
$$ 463922 444980 393272 345938 298051 294697 306559 277272 261549 278743 240822 232780 249335
13705B49335K3766L1485Q416K4687M4328M6572N9054N8784N0001J21352P0705
$$ 249335 273101 304586 313002 337689 382017 428589 487643 546427 596428 717780 788485
13694G88485M9556O2023O5512K7491j839l6658l0873n1717r5003p5588r2624j22480
$$ 788485 838041 900064 965576 993067 991228 954570 923697 871980 776977 701389 608765 486285
13682D86285r4288p4084l0553m7310l4348j2098m5168j5382k9158j9232J2462
$$ 486285 391997 317913 287360 240050 205702 193604 148436 133054 103896 84664 97126
13671I7126l0909n8986l040k892J1802L6145K3427j6037o1952K1325L8042Q325
$$ 97126 66217 7231 4191 1299 13101 49246 72673 56636 -5316 16009 54051 62376
13659F2376j3675k9385M654K0459n53k1108k678L1090j0989m1632k3158J3103
$$ 62376 48701 19316 23970 44429 43876 22768 20090 51180 40191 -1441 -24599 -11496
13647a1496j0111K6933j3435K9375L7326j3257O481j6033k7450l1752p754P246
$$ -11496 -21607 5326 -8109 21266 58592 45335 51816 35783 8333 -23419 -31173 -23927
13635b3927L3008m327j354p458L4781o987p033K6822N851J1713k0109K83p671
$$ -23927 9081 4754 3400 -4058 30723 23736 16703 43525 49376 61089 40980 41263 33592
13622C3592K5245k5472n2098k5713l2475M2703N507j2301L3720l831N4558L5399
$$ 33592 58837 33365 -18733 -44446 -76921 -34218 -28711 -41012 -7292 -11123 43435 78834
13610G8834j1770j7910l7387l7280j5484o831r541K8745L6889K7045k9196L2130
$$ 78834 67064 49154 11767 -25513 -40997 -47828 -57369 -28624 8265 35310 6114 38244
13598C8244K9867J0981l624l3287l2753k4808L163l526K3598L2270N581j9421
$$ 38244 68111 79092 75468 42181 9428 -15380 -12217 -15743 7855 40125 45706 26285
13586B6285l6848M4283O648L225l4692Q900j3032J283Q986L735k4969P180P401
$$ 26285 -10563 33720 40368 43593 8901 17801 4769 6052 15038 18773 -6196 984 8385
13573H385K2578n089o683K4288L1439m3398j3506o50l2416O655k8772m805j4352
$$ 8385 30963 25874 19191 43479 74918 31520 18014 17364 -15052 -8397 -37169 -41974 -56326
13560e6326O914N9913J6585M151j134j8127k1309l975m695j8063l2759j116m637
$$ -56326 -49412 10501 27086 31237 30103 11976 -9333 -13308 -18003 -36066 -68825 -69941 -74578
13547g4578K1415N3753n209r200p745M7555j1365k4521j8628n175J8218j6125
$$ -74578 -53163 590 -4619 -13819 -21564 25991 14626 -9895 -28523 -33698 -15480 -31605
13535c1605k0434k0074K1525J7765l7308K135J3592M7049k1198m3161L0494N913
$$ -31605 -52039 -72113 -50588 -32823 -70131 -67996 -54404 -7355 -28553 -71714 -41220 -35307
13523c5307k2398N1964J9124l1365j650L9358l184k6249R759J2155N520N7j8665
$$ -35307 -57705 -5741 13383 -17982 -19632 19726 16542 -9707 52 12207 17727 17784 -881
13510h81k9506j8570k1736j1192J6785J8019K2026L2207j6494J063j6035j9142
$$ -881 -30387 -48957 -70693 -81885 -65100 -47081 -25055 7152 -9342 -8279 -24314 -43456
13498d3456L3684J6869k26n136J8497l127j9821l6094J013M1299K0421l0867k932
$$ -43456 -9772 7097 6871 1735 20232 17105 -2716 -38810 -37797 3502 23923 -6944 -9876
13485i876o246K8408P064L422K8056J486K4358K2364l8600r417N4382L922l8557
$$ -9876 -16122 12286 19350 22772 50828 52314 76672 99036 60436 51019 105401 109323 70766
13472G0766o1323k7229J5087L2004J6773k4820k7195L299p202k8650j3423k7063
$$ 70766 9443 -17786 -2699 29305 46078 21258 -5937 -2638 -9840 -38490 -51913 -78976
13460g8976K9661N9775J9285K2080L185p743m5456j4754l1924J3153K7420k8774
$$ -78976 -49315 10460 29745 51825 55010 47267 1811 -12943 -44867 -31714 -4294 -33068
13448c3068j0286J8083O0738L3687k1263k3236J3151K6456J2022l0019k2400j956
$$ -33068 -43354 -25271 35467 69154 47891 24655 37806 64262 76284 46265 23865 21909
13436B1909l0782k5204Q964L133P705J9845k297k4837k8816J1080M3040j9763
$$ 21909 -8873 -34077 -25113 -21980 -14275 5570 3273 -21564 -50380 -39300 3740 -16023
13424a6023k2164K0401L0877K502K776M069j1679k0145k2559k1618k3258J3039
$$ -16023 -38187 -17786 13091 15593 18369 22438 10759 -9386 -31945 -53563 -76821 -63782
13412f3782K4456k0267p808l513K0804j3510J1186J1545n304j088P685J348k3316
$$ -63782 -39326 -59593 -67401 -70914 -50110 -63620 -52434 -40889 -46193 -47281 -39596 -38248 -61564
13399f1564j636n3j8607j5433M519J8727J0445J1134M4423R440j8385l8557q150
$$ -61564 -63200 -63253 -81860 -97293 -92774 -74047 -63602 -52468 -8045 1395 -16990 -55547 -63697
13386f3697K7856R99j6661o909L6822L959L873M2884P882l9557r789n7339J2522
$$ -63697 -35841 -34842 -51503 -58412 -21590 -17631 -13758 29126 37008 -2549 -12338 -69677 -57155
13373e7155O759M785L3272o046l1808k1169K0987P99j3664L5341k3839R191L6703
$$ -57155 -50396 -45611 -12339 -18385 -50193 -71362 -50375 -49576 -63240 -27899 -51738 -42547 -5844
13360e844J8077J30k0394O042M6281k2652l0797P541J6323l3049j6378k2158j2453
$$ -5844 12233 12363 -8031 -1989 44292 21640 -9157 -1616 14707 -18342 -34720 -56878 -69331
13347f9331J3364K3026J0668p122j1875J1041L4208K6231P937K3414K8462P384
$$ -69331 -55967 -32941 -22273 -29395 -41270 -30229 3979 30210 38147 61561 90023 97407
13335I7407j4523m5286m3379p6842k459L4752M7088M7154Q360m0804j0479J9555
$$ 97407 82884 37598 -5781 -82623 -85082 -50330 -3242 43912 52272 11468 989 20544
13323B0544m412j748j0158N809k8902j4246l074K2593J7939l666m8415m3962J5932
$$ 20544 16132 14384 4226 10035 -18867 -33113 -36187 -13594 4345 679 -47736 -91698 -75766
13310g5766K2237O556L4371K5370r809J7470J1511k3474R51o865j3596K4425M0091
$$ -75766 -53529 -46973 -12602 12768 2959 20429 31940 8466 9417 2552 -11044 13381 53472
13297E3472K2989j69j9156l2673k3458n7471j8370J5375j0519J2234j4331j132
$$ 53472 76461 76292 57136 24463 1005 -56466 -74836 -59461 -69980 -57746 -72077 -73209
13285g3209L7474K8235J0784j4645O5674J6229l1167J933l2643j2252R088L95
$$ -73209 -35735 -7500 3284 -11361 54313 70542 39375 41308 8665 -3587 5501 5896
13273E896Q92K0302p764o579J5318j333q47J7261k0187k6178l2219o347N4125
$$ 5896 6788 27090 19326 12747 28065 26732 25885 43146 22959 -3219 -35438 -41785 12340
13260A2340J1837L1263R021k1354l542k8079k8418J1438o3416j3219P2736L8369
$$ 12340 24177 55440 64461 43107 39565 11486 -16932 -5494 -68910 -82129 -9393 28976
13248B8976k4413j9580m7281M604K9641N4312O6878K0o7260l9159k3371l860J1966
$$ 28976 4563 -15017 -62298 -57694 -28053 26259 93137 93157 25897 -13262 -36633 -40493 -28527
13235b8527M563K7177N196l2965n5566j3834O7454J8168k306O778L668R411l1371
$$ -28527 -23964 3213 8409 -24556 -80122 -93956 -26502 -8334 -10640 -3862 -194 9217 -22154
13222b2154o200J6424k61J7044J3184j3690J722L106l8319J2212J2261J1654J4692
$$ -22154 -28354 -11930 -12191 4853 18037 4347 6069 9175 -29144 -16932 -4671 6983 21675
13209B1675j6481l1290j8255K432M6150L5757K8983j1333m6106K9791J4002k7314
$$ 21675 5194 -26096 -44351 -41919 4231 39988 68971 57638 11532 41323 55325 28011
13197B8011k9700j5542J3490J0545j1988O2813K9393K4537J4014j0147M2212M8885
$$ 28011 -1689 -17231 -3741 6804 -5184 57629 87022 111559 125573 115426 157638 206523
13185B06523J01013J54455J65016R5564j539j44876j57636j17585r8909l1747
$$ 206523 307536 461991 627007 722571 721032 576156 418520 300935 202026 170279
13175A70279j1882l4241j1540j2828k9416l3437l0921O768n313Q493j8815l504
$$ 170279 158397 124156 112616 99788 70372 36935 6014 12782 7469 15962 -2853 -6357
13163f357J9845M5132L1000R667l5780J083J6161j9055J06N724r297J7916R083
$$ -6357 13488 58620 89620 99287 63507 64590 80751 61696 61802 67526 58229 76145 85228
13150H5228Q361J3721R859J7079J9439K5524R0762J03150Q1560J54642L38144
$$ 85228 93589 107310 117169 134248 153687 179211 269973 373123 454683 609325 947469
13139I47469N15287N68351M08219j0922l97628n82565m63261l23833k08222j47478
$$ 947469 1462756 2031107 2439326 2428404 2030776 1448211 984950 661117 452895 305417
13129C05417n4193q387j6265k2837m7998l5062l7441Q157Q134j8361m7447J51
$$ 305417 251224 242837 226572 203735 155737 120675 83234 91391 99525 81164 33717 33868
13117C3868k848j8582J9518J7463L3394K2530J8661Q935k9104l2582k8089K6335
$$ 33868 31020 12438 31956 49419 82813 105343 124004 132939 103835 71253 43164 69499
13105F9499N3054N8116K2328j8301l9289m088N9365N9619Q3600K04514K98760
$$ 69499 122553 180669 202997 184696 145407 141319 200684 260303 343903 548417 847177
13094H47177M51870O19942N29775J04349l66086n76080n35821l69309j95354j09191
$$ 847177 1299047 1918989 2448764 2553113 2187027 1610947 1075126 705817 510463 401272
13084D01272j16550p4617k6458l8365Q882k4784N318m4716m1133L682n602j097
$$ 401272 284722 210105 183647 145282 154164 129380 134698 89982 48849 52531 46929 45832
13072D5832j1368m8495k9593K8943M5057j4232j3140K4612K9071l6379k9611K1287
$$ 45832 34464 -14031 -43624 -14681 30376 16144 3004 27616 56687 20308 -9303 11984
13060A1984N8225J8266m182P517L165k7037j6183L6652M3685O8845J30887J07234
$$ 11984 70209 88475 84293 91810 94975 67938 51755 88407 132092 200937 331824 439058
13048D39058J98656J89285O7787q9705j84175j73943j56606j26254o6411k6868
$$ 439058 637714 826999 894786 805081 620906 446963 290357 164103 97692 70824
13038G0824j8875k473l453l4743n6521k4334R648r775K5767N6068J6451k538k0898
$$ 70824 51949 49476 46023 11280 -45241 -69575 -59927 -69702 -43935 12133 28584 26046 5148
13025E148k9577m652J8792L7369j0302n627k9042p890j3973j557K7642O015J0752
$$ 5148 -24429 -29081 -10289 27080 16778 11151 -17891 -25781 -39754 -41311 -13669 -7654 3098
13012C098q095k2212j4685j9497J1224n1746j774L8462j8519J2540K5102J8756
$$ 3098 -4997 -27209 -41894 -61391 -50167 -101913 -103687 -65225 -83744 -71204 -46102 -27346
13000b7346J2594k0985q241K2471N0751R330m0371k1150K4548J179M1480J8478
$$ -27346 -14752 -35737 -43978 -21507 29244 38574 -1797 -22947 1601 2780 44260 62738
12988F2738j4304l643j2444l9164k0368j8891N391P454L0344Q902k1687n832L628
$$ 62738 48434 44791 32347 -6817 -27185 -46076 -40685 -33231 -2887 6015 -15672 -21504 -17876
12975a7876l4936K7044J6666J8986j2574k848j7181j0082k9561J0455O2265M9552
$$ -17876 -52812 -25768 -9102 9884 -2690 -5538 -22719 -32801 -62362 -51907 10358 59910
12963E9910n689k5380k6291o6752j4172l308L3105K807N1130P054o8205J1726
$$ 59910 54221 28841 2550 -64202 -78374 -81682 -48577 -45770 5360 12414 -55791 -44065
12951d4065K0521J0476K0577K3813L670K5873j2916j4595l4514j6308J8444J2203
$$ -44065 -23544 -13068 7509 31322 34992 60865 47949 33354 -1160 -17468 976 13179
12939A3179k9029J714r536K8236l270j671J3455J5057K102q057K6997R493l0294
$$ 13179 -15850 -14136 -23672 4564 1294 -377 13078 28135 30237 22180 49177 58670 28376
12926B8376M17k9512k8022K3583K5140j2442m2727o567m76J6895J5039k9373J5709
$$ 28376 28793 -719 -28741 -5158 19982 7540 -35187 -41754 -42230 -25335 -10296 -39669 -23960
12913b3960O321N605j4929P331l7250J7856l130k9296m33M6879k6157k9017L0485
$$ -23960 -17639 -12034 -26963 -19632 -56882 -39026 -42156 -71452 -71885 -25006 -51163 -80180 -49695
12900d9695K2550J3106k635N736L8730L9225O103K102l1046l0394K4261J6496
$$ -49695 -27145 -14039 -16674 -10938 27792 67017 73120 75222 44176 13782 38043 54539
12888E4539m4068j6250K8548K2175o049J4746l9063n8221J4q286j3386K0L706
$$ 54539 10471 -5779 22769 44944 38895 53641 14578 -43643 -43629 -51915 -65301 -65281 -61575
12875f1575k0331K2117J8073K0362K6394r083q360p734J5505N5101p250k5315
$$ -61575 -81906 -59789 -41716 -21354 5040 -4043 -12403 -20137 -4632 50469 43219 17904
12863A7904j7231L0304k2913k4128j2912l7512k1257J5505J4924j1478j6780l97
$$ 17904 673 30977 8064 -16064 -28976 -66488 -87745 -72240 -57316 -68794 -85574 -85971
12851h5971K2744L6650K931k2872j3753L514K385L9765J8857j7005j275n787J2308
$$ -85971 -63227 -26577 -23646 -46518 -60271 -56757 -54372 -14607 4250 -12755 -14030 -19817 -7509
12838g509P255q703k764J150L3527P381k6422m1980N203m184L53J784k3869L8179
$$ -7509 -254 -8957 -11721 -10571 22956 30337 3915 -38065 -32862 -37046 -36693 -34909 -58778 -20599
12824b0599M8547R165J6102l877j4819j5336Q499J668n3060m1244N046k794p800
$$ -20599 27948 37113 53215 49338 34519 19183 27682 29350 -23710 -64954 -59908 -62702 -70502
12811g0502O3974O5264J277n8303K671M648j5456k0113K0402K7097P665j916J4194
$$ -70502 -6528 58736 60013 1710 4381 9029 -6427 -26540 -6138 20959 28624 26708 40902
12798D0902j6805k2631j5997k3793l2590J0896K2284o322L6434J1825o400j8265
$$ 40902 24097 1466 -14531 -38324 -70914 -60018 -37734 -44056 -7622 4203 -2197 -20462
12786b0462j3721L7159J5371m253k4971J2904J3964m3799m7435J6068r860n5005
$$ -20462 -34183 2976 18347 14094 -10877 2027 15991 -27808 -75243 -59175 -69035 -124040
12774a24040L381L6175M816J4633J9600Q800K7072J7078n228J7633J4581J0754
$$ -124040 -120659 -84484 -79668 -65035 -45435 -36635 -9563 7515 2287 19920 34501 45255
12762D5255J8464n9792k8331k5178N5122L6087l4654k8809k7201j6393N997L5862
$$ 45255 63719 3927 -24404 -49582 5540 41627 6973 -21836 -49037 -65430 -59433 -23571
$$ [...]
##END NTUPLES=NMR SPECTRUM
##END=
