##TITLE=Analysis number 325979
Compound Code cc 57803
Book Reference 449/164
Project Code adrs
Chemist Name davee
##JCAMPDX= 6.0         $$ Bruker NMR JCAMP-DX V2.0
##DATA TYPE= NMR SPECTRUM
##DATA CLASS= NTUPLES
##ORIGIN= Bruker BioSpin GmbH
##OWNER= nmr
$$ XWIN-NMR		Version 3.5
$$ Mon Jan 22 11:23:15 2007 GMT Standard Time (UT+0h)  MAYBRIDGE\nmr@NMR_250MHZ
##.OBSERVE FREQUENCY= 250.131544655141
##.OBSERVE NUCLEUS= ^1H
##.ACQUISITION MODE= SIMULTANEOUS (DQD)
##.ACQUISITION SCHEME= undefined
##.AVERAGES= 16
##.DIGITISER RES= 18
##SPECTROMETER/DATA SYSTEM= dpx250
##.PULSE SEQUENCE= zg30
##.SOLVENT NAME= CDCl3
##.SHIFT REFERENCE= (INTERNAL, CDCl3, 0, 16.522)
##AUDIT TRAIL= $$ (NUMBER, WHEN, WHO, WHERE, WHAT)
$$ ##TITLE= Audit trail, XWIN-NMR		Version 3.5
$$ ##JCAMPDX= 5.01
$$ ##ORIGIN= Bruker BioSpin GmbH
$$ ##OWNER= nmr
$$ C:\u/data/dgb/nmr/ADRS/1540/pdata/1/auditp.txt
$$ ##AUDIT TRAIL=  $$ (NUMBER, WHEN, WHO, WHERE, WHAT)
(   1,<2007-01-22 11:22:50.66 +000>,<MAYBRIDGE\nmr>,<NMR_250MHZ>,
      <created by zg, POWCHK disabled, PULCHK disabled
       configuration hash MD5:
       49 4B E0 1D 92 C2 6B 37 9F E6 65 BC 52 41 86 1D
       data hash MD5: 64K
       F6 BD 6A 90 8F AE E3 0B 35 D4 9D 69 F2 BB EB 37>)
(   2,<2007-01-22 11:23:05.11 +000>,<MAYBRIDGE\nmr>,<NMR_250MHZ>,
      <Start of raw data processing
       ef LB = 0.3 FT_mod = 6 PKNL = 1 SI = 32K 
       data hash MD5: 32K
       07 BB 2A 88 E0 4A 35 02 C1 EA A7 19 B7 98 70 F4>)
(   3,<2007-01-22 11:23:06.77 +000>,<MAYBRIDGE\nmr>,<NMR_250MHZ>,
      <apk 
       data hash MD5: 32K
       96 8E 85 48 42 81 F4 84 01 77 F7 4D 8B D7 34 D3>)
(   4,<2007-01-22 11:23:07.52 +000>,<MAYBRIDGE\nmr>,<NMR_250MHZ>,
      <abs ABSG = 5 
       data hash MD5: 32K
       95 BA 62 B8 3C 66 36 49 BA F2 CB 4D 94 7F E7 BE>)
$$ ##END=
$$ 
$$ hash MD5
$$ 7D DC 9F A8 6A ED 89 E9 B7 B9 51 6F EF F2 32 68
##$RELAX= 
##$RELAX= 
##$RELAX= 
##$RELAX= 
##$RELAX= 
##$RELAX= 
##$RELAX= 
$$ Bruker specific parameters
$$ --------------------------
##$DU= <C:\u>
##$EXPNO= 1540
##$NAME= <ADRS>
##$PROCNO= 1
##$TYPE= <nmr>
##$USER= <dgb>
##$AMP= (0..31)
100 100 100 100 100 100 100 100 100 100 100 100 100 100 100 100 100 100 
100 100 100 100 100 100 100 100 100 100 100 100 100 100 
##$AQSEQ= 0
##$AQ_mod= 3
##$AUNM= <au_zg>
##$AUTOPOS= <31 >
##$BF1= 250.13
##$BF2= 250.13
##$BF3= 250.13
##$BF4= 250.13
##$BF5= 500.13
##$BF6= 500.13
##$BF7= 500.13
##$BF8= 500.13
##$BYTORDA= 1
##$CFDGTYP= 0
##$CFRGTYP= 5
##$CHEMSTR= <none>
##$CNST= (0..31)
1 1 145 1 1 1 1 1 1 1 1 1 1 1 1 1 1 1 1 1 1 1 1 1 1 1 1 1 1 1 1 1 
##$CPDPRG= <>
##$CPDPRG1= <>
##$CPDPRG2= <>
##$CPDPRG3= <>
##$CPDPRG4= <mlev>
##$CPDPRG5= <mlev>
##$CPDPRG6= <mlev>
##$CPDPRG7= <mlev>
##$CPDPRG8= <mlev>
##$CPDPRGB= <>
##$CPDPRGT= <>
##$D= (0..31)
0 1 0 0 0 0 0 0 0 0.06 0 0 0 0 0 0 0.0002 0 0 0 0 0 0 0 0 0 0 0 0 0 0 
0 
##$DATE= 1169464969
##$DBL= (0..7)
120 120 120 120 120 120 120 120 
##$DBP= (0..7)
150 150 150 150 150 150 150 150 
##$DBP07= 0
##$DBPNAM0= <>
##$DBPNAM1= <>
$$ [...]
##$SUBNAM7= <"">
##$SUBNAM8= <"">
##$SUBNAM9= <"">
##$SW= 20.6930455092707
##$SWIBOX= (0..15)
0 0 3 0 0 0 0 0 0 0 0 0 0 0 0 0 
##$SW_h= 5175.983436853
##$TD= 65536
##$TD0= 1
##$TE= 294.16
##$TE2= 300
##$TE3= 300
##$TEG= 300
##$TL= (0..7)
0 120 120 120 120 120 120 120 
##$TP= (0..7)
150 150 150 150 150 150 150 150 
##$TP07= 0
##$TPNAME0= <>
##$TPNAME1= <>
##$TPNAME2= <>
##$TPNAME3= <>
##$TPNAME4= <>
##$TPNAME5= <>
##$TPNAME6= <>
##$TPNAME7= <>
##$TPOAL= (0..7)
0.5 0.5 0.5 0.5 0.5 0.5 0.5 0.5 
##$TPOFFS= (0..7)
0 0 0 0 0 0 0 0 
##$TUNHIN= 0
##$TUNHOUT= 0
##$TUNXOUT= 0
##$USERA1= <user>
##$USERA2= <user>
##$USERA3= <user>
##$USERA4= <user>
##$USERA5= <user>
##$V9= 5
##$VALIST= <valist>
##$VCLIST= <CCCCCCCCCCCCCCC>
##$VD= 0
##$VDLIST= <DDDDDDDDDDDDDDD>
##$VPLIST= <PPPPPPPPPPPPPPP>
##$VTLIST= <TTTTTTTTTTTTTTT>
##$WBST= 1024
##$WBSW= 4
##$XGAIN= (0..3)
0 0 0 0 
##$XL= 0
##$YL= 0
##$YMAX_a= 403519
##$YMIN_a= -470925
##$ZGOPTNS= <>
##$ZL1= 120
##$ZL2= 120
##$ZL3= 120
##$ZL4= 120
##$ABSF1= 16.522
##$ABSF2= -4.171173
##$ABSG= 5
##$ABSL= 3
##$ALPHA= 0
##$AQORDER= 0
##$ASSFAC= 0
##$ASSFACI= 0
##$ASSFACX= 0
##$ASSWID= 0
##$AUNMP= <proc_1d>
##$AZFE= 0.1
##$AZFW= 0.1
##$BCFW= 0
##$BC_mod= 0
##$BYTORDP= 0
##$COROFFS= 0
##$CY= 12.5
##$DATMOD= 1
##$DC= 0
##$DFILT= <>
##$DTYPP= 0
##$F1P= 14.0000005364418
##$F2P= -0.99999901652339
##$FCOR= 0.5
##$FTSIZE= 32768
##$FT_mod= 6
##$GAMMA= 0
##$GB= 0
##$INTBC= 1
##$INTSCL= 1
##$ISEN= 128
##$LB= 0.3
##$LEV0= 0
##$LPBIN= 0
##$MAXI= 10000
##$MC2= 0
##$MEAN= 0
##$ME_mod= 0
##$MI= 0
##$NCOEF= 0
##$NC_proc= -4
##$NLEV= 6
##$NOISF1= 0
##$NOISF2= 0
##$NSP= 0
##$NTH_PI= 0
##$NZP= 0
##$OFFSET= 16.522
##$PC= 1
##$PHC0= 230.3002
##$PHC1= 3.15616
##$PH_mod= 1
##$PKNL= yes
##$PPARMOD= 0
##$PSCAL= 4
##$PSIGN= 0
##$REVERSE= no
##$SF= 250.13
##$SI= 32768
##$SIGF1= 0
##$SIGF2= 0
##$SINO= 400
##$SIOLD= 32768
##$SREGLST= <1H.CDCl3>
##$SSB= 0
##$STSI= 32768
##$STSR= 0
##$SW_p= 5175.98343685301
##$SYMM= 0
##$S_DEV= 0
##$TDeff= 65536
##$TDoff= 0
##$TI= <Analysis number 999999
Compound Code 99
Book Reference 9
Project Code 9>
##$TILT= no
##$TM1= 0
##$TM2= 0
##$TOPLEV= 0
##$USERP1= <user>
##$USERP2= <user>
##$USERP3= <user>
##$USERP4= <user>
##$USERP5= <user>
##$WDW= 1
##$XDIM= 32768
##$YMAX_p= 285076271
##$YMIN_p= -138828
$$ End of Bruker specific parameters
$$ ---------------------------------
##NTUPLES= NMR SPECTRUM
##VAR_NAME=  FREQUENCY,     SPECTRUM/REAL,   SPECTRUM/IMAG
##SYMBOL=    X,             R,               I
##VAR_TYPE=  INDEPENDENT,   DEPENDENT,       DEPENDENT
##VAR_FORM=  AFFN,          ASDF,            ASDF
##VAR_DIM=   32768,         32768,           32768
##UNITS=     HZ,            ARBITRARY UNITS, ARBITRARY UNITS
##FACTOR=    0.157963299565203, 1,           1
##FIRST=     4132.6476996994, 0,             0
##LAST=      -1043.33573715361, 0,           0
##MIN=       -1043.33573715361, -138828,     0
##MAX=       4132.6476996994, 285076271,     0
$$ Real data points
##PAGE= N=1
##DATA TABLE= (X++(R..R)), XYDATA
$$ [...]
$$ plain form
17308 -86427 -84321 -91267 -60852 -47243 -41437 -60897 -49068 -28577 -58930 -64836 -35240 -48320
17296 -48320 -65692 -43687 -11919 33425 63860 47852 19223 44931 36021 -24461 -22541 -27272
17284 -27272 -27128 -42844 -34367 -23233 -35926 -48428 -49740 -22975 -40293 -72183 -63676 -62972 -29510
17271 -29510 -10675 -17406 -38864 -36701 -22306 -12819 -33105 -34501 -38413 -26595 -48026 -33291 -16260
17258 -16260 -29807 -26894 -22575 -19450 -17595 -18372 -34054 -320 32791 32225 26408 4622 -18142
17245 -18142 33272 15889 -24791 -33066 -50029 -67260 -51949 -29470 -54496 -67201 -63098 -42820
17233 -42820 -30244 -28996 -1789 14350 24109 1224 -41031 -40691 -11610 37441 57409 46387
17221 46387 25182 -6765 -31944 -69206 -48056 -11401 12713 5985 -2174 -21140 6248 21732
$$ packed form
17308h6427K106o946L0415J3609N806j9460J1829K0491l0353n906K9596j3080
17296d8320j7372K2005L1768M5344L0435j6008k8629K5708q910o0482J920m731
17284b7272J44j5716Q477J1134j2693j2502j312K6765j7318l1890Q507P04L3462
17271b9510J8835o731k1458K163J4395R487k0286j396l912J1818k1431J4735J7031
17258a6260j3547K913M319L125J855p77j5682L3734L3111n66n817k1786k2764
17245a8142N1414j7383m0680q275j6963j7231J5311K2479k5026j2705M103K0278
17233d2820J2576J248K7207J6139R759k2885m2255L40K9081M9051J9968j1022
17221D6387k1205l1947k5179l7262K1150L6655K4114o728q159j8966K7388J5484
$$ plain form
17209 21732 3042 -11762 -43195 -59541 -87996 -62759 -16108 2893 10836 -2300 -30605 -45088
17197 -45088 -70999 -71762 -54016 -44160 -23846 -19581 -23791 -18352 7947 30566 -8832 -41551 -50925
17184 -50925 -53668 -60974 -59395 -77786 -76217 -47842 -33093 10198 8643 -10617 -41626 -57040 -34293
17171 -34293 9328 75862 67489 27971 15812 -3817 -40982 -58760 -36589 -7642 -5180 -32760
17159 -32760 -37321 2812 37724 42159 18811 -19401 -28194 16697 22993 13922 -4855 -42824 -23422
17146 -23422 -42797 -61124 -32323 -16171 21926 46406 37620 4258 -24678 -45947 -34325 -28755
17134 -28755 -34423 -35597 -49621 -47484 -19259 -37416 -53426 -45191 -13348 -6527 -3486 -29370 -47790
17121 -47790 -65170 -45509 -45712 -43545 11159 24276 -15709 -55295 -35748 -18477 -30510 -14093
$$ packed form
17209B1732j8690j4804l1433j6346k8455K5237M6651J9001P943j3136k8305j4483
17197d5088k5911p63J7746R856K0314M265m210N439K6299K2619l9398l2719r374
17184e0925k743p306J579j8391J569K8375J4749M3291j555j9260l1009j5414K2747
17171c4293M3621O6534q373l9518j2159j9629l7165j7778K2171K8947K462k7580
17159c2760m561M0133L4912M435k3348l8212q793M4891O296r071j8777l7969J9402
17146b3422j9375j8327K8801J6152L8097K4480q786l3362k8936k1269J1622N570
17134b8755n668j174j4024K137K8225j8157j6010Q235L1843O821L041k5884j8420
17121d7790j7380J9661k03K167N4704J3117l9985l9586J9547J7271j2033J6417
$$ plain form
17109 -14093 7777 -18915 -43206 -6896 17977 51893 27715 8353 -22050 -43317 -57912 -46071
17097 -46071 -6376 30066 33525 60330 71010 54931 10413 -14314 -1615 9476 -1845 -13908
17085 -13908 -18442 -19464 -22672 2102 -2865 2748 56642 57957 52909 79748 95924 81235 8024
17072 8024 -1063 -2823 -25716 4685 25690 -6554 -46058 -54994 -52059 -31379 -33132 -45347 -64818
17059 -64818 -66239 -75643 -54732 -51966 -62785 -16553 -19544 -12926 -46335 -72471 -47805 -32737 -37165
17046 -37165 -39172 -35345 -6874 -3267 18930 46829 60949 57388 17244 2004 -994 -30241 -30924
17033 -30924 -2261 16967 15835 43835 -5625 -6449 893 -24898 -22430 2292 981 -25645 -30890
17020 -30890 -16287 24337 14897 -10640 -25039 -65440 -47084 -28086 -20608 -40910 -46501 -26252
$$ packed form
17109a4093K1870k6692k4291L6310K4873L3916k4178j9362l0403k1267j4595J1841
17097d6071L9695L6442L459K6805J0680j6079m4518k4727J2699J1091j1321j2063
17085a3908m534j022l208K4774m967N613N3894J315n048K6839J6176j4689p3211
17072H024r087j760k2893L0401K1005l2244l9504q936K935K0680j753j2215j9471
17059f4818j421r404K0911K766j0819M6232k991O618l3409k6136K4666J5068m428
17046c7165k007L827K8471L607K2197K7899J4120l561m0144j5240k998k9247o83
17033c0924K8663J9228j132K8000m9460q24P342k5791K468K4722j311k6626n245
17020c0890J4603M0624r440k5537j4399m0401J8356J8998P478k0302n591K0249
$$ plain form
17008 -26252 18328 8782 4333 -12910 -31795 -25885 -27568 -60805 -109784 -61222 -22221 -19950 -60993
16995 -60993 -85172 -79353 -36906 -16873 8492 24171 15343 -1065 -49030 -46510 -19263 -31586
16983 -31586 -44994 -19601 -27501 -34787 -73752 -80682 -74518 -46964 -22527 -43531 -40114 -11732 -185
16970 -185 -60551 -67883 -70537 -45131 -2698 37016 72313 45439 26016 9795 6748 -20362 -1762
16957 -1762 -4395 -52494 -45727 -36234 17938 56301 44826 -20323 -23287 11284 9721 4255 44641
16944 44641 39473 8446 -25463 -12875 -7713 8368 7929 -2880 1010 -28275 -32709 -29758 -22943
16931 -22943 -4556 2476 10473 7664 16436 -238 -75833 -83175 -117313 -106467 -53459 -11730 -10551
16918 -10551 -9727 -7043 -15618 -12440 -40580 -58130 -8491 29291 32042 -32 -20264 -3839 -25459
$$ packed form
17008b6252M4580r546m449j7243j8885N910j683l3237m8979M8562L9001K271m1043
16995f0993k4179N819M2447K0033K5365J5679q828j6408m7965K520K7247j2323
16983c1586j3408K5393p900p286l8965o930O164K7554K4437k1004L417K8382J1547
16970a85o0366p332k654K5406M2433L9714L5297k6874j9423j6221l047k7110J8600
16957a762k633m8099O767R493N4172L8363j1475o5149k964L4571j563n466M0386
16944D4641n168l1027l3909J2588N162J6081m39j0809L890k9285m434K951O815
16931b2943J8387P032P997k809Q772j6674p5595p342l4138J0846N3008M1729J179
16918a0551Q24K684q575L178k8140j7550M9639L7782K751l2074k0232J6425k1620
$$ plain form
16905 -25459 -24021 -33074 -26700 -33073 5683 48863 42446 22576 9609 13711 -19627 -38232 -31547
16892 -31547 -10673 -44792 -65411 -39613 -46518 -57017 -54658 -65043 -65310 -55211 -77003 -51195
16880 -51195 -25767 16266 29886 13374 13411 -617 -67345 -110247 -113034 -83790 -47483 -17148
16868 -17148 -8275 -15778 3530 -547 3695 -38887 -78783 -81201 -86689 -83925 -71266 -57204 -20203
16855 -20203 -24092 -34642 -6967 -1546 3356 5746 -18485 -27390 -24885 -38186 -25277 18105 29682
16842 29682 14667 -979 -6009 4360 2240 -6803 3300 -10147 -9102 -44833 -44306 -68634 -77763
16829 -77763 -80353 -89603 -100343 -90009 -92611 -82520 -51298 -80339 -47475 2831 -30393 -43435
16817 -43435 12018 32065 -26636 -44024 -44297 -34925 -14457 -6806 -10475 -14242 14977 -22350 -66588
$$ packed form
16905b5459J438r053O374o373L8756M3180o417j9870j2967M102l3338j8605O685
16892c1547K0874l4119k0619K5798o905j0499K359j0385k67J0099k1792K5808
16880e1195K5428M2033J3620j6512L7j4028o6728m2902k787K9244L6307L0335
16868a7148Q873p503J9308m077M242m2582l9896k418n488K764J2659J4062L7001
16855b0203l889j0550K7675N421M902K390k4231q905K505j3301J2909M3382J1577
16842B9682j5015j5646n030J0369k120r043J0103j3447J045l5731N27k4328r129
16829g7763k590r250j0740J0334k602J0091L1222k9041L2864N0306l3224j3042
16817d3435N5453K0047n8701j7388k73R372K0468P651l669l767K9219l7327m4238
$$ plain form
16804 -66588 -57379 -24581 -57307 -43882 26712 42505 -23433 -26327 -11955 -38898 -36045 -26666
16792 -26666 -23507 15753 32161 11650 -27372 -33093 -9007 -17042 -66412 -93283 -40904 4234
16780 4234 12733 9155 -10145 -3708 20675 -154 -2632 -10524 -18508 -43306 -39675 -36920 -35671 -36073
16766 -36073 -24924 -23041 -4719 -1617 -21054 -38807 -33761 -31343 -42845 -44712 -44873 -18600 -2083
16753 -2083 -6781 -21530 -23426 -887 2685 5200 9719 -14499 -20930 -18452 -10344 14962 31667
16740 31667 11787 -19226 -17858 7395 -10131 -54670 -59255 -56121 -61996 -34265 -23164 22591
16728 22591 26497 -3971 -11251 2482 -636 26883 -6882 -29948 -66710 -51029 -44096 -40004 -36977
16715 -36977 -47808 -25926 -16691 -7566 -10682 -25872 -18465 -8742 3036 22412 26206 33922 23361
$$ packed form
16804f6588R209L2798l2726J3425P0594J5793o5938k894J4372k6943K853R379
16792b6666L159L9260J6408k0511l9022n721K4086q035m9370k6871N2379M5138
16780D234Q499l578j9300O437K4383k0829k478p892p984k4798L631K755J249m02
16766c6073J1149J883J8322L102j9437j7753N046K418j1502j867j61K6273J6517
16753b083m698j4749j896K2539L572K515M519k4218o431K478Q108K5306J6705
16740C1667j9880l1013J368K5253j7526m4539m585L134n875K7731J1101M5755
16728B2591L906l0468p280J3733l118K7519l3765k3066l6762J5681O933M092L027
16715c6977j0831K1882R235R125l116j5190P407R723J1778J9376L794P716j0561
$$ plain form
16702 23361 -2449 -6732 30286 -2442 -40162 -16940 22366 13618 28716 27421 34196 20734
16690 20734 45745 52824 23798 -17214 22309 4355 9282 23927 4522 7468 26521 52124
16678 52124 35682 36319 35808 1496 -11580 -47608 -59181 -29656 -5756 -23930 -36435 -11530
16666 -11530 6471 27453 53394 52216 10978 -18446 -3779 -2253 -19028 -42551 -40700 -33750
16654 -33750 -36513 -44163 -14653 -26043 -25295 -37609 -40759 -37795 -44234 -53877 -22466 16496 57349
16641 57349 35461 -13757 -36377 -25324 -19672 -974 -16999 -69378 -67946 -32350 -17144 -25607
16629 -25607 -27000 -30241 -19800 -40767 -57421 -51224 -47745 -39355 -50824 -56879 -79285 -85234 -58444
16616 -58444 -32190 -7942 -31995 -54380 -51673 -54889 -41319 -38861 -51602 -66834 -57389 -35842
$$ packed form
16702B3361k5810m283L7018l2728l7720K3222L9306q748J5098j295O775j3462
16690B0734K5011P079k9026m1012L9523j7954M927J4645j9405K946J9053K5603
16678E2124j6442O37n11l4312j3076l6028j1573K9525K3900j8174j2505K4905
16666a1530J8001K0982K5941j178m1238k9424J4667J526j6775k3523J851O950
16654c3750k763p650K9510j1390P48j2314l150K964o439r643L1411L8962M0853
16641E7349k1888m9218k2620J1053N652J8698j6025n2379J432L5596J5206q463
16629b5607j393l241J0441k0967j6654O197L479Q390j1469o055k2406n949K6790
16616e8444K6254K4248k4053k2385K707l216J3570K458j2741j5232R445K1547
$$ plain form
16604 -35842 -34066 -45344 -29188 -28383 -27319 -30502 -43086 -77643 -98593 -116986 -93091 -76118 -15438
16591 -15438 62827 46161 20947 11909 -22211 -50371 -90063 -91392 -60105 -62390 -83499 -52659
16579 -52659 -34575 -12529 -19544 -31698 -30727 -34332 -4440 28100 23505 28752 -1501 -18273 -41609
16566 -41609 -42808 -56035 -30782 18154 1731 -46292 -56083 -64202 -63285 -27784 -16839 -32661 -15897
16553 -15897 -15398 -7599 -27753 -55638 -84068 -122013 -67388 -44192 -70702 -67382 -40691 -21037
16541 -21037 -25735 -22572 -25524 -18900 16880 14978 -18001 -37008 -2712 -1484 7715 4814 24210
16528 24210 -385 -9870 31629 62901 56399 42097 60331 36346 4772 26696 12937 -48998
16516 -48998 -46512 -14426 230 11880 -12352 -56524 -22589 -31085 -29530 8158 -1114 -21184
$$ packed form
16604c5842J776j1278J6156Q05J064l183j2584l4557k0950j8393K3895J6973O0680
16591a5438P8265j6666k5214r038l4120k8160l9692j329L1287k285k1109L0840
16579e2659J8084K2046p015j2154R71l605K9892L2540m595N247l0253j6772k3336
16566d1609j199j3227K5253M8936j6423m8023r791q119R17L5501J0945j5822J6764
16553a5897M99P799k0154k7885k8430l7945N4625K3196k6510L320K6691J9654
16541b1037m698L163k952O624L5780j902l2979j9007L4296J228R199k901J9396
16528B4210k4595r485M1499L1272o502j4302J8234k3985l1574K1924j3759o1935
16516d8998K486L2086J4656J1650k4232m4172L3935q496J555L7688r272k0070
$$ plain form
16504 -21184 -7631 -11124 -54474 -73343 -41953 1143 18003 5793 -11891 13723 28430 18168
16492 18168 -12712 893 2436 -48965 -68294 -40601 -18817 -19708 -17045 -19930 -50299 -8467 50472
16479 50472 51120 15982 6532 15443 -13595 -14255 17135 -11232 -41999 -27251 17505 28237 23798
16466 23798 -10568 -44545 -54471 -26103 -37953 -63582 -42867 -34293 -21007 -23767 -18068 -14836 -12714
16453 -12714 -29348 -16003 21089 22876 44431 33273 24674 5059 -30226 -14124 458 11958
16441 11958 28520 17724 22183 5357 -3857 26345 20620 30121 38441 51354 69971 52064 34108
16428 34108 10688 -13891 -39710 -56621 -30166 7822 -4122 -21087 -22215 -35414 -47926 -69675
16416 -69675 -57634 -49062 -7903 50620 -3661 -56914 -41658 -5807 -26417 -44255 -43796 -682
$$ packed form
16504b1184J3553l493m3350j8869L1390M3096J6860j2210j7684K5614J4707j0262
16492A8168l0880J3605J543n1401j9329K7693K1784q91K663k885l0369M1832N8939
16479E0472O48l5138r450Q911k9038o60L1390k8367l0767J4748M4756J0732m439
16466B3798l4366l3977r926K8368j1850k5629K0715Q574J3286k760N699L232K122
16453a2714j6634J3345L7092J787K1555j1158q599j9615l5285J6102J4582J1500
16441A1958J6562j0796M459j6826r214L0202n725R501Q320J2913J8617j7907j7956
16428C4108k3420k4579k5819j6911K6455L7988j1944j6965j128j3199j2512k1749
16416f9675J2041Q572M1159N8523n4281n3253J5256L5851k0610j7838M59M3114
$$ plain form
16404 -682 10043 -6126 -19880 -9723 -27995 -50889 -52582 -59335 -44385 -33590 -27359 -17632 10140
16391 10140 28163 28431 -865 -34197 -36467 -22267 -26162 -24951 2957 2682 -33260 -50318 -45967
16378 -45967 -31094 -4908 6921 -6504 -33450 -49476 -51482 -17053 21061 17173 3990 -6504
16366 -6504 -47207 -46762 -14391 -10566 -41665 -44841 -61313 -53057 -14890 -18269 -17899 -14155 -40110 -72115
16352 -72115 -59845 -27175 39190 52454 21329 -13308 -14223 33581 61334 53843 53586 24049 -15058
16339 -15058 -25980 -10102 -15812 -11400 -8313 -12570 1075 8532 -1674 -30531 -2547 22190 -34133
16326 -34133 -61988 -21302 -1490 15495 6203 35309 4383 -27280 -24401 -63346 -69734 -46392
16314 -46392 -25743 -24754 -44582 -45106 -63492 -50172 -13253 11896 -20649 -44241 -23547 -49795
$$ packed form
16404f82J0725j6169j3754J0157j8272k2894j693o753J4950J0795O231R727K7772
16391A0140J8023K68k9296l3332k270J4200l895J211K7908k75l5942j7058M351
16378d5967J4873K6186J1829j3425k6946j6026k006L4429L8114l888j3183j0494
16366f504m0703M45L2371L825l1099l176j6472Q256L8167l379L70L744k5955l2005
16352g2115J2270L2670O6365J3264l1125l4637r15M7804K7753p491k57k9537l9107
16339a5058j0922J5878n710M412L087m257J3645P457j0206k8857K7984K4737n6323
16326c4133k7855M0686J9812J6985r292K9106l0926l1663K879l8945o388K3342
16314d6392K0649R89j9828n24j8386J3320L6919K5149l2545k3592K0694k6248
$$ plain form
16302 -49795 -41901 -33674 -27957 -28736 -31397 -28020 -50122 -75392 -88585 -37044 -2903 23601 58607
16289 58607 30710 -16284 -44787 -55438 -35942 -57671 -42747 -8893 -9808 -32291 -53149 -23492
16277 -23492 1877 -5587 -21867 -83064 -68558 -30493 -53612 -35191 -31845 -49695 -46443 4269
16265 4269 -14185 -3523 46862 -9684 -28573 -73463 -65624 -36805 -15122 -15099 -10633 8667 8511
16252 8511 -19981 -45890 -63901 -62894 -88641 -69334 -63839 -17233 29670 20801 -16542 -76071
16240 -76071 -89663 -108948 -115075 -129370 -77772 -48973 -55283 -13767 -7373 7227 12230 -1201
16228 -1201 19635 12211 14910 30971 20019 16103 31576 -1524 -16000 -3004 -10672 -35966 1522
16215 1522 -6866 -6283 474 -20279 -31633 -15063 -14876 -31847 -16369 14771 29906 -48 -53655
$$ packed form
16302d9795P894Q227N717p79k661L377k2102k5270j3193N1541L4141K6504L5006
16289E8607k7897m6994k8503j0651J9496k1729J4924L3854r15k2483k0858K9657
16277b3492K5369p464j6280o1197J4506L8065k3119J8421L346j7850L252N0712
16265D269j8454J0662N0385n6546j8889m4890P839K8819K1683K3M466J9300j56
16252H511k8492k5909j8011J007k5747J9307N495M6606M6903q869l7343n9529
16240g6071j3592j9285o127j4295N1598K8799o310M1516O394J4600N003j3431
16228a201K0836p424K699J6061j0952l916J5473l3100j4476J2996p668k5294L7488
16215A522q388N83O757k0753j1354J6570J87j6971J5478L1140J5135k9954n3607
$$ plain form
16202 -53655 -52988 -31467 -3317 -6339 -13615 -34233 -14584 632 -46595 -76038 -89623 -80229 -70336
16189 -70336 -15559 16343 5643 -436 3269 27604 10086 8456 27757 8967 -3339 -11440
16177 -11440 7384 40875 28436 -5452 607 43284 50725 33473 26239 20464 -9739 -34721
16165 -34721 -44134 -4941 47487 71615 23614 25601 43979 27415 -26214 -37427 -14402 24545
16153 24545 12933 18673 36338 -9297 -33223 -39114 -21703 -20784 -27186 -7690 112 24058 -3338
16140 -3338 1409 -6513 -21602 -37710 -43394 -35964 -31524 -48052 -41028 -48809 -16535 -4464 27376
16127 27376 50496 -4246 -11813 -15577 -31339 3774 26856 27544 19150 -13324 -26497 21372 33828
16114 33828 -33786 -36882 -44366 -15418 -12918 -23265 3413 28113 34759 45419 21123 42865
$$ packed form
16202e3655O67K1521K8150l022p276k0618J9649J5216m7227k9443j3585R394R893
16189g0336N4777L1902j0700o079L705K4335j7518j630J9301j8790j2306q101
16177a1440J8824L3491j2439l3888O059M2677P441j7252p234n775l0203k4982
16165c4721r413L9193N2428K4128m8001J987J8378j6564n3629j1213K3025L8947
16153B4545j1612N740J7665m5635k3926n891J7411R19o402J9496P802K3946k7396
16140c338M747p922j5089j6108n684P430M440j6528P024p781L2274J2071L1840
16127B7376K3120n4742p567l764j5762L5113K3082O88q394l2474j3173M7869J2456
16114C3828o7614l096p484K8948K500j0347K6678K4700O646J0660k4296K1742
$$ plain form
16102 42865 82155 78723 76238 82568 99092 77918 55160 46131 12147 -47399 -45072 -27091 -1649
16089 -1649 -1418 -42066 -53663 6736 41165 34778 20083 56199 35827 23146 31626 24950 23605
16076 23605 26502 10100 -24530 -21796 -12092 -28938 6263 26564 -8270 -38714 -36883 -34583 -73018
16063 -73018 -105840 -81453 -36710 -27388 -34598 -33591 -50327 -52796 -68354 -46206 -11795 -7196 -23150
16050 -23150 -1431 23814 15446 -14450 -20497 -29479 -10429 -45244 -57330 -58697 -48453 -31837
16038 -31837 -48035 -79493 -69581 -48782 -22571 3421 28500 34463 5696 -24589 -48834 -38884
16026 -38884 -24502 -16320 -155 -38076 -46248 -33328 -12370 -57185 -89805 -90614 -55296 -33109
16014 -33109 -44285 -112526 -126938 -81837 -69905 -52469 -19905 -28497 -23390 -11619 3726 -36754
$$ packed form
16102D2865L9290l432k485O330J6524k1174k2758r029l3984n9546K327J7981K5442
16089a649K31m0648j1597O0399L4429o387j4695L6116k0372j2681Q480o676j345
16076B3605K897j6402l4630K734R704j6846L5201K0301l4834l0444J831K300l8435
16063g3018l2822K4387M4743R322p210J007j6736k469j5558K2148L4411M599j5954
16050b3150K1719K5245q368k9896o047q982J9050l4815j2086j367J0244J6616
16038c1837j6198l1458R912K0799K6211K5992K5079N963k8767l0285k4245R950
16026c8884J4382Q182J6165l7921q172J2920K0958m4815l2620q09L5318K2187
16014c3109j1176o8241j4412M5101J1932J7436L2564q592N107J1771J5345m0480
$$ plain form
16002 -36754 -38564 -23775 809 73084 66543 33692 -5084 -62249 -73862 -46436 -41317 -69067
15990 -69067 -59041 -12967 -7793 1943 -24841 -49149 -46042 -3543 39455 48002 58000 79017 60859
15977 60859 36485 12405 -13016 -9219 -13857 -30803 -65023 -70057 -82415 -73342 -44846 -15021
15965 -15021 3741 -12747 -6031 -14100 -5410 10270 -3245 666 29339 22575 17545 6141 -24534
15952 -24534 -25806 -52688 -56896 -44908 -44901 -57118 -73014 -54986 -33815 16297 18767 -8113 2206
15939 2206 -9812 2386 21955 -3012 4141 32155 -8174 -22773 -33510 -48237 -48035 -16001
15927 -16001 -13872 -14920 11033 749 -9366 -560 12654 26654 5623 -6378 -8309 2007
15915 2007 32421 14236 15338 27975 -5295 -20375 -24885 -29124 -34646 -35835 -72334 -96551 -91486
$$ packed form
16002c6754j810J4789K4584P2275o541l2851l8776n7165j1613K7426N119k7750
15990f9067J0026M6074N174R736k6784k4308L107M2499M2998Q547R998K1017j8158
15977F0859k4374k4080k5421L797m638j6946l4220n034j2358R073K8496K9825
15965a5021J8762j6488O716q069Q690J5680j3515L911K8673o764n030j1404l0675
15952b4534j272k6882m208J1988Pj2217j5896J8028K1171N0112K470k6880J0319
15939B206j2018J2198J9569k4967P153K8014m0329j4599j0737j4727K02L2034
15927a6001K129j048K5953j0284j0115Q806J3214J4000k1031j2001j931J0316
15915B007L0414j8185J102J2637l3270j5080m510m239n522j189l6499k4217N065
$$ plain form
15902 -91486 -64653 -48883 -74578 -64799 -3616 18635 -23568 -46090 -44105 -65115 -58307 -11394
15890 -11394 29595 25991 397 -43143 -94147 -77578 -37643 -13412 -27450 -32543 -12756 37029
15878 37029 30249 -1462 -4992 -5480 6681 7701 -259 3800 2217 -208 3898 -9499 -25250 -9398
15864 -9398 -496 -43701 -24835 40820 41493 60114 25195 455 -35106 -73389 -60394 -90719
15852 -90719 -104674 -90248 -84274 -73460 -53715 -55023 -22424 7267 13671 -23180 -41046 -39081
15840 -39081 -16514 5936 -27516 -46748 -67932 -76769 -51279 -30332 -6034 2780 -13498 -32885
15828 -32885 -47322 -66531 -93631 -93890 -81833 -77149 -73321 -27214 -6703 20059 6586 2833 32121
15815 32121 58818 77451 58896 27288 -6085 -26606 -1545 -15346 3802 32954 37469 15006
$$ packed form
15902i1486K6833J5770k5695R779O1183K2251m2203k2522J985k1010O808M6913
15890a1394M0989l604k5594m3540n1004J6569L9935K4231j4038n093J9787M9785
15878C7029o780l1711l530m88J2161J020p960M059j583k425M106j3397j5751J5852
15864i398Q902m3205J8866O5655O73J8621l4919k4740l5561l8283J2995l0325
15852i0719j3955J4426N974J0814J9745j308L2599K9691O404l6851j7866J965
15840c9081K2567K2450l3452j9232k1184q837K5490K0947K4298Q814j6278j9387
15828c2885j4437j9209k7100k59J2057M684L828M6107K0511K6762j3473l753K9288
15815C2121K6697J8633j8555l1608l3373k0521K5061j3801J9148K9152M515k2463
$$ plain form
15803 15006 4972 764 -5106 22497 14646 -6646 -1848 20776 17086 -8479 -40855 -44182 -58369
15790 -58369 -90901 -91386 -46545 -17930 -24460 -53976 -47700 -6063 -25326 -40692 -35183 -36466 -27507
15777 -27507 30832 46389 1267 -16771 841 -12003 13099 9402 -12264 -1296 10741 -6732
15765 -6732 -48326 -40058 -13929 -45959 -83098 -53084 5890 34554 34869 39063 1146 -5899 7805
15752 7805 10472 20432 4846 -24196 -67585 -69593 -23074 18862 13823 -27611 -63458 -43708 -41129
15739 -41129 -21050 -13626 -14335 -15187 -14499 -25476 -11238 4637 19875 26136 6714 -15262 -31586
15726 -31586 4787 22695 12191 8874 36409 19053 -10460 -32585 -60462 -45278 -23631 6512
15714 6512 10966 -1956 -51583 -33926 -1014 16778 -11329 8420 24518 2399 2473 7536 8722
$$ packed form
15803A5006j0034m208n870K7603p851k1292M798K2624l690k5565l2376l327j4187
15790e8369l2532m85M4841K8615o530k9516O276M1637j9263j5366N509j283Q959
15777b7507N8339J5557m5122j8038J7612j2844K5102l697k1666J0968J2037j7473
15765f732m1594Q268K6129l2030l7139L0014N8974K8664L15M194l7917p045J3704
15752G805K667R960j5586k9042m3389k008M6519M1936n039m1434l5847J9750K579
15739d1129K0079P424p09q52O88j0977J4238J5875J5238O261j9422k1976j6324
15726c1586L6373J7908j0504l317K7535j7356k9513k2125k7877J5184K1647L0143
15714F512M454j2922m9627J7657L2912J7792k8107J9749J6098k2119P4N063J186
$$ plain form
15701 8722 -11124 -26321 -20523 -28164 -37626 -41243 -87742 -124613 -60308 5253 -9460 -49500 -50555
15688 -50555 -62615 -93538 -68580 -89757 -98135 -28097 -13872 1791 13170 10257 14921 -21631
15676 -21631 -37920 -455 1688 7432 -5023 12780 11570 -20860 -8542 3328 24816 11130
15664 11130 13053 42166 21853 -1624 35241 25170 -15962 -25024 -6130 5897 -5751 -26223
15652 -26223 -50246 -61414 -54406 -38201 -1739 2809 -18485 15888 10128 50526 66076 65946 60058
15639 60058 55223 41812 58 -3242 49915 48029 38887 17115 -21822 -4826 27794 28534 -36060
15626 -36060 -23998 10758 29006 13793 3881 -16754 -55798 -64968 -40556 -36065 -42292 -28430
15614 -28430 -42943 -11984 -16154 -53460 -78662 -76521 -45781 -26379 -61993 -26055 5594 4992
$$ packed form
15701H722j9846j5197N798p641r462l617m6499l6871O4305O5561j4713m0040j055
15688e0555j2060l0923K4958k1177q378P0038J4225J5663J1379k913M664l6552
15676b1631j6289L7465K143N744j2455J7803j210l2430J2318J1870K1488j3686
15664A1130J923K9113k0313k3477L6865j0071m1132r062J8894J2027j1648k0472
15652b6223k4023j1168P008J6205L6462M548k1294L4373n760M0398J5550j30n888
15639F0058m835j3411m1754l300N3157j886r142k1772l8937J6996L2620P40o4594
15626c6060J2062L4756J8248j5213r912k0635l9044r170K4412M491o227J3862
15614b8430j4513L0959m170l7306k5202K141L0740J9402l5614L5938L1649o02
$$ plain form
15602 4992 14532 29704 16454 -3643 -18324 16620 39449 76963 95413 37797 9095 7851
15590 7851 3862 16196 27459 8293 -7339 -18323 12729 21935 34306 48860 41112 19374
15578 19374 -1035 989 26097 39838 45897 77348 56423 -2380 -38798 -54417 -19403 -16844
15566 -16844 -28875 -51045 -57274 -57177 -41497 15367 83375 70866 14847 24223 61258 53595 20534
15553 20534 -15730 -30859 -1988 -8108 -5965 10403 38296 41538 29038 24667 33433 59505 71668
15540 71668 71494 19378 11849 40245 46818 24878 10043 25291 50013 63922 36388 -1276
15528 -1276 -27248 -23450 27401 74688 38675 -14250 -21187 19114 33930 20810 26786 46860
15516 46860 61569 50223 68650 95095 68639 27835 1253 -898 25399 34302 27065 22806
$$ packed form
15602D992R540J5172j3250k0097j4681L4944K2829L7514J8450n7616k8702j244
15590G851l989J2334J1263j9166j5632j0984L1052R206J2371J4554p748k1738
15578A9374k0409K024K5108J3741O059L1451k0925n8803l6418j5619L5014K559
15566a6844j2031k2170o229R7J5680N6864O8008j2509n6019R376L7035p663l3061
15553B0534l6264j5129K8871o120K143J6368K7893L242j2500m371Q766K6072J2163
15540G1668j74n2116p529K8396O573k1940j4835J5248K4722J3909k7534l7664
15528a276k5972L798N0851M7287l6013n2925o937M0301J4816j3120N976K0074
15516D6860J4709j1346J8427K6445k6456m0804k6582k151K6297Q903p237m259
$$ plain form
15504 22806 -16482 -26123 132 34873 48110 14407 22013 43204 2957 -21459 25741 44476
15492 44476 29598 -28479 -10664 34059 42109 34317 24355 20954 18353 23671 29641 27241 7250
15479 7250 11433 32641 13586 -30880 -25128 343 -20882 -20035 -61535 -51986 -6430 -1805 -4696
15466 -4696 -14473 -19481 -29115 -30740 -18038 13834 40253 16372 4962 774 7921 39784 34643
15453 34643 20520 -11739 -25452 -13893 13048 57202 56270 44552 31216 18948 24477 11678
15441 11678 27183 3983 4835 -1182 -18312 2428 17876 13754 -10294 -50003 -73732 -84648
15429 -84648 -62415 -27357 -44395 -44171 -14551 26974 52623 25459 19336 18602 28751 6991 -29766
15416 -29766 2226 61331 85222 71652 51948 12336 22196 43553 30762 -1454 -22423 -18096
$$ packed form
15504B2806l9288r641K6255L4741J3237l3703P606K1191m0247k4416M7200J8735
15492D4476j4878n8077J7815M4723Q050p792r962l401k601N318N970k400j9991
15479G250M183K1208j9055m4466N752K5471k1225Q47m1500R549M5556M625k891
15466d696r777n008r634j625J2702L1872K6419k3881j1410m188P147L1863n141
15453C4643j4123l2259j3713J1559K6941M4154r32j1718j3336j2268N529j2799
15441A1678J5505k3200Q52o017j7130K0740J5448m122k4048l9709k3729j0916
15429h4648K2233L5058j7038K24K9620M1525K5649k7164o123p34J0149k1760l6757
15416b9766L1992N9105K3891j3570j9704l9612R860K1357j2791l2216k0969M327
$$ plain form
15404 -18096 -1547 -41246 -15815 -10385 -44327 -65030 -59299 -69085 -86107 -45974 6674 30654
15392 30654 57613 113025 88704 47454 43184 59384 35859 8690 -34730 -84907 -100295 -107244
15380 -107244 -61477 -30064 -33171 -8084 12454 -2339 -19540 12874 10133 -22662 1104 3760
15368 3760 1150 16262 14262 11757 21306 29120 15946 29289 -8704 -37281 -47820 -9658 11169
15355 11169 62664 79981 61280 30675 30914 17656 16209 41484 50728 55410 64653 47052 9305
15342 9305 27745 57070 21513 -6524 -39467 -44401 -51364 5750 56034 85214 63563 40334
15330 40334 46226 47426 24380 11793 27392 27507 -8761 28001 86617 64846 1486 6842 22069
15317 22069 4054 -11591 -18659 16879 738 -21499 7506 -4350 6451 54269 27666 22006
$$ packed form
15404a8096J6549l9699K5431N430l3942k0703N731r786j7022M0133N2648K3980
15392C0654K6959N5412k4321m1250m270J6200k3525k7169m3420n0177j5388o949
15380a07244M5767L1413l107K5087K0538j4793j7201L2414k741l2795K3766K656
15368C760k610J5112k000k505R549P814j3174J3343l7993k8577j0539L8162K0827
15355A1169N1495J7317j8701l0605K39j3258j447K5275R244M682R243j7601l7747
15342I305J8440K9325l5557k8037l2943m934o963N7114N0284K9180k1651k3229
15330D0334N892J200k3046j2587J5599J15l6268L6762N8616k1771o3360N356J5227
15317B2069j8015j5645p068L5538j6141k2237K9005j1856J0801M7818k6603n660
$$ plain form
15305 22006 34634 28658 19431 -82 -8395 9403 43399 37937 33991 71921 74553 32349 -6323
15292 -6323 -40363 -54188 -17458 -27876 -40240 -31802 -58451 -67723 -75836 -44097 -14703 -23017 -16934
15279 -16934 -33241 -25947 -38596 -52297 -22438 12459 7507 22000 58487 66711 18674 -37499
15267 -37499 -14549 -33473 -47419 -37136 -43579 -10215 2451 -20168 -23260 4862 48555 55262
15255 55262 61219 48325 52623 56035 15192 7783 6024 -3146 -11968 2754 42948 27461 8494
15242 8494 15135 14659 -2012 -15995 -3676 -23434 -14038 -9078 -13508 -31560 -19943 17039 40529
15229 40529 2343 -1255 -17330 -17878 26603 10284 -15982 -9699 418 11827 51111 65629
15217 65629 38613 26204 32084 15269 -1834 -26297 -7373 -22076 -39905 -39746 -68979 -49478
$$ packed form
15305B2006J2628n976r227j9513q313J7798L3996n462l946L7930K632m2204l8672
15292f323l4040j3825L6730j0418j2364Q438k6649r272q113L1739K9394q314O083
15279a6934j6307P294j2649j3701K9859L4897m952J4493L6487Q224m8037n6173
15267c7499K2950j8924j3946J0283o443L3364J2666k2619l092K8122M3693O707
15255E5262N957j2894M298L412m0843p409j759r170q822J4722M0194j5487j8967
15242H494O641m76j6671j3983J2319j9758R396M960m430j8052J1617L6982K3490
15229D0529l8186l598j6075n48M4481j6319k6266O283J0117J1409L9284J4518
15217F5629k7016j2409N880j6815j7103k4463J8924j4703j7829J59k9233J9501
$$ plain form
15205 -49478 -9474 13546 13916 1264 -35364 -30735 -6285 -28062 -28660 3343 10147 -5187 2642
15192 2642 9520 43355 43045 22547 3281 -36033 -24540 -14956 -4799 -7878 -28081 -20747 -13020
15179 -13020 13052 8535 19032 4780 -11652 -26444 -5047 28308 16688 -4014 -10629 10205
15167 10205 50033 14453 9397 -2527 2296 15115 -20081 -5410 40309 12889 -5722 7862
15155 7862 9107 344 373 37275 24413 24508 32605 8353 -21573 -38855 -25000 -25173 -28533 -12788
15141 -12788 13817 2134 10082 33378 46531 40447 -4564 -18920 30734 42692 16774 -6477
15129 -6477 -30931 -10384 2432 6402 10335 -11807 -46175 -79179 -58339 -12584 -18332 -2692
15117 -2692 -17443 6089 33646 21559 -18825 -40194 -34212 -32635 -45720 -46017 -23 23647 -4597
$$ packed form
15205d9478M0004K3020L70j2652l6628M629K4450k1777n98L2003O804j5334P829
15192B642O878L3835l10k0498j9266l9314J1493R584J0157l079k0203P334P727
15179a3020K6072m517J0497j4252j6432j4792K1397L3355j1620k0702o615K0834
15167A0205L9828l5580n056j1924M823J2819l5196J4671M5719k7420j8611J3584
15155G862J245q763K9L6902j2862R5Q097k4252k9926j7282J3855j73l360J5745
15141a2788K6605j1683P948K3296J3153o084m5011j4356M9654J1958k5918k3251
15129f477k4454K0547J2816L970L933k2142l4368l3004K0840M5755n748J5640
15117b692j4751K3532K7557j2087m0384k1369N982J577j3085k97M5994K3670k8244
$$ plain form
15104 -4597 -39968 -61938 -83317 -91369 -48488 -6105 51400 81130 23328 14135 -17393 -35685
15092 -35685 -30527 -23572 12342 12588 -17497 -22649 7200 25661 5882 -26579 -46034 -33601 -41165
15079 -41165 -11434 25916 30380 -3309 680 -8335 -36003 -27343 7621 701 -27596 -49852 -47002
15066 -47002 -36532 -26357 -26798 3331 20842 22065 32042 41198 64833 85125 77981 80203 56819
15053 56819 11376 6005 29803 38459 28592 -19999 -61808 -52549 -26264 -1576 36592 22636
15041 22636 14500 25854 28128 46013 53344 34732 27566 -8548 -35764 1636 -15602 -12002 17556
15028 17556 23462 -20307 -35437 6932 40416 49412 21520 -11872 16455 8994 -12431 -24878
15016 -24878 -26675 -33829 -31266 -26343 -26306 -21362 -12551 8110 14111 37133 34947 22364 26333 24194
$$ packed form
15104d597l5371k1970k1379q052M2881M2383N7505K9730n7802r193l1528j8292
15092c5685N158O955L5914K46l0085n152K9849J8461j9779l2461j9455J2433p564
15079d1165K9731L7350M464l3689L989r015k7668Q660L4964o920k8297k2256K850
15066d7002J0470J0175m41L0129J7511J223R977R156K3635K0292p144K222k3384
15053E6819m5443n371K3798Q656r867m8591m1809R259K6285K4688L8168j3956
15041B2636q136J1354K274J7885P331j8612p166l6114k7216L7400j7238L600K9558
15028A7556N906m3769j5130M2369L3484Q996k7892l3392K8327p461k1425j2447
15016b4878j797p154K563M923L7M944Q811K0661O001K3022k186j2583L969k139
$$ plain form
15002 24194 17913 -21068 -25942 -16061 -17828 12318 10286 -1508 -21510 -10147 22160 52415 80747
14989 80747 86085 24631 -19354 -25907 -35152 -10587 1290 12083 33731 48930 61033 31174
14977 31174 21181 -8141 -57995 -47944 -36101 -23277 2464 24763 34516 1172 31405 86140
14965 86140 74643 41917 53592 35655 -18217 -16471 -8888 16283 43161 38213 -12936 -20771
14953 -20771 13701 25973 -17894 -46472 -27883 -23678 -23037 -26536 -3128 -44673 -87907 -61687
14941 -61687 -42017 -33160 -23004 -4683 5682 2931 15787 27552 3116 4638 -23412 -53797
14929 -53797 -73769 -55027 -12674 15531 -12378 -5105 17215 33688 67318 81319 79380 38489
14917 38489 -7598 -8883 5087 11171 37588 24360 6090 -12080 -15106 8978 -2907 -12961
$$ packed form
15002B4194o281l8981m874R881j767L0146k032j1794k0002J1363L2307L0255K8332
14989H0747N338o1454m3985o553r245K4565J1877J0793K1648J5199J2103k9859
14977C1174r993k9322m9854J0051J1843J2824K5741K2299R753l3344L0233N4735
14965H6140j1497l2726J1675j7937n3872J746P583K5171K6878m948n1149p835
14953b0771L4472J2272m3867k8578J8589M205O41l499K3408m1545m3234K6220
14941f1687J9670Q857J0156J8321J0365k751J2856J1765k4436J522k8050l0385
14929e3797j9972J8742M2353K8205k7909P273K2320J6473L3630J4001j939m0891
14917C8489m6087j285J3970O084K6417j3228j8270j8170l026K4084j1885j0054
$$ plain form
14905 -12961 -9487 -31211 -44933 -77430 -99837 -73612 -14082 9861 45602 58815 70439 62172
14893 62172 51772 68020 54721 21858 -23595 -16458 -31787 -57657 -68202 -67321 -53971 -42631
14881 -42631 -62708 -59210 -67730 -37087 16581 10844 -16837 -1296 -24150 -30628 -43647 -35936 2240
14868 2240 23946 9009 13462 17405 11223 31270 8383 15441 16232 18566 8518 -17917 -17603 -11028
14854 -11028 -30745 -7199 6706 26329 43994 31629 16131 -4154 5754 47607 115156 117515
14842 117515 100378 67255 25973 -17103 -10370 30694 26876 23135 36951 53274 55103 37405
14830 37405 19530 35260 46906 77581 55336 23566 -34834 -68446 -61644 -29676 463 256
14818 256 -4041 8456 21952 13064 -1040 -8331 -28819 11607 34595 4351 13145 60600 37477
$$ packed form
14905a2961L474k1724j3722l2497k2407K6225N9530K3943L5741J3213J1624q267
14893F2172j0400J6248j3299l2863m5453P137j5329k5870j0545Q81J3350J1340
14881d2631k0077L498q520L0643N3668n737k7681J5541k2854o478j3019P711L8176
14868B240K1706j4937M453L943o182K0047k2887P058P91K334j0048k6435L14O575
14854a1028j9717K3546J3905J9623J7665j2365j5498k0285R908M1853O7549K359
14842A17515j7137l3123m1282m3076O733M1064l818l741J3816J6323J829j7698
14830C7405j7875J5730J1646L0675k2245l1770n8400l3612O802L1968L0139k07
14818B56m297J2497J3496q888j4104p291k0488M0426K2988l0244Q794M7455k3123
$$ plain form
14805 37477 15065 -619 -30533 -24161 11337 14061 -19961 -32904 -28410 -50041 -73015 -90869
14793 -90869 -100185 -56752 -46461 -39636 -3808 4825 -28488 -26999 -5894 -2938 20201 -6662 5263
14780 5263 27297 49004 41421 71073 53180 4172 7794 21301 16631 59640 68366 77960 92686
14767 92686 90566 47362 24100 26401 64589 48471 27249 32754 40162 19494 54956 32066
14755 32066 -5555 -11305 -9400 -3123 -14300 -19133 1065 42242 56758 54938 67297 69231 32281
14742 32281 -2797 -34569 -13724 -609 958 16341 54788 93834 90311 71827 60044 29087
14730 29087 49923 17909 27551 37988 18496 3590 9002 7255 36228 61520 56054 41384
14718 41384 2546 -20208 -4500 22670 32805 20583 5388 -5668 23624 28252 11396 6528
$$ packed form
14805C7477k2412j5684k9914O372L5498K724l4022j2943M494k1631k2974j7854
14793i0869r316M3433J0291O825L5828Q633l3313J489K1105K956K3139k6863J1925
14780E263K2034K1707p583K9652j7893m9008L622J3507m670M3009Q726R594J4726
14767I2686k120m3204k3262K301L8188j6118k1222N505P408k0668L5462k2890
14755C2066l7621n750J905O277j1177m833K0198M1177J4516j820J2359J934l6950
14742C2281l5078l1772K0845J3115J567J5383L8447L9046l523j8484j1783l0957
14730B9087K0836l2014R642J0437j9492j4906N412j747K8973K5292n466j4670
14718D1384l8838k2754J5708K7170J0135j2222j5195j1056K9292M628j6856m868
$$ plain form
14706 6528 29560 35744 47949 41091 -2194 -12349 12178 5816 25531 60368 50555 8401 17168
14693 17168 31090 34810 10353 19638 -4592 -10550 -1647 26893 22322 -6100 -27102 -43990 -30161
14680 -30161 -11874 41430 53924 -2444 -9156 15592 2393 13766 31814 27703 24035 5424
14668 5424 20244 16133 2555 6506 -22506 3950 37465 7356 -6548 -52236 -37302 -21757
14656 -21757 13969 17814 43542 75824 79230 83016 39775 -24418 -35631 -29777 -15619 28910
14644 28910 44969 32648 37396 6298 16474 10528 10485 10838 23460 17346 -813 -8935 -23526
14631 -23526 -16179 -20485 -8068 -4557 20145 -13125 -3601 12077 11515 -13664 -46499 -40705 12349
14618 12349 69154 42352 21153 9940 -5683 -11163 4971 40009 70865 48469 53720 61707
$$ packed form
14706F528K3032O184J2205o858m3285j0155K4527o362J9715L4837r813m2154Q767
14693A7168J3922L720k4457R285k4230n958Q903K8540m571k8422k1002j6888J3829
14680c0161J8287N3304J2494n6368o712K4748j3199J1373J8048m111l668j8611
14668E424J4820m111j3578L951k9012K6456L3515l0109j3904m5688J4934J5545
14656b1757L5726L845K5728L2282L406L786m3241o4193j1213N854J4158M4529
14644B8910J6059j2321M748l1098J0176n946m3L53J2622o114j8159q122j4591
14631b3526P347m306J2417L511K4702l3270R524J5678n62k5179l2835N794N3054
14618A2349N6805k6802k1199j1213j5623n480J6134L5038L0856k2396N251P987
$$ plain form
14606 61707 64984 68282 50172 59770 82408 107704 56729 16813 27585 19719 30494 1546
14594 1546 -5184 13667 73549 79803 10377 -34959 1562 34434 39761 12323 24151 29843 -5066
14581 -5066 -43851 -47090 -10401 36117 37783 45344 46233 5821 -25560 -1241 29784 40008 48963
14568 48963 56103 22813 -4420 -12757 -4629 -25536 -42690 -44147 -55768 -39651 13700 41145
14556 41145 38712 67602 73652 78933 68491 63406 41405 40116 34396 19427 21513 13501 8763
14543 8763 10839 62965 101008 69270 55516 32526 15708 24738 73859 81269 54481 21881
14531 21881 -16799 7087 17512 8078 29789 44580 54298 38893 34974 39304 35500 21357 17805
14518 17805 16636 43642 63141 46456 21351 -4566 2031 5438 -8971 12960 8533 4578 17422
$$ packed form
14606F1707L277L298j8110R598K2638K5296n0975l9916J0772p866J0775k8948
14594A546o730J8851N9882O254o9426m5336L6521L2872N327k7438J1828N692l4909
14581e066l8785l239L6689M6518J666P561Q89m0412l1381K4319L1025J0224Q955
14568D8963P140l3290k7233q337Q128k0907j7154j457j1621J6117N3351K7445
14556D1145k433K8890O050N281j0442n085k2001j289n720j4969K086q012m738
14543H763K076N2126L8043l1738j3754k2990j6818R030M9121P410k6788l2600
14531B1881l8680K3886J0425r434K1711J4791R718j5405l919M330l804j4143l552
14518A7805j169K7006J9499j6685k5105k5917O597L407j4409K1931m427l955J2844
$$ plain form
14505 17422 31138 52421 66894 77609 66179 32149 15900 8726 40308 27859 7186 -2842
14493 -2842 28558 35095 48161 7172 -8450 33068 22729 8077 31170 17757 23889 33077
14481 33077 61823 70263 44553 51880 16777 7032 9325 15304 8793 -4002 -12278 21065 38969
14468 38969 15633 33198 51969 41439 35864 31818 13685 7359 -2197 36334 -986 -34488
14456 -34488 -21103 37990 29875 -7423 -3049 6843 -18036 -9805 -54920 -48667 -30837 -44854 -22050
14443 -22050 -4825 5208 7781 -30303 -46132 -41025 -45963 -43924 -67404 -72920 -30310 -34158 -71646
14430 -71646 -69479 -13859 -10515 -16541 -416 11519 7401 16797 46406 32710 -20284 -40557 -33644
14417 -33644 -21595 -11992 40094 52070 2780 -8025 13604 29034 30901 9124 -18771 -24883
$$ packed form
14505A7422J3716K1283J4473J0715j1430l4030j6249p174L1582j2449k0673j0028
14493b842L1400O537J3066m0989j5622M1518j0339j4652K3093j3413O132R188
14481C3077K8746Q440k5710P327l5103r745K293N979o511j2795q276L3343J7904
14468C8969k3336J7565J8771j0530n575m046j8133o326r556L8531l7320l3502
14456c4488J3385N9093q115l7298M374R892k4879Q231m5115O253J7830j4017K2804
14443b2050J7225J0033K573l8084j5829N107m938K039k3480n516M2610l848l7488
14430g1646K167N5620L344o026J6125J1935m118R396K9609j3696n2994k0273O913
14417c3644J2049R603N2086J1976m9290j0805K1629J5430J867k1777k7895o112
$$ plain form
14405 -24883 -7816 -8374 -8229 27439 33187 28392 65228 57404 53139 56567 28417 49489 32093
14392 32093 -18701 14047 67615 34528 27361 13511 8558 20796 23561 68067 51194 36170
14380 36170 90393 86450 21679 -14741 -28830 -16058 22769 16569 -4471 -46718 -42911 -24299
14368 -24299 -8466 47174 37968 34865 60222 41294 -5665 -21713 -26025 -32945 -42558 -50626 -46885
14355 -46885 -34938 -38591 19981 43417 23337 10085 25131 30064 30879 54431 35323 1077
14343 1077 10217 30442 60260 49756 16836 12844 -13846 19281 64879 78673 68916 21771
14331 21771 14375 34528 53051 32784 33499 31119 28090 46934 44999 25432 19974 34599 47930
14318 47930 81265 83506 42944 15441 28114 38400 -959 -38806 -46139 -74228 -85211 -62051
$$ packed form
14405b4883J7067n58J45L5668N748m795L6836p824m265L428k8150K1072j7396
14392C2093n0794L2748N3568l3087p167j3850m953J2238K765M4506j6873j5024
14380C6170N4223l943o4771l6420j4089J2772L8827o200k1040m2247L807J8612
14368b4299J5833N5640r206l103K5357j8928m6959j6048m312o920r613q068L741
14355d6885J1947l653N8572K3436k0080j3252J5046M933Q15K3552j9108l4246
14343A077R140K0225K9818j0504l2920l992k6690L3127M5598J3794r757m7145
14331B1771p396K0153J8523k0267P15k380l029J8844j935j9567n458J4625J3331
14318D7930L3335K241m0562k7503J2673J0286l9359l7847p333k8089j0983K3160
$$ plain form
14306 -62051 1496 15033 -5903 -6462 -46151 -47019 -58396 -50174 -22614 -7517 -38973 -22867 27757
14293 27757 25576 24955 -1861 8812 40041 34565 23027 27614 28633 44375 33401 34509 45815
14280 45815 44778 54034 31950 21747 21127 32018 9408 -7023 37678 48008 54022 55904 17858
14267 17858 9285 -3363 -22568 -33121 2362 -22012 -40299 -52274 -52055 -39587 -27095 -6468
14255 -6468 11129 37476 34560 -1882 427 -11578 -21655 -21983 3199 5841 -18773 -5569 48128
14242 48128 64422 62343 44044 60323 72847 83749 73539 44318 16482 -17746 -30525 -10892
14230 -10892 -989 -26731 -11859 -40885 -42489 -53622 -46508 -17297 3071 52709 38059 18491
14218 18491 26023 36006 7640 -10194 3410 24109 22463 24730 11522 5831 37303 85004 82891
$$ packed form
14306f2051O3547J3537k0936n59l9689q68j1377Q222K7560J5097l1456J6106N0624
14293B7757k181o21k6816J0673L1229n476j1538M587J019J5742j0974J108J1306
14280D5815j037R256k2084j0203o20J0891k2610j6431M4701J0330O014J882l8046
14267A7858q573j2648j9205j0553L5483k4374j8287j1975K19J2468J2492K0627
14255f468J7597K6347k916l6442K309j2005j0077l28K5182K642k4614J3204N3697
14242D8128J6294k079j8299J6279J2524J0902j0210k9221k7836l4228j2779J9633
14230a0892R903k5742J4872k9026j604j1133P114K9211K0368M9638j4650j9568
14218A8491P532R983k8366j7834J3604K0699j646K267j3208n691L1472M7701k113
$$ plain form
14205 82891 85906 55933 12724 36625 39352 43286 67772 75279 63478 51049 73715 59793
14193 59793 44534 38482 53210 49854 42146 -2988 -5758 23941 41083 39994 44936 53841 51877
14180 51877 43364 54929 68772 59331 59396 69220 100850 101418 90888 97695 102712 98571 98954 108271
14166 108271 84355 69435 87634 90419 52218 45336 72750 55883 39198 57740 84934 97989
14154 97989 45317 -2424 10008 50718 53315 54319 27165 7751 6659 11129 17695 18954 10046
14141 10046 47618 77538 128447 140065 70233 34306 16432 -31906 -32535 17686 27988 37795
14129 37795 27362 58928 80379 80693 53585 69382 91467 59987 39638 43017 43258 16707 941
14116 941 23726 27009 23440 5575 -40956 -38947 -12014 -13314 7915 45373 66707 74311 91360
$$ packed form
14205H2891L015k9973m3209K3901K727L934K4486P507j1801j2429K2666j3922
14193E9793j5259o052J4728l356p708m5134k770K9699J7142j089M942Q905j964
14180E1877q513J1565J3843r441O5R824L1630N68j0530O807N017m141L83R317
14166A08271k3916j4920J8199K785l8201o882K7414j6867j6685J8542K7194J3055
14154I7989n2672m7741J2432M0710K597J004k7154j9414j092M470O566J259q908
14141A0046L7572K9920N0909J1618o9832l5927j7874m8338o29N0221J0302R807
14129C7795j0433L1566K1451L14k7108J5797K2085l1480k0349L379K41k6551j5766
14116I41K2785L283l569j7865m6531K009K6933j300K1229L7458K1334P604J7049
$$ plain form
14103 91360 79727 29926 16631 44057 24524 16685 12810 18132 -1482 -11466 18606 6041
14091 6041 19170 23064 43000 6728 31586 74810 56650 22668 21553 42441 92528 126740
14079 126740 110732 81145 51793 45561 58059 20280 2290 -20107 -5316 13561 26400 28276
14067 28276 22621 8290 -4153 3269 11325 26685 40369 65259 86794 100007 76246 62460
14055 62460 82756 73704 49440 54298 79101 78395 64970 80770 94872 103891 86483 115396 137548
14042 137548 103393 86133 76257 55817 78541 96151 59815 50004 63717 70641 81542 64348
14030 64348 68153 48479 30514 54938 74865 74517 53136 83954 85255 81039 51267 11998 20074
14017 20074 37411 46682 32942 28701 26762 21026 40153 29852 -22319 -30019 -17084 13353 13622
$$ packed form
14103I1360j1633m9801j3295K7426j9533p839l875N322j9614r984L0072j2565
14091F041J3129L894J9936l6272K4858M3224j8160l3982j115K0888N0087L4212
14079A26740j6008k9587k9352o232J2498l7779j7990k2397J4791J8877J2839J876
14067B8276n655j4331j2443P422Q056J5360J3684K4890K1535J3213k3761j3786
14055F2460K0296r052k4264M858K4803p06j3425J5800J4102R019j7408K8913K2152
14042A37548l4155j7260r876k0440K2724J7610l6336r811J3713O924J0901j7194
14030F4348L805j9674j7965K4424J9927l48k1381L0818J301m216k9772l9269Q076
14017B0074J7337R271j3740m241j939n736J9127j0301n2171p700J2935L0437K69
$$ plain form
14004 13622 -23155 -45804 -26775 -13904 22137 42553 36660 32181 15092 -6137 9059 53385
13992 53385 66904 29648 3495 7558 15724 8600 23323 14891 11069 28670 57831 66955 62557
13979 62557 18195 22769 64886 69977 107649 76081 71909 57069 41901 36293 56582 67085
13967 67085 47296 45563 49062 82914 95219 111648 114184 97396 96909 105245 84059 75452 97962
13954 97962 92643 75265 66930 47106 44258 31594 16990 -21680 -25689 30701 64617 70584 83987
13941 83987 47771 51652 83755 103171 67876 65593 73063 49867 53223 78938 98561 102161 78149
13928 78149 63060 59556 65002 66899 76083 59063 14449 35909 56745 61697 55257 31069 1509
13915 1509 38747 57966 59958 55779 43284 36382 77487 107190 44192 -6352 -13309 56216 97365
$$ packed form
14004A3622l6777k2649J9029J2871L6041K0416n893m479j7089k1229J5196M4326
13992E3385J3519l7256k6153M063Q166p124J4723q432l822J7601K9161R124m398
13979F2557m4362M574M2117N091L7672l1568m172j4840j5168n608K0289J0503
13967F7085j9789j733L499L3852J2305J6429K536j6788m87Q336k1186q607K2510
13954I7962n319j7378q335j9824k848j2664j4604l8670m009N6390L3916N967J3403
13941H3987l6216L881L2103J9416l5295k283P470k3196L356K5715J9623L600k4012
13928G8149j5089l504N446J897R184j7020m4614K1460K0836M952o440k4188k9560
13915A509L7238J9219J992m179j2495o902M1105K9703o2998n0544o957O9525M1149
$$ plain form
13902 97365 73288 24237 38327 38279 30007 32323 22130 36238 23481 43395 78073 91439 82564
13889 82564 72795 69138 34262 16193 70097 95293 95954 79599 74642 67942 37720 31825 27668
13876 27668 26657 43335 43297 66819 54281 41351 17248 45526 52549 93959 154344 124299 119443
13863 119443 121613 113709 84770 73397 101097 87621 109499 125959 94587 80505 60962 15981
13851 15981 23906 40179 48047 48426 59327 70162 53858 71357 92780 91488 117317 119073 81407
13838 81407 50441 35374 40858 60929 69315 77247 78991 103216 134537 147393 132507 109191
13826 109191 55941 34798 4240 -14196 -6461 -1051 4443 -1954 -3303 8195 -8951 -540 8575
13813 8575 16554 13839 35659 52261 87125 111896 125325 104676 79338 62016 55847 40649
$$ packed form
13902I7365k4077m9051J4090m8q272K316j0193J4108j2757J9914L4678J3366q875
13889H2564r769l657l4876j8069N3904K5196O61j6355m957o700l0222n895m157
13876B7668j011J6678l8K3522j2538j2930k4103K8278P023M1410O0385l0045m856
13863A19443K170p904k8939j1373K7700j3476K1878J6460l1372j4082j9543m4981
13851A5981P925J6273P868L79J0901J0835j6304J7499K1423j292K5829J756l7666
13838H1407l0966j5067N484K0071Q386P932J744K4225L1321J2856j4886k3316
13826A09191n3250k1143l0558j8436P735N410N494o397j349J1498j7146Q411R115
13813H575P979k715K1820J6602L4864K4771J3429k0649k5338j7322o169j5198
$$ plain form
13801 40649 32252 35667 71623 90485 50507 13847 -4693 16286 43400 68720 62755 73826
13789 73826 75674 116427 97521 75910 87149 90399 82890 85134 104523 136208 150185 72892
13777 72892 60166 61699 55379 37203 50626 52061 36184 17600 35027 58518 80399 70261
13765 70261 57012 75697 48926 50486 100633 131468 135163 149450 130616 124010 142561 158347
13753 158347 157669 136551 139286 126745 94050 88077 100730 59583 29381 43275 59361 118275
13741 118275 107627 66881 89699 99462 80179 77482 64981 78629 78633 92186 126181 116363 101926
13728 101926 94830 76864 77237 80026 67037 31360 52121 75503 96440 89872 82678 91574 69284
13715 69284 57484 61076 63819 71028 45074 58115 94369 75380 50682 61216 64363 96819
$$ packed form
13801D0649q397L415L5956J8862l9978l6660j8540K0979K7114K5320n965J1071
13789G3826J848M0753j8906k1611J1239L250p509K244J9389L1685J3977p7293
13777G2892j2726J533o320j8176J3423J435j5877j8584J7427K3491K1881j0138
13765G0261j3249J8685k6771J560N0147L0835L695J4287j8834o606J8551J5786
13753A58347o78k1118K735j2541l2695n973J2653m1147l0202J3894J6086N8914
13741A18275j0648m0746K2818R763j9283k697j2501J3648MJ3553L3995r818j4437
13728A01926p096j7966L73K789j2989l5677K0761K3382K0937o568p194Q896k2290
13715F9284j1800L592K743P209k5954J3041L6254j8989k4698J0534L147L2456
$$ plain form
13703 96819 120407 115741 99520 98303 86787 73695 73988 78179 58757 38414 20506 79742 79054
13690 79054 53106 71845 85680 89963 116996 109603 80552 62754 69230 64092 74125 119878
13678 119878 148556 141855 115663 121498 137386 118108 91181 97706 116789 66664 91268 73764
13666 73764 42730 51225 75268 88176 97989 106963 113920 98206 126728 109510 81940 81635 88468
13653 88468 58863 52522 91120 114184 107562 75521 94757 124588 115430 106103 87994 93742 110896
13640 110896 108998 97345 78153 113066 111660 100623 116499 120514 124568 147684 134258 101942
13628 101942 102568 68905 59452 71015 75460 76882 74722 69356 68370 41336 48462 58647 35017
13615 35017 67333 100260 97879 128432 129079 116563 79123 77361 56537 73078 66478 95964 126300
$$ packed form
13703I6819K3588m666j6221j217j1516j3092K93M191j9422k0343j7908N9236o88
13690G9054k5948J8739J3835M283K7033p393k9051j7798O476n138J0033M5753
13678A19878K8678o701k6192N835J5888j9278k6927O525J9083n0125K4604j7504
13666G3764l1034Q495K4043J2908R813Q974O957j5714K8522j7218k7570l05O833
13653H8468k9605o341L8598K3064o622l2041J9236K9831r158r327j8109N748J7154
13640A10896j898j1653j9192L4913j406j1037J5876M015M054K3116j3426l2316
13628A01942O26l3663r453J1563M445J422k160n366r86k7034P126J0185k3630
13615C5017L2316L2927k381L0553O47j2516l7440j762k0824J6541o600K9486L0336
$$ plain form
13602 126300 112981 62537 8385 45323 61120 43185 19059 34458 33418 15386 31716 98220
13590 98220 96492 98726 79866 75973 94845 83877 47886 52074 93505 103244 117888 149058 123752
13577 123752 65540 85983 73179 75944 74941 102303 147343 176085 165047 160885 144645 123266
13565 123266 72812 68805 113058 137051 83204 77259 106002 132572 123755 126961 91360 118236
13553 118236 104836 107813 139417 154447 85807 39737 61251 85986 99727 104586 97524 90571
13541 90571 106152 121762 118105 83408 98532 116324 118056 109083 81366 80876 161941 198233 213857
13528 213857 196012 181769 136629 85278 84628 113851 146839 140130 139675 105150 68507 69913 94381
13515 94381 101213 118165 139948 145658 138726 124935 153508 180561 190534 170405 133406 174465
$$ packed form
13602A26300j3319n0444n4152L6938J5797j7935k4126J5399j040j8032J6330O6504
13590I8220j728K234j8860l893J8872j0968l5991M188M1431R739J4644L1170k5306
13577A23752n8212K0443j2804K765j003K7362M5040K8742j1038m162j6240k1379
13565A23266n0454m007M4253K3993n3847n945K8743K6570q817L206l5601K6876
13553A18236j3400K977L1604J5030o8640m6070K1514K4735J3741M859p062o953
13541I0571J5581J5610l657l4697J5124J7792J732q973k7717m90Q1065L6292J5624
13528B13857j7845j4243m5140n1351o50K9223L2988o709m55l4525l6643J406K4468
13515I4381O832J6952K1783N710o932j3791K8573K7053R973k0129l6999M1059
$$ plain form
13503 174465 179221 149702 144245 187051 155944 168044 194513 220659 255909 247713 228547 237827
13491 237827 273564 223060 256089 292480 281379 276540 271976 301369 331680 342531 343432 359238
13479 359238 362795 379466 385119 347738 342465 353700 386820 397785 370627 358672 374397 363129
13467 363129 375061 368370 365945 383824 399414 421090 440475 416999 370622 367010 381914 362562
13455 362562 340416 356391 397098 403408 396452 367907 323747 351210 394075 362058 371115 354137
13443 354137 317809 319230 362659 321752 320407 349248 315271 238562 176991 223047 236845 262582
13431 262582 298848 261041 244457 219142 178015 193726 233793 213377 147990 139962 195047 265842
13419 265842 230104 207394 238074 208618 171782 196453 217299 253788 301177 317925 323427 346991
$$ packed form
13503A74465M756k9519n457M2806l1107J2100K6469K6146L5250q196j9166R280
13491B37827L5737n0504L3029L6391j1101m839m564K9393L0311J0851R01J5806
13479C59238L557J6671N653l7381n273J1235L3120J0965k7158j1955J5725j1268
13467C63129J1932o691k425J7879J5590K1676J9385k3476m6377l612J4904j9352
13455C62562k2146J5975M0707O310o956k8545m4160K7463M2865l2017R057j6978
13443C54137l6328J421M3429m0907j345K8841l3977p6709o1571M6056J3798K5737
13431B62582L6266l7807j6584k5315m1127J5711M0067k0416o5387q028N5085P0795
13419B65842l5738k2710L0680k9456l6836K4671K0846L6489M7389J6748N502K3564
$$ plain form
13407 346991 329010 364431 378780 381968 376075 381836 453780 505093 522883 515308 532841 585887
13395 585887 602376 631172 668325 711249 755177 769952 782255 761912 719900 745439 763086
13384 763086 725156 727982 762173 725716 672195 669700 729250 774096 767726 717338 726568 718728
13372 718728 727220 780954 793714 779785 748047 684852 624565 596891 607446 614387 595114 562168
13360 562168 564965 553696 508953 475842 425651 390302 363757 340243 349388 321179 287427 300872
13348 300872 320381 275282 242564 264592 272563 265313 249098 239832 213604 186765 220418 259773
13336 259773 287387 243462 198708 191204 221991 275298 272875 237661 225013 190507 212393 201968
13324 201968 182308 205760 255097 288688 256997 262571 294074 283075 278678 267585 270808 296869
$$ packed form
13407C46991j7981L5421J4349L188n893N761P1944N1313J7790p575J7533N3046
13395E85887J6489K8796L7153M2924M3928J4775J2303k0343m2012K5539J7647
13384G63086l7930K826L4191l6457n3521k495N9550M4846o370n0388R230p840
13372G18728Q492N3734J2760j3929l1738o3195o0287k7674J0555O941j9273l2946
13360E62168K797j1269m4743l3111n0191l5349k6545k3514R145k8209l3752J3445
13348C00872J9509m5099l2718K2028P971p250j6215r266k6228k6839L3653L9355
13336B59773K7614m3925m4754p504L0787N3307k423l5214j2648l4506K1886j0425
13324B01968j9660K3452M9337L3591l1691N574L1503j0999m397j1093L223K6061
$$ plain form
13312 296869 289362 313950 381158 457529 527794 610585 716922 800809 943444 1133309 1312953
13301 1312953 1420139 1387808 1257087 1072979 957474 904995 811354 751539 714605 712513 698898
13290 698898 737186 797595 835935 881304 968031 1015928 1083859 1105786 1091548 1075398 1059050
13279 1059050 1072367 1094388 1148549 1251928 1313027 1397374 1492329 1537335 1508022 1403211 1259251
13268 1259251 1181930 1119325 1059664 1034584 1007052 1009891 1039346 1085620 1125673 1104697 1031648
13257 1031648 953964 936453 846948 744979 706756 689475 683159 715917 786538 870514 996808
13246 996808 1214620 1388807 1492981 1541720 1454730 1239911 1038440 916702 755976 650647
13236 650647 546951 460596 357446 343160 330075 350256 391646 393710 352806 299781 265605
$$ packed form
13312B96869p507K4588O7208P6371P0265Q2791J06337Q3887J42635J89865J79644
13301A312953J07186l2331j30721j84108j15505n2479r3641n9815l6934k092j3615
13290F98898L8288O0409L8340M5369Q6727M7897O7931K1927j4238j6150j6348
13279A059050J3317K2021N4161J03379O1099Q4347R4955M5006k9313j04811j43960
13268A259251p7321o2605n9661k5080k7532K839K9455M6274M0053k0976p3049
13257A031648p7684j7511q9505j01969l8223j7281o316L2758P0621Q3976J26294
13246I96808K17812J74187J04174M8739q6990k14819k01471j21738j60726j05329
13236F50647j03696q6355j03150j4286j3085K0181M1390K064m0904n3025l4176
$$ plain form
13225 265605 226414 221424 226788 250414 286172 246814 207541 215134 223510 254100 265082 259183
13213 259183 232196 170045 157355 145765 140584 158428 186025 161266 151643 192106 241592 301095
13201 301095 340781 325937 307828 333314 337331 322894 348086 353032 376668 442163 397520 346589
13189 346589 397913 434838 477377 513275 568699 569803 546029 546202 548706 581152 596304 555795
13177 555795 547317 546081 559296 573128 573322 548820 535379 558563 558804 529663 523628 508281 503159
13164 503159 512550 527252 513253 485601 450603 417784 366700 334114 342534 344346 352901 387294
13152 387294 430949 419875 369994 334735 363123 427359 421336 397827 424632 428741 397456 352535
13140 352535 355946 327605 322733 341470 360742 401747 441949 478245 445169 405230 380508 421862
$$ packed form
13225B65605l9191m990N364K3626L5758l9358l9273P593Q376L0590J0982n899
13213B59183k6987o2151j2690j1590n181J7844K7597k4759r623M0463M9486N9503
13201C01095L9686j4844j8109K5486M017j4437K5192M946K3636O5495m4643n0931
13189C46589N1324L6925M2539L5898N5424J104k3774J73K504L2446J5152m0509
13177E55795q478j236J3215J3832J94k4502j3441K3184K41k9141o035j5347n122
13164E03159R391J4702j3999k7652l4998l2819n1084l2586Q420J812Q555L4393
13152C87294M3655j1074m9881l5259K8388O4236o023k3509K6805M109l1285m4921
13140C52535L411k8341m872J8737J9272M1005M0202L6296l3076l9939k4722M1354
$$ plain form
13128 421862 447479 478073 532375 537851 524148 497212 516466 556307 582240 611112 620004 624991
13116 624991 654129 697271 720780 748223 745021 767169 815521 849062 854290 860563 867066 868891
13104 868891 887405 910880 905317 933211 962024 941871 921407 898650 891007 869303 828598 819493
13092 819493 803816 776943 762652 745124 731993 723537 740723 714938 692928 670115 667305 626750
13080 626750 568738 576647 622200 614088 621925 641635 674381 721950 708179 663479 643729 633441
13068 633441 626735 624226 595436 557555 526855 500812 486482 454142 477543 519491 521580 509372
13056 509372 500696 475482 437748 437739 467726 436373 414344 442992 468672 491273 528981 626451
13044 626451 637029 651703 692447 701551 683245 695842 674524 646390 619711 635987 656927 641768
$$ packed form
13128D21862K5617L0594N4302N476j3703k6936J9254L9841K5933K8872Q892M987
13116F24991K9138M3142K3509K7443l202K2148M8352L3541N228O273O503J825
13104H68891J8514K3475n563K7894K8813k0153k0464k2757p643k1704m0705r105
13092H19493j5677k6873j4291j7528j3131q456J7186k5785k2010k2813k810m0555
13080F26750n8012P909M5553q112P837J9710L2746M7569j3771m4700j9750j0288
13068F33441o706k509k8790l7881l0700k6043j4330l2340K3401M1948K089j2208
13056E09372q676k5214l7734rK9987l1353k2029K8648K5680K2601L7708R7470
13044F26451J0578J4674M0744R104j8306J2597k1318k8134k6679J6276K0940j5159
$$ plain form
13032 641768 630801 644471 641483 630223 664417 703211 734962 755778 754773 762385 742135 690143
13020 690143 674436 686061 703267 710559 715747 682874 700882 688747 681957 680156 726762 777978
13008 777978 783288 741747 744337 748697 724176 702250 674348 635033 645193 686377 715347 695520
12996 695520 726145 760413 802548 771960 766450 776722 742383 693410 689016 737678 779072 780986
12984 780986 758476 785720 823115 855835 904694 943050 1006790 1042075 1001086 964051 923186
12973 923186 870476 780464 763080 849082 979171 1038405 1113779 1237458 1317108 1348698 1390426
12962 1390426 1425355 1386737 1305367 1219455 1131693 1024873 982025 981477 957108 913305 937102
12951 937102 958346 962943 971947 986661 956235 905499 859645 792018 764195 753060 759969 826402
$$ packed form
13032F41768j0967J3670k988j1260L4194L8794L1751K0816j005P612k0250n1992
13020F90143j5707J1625J7206P292N188l2873J8008j2135o790j801M6606N1216
13008G77978N310m1541K590M360k4521k1926k7902l9315J0160M1184K8970j9827
12996F95520L0625L4268M2135l0588n510J0272l4339m8973m394M8662M1394J914
12984G80986k2510K7244L7395L2720M8859L8356O3740L5285m0989l7035m0865
12973I23186n2710r0012j7384Q6002J30089N9234P5374J23679P9650L1590M1728
12962A390426L4929l8618q1370q5912q7762j06820m2848n48k4369m3803K3797
12951I37102K1244M597R004J4714l0426n0736m5854o7627k7823j1135O909O6433
$$ plain form
12939 826402 866677 880554 878367 884724 916222 937963 956531 922702 876167 863865 910203 942698
12927 942698 949787 964192 1007801 1036775 1054507 1158539 1195225 1204178 1185084 1175468 1148246 1094198
12915 1094198 1038648 1002664 1054152 1083015 1152985 1235376 1281819 1340030 1364251 1357531 1390203
12904 1390203 1438582 1461318 1506401 1522542 1584999 1613984 1638173 1703005 1751731 1836373 1971003
12893 1971003 2069794 2131497 2168101 2261715 2381848 2493574 2592762 2690170 2757558 2884561 3043003
12882 3043003 3150257 3297433 3440559 3612204 3800300 4015210 4241522 4453402 4702444
12873 4702444 4993093 5348142 5704489 6060384 6589453 7229399 8037070 9018076 10106564
12864 10106564 11363321 12746020 14270550 15932344 17761399 20026999 23026515 27051600
$$ packed form
12939H26402M0275J3877k187O357L1498K1741J8568l3829m6535j2302M6338L2495
12927I42698P089J4405M3609K8974J7732J04032L6686Q953j9094r616k7222n4048
12915A094198n5550l5984N1488K8863O9970Q2391M6443N8211K4221o720L2672
12904A390203M8379K2736M5083J6141O2457K8985K4189O4832M8726Q4642J34630
12893A971003R8791O1703L6604R3614J20133J11726R9188R7408O7388J27003J58442
12882C043003J07254J47176J43126J71645J88096K14910K26312K11880K49042
12873D702444K90649L55049L56347L55895N29069O39946Q07671R81006J088488
12864A0106564J256757J382699J524530J661794J829055K265600K999516M025085
$$ plain form
12856 27051600 32596055 40335732 51128379 66200366 87145558 115537072 152115750
12849 152115750 195037584 236136489 259839942 254962844 227368061 191192961 156307174
12842 156307174 127444626 105792251 90618957 81109005 76616458 76622684 80920676 89479825
12834 89479825 101994428 117611583 134573461 149674131 159778115 163664187 162503464
12827 162503464 159231009 156666062 157396790 163634513 176408837 195108871 217489749 239759753
12819 239759753 255822563 259165677 248172127 227498974 203572230 181327718 163682182
12812 163682182 151982815 146517345 146706385 151042903 157226678 162826042 164880151 161144725
12804 161144725 151300114 136706741 120423923 105458969 93603374 86038200 83409220
$$ packed form
12856B7051600N544455P739677J0792647J5071987K0945192K8391514L6578678
12849A52115750M2921834M1098905K3703453m877098k7594783l6175100l4885787
12842A56307174k8862548k1652375j5173294r509952m492547O226M297992Q559149
12834H9479825J2514603J5617155J6961878J5100670J0103984L886072j160723
12827A62503464l272455k564947P30728O237723J2774324J8700034K2380878K2270004
12819B39759753J6062810L343114j0993550k0673153k3926744k2244512j7645536
12812A63682182j1699367n465470J89040M336518O183775N599364K054109l735426
12804A61144725r844611j4593373j6282818j4964954j1855595p565174k628980
$$ plain form
12797 83409220 86029929 94558671 109893812 133077964 164764048 203403311 243908994
12790 243908994 275898907 285076271 264398591 223462270 178376467 138981084 107960632
12783 107960632 84355678 66612300 53378768 43525034 36173983 30651472 26385203
12776 26385203 23074452 20438167 18283676 16393123 14670343 13047643 11673714 10514532
12768 10514532 9487649 8580027 7814154 7155662 6575925 6070014 5637090 5278751 4942720
12759 4942720 4596116 4264974 4024479 3810410 3596972 3410876 3244047 3085298 2953130
12750 2953130 2819320 2691263 2542633 2403706 2264107 2107693 2012677 1942044 1931261 1910463
12740 1910463 1851285 1786332 1791780 1782649 1748352 1693412 1615906 1543707 1499848 1485440 1456621 1448289
$$ packed form
12797H3409220K620709Q528742J5335141K3184152L1686084L8639263M0505683
12790B43908994L1989913R177364k0677680m0936321m5085803l9395383l1020452
12783A07960632k3604954j7743378j3233532r853734p351051n522511m266269
12776B6385203l310751k636285k154491j890553j722780j622700j373929j159182
12768A0514532j026883r07622p65873o58492n79737n05911m32924l58339l36031
12759D942720l46604l31142k40495k14069k13438j86096j66829j58749j32168
12750B953130j33810j28057j48630j38927j39599j56414r5016p0633j0783k0798
12740A910463n9178o4953N448r131l4297n4940p7506p2199m3859j4408k8819q332
$$ plain form
12728 1448289 1466668 1480723 1461328 1479167 1493280 1461365 1459255 1424826 1336521 1243229 1183058
12717 1183058 1118689 1079855 1071396 1041623 1012466 1017385 1002482 958112 952493 950084 907721 887360
12705 887360 891585 888943 897313 878975 821450 798139 816202 876064 917831 956157 1009215 1012011
12693 1012011 979557 942549 865796 835923 808500 776644 737860 720665 723577 764155 855850
12682 855850 909533 948178 945198 983378 1015443 1072086 1161613 1261433 1310029 1305432 1220093 1142283
12670 1142283 1049938 939388 829823 823885 807740 800183 771681 655764 563389 491869 384939
12659 384939 353641 315890 312172 326956 317446 281040 267652 263420 268693 255049 230203 246486
12647 246486 219540 194308 196122 172702 156745 146609 133969 175575 180073 194514 211866 181863
$$ packed form
12728A448289J8379J4055j9395J7839J4113l1915k110l4429q8305r3292o0171
12717A183058o4369l8834q459k9773k9157M919j4903m4370n619k409m2363k0361
12705H87360M225k642Q370j8338n7525k3311J8063N9862M1767L8326N3058K796
12693A012011l2454l7008p6753k9873k7423l1856l8784j7195K912M0578R1695
12682H55850N3683L8645k980L8180L2065N6643Q9527R9820M8596m597q5339p7810
12670A142283r2345j10550j09565n938j6145p557k8502j15917r2375p1520j06930
12659C84939l1298l7751l718J4784r510l6406j3388m232N273j3644k4846J6283
12647B46486k6946k5232J814k3420j5957j0136j2640M1606M498J4441J7352l0003
$$ plain form
12635 181863 193957 195057 167243 182873 181524 147970 151761 190732 193795 180768 209793 240145
12623 240145 243815 208590 193716 214089 231880 233337 248672 267226 250626 237914 249559 275184
12611 275184 247994 282228 335748 390704 393270 355997 310119 311720 333354 351646 356100 370092
12599 370092 380609 374466 373494 404663 408615 446082 465050 460298 457049 471320 452299 467938 451366
12586 451366 470732 443361 447451 446796 436738 433379 432438 434623 411890 378691 374959 362516 369017
12573 369017 391236 400392 409633 410136 388536 349381 312985 302433 307600 304148 291496 297659 293110
12560 293110 306153 331207 326876 300090 313884 314816 303656 301794 303501 316212 328206 313236
12548 313236 314020 322423 355513 370601 370070 359450 356936 372177 405844 439957 471269 518788 535338
$$ packed form
12635A81863J2094J100k7814J5630j349l3554L791L8971L063j3027K9025L0352
12623B40145L670l5225j4874K0373J7791J457J5335J8554j6600j2712J1645K5625
12611B75184k7190L4234N3520N4956K566l7273m5878J601K1634J8292M454J3992
12599C70092J0517o143r72L1169L952L7467J8968m752l249J4271j9021J5639j6572
12586D51366J9366k7371M090o55j0058l359r41K185k2733l3199l732j2443O501
12573C69017K2219R156R241N03k1600l9155l6396j0552N167l452j2652O163m549
12560B93110J3043K5054m331k6786J3794R32j1160j862J707J2711J1994j4970
12548C13236P84Q403L3090J5088n31j0620k514J5241L3667L4113L1312M7519J6550
$$ plain form
12535 535338 556825 574301 566815 590309 621070 680560 739323 790897 802166 821566 844198 896140
12523 896140 902826 927136 954575 1003264 1050495 1027242 1007088 985707 977245 977983 963711 961917
12511 961917 970649 942340 951840 947330 922406 899484 888858 815538 747376 705624 661728 600828
12499 600828 555062 536788 508018 483023 451691 441742 412463 409804 394769 375087 375736 357910
12487 357910 328941 344851 352463 385691 336045 305864 329327 340563 334592 320117 306783 341119
12475 341119 333876 301922 309512 344137 371202 357216 335185 326711 357829 363507 366509 378487
12463 378487 391132 408768 472847 478730 474588 458756 454472 481362 470534 456565 476654 496241
12451 496241 503165 488432 445821 466237 510910 526686 513300 510125 474942 465499 464349 485315
$$ packed form
12535E35338K1487J7476p486K3494L0761N9490N8763N1574J1269J9400K2632N1942
12523H96140O686K4310K7439M8689M7231k3253k0154k1381q462P38j4272j794
12511I61917Q732k8309R500m510k4924k2922j0626p3320o8162m1752m3896o0900
12499F00828m5766j8274k8770k4995l1332r949k9279k659j5035j9682O49j7826
12487C57910k8969J5910P612L3228m9646l0181K3463J1236n971j4475j3334L4336
12475C41119p243l1954P590L4625K7065j3986k2031q474L1118N678L002J1978
12463C78487J2645J7636O4079N883m142j5832m284K6890j0828j3969K0089J9587
12451D96241O924j4733m2611K0416M4673J5776j3386l175l5183r443j150K0966
$$ plain form
12439 485315 497128 492381 482003 454239 423733 415843 406842 423273 433488 421549 456089 495279
12427 495279 497852 483538 463994 442529 388674 375786 383611 390343 413628 451652 471650 456292
12415 456292 412205 381957 324144 316494 337304 356676 336584 357452 414550 389417 362619 334242
12403 334242 333177 409867 423543 425232 474005 509159 521215 546282 557917 545968 608565 686001
12391 686001 809831 944596 1132126 1298178 1428522 1498677 1513626 1403648 1269006 1107588
12381 1107588 965343 898696 862123 814552 810321 867836 865830 888336 882757 947829 1061268
12370 1061268 1148083 1219783 1268263 1253764 1250942 1240115 1239795 1272060 1329340 1435874 1559693
12359 1559693 1644659 1677142 1685938 1616558 1472317 1342128 1218796 1151165 1131001 1099875 1099651
$$ packed form
12439D85315J1813m747j0378k7764l0506p890r001J6431J0215j1939L4540L9190
12427D95279K573j4314j9544k1465n3855j2888P825O732K3285L8024J9998j5358
12415D56292m4087l0248n7813p650K0810J9372k0092K0868N7098k5133k6798k8377
12403C34242j065P6690J3676J689M8773L5154J2056K5067J1635j1949O2597P7436
12391F86001J23830J34765J87530J66052J30344P0155J4949j09978j34642j61418
12381A107588j42245o6647l6573m7571m231N7515k006K2506n579O5072J13439
12370A061268Q6815P1700M8480j4499k822j0827l20L2265N7280J06534J23819
12359A559693Q4966L2483Q796o9380j44241j30189j23332o7631k0164l1126k24
$$ plain form
12348 1099651 1151472 1166831 1180764 1135129 1128020 1101561 987010 886004 799357 732206 705416
12337 705416 688558 722849 735858 807864 917600 1030634 1211889 1394226 1555224 1623105
12327 1623105 1573744 1377492 1160204 949175 757282 616834 523588 457556 395279 371545
12317 371545 381937 323280 270644 244306 284851 293797 257176 257237 315586 287924 211779 213890
12305 213890 250079 256996 220260 221825 243927 246334 223969 202528 192961 171312 158915 156682
12293 156682 161702 158803 150219 165129 186175 194619 231852 221077 187896 178179 179554 188447 170899
12280 170899 156402 130173 146707 184966 178982 172985 150849 145345 136976 127494 112768 157074
12268 157074 199068 166951 187137 174595 166237 119678 78699 110350 135987 111095 114791 115434
$$ packed form
12348A099651N1821J5359J3933m5635p109k6459j14551j01006q6647o7151k6790
12337G05416j6858L4291J3009P2006J09736J13034J81255J82337J60998O7881
12327A623105m9361j96252k17288k11029j91893j40448r3246o6032o2277k3734
12317C71545J0392n8657n2636k6338M0545Q946l6621O1N8349k7662p6145K111
12305B13890L6189O917l6736J565K2102K407k2365k1441r567k1649j2397k233
12293A56682N020k899q584J4910K1046Q444L7233j0775l3181r717J375Q893j7548
12280A70899j4497k6229J6534L8259n984n997k2136n504q369r482j4726M4306
12268A57074M1994l2117K0186j2542q358m6559m0979L1651K5637k4892L696O43
$$ plain form
12256 115434 110923 121300 160094 100696 93618 90658 91352 95336 52239 59140 68609 66377 89510
12243 89510 64617 54994 53994 3798 15630 52427 70351 92505 83957 76369 79292 71829 72609
12230 72609 103237 103112 94295 78122 57827 72623 64943 89689 123953 122661 108219 114264 110544
12217 110544 79940 62975 74304 99706 90842 46308 65503 103874 110697 73431 55680 60985
12205 60985 43889 21107 40654 17741 11754 24430 46012 47014 67854 72105 76064 99033
12193 99033 101820 99193 144279 168642 159850 147609 141231 110409 117660 140900 155109 194300 237951
12180 237951 323491 358653 348076 322447 324144 302674 224896 183176 135738 122546 110681 100469
12168 100469 103143 76789 61590 71168 104617 90731 77992 61531 90078 99809 138607 148029
$$ packed form
12256A15434m511J0377L8794n9398p078k960O94L984m3097O901R469k232K3133
12243H9510k4893r623j000n0196J1832L6797J7924K2154q548p588K923p463P80
12230G2609L0628j25q817j6173k0295J4796p680K4746L4264j292j4442O045l720
12217A10544l0604j6965J1329K5402q864m4534J9195L8371O823l7266j7751N305
12205F0985j7096k2782J9547k2913n987J2676K1582J002K0840M251L959K2969
12193I9033K787k627M5086K4363q792j2241o378l0822P251K3240J4209L9191M3651
12180B37951Q5540L5162j0577k5629J697k1470p7778m1720m7438j3192j1865j0212
12168A00469K674k6354j5199R578L3449j3886j2739j6461K8547R731L8798R422
$$ plain form
12156 148029 106435 77036 78719 100395 137071 168089 175481 190743 205934 188359 155510 173869
12144 173869 155344 147784 167115 202460 187688 176812 199268 216021 199293 191333 151436 151676
12132 151676 207601 229977 240570 235901 248313 228861 187133 189462 213849 215879 177243 194953
12120 194953 201342 191181 144877 122703 148419 159696 161837 147419 153017 158964 168173 188995
12108 188995 196375 194103 162151 166527 154704 146784 170202 203878 197204 212090 205781 164293 164931
12095 164931 138194 123520 130255 119033 143162 161327 170527 180473 218777 231362 245031 242918
12083 242918 254251 304769 380440 514016 591661 666730 695208 679162 649961 598391 519386
12072 519386 433386 361749 319169 293772 291903 310414 314380 320031 338830 367335 402781 402205
$$ packed form
12156A48029m1594k9399J683K1676L6676L1018P392J5262J5191j7575l2849J8359
12144A73869j8525p560J9331L5345j4772j0876K2456J6753j6728p960l9897K40
12132A51676N5925K2376J0593m669J2412j9452m1728K329K4387K030l8636J7710
12120A94953O389j0161m6304k2174K5716J1277K141j4418N598N947R209K0822
12108A88995P380k272l1952M376j1823p920K3418L3676o674J4886o309m1488O38
12095A64931k6737j4674O735j1222K4129J8165R200R946L8304J2585J3669k113
12083B42918J1333N0518P5671J33576P7645P5069K8478j6046k9201n1570p9005
12072E19386q6000p1637m2580k5397j869J8511L966N651J8799K8505L5446n76
$$ plain form
12060 402205 351993 357405 393026 423436 437592 487063 543289 622205 750713 946608 1137581
12049 1137581 1268380 1430404 1528900 1575484 1570317 1483018 1364389 1245313 1109734 1011589
12039 1011589 938784 928895 975833 966815 983558 1016427 1048702 1146388 1263527 1308634 1328947
12028 1328947 1326629 1296946 1256083 1216417 1182555 1165296 1193900 1267060 1378637 1500768 1591307
12017 1591307 1678413 1704973 1618868 1525617 1429800 1305018 1220257 1165064 1181569 1259492 1294738
12006 1294738 1305673 1327052 1301371 1180257 979158 826542 760832 695368 633008 605384 668145
11995 668145 749657 819824 907820 1014498 1126911 1221328 1289204 1316261 1302510 1257535 1162116
11984 1162116 1014315 878665 784774 720763 685919 675458 722183 793734 836278 838081 802986
$$ packed form
12060D02205n0212N412L5621L0410J4156M9471N6226P8916J28508J95895J90973
12049A137581J30799J62024R8496M6584n167q7299j18629j19076j35579r8145
12039A011589p2805r889M6938r018J6743L2869L2275R7686J17139M5107K0313
12028A328947k318k9683m0863l9666l3862j7259K8604P3160J11577J22131R0539
12017A591307Q7106K6560q6105r3251r5817j24782q4761n5193J6505P7923L5246
12006A294738J0935K1379k5681j21114k01099j52616o5710o5464o2360k7624O2761
11995F68145Q1512P0167Q7996J06678J12413R4417O7876K7057j3751m4975r5419
11984A162116j47801j35650r3891o4011l4844j0461M6725P1551M2544J803l5095
$$ plain form
11973 802986 702936 589338 506334 473046 415503 402154 378494 330485 333615 330359 288880
11962 288880 275038 279574 257464 255496 245815 242521 248350 228862 226188 252233 268285 180808 170542
11949 170542 167926 187424 190789 208545 228514 228826 243843 228851 187155 181153 172948 184083 131170
11936 131170 96853 157239 216645 239158 250897 255775 246978 245544 228907 225406 198887 240533
11924 240533 268883 213433 204482 251870 245020 213291 220865 210097 216448 213995 256515 234054
11912 234054 233646 240851 219244 238959 232339 192989 193488 194723 222195 209449 236635 246010 245653
11899 245653 238113 181936 143903 160839 166018 158286 175818 190429 195272 220002 209470 231554
11887 231554 264998 249384 258272 267811 234226 226607 214459 202256 233254 238404 268712 279840
$$ packed form
11973H02986j00050j13598q3004l3288n7543j3349k3660m8009L130l256m1479
11962B88880j3842M536k2110j968r681l294N829j9488k674K6045J6052q7477j0266
11949A70542k616J9498L365J7756J9969L12J5017j4992m1696o002q205J1135n2913
11936A31170l4317O0386N9406K2513J1739M878q797j434j6637l501k6519M1646
11924B40533K8350n5450q951M7388o850l1729P574j0768O351k453M2520k2461
11912B34054m08P205k1607J9715o620l9350M99J235K7472j2746K7186R375l57
11899B45653p540n6177l8033J6936N179p732J7532J4611M843K4730j0532K2084
11887B31554L3444j5614Q888R539l3585p619j2148j2203L0998N150L0308J1128
$$ plain form
11875 279840 284305 342774 337986 307264 356610 449947 419996 389065 394445 420444 385037 313498
11863 313498 304793 294102 309489 323017 334122 335008 347230 335122 306671 317336 358823 372230
11851 372230 355852 376175 374821 368183 381737 384327 405904 436135 439961 458082 475072 461690
11839 461690 412222 361415 350542 338681 325158 348685 377948 374906 396047 427711 395342 372723
11827 372723 381809 387866 382651 377014 337729 328336 313412 292167 317172 362056 354739 360735 386970
11814 386970 402343 407373 424475 424342 435224 449832 445979 422475 408122 388764 403905 374183
11802 374183 380033 388666 360623 378067 431285 443828 444890 451320 465614 456704 464311 456377 441004
11789 441004 395281 387462 403384 389299 412894 400156 381330 395441 402585 428770 438681 452773
$$ packed form
11875B79840M465N8469m788l0722M9346R3337k9951l0931N380K5999l5407p1539
11863C13498q705j0691J5387J3528J1105Q86J2222j2108k8451J0665M1487J3407
11851C72230j6378K0323j354o638J3554K590K1577L0231L826J8121J6990j3382
11839D61690m9468n0807j0873j1861j3523K3527K9263l042K1141L1664l2369k2619
11827C72723R086O057n215n637l9285r393j4924k1245K5005M4884p317N996K6235
11814C86970J5373N030J7102j33J0882J4608l853k3504j4353j9358J5141k9722
11802C74183N850Q633k8043J7444N3218J2543J062O430J4294q910P607p934j5373
11789D41004m5723p819J5922j4085K3595j2738j8826J4111P144K6185R911J4092
$$ plain form
11777 452773 479480 493308 520714 529759 493980 489980 542124 563625 580263 566576 586970 611168
11765 611168 583832 579544 584898 594162 623557 642857 677999 662961 673675 696910 688886 730973
11753 730973 776428 805712 813585 823467 852065 863286 923744 934476 851141 794037 759162 754132
11741 754132 749348 805283 927929 1066035 1207447 1377327 1541654 1617340 1628974 1670611 1664057
11730 1664057 1569885 1420586 1288004 1163891 1024401 963103 956644 927182 940931 963846 960976
11719 960976 960125 986622 939706 924830 905942 803779 775455 777963 778786 806186 798140 834058
11707 834058 837008 821212 851760 865070 847300 835415 849196 869053 916771 958399 1000785 1023449
11695 1023449 1057870 1090542 1101110 1091454 1077340 1094527 1102297 1114818 1100365 1084589 1071002 1079376
$$ packed form
11777D52773K6707J3828K7406R045l5779m000N2144K1501J6638j3687K0394K4198
11765F11168k7336m288N354R264K9395J9300L5142j5038J0714K3235q024M2087
11753G30973M5455K9284P873R882K8598J1221O0458J0732q3335n7104l4875n030
11741G54132m784N5935J22646J38106J41412J69880J64327P5686J1634M1637o554
11730A664057r4172j49299j32582j24113j39490o1298o459k9462J3749K2915k870
11719I60976q51K6497m6916j4876j8888j02163k8324K508Q23K7400q046L5918
11707H34058K950j5796L0548J3310j7770j1885J3781J9857M7718M1628M2386K2664
11695A023449L4421L2672J0568r656j4114J7187P770J2521j4453j5776j3587Q374
$$ plain form
11683 1079376 1085603 1072541 1126885 1200676 1277492 1339299 1383856 1451288 1489378 1536949 1582875
11672 1582875 1622135 1694043 1719706 1731927 1776445 1820331 1878332 1945136 2050222 2175449 2279433
11661 2279433 2347843 2438678 2578956 2630369 2704478 2841647 2938664 3026028 3150664 3296238
11651 3296238 3479586 3698204 3907224 4155309 4350123 4577939 4849367 5141064 5482476
11642 5482476 5843084 6222646 6713393 7310217 8018663 8871443 9911467 11173780 12602715
11633 12602715 14288328 16227924 18440082 21060173 24284561 28402744 33800055 41207880
11625 41207880 51623695 66402086 86966653 114706913 150377585 192656254 235579929
11618 235579929 266583020 272890180 254435158 222799871 188639903 157084364 130346076
$$ packed form
11683A079376O227j3062N4344P3791P6816O1807M4557O7432L8090M7571M5926
11672A582875L9260P1908K5663J2221M4518M3886N8001O6804J05086J25227J03984
11661B279433O8410R0835J40278N1413P4109J37169R7017Q7364J24636J45574
11651C296238J83348K18618K09020K48085J94814K27816K71428K91697L41412
11642E482476L60608L79562M90747N96824P08446Q52780J040024J262313J428935
11633A2602715J685613J939596K212158K620091L224388M118183N397311P407825
11625D1207880J0415815J4778391K0564567K7740260L5670672M2278669M2923675
11618B35579929L1003091O307160j8455022l1635287l4159968l1555539k6738288
$$ plain form
11611 130346076 109514820 95094354 86876319 84214645 86769546 94634997 107703926
11604 107703926 124795807 143045260 158189862 166385091 165869614 158362948 147978856
11597 147978856 138218458 132013452 132010771 140119423 157369193 183711534 216797591 250651467
11589 250651467 275977938 283956649 271504948 244096868 211768314 182935017 162058799
11582 162058799 150363877 147157548 150512287 157557671 164780016 167940171 163476016 151277079
11574 151277079 134090717 115726768 99540235 87330417 79585087 76304794 77446130
11567 77446130 83399411 94715978 111935644 135143334 163692123 195587859 226073199
11560 226073199 246360144 246476962 223987841 187913373 149996345 117100434 91063884
$$ packed form
11611A30346076k0831256j4420466q218035k661674K554901P865451J3068929
11604A07703926J7091881J8249453J5144602Q195229n15477p506666j0384092
11597A47978856r760398o205006k681Q108652J7249770K6342341L3086057L3853876
11589B50651467K5326471P978711j2451701k7408080l2328554k8833297k0876218
11582A62058799j1694922l206329L354739P045384P222345L160155m464155j2198937
11574A51277079j7186362j8363949j6186533j2209818p745330l280293J141336
11567G7446130N953281J1316567J7219666K3207690K8548789L1895736L0485340
11560B26073199K0286945J16818k2489121l6074468l7917028l2895911k6036550
$$ plain form
11553 91063884 71326303 56704817 45958198 38062921 32163244 27560728 23815953 20703365
11545 20703365 18064703 15808154 13932337 12354387 10998934 9848969 8911665 8118647
11537 8118647 7424155 6810737 6277707 5817611 5372150 5006542 4723961 4397507 4115464
11528 4115464 3874865 3632533 3432302 3263122 3087237 2949528 2813591 2713044 2631041 2506018
11518 2506018 2359946 2198126 2137776 2080866 1994701 1914212 1905580 1908782 1882339 1815905 1747749
11507 1747749 1678368 1599988 1565783 1517771 1459007 1442088 1436021 1420746 1413297 1400219 1378907 1412576
11495 1412576 1463486 1437732 1404671 1406710 1328082 1183017 1092759 1017117 988712 993485 993661 978406
11483 978406 969421 958880 958666 953431 926462 929808 898635 814090 787791 767440 752809 703622
$$ packed form
11553I1063884j9737581j4621486j0746619p895277n899677m602516l744775l112588
11545B0703365k638662k256549j875817j577950j355453j149965r37304p93018
11537H118647o94492o13418n33030m60096m45461l65608k82581l26454k82043
11528D115464k40599k42332k00231j69180j75885j37709j35937j00547q2003j25023
11518B506018j46072j61820o0350n6910q6165q0489q632L202k6443o6434o8156
11507A747749o9381p8380l4205m8012n8764j6919o067j5275p449j3078k1312L3669
11495A412576N0910k5754l3061K039p8628j45065r0258p5642k8405M773J76j5255
11483I78406q985j0541k14n235k6969L346l1173q4545k6299k0351j4631m9187
$$ plain form
11471 703622 693413 696205 701737 659794 665857 748114 819362 836419 846072 817310 783175 731489
11459 731489 665744 584807 533127 519565 572289 565560 535039 544501 595372 674106 701866 674620
11447 674620 737834 804315 850995 867224 860408 824487 720300 644884 587327 585441 575141 558249
11435 558249 540693 526533 506775 449199 391271 328357 283952 293935 245865 194651 175728 183894
11423 183894 177340 140052 80424 52122 69902 96199 101227 76617 76115 86550 85821 111536 119108
11410 119108 104183 77411 86513 88432 81027 91640 115442 104185 62035 65308 61142 50299
11398 50299 28034 31938 92220 172756 175728 165956 123545 87203 34203 21684 1744 -1296
11386 -1296 20369 44227 38662 30214 27306 64342 88043 118295 118110 143353 104226 61913 72449
$$ packed form
11471G03622j0209K792N532m1943O063Q2257P1248J7057R653k8762l4135n1686
11459G31489o5745q0937n1680j3562N2724o729l0521R462N0871P8734K7760k7246
11447F74620O3214O6481M6680J6229o816l5921j04187p5416n7557j886j0300j6892
11435E58249j7556j4160j9758n7576n7928o2914m4405R983m8070n1214j8923Q166
11423A83894o554l7288n9628k8302J7780K6297N028k4610n02J0435p29K5715P572
11410A19108j4925k6772R102J919p405J0613K3802j1257m2150L273m166j0843
11398E0299k2265L904O0282Q0536K972r772m2411l6342n3000j2519j9940l040
11386a296K1665K3858n565q448k908L7036K3701L0252j85K5243l9127m2313J0536
$$ plain form
11373 72449 66620 84049 121276 122136 98054 142631 165151 150426 136495 118485 115834 155256
11361 155256 119753 78323 111946 80796 75360 63253 62414 79099 100745 142458 137518 123066
11349 123066 101080 84752 70805 40068 38278 40525 63289 65110 21938 38921 70244 50261
11337 50261 176 18709 33433 33281 33132 71192 67580 71472 17122 20973 60652 80120 73974
11324 73974 51316 54876 59506 26140 42668 65280 78733 45668 18992 51171 70468 35064
11312 35064 52695 49923 64910 89043 80471 31705 27614 11755 16187 49596 59248 14355 -39101
11299 -39101 -61508 -71246 -70971 -58441 -42209 -16319 -19670 1574 -28507 -70530 -70335 -59633 -45089
11286 -45089 -31191 -47259 -29916 -20473 -27414 -38789 -12885 -697 -46605 -44996 -12032 15319
$$ packed form
11373G2449n829J7429L7227Q60k4082M4577K2520j4725j3931j8010k651L9422
11361A55256l5503m1430L3623l1150n436j2107q39J6685K1646M1713m940j4452
11349A23066k1986j6328j3947l0737j790K247K2764J821m3172J6983L1323j9983
11337E0261n0085J8533J4724j52j49L8060l612L892n4350L851L9679J9468o146
11324G3974k2658L560M630l3366J6528K2612J3453l3065k6676L2179J9297l5404
11312C5064J7631k772J4987K4133q572m8766m091j5859M432L3409R652m4893n3456
11299c9101k2407r738K75J2530J6232K5890l351K1244l0081m2023J95J0702J4544
11286d5089J3898j6068J7343R443o941j1375K5904J2188m5908J609L2964K7351
$$ plain form
11274 15319 26739 48448 108065 93098 55661 -12056 -26791 -35049 -48629 -54073 -60574 -87902
11262 -87902 -65934 -44712 -22037 -28466 -52999 -33386 -11224 -16799 -21023 -18316 20806 2801
11250 2801 -7233 -9423 -25682 -43973 -15276 -17391 -29634 -26721 -4247 6425 -14224 -407
11238 -407 22005 1601 -1244 -4101 -3839 -12002 -28499 -26636 -17487 -9583 20383 -26611 -58596 -51214
11224 -51214 1423 20540 6856 -6751 -12829 -19058 6470 23661 49141 36702 24561 33050
11212 33050 39689 49846 74671 45740 16220 17362 -21884 -9116 -12751 8819 64356 93456
11200 93456 90500 51001 42899 68844 112183 149230 200945 216856 216029 275693 342420 420076
11188 420076 492871 634941 774468 939645 1088280 1193013 1220531 1181429 1115928 1015619
$$ packed form
11274A5319J1420K1709N9617j4967l7437o7717j4735q258j3580n444o501k7328
11262h7902K1968K1222K2675o429k4533J9613K2162n575m224K707L9122j8005
11250B801j0034k190j6259j8291K8697k115j2243K913K2474J0672k0649J3817
11238d07K2412k0404k845k857K62q163j6497J863R149P904K9966m6994l1985P382
11224e1214N2637J9117j3684j3607o078o229K5528J7191K5480j2439j2141Q489
11212C3050O639J0157K4825k8931k9520J142l9246J2768l635K1570N5537K9100
11200I3456k956l9499q102K5945M3339L7047N1715J5911q27N9664O6727P7656
11188D20076P2795J42070J39527J65177J48635J04733K7518l9102o5501j00309
$$ plain form
11178 1015619 831469 695769 608629 541111 474053 453555 486966 564585 606930 663197 765779
11167 765779 842549 877410 883964 871364 815643 798891 806159 792448 854188 944223 1034962 1137261
11155 1137261 1287035 1414704 1397534 1341153 1314289 1310404 1361082 1580208 1989924 2696760
11145 2696760 3350118 3124562 2388438 1835307 1469420 1209112 1006293 831406 693924
11136 693924 622208 569541 557143 567592 591872 630650 708444 799804 888606 1033630 1110551
11125 1110551 1122821 1086503 1001616 923318 761782 632779 503241 347324 265107 243796
11115 243796 201696 158947 144706 132006 132153 109055 76151 42423 21418 18968 13852 40628
11103 40628 65474 36011 -7241 -19213 -13815 -11896 -28751 -24574 11214 58720 74866 28488
$$ packed form
11178A015619j84150j35700q7140o7518o7058k0498L3411P7619M2345N6267J02582
11167G65779P6770L4861O554j2600n5721j6752P268j3711O1740R0035R0739J02299
11155A137261J49774J27669j7170n6381k6864l885N0678K19126M09716P06836
11145B696760O53358k25556p36124n53131l65887k60308k02819j74887j37482
11136F93924p1716n2667j2398J0449K4280L8778P7794R1360Q8802J45024P6921
11125A110551J2270l6318q4887p8298j61536j29003j29538j55917q2217k1311
11115B43796m2100m2749j4241j2700J47k3098l2904l3728k1005k450n116K6776
11103D0628K4846k9463m3252j1972N398J919j6855M177L5788M7506J6146m6378
$$ plain form
11091 28488 -28617 -61622 -33265 -26245 -19169 17338 19021 -40159 -45012 -99246 -93782 -40870 -8356
11078 -8356 -21273 -10543 -1150 40946 32602 3615 17332 32730 -1909 -4324 33636 44386
11066 44386 25194 8837 -3538 -31610 -47255 -15951 8884 33199 55319 98486 102058 59127
11054 59127 41918 68012 81317 87244 73607 68166 29403 17811 35892 21224 13380 1209
11042 1209 16038 31916 63771 70369 57241 33170 18708 28974 45919 84940 101598 139296
11030 139296 127880 131037 164468 181456 182288 203596 205002 298850 390659 399371 414359 403492
11018 403492 361890 351183 421059 507510 582907 638298 714167 800060 908879 1050122 1326983
11007 1326983 1720888 2352478 3333419 5022288 8166060 14214557 23654039 27651345 20187668
$$ packed form
11091B8488n7105l3005K8357P020P076L6507J683n9180m853n4234N464N2912L2514
11078h356j2917J0730R393M2096q344k8987J3717J5398l4639k415L7960J0750
11066D4386j9192j6357j2375k8072j5645L1304K4835K4315K2120M3167L572m2931
11054E9127j7209K6094J3305N927j3637n441l8763j1592J8081j4668p844j2171
11042A209J4829J5878L1855O598j3128k4071j4462J0266J6945L9021J6658L7698
11030A39296j1416L157L3431J6988Q32K1308J406R3848R1809Q712J4988j0867
11018D03492m1602j0707O9876Q6451P5397N5391P5869Q5893J08819J41243K76861
11007A326983L93905O31590R80941J688869L143772O048497R439482L997306p463677
$$ plain form
10998 20187668 12024990 7511195 5053881 3627362 2750343 2190533 1789878 1475800 1245074
10989 1245074 1057376 916650 849789 782633 769496 748552 715148 674160 612108 569243 577171
10978 577171 554311 492796 479397 487839 431600 337942 306633 311291 296636 299502 307894 333178
10966 333178 324203 262733 213202 169048 193102 178798 152181 148192 180864 173609 169258 145076
10954 145076 173530 185414 175690 149658 181439 183492 209938 243707 254147 273940 317719 365994
10942 365994 390584 376926 360978 345327 347378 338589 362932 385136 374857 318156 254258 188213
10930 188213 154758 123475 68830 37458 30740 50915 13023 8096 18108 -8686 5790 8959
10918 8959 13130 36705 81347 94041 89489 97989 119281 73547 27261 33933 23900 21926 31695
$$ packed form
10998B0187668q162678m513795k457314j426519q77019n59810m00655l14078k30726
10989A245074j87698j40726o6861o7156j3137k0944l3404m0988o2052m2865P928
10978E77171k2860o1515j3399Q442n6239r3658l1309M658j4655K866Q392K5284
10966C33178q975o1470m9531m4154K4054j4304k6617l989L2672p255m351k4182
10954A45076K8454J1884r724k6032L1781K053K6446L3769J0440J9793M3779M8275
10942C65994K4590j3658j5948j5651K051q789K4343K2204j0279n6701o3898o6045
10930A88213l3455l1283n4645l1372o718K0175l7892m927J0012k6794J4476L169
10918H959M171K3575M4642J2694m552Q500K1292m5734m6286O672j0033j974R769
$$ plain form
10905 31695 20361 33510 36512 29252 26759 17792 -12454 14226 49552 62531 55045 55782 34563
10892 34563 23747 5703 -18606 -24839 -28688 -12003 -23367 -28137 -39698 -36262 -16027 -13530 25543
10879 25543 6208 -13074 -27924 -20848 42574 53568 30053 21009 40414 80744 97717 160863
10867 160863 241875 277096 225241 131834 62001 78928 73893 67514 53013 -6280 -21581 -15065
10855 -15065 -22984 -62756 -91940 -61727 -63834 -70425 -11823 3513 19359 28936 25949 7869 -21299
10842 -21299 -68283 -23929 4994 9693 71438 84141 19016 49185 126396 84253 39207 45531
10830 45531 40069 26168 19235 -40400 -70637 -34582 11467 52621 80759 138389 137141 94668
10818 94668 128023 145951 190649 257205 309116 343568 350946 313373 297677 305558 326348 325488
$$ packed form
10905C1695j1334J3149L002p260k493q967l0246K6680L5326J2979p486P37k1219
10892C4563j0816j8044k4309o233l849J6685j1364m770j1561L436K0235K497L9073
10879B5543j9335j9282j4850P076O3422J0994k3515r044J9405M0330J6973O3146
10867A60863Q1012L5221n1855r3407o9833J6927n035o379j4501n9293j5301O516
10855a5065p919l9772k9184L0213k107o591N8602J5336J5846R577k987j8080k9168
10842b1299m6984M4354K8923M699O1745J2703o5125L0169P7211m2143m5046O324
10830D5531n462j3901o933n9635l0237L6055M6049M1154K8138N7630j248m2473
10818I4668L3355J7928M4698O6556N1911L4452P378l7573j5696P881K0790q60
$$ plain form
10806 325488 355937 351535 319652 302331 223158 161942 131127 133920 159059 146230 114368 78938
10794 78938 81667 107594 137311 180452 214259 262831 262037 261504 303384 327204 340345 372580 462423
10781 462423 531731 570659 534654 499077 492599 497670 465579 413966 365991 338632 327798 313722
10769 313722 337737 360204 411721 414034 391413 379885 364610 340835 282040 256428 234879 203818
10757 203818 185154 143539 96459 73903 75178 84935 90357 95559 74894 56853 32235 21758
10745 21758 43339 40273 63196 67861 68483 73675 89392 84215 91768 121731 162506 171349 169605
10732 169605 158991 136741 107640 163469 163586 136687 118789 107088 132620 142524 89928 46814
10720 46814 6919 -15581 -6853 11835 15787 26533 9571 -26931 -21894 -39032 -25378 2012
$$ packed form
10806C25488L0449m402l1883j7321p9173o1216l0815K793K5139j2829l1862l5430
10794G8938K729K5927K9717M3141L3807M8572p94n33M1880K3820J3141L2235Q9843
10781D62423O9308L8928l6005l5577o478N071l2091n1613m7975k7359j0834j4076
10769C13722K4015K2467N1517K313k2621j1528j5275k3775n8795k5612k1549l1061
10757B03818j8664m1615m7080k2556J275R757N422N202k0665j8041k4618j0477
10745B1758K1581l066K2923M665O22N192J5717n177P553K9963M0775Q843j744
10732A69605j0614k2250k9101N5829J17k6899j7898j1701K5532R904n2596m3114
10720D6814l9895k2500Q728J8688L952J0746j6962l6502N037j7138J3654K7390
$$ plain form
10708 2012 13920 -18142 -17854 -6278 -22665 22354 16253 -15263 -40930 -29658 -33672 -85016 -63830
10695 -63830 -32523 -11897 -20432 -13397 -5089 -24488 -74911 -84862 -86498 -110204 -102200 -117308 -93137
10682 -93137 -41617 -22270 -39682 -40941 -14857 -28083 -51790 -82512 -79990 -63379 -31803 -4679
10670 -4679 -20637 -64904 -94134 -51887 -50665 -44936 -58754 -104746 -98186 -105708 -91440 -88141 -87972
10657 -87972 -73977 -88086 -89297 -86331 -101250 -70961 -39166 -16061 -36466 -43382 -44876 -76493
10645 -76493 -62929 -58714 -96693 -128153 -124070 -76932 -74669 -107112 -90932 -83595 -116692 -84710
10633 -84710 -16262 -14286 -26486 -49561 -58112 -51700 -62379 -43443 -47980 -67377 -59251 -9520 19994
10620 19994 6399 -10876 22255 51734 14076 -23449 1854 63837 46945 23249 -9354 -44911
$$ packed form
10708B012J1908l2062K88J1576j6387M5019o101l1516k5667J1272m014n1344K1186
10695f3830L1307K0626q535P035Q308j9399n0423r951j636k3706Q004j5108K4171
10682i3137N1520J9347j7412j259K6084j3226k3707l0722K522J6611L1576K7124
10670d679j5958m4267k9230M2247J222N729j3818m5992O560p522J4268L299J69
10657h7972J3995j4109j211K966j4919L0289L1795K3105k0405o916j494l1617
10645g6493J3564M215l7979l1460M083M7138K263l2443J6180P337l3097L1982
10633h4710O8448J976j2200k3075q551O412j0679J8936m537j9397Q126M9731K9514
10620A9994j3595j7275L3131K9479l7658l7525K5303O1983j6892k3696l2603l5557
$$ plain form
10608 -44911 -12259 -3256 -8238 -20839 -29487 -36351 -24146 -43550 -44465 -46439 -39106 -27719 -33841
10595 -33841 -43171 -29063 -23592 -9306 -25154 -57267 -49917 -47196 -14960 -11890 -10570 -72317 -66143
10582 -66143 -72685 -52848 -67744 -68833 -69500 -120542 -111889 -75825 -22500 -34535 -39575 -19557 -3551
10569 -3551 -37479 -85742 -65688 -82713 -101776 -54245 -54973 -69103 -88656 -105780 -88704 -68625
10557 -68625 -46711 -3922 -11415 -14667 16695 -13870 -81412 -92653 -61918 -64272 -90427 -86849
10545 -86849 -58440 -61068 -86375 -64286 -37062 -41066 -4064 398 10410 -6269 -29255 -22540
10533 -22540 -28473 -61407 -91701 -51771 -48794 -48469 -40799 8266 1289 -23053 -33012 -33724 -9820
10520 -9820 407 432 -20692 -44339 -70828 -65765 -16660 10657 -4073 -11299 -50217 -38768 20319
$$ packed form
10608d4911L2652R003m982j2601q648o864J2205j9404r15j974P333J1387o122
10595c3841r330J4108N471J4286j5848l2113P350K721L2236L070J320o1747O174
10582f6143o542J9837j4896j089o67n1042Q653L6064N3325j2035n040K0018J6006
10569c551l3928m8263K0054j7025j9063M7531p28j4130j9553j7124J7076K0079
10557f8625K1914M2789p493l252L1362l0565o7542j1241L0735k354k6155L578
10545h6849K8409k628k5307K2089K7224m004L7002M462J0012j6679k2986O715
10533b2540n933l2934l0294L9930K977L25P670M9065o977k4342r959p12K3904
10520i820J0227K5k1124k3647k6489N063M9105K7317j4730p226l8918J1449N9087
$$ plain form
10507 20319 22112 12450 -2387 -2850 -33732 -58947 -65977 -49841 -22125 -13016 -24193 -6546 4552
10494 4552 15842 8861 -953 13073 45265 23500 -13282 -46841 -107548 -76361 -26666 -6396
10482 -6396 -17937 -14367 5010 852 -10834 -15386 15316 7376 15059 39170 28931 19616 2034
10469 2034 1107 11149 -14734 5473 32955 20702 3543 37597 54324 52250 28155 8612
10457 8612 15801 52607 34250 7784 -24902 -37530 -17779 -51908 -68672 -57794 -31019 -27567
10445 -27567 -36374 -17773 -30167 11875 5381 -11192 -45015 -48403 -41568 -33262 -31069 -23793 -7902
10432 -7902 -53638 -72862 -72795 -60967 -43303 4095 -13705 -34209 6683 -7032 -1311 15039 26988
10419 26988 12344 -689 13198 62417 69370 73097 51526 -30867 -47202 -26307 11453 -13769
$$ packed form
10507B0319J793r662j4837m63l0882k5215p030J6136K7716R109j1177J7647J1098
10494D552J1290o981r814J4026L2192k1765l6782l3559o0707L1187M9695K0270
10482f396j1541L570J9377m158j1686m552L0702p940P683K4111j0239r315j7582
10469B034r27J0042k5883K0207K7482j2253j7159L4054J6727k074k4095j9543
10457H612P189L6806j8357k6466l2686j2628J9751l4129j6764J0878K6775L452
10445b7567q807J8601j2394M2042o494j6573l3823l388O835Q306K193P276J5891
10432g902m5736j9224O7J1828J7664M7398j7800k0504M0892j3715N721J6350J1949
10419B6988j4644j3033J3887M9219O953L727k1571q2393j6335K0895L7760k5222
$$ plain form
10407 -13769 -33000 -48708 -87268 -69761 -68513 -73974 -82501 -73681 -77004 -84687 -85708 -73554 -48103
10394 -48103 -77430 -74529 -78071 -58672 -41475 2919 28110 43581 41570 41194 26634 -21761 -7
10381 -7 -3228 -25195 -59550 -41430 -10763 -8925 45781 86714 81906 88091 101801 113923 97076
10368 97076 32732 -13062 3998 -13446 -32020 977 9269 22182 32403 18405 46120 48107
10356 48107 25057 44476 10221 -10014 -8304 2841 -34639 -31672 -34747 -21736 -10298 -24307
10344 -24307 -30866 -14060 -33340 -45237 -35515 -7284 -32874 -42492 -63350 -85176 -97219 -12095
10332 -12095 45192 48522 72757 64131 6451 -16935 -27678 -50586 -66230 -48122 -63175 -49247
10320 -49247 -33342 -51427 -25124 -31042 -13419 -3973 -8635 -25595 -8459 79836 73546 8954
$$ packed form
10407a3769j9231j5708l8560J7507J248n461q527Q820l323p683j021J2154K5451
10394d8103k9327K901l542J9399J7197M4394K5191J5471k011l76j4560m8395K1754
10381gl221k1967l4355J8120L0667J838N4706M0933m808O185J3710J2122j6847
10368I7076o4344m5794J7060j7444j8574L2997Q292J2913J0221j3998K7715J987
10356D8107k3050J9419l4255k0235J710J1145l7480K967l075J3011J1438j4009
10344b4307o559J6806j9280j1897R722K8231k5590r618k0858k1826j2043Q5124
10332a2095N7287L330K4235q626n7680k3386j0743k2908j5644J8108j5053J3928
10320d9247J5905j8085K6303n918J7623R446m662j6960J7136Q8295o290o4592
$$ plain form
10308 8954 -19066 -24925 -30470 -39759 -26267 -49235 -55416 -76538 -65515 -82662 -96927 -71610 -64994
10295 -64994 -46610 -43971 -21496 1659 23516 11159 9308 9440 -15460 -55232 -64487 -44553 -25491
10282 -25491 -13378 -8650 13037 -12904 -16675 -55237 -65215 -76338 -65164 -75283 -75007 -53645 -75549
10269 -75549 -98405 -35934 26674 28360 27087 47107 33370 14546 44065 52408 10987 20374
10257 20374 -3474 -45783 -55041 -39113 559 15811 -10872 -37654 -36425 -24033 -56294 -42815
10245 -42815 -4509 11032 40386 34165 21687 -1561 15160 12141 -4860 -2059 -28387 -13129
10233 -13129 -3108 -21496 -35376 -16257 12066 16579 3265 -1553 -14731 -36894 -21900 -36734
10221 -36734 -8224 3536 -24346 -14566 -28072 -16252 -14634 -17715 -9169 -15075 -50516 -44610 -28591
$$ packed form
10308H954k8020n859n545r289J3492k2968o181k1122J1023j7147j4265K5317O616
10295f4994J8384K639K2475K3155K1857j2357j851J32k4900l9772r255J9934J9062
10282b5491J2113M728K1687k5941l771l8562r978j1123J1174j0119K76K1362k1904
10269g5549k2856O2471O2608J686j273K0020j3737j8824K9519Q343m1421R387
10257B0374k3848m2309r258J5928L9672J5252k6683k6782J229J2392l2261J3479
10245d2815L8306J5541K9354o221j2478k3248J6721l019j7001K801k6328J5258
10233a3129J0021j8388j3880J9119K8323M513j3314m818j3178k2163J4994j4834
10221c6734K8510J1760k7882R780j3506J1820J618l081Q546n906l5441N906J6019
$$ plain form
10208 -28591 -39443 -23347 -4610 -35723 -25720 -8836 19824 20268 2862 4003 11374 -31926
10196 -31926 -54645 -14802 26393 8548 7620 8383 8944 26952 38607 33182 6236 6155 19921 13264
10182 13264 26709 39873 55195 32958 29161 28537 8672 -23910 -11247 -8160 18058 40759
10170 40759 21956 -581 6664 -17928 -60810 -33716 -27479 -7817 -8709 -6224 -22247 -40762 -53273
10157 -53273 -99260 -90824 -39145 -1155 18005 16091 -13301 36841 49778 12250 -7335 -10416
10145 -10416 -3488 6959 -26031 -55883 -60774 -46280 -41158 -21540 -14304 9204 28282 19636 30491
10132 30491 49056 30818 538 -32704 -18907 10088 42263 27282 -7872 -55364 -60628 -16888
10120 -16888 27760 60134 68780 71691 61274 44102 -14368 -19608 76 1316 30426 1568
$$ packed form
10208b8591j0852J6096J8737l1113J0003J6884K8660M44j7406J141P371m3300
10196c1926k2719L9843M1195j7845r28P63N61J8008J1655n425k6946q1J3766o657
10182A3264J3445J3164J5322k2237l797o24j9865l2582J2663L087K6218K2701
10170D0759j8803k2537P245k4592m2882K7094O237J9662q92K485j6023j8515j2511
10157e3273m5987Q436N1679L7990J9160j914k9392N0142J2937l7528j9585l081
10145a0416O928J0447l2990k9852m891J4494N122J9618P236K3508J9078q646J0855
10132C0491J8565j8238l0280l3242J3797K8995L2175j4981l5154m7492n264M3740
10120a6888M4648L2374Q646K911j0417j7172n8470n240J9684J240K9110k8858
$$ plain form
10108 1568 5242 15690 -11402 -29676 -20080 13970 -7393 -28064 -34283 -9148 36319 27198 13744
10095 13744 6311 -5163 6064 33815 15788 12139 -5596 -30156 -14689 -8622 8812 27902
10083 27902 35006 2954 -28894 -6441 3285 -33024 -46562 -47138 -42777 -35695 -55526 -44257 -28722
10070 -28722 -26758 -20789 -54367 -55915 -34497 -18529 -50690 -30300 -13004 29083 85239 97693
10058 97693 42097 -10812 -27175 -30881 -18068 40003 35184 21310 23442 22074 29214 43699 38406
10045 38406 8665 9684 2902 38409 46839 28545 10505 996 -1082 -4186 1566 5372 2468
10032 2468 -1092 -197 -12452 -1040 24684 -18845 -27915 -11151 15525 59680 30646 18621 -1346
10019 -1346 1789 -6505 -22611 -21339 -18731 2038 5471 17113 9767 -12975 -34636 -21700 -21811
$$ packed form
10108A568L674J0448k7092j8274R596L4050k1363k0671o219K5135M5467r121j3454
10095A3744p433j1474J1227K7751j8027l649j7735k4560J5467O067J7434J9090
10083B7902P104l2052l1848K2453R726l6309j3538n76M361P082j9831J1269J5535
10070b8722J964N969l3578j548K1418J5968l2161K0390J7296M2087N6156J2454
10058I7693n5596n2909j6363l706J2813N8071m819j3874K132j368P140J4485n293
10045C8406k9741J019o782L5507Q430j8294j8040r509k078l104N752L806k904
10032B468l560Q95j2255J1412K5724m3529r070J6764K6676M4155k9034j2025j9967
10019a346L135q294j6106J272K608K0769L433J1642p346k2742k1661J2936j11
$$ plain form
10006 -21811 17669 8187 -6267 44032 43387 13672 2594 -3343 6738 -31507 -40858 -17275 -28967
9993 -28967 -33288 2054 15958 42725 79904 66587 82134 86785 45727 6255 36626 37982
9981 37982 10505 -3663 11770 -483 -7904 -481 -6134 -18547 -23531 -38424 22998 44864 511
9968 511 14949 36440 65718 33878 14215 27356 14775 5342 7361 13296 33014 27633 7529
9955 7529 4409 16993 66540 68022 27955 10837 1303 4954 54061 94038 92047 115774 108952
9942 108952 79554 67077 49865 16137 -1881 -11708 -18283 4389 -22 9010 2108 20391 22411
9929 22411 27572 463 16717 -12955 -33528 -35715 -9753 27697 4646 -24071 -11820 11736
9917 11736 25213 49567 65325 95497 119395 77503 29013 -11334 -26025 -29958 -20363 -11442
$$ packed form
10006b1811L9480r482j4454N0299o45k9715j1078n937J0081l8245r351K3583j1692
9993b8967m321L5342J3904K6767L7179j3317J5547M651m1058l9472L0371J356
9981C7982k7477j4168J5433j2253p421P423n653j2413m984j4893O1422K1866m4353
9968E11J4438K1491K9278l1840j9663J3141j2581r433K019N935J9718n381k0104
9955G529l120J2584M9547J482m0067j7118r534L651M9107L9977j991K3727o822
9942A08952k9398j2477j7212l3728j8018r827o575K2672m411R032o902J8283K020
9929B2411N161k7109J6254k9672k0573k187K5962L7450k3051k8717J2251K3556
9917A1736J3477K4354J5758L0172K3898m1892m8490m0347j4691l933R595Q921
$$ plain form
9905 -11442 -3917 34507 58432 60844 67893 65598 59571 58799 37601 46459 31423 4424 20892
9892 20892 35548 45070 50336 70133 75655 59380 -1033 8381 3809 7502 13057 11510 -5495
9879 -5495 -38327 -21972 15378 24556 39110 22156 28938 44556 39652 -8412 4677 34671 26994
9866 26994 26486 55930 58798 71263 46648 25660 56615 65206 14709 -1095 191 -1689 -5023
9853 -5023 -284 -15695 -18012 -29514 -38685 -21634 -3479 11798 40108 70837 56734 31893 54679
9840 54679 63556 47151 22282 37718 61449 99775 110738 100622 104724 92015 83132 94970
9828 94970 74167 71130 71756 65484 81073 119707 141345 144584 148518 100520 70196 67416 96993
9815 96993 131902 99971 99514 81622 38017 87007 133789 133549 108609 103934 97659 146560 152261
$$ packed form
9905a1442P525L8424K3925K412P049k295o027p72k1198Q858j5036k6999J6468
9892B0892J4656R522N266J9797N522j6275o0413R414m572L693N555j547j7005
9879e495l2832J6355L7350R178J4554j6954O782J5618m904m8064J3089K9994p677
9866B6994n08K9444K868J2465k4615k0988L0955Q591n0497j5804J286j880l334
9853e023M739j5411k317j1502r171J7051J8155J5277K8310L0729j4103k4841K2786
9840E4679Q877j6405k4869J5436K3731L8326J0963j0116M102j2709q883J1838
9828I4970k0803l037O26o272J5589L8634K1638L239L934m7998l0324k780K9577
9815I6993L4909l1931m57j7892m3605M8990M6782k40k4940m675o275M8901N701
$$ plain form
9802 152261 113733 70117 66646 84699 73714 48211 45118 101807 124735 101449 101062 145179
9790 145179 119591 82371 66100 60751 113 -48969 -43328 -30511 -12127 -146 26604 17026
9778 17026 18584 66499 88106 47423 45095 70146 49850 54421 64949 59441 66645 29452 -6972
9765 -6972 14176 25003 53282 61751 59303 57883 35644 8925 26478 29142 48602 39290 20733
9752 20733 99453 127668 77322 29836 17970 37362 50242 9172 16592 25085 51874 50327
9740 50327 45621 47476 37347 25395 48135 75728 83456 87496 104526 107225 97704 107316 97641
9727 97641 54455 7441 35822 81554 73049 80860 74550 67594 95372 107741 116096 94589 54131
9714 54131 62175 27127 23627 14826 17122 31717 12332 22390 64315 95652 68127 53462 37530
$$ packed form
9802A52261l8528m3616l471J8053j0985k5503l093N6689K2928k3286l87M4117
9790A45179k5588l7220j6271n349o0638m9082N641J2817J8384J1981K6750r578
9778A7026J558M7915K1607m0683k328K5051k0296M571J0528n508P204l7193l6424
9765f972K1148J0827K8279Q469k448j420k2239k6719J7553K664J9460r312j8557
9752B0733P8720K8215n0346m7486j1866J9392J2880m1070P420Q493K6789j547
9740E0327m706J855j0129j1952K2740K7593P728M040J7030K699r521R612r675
9727I7641m3186m7014K8381M5732q505P811o310o956K7778J2369Q355k1507m0458
9714E4131Q044l5048l500q801K296J4595j9385J0058M1925L1337k7525j4665j5932
$$ plain form
9701 37530 13248 18433 44149 62846 59004 33349 24966 51910 66725 62839 41105 59417 81191
9688 81191 77620 43606 13117 -5927 30193 53605 69324 83013 54523 50312 39286 6678
9676 6678 9085 23946 28318 35544 61380 71189 85730 92355 117508 128365 103521 95897 128022
9663 128022 138509 125690 97404 38264 9042 -446 8926 10507 51282 64138 49093 65831
9651 65831 46463 51566 76658 86919 97748 80603 78542 18679 -18831 24773 42265 45418
9639 45418 57067 93935 93533 78797 103769 115987 80447 64047 43699 18235 43633 61699
9627 61699 91971 98909 86218 59254 13521 2597 45817 48290 57307 92082 110604 125934
9615 125934 127190 101340 92032 90811 75074 52054 42455 56533 83090 109086 137957 155677
$$ packed form
9701C7530k4282N185K5716J8697l842k5655q383K6944J4815l886k1734J8312K1774
9688H1191l571l4014l0489j9044L6120K3412J5719J3689k8490m211j1026l2608
9676F678K407J4861M372P226K5836R809J4541O625K5153J0857k4844p624L2125
9663A28022J0487j2819k8286n9140k9222r488R372J581M0775J2856j5045J6738
9651F5831j9368N103K5092J0261J0829j7145k061n9863l7510M3604J7492L153
9639D5418J1649L6868m02j4736K4972J2218l5540j6400k0348k5464K5398J8066
9627F1699L0272O938j2691k6964m5733j0924M3220K473R017L4775J8522J5330
9615A25934J256k5850r308j221j5737k3020r599J4078K6557K5996K8871J7720
$$ plain form
9603 155677 181224 194112 173763 163029 110986 110385 107036 142507 162234 179431 177475 141384
9591 141384 130754 117243 81232 50548 79863 90835 121384 125845 107155 107880 141660 169449
9579 169449 185815 191048 165113 139927 135546 144708 174737 232867 264553 266003 239490 197104
9567 197104 181675 172288 145928 162434 141806 91734 76747 100588 125891 143224 151090 167682
9555 167682 199316 223711 227453 249488 284397 286999 281690 259055 210781 175663 205154 203319
9543 203319 165243 188460 201348 186263 207697 202112 206986 225008 208797 245126 272554 278380
9531 278380 284203 279930 270797 281480 283602 310365 368840 397700 385530 363140 335518 321504
9519 321504 314498 288525 242925 239009 230748 235090 217799 205859 238198 273195 293543 275087
$$ packed form
9603A55677K5547J2888k0349j0734n2043o01l349L5471J9727J7197j956l6091
9591A41384j0630j3511l6011l0684K9315J0972L0549M461j8690P25L3780K7789
9579A69449J6366N233k5935k5186m381R162L0029N8130L1686J450k6513m2386
9567A97104j5429r387k6360J6506k0628n0072j4987K3841K5303J7333P866J6592
9555A67682L1634K4395L742K2035L4909K602n309k2635m8274l5118K9491j835
9543B03319l8076K3217J2888j5085K1434n585M874J8022j6211L6329K7428N826
9531B78380N823m273r133J0683K122K6763N8475K8860j2170k2390k7622j4014
9519C21504p006k5973m5600l916q261M342j7291j1940L2339L4997K0348j8456
$$ plain form
9507 275087 256689 265141 279382 323861 353892 332449 271684 211160 214712 246388 280172 255541
9495 255541 253558 240051 221027 214557 290691 329715 354206 351067 296137 244672 239068 205598
9483 205598 208772 188917 198030 192976 207457 238008 278177 346804 370051 371165 343843 380396
9471 380396 348454 357620 395312 430322 439815 374430 271535 252279 232503 243477 245135 214051
9459 214051 193519 190443 198131 215060 214964 211292 196372 188522 217675 241857 239412 225169 216584
9446 216584 184908 161895 184181 194326 156633 129512 128193 170004 208434 178980 143519 173829
9434 173829 187303 159412 141601 156953 172922 179269 251146 266699 285225 327865 329651 332318
9422 332318 363729 393586 341819 276464 270632 265574 238863 203800 206254 204090 187469 198574
$$ packed form
9507B75087j8398Q452J4241M4479L0031k1443o0765o0524L552L1676L3784k4631
9495B55541j983j3507j9024o470P6134L9024K4491l139n4930n1465n604l3470
9483B05598L174j9855R113n054J4481L0551M0169O8627K3247J114k7322L6553
9471C80396l1942R166L7692L5010R493o5385j02895j9256j9776J0974J658l1084
9459B14051k0532l076P688J6929r6l672j4920p850K9153K4182k445j4243q585
9446B16584l1676k3013K2286J0145l7693k7121j319M1811L8430k9454l5461L0310
9434A73829J3474k7891j7811J5352J5969O347P1877J5553J8526M2640J786K667
9422C32318L1411K9857n1767o5355n832n058k6711l5063K454k164j6621J1105
$$ plain form
9410 198574 227157 243234 284428 264167 246022 208979 211040 208987 210078 191294 165453 145326
9398 145326 137773 134510 110419 98762 75492 63487 58179 116043 110096 74082 42388 31971
9386 31971 69199 110568 124039 117403 112405 113015 70456 54927 144110 152736 174060 170613 172003
9373 172003 204927 206710 184976 158252 126436 78313 65043 93546 94496 71994 88165 97601
9361 97601 92485 91023 134317 138907 130526 133301 114594 126282 136319 117202 102859 119181 123446
9348 123446 103717 123646 107590 82257 103958 139518 114649 75805 90056 119712 132509 135977
9336 135977 126358 119677 108413 95920 125477 141454 115757 110214 128959 124401 150346 115183
9324 115183 48781 29052 47545 22775 55796 132352 146083 137079 126658 112495 98240 90530
$$ packed form
9410A98574K8583J6077M1194k0261j8145l7043K061k053J091j8784k5841k0127
9398A45326p553l263k4091j1657k3270j2005n308N7864n947l6014l1694j0417
9386C1971L7228M1369J3471o636m998O10m2559j5529Q9183Q626K1324l447J390
9373A72003L2924J783k1734k6724l1816m8123j3270K8503R50k2502J6171R436
9361I7601n116j462M3294M590q381K775j8707J1688J0037j9117j4343J6322M265
9348A23446j9729J9929j6056k5333K1701L5560k4869l8844J4251K9656J2797L468
9336A35977r619o681j1264j2493K9557J5977k5697n543J8745m558K5945l5163
9324A15183o6402j9729J8493k4770L3021P6556J3731r004j0421j4163j4255p710
$$ plain form
9312 90530 108668 140312 124668 79839 100914 133030 151845 154274 149817 147705 160642 148452
9300 148452 120137 118953 157663 180639 154167 123609 135971 170370 191371 214389 182071 135714
9288 135714 108488 117881 139481 136944 128938 109246 100247 64294 30168 39993 76817 88674 144364
9275 144364 136745 110084 99677 105470 119100 96052 115212 109531 92839 57221 46868 65270
9263 65270 73377 70815 74821 59814 66131 78440 94709 120154 126599 87788 80364 102396 86878
9250 86878 64046 93464 137829 138001 125133 103826 97827 85362 71327 67735 62278 55460 64733
9237 64733 77926 117945 115210 120416 151856 118651 46530 12544 52441 79119 77559 112314
9225 112314 131287 126251 138273 97802 75774 56923 64964 82489 50878 40934 53848 92837
$$ packed form
9312I0530J8138L1644j5644m4829K1075L2116J8815K429m457k112J2937j2190
9300A48452k8315j184L8710K2976k6472l0558J2362L4399K1001K3018l2318m6357
9288A35714k7226R393K1600k537q006j9692q999l5953l4126R825L6824J1857N5690
9275A44364p619k6661j0407N793J3630k3048J9160n681j6692l5618j0353J8402
9263F5270Q107k562M006j5007O317J2309J6269K5445O445l8811p424K2032j5518
9250H6878k2832K9418M4365J72j2868k1307n999j2465j4035l592n457o818R273
9237F4733J3193M0019k735N206L1440l3205p2121l3986L9897K6678j560L4755
9225A12314J8973n036J2022m0471k2028j8851Q041J7525l1611r944J2914L8989
$$ plain form
9213 92837 68472 85373 96213 122179 111338 86268 48576 40668 23531 40931 54937 85769
9201 85769 85856 93019 87643 86895 97069 109158 129548 74488 47082 7076 -48792 -25133 -839
9188 -839 13358 16127 21038 67659 115875 114900 128100 101756 59759 49909 64387 50491 49914 59209
9174 59209 56988 59934 88103 133361 134472 112845 91871 89474 87156 91558 110201 103998 119853
9161 119853 116560 125488 141814 145475 101735 106417 118122 114056 116330 137759 128777 112163 132453
9148 132453 150444 134299 88545 82246 58423 49448 77526 91627 78684 92968 96443 73290
9136 73290 91787 93022 94255 110206 63446 50024 40549 70939 94107 104914 128410 102768
9124 102768 72748 84551 146584 182279 121922 59822 60431 92479 133681 113005 71712 74846
$$ packed form
9213I2837k4365J6901J0840K5966j0841k5070l7692p908j7137J7400J4006L0832
9201H5769Q7P163n376p48J0174J2089K0390n5060k7406m0006n5868K3659K4294
9188h39J4197K769M911M6621M8216r75J3200k6344m1997r850J4478j3896n77R295
9174E9209k221K946K8169M5258J111k1627k0974k397k318M402J8643o203J5855
9161A19853l293Q928J6326L661m3740M682J1705m066K274K1429q982j6614K0290
9148A32453J7991j6145m5754o299k3823q975K8078J4101j2943J4284L475k3153
9136G3290J8497J235J233J5951m6760j3422r475L0390K3168J0807K3496k5642
9124A02768l0020J1803O2033L5695o0357o2100O09L2048M1202k0676m1293L134
$$ plain form
9112 74846 88354 87369 65613 63235 81369 64437 20640 -3355 -962 6712 42870 28479 33116
9099 33116 40109 25112 29737 53813 80271 118696 108295 141457 160706 140137 131234 104535
9087 104535 66576 79673 91738 70024 101759 132770 150181 182390 199827 223845 200701 153252
9075 153252 161645 178702 164795 163843 148566 131931 123256 142400 147482 103314 50358 63617 88725
9062 88725 106638 116908 80698 71541 57569 94270 119257 124485 110274 114708 117288 137416 121946
9049 121946 97452 72171 101294 87280 84438 109859 148102 183264 180250 180651 215495 240604
9037 240604 290721 341384 359733 338424 280713 243273 220546 154950 181845 179625 217431 206285
9025 206285 167065 148946 124732 110123 122061 121738 140145 117879 85139 80662 71915 89957
$$ packed form
9112G4846J3508r85k1756k378J8134j6932m3797k3995K393P674L6158j4391M637
9099C3116O993j4997M625K4076K6458L8425j0401L3162J9249k0569q903k6699
9087A04535l7959J3097J2065k1714L1735L1011J7411L2209J7437K4018k3144m7449
9075A53252Q393J7057j3907r52j5277j6635q675J9144N082m4168n2956J3259K5108
9062H8725J7913J0270l6210r157j3972L6701K4987N228j4211M434K580K0128j5470
9049A21946k4494k5281K9123j4014k842K5421L8243L5162l014M01L4844K5109
9037B40604N0117N0663J8349k1309n7711l7440k2727o5596K6895k220L7806j1146
9025B06285l9220j8119k4214j4609J1938l23J8407k2266l2740m477q747J8042
$$ plain form
9013 89957 141454 122481 133484 194758 240617 224000 200535 197218 166523 159696 180579 208974
9001 208974 190377 200706 249015 297878 352080 391933 423762 473870 522609 522831 479748 443520
8989 443520 441438 408193 423437 388958 353326 326912 292674 245690 227851 215005 167751 143019
8977 143019 114701 103478 101378 118555 144808 142035 130322 155554 165806 183301 154498 143241
8965 143241 146715 125937 139537 165670 176169 167332 151336 187334 238476 242851 237693 235596 295748
8952 295748 335687 318191 312898 317811 356840 421608 471281 514230 535938 583273 566058 520686
8940 520686 449830 423229 438912 434184 389684 361624 340506 319387 343573 319473 298925 251480
8928 251480 193378 117031 114083 122425 130434 149975 159269 157413 145657 149990 136805 108902 103986
$$ packed form
9013H9957N1497j8973J1003O1274M5859j6617k3465l317l0695o827K0883K8395
9001B08974j8597J0329M8309M8863N4202L9853L1829N0108M8739K22m3083l6228
8989D43520k082l3245J5244l4479l5632k6414l4238m6984j7839j2846m7254k4732
8977A43019k8318j1223k100J7177K6253k773j1713K5232J0252J7495k8803j1257
8965A43241L474k0778J3600K6133J0499q837j5996L5998N1142M375n158k097O0152
8952B95748L9939j7496n293M913L9029O4768M9673M2949K1708M7335j7215m5372
8940E20686p0856k6601J5683m728m4500k8060k1118k1119K4186k4100k0548m7445
8928B51480n8102p6347k948Q342Q009J9541R294j856j1756M333j3185k7903m916
$$ plain form
8915 103986 147111 160924 169782 202133 210508 201120 162153 148438 186592 197336 198435 204719 232992
8902 232992 313009 369052 398604 444703 488236 506053 488680 455032 449081 436873 381105 341695
8890 341695 306959 282325 234852 200810 198883 207154 186150 165037 142140 146713 96378 61406
8878 61406 56862 60247 84865 89058 83388 95908 94018 114510 108986 104793 125407 164757 137357
8865 137357 108718 153146 177883 207730 264340 299492 314553 410112 543836 772575 1166530
8854 1166530 1512085 1537066 1249471 943030 768381 643516 549578 459846 343656 294548
8844 294548 263637 242398 214503 202806 198289 177705 143373 109546 59946 72705 101345 81390
8832 81390 103578 80872 55429 69585 103977 100787 76266 60207 35396 63010 86441 84048
$$ packed form
8915A03986M3125J3813Q858L2351Q375r388l8967j3715L8154J0744J099O284K8273
8902B32992Q0017N6043K9552M6099M3533J7817j7373l3648n951j2208n5768l9410
8890C41695l4736k4634m7473l4042j927Q271k1004k1113k2897M573n0335l4972
8878F1406m544L385K4618M193n670J2520j890K0492n524m193K0614L9350k7400
8865A37357k8639M4428K4737K9847N6610L5152J5061R5559J33724K28739L93955
8854A166530L45555K4981k87595l06441j74649j24865r3938q9732j16190m9108
8844B94548l0911k1239k7895j1697m517k0584l4332l3827m9600J2759K8640j9955
8832H1390K2188k2706k5443J4156L4392l190k4521j6059k4811K7614K3431k393
$$ plain form
8820 84048 65364 59821 63677 98636 122729 87611 55875 51774 42393 25520 39625 98577 103650
8807 103650 45553 18997 74576 106042 113391 111741 81988 43472 37223 77557 95731 97755
8795 97755 98819 87353 85194 97925 126448 108497 78017 66457 82317 92756 90819 61286
8783 61286 89137 98945 75758 49343 29234 58168 96495 87543 98326 118446 111517 110368 110050
8770 110050 54683 64505 87212 133188 137026 121276 117917 106058 102359 98819 47448 67575 98015
8757 98015 97391 105338 102377 102415 120959 123153 119394 145665 163343 155418 134952 112844 80941 79317
8743 79317 81376 45535 68407 106618 76615 66077 78840 85799 96532 113900 108126 116983 141524
8730 141524 140143 128194 169628 221070 259782 242140 234422 241231 235041 219889 213225 199854 226534
$$ packed form
8820H4048j8684n543L856L4959K4093l5118l1736m101r381j6873J4105N8952N073
8807A03650n8097k6556N5579L1466P349j650k9753l8516o249M0334J8174K024
8795I7755J064j1466k159J2731K8523j7951l0480j1560J5860J0439j937k9533
8783F1286K7851R808k3187k6415k0109K8934L8327q952J0783K0120o929j149l18
8770A10050n5367R822K2707M5976L838j5750l359j1859l699l540n1371K0127L0440
8757I8015o24P947k961L8J8544K194l759K6271J7678p925k0466k2108l1903j624
8743G9317K059l5841K2872L8211l0003j0538J2763O959J0733J7368n774Q857K4541
8730A41524j381j1949M1434N1442L8712j7642p718O809o190j5152o664j3371K6680
$$ plain form
8717 226534 216211 195146 203840 207534 198761 234478 291111 248425 199007 197672 213768 248895
8705 248895 229188 244684 251900 243342 235178 248763 261031 247277 202339 213396 203214 206040
8693 206040 203025 238969 278959 341270 391689 359374 334917 350966 371193 397270 427014 417663
8681 417663 396659 406438 449602 460450 445898 393265 371082 366270 395460 442825 486102 478271
8669 478271 510155 534547 504106 481233 461520 455309 485907 480543 457631 436950 455924 455131
8657 455131 414181 391806 407679 455768 477285 482231 511822 503662 501230 500673 531523 613543 702411
8644 702411 744167 740080 733536 761533 755621 767872 737720 704277 696409 739638 752687 778984
8632 778984 789680 806456 805740 809892 824962 817976 796229 797050 871688 965791 1049417 1112409 1197765
$$ packed form
8717B26534j0323k1065Q694L694q773L5717N6633m2686m9418j335J6096L5127
8705B48895j9707J5496P216q558q164J3585J2268j3754m4938J1057j0182K826
8693B06040l015L5944L9990O2311N0419l2315k4457J6049K0227K6077K9744r351
8681D17663k1004R779M3164J0848j4552n2633k2183m812K9190M7365M3277p831
8669D78271L1884K4392l0441k2873j9713o211L0598n364k2912k0681J8974p93
8657D55131m0950k2375J5873M8089K1517M946K9591q160k432n57L0850Q2020Q8868
8644G02411M1756m087o544K7997n912J2251l0152l3443p868M3229J3049K6297
8632G78984J0696J6776p16M152J5070o986k1747Q21P4638R4103Q3626O2992Q5356
$$ plain form
8619 1197765 1300628 1411562 1523689 1590547 1698846 1834828 1949899 2014543 2084254 2169468
8609 2169468 2271237 2324115 2378273 2388902 2376692 2357244 2305534 2224811 2166419 2103783 2055020
8598 2055020 1972494 1888903 1766754 1671501 1638603 1617218 1613784 1615780 1634523 1633796 1589062 1554893
8586 1554893 1550361 1493166 1397174 1268873 1103240 987845 910062 852975 813564 745931 725487
8575 725487 667276 600921 557180 529077 513814 502525 477190 455851 405127 402708 326026 274701
8563 274701 273823 283615 282355 258727 249476 261842 264711 258377 252225 241615 237202 255003 274268
8550 274268 277060 265071 246715 244392 225452 196267 125598 110852 166677 171191 140766 158236
8538 158236 181770 174716 162764 172362 131360 132514 163075 189932 199030 197511 208751 204948 172967
$$ packed form
8619A197765J02863J10934J12127O6858J08299J35982J15071O4644O9711Q5214
8609B169468J01769N2878N4158J0629j2210j9448n1710q0723n8392o2636m8763
8598B055020q2526q3591j22149r5253l2898k1385l434J996J8743p27m4734l4169
8586A554893m532n7195r5992j28301j65633j15395p7783n7087l9411o7633k0444
8575G25487n8211o6355m3741k8103j5263j1289k5335k1339n0724k419p6682n1325
8563B74701q78R792j260k3628r251J2366K869o334o152j0610m413J7801J9265
8550B74268K792j1989j8356k323j8940k9185p0669j4746N5825M514l0425J7470
8538A58236K3534p054j1952R598m1002J154L0561K6857R098j519J1240l803l1981
$$ plain form
8525 172967 152799 126504 120627 102200 100500 85878 119716 121299 123833 136194 126770 43338 52507
8512 52507 68585 71772 96685 84392 73518 66905 67921 78840 71798 36042 29879 45782 67756
8499 67756 53851 107582 113043 115952 143789 157357 154686 161913 138435 106116 124717 175655 245582
8486 245582 333622 442521 526009 462790 305539 149488 117212 120266 103036 132196 150575
8475 150575 132691 104340 104279 87742 71960 131694 184604 195642 155526 77845 55481 44084
8463 44084 50842 79271 93704 103094 105679 119718 126521 119114 99219 45810 133329 160471 161236
8450 161236 142318 141864 143328 150453 214611 352836 503816 493136 341356 211489 138555 147426
8438 147426 156725 134384 57738 -7634 14221 66564 140295 172435 196921 172943 157673 186304
$$ packed form
8525A72967k0168k6295n877j8427j700j4622L3838J583K534J2361r424q3432R169
8512E2507J6078L187K4913j2293j0874o613J016J0919p042l5756o163J5903K1974
8499F7756j3905N3731N461K909K7837J3568k671P227k3478l2319J8601N0938O9927
8486B45582Q8040J08899Q3488o3219j57251j56051l2276L054j7230K9160J8379
8475A50575j7884k8351o1j6537j5782N9734N2910J1038m0116p7681k2364j1397
8463D4084O758K8429J4433R390K585J4039O803p407j9895n3409Q7519K7142P65
8450A61236j8918m54J464P125O4158J38225J50980j0680j51780j29867p2934Q871
8438A47426R299k2341p6646o5372K1855N2343P3731L2140K4486k3978j5270K8631
$$ plain form
8426 186304 180268 163582 120850 139596 170430 129496 116959 142080 136366 145172 122479 123897
8414 123897 152413 183021 195861 195601 192648 173555 157760 144171 169772 184551 142818 114872
8402 114872 89709 81667 91960 112097 80618 80202 68751 81576 107709 79350 50412 54970
8390 54970 26713 56394 76956 86874 128351 133247 124309 112393 145936 174306 188580 191413 179406
8377 179406 175302 164054 161639 161891 192286 227850 266896 275018 234680 181510 175709 156595 156776
8364 156776 137177 85552 66013 79246 74682 37791 53200 49908 64726 79025 74454 97521
8352 97521 109993 50869 30125 42641 52388 23173 38251 54736 49922 72450 95695 83848
8340 83848 64565 44153 48604 47362 69975 125903 97989 85410 72637 67273 94275 106513
$$ packed form
8426A86304o036j6686m2732J8746L0834m0934j2537K5121n714Q806k2693J418
8414A23897K8516L0608J2840k60k953j9093j5795j3589K5601J4779m1733k7946
8402A14872k5163q042J0293K0137l1479m16j1451J2825K6133k8359k8938M558
8390E4970k8257K9681K0562R918M1477M896q938j1916L3543K8370J4274K833j2007
8377A79406m104j1248k415K52L0395L5564L9046Q122m0338n3170n801j9114J81
8364A56776j9599n1625j9539J3233m564l6891J5409l292J4818J4299m571K3067
8352I7521J2472n9124k0744J2516R747k9215J5078J6485m814K2528K3245j1847
8340H3848j9283k0412M451j242K2613N5928k7914j2579j2773n364K7002J2238
$$ plain form
8328 106513 123572 103676 122761 138302 145269 142351 94434 83094 91879 125133 131208 130819 112789
8315 112789 63311 7630 -3694 28976 41808 31197 29278 29012 47710 28783 14049 -7876
8303 -7876 12987 31306 61601 37027 35745 37061 31547 3021 15547 44567 39566 34159 7159
8290 7159 42219 69850 62834 96329 135745 120190 84532 45892 26420 63983 75673 68818
8278 68818 76691 52022 52757 48323 73571 78139 74966 48558 27755 51675 73708 61473 66551
8265 66551 53607 32146 13573 11407 55702 69718 109409 137289 122998 99766 82615 76798
8253 76798 79405 27838 62687 76688 76288 78740 66220 60060 55453 53851 48570 15584 54577
8240 54577 108800 123203 87496 53000 54312 46181 28195 36992 43373 51827 71014 85159 69306
$$ packed form
8328A06513J7059j9896J9085J5541O967k918m7917j1340Q785L3254O075l89j8030
8315A12789m9478n5681j1324L2670J2832j0611j919k66J8698j8927j4734k1925
8303g876K0863J8319L0295k4574j282J316n514k8526J2526K9020n001n407k7000
8290G159L5060K7631p016L3495L9416j5555l5658l8640j9472L7563J1690o855
8278F8818P873k4669P35m434K5248M568l173k6408k0803K3920K2033j2235N078
8265F6551j2944k1461j8573k166M4295J4016L9691K7880j4291k3232j7151n817
8253G6798K607n1567L4849J4001m00K452j2520o160m607j602n281l2986L8993
8240E4577N4223J4403l5707l4496J312q131j7986Q797O381Q454J9187J4145j5853
$$ plain form
8227 69306 40510 44906 68492 78598 88439 67590 45809 23557 51 59635 66101 56822 59860
8214 59860 74460 72915 58240 53265 46206 20897 -3880 -26911 -8293 22057 38048 41279 82764
8201 82764 69912 65797 40720 33563 63196 65743 104612 178954 143790 78130 61948 116758
8189 116758 122203 75782 16284 36209 80533 117556 156273 154606 135001 166625 194713 203242
8177 203242 215445 176446 186247 263159 325753 352957 412604 474308 457026 409343 365917 302098
8165 302098 254899 188031 153207 133107 114144 121610 127366 170556 189335 177962 218386 292828
8153 292828 391845 510516 649793 804856 1012384 1302058 1509002 1414061 1137662 832956
8143 832956 619129 484178 396482 337070 305992 288979 291138 269724 272939 264528 227195 195382
$$ packed form
8227F9306k8796M396K3586J0106R841k0849k1781k2252k3506N9584O466r279L038
8214E9860J4600j545j4675m975p059k5309k4777k3031J8618L0350J5991L231M1485
8201H2764j2852m115k5077p157K9633K547L8869P4342l5164o5660j6182N4810
8189A16758N445m6421n9498J9925M4324L7023L8717j667j9605L1624K8088Q529
8177B03242J2203l8999R801P6912O2594K7204N9647O1704j7282m7683m3426o3819
8165C02098m7199o6868l4824k0100j8963P466N756M3190J8779j1373M0424P4442
8153B92828R9017J18671J39277J55063K07528K89674K06944r4941k76399l04706
8143H32956k13827j34951q7696n9412l1078j7013K159k1414L215q411l7333l1813
$$ plain form
8131 195382 243525 275528 314029 416491 543303 638599 766282 849072 842563 733831 569680
8120 569680 442501 370612 349422 326357 262305 255013 279103 273124 286732 298626 351595 505645
8108 505645 680529 889258 1097158 1321411 1500420 1683059 1809381 1761209 1586041 1289639
8098 1289639 997309 734997 573620 479949 445054 402345 383592 392622 364542 366752 339154
8087 339154 301455 278617 280414 314500 332134 350493 349107 395192 455252 461485 442564 467335
8075 467335 414362 316321 285772 277376 262669 216463 243810 246492 230710 228316 231819 191602
8063 191602 224459 307464 352077 388233 420034 513371 646911 716630 748703 758056 758046 698222
8051 698222 609921 549480 498613 441896 427157 415305 456075 502761 552244 636200 720571 761850
$$ packed form
8131A95382M8143L2003L8501J02462J26812R5296J27683Q2790o509j08732j64151
8120E69680j27179p1889k1190k3065o4052p292K4090n979J3608J1894N2969J54050
8108E05645J74884K08729K07900K24253J79009J82639J26322m8172j75168k96402
8098A289639k92330k62312j61377r3671l4895m2709j8753R030k8080K210k7598
8087C39154l7699k2838J797L4086J7634J8359j386M6085O0060O233j8921K4771
8075D67335n2973r8041l0549q396j4707m6206K7347K682j5782k394L503m0217
8063A91602L2857Q3005M4613L6156L1801R3337J33540O9719L2073R353j0n9824
8051F98222q8301o0441n0867n6717j4739j1852M0770M6686M9483Q3956Q4371M1279
$$ plain form
8039 761850 855277 935511 1002394 1020069 997528 954007 926020 945152 994061 1007353 1004297 1046645
8027 1046645 1089765 1062553 988146 885040 811920 747028 715336 727413 768169 753207 755145
8016 755145 712814 679945 721170 740156 724433 717578 692634 718215 720000 699494 768910 828039
8004 828039 874930 1025244 1248248 1499009 1710507 2083880 2659992 3383639 4007354 3966322
7994 3966322 3377809 2737117 2220371 1858508 1618766 1511389 1527565 1685586 2034965 2585402
7984 2585402 3231133 3500231 3027681 2236328 1620513 1243487 1058877 937760 784843 698969
7974 698969 647743 606895 590813 563144 558724 584929 611113 597769 622515 678101 706280 726884
7962 726884 733394 764711 770104 835290 957361 1073444 1284810 1558068 1895845 2281271 2566772
$$ packed form
8039G61850R3427Q0234O6883J7675k2541m3521k7987J9132M8909J3292l056M2348
8027A046645M3120k7212p4407j03106p3120o4892l1692J2077M0756j4962J938
8016G55145m2331l2869M1225J8986j5723o855k4944K5581J785k0506O9416N9129
8004H28039M6891J50314K23004K50761K11498L73373N76112P23647O23715m1032
7994C966322n88513o40692n16746l61863k39742j07377J6176J58021L49379N50437
7984B585402O45731K69098m72550p91353o15815l77026j84610j21117j52917q5874
7974F98969n1226m0848j6082k7669m420K6205K6184j3344K4746N5586K8179K0604
7962G26884O510L1317N393O5186J22071J16083K11366K73258L37777L85426K85501
$$ plain form
7951 2566772 2629314 2563422 2368328 2088254 1811022 1700717 1753456 1942989 2325224 2745781
7941 2745781 2780157 2363755 1870693 1510169 1220673 1006369 806196 634608 540454 513753
7931 513753 476653 404164 325948 298231 271696 269106 305377 273034 255598 260585 263676 199261
7919 199261 184316 222063 267444 312429 352267 407391 498989 672610 845181 924912 878543
7908 878543 767312 714697 676637 603492 494867 423218 441091 451927 471793 430561 354857
7897 354857 314662 258162 178610 131021 71319 55937 70740 80389 93872 68558 45185 29909
7885 29909 10717 22273 9348 16001 15604 -1893 38236 39589 -1655 15794 47140 22813 17856
7872 17856 43507 93290 66785 28690 31218 37588 54204 63270 46478 -11543 -14050 2961 -25351
$$ packed form
7951B566772O2542o5892j95094k80074k77232j10305N2739J89533L82235M20557
7941B745781L4376m16402m93062l60524k89496k14304k00173j71588r4154k6701
7931E13753l7100p2489p8216k7717k6535k590L6271l2343j7436M987L091o4415
7919A99261j4945L7747M5381M4985L9838N5124R1598J73621J72571P9731m6369
7908H78543j11231n2615l8060p3145j08625p1649J7873J0836J9866m1232p5704
7897C54857m0195n6500p9552m7589n9702j5382J4803R649J3483k5314k3373j5276
7885B9909j9192J1556j2925O653l97j7497M0129J353m1244J7449L1346k4327m957
7872A7856K5651M9783k6505l8095K528O370J6616R066j6792n8021k507J7011k8312
$$ plain form
7859 -25351 -51371 -44237 -6360 20225 22338 33493 33561 10662 2171 -12607 -34668 -48865 -16125
7846 -16125 -21132 -33279 -9444 10577 -19946 -36347 -16222 -11127 -37645 -31062 -39276 -49708 -27818
7833 -27818 -15015 -14803 -12149 -34915 -24138 -39817 -73494 -61614 -42945 -68067 -74963 -45406 -15910
7820 -15910 -12826 -16396 28761 61366 52059 30132 26460 10753 -8420 -39135 -48341 -56519 -44346
7807 -44346 -22285 -24442 -23346 -45774 -36501 -8973 -16238 22799 11415 18983 19200 20807 -13574
7794 -13574 -34822 -8852 13714 6140 -14996 -46668 -60388 -47989 -32076 -226 -23192 -37767
7782 -37767 -16695 -2741 17251 16866 35746 56612 33027 212 -7877 -26730 -26612 -38274 -11929
7769 -11929 -11961 -5467 -34902 -43012 -21744 -5086 -39299 -11474 2775 -14420 -32178 -40434 -7172
$$ packed form
7859b5351k6020P134L7877K6585K113J1155O8k2899q491j4778k2061j4197L2740
7846a6125n007j2147K3835K0021l0523j6401K0125N095k6518O583q214j0432K1890
7833b7818J2803K12K654k2766J0777j5679l3677J1880J8669k5122o896K9557K9496
7820a5910L084l570M5157L2605r307k1927l672j5707j9173l0715r206q178J2173
7807d4346K2061k157J096k2428R273K7528p265L9037j1384P568K17J607l4381
7794a3574k1248K5970K2566p574k1136l1672j3720J2399J5913L1850k2966j4575
7782c7767K1072J3954J9992l85J8880K0866k3585l2815q089j8853J18j1662K6345
7769a1929l2O494k9435q110K1268J6658l4213K7825J4249j7195j7758q256L3262
$$ plain form
7756 -7172 1515 -34223 -47023 -55734 -81535 -83916 -95545 -65248 -25089 -24861 -40142 -77215 -71764
7743 -71764 -68103 -27347 8476 -19126 -66442 -45788 -37760 -53703 -42318 -42254 -34289 14155 26439
7730 26439 14769 16942 23425 84010 92911 19336 -37106 -26821 -3243 -27964 -29873 -11378 20480
7717 20480 64459 53983 -25053 -46768 -44087 -48160 -60041 -31203 -25825 3618 10184 -17031 -18840
7704 -18840 2743 -18509 -20269 -21527 -64780 -66383 -27481 -6874 12283 8825 699 -16752 -2605
7691 -2605 -16001 -7823 33425 72698 50011 -1019 22255 69124 86049 64116 51320 45510
7679 45510 9352 -17687 -12879 8539 -23087 -24313 17420 75048 82531 15856 -51621 -50453 -19206
7666 -19206 -19523 -17875 -8060 -33512 -34047 -28120 -23727 -5019 -13203 -42514 -20398 -8092 4429 -15102
$$ packed form
7756g172Q687l5738j2800q711k5801k381j1629L0297M0159K28j5281l7073N451
7743g1764L661M0756L5823k7602m7316K0654Q028j5943J1385O4P965M8444J2284
7730B6439j1670K173O483O0585Q901p3575n6442J0285K3578k4721j909J8495L1858
7717B0480M3979j0476p9036k1715K681m073j1881K8838N378K9443O566k7215j809
7704a8840K1583k1252j760j258m3253j603L8902K0607J9157l458q126j7451J4147
7691b605j3396Q178M1248L9273k2687n1030K3274M6869J6925k1933j2796n810
7679D5510l6158k7039M808K1418l1626j226M1733N7628P483o6675o7477J168L1247
7666a9206l17J648R815k5452n35N927M393J8708q184k9311K2116J2306J2521j9531
$$ plain form
7652 -15102 -28745 -40357 -40891 -44817 -60063 -62467 -68051 -31943 3237 -8025 -19753 -5681 26986
7639 26986 45306 41106 31545 19539 63419 37308 17872 29640 8130 23798 58406 83552
7627 83552 56740 35715 5569 26920 16602 -27210 -11236 17129 -2808 -25513 -48687 -37164
7615 -37164 -52362 -69629 -104616 -86972 -75503 -60214 -12518 -20117 -32015 -51237 -59786 -17684
7603 -17684 -19602 -50823 -45920 -39053 -66265 -46757 -32298 -30856 -21738 -19004 -43631 7019 19536
7590 19536 2624 -10881 -18820 32850 47623 26758 -4561 -32898 1831 -15631 -33357 -14659
7578 -14659 10609 -7742 -30569 -39249 -25657 27827 51350 -4975 -2090 26003 42764 63581
7566 63581 28332 -24181 -33710 -20874 -4839 -11285 -13946 -43602 -52145 -2559 21943 12249 20354
$$ packed form
7652a5102j3643j1612n34l926j5246k404n584L6108L5180j1262j1728J4072L2667
7639B6986J8320m200r561j2006M3880k6111j9436J1768k1510J5668L4608K5146
7627H3552k6812k1025l0146K1351j0318m3812J5974K8365j9937k2705k3174J1523
7615c7164j5198j7267l4987J7644J1469J5289M7696p599j1898j9222q549M2102
7603a7684j918l1221M903O867k7212J9508J4459J442R118K734k4627N0650J2517
7590A9536j6912j3505p939N1670J4773k0865l1319k8337L4729j7462j7726J8698
7578a4659K5268j8351k2827q680J3592N3484K3523n6325K885K8093J6761K0817
7566F3581l5249n2513r529J2836J6035o446k661k9656q543M9586K4502r694Q105
$$ plain form
7553 20354 37198 50826 7512 -31146 -35200 16212 70828 55667 21269 19328 45487 31117
7541 31117 -3113 13415 -690 1681 31291 24239 -7048 -48485 -44786 1723 13273 -15836
7529 -15836 -55725 -39277 -31063 -34611 -14048 -20767 -708 -25304 -32562 -4513 -3397 -5673 -4058
7516 -4058 -18407 -34996 -28757 -28247 -5246 1233 -37772 -28583 -12858 7702 14763 24859 24240 -56
7502 -56 -36327 -43874 -26953 -4690 -2190 627 -32811 -28167 -3109 35092 -11088 -65147 -37110
7489 -37110 31064 32265 -5934 -11869 -20737 -39205 -34167 -23942 -25719 -31736 -25994 -8792 6726
7476 6726 25723 27598 7547 -45317 -77639 -105175 -80449 -54822 -32803 -16348 -67006 -69284
7464 -69284 -12416 17684 -19856 -30805 -27578 -41714 -59185 -19774 -32708 -30817 3942 11123
$$ packed form
7553B0354J6844J3628m3314l8658m054N1412N4616j5161l4398j941K6159j4370
7541C1117l4230J6528j4105K371K9610p052l1287m1437L699M6509J1550k9109
7529a5836l9889J6448Q214l548K0563o719K0059k4596p258K8049J116k276J615
7516d058j4349j6589O239N10K3001O479l9005R189J5725K0560P061J0096o19k4296
7502e6l6271p547J6921K2263K500K817l3438M644K5058L8201m6180n4059K8037
7489c7110O8174J201l8199n935q868j8468N038J0225j777o017N742J7202J5518
7476F726J8997J875k0051n2864l2322k7536K4726K5627K2019J6455n0658k278
7464f9284N6868L0100l7540j0949L227j4136j7471L9411j2934J891L4759P181
$$ plain form
7452 11123 -8272 16031 -2937 -26247 -5486 12250 9540 4457 -4456 -9314 -14144 1849 -14464
7439 -14464 -29207 -39105 -11783 14837 8286 -33929 -57052 -17154 14824 31960 27023 1892
7427 1892 1091 -16220 -7881 2085 3535 19434 28347 -7606 -38952 -36626 16793 8687 9206 -20920
7413 -20920 -44571 -57377 -60778 -43423 -34323 -53049 -51568 -25044 17512 3379 -22826 -30831 -14758
7400 -14758 -28823 -4973 19770 16671 -36688 -57258 -23581 702 54319 77255 37779 -1193
7388 -1193 -10608 -32418 -23205 -50933 -67294 -33224 33386 42773 30055 18077 -8610 -3655 27668
7375 27668 -22117 -19192 25402 78645 63413 47225 14388 -17116 -18802 -56282 -60037 -45246
7363 -45246 -9743 -3587 21437 45287 42563 32759 16054 8019 26402 19018 -2590 24720 37246
$$ packed form
7452A1123j9395K4303j8968k3310K0761J7736k710n083q913m858m830J5993j6313
7439a4464j4743r898K7322K6620o551m2215k3123L9898L1978J7136m937k5131
7427A892q01j7311Q339R966J450J5899Q913l5953l1346K326N3419q106N19l0126
7413b0920k3651j2806l401J7355R100j8726J481K6524M2556j4133k6205q005J6073
7400a4758j4065K3850K4743l099n3359k0570L3677K4283N3617K2936l9476l8972
7388a193r415k1810R213k7728j6361L4070O6610R387j2718j1978k6687M955L1323
7375B7668m9785K925M4594N3243j5232j6188l2837l1504j686l7480l755J4791
7363d5246L5503O156K5024K3850k724r804j6705q035J8383p384k1608K7310J2526
$$ plain form
7350 37246 13290 -16004 -50470 -28819 -22811 -45450 -48990 -57670 -37461 -14462 -28248 31185
7338 31185 34492 -14688 -25713 -6679 -3934 -4800 -10121 -14045 -31138 -38267 -54419 -35279 -38011
7325 -38011 -27510 -39721 -16070 -16550 -18427 -26957 -21361 40920 26381 -4024 5996 -28083 -10164
7312 -10164 -9197 -8636 -27099 -11824 -18717 7372 -4394 -21084 -22429 -43535 -23861 -2492 -17710
7299 -17710 -14769 23644 -9486 -21874 -38298 -69360 -54016 -64475 -71620 -46842 -10049 -8601
7287 -8601 -1348 27787 -10441 -48654 -81286 -75816 -33198 -8783 -6831 1116 -6006 -19763 5722
7274 5722 -27315 -24745 290 -35445 -46484 -33640 -28691 -38353 -31023 -52475 -63162 -56922 -38906
7261 -38906 -20113 -39240 -43577 -28124 -58967 -42893 -45311 -66384 -57539 -64724 -52921 -34924 -54093
$$ packed form
7350C7246k3956k9294l4466K1651O008k2639l540q680K0209K2999j3786N9433
7338C1185L307m9180j1025J9034K745q66n321l924j7093p129j6152J9140k732
7325c8011J0501j2211K3651m80j877q530N596O2281j4539l0405J0020l4079J7919
7312a0164R67N61j8463J5275o893K6089j1766j6690j345k1106J9674K1369j5218
7299a7710K941L8413l3130j2388j6424l1062J5344j0459p145K4778L6793J448
7287h601P253K9135l8228l8213l2632N470M2618K4415J952P947p122j3757K5485
7274E722l3037K570K5035l5735j1039J2844M949r662P330k1452j0687O240J8016
7261c8906J8793j9127m337J5453l0843J6074k418k1073Q845p185J1803J7997j9169
$$ plain form
7248 -54093 -20667 -22504 -551 33671 24899 -10330 -10318 15610 -7339 -18819 -5503 21463 26112
7235 26112 1465 -4560 -13239 -44899 -18222 5227 -3187 -19523 -725 10058 -6930 -42476
7223 -42476 -47597 -43690 -28076 -4476 -21368 -30157 -23731 -12757 7959 -13092 -12892 -22363 -12077
7210 -12077 -28545 -38174 -40292 -34489 -38976 -18723 -21384 -50350 -77610 -48195 -60933 -55985 -42798
7197 -42798 -93234 -87353 -56517 -26339 -13614 3693 -2465 -5421 -14788 -30133 -41954 -39786 6715
7184 6715 45159 3338 -43444 -28997 -42646 -45171 -24289 18997 20857 -13179 -24793 -37303
7172 -37303 -46145 -17299 -12202 10078 28528 39022 41084 7122 -15145 -13194 -1678 14613 -4382
7159 -4382 -19078 -51181 -72064 -70720 -85610 -54318 -29046 -11351 -9298 -27214 -23711 -2144 13307
$$ packed form
7248e4093L3426j837K1953L4222q772l5229J2K5928k2949j1480J3316K6966M649
7235B6112k4647o025q679l1660K6677K3449q414j6336J8798J0783j6988l5546
7223d2476n121L907J5614K3600j6892q789O426J0974K0716k1051K00r471J0286
7210a2077j6468r629k118N803m487K0253k661k8966k7260K9415j2738M948J3187
7197d2798n0436N881L0836L0178J2725J7307o158k956r367j5345j1821K168M6501
7184F715L8444m1821m6782J4447j3649k525K0882M3286J860l4036j1614j2510
7172c7303q842K8846N097K2280J8450J0494K062l3962k2267J951J1516J6291j8995
7159d382j4696l2103k0883J344j4890L1292K5272J7695K053j7916L503K1567J5451
$$ plain form
7146 13307 30096 58136 45409 50526 60429 73262 65100 35176 -27074 -35189 -6726 21601 33057
7133 33057 27929 11903 -26402 -26682 -23737 -3496 -25096 -36173 -83464 -95334 -73882 -77387 -76258
7120 -76258 -76039 -65428 -61798 -38233 -17908 -20709 -19813 -18104 -16905 -38928 -29428 -33996 -44453 -50625
7106 -50625 -60226 -70624 -35541 -17617 -50499 -35055 -8337 -9615 18533 10152 3058 7301 -17838
7093 -17838 -45092 -13698 -10941 11927 9250 -18513 -45758 -49629 -46357 -12650 24845 14181 -23296
7080 -23296 -63424 -90668 -110965 -91717 -47978 -58983 -71212 -43108 -35852 -44960 -32341 -11022
7068 -11022 -32653 -39290 8 7825 -10934 -10746 11447 11103 -6403 -14048 -15826 27523 12680
7055 12680 -25336 -28479 14868 -528 -1691 -2025 -24637 -31331 -18148 -10196 -24166 -30163 -12078
$$ packed form
7146A3307J6789K8040j2727N117R903J2833q162k9924o2250q115K8463K8327J1456
7133C3057n128j6026l8305k80K945K0241k1600j1077m7291j1870K1452l505J129
7120g6258K19J0611L630K3565K0325k801Q96J709J199k2023R500m568j0457o172
7106e0625r601j0398L5083J7924l2882J5444K6718j278K8148q381p094M243k5139
7093a7838k7254L1394K757K2868k677k7763k7245l871L272L3707L7495j0664l7477
7080b3296m0128k7244k0297J9248M3739j1005j2229K8104P256r108J2619K1319
7068a1022k1631o637L9298P817j8759J88K2193l44j7506p645j778M3349j4843
7055A2680l8016l143M3347j5396j163l34k2612o694J3183P952j3970n997J8085
$$ plain form
7042 -12078 177 3331 19218 5289 -6975 -8193 -64031 -88829 -73216 -44649 -19158 -36698
7030 -36698 -100739 -100497 -82044 -30966 -15110 -15764 -25912 -41465 -60878 -102343 -106336 -85959 -64801
7017 -64801 -10722 36564 14749 36714 45562 20628 -24909 -67272 -69761 -42737 3651 7007
7005 7007 -27594 -871 19300 54452 49748 7265 -20431 -29480 -36630 -12582 7428 -22374 -48946
6992 -48946 -83050 -76232 -41211 -39279 -54944 -56700 -29316 -208 36093 15013 -3776 -41722
6980 -41722 -47493 -40578 -4131 5471 25778 16001 2727 28850 10742 -29956 -80897 -46992 -17968
6967 -17968 -22006 -64576 -47513 -58754 -49109 -16748 -19090 -17536 14601 1377 -31182 -61946 -54388
6954 -54388 -52783 -41565 -58829 -52700 -35 27814 12639 1077 16710 47124 23705 -18767
$$ packed form
7042a2078J2255L154J5887j3929j2264j218n5838k4798J5613K8567K5491j7540
7030c6698o4041K42J8453N1078J5856o54j0148j5553j9413m1465l993K0377K1158
7017f4801N4079M7286k1815K1965Q848k4934m5537m2363k489K7024M6388L356
7005G007l4601K6723K0171L5152m704m2483k7696r049p150K4048K0010k9802k6572
6992d8946l4104O818L5021J932j5665j756K7384K9108L6301k1080j8789l7946
6980d1722n771O915L6447R602K0307r777j3274K6123j8108m0698n0941L3905K9024
6967a7968m038m2570J7063j1241R645L2361k342J554L2137j3224l2559l0764P558
6954e4388J605J1218j7264O129N2665K7849j5175j1562J5633L0414k3419m2472
$$ plain form
6942 -18767 -31152 -46810 -59334 -31984 -10992 -28624 -63570 -118752 -63000 -11129 -35929 -73457
6930 -73457 -43034 30256 30731 23855 -30736 -20288 27789 -6331 -20558 -27410 -9736 -36103 -53900
6917 -53900 -30850 -10262 -6993 2538 8626 -21859 -27838 -22910 -21849 33208 53835 27531 25810
6904 25810 -20255 -40913 -52159 -60082 -77792 -86170 -99521 -65685 -30102 -23595 -25957 -48083 -19999
6891 -19999 -13231 -17413 -20166 -24936 13311 20809 -3182 -45444 -96772 -138828 -125580 -79170 -58361
6878 -58361 -69343 -51065 -52046 -43825 -39382 -37814 -50651 -59230 -44776 -53151 -45076 -25800 5340
6865 5340 49694 22918 27588 -9487 -7326 -13219 -7439 13186 36527 1522 -12589 -14537 3218
6852 3218 -14034 -15765 35204 16595 -41652 -50912 -46893 -74466 -68263 -21768 11166 11649 2970
$$ packed form
6942a8767j2385j5658j2524K7350K0992j7632l4946n5182N5752N1871k4800l7528
6930g3457L0423P3290M75o876n4591J0448M8077l4120j4227o852J7674k6367j7797
6917e3900K3050K0588L269R531O088l0485n979M928J061N5057K0627k6304j721
6904B5810m6065k0658j1246p923j7710q378j3351L3836L5583O507k362k2126K8084
6891a9999O768m182k753m770L8247P498k3991m2262n1328m2056J3248M6410K0809
6878e8361j0982J8278r81Q221M443J568j2837q579J4454q375Q075J9276L1140
6865E340M4354k6776M670l7075K161n893N780K0625K3341l5005j4111j948J7755
6852C218j7252j731N0969j8609n8247r260M019k7573O203M6495L2934M83q679
$$ plain form
6839 2970 -12024 -11533 -26981 -41054 -34700 -30166 -22269 15893 -4576 -39015 -39821 -43317 -31905 -36281
6825 -36281 -25857 -23601 -18649 -44996 -18436 -8608 -14826 -28234 -3442 3641 2951 42525 31584
6812 31584 43248 59240 52837 21879 5179 -23212 -36271 -4021 26395 12483 11700 22876
6800 22876 43787 33611 27020 3912 -16947 1288 16514 19013 -19119 -28147 -39135 -60478
6788 -60478 -64440 -46782 -39094 10517 61589 22505 -33502 -55182 -35527 -9315 -40250 -50564
6776 -50564 -43013 -25058 -20011 -24936 -26089 -16316 -15905 -16520 -4101 -2182 -8313 -18077 -41272 -32782
6762 -32782 -12098 -9941 -5750 -27919 -13118 -4254 1483 28220 34998 9374 13961 1163 -18232
6749 -18232 -20818 19508 45880 58181 10133 -14586 -13845 -26952 -22927 -37104 -44542 -49453 -26497
$$ packed form
6839B970j4994M91j5448j4073O354M534P897L8162k0469l4439q06l496J1412m376
6825c6281J0424K256M952k6347K6560R828o218j3408K4792P083o90L9574j0941
6812C1584J1664J5992o403l0958j6700k8391j3059L2250L0416j3912p83J1176
6800B2876K0911j0176o591k3108k0859J8235J5226K499l8132r028j0988k1343
6788f0478l962J7658P688M9611N1072l9084n6007k1680J9655K6212l0935j0314
6776e0564P551J7955N047m925j153R773M11o15J2419J919o131r764k3195Q490
6762c2782K0684K157M191k2169J4801Q864N737K6737O778k5624M587j2798j9395
6749a8232k586M0326K6372J2301m8048k4719P41j3107M025j4177p438m911K2956
$$ plain form
6736 -26497 19234 39709 14596 -18010 -37457 -53847 -7927 10553 -31932 -34067 -15101 -23933
6724 -23933 -32397 -10650 45841 20803 -19855 18550 53238 68981 85774 67438 74500 47684
6712 47684 10580 -238 7424 -1165 -29140 -35149 -32700 -49355 -19183 14289 47947 44882 -836
6699 -836 -25538 -46767 -23170 15225 -14897 -17521 8239 -16707 -19624 -10752 -2142 -32744 -69985
6686 -69985 -74947 -52666 -22908 -5962 -7127 1355 6079 24760 21507 31703 44450 60625 22289
6673 22289 51857 73098 47434 5580 21967 31057 34902 -5694 -42710 -56222 -18350 -12336
6661 -12336 -50124 -47109 -18835 1937 41320 40753 31586 65049 35539 30545 18046 -375 18412
6648 18412 35324 51360 37542 41543 44921 51207 -2918 -18973 -40097 -58205 -2531 12412
$$ packed form
6736b6497M5731K0475k5113l2606j9447j6390M5920J8480m2485k135J8966q832
6724b3933q464K1747N6491k5038m0658L8405L4688J5743J6793j8336P062k6816
6712D7684l7104j0818P662q589k7975o009K449j6655L0172L3472L3658l065m5718
6699h36k4702k1229K3597L8395l0122k624K5760k4946k917Q872Q610l0602l7241
6686f9985m962K2281K9758J6946j165Q482M724J8681l253J0196J2747J6175l8336
6673B2289K9568K1241k5664m1854J6387R090L845m0596l7016j3512L7872O014
6661a2336l7788L015K8274K0772L9383n67r167L3463k9510m994j2499j8421J8787
6648A8412J6912J6036j3818M001L378O286n4125j6055k1124j8108N5674J4943
$$ plain form
6636 12412 -22278 -53318 -15510 4242 2436 30056 16281 -41298 -50529 -26249 -13549 -8872
6624 -8872 -2936 -1882 -14255 -47569 -82982 -73984 -61292 -68382 -103721 -111149 -83889 -81398 -85650
6611 -85650 -63931 -56245 -48237 -32782 -37520 -16921 -56099 -26564 -56288 -57645 -25544 -52580 -83896
6598 -83896 -104906 -94115 -53940 -29958 -84288 -84636 -73210 -27646 -22222 23841 48352 18175
6586 18175 -24786 -49313 -37609 -29269 -29377 -22815 -34844 -44134 -53873 -42898 -35676 -30522 -49955
6573 -49955 -39261 -42249 -19960 -26893 -27829 -63132 -3422 14986 4508 -5909 -29042 -8534 -22263
6560 -22263 -24653 -15477 -36638 -25921 30541 48902 36972 10592 26641 45230 16462 28742
6548 28742 -3207 -23177 -49341 -18932 21155 25687 -793 -21696 -40101 -15340 -33197 -55922
$$ packed form
6636A2412l4690l1040L7808J9752j806K7620j3775n7579r231K4280J2700M677
6624h872N936J054j2373l3314l5413Q998J2692p090l5339p428K7260K491m252
6611h5650K1719P686Q008J5455m738K0599l9178K9535k9724j357L2101k7036l1316
6598h3896k1010J0791M0175K3982n4330l48J1426M5564N424M6063K4511l0177
6586A8175m2961k4527J1704Q340j08O562j2029r290r739J0975P222N154j9433
6573d9955J0694k988K2289o933r36l5303N9710J8408j0478j0417k3133K0508j3729
6560b2263k390R176k1161J0717N6462J8361j1930k6380J6049J8589k8768J2280
6548B8742l1949j9970k6164L0409M0087M532k6480k0903j8405K4761j7857k2725
$$ plain form
6536 -55922 -30055 -33500 -42809 -42088 -8450 -5073 37179 29876 -9668 10560 -8640 -40077 -24955
6523 -24955 -20901 -22270 -36410 -35064 -23996 -49617 -43113 -17890 -12156 21638 8856 11317 27231
6510 27231 -31070 -61296 5276 46739 31466 56692 74583 12253 14518 3826 931 11512
6498 11512 31349 11384 3965 -6006 -12290 -37182 -47208 -46466 -41350 -68160 -26327 -24945 -36522
6485 -36522 -6153 18640 17408 7221 7539 19357 15099 13470 43288 41168 14477 7849 -3307
6472 -3307 -50918 -44655 -3947 -6839 -35306 -25203 1570 5761 5192 9676 -17799 -24105 -9714
6459 -9714 -37105 -80309 -60543 -40415 -36438 -56077 -63931 -55475 -45138 -9380 9232 1163 -2697
6446 -2697 -57880 -71062 -71642 -98499 -62860 8636 22872 11670 1634 13544 29280 3379
$$ packed form
6536e5922K5867l445r309P21L3638L377M2252p303l9544K0228j9200l1437J5122
6523b4955M054j369j4140J346J1068k5621O504K5223N734L3794j2782K461J5914
6510B7231n8301l0226O6572M1463j5273K5226J7891o2330K265j0692k895J0581
6498A1512J9837j9965p419r971o284k4892j0026P42N116k6810M1833J382j1577
6485c6522L0369K4793j232j0187L18J1818m258j629K9818k120k6691o628j1156
6472c307m7611O263M0708k892k8467J0103K6773M191n69M484k7475o306J4391
6459i714k7391m3204J9766K0128L977j9639p854Q456J0337L5758J8612q069l860
6446b697n5183j3182n80k6857L5639P1496J4236j1202j0036J1910J5736k5901
$$ plain form
6434 3379 -14369 32353 31315 -28162 -40929 -46760 -60211 -20254 -14382 14853 30217 18975 4613
6421 4613 13703 40429 51297 3329 -4017 24663 1167 9182 45574 78396 54720 42593 12080
6408 12080 12499 47753 82743 69704 32354 6847 -20734 -68167 -29098 -12328 -22626 -34380
6396 -34380 -13747 -965 -12541 -13545 9543 3169 -2768 5825 -22842 -57064 -65113 -7316 -4205
6383 -4205 10879 28155 27367 22308 -38 -36189 -25565 -4454 -38645 -23189 -2348 -40580 -83016
6370 -83016 -83695 -58468 -91155 -104903 -62322 -58251 -79657 -86548 -31599 5216 -11058 -30183 -83565
6357 -83565 -57136 -47338 -71889 -74356 -95638 -112384 -77168 -21756 -12660 -12376 -9069 -22598 -22619 -26566
6343 -26566 -18571 -40662 -23670 -41765 -6492 -25682 -59707 -54841 -76041 -79506 -39162 -1540
$$ packed form
6434C379j7748M6722j038n9477j2767n831j3451L9957N872K9235J5364j1242j4362
6421D613R090K6726J0868m7968p346K8680k3496Q015L6392L2822k3676j2127l0513
6408A2080M19L5254L4990j3039l7350k5507k7581m7433L9069J6770j0298j1754
6396c4380K0633J2782j1576j004K3088o374n937Q593k8667l4222q049N7797L111
6383d205J5084J7276p88n059k2346l6151J0624K1111l4191J5456K0841l8232m2436
6370h3016o79K5227l2687j3748M2581M071k1406o891N4949L6815j6274j9125n3382
6357h3565K6429R798k4551k467k1282j6746L5216N5412R096K84L307j3529k1l947
6343b6566P995k2091J6992j8095L5273j9190l4025M866k1200l465M0344L7622
$$ plain form
6331 -1540 23395 49288 54634 72423 63864 71400 53329 35823 26107 37830 47854 40590 8184
6318 8184 -26865 -39987 -37528 -33284 -51432 -57585 -36932 -29823 -21384 -40146 -33108 -38805 -23509
6305 -23509 -33075 -35541 -18244 -36125 -67209 -81862 -15419 50112 57170 24276 19400 -5446 -375
6292 -375 -1736 -26147 -65645 -74841 -53927 4486 30285 -7051 -36295 -19830 17286 20627 8169
6279 8169 2187 -13336 -44404 -61764 -18753 8569 25669 22796 57092 26434 -817 8181 25463
6266 25463 18217 -17701 -13720 -21443 -2853 4875 -1163 -16342 -14171 -15150 -22629 -34462 -15965 -43524
6252 -43524 -51970 -29407 -12822 -18211 15713 28623 31832 5150 -20822 -56806 -74018 -66813 -36448
6239 -36448 -32109 -54160 -18914 111 44529 40519 -19793 -9634 -1381 30420 56937 63694 40809
$$ packed form
6331a540K4935K5893N346J7789q559P536j8071j7506r716J1723J0024p264l2406
6318H184l5049j3122K459M244j8148o153K0653P109Q439j8762P038n697J5296
6305b3509r566k466J7297j7881l1084j4653O6443O5531P058l2894m876k4846N071
6292c75j361k4411l9498r196K0914N8413K5799l7336k9244J6465L7116L341j2458
6279H169n982j5523l1068j7360M3011K7322J7100k873L4296l0658k7251Q998J7282
6266B5463p246l5918L981p723J8590P728o038j5179K171r79p479j1833J8497k7559
6252d3524q446K2563J6585n389L3924J2910L209k6682k5972l5984j7212P205L0365
6239c6448M339k2051L5246J9025M4418m010o0312J0159Q253L1801K6517O757k2885
$$ plain form
6226 40809 59292 75298 77686 36811 32318 22603 17504 10852 40972 74053 87406 51081 19291
6213 19291 -7534 -40646 -39083 -33724 -55479 -38003 -46560 -50821 -32848 2367 17675 19308 -2438
6200 -2438 -5385 19153 34560 32581 12702 -9376 4667 -15056 -24389 -23347 -56879 -60152 -79509
6187 -79509 -66274 -61943 -44823 -18010 16774 39481 49153 -21987 -31936 -43521 -47382 -48079 -47222
6174 -47222 -65952 -97408 -85724 -58063 -40893 -35013 -42900 -32718 -32424 -46957 -26490 13302 43414
6161 43414 21859 14581 34445 41137 11254 -15397 -5495 39716 75383 68559 24883 11431 -28677
6148 -28677 -82470 -38840 5602 1998 21095 25464 11911 -25721 -8459 29068 37440 33960 50516
6135 50516 51628 13957 328 -9383 -7518 712 -5577 -33418 -61167 -51020 -20547 11055 41309
$$ packed form
6226D0809J8483J6006K388m0875m493r715n099o652L0120L3081J3353l6325l1790
6213A9291k6825l3112J563N359k1755J7476q557m261J7973L5215J5308J633k1746
6200b438k947K4538J5407j979j9879k2078J4043j9723r333J042l3532l273j9357
6187g9509J3235M331J7120K6813L4784K2707R672p1140r949j1585l861o97Q57
6174d7222j8730l1456J1684K7661J7170N880p887J0182K94j4533K0467L9792L0112
6161D3414k1555p278J9864O692k9883k6651R902M5211L5667o824m3676j3452m0108
6148b8677n3793M3630M4442l604J9097M369j3553l7632J7262L7527Q372l480J6556
6135E0516J112l7671j3629r711J865Q230o289k7841k7749J0147L0473L1602L0254
$$ plain form
6122 41309 14629 3291 23316 -22628 -28197 -14703 -17769 -36005 -49592 -41598 -6384 13518
6110 13518 21415 42964 18471 -27688 -31569 -22733 -40031 -36008 -20570 -12171 -50160 -54409 -29199
6097 -29199 -31988 -19565 -15731 -22059 -5422 -15699 8863 20469 -1346 -18795 -18445 -13066 5666
6084 5666 -8059 -45412 -58391 -60676 -34002 -10373 -26308 -42170 15618 25434 33292 37472 32652
6071 32652 -26352 -30616 -39774 -17058 -10359 218 -30701 -25415 -10382 -30678 -31948 -23806 114
6058 114 -190 -53622 -92400 -102612 -93585 -48182 -26697 -23647 -13547 4623 -12465 -9803 35480
6045 35480 27928 46812 27958 16739 -7005 2170 58387 100752 74171 29847 12369 13770
6033 13770 -23703 -14775 -27133 -5590 28384 11984 -2384 15502 2802 16596 33889 23679
$$ packed form
6122D1309k6680j1338K0025m5944n569J3494l066j8236j3587P994L5214J9902
6110A3518P897K1549k4493m6159l881Q836j7298M023J5438Q399l7989m249K5210
6097b9199k789J2423L834o328J6637j0277K4562J1606k1815j7449L50N379J8732
6084E666j3725l7353j2979k285K6674K3629j5935j5862N7788R816P858M180m820
6071C2652n9004m264r158K2716O699J0577l0919N286J5033k0296j270Q142K3920
6058A14l04n3432l8778j0212R027M5403K1485L050J0100J8170j7088K662M5283
6045C5480p552J8884j8854j1219k3744R175N6217M2365k6581m4324j7478J401
6033A3770l7473Q928j2358K1543L3974j6400j4368J7886j2700J3794J7293j0210
$$ plain form
6021 23679 -21669 8619 13120 2301 29180 30699 -18074 -47734 -23468 -306 15667 55664
6009 55664 36459 -19645 -64749 -39579 -13149 48021 44686 29119 13468 -29517 -60200 -21140
5997 -21140 4991 -32904 -63393 -43345 -7700 18245 15374 6811 -15157 86 49236 52836
5985 52836 37188 43291 8635 -16901 -22246 -40573 -82488 -92739 -51417 -32324 -45699 -48188
5973 -48188 -60936 -59862 -36548 -11846 -47647 -10070 31737 27081 18267 19284 -5021 -3540 -13
5960 -13 -33454 -57398 -71742 -69684 -51308 -41292 -30071 -43885 -21472 24931 48002 58125 41979
5947 41979 21761 9298 32219 72803 68244 25485 -6943 -11269 -31485 -4211 37154 39592
5935 39592 13778 -3265 -989 -28241 -58345 -46520 -47828 -57049 -33291 -10806 4770 -29116
$$ packed form
6021B3679m5348L0288M501j0819K6879J519m8773k9660K4266K3162J5973L9997
6009E5664j9205n6104m5104K5170K6430O1170l335j5567j5651m2985l0683L9060
5997b1140K6131l7895l0489K0048L5645K5945k871q563k1968J5243M9150L600
5985E2836j5648O103l4656k5536n345j8327m1915j0251M1322J9093j3375k489
5973d8188j2748J074K3314K4702l5801L7577M1807m656q814J017k4305J481L527
5960a3l3441k3944j4344K058J8376J0016J1221j3814K2413M6403K3071J0123j6146
5947D1979k0218j2463K2921M0584m559m2759l2428m326k0216K7274M1365K438
5935C9592k5814j7043K276k7252l0104J1825j308r221K3758K2485J5576l3886
$$ plain form
5923 -29116 -23378 -10036 -36283 -58934 -32136 26477 27869 50716 38111 10696 31799 20003
5911 20003 2220 123 -6708 37067 54473 14229 -38140 -37560 -19698 -1405 715 4779 26963
5898 26963 24950 3371 -19298 -51541 -76261 -94994 -68587 -485 16339 -6150 -10376 13583
5886 13583 -10650 -25744 -902 8351 -56939 -82856 -57386 6298 17279 6276 -42203 -61712
5874 -61712 -26851 -35664 -57128 -51520 -59333 -73205 -90616 -83267 -68384 -62776 -31723 -19084 48080
5861 48080 89372 103296 90272 120767 97910 45318 15892 8826 4236 -14884 -8240 23455
5849 23455 20796 19119 13994 1676 -20289 -41748 -18150 -5959 -19533 10171 -2448 -37938
5837 -37938 -18235 -11556 -18259 -3432 -6918 -18709 -11469 -11215 -10871 -25350 -16961 -2802 14072 27329
$$ packed form
5923b9116N738J3342k6247k2651K6798N8613J392K2847j2605k7415K1103j1796
5911B0003j7783k097o831M3775J7406m0244n2369N80J7862J8293K120M064K2184
5898B6963k013k1579k2669l2243k4720j8733K6407O8102J6824k2489m226K3959
5886A3583k4233j5094K4842R253o5290k5917K5470O3684J0981j1003m8479j9509
5874f1712L4861q813k1464N608p813j3872j7411P349J4883N608L1053J2639O7164
5861D8080M1292J3924j3024L0495k2857n2592k9426p066m590j9120O644L1695
5849B3455k659j677n125j2318k1965k1459K3598J2191j3574K9704j2619l5490
5837c7938J9703O679o703J4827l486j1791P240K54L44j4479Q389J4159J6874J3257
$$ plain form
5823 27329 -7610 843 5883 5416 -5672 -4405 -20373 -50032 -37131 -704 -7545 -34225 -26638
5810 -26638 4718 21156 13483 15530 -24133 -8782 -14930 -59034 -53055 -61402 -64664 -13873 -12812
5797 -12812 -33019 -23525 -34583 -79031 -50174 -21017 -7922 -40305 -27411 -35938 -33201 -46589
5785 -46589 -69361 -68642 -40605 -48621 -59591 -78104 -108142 -105184 -78058 -52374 -59849 -40845 -34470
5772 -34470 -18314 -43118 -41372 -4067 -11524 -39967 -66906 -73437 -53104 -45755 -50254 -18227 4393
5759 4393 5997 -7155 -12763 5922 9609 38271 16996 -7472 -33318 -20869 -2212 14418 -26277
5746 -26277 -82280 -91519 -83293 -45289 -55932 -68825 -68369 -61938 -58810 -70372 -60161 -8447 9790
5733 9790 -45981 -14502 53036 65685 48525 18799 -3361 -4498 -22416 -22968 -1705 22063 -1921
$$ packed form
5823B7329l4939Q453N040m67j1088J267j5968k9659J2901L6427o841k6680P587
5810b6638L1356J6438p673K047l9663J5351o148m4104N979q347l262N0791J061
5797a2812k0207R494j1058m4448K8857K9157J3095l2383J2894q527K737j3388
5785d6589k2772P19K8037q016j0970j8513l0038K958K7126K5684p475J9004O375
5772c4470J6156k4804J746L7305p457k8443k6939o531K0333P349m499L2027K2620
5759D393J604j3152n608J8685L687K8662k1275k4468k5846J2449J8657J6630m0695
5746b6277n6003r239Q226L8004j0643j2893M56O431L128j1562J0211N1714J8237
5733I790n5771L1479O7538J2649j7160k9726k2160j137j7918n52K1263K3768k3984
$$ [...]
##END NTUPLES=NMR SPECTRUM
##END=
