##TITLE=Analysis number 326088
Compound Code cc 59404
Book Reference 494/108
Project Code adrs
Chemist Name craigr
##JCAMPDX= 6.0         $$ Bruker NMR JCAMP-DX V2.0
##DATA TYPE= NMR SPECTRUM
##DATA CLASS= NTUPLES
##ORIGIN= Bruker BioSpin GmbH
##OWNER= nmr
$$ XWIN-NMR		Version 3.5
$$ Wed Jan 24 12:54:18 2007 GMT Standard Time (UT+0h)  MAYBRIDGE\nmr@NMR_250MHZ
##.OBSERVE FREQUENCY= 250.131544655141
##.OBSERVE NUCLEUS= ^1H
##.ACQUISITION MODE= SIMULTANEOUS (DQD)
##.ACQUISITION SCHEME= undefined
##.AVERAGES= 16
##.DIGITISER RES= 18
##SPECTROMETER/DATA SYSTEM= dpx250
##.PULSE SEQUENCE= zg30
##.SOLVENT NAME= CDCl3
##.SHIFT REFERENCE= (INTERNAL, CDCl3, 0, 16.522)
##AUDIT TRAIL= $$ (NUMBER, WHEN, WHO, WHERE, WHAT)
$$ ##TITLE= Audit trail, XWIN-NMR		Version 3.5
$$ ##JCAMPDX= 5.01
$$ ##ORIGIN= Bruker BioSpin GmbH
$$ ##OWNER= nmr
$$ C:\u/data/dgb/nmr/ADRS/1710/pdata/1/auditp.txt
$$ ##AUDIT TRAIL=  $$ (NUMBER, WHEN, WHO, WHERE, WHAT)
(   1,<2007-01-24 12:53:57.17 +000>,<MAYBRIDGE\nmr>,<NMR_250MHZ>,
      <created by zg, POWCHK disabled, PULCHK disabled
       configuration hash MD5:
       49 4B E0 1D 92 C2 6B 37 9F E6 65 BC 52 41 86 1D
       data hash MD5: 64K
       A8 D0 6B 28 D9 79 B3 E3 B9 BB 0B 9D 54 1C 00 70>)
(   2,<2007-01-24 12:54:09.65 +000>,<MAYBRIDGE\nmr>,<NMR_250MHZ>,
      <Start of raw data processing
       ef LB = 0.3 FT_mod = 6 PKNL = 1 SI = 32K 
       data hash MD5: 32K
       23 EE 6D 0B E9 C1 7A CC 69 95 79 EB CC 7A C2 1C>)
(   3,<2007-01-24 12:54:11.26 +000>,<MAYBRIDGE\nmr>,<NMR_250MHZ>,
      <apk 
       data hash MD5: 32K
       74 27 54 F5 C7 10 26 CD 5D 8B 74 05 A6 5B 8D FE>)
(   4,<2007-01-24 12:54:11.95 +000>,<MAYBRIDGE\nmr>,<NMR_250MHZ>,
      <abs ABSG = 5 
       data hash MD5: 32K
       5A E9 FE 98 0B D1 5E FB 27 51 BC BA E3 F5 CC DC>)
$$ ##END=
$$ 
$$ hash MD5
$$ FB E7 F4 9F 87 74 20 3D 51 B0 29 23 E3 81 1A 5B
##$RELAX= 
##$RELAX= 
##$RELAX= 
##$RELAX= 
##$RELAX= 
##$RELAX= 
##$RELAX= 
$$ Bruker specific parameters
$$ --------------------------
##$DU= <C:\u>
##$EXPNO= 1710
##$NAME= <ADRS>
##$PROCNO= 1
##$TYPE= <nmr>
##$USER= <dgb>
##$AMP= (0..31)
100 100 100 100 100 100 100 100 100 100 100 100 100 100 100 100 100 100 
100 100 100 100 100 100 100 100 100 100 100 100 100 100 
##$AQSEQ= 0
##$AQ_mod= 3
##$AUNM= <au_zg>
##$AUTOPOS= <22 >
##$BF1= 250.13
##$BF2= 250.13
##$BF3= 250.13
##$BF4= 250.13
##$BF5= 500.13
##$BF6= 500.13
##$BF7= 500.13
##$BF8= 500.13
##$BYTORDA= 1
##$CFDGTYP= 0
##$CFRGTYP= 5
##$CHEMSTR= <none>
##$CNST= (0..31)
1 1 145 1 1 1 1 1 1 1 1 1 1 1 1 1 1 1 1 1 1 1 1 1 1 1 1 1 1 1 1 1 
##$CPDPRG= <>
##$CPDPRG1= <>
##$CPDPRG2= <>
##$CPDPRG3= <>
##$CPDPRG4= <mlev>
##$CPDPRG5= <mlev>
##$CPDPRG6= <mlev>
##$CPDPRG7= <mlev>
##$CPDPRG8= <mlev>
##$CPDPRGB= <>
##$CPDPRGT= <>
##$D= (0..31)
0 1 0 0 0 0 0 0 0 0.06 0 0 0 0 0 0 0.0002 0 0 0 0 0 0 0 0 0 0 0 0 0 0 
0 
##$DATE= 1169643236
##$DBL= (0..7)
120 120 120 120 120 120 120 120 
##$DBP= (0..7)
150 150 150 150 150 150 150 150 
##$DBP07= 0
##$DBPNAM0= <>
##$DBPNAM1= <>
$$ [...]
##$SUBNAM7= <"">
##$SUBNAM8= <"">
##$SUBNAM9= <"">
##$SW= 20.6930455092707
##$SWIBOX= (0..15)
0 0 3 0 0 0 0 0 0 0 0 0 0 0 0 0 
##$SW_h= 5175.983436853
##$TD= 65536
##$TD0= 1
##$TE= 294.16
##$TE2= 300
##$TE3= 300
##$TEG= 300
##$TL= (0..7)
0 120 120 120 120 120 120 120 
##$TP= (0..7)
150 150 150 150 150 150 150 150 
##$TP07= 0
##$TPNAME0= <>
##$TPNAME1= <>
##$TPNAME2= <>
##$TPNAME3= <>
##$TPNAME4= <>
##$TPNAME5= <>
##$TPNAME6= <>
##$TPNAME7= <>
##$TPOAL= (0..7)
0.5 0.5 0.5 0.5 0.5 0.5 0.5 0.5 
##$TPOFFS= (0..7)
0 0 0 0 0 0 0 0 
##$TUNHIN= 0
##$TUNHOUT= 0
##$TUNXOUT= 0
##$USERA1= <user>
##$USERA2= <user>
##$USERA3= <user>
##$USERA4= <user>
##$USERA5= <user>
##$V9= 5
##$VALIST= <valist>
##$VCLIST= <CCCCCCCCCCCCCCC>
##$VD= 0
##$VDLIST= <DDDDDDDDDDDDDDD>
##$VPLIST= <PPPPPPPPPPPPPPP>
##$VTLIST= <TTTTTTTTTTTTTTT>
##$WBST= 1024
##$WBSW= 4
##$XGAIN= (0..3)
0 0 0 0 
##$XL= 0
##$YL= 0
##$YMAX_a= 405702
##$YMIN_a= -391720
##$ZGOPTNS= <>
##$ZL1= 120
##$ZL2= 120
##$ZL3= 120
##$ZL4= 120
##$ABSF1= 16.522
##$ABSF2= -4.171173
##$ABSG= 5
##$ABSL= 3
##$ALPHA= 0
##$AQORDER= 0
##$ASSFAC= 0
##$ASSFACI= 0
##$ASSFACX= 0
##$ASSWID= 0
##$AUNMP= <proc_1d>
##$AZFE= 0.1
##$AZFW= 0.1
##$BCFW= 0
##$BC_mod= 0
##$BYTORDP= 0
##$COROFFS= 0
##$CY= 12.5
##$DATMOD= 1
##$DC= 0
##$DFILT= <>
##$DTYPP= 0
##$F1P= 14.0000005364418
##$F2P= -0.99999901652339
##$FCOR= 0.5
##$FTSIZE= 32768
##$FT_mod= 6
##$GAMMA= 0
##$GB= 0
##$INTBC= 1
##$INTSCL= 1
##$ISEN= 128
##$LB= 0.3
##$LEV0= 0
##$LPBIN= 0
##$MAXI= 10000
##$MC2= 0
##$MEAN= 0
##$ME_mod= 0
##$MI= 0
##$NCOEF= 0
##$NC_proc= -2
##$NLEV= 6
##$NOISF1= 0
##$NOISF2= 0
##$NSP= 0
##$NTH_PI= 0
##$NZP= 0
##$OFFSET= 16.522
##$PC= 1
##$PHC0= 230.0123
##$PHC1= 6.106421
##$PH_mod= 1
##$PKNL= yes
##$PPARMOD= 0
##$PSCAL= 4
##$PSIGN= 0
##$REVERSE= no
##$SF= 250.13
##$SI= 32768
##$SIGF1= 0
##$SIGF2= 0
##$SINO= 400
##$SIOLD= 32768
##$SREGLST= <1H.CDCl3>
##$SSB= 0
##$STSI= 32768
##$STSR= 0
##$SW_p= 5175.98343685301
##$SYMM= 0
##$S_DEV= 0
##$TDeff= 65536
##$TDoff= 0
##$TI= <Analysis number 999999
Compound Code 99
Book Reference 9
Project Code 9>
##$TILT= no
##$TM1= 0
##$TM2= 0
##$TOPLEV= 0
##$USERP1= <user>
##$USERP2= <user>
##$USERP3= <user>
##$USERP4= <user>
##$USERP5= <user>
##$WDW= 1
##$XDIM= 32768
##$YMAX_p= 353637338
##$YMIN_p= -32615
$$ End of Bruker specific parameters
$$ ---------------------------------
##NTUPLES= NMR SPECTRUM
##VAR_NAME=  FREQUENCY,     SPECTRUM/REAL,   SPECTRUM/IMAG
##SYMBOL=    X,             R,               I
##VAR_TYPE=  INDEPENDENT,   DEPENDENT,       DEPENDENT
##VAR_FORM=  AFFN,          ASDF,            ASDF
##VAR_DIM=   32768,         32768,           32768
##UNITS=     HZ,            ARBITRARY UNITS, ARBITRARY UNITS
##FACTOR=    0.157963299565203, 1,           1
##FIRST=     4132.6476996994, 0,             0
##LAST=      -1043.33573715361, 0,           0
##MIN=       -1043.33573715361, -32615,      0
##MAX=       4132.6476996994, 353637338,     0
$$ Real data points
##PAGE= N=1
##DATA TABLE= (X++(R..R)), XYDATA
$$ [...]
21365 -10853 -8830 -8483 -6723 -9181 -11388 -6172 -8826 -4622 -137 -865 -3694 -6730 -4633 -3189 -4967
21350 -4967 -8717 -8535 -1984 8431 11783 9400 4158 3879 7038 7142 7787 4294 -473 -1282 -6616 -10662
21334 -10662 -11381 -14404 -12349 -8009 -4131 -3315 -5334 -9047 -14100 -13979 -8664 -3812 -1045 -3515 422
21319 422 3241 2084 -2124 3081 -5348 -8646 -7392 -2920 -750 -1661 -3332 -5536 -6303 -10699 -9073
21304 -9073 -3949 2892 4885 2002 3852 5891 -1311 -927 -1065 -8360 -12770 -12724 -15705 -12433 -8250 -10425
21288 -10425 -8865 -555 2466 -1742 -6528 -5572 -3867 -2900 -5833 -2910 951 -2878 -1362 -1211 -8081
21273 -8081 -8951 -8786 -14154 -14571 -5290 1079 -7714 -12285 -6667 738 1388 3252 3868 3524 -4338 -10001
21257 -10001 -7575 -13139 -9209 -6871 -2629 -3084 -10566 -16517 -11604 -11425 -15636 -11669 -8755 -4352 -1738
21242 -1738 4219 1719 -6729 -9504 -7419 -5444 -4150 -3395 -1496 -7987 -10978 -9411 -2405 2634 8043
21227 8043 12199 9007 3629 8109 9712 4437 -478 -5885 -5623 -7413 -3396 -6650 -13869 -10420 -6088
21212 -6088 -4149 -2597 -4619 -2849 -7348 -6619 -5540 -11148 -11224 -10077 -8506 -9370 -14811 -14230 -17625 -12203
21196 -12203 -4157 2187 3545 2166 466 1351 -2951 -3759 -3912 -1726 -2457 -5081 -8024 -4382 -1382
21181 -1382 -7159 -10947 -5038 -3045 -5887 -3399 5177 -439 -1457 1929 8699 8457 2473 -4709 -10667
21166 -10667 -16113 -12685 -6798 -8789 -10775 -13937 -16229 -12360 -7780 -2910 -6773 -7503 -4490 -2764 -3057
21151 -3057 -3309 -974 -2098 -3293 -5812 -12353 -11174 -4997 -3471 -7341 -8396 -6549 4648 3764 250
21136 250 -1880 1466 4918 4306 -830 3912 10262 11528 -4168 -14260 -10511 -3852 -3688 -3237 -4557
21121 -4557 -6790 -4840 -5064 -12085 -10065 -5050 -476 6105 11337 4680 -3535 -3730 -3838 -6738 -3082
21106 -3082 -4204 -4897 -1950 -2491 -4688 -5619 -2641 2278 -575 -8877 -9138 -9617 -5412 -2838 2841 3964
21090 3964 1071 -1281 -11206 -6500 -7616 -13853 -17835 -9868 -4272 -3398 -3800 -6117 -1831 -990 3710
21075 3710 6861 4348 429 -4132 -5562 -8068 -7589 -5177 -3841 -3855 -1022 6681 13456 10281 -83
21060 -83 -6763 -6072 -7560 -7504 -4395 624 9248 14001 7319 -1208 1919 6527 1085 -3911 -5261 -6193
21044 -6193 -4684 -7940 -9662 -4750 -8262 -9822 -8287 -3043 2784 -21 -1628 628 1880 1661 -1695
21029 -1695 -341 4244 8837 1845 -20 -5936 -10910 -11264 -11074 -8992 -2068 -4126 -782 -286 -4349
21014 -4349 -388 4825 6823 2722 -8541 -11421 -8877 -657 4707 4324 8909 1598 -4684 -6915 -4309
20999 -4309 -2307 -4843 -3057 -1421 2632 2719 -1262 -623 2137 -5287 -7647 -10462 -12171 -8739 -10285
20984 -10285 -5935 1959 11679 11175 20168 21058 14958 10568 3930 -2055 1043 -602 1140 -2571 -12373
20969 -12373 -13955 -12773 -13075 -9207 -9370 -3073 -358 -511 371 -1380 -366 -4791 -3788 6920 4865
20954 4865 -438 691 101 -3742 -8011 -7756 -5746 -1164 -686 -4427 -5744 -8372 -16087 -17333 -14381
20939 -14381 -8656 1241 1691 6447 10728 11331 4347 -8583 -13582 -10694 -7724 -12731 -10533 -2776 -2419
20924 -2419 -9209 -11149 -10077 -10754 -11866 -11051 -7198 -2223 229 -1956 509 3215 5563 6432 4960
20909 4960 2401 4107 9828 4273 113 5363 4005 -724 -3424 -2592 -5810 -8388 -4721 -9697 -17097
20894 -17097 -19071 -14984 -7976 -3928 -5973 -7264 -4017 -3802 -2391 -4163 -6507 -8615 -3750 -6956 -17910
20879 -17910 -13834 -6122 -8927 -8976 -12142 -7226 -3005 -7671 1894 6718 727 -4227 -4814 -1961 -570
20864 -570 4901 1511 -6994 -8099 -7189 -2950 -2077 -5551 -6904 -1027 -3894 -12175 -12080 -8563 517 6980
20848 6980 -1622 -9970 -9927 -9026 -6949 -3913 -2695 -1277 -5192 -3347 938 4 -5828 -11496 -10923 -14283
20832 -14283 -11348 -8914 -11365 -18841 -19785 -18426 -16177 -11301 -6331 -5580 -7057 -5987 -8192 -12188 -13534
20817 -13534 -11953 -3439 -971 -5035 -5812 2064 -892 1371 4601 5275 -6910 -12182 -14106 -8141 -3133
20802 -3133 -5686 -1841 -1782 1188 -3330 -8038 -11867 -16541 -15651 -7833 -212 584 3507 2390 3685 2708
20786 2708 -2831 -3003 3700 5528 8165 2519 -1472 -2822 -2572 -476 2045 -1317 -2977 -3241 -2116
20771 -2116 1163 -1955 -9 -4557 -11530 -12784 -14788 -13104 -8544 -10791 -11790 -8180 -9172 -6922 -3742
20756 -3742 1015 -3293 -11357 -10514 -5814 -2732 -6248 -2004 -498 2687 10298 7869 452 176 -2258
20741 -2258 113 5447 597 -6780 -9083 -10103 -12414 -14193 -11767 -8053 -877 -4148 -11788 -17448 -13081
20726 -13081 -14094 -8957 -1997 -5202 -3653 -2617 -2545 -2772 -9689 -15347 -14811 -16302 -14492 -6048 -365
20711 -365 -12420 -19795 -16746 -14607 -12882 -6271 -5932 -1235 6269 8831 9410 13892 12572 8408 4390
20696 4390 577 2553 -1819 -1085 -5765 -9107 -5632 -4313 -9907 -8063 820 5998 3375 -222 -1098
20681 -1098 -5471 -2776 -4115 -2176 1336 2700 6983 6226 3540 -28 5338 5928 3687 -1842 -172
20666 -172 -1034 -1424 -5772 -6096 -5517 -10956 -17257 -12141 -3412 -3020 -10199 -13724 -6097 -5649 -6862 -1516
20650 -1516 -3008 -9168 -5878 -8461 -12993 -11891 -8300 -8813 -12079 -12042 -6701 -11402 -12011 -6804 -8327 -6140
20634 -6140 -1639 -543 -1943 -9949 -10589 -1853 -2620 -4626 -5679 -8703 -6048 -2587 -7749 -10277 -9763
20619 -9763 -5670 -6536 -3423 -3544 -341 -2185 -4867 -8542 -17351 -20136 -14748 -9324 -8878 -4155 -9042
20604 -9042 -12114 -9587 -8929 -9665 -13730 -15454 -10554 -8181 -5654 -4264 -2825 -3483 -4418 -10784 -6303 1102
20588 1102 1655 -556 -4317 -6823 -14751 -19284 -12983 -6973 -1958 -5410 -8510 -10160 -5707 -6904 -7084
20573 -7084 -4143 -11325 -11255 -7045 -7777 -12645 -14143 -13482 -12023 -7874 -3781 -6547 -5234 -1989 1855 -1254
20557 -1254 -7789 -5415 -3896 -6622 -8903 -12650 -16313 -18351 -16657 -7184 -7942 -18901 -12333 -5292 -65
20542 -65 2765 -2046 -9939 -7400 -9079 -6584 428 6753 12400 10918 8284 8788 9038 4044 -1312 -982
20526 -982 -5183 -1668 -640 -2092 1291 2574 -2201 -5420 -11359 -12413 -11704 -8838 -8012 -10419 -16955
20511 -16955 -19988 -20053 -12675 -7462 -5584 -10550 -5738 -535 -4218 -2556 5299 6780 6482 7963 6179
20496 6179 851 -3482 -5989 305 4811 -6591 -11377 -6126 2223 7086 7929 6366 -826 -6106 197
20481 197 1172 -3163 -2200 -341 3244 3992 -492 1729 7179 1438 -5599 -5639 -2265 -5599 -6849 -586
20465 -586 6774 8807 3073 -3277 -3122 -4043 -1146 2570 -560 -6794 -6899 -2622 -5232 -5396 -6492 -3976
20449 -3976 -2853 -1783 -13714 -19441 -15111 -14976 -13034 -10394 -11154 -7064 -3760 -175 222 -471 -1196 -6343
20433 -6343 -4628 -3566 -12166 -16386 -16735 -7541 2972 -5853 -7468 -9740 -7523 936 11697 6818
20419 6818 1670 -2129 -1851 5214 1140 1972 2053 6067 9801 4703 2534 3222 6890 5474 2326 -455
20403 -455 -9642 -8782 -2917 4511 6036 -1472 -2564 -2229 -3376 -4660 -6973 -3647 -7274 -9739 -11481
20388 -11481 -9714 -5713 -8556 -5409 -6850 -13778 -10307 -3573 -5001 -6271 -8490 -6036 380 7055
20374 7055 898 -3241 -11262 -8365 -4536 -5771 -4849 -6214 -4800 -5859 -5362 -4842 1212 5 -1576
20359 -1576 377 227 -2126 -1950 -1638 -3073 -4449 -9058 -7745 -7564 -10138 -13386 -14371 -4363 2005 2402
20343 2402 -3194 -12566 -9712 -5161 -3660 1825 5774 4990 2406 6086 200 -4745 -3097 -3471 -3530 -7907
20327 -7907 -6074 -671 4628 6491 2570 1646 -5073 -11431 -12739 -12574 -11145 -7222 2520 2536 -9420
20312 -9420 -17723 -12762 -6054 -8297 -5620 257 4478 1399 -857 -329 -7314 -9254 -1443 -610 -13007
20297 -13007 -12004 -11946 -6280 -2248 -3213 -2491 -2981 -3474 -7959 -9742 -6268 -1921 -231 552 -1465 -4128
20281 -4128 -8231 -9206 -2811 -3291 -4562 -2662 4287 1535 -5294 -11707 -13667 -15591 -12319 -12754 -7907
20266 -7907 -3429 -8177 -5717 -2636 -6727 -5807 -10867 -15642 -16805 -11353 -8264 -7629 -7102 -3157 -470
20251 -470 -342 -445 1154 2286 10994 8010 2259 -3791 -4297 -5370 -4762 -9840 -3040 217 -5084 -5663
20235 -5663 -3926 -5666 -2037 -4151 -3188 -3766 -5025 -480 3820 4289 -2910 -10309 -15492 -12990 -6711
20220 -6711 -2704 -1277 -6 -886 -1996 -5319 -7043 -10574 -13152 -8569 -8248 -7713 -3946 -569 967
20205 967 -224 2151 1086 -5478 -7551 -10860 -14560 -10729 -6789 -10620 -12960 -9195 -4561 -6151 -7470
20190 -7470 -9927 -5685 2766 3813 -405 -7088 -5994 -6471 -9111 -10346 -4379 -5421 -11811 -10668 -5463
20175 -5463 -5905 -3131 5955 2929 981 -1109 -8801 -10314 -10650 -12184 -7769 -11332 -13566 -3895 4238
20160 4238 -3399 -8530 -10188 -10085 -6424 -3018 -1797 -8683 -12543 -15846 -14021 -11303 -8738 -5276 -5929
20145 -5929 -7436 -4272 -2333 -2497 -8809 -10140 -11497 -9117 -5910 1263 -379 -6800 -6312 -8658 -1169
20130 -1169 6635 10441 6539 3924 -1978 -6812 -5352 -4803 -5506 -1573 3393 3592 -1727 -8240 -5007
20115 -5007 -5405 -7339 -6598 -11519 -12049 -6594 -6919 1034 1529 -270 -5391 -6742 -1130 -2579 -7879 -9485
20099 -9485 -7048 -9227 -5390 4411 2869 6224 7942 9556 7981 338 -242 -4991 -5650 5313 8565
20084 8565 7901 5246 3090 -4668 -5179 -2335 -5325 -3776 -3816 -93 -5325 -9922 -7916 -4051 -8790 -15224
20068 -15224 -10042 -7461 -9649 -11955 -6976 -4669 535 330 7277 8982 9139 6799 6658 6065 -369
20053 -369 -7989 -11860 -8417 -3349 -5669 -2321 3170 7864 132 -3574 -4148 -2939 -1449 -5024 -5968
20038 -5968 -8065 -7595 -8368 -2291 1403 2725 46 276 -352 1892 3107 -414 -4768 -3659 -2934 1380
20022 1380 8001 5547 6047 4494 308 -2597 -2252 -2318 -5586 -9711 -11266 -15825 -10736 -5350 -1083 2261
20006 2261 1886 3766 5219 4790 5947 10300 8686 7155 6272 7718 6100 6325 8863 4683 -710 -6917
19990 -6917 29 -170 37 12054 28114 42846 55151 60752 51463 38952 32332 26089 17577 19313
19976 19313 13765 9493 8617 3376 6166 6970 9683 13026 12331 11892 4383 -2530 -4786 -3060 -767
19961 -767 -5427 -2533 -353 2045 5950 7589 2938 -1906 -4069 -6195 -7818 -6515 -4235 -887 1586
19946 1586 -5207 -10664 -8870 1532 6744 8406 6661 3476 -7612 -13205 -11960 -9014 -7995 -1704
19932 -1704 -2157 -1858 -684 -1144 6953 9382 4478 -4084 -4429 -5601 -8692 -7780 -3172 922 5197 7976
19916 7976 8833 7775 -3505 -8093 -9024 -9566 -13304 -12085 -8631 -6079 -7665 -4435 -5479 -6710 -5707
19901 -5707 -5355 -4568 -1828 -7046 -6507 -4682 -8663 -14173 -11665 -12448 -25292 -32615 -29985 -22805 -15915
19886 -15915 -11705 -9885 -10736 -7701 -5465 -3278 -4145 -1920 -1826 -8778 -8458 -5714 -7159 -10556 -13313 -20051
19870 -20051 -20734 -13754 -4769 -1361 -5023 -1593 -2237 -5288 -6293 302 -1284 -1437 -4192 -190 5324
19855 5324 2661 5001 10042 7121 3717 8564 292 -1476 -2473 -7709 -5927 -964 -2795 -6662 -1939
19840 -1939 1911 -4002 -11296 -10072 -10548 -4218 -5189 -2354 -9220 -10795 -7843 -3039 -3861 -3581 -362 -3353
19824 -3353 -4973 -4551 -4830 -7766 -1063 7098 8871 4812 3897 5634 3943 3413 2551 3609 12512 16122
19808 16122 12997 4938 42 -622 -142 -5767 -8270 -6906 -2680 1870 4305 -1887 -948 -1412 -2532
19793 -2532 -10329 -10994 -8580 -3904 -951 2311 7530 1152 -4851 -3594 -8863 -7856 -3459 -5137 -11617
19778 -11617 -9738 -4144 -1243 -679 4857 2376 -798 3659 5546 2505 -331 1073 6684 8019 6602
19763 6602 5044 718 -12893 -18734 -17707 -14023 -10440 -7812 -4802 -2256 -4862 -5672 -924 -4907 -9600
19748 -9600 -9442 -1088 90 -132 3447 5471 4819 2032 5837 6152 5347 9710 9613 6958 7216 4410 -822
19731 -822 -6519 -9257 -9661 1569 7442 7593 8118 6967 5489 2103 -2889 -921 2124 3316 -948
19716 -948 1196 834 1795 -1546 -5330 -3696 -12346 -9322 -5047 -3213 -4166 -4395 -3642 -1713 5651 6224
19700 6224 5003 3595 -879 -6628 -5985 -2521 -3541 -5695 -6901 -8761 -9557 -13474 -12902 -12550 -8351 -5905
19684 -5905 -4085 -2644 -635 -2777 -7610 -5216 1339 987 7489 3912 6246 8876 10399 10139 6099
19669 6099 3643 -3381 2643 7393 15697 26505 26436 16873 5320 3859 6014 9141 13839 15532 12815
19654 12815 12591 5334 5108 9725 7140 9066 2997 -5341 -1185 8440 14280 14136 10176 5342 -1970
19639 -1970 2556 3821 13139 18782 13351 9924 4031 -2809 -4535 -5524 74 4672 2950 -303 6008
19624 6008 12235 14874 20291 17380 8119 4363 3745 7676 14438 17812 11187 4292 9712 7537 -460
19609 -460 -3531 2062 7056 5565 5682 8039 9257 4159 2306 5063 6889 8344 8917 3419 396
19594 396 -917 -969 -7413 -6533 -2032 1782 2573 -818 -1955 -4210 -4826 -2135 5183 6351 6372 1695 5183
19577 5183 7692 6248 -39 204 -4866 -6434 -7794 -5735 -7210 -6920 2775 758 -33 5156 11729
19562 11729 9774 7449 13108 12996 7762 -769 -4768 1535 3381 1007 3206 3194 7744 7943 444
19547 444 1249 8911 10279 10657 11817 12917 14074 12801 9878 14390 20333 15984 14054 14214 18762 19701
19531 19701 21828 13489 6701 5080 7382 4045 4199 6138 11209 12206 13407 15290 13409 7227 10662
19516 10662 11918 7288 3096 -954 1796 7926 12855 17744 18011 17601 10866 12695 22323 22218 19048
19501 19048 12937 9266 7037 7413 6910 8161 10903 15070 13513 16659 23574 21964 19597 9146 2723
19486 2723 -3920 -6134 515 4317 9547 9499 9281 10796 15466 16779 15047 9949 14106 23597 27933
19471 27933 24861 19705 19167 16004 16048 14127 14416 15050 11103 9030 12406 15610 18656 15741 19370 26540
19455 26540 27604 23679 17963 11979 10825 5417 10740 11267 13290 8525 13033 13539 6299 485 75
19440 75 3917 3732 5772 -380 -5212 -4945 -2682 3368 1075 6875 14797 15876 19313 22293 20245 19669
19424 19669 19955 19136 12529 10031 14386 15805 14542 19580 22653 24125 27720 23044 24241 22705 22264
19409 22264 18048 14784 10068 11560 16041 24906 29581 22182 19298 21811 21456 21088 18887 15829 11129
19394 11129 6212 8973 11352 2380 -1009 -1111 1071 6390 13847 8121 3238 -1444 4726 16611
19380 16611 12787 16528 15202 7154 4304 3239 2889 7935 14628 15591 9274 6652 14664 20930 20359
19365 20359 14135 15891 15857 15979 14479 16656 13407 10453 12149 7071 7722 8033 8854 12250 9564 4839
19349 4839 13810 14460 9222 4166 3271 4446 6300 17553 24120 21528 17426 16078 16386 16658 20713
19334 20713 20086 25452 30241 35111 39281 32440 20348 22160 25756 27012 23818 20426 19348 26497
19320 26497 26268 18818 20760 23644 23092 25917 24144 21367 19437 23922 31784 36144 39881 41653 45307
19305 45307 50747 49108 61255 79029 87229 90586 99670 111514 113954 122503 126240 134250 138159 139531
19291 139531 140435 146378 148456 138731 130214 122886 119869 108011 95209 90212 74065 61177 52741
19278 52741 46546 46563 48583 38176 30094 24207 22219 20114 17330 25744 28928 37805 40669 30766 26593
19263 26593 22193 22838 15494 17789 24877 25632 18910 17364 18775 16564 14387 17632 21829 29404 27563
19248 27563 19945 18254 20140 18473 20794 24041 26826 31597 26697 22995 20718 16596 14941 11830
19234 11830 11759 5700 6004 11774 8002 7883 10489 12911 12983 8233 12887 11679 10761 3935 4682 6437
19218 6437 6523 9745 15921 19158 19325 17108 16507 10037 14920 19449 18429 15863 12263 15360 13178 11621
19202 11621 13829 18509 15755 20880 30875 38671 30681 23039 25023 28637 35997 35021 23252 23635 39259
19187 39259 39292 33231 32622 31611 18778 11406 12072 18599 25913 32166 32779 29140 25698 25554 19028 14672
19171 14672 15200 15251 15501 14786 16744 13858 10534 19039 29430 33524 30647 17766 13498 17125 16833
19156 16833 22807 28282 27093 27877 27899 25251 30797 35465 31725 36159 43579 49907 49920 58003 61877 59108
19140 59108 50730 45747 42045 42068 43430 51512 54585 54051 51794 51876 56368 55289 48664 47851 50960 46744
19124 46744 49926 53908 52601 50325 44623 42402 48115 52788 53425 50598 51220 46067 37573 34958 44396
19109 44396 50431 52248 47755 39886 33390 27702 25852 29900 33489 42723 46442 45775 46546 42914 44069
19094 44069 34980 32215 32940 33018 32069 35594 39625 44084 46364 46915 48214 47717 50425 45077 42868 49532
19078 49532 53538 60292 57462 56916 54695 52132 68559 81200 87248 83616 72497 66308 53358 55820
19064 55820 55544 50046 52618 63175 67962 59756 45207 36953 40354 39820 44190 50280 53267 59074
19050 59074 61472 61572 57266 47710 48036 48968 48823 44478 33183 29140 28805 31866 30236 27984 26369
19035 26369 27595 29500 29948 30518 38082 38508 34851 39103 39747 51124 68029 88897 95656 80112
19021 80112 67022 62612 60040 59244 70557 91109 114497 141079 147056 139658 134900 120876 103570
19008 103570 86103 72506 62553 55175 44090 46864 56183 65059 59882 51968 40525 31787 30895
18995 30895 33288 31585 28693 31139 37851 40698 44421 48208 41031 41403 41535 42991 44558 43356 39347
18980 39347 41640 41880 43467 39635 52273 62946 73538 92632 102207 96439 92844 89013 77896
18967 77896 74073 78708 74520 79659 86432 102643 116834 122269 125755 138353 139542 125573 101035
18954 101035 76092 61099 60261 55905 54670 50023 50730 46725 41753 42129 42162 46179 43910 32699 34608
18939 34608 31630 28103 28443 28417 31274 27130 24547 33715 48791 66732 97170 113560 113614 110256 106256
18924 106256 101278 99380 105148 108745 103005 93466 79365 62301 62045 60572 60841 61176 61545 63738 58968
18909 58968 55718 47405 49742 50080 46039 45493 51479 53556 67205 69808 56284 45454 44950 46504
18895 46504 52137 49325 37064 32108 32502 33820 32417 32504 33036 41518 51626 68958 92931 116185
18881 116185 138813 147028 145321 150727 161826 171637 175329 168438 158375 146088 124884 100858 87569
18868 87569 87832 94285 104093 102960 96804 80752 57071 46978 46173 44657 50511 58123 62302 67753
18854 67753 69983 71191 60469 58211 57355 52356 54063 55657 52546 57909 58643 58151 56114 46902 32180
18839 32180 34446 40102 41188 48856 62157 72602 80963 85228 105667 128628 148182 168597 174064
18826 174064 173687 167899 155933 141717 145847 145440 137926 128617 120658 122965 129003 126848 116537 107824
18812 107824 109300 110792 116331 120446 122285 120285 118279 116563 114207 123196 125246 124100 122420 114170
18798 114170 100130 89038 75648 67803 70539 75978 72317 65561 60991 63285 67023 70082 72637
18785 72637 83134 96143 106814 110573 110029 101732 89022 92389 99246 109916 127911 142931 147408
18772 147408 156596 158536 153555 158680 188156 229078 241996 212457 178163 155385 146239 139610 141608
18759 141608 143719 133177 127600 132694 138455 134957 133291 131395 130192 125289 124491 125535 127657 128289
18745 128289 125344 129896 131391 127598 125126 120090 115365 111900 116243 122168 128233 132368 128449 115520
18731 115520 114955 113158 111024 113192 113957 119363 126920 109921 86187 74505 81328 75870 72245 72787
18717 72787 78370 81854 83766 81280 81107 76595 69970 75921 76740 70274 72405 78483 75806 79090 81596
18702 81596 80830 73571 76992 79042 73066 68144 70179 71880 71692 79283 79580 74179 72504 75878 71836
18687 71836 71431 71694 72848 74009 72011 71048 72948 75707 78592 91894 95571 95683 99069 96861 85949
18672 85949 84545 82084 81557 82151 78746 81617 74882 68662 73381 71428 69292 71839 76486 87933 94382
18657 94382 102865 112274 113211 109831 97749 86010 83906 83927 89245 85339 78806 76820 89862 95534
18643 95534 103033 106755 100026 87785 89601 98647 106666 117663 128670 131887 138557 138225 128184 125873
18629 125873 128675 134655 138867 141480 141813 144028 143363 148370 148732 141907 128175 124245 136554 145934
18615 145934 150563 160385 169206 171455 163405 147339 132620 119607 110549 110085 112158 104688 99747 95706
18601 95706 99992 102359 104663 110465 114133 112992 112952 115779 114712 114085 114301 118333 129780 138172 137375
18586 137375 144991 151026 156582 156699 161076 163510 162875 161805 152352 153182 160398 173606 188703 201672
18572 201672 217307 230095 234231 241565 240500 239083 251203 265080 271875 267804 258029 243490 229629
18559 229629 218245 197495 176107 168886 162236 146507 136759 131444 128274 130048 136274 139995 147283
18546 147283 147673 144986 148898 148073 151479 162464 174455 166012 149587 142309 144404 153653 168131 176641
18532 176641 184384 168456 148467 139834 133640 137192 151830 166984 185002 191920 188604 192222 210536
18519 210536 217119 209866 205210 197936 197912 213438 227070 236473 233307 225349 219317 210842 200870 183749
18505 183749 173648 167350 162901 164142 167325 168618 175237 182349 202687 222005 216624 203803 198225
18492 198225 191363 191988 199444 205289 204776 203240 205788 209146 214165 220411 232856 253585 272938 282959
18478 282959 284161 289283 293957 290043 288138 299070 314645 322677 323048 317676 311020 311341 303255 296110
18464 296110 298821 292614 287704 287315 295759 302034 289643 279914 277986 281785 298038 318553 335677
18451 335677 342715 334947 312972 290447 271614 276138 281628 299353 325424 350297 366125 390422
18439 390422 418587 443935 484204 524803 532308 508544 479643 463386 459297 464380 479018 517473
18427 517473 579117 673654 826831 1067193 1481720 2106741 2706148 2759429 2306719 1941865
18417 1941865 1868017 2019667 2261507 2685313 3120353 2956792 2406536 2007472 1825294 1770823
18407 1770823 1811319 1950590 2192672 2490864 2815120 3206723 3771093 4652245 6182717
18398 6182717 8937428 13852617 22138022 31890180 33878886 27525636 22550651 23059198
18390 23059198 28888917 36704903 37131796 27758760 17957622 12041282 8895830 7196394
18382 7196394 6241553 5704892 5462910 5531598 5956481 6890101 8701018 11889433 15866857
18373 15866857 17083775 14289299 11088555 9542038 9767444 11801733 15779626 20016215
18365 20016215 19658017 15059517 11009724 8964221 8464887 9315687 11671759 15329468
18357 15329468 18653188 20196635 20287772 20993594 21975501 20513560 16017987 10968692 7451867
18348 7451867 5396912 4205278 3473595 2982774 2657364 2496152 2482465 2413909 2131991
18339 2131991 1839248 1662797 1569675 1518385 1501318 1518415 1589744 1704612 1845519 1989890
18329 1989890 2150360 2373443 2774477 3495281 4734015 6629891 8917369 10689955 11132617
18320 11132617 10801680 11077934 12796736 15490114 17362949 16861157 14698853 12767839
18312 12767839 12275717 13243052 14551456 14917224 14489643 14710282 16117212 17418617 17225312
18303 17225312 16048449 15298445 15191923 15057186 14770982 14688038 14450589 13427428 12172398
18294 12172398 11403021 10725938 9300026 7237797 5321419 3954436 3070090 2498606 2112644
18285 2112644 1846310 1648606 1491389 1339094 1193694 1066038 957697 867785 794087 732249
18275 732249 665636 597842 537550 484862 443563 421662 409170 390545 370731 355563 339484
18264 339484 324398 318956 314647 304034 292060 282650 274509 265824 266220 273419 287339 320513 376263
18251 376263 451127 532574 591230 618006 601606 558343 499226 422132 349502 300981 268145
18240 268145 259806 247406 237808 232193 223860 216248 219115 223885 230166 231358 226479 217612 212023 209919
18226 209919 210591 219678 220120 212558 197863 187279 187411 192452 195548 211441 238390 281953 341802
18213 341802 424025 460671 430393 393700 385631 427558 523093 664493 803203 879885 897771
18202 897771 884300 872782 867864 840209 739434 591689 478738 414470 391694 411864 477810
18191 477810 547308 523989 411880 311511 251687 215374 194378 177443 171088 175231 177348 171696
18179 171696 165553 149510 143200 140756 139822 147854 153047 142098 133830 129456 135948 141473 163657 196000
18165 196000 217502 204870 182319 165109 160696 168259 183486 208764 234075 245672 218425 175936
18153 175936 151594 145051 135379 129168 129904 132848 123373 122695 122519 123163 124685 112250 97669 86865
18139 86865 78660 75096 85905 101767 116887 121106 126164 128738 135442 136173 139753 146634 158379 169159
18125 169159 185596 210604 232832 250968 277011 310629 357022 434906 540052 674985 877362
18114 877362 1181510 1689229 2637511 4513685 8196134 14840055 19900019 15146856 8352696
18105 8352696 4690564 2964406 2050155 1517285 1198418 974599 807181 692415 600191
18096 600191 522041 458980 411887 372969 331563 294801 266453 239098 214047 197327 180563
18085 180563 175132 169941 156247 149889 147048 151330 157363 156276 142445 132559 129759 130708 132208 130908
18071 130908 121479 120591 119690 125634 131795 139339 140398 140723 146776 151102 144893 136164 123522 111957
18057 111957 107721 108010 112658 117400 119773 126356 123320 110575 103121 101161 111742 119443 113306 107232
18043 107232 108126 113769 127380 143923 169778 204067 229337 223535 202251 196001 197783 199655 220419
18030 220419 245341 286260 349855 456331 640552 950125 1402525 1828733 1876863 1546671
18020 1546671 1184957 941236 786721 682104 611818 578626 564800 568242 593672 639581 719416
18009 719416 862472 1088071 1450714 2004381 2610138 2918257 2841415 2772473 3060783 3955722
17999 3955722 5704732 8328596 10567730 10184842 7700998 5326530 3807218 2914407
17991 2914407 2414630 2177899 2095594 2072155 2116206 2288465 2645483 3234368 4240397 5957902
17981 5957902 8478496 10915238 11548367 10891421 10835737 10882307 9349646 6796991 4709781
17972 4709781 3440194 2729300 2339080 2114174 1998825 1978541 2048006 2215858 2526321 3066613
17962 3066613 4023126 5606628 7798792 10031675 11578325 11741060 10087632 7435089
17954 7435089 5207347 3865802 3147624 2779733 2642904 2726594 3079916 3807638 4977866
17945 4977866 6277121 6962338 6666025 5827323 5378146 5882496 7320125 8635409 8087955
17936 8087955 6049444 4152880 2948234 2256835 1860144 1629650 1493281 1453089 1481434
17927 1481434 1583568 1783735 2184903 2930899 4209607 5983648 7245385 6563072 4672239
17918 4672239 3080753 2147994 1668985 1470743 1471852 1580028 1602579 1431274 1141497 880618
17908 880618 715343 626638 568873 528907 502982 494801 501175 539906 622426 784548 1014921
17897 1014921 1241277 1273427 1066481 808416 630726 526623 455683 397972 350744 303923
17887 303923 266866 242581 218243 204315 202154 197243 180052 159801 142606 131602 121834 115956
17875 115956 114778 111819 114949 120710 120811 115716 103677 102522 100045 98215 95680 94934 96864 94596
17861 94596 95716 91293 92022 97374 102890 107934 111372 117268 134106 150293 162655 171592 185407 190261
17847 190261 192004 189496 189701 187318 185674 177787 172123 159711 152158 141721 130309 122395 111950
17834 111950 96624 89711 86258 87232 92103 88874 87765 88161 77237 66497 55066 52687 56960 64827
17820 64827 58571 56886 64056 71229 79241 84048 97394 111228 119652 123782 134005 138469 136922 142200
17806 142200 146507 151490 146391 138813 128707 128108 139782 148693 150484 150051 146954 145983 146701 145244 136955
17791 136955 131444 119389 126507 144199 152191 149384 141701 134937 120232 111081 107382 105037 97363
17778 97363 83167 72796 62505 53954 55753 60916 65389 68846 67765 60379 53467 43975 46024 45066
17764 45066 43374 36891 33280 34067 39020 42983 42131 47089 49664 54282 60314 69236 73018 73595 85138
17749 85138 106055 134004 171100 234937 293059 274664 217045 166988 131682 112849 107215 110676
17737 110676 114399 114545 120975 154508 202704 271189 323366 336667 342974 330880 271519 205107
17725 205107 159442 130431 109287 96403 92180 99912 115746 143491 187822 235383 240497 214480
17713 214480 186704 183531 179146 160992 152395 142009 137068 142187 147415 162888 204157 259746 308324
17700 308324 302866 270158 251715 252727 236442 198198 166581 152843 147931 144763 157221 186284
17688 186284 234254 278772 265071 234013 244109 256874 209312 145635 111144 90845 78124
17677 78124 75493 81074 91257 105779 114876 147286 186545 196525 158187 115282 86108 69281
17665 69281 62479 55957 52576 51460 53215 58133 69528 83161 97972 112916 122068 129405 132201
17652 132201 123173 116774 123962 132894 143750 151750 154698 144411 132421 120597 103125 84997 73199
17639 73199 64642 59018 57911 52160 45722 41278 31219 29574 32244 39584 42255 42284 43046 45986 49847
17624 49847 49310 44658 33879 26008 22674 28225 28259 21036 12848 12658 13000 8611 12950 17362 14666
17609 14666 14284 19263 19803 24418 33366 36002 39138 38206 34623 35848 34484 32298 32218 30261 30020 31339
17593 31339 28077 26749 26045 32023 37235 35597 38892 39492 32084 30376 23934 16568 14692 20218 16750
17578 16750 12803 15942 30799 32339 31349 25305 24023 21942 18960 25952 30044 31256 31289 27304 24273
17563 24273 20172 10302 9605 15930 20581 17674 20589 14850 11306 14845 25000 27258 25809 22696
17549 22696 21707 18624 15707 11978 14629 17223 11501 12699 14917 17629 20738 17176 17706 19695 16088
17534 16088 14375 15834 18054 12079 5980 5114 4870 7902 8025 5462 2108 -2343 441 5259 9380
17519 9380 12935 13592 12728 13400 22791 25296 27152 23884 15033 8441 13798 13517 13062 21529 25252 28754
17503 28754 33970 29516 25674 23722 23589 26430 28983 28118 31430 34366 33131 32978 40095 45241 56524
17488 56524 57963 59059 54093 46482 43465 36009 33225 31303 24454 19103 22547 25650 25778 26444 26637
17473 26637 38827 54818 64369 60816 44391 28547 21325 26189 31139 29543 29314 39021 52775
17460 52775 65544 73592 80757 78216 72655 69392 60465 43645 38155 37614 29245 23090 24991 32494
17446 32494 40028 58116 85852 120528 157911 165196 127918 94408 63258 45498 36547 29635
17434 29635 34218 37403 36540 39597 49213 59882 55780 46230 39296 25331 19608 21620 23605 20859
17420 20859 23969 28136 28073 29665 33056 34992 36030 42595 49862 47179 39525 36976 33680 26242 25290
17405 25290 21858 19693 15297 13506 16914 20279 22882 22769 22188 27676 22715 18683 20380 16174 18368
17390 18368 22378 20606 18275 16988 9660 4688 7193 6280 14026 23679 17848 18636 19540 19109 16435
17375 16435 21115 16489 4944 4902 8408 11870 12571 10525 8170 4401 5232 10025 11749 7530 16446
17360 16446 17930 14163 13215 15811 18614 10626 6510 8170 7870 3171 -1705 3112 8769 14949 17825
17345 17825 17304 19399 8608 1916 -32 982 8102 14288 4780 -3287 -1742 -4688 -973 7858
17331 7858 9918 11572 13844 13628 7799 2070 629 -473 -3254 4302 12866 12365 2555 4084 4553
17316 4553 -1312 3029 2447 6697 10253 11395 8843 6935 13953 9610 5943 6693 16368 15040 14184
17301 14184 11087 4358 1053 -795 -3763 -7595 1626 5624 6183 -2080 -7482 -6056 -7721 -3007 477
17286 477 -2014 2323 4637 -568 -10915 -9868 -3922 1804 6069 9092 10545 12054 4864 -1559 -1417
17271 -1417 2458 5698 9927 7764 12108 9943 5827 319 -423 6253 10506 -1073 -2748 2934 7985
17256 7985 6083 3478 8007 8347 8673 9646 9733 9213 13058 5334 4558 5940 8052 6842 2334 -1421
17240 -1421 -2772 2427 9310 15960 14522 9944 11239 12820 11323 14551 16999 13001 10931 10702 13279
17225 13279 8547 9125 6679 1764 -145 -241 2617 3073 2710 -5459 -7653 -6365 -3155 2578 7529 7855
17209 7855 6895 6346 7115 9355 8141 3831 1411 4664 7901 1821 3597 1244 2956 843 3279
17194 3279 460 5021 11027 9728 130 -3815 71 1833 3863 3022 998 -1708 -3097 -1741 -3828
17179 -3828 1722 1933 -457 914 4169 3849 3900 655 -446 2661 -3956 -2824 4203 8863 9025 11867
17163 11867 12585 12135 5738 4454 3145 2852 4106 3143 -265 -3778 -10114 -8186 -8812 -10794 -6198 -2887
17147 -2887 -4508 -5723 -7088 -4844 -3501 -4046 -1551 -1407 -4316 -6664 -10280 -3590 5147 4746 1448
17132 1448 92 -2786 1204 -450 -2302 -3283 1766 5894 -3080 -2410 -2541 -4607 -3126 -4295 -227
17117 -227 5643 6057 1210 1297 2676 -1474 -3229 -2789 -2673 -4954 -6964 -5152 -446 2130 455 -2433
17101 -2433 -4521 -5510 -757 321 -3764 3477 9667 7325 6522 2752 -888 -119 -369 -8635 -7535 -1848
17085 -1848 839 1502 2200 2292 -2055 -4686 -5349 -4849 -6147 -6203 -6445 -6231 65 1868 249 4161 5124
17068 5124 9647 9140 3838 -7686 -3225 1225 2721 208 7025 43 -8890 -14988 -7323 1174 -2320
17053 -2320 -1105 6347 10080 8164 11467 10316 596 -6842 -7936 -5347 -2507 -1432 -3027 -5026 -9553
17038 -9553 -8547 2118 11892 11506 9749 6318 4358 2788 3518 7905 10017 7216 6573 5725 2414
17023 2414 3948 99 -6981 -8469 -12114 -114 1810 -8713 -11447 -5736 -331 -746 -1749 -6830
17009 -6830 -6404 -6160 -4291 899 96 -2069 -4855 -1355 -6299 -8430 -11181 -9249 -1600 -4569 -2288
16994 -2288 -1454 -3578 -4353 182 3572 4530 1597 -3482 -7962 -10831 -16139 -18779 -16272 -15421 -14495 -15486
16978 -15486 -12678 -11505 -14937 -11904 -7919 -3729 -1532 -2436 -4539 1047 -1840 -2426 -3606 -1259 -5514
16963 -5514 445 14 -4894 -6294 -2329 -1555 -2614 -3352 4022 3596 4971 -460 -836 -2836 -5004 -7049
16947 -7049 -7771 -8344 -4750 -524 328 2079 2166 3236 -4404 -7149 -6280 -3635 497 1094 -3648 -3889 -4591
16930 -4591 -8149 -5993 -2583 -8987 -7719 -10225 -13061 -8448 -5048 -8416 -12226 -12426 -9625 -13747 -12413
16915 -12413 -6192 3027 -1427 819 2782 4376 5136 -1328 -6315 -3126 -942 -5747 -1687 -329 3525
16900 3525 3437 -2097 -7404 -9882 -5609 -569 -3797 -3256 2420 5167 -1500 717 226 -1185 5770 2307
16884 2307 965 -2249 -6961 -11875 -21688 -22071 -20403 -12492 -8602 -7315 -10526 -12692 -8664 -3806 -703
16869 -703 -6394 -10945 -9964 -2473 7902 12078 12344 4219 1229 -6104 -10375 -8873 -4338 -5513 -9610
16854 -9610 -14972 -11620 -8881 -189 128 -2098 863 2623 4588 -2853 -11601 -13538 -10602 -7402 -4268
16839 -4268 -2297 -852 -2532 -3568 -2534 -2197 -6530 -7013 -1214 -418 -6091 -9603 -11247 -9708 -4133
16824 -4133 -6145 -2677 -513 2153 -777 -5776 -10214 -12642 -2441 2879 1772 4596 47 -2637
16810 -2637 -1675 -2172 -7414 -3016 -1851 -2272 504 4434 2590 -5256 -2697 185 -5741 -3593 1326
16795 1326 630 -1204 -3245 -3677 -5709 -4781 -386 3383 5564 -445 1984 10403 7590 5441 12676
16780 12676 8367 3909 6771 6034 1916 -4563 -3574 -4449 -3502 -7171 -4079 1970 6852 9278 9194 8241
16764 8241 3269 -1709 -714 -2856 -4750 -1573 1033 3170 3294 -264 -3536 -5994 -221 1201 4763
16749 4763 4963 -586 -1873 -3873 -8119 -10159 -4108 2982 5252 2929 -2534 -3865 -8247 -15188 -13852
16734 -13852 -5515 2335 4815 3242 1576 5331 8409 5007 4975 -1247 -4251 -5331 -1305 4260 2857
16719 2857 -746 -1133 -8942 -1396 1558 589 946 4453 7089 7625 500 -4545 -7764 -17615 -9868 -5872
16703 -5872 -8069 -15746 -13395 -11735 -15098 -13888 -8623 -6057 -5405 65 -748 -3522 -3740 6396 11371
16688 11371 4118 -3659 -4934 -6548 -10743 -6048 -5668 -6121 -6148 -7922 -7854 -3914 -4194 -5407 -5491 -6448 -10218
16671 -10218 -4105 4640 6010 -1074 611 3300 6015 3710 -927 -7481 -6523 -7546 -10169 -8579 -9511
16656 -9511 -2195 -1610 -6711 -9316 -10007 -13290 -8757 -4060 -1799 1158 -8811 -13765 -11966 -18173 -17864
16641 -17864 -13670 -10377 60 773 -3776 392 792 103 1909 3665 -2107 -155 3929 -673 -3096
16626 -3096 184 575 -4030 -3070 -1580 -3660 -9029 -10423 -8782 -2261 1591 360 -2934 -3120 -1400
16611 -1400 2596 508 -3408 -1577 -1678 -10088 -11498 -6458 -2118 748 179 3051 415 -5087 -5055 -6859
16595 -6859 -9023 -6733 -7164 -2874 5616 8949 6351 4299 3640 8221 9375 7153 3483 13494 14236
16580 14236 4744 -224 1795 255 -736 3303 1859 -1963 -3151 -10444 -12908 -12596 -9909 2148 5456
16565 5456 9093 8927 12587 17417 15645 13018 8048 5069 -3421 -2276 -9 235 -4606 -8053 -3227
16550 -3227 886 68 1191 3487 5087 8280 7915 2506 -2130 -5650 -6513 -4430 -8362 -8612 -955 3472
16534 3472 -1382 -10177 -17461 -8726 -2195 -2373 1332 -1580 -5134 -4803 -599 3713 6171 2876 -2792
16519 -2792 -409 6816 9764 8120 -4004 -1029 4527 6141 6687 4318 9440 11830 8071 10661 10545
16504 10545 88 -2308 -3627 -5221 227 3387 1875 -2779 1016 2088 -1597 705 3816 1824
16490 1824 -1782 2623 1486 -350 -196 -406 -1276 -3407 -4290 -2569 -52 -503 -3931 -1485 95 -3992
16474 -3992 -4700 -11031 -8012 -891 4540 986 1964 7321 6339 -523 -4485 -2868 1783 3826 5977
16459 5977 2694 -2328 146 3630 2883 2215 7429 6394 -2797 10 4456 8931 8500 6921 4921
16444 4921 732 -3513 -5247 993 5395 4297 2955 -2266 -4273 -1929 -1090 260 5172 3170 3296
16429 3296 5383 2685 5354 8962 8829 7978 6159 2147 1301 -2311 377 3480 5566 2896 530
16414 530 -3683 -3175 -2397 -1484 1826 3115 -1246 -5704 -6300 -6440 -8837 -6007 590 -3294 -4964 -2926
16398 -2926 -2900 -6481 -10471 -4653 109 -277 -2566 -1609 -8985 -7375 -3798 -8760 -6522 -9439 -9916 -7479
16382 -7479 -3492 316 -4149 -4398 2273 6270 7920 5921 -2986 279 5014 4418 -8146 -11271 -6064
16367 -6064 -11652 -12243 -13023 -6832 -5621 -11517 -8801 -6717 -8696 -4084 2650 -601 -9664 3617 10874
16352 10874 12028 3737 -1924 3250 6530 2457 913 79 3486 7517 -199 1856 9437 10450 6385
16337 6385 7284 154 -8303 -5819 -5323 -3332 -6994 -9731 -17 11178 15214 11186 6563 5371 6084
16322 6084 10686 13366 15342 10812 6 -7304 -6302 -58 -1617 -5022 -4635 -5558 -4904 -8770 -8452
16307 -8452 1508 4534 1546 -3566 426 1714 4924 13921 16504 5601 6870 9221 4747 889
16293 889 1196 6881 16679 23917 35025 54524 75571 69319 47390 24346 12964 2781 -2389
16280 -2389 -1096 -4383 -2983 3051 5739 6787 9142 7732 2657 426 -1983 -3304 -2409 -2105 -2157 6591
16264 6591 10344 7684 8601 6972 2323 10970 21669 24512 34346 55696 79828 78659 54289 36765
16250 36765 23494 8374 3942 1599 1597 760 -4975 -6181 2617 -2330 -3759 4371 5920 6083 11826
16235 11826 5244 268 7319 13628 14452 8608 1663 7361 13836 17749 20479 24840 29091 43636
16221 43636 69569 89270 69375 43010 23010 21823 23634 28537 29124 41630 52787 45053 26519
16208 26519 17205 8994 9086 5372 -2915 195 995 -1524 1462 -1992 646 5367 13288 16294 13610
16193 13610 15395 21106 25686 25806 28724 40452 51567 46533 28414 24425 14686 9295 16778 40473
16179 40473 66149 96924 112647 77034 33208 15129 8488 4718 6476 7826 6643 9202 13173
16166 13173 14499 16837 13452 10210 11712 8064 3338 1354 6343 -707 -6016 -6063 -4729 -12484 -13836
16151 -13836 1840 12613 15894 17930 30358 51073 79210 92896 66986 37094 25289 17472
16139 17472 12436 10199 6746 9526 4305 6756 9759 7561 688 3990 6075 4223 4039 719 -491
16124 -491 7070 15206 14004 6477 5712 1943 1575 3073 12923 13888 22050 48708 94117 112673 96620
16109 96620 58171 26041 16343 18048 23679 18034 694 28 -1290 1091 -2312 -413 552 -4631
16095 -4631 -2771 896 4479 5250 1838 4527 6195 827 -8258 -11445 -10368 -9115 -4025 2761 10410
16080 10410 24625 41963 57431 56409 45057 25053 12600 6550 8754 2952 -316 3187 5117
16067 5117 5067 4564 1496 6477 3420 663 -2850 -509 -2972 -2759 -680 4349 2762 424 -2721 512
16051 512 9449 16769 15686 10229 2155 -575 2980 8868 1899 -2914 -7638 -10903 -8649 -4962 -8524
16036 -8524 -4581 4108 2001 -2587 -1512 3605 2248 -4008 -3402 -7433 -6098 -5160 -9602 -6945 -7507
16021 -7507 -6707 -8195 -2136 4259 6748 14645 10948 4631 -2612 -825 -4421 -8528 -16436 -11414 -10083
16006 -10083 -9152 -6766 -10355 -12140 -3867 873 -1916 -2090 543 -4913 -7119 -3722 3553 624 -9164
15991 -9164 -10840 -10567 -6522 -7084 -8944 -7457 -2692 -5758 -2887 -2694 1939 4724 930 -3169 -6015
15976 -6015 1083 2547 4723 5815 6488 428 -743 -6127 -5219 2203 249 -865 -8752 -3470 -3679
15961 -3679 -5402 -2230 1219 -2378 -8013 -8394 -10569 -6406 -526 2516 5718 9145 3539 -6214 -13169
15946 -13169 -9543 -1362 2300 -2874 -3004 -4092 -1768 7832 9857 8128 3493 -660 -2245 2571 5598
15931 5598 7107 3142 -1184 3004 -1374 -1233 1017 1337 6574 -769 -7497 -4974 -5311 305 798 -3723
15915 -3723 5091 538 -7664 -10727 -8121 -10027 -6574 -3592 -4645 -1823 5461 3205 3268 -4427 -3135
15900 -3135 -2448 -274 4902 5861 5582 2832 -387 -1135 4791 8685 7837 6380 5472 398 213 1794
15884 1794 -2702 -2627 5729 6131 242 -2337 -1537 -1341 2048 -1846 -2297 -1127 -4514 -5479 -7808 -11189
15868 -11189 -766 5324 6255 6189 5256 5031 13301 13080 4412 -2468 -4048 -3629 -4066 -3367 -6298 -8088
15852 -8088 -4253 442 -1918 -5861 -7220 -8984 -5473 -7448 -1230 10069 10868 2484 1597 11931 6323
15837 6323 2981 -3324 -11976 -18601 -15997 -7594 -8566 -8453 -9043 -9017 -3665 3847 299 -1164 2761 516
15821 516 4082 1817 -1634 -1432 -846 -5092 -9980 -7775 -4414 -2112 -5114 -2689 1069 2729 434
15806 434 126 7656 9410 5784 513 -140 -1073 1841 1361 -1172 1804 -1856 1766 2837 2590 3976
15790 3976 852 -6518 -12664 -10169 -6776 -7004 -1963 -3778 -4365 -9646 -8809 -4096 -6443 -13896 -14969
15775 -14969 -8120 -4376 -8053 -3530 -545 4999 10175 7507 3217 1680 484 1565 -178 -7521
15761 -7521 -7014 -4029 -3868 -5654 -4356 1014 6547 2778 -3996 -2034 2283 -2348 -3848 -955 -2036
15746 -2036 -4736 -4823 -3246 -5208 -927 1350 -1423 -2840 -4571 3484 13259 10922 5477 80 -3401
15731 -3401 -5347 1726 5811 5034 -239 2930 464 -444 7441 13709 11690 9398 8576 5772 7206
15716 7206 9665 7705 6309 1584 -6892 -10823 -8789 -3881 -7083 -5768 -1039 -127 763 2769 -2061
15701 -2061 2458 5093 7608 1259 -2335 -58 1529 9560 13995 9349 5674 480 824 5003 7784
15686 7784 10466 7628 4337 3788 4255 1146 651 2916 5370 3030 -5394 -2310 1635 -1924 852
15671 852 3465 12475 14002 12889 14654 10092 -628 -5033 -11415 -12459 -2070 4225 1666 8426
15657 8426 13884 16759 10018 1041 3451 4104 5264 4233 4203 -1087 180 586 1805 8319 9808 11656
15641 11656 11705 -3189 -9831 -9311 -6612 -4385 -6172 -9029 -9866 -3556 700 2276 4496 -2268 1584
15626 1584 2550 -8270 -11076 -4619 -1671 -204 -5213 -815 2976 2727 645 1372 -727 262 -550 -5601
15610 -5601 -7674 -2362 6219 1930 1095 3344 4765 7543 5886 2581 4546 1126 -2600 3319 7922
15595 7922 10194 8115 2817 4727 4708 3915 3303 4058 6506 -2393 -5331 -6347 -7129 -3101 -1846 103
15579 103 -2791 -1936 -2244 -8559 -6147 -4840 -1652 4808 5284 6930 8359 9513 4616 5704 4769 -3542
15563 -3542 -10151 -4902 1191 3986 4673 9162 6331 9856 8424 6747 9692 12228 4057 1053 3947
15548 3947 6003 4997 6625 2198 -5671 -6060 -2662 -1596 -10705 -15365 -10472 -11638 -11526 -13022 -11651
15533 -11651 -12603 -12929 -19853 -11274 -12168 -9436 -8445 -9969 -11763 -10248 -5168 -6127 -7817 -5660 -2421 -2717
15517 -2717 2999 2662 3327 1353 1370 775 36 -263 8193 4180 8075 9024 3601 -4406 -8129 -10895 -8708
15500 -8708 -1171 -1146 -4829 -8598 -7489 -5158 2384 5840 4556 -743 2899 5194 4469 10951 3319
15485 3319 -6795 1118 1855 -1914 3169 3520 1923 -3295 -10066 -14857 -10179 -7874 -5463 -3121 -2175
15470 -2175 -4703 -3941 -704 -4910 -5234 -3666 -6173 -6632 -7044 3095 1572 -1755 -757 -5354 -7618 -4304
15454 -4304 -4156 -2382 -663 -9505 -12899 -9670 -6956 -10485 -12873 -11681 -6015 -7145 -11490 -5108 -878
15439 -878 420 -3707 -8150 -11509 -6169 5493 9371 480 -660 -1911 -10281 -14825 -10462 -11325 -10898
15424 -10898 -15913 -18471 -20716 -19415 -10184 -6954 -7119 -6376 740 5902 1903 -7268 -4024 -2691 -5604
15409 -5604 -1568 -3042 -9165 -7038 -4129 1261 -2772 -6601 -2628 -749 2189 1582 2833 5439 999
15394 999 -899 150 -3246 -481 6644 8628 7841 4662 3201 835 6157 5227 1037 1398 1418 2153
15378 2153 10533 5135 -726 252 7036 5544 6445 9561 9471 6711 6114 6342 8501 6433 1313 -3513
15362 -3513 -8320 -3388 7354 9146 7724 5799 3238 4751 11029 8415 6994 10624 6244 101
15348 101 -438 3375 908 392 -2173 -6979 -6451 -6286 -11234 -14687 -11424 -5592 -2285 4705 10747 8924
15332 8924 5724 2442 -361 1179 -5186 -8568 -4721 -1686 5891 7584 803 -2238 -1652 -4207 -7115
15317 -7115 -1756 704 366 5444 6907 5728 10581 10936 4485 271 5305 1215 -2904 1766 2761
15302 2761 1640 -290 701 159 -8937 -11852 -6856 -5391 -3292 -3114 478 1279 -4568 -9053 -8039 -10860
15286 -10860 -13581 -12574 -7040 -2136 6238 4943 7016 15608 27706 50429 56068 45136 35769 38543
15272 38543 39915 42405 50253 69712 102441 142022 158428 132230 88035 61881 47146 47562 52846
15259 52846 76534 109926 145784 149274 116333 73328 49929 38869 33044 30190 34348 37402 46468
15246 46468 55045 40543 18223 8726 5044 11413 14696 13459 8844 4985 2331 2218 2802 11354
15232 11354 12970 15940 11720 3538 4241 10071 16862 13028 171 -5290 -1453 3519 7545 10416
15218 10416 11881 14290 10676 8357 5284 3689 6171 9178 9885 9204 3051 2061 -2271 -8124 -6667
15203 -6667 -264 -243 -4129 -6030 -5730 -4469 -7535 -9390 -1109 -65 -4434 671 -1396 -957 -1307 -2208
15187 -2208 998 7845 5335 -10172 -10429 -9120 -17905 -10627 1649 -191 5262 4807 5540 9200 9864
15172 9864 16226 13472 8376 16503 26308 36432 42280 34671 18343 17575 23071 24850 43623 77258
15158 77258 110855 133203 121785 86006 54433 39974 34609 34394 47201 69932 100163 124224
15146 124224 111272 81217 50671 34324 25770 13439 14526 27824 45812 52753 44973 28717
15134 28717 16244 8094 6933 7101 2773 -6296 -10817 -5906 -2787 -782 4263 8909 11251 13272
15120 13272 17117 12400 3198 -8593 -4939 2712 2496 670 6690 663 -9336 -12596 -19628 -18073
15106 -18073 -9464 -1476 -3065 -4053 -9206 -2817 376 4719 4071 -1099 2957 7802 -1003 -7944 -12312
15091 -12312 -7667 -526 -2250 2924 4112 1408 -504 3530 1964 2996 -1122 -3723 -1780 4881
15077 4881 10985 13980 13164 15356 12494 5674 8309 16403 16245 22324 43915 62946 61779 45538
15063 45538 31437 19905 20408 37467 70953 118522 156680 141295 99884 67766 52203 56757
15051 56757 72113 91957 132452 165117 142338 88613 56193 47598 41890 41604 46450 55443 60995
15038 60995 49905 36858 24895 9468 2788 3221 4806 2405 4177 309 -1758 761 1980 4028
15024 4028 10402 17639 18967 14745 10611 6435 6051 7216 5926 6644 8424 9369 14803 8944 789
15009 789 5675 11570 11784 13260 11262 11669 12719 17076 34222 48777 48184 33211 26155 28905 23650
14994 23650 32526 59052 100295 135245 140685 101458 72732 60720 47409 49715 75458 112442
14982 112442 148342 151340 110732 70043 47729 36898 31843 33114 48077 58417 51846 33305
14970 33305 25251 14761 1435 -1175 4320 502 367 129 1208 1239 -8408 -14052 -9783 -7982 -4746
14955 -4746 4794 5761 1626 4982 4702 4898 4319 -308 -3876 2387 9366 10665 7902 4722 5219 3553
14939 3553 1286 3674 -6609 -11265 -3618 5060 1017 -3927 -5717 -5730 -3814 -2125 -2319 614 6193
14924 6193 3341 778 591 4740 14794 22098 15445 7966 646 -3736 -3124 -1755 -1056 -6414 -5048
14909 -5048 1587 1109 6670 6676 3187 -3192 -13011 -12443 -7248 -3218 315 -2481 -3568 1101 -2467 -4775
14893 -4775 -4746 -1850 -5763 -6872 -9401 -6948 -2798 -1071 -2081 -3627 -143 -792 -1685 -41 1949 1446
14877 1446 2376 -239 -5790 -27 -2057 -10302 -7347 -2003 -4319 -2715 -885 4602 3930 4762 7434
14862 7434 3571 -1458 4308 4351 -835 -3864 -114 2629 3618 9 -7246 -3653 -801 -1440 2983 7250
14846 7250 4767 -1566 3543 3287 -3924 -4832 1693 9291 12000 11311 12777 6083 7263 1005 -5703
14831 -5703 -7093 589 5677 5833 777 -1386 2941 -2008 -5167 1761 3736 5433 7835 6033 1494
14816 1494 -529 -5309 -11023 -13181 -8777 -3469 -612 4356 6663 5659 1652 -4365 -3150 -3079 -5228
14801 -5228 -7112 -7718 -6152 -3558 -5169 -4844 1223 -1848 -2454 -5616 -3968 -7171 -4462 -5427 -4273 -209
14785 -209 -1048 -10605 -16311 -22223 -27806 -23823 -24007 -16707 -13432 -10124 -9522 -11410 -11814 -16568 -13099 -9521
14769 -9521 -4740 -5965 -6072 -3393 -849 626 1316 5111 3725 2415 4094 1379 -2003 -657 5332
14754 5332 466 -1481 486 625 -121 -912 -706 -794 -733 -3429 1873 -4016 -9611 -5732 -4076 -3801 -2538
14737 -2538 -1491 2981 2938 1174 -725 -7202 -14164 -10313 -1674 -3136 -6183 -4035 124 4413 11007
14722 11007 7399 3965 -744 -1766 -1240 -4159 -11569 -9833 -5761 1504 -546 3729 4476 -1195 -3736
14707 -3736 -4121 29 7647 5444 -2196 -3940 -860 -5757 -13167 -10207 -2184 5005 -1470 -9798 -13328
14692 -13328 -17551 -15195 -11524 -3630 2769 2 -7053 -11978 -19116 -10147 -5868 -3872 -732 -765 -351
14677 -351 -6156 -4303 -3866 -10864 -4483 937 4746 13518 19165 10885 3036 3485 -136 3761 769
14662 769 -7974 -10814 -12680 -9756 -3183 748 5522 1436 -5564 -4898 -5592 -6356 2544 1375 3490 7345
14646 7345 12643 18634 8334 -4126 -4389 1902 -1377 -2812 1050 -1037 -5714 -8554 -3942 3176
14632 3176 2350 -1118 3316 -3214 -5846 -3908 -2861 -8244 -5937 -6657 -3399 -2212 -3737 -6173 -2538
14617 -2538 5047 -2943 -6382 -7298 -9562 -8321 -6882 -5256 -520 2163 2735 5561 12428 9054 2664
14602 2664 188 -3451 -739 -2616 -1593 -9356 -15593 -16855 -14044 -13177 -7892 -8864 -13555 -17927 -13614
14587 -13614 -7641 -5242 -88 -2564 -8654 -8865 -9676 -8716 -869 5339 12422 14584 9984 4260 1778
14572 1778 -2389 -2357 -11750 -15098 -13781 -7471 281 -2418 -3231 1447 -5143 -8237 -7698 -6213 -570 4537
14556 4537 3945 1425 -640 171 -4739 -11180 -15281 -10903 -4446 2883 4646 4807 3303 706 3960
14541 3960 2919 57 -2135 -5775 -4877 -6613 -12095 -7822 -8712 -10108 -5726 -6161 532 5329 -602
14526 -602 -2459 1876 3465 1256 1839 -2776 -4650 -9180 -7290 -4798 -901 895 4632 -2798 -5464
14511 -5464 -2887 1896 -3201 -13788 -13584 -8122 -8795 -17634 -15617 -2126 7295 -43 -5264 -8479 -11157
14496 -11157 -9869 -6844 -7035 -1340 -2134 -3697 -1323 1160 4588 862 -4459 4024 3975 3362 2414 2418 2313
14479 2313 5760 6039 1924 -772 -6838 -9756 -5547 -889 -1537 -5368 -6750 -4679 -5064 -11339 -20226
14464 -20226 -17283 -12384 -9900 -8261 -1594 -3671 -7508 -10660 -11060 -7479 -3449 -7559 -8464 -847 -3128
14449 -3128 -6182 -11941 -10580 -7969 -4307 9206 13621 4124 -2010 -6801 -6371 222 2753 198 -319
14434 -319 -924 -7723 -6872 -3364 -3532 -10780 -11970 -7650 -3960 -2744 -6098 -7292 -6902 -5415 -3177 -6151
14418 -6151 -1214 2552 2058 -1388 -5929 -7903 -5302 647 -2829 -5155 2330 6125 6604 4882 -629
14403 -629 -6244 -5974 -4470 -6820 -8720 -6628 -2677 -1770 -9594 -13745 -18366 -14803 -13635 -15859 -13012
14388 -13012 -8437 -5756 942 3582 -3421 -12613 -9261 -10565 -6917 -7218 -6285 -2722 -6940 -4662 4927
14373 4927 3939 -3335 -1604 -6644 -18188 -19410 -11104 -5736 -2172 1409 32 909 2486 -863 -3850
14358 -3850 -1499 4174 12526 8732 5006 656 3525 2862 -1377 -2594 -1880 914 752 1830 113
14343 113 -1903 2401 202 -277 -421 -4490 -10204 -8750 -1010 3582 3409 8712 7410 8599 8718 15342
14327 15342 13134 -769 -6908 -6123 -5054 2117 -4441 -3149 -6901 -12501 -11273 -10295 -6185 -1747 -543
14312 -543 -1218 1412 -3432 -4492 -539 -3051 -2001 5300 9114 9706 7317 11208 11573 1627 3813 2679
14296 2679 7147 9697 9767 4566 2375 -3766 -7733 -11635 -6176 5591 3558 -145 -2244 -11866 -14229
14281 -14229 -12716 -13722 -6449 -4986 125 981 1041 -4713 -5116 -5691 -6219 -5755 -7463 -5343 -1124 -6015
14265 -6015 -6376 -3073 563 -4098 -8408 -7125 -1913 -2252 -4382 -1555 -1197 -4324 -8385 -2909 -2919 -2209
14249 -2209 692 5648 1421 -1837 -686 1604 722 5940 5405 2664 2732 5358 2331 -2504 -3301 -4149
14233 -4149 -4422 -5481 -5171 -3201 1363 937 -1431 -3408 -4909 -4734 -4439 -9386 -6222 -4224 -6780 -94
14217 -94 6900 3796 -650 -7294 -9652 -3300 -1550 -2520 -1046 4543 5799 -1474 -1344 4026 5145 7379
14201 7379 7817 4971 279 -1169 -2631 -3011 -1390 -2096 3956 11578 14255 14042 7033 -1773 -876 105
14185 105 908 2695 3446 4226 5605 2569 -3395 -10450 -11186 -5951 1356 -5949 -11444 -4751 54 2299
14169 2299 -3437 -7376 -4663 -7066 -5168 -7414 -4671 7950 20659 7877 -1738 955 -10111 -12467
14155 -12467 -10068 -8799 -15083 -18988 -18315 -7225 -3170 4572 9642 6812 1631 900 -2891 -6328 -4855
14140 -4855 -3573 -3062 1887 1408 -4933 -9923 -7183 229 1073 -3083 171 1087 -3187 -7361 -5188 -787
14124 -787 698 -1304 201 4778 3817 5381 5043 999 1707 2094 2477 -615 -4234 -1748 -5863 -7543
14108 -7543 -3056 -4323 -9132 -10195 -6122 -5023 -6480 -966 2439 -2624 -7658 -8257 -1260 4077 1336
14093 1336 2742 -59 -2298 4613 5188 6077 11117 9560 3838 5332 7504 6474 3235 -4509 -3373
14078 -3373 5076 10479 9426 3592 948 -4552 4377 5083 21 -5098 -11619 -14112 -14156 -13233 -14865 -11932
14062 -11932 -13721 -5424 6063 4115 4593 7009 2643 3894 1020 -2757 -3103 -6016 -3707 6514
14048 6514 11546 12912 10234 -27 -3687 -7115 -7996 -10630 -9415 -8084 -3568 -1252 -6502 -8964 -5642
14033 -5642 -1615 1689 7821 2130 665 -5393 -9519 -2714 3948 4387 -288 -1854 -3039 -792 -226
14018 -226 -2270 -1390 -1777 -5260 -2245 637 3455 8229 5165 1365 2088 5436 -1338 -2676 -10569 -10247
14002 -10247 -9773 -6686 -5779 -2123 -700 -1521 -485 4324 8084 2926 6184 7905 -2122 282 4332
13987 4332 4918 -342 1091 4670 3271 -1590 -3305 83 3698 10135 11722 6868 8460 6356 7030
13972 7030 9001 12906 15867 15744 14279 20855 25766 22184 18648 16518 14454 13197 14998 13708 5727
13957 5727 -2890 -3721 -5047 -8803 -8301 -8942 -4946 -486 10901 13555 14676 11037 4644 3107 481
13942 481 -2873 -200 5637 9318 7663 8967 8118 3117 3202 9475 12685 -1142 -8041 -1227 1876
13927 1876 2958 3542 3127 3162 7960 13486 13651 10151 19781 26876 25861 35940 58842 103801 143510
13912 143510 160319 167546 143817 116634 101967 107407 131518 186718 261593 320427 334795 302726
13900 302726 237889 180069 138254 116409 110029 121998 154012 180471 177967 142918 103715 73888
13888 73888 54011 48989 52908 52422 57148 60880 70614 103557 145694 184423 191615 164566 128753
13875 128753 106755 104919 119818 162517 226610 293768 329789 309241 248008 172715 122334 105503
13863 105503 106046 108942 135546 171358 179011 151653 111400 79199 48475 36734 36384 28231 22638
13850 22638 20435 17545 14880 11300 147 -7175 -9509 -3293 662 -449 -671 633 -2555 -1756 754
13835 754 248 1608 -195 9263 15106 17790 10644 2843 -724 -8982 -5992 899 7968 14455 14943
13820 14943 14961 7019 2387 4528 4134 3299 -1551 -5341 -6336 -2670 -1246 -557 -5289 -8456 -3794 730
13804 730 -235 -193 -1798 -546 -3545 -5952 -4438 -8470 -2917 -2522 -9156 -13123 -14567 -6368 7297 13463
13788 13463 8275 2710 5920 3962 8359 15695 14246 8698 2586 9690 12507 5781 8048 9013 6009
13773 6009 854 -2533 1253 4703 11867 8621 -4636 -681 8006 1639 -1551 -1559 -7060 -10993 -11796
13758 -11796 -12574 -15070 -13442 -7747 -615 4863 7594 3359 6456 14801 9631 9839 -492 -10700
13744 -10700 -10318 -8436 -3874 -6842 -9482 -9769 359 6462 -4840 -7690 -8082 -9799 -4877 -10 2807
13729 2807 2201 -4088 -6615 -10775 -8537 -6554 -6149 -1911 -5372 -9422 -3982 1348 1651 7103 8718
13714 8718 11652 18220 14237 6819 602 1521 2598 3165 864 -6715 -1967 1614 -164 -6831 -12042
13699 -12042 -14511 -7930 -1082 -722 2319 -3279 -12260 -5037 4498 12482 16366 13798 7454 -256 -2830
13684 -2830 -2646 -2536 3270 459 6565 7945 4965 3126 3450 -3586 -9714 -9437 -16515 -9652 -10821 -9946
13668 -9946 -3382 7191 6889 4004 2502 3396 2557 1724 4216 5530 7164 3493 -865 -3834 -4627 -3503
13652 -3503 -1030 -5869 -6022 -4338 -6587 -906 -323 -3534 -7644 -9697 -8550 -5442 -3604 6457 5304
13637 5304 -1324 1802 4629 6161 6842 7995 5780 5868 4763 -251 1479 4726 4529 362 -146 -964
13621 -964 1211 6883 4109 4843 6174 8468 10185 14478 10898 8116 5113 5042 -390 -1124 1281 -830
13605 -830 -840 430 9003 5384 5404 4859 -3265 -2867 -2649 -2862 2011 4733 4370 4124 -92 -1323 4907
13588 4907 8609 4088 4241 7142 6980 468 -5597 -2418 729 -6101 -3215 1600 4441 -3040 -1297
13573 -1297 4002 6444 9106 -2187 -2231 3420 6478 7553 10075 11240 8912 5278 6921 9393 9562
13558 9562 13514 18890 23533 24968 25238 23292 35190 48430 56479 71087 95354 114636 131678
13545 131678 130289 128908 117659 91916 69041 55570 47089 46246 40392 30906 26354 21592 20826 16034
13531 16034 9782 17041 16563 17162 16206 19022 14981 15031 18337 24028 18883 15208 13069 15527 14305 16822
13515 16822 23708 33613 49481 61526 69905 79177 102878 142118 183891 229749 261007 268937 252601
13502 252601 209898 166941 133850 102047 78151 58473 50661 48950 40250 30569 28288 32232 27292
13489 27292 22017 19346 25261 28316 25679 13549 8187 13149 12129 11639 14016 19124 16945 21020
13475 21020 25105 25194 30562 23896 24376 33893 43004 58697 83164 103161 119968 129271 130638 124031
13461 124031 104362 81697 64647 53421 46418 42058 36334 26426 15665 12446 15368 19797 25075
13448 25075 27415 26162 21324 19583 22657 21925 20134 11539 8610 3973 -2337 -2478 -3520 -2932 1436
13433 1436 434 7558 10931 7012 2118 2606 4887 3032 5894 4758 -1122 -2537 934 8452 5178
13418 5178 1348 7241 -408 -5132 -5680 -925 6332 8791 9836 14282 10507 13302 15966 27100 26061
13403 26061 16770 9386 8989 9884 8582 6120 172 607 -4418 -11253 -10569 -4622 -1198 -813 -2038 -633
13387 -633 -6873 -5635 501 -5455 -4516 -2253 -1338 -5804 -8538 -3614 -6912 -7222 624 -3059 4562 1935
13371 1935 1615 1409 -1312 1326 6288 8582 7815 6777 4962 10030 11596 8332 12836 11857 4498 -658
13355 -658 -5219 -438 1096 5492 10211 16798 20268 16905 16486 10185 461 4107 -1464 -1320 1737
13340 1737 3255 7968 4151 -235 4780 11884 8024 5124 5133 7998 12820 11398 11538 11299 2133 6672
13324 6672 15541 23298 20961 17921 11462 6434 6909 13553 14861 12224 11634 11500 19962 19925 20400 24824
13308 24824 33808 42390 38693 29883 23850 18763 18976 14599 14105 12634 8025 5353 7848 6955 6100
13293 6100 7749 10083 9211 5932 9472 16002 14309 11868 19889 19988 23483 28084 27022 29596 26372
13278 26372 24589 28603 22453 21652 23694 34867 44830 43278 39336 45317 49700 57856 66609 76344
13264 76344 77198 67878 57806 52340 43126 36377 34498 34091 30096 21983 20289 17356 26545 29783 27040
13249 27040 20643 15346 9383 8877 8869 16822 22373 27076 25733 25941 28707 28003 19773 17123 20741 23283
13233 23283 25277 24458 30406 33958 36474 40068 40961 59256 78133 105925 134620 155116 154051 135410
13219 135410 101911 79762 63760 56416 55087 48659 43086 44857 50077 56898 59045 58370 54433 49409
13205 49409 56681 60245 72645 91052 106787 112378 104154 91842 84123 79874 81650 80984 80127 89934
13191 89934 107509 140131 195191 263023 323730 333625 293334 240276 205260 190541 190603 190205 177589
13178 177589 158245 140068 125817 111615 101993 95766 94809 97606 99031 104405 111880 121062 128599
13165 128599 140975 155920 174051 207013 231494 236249 218239 195943 175655 154079 138026 130508
13153 130508 135684 149760 173317 205226 247519 295122 352416 422240 500132 628854 808508
13142 808508 979024 1023267 908718 716057 543285 424318 348852 305039 269607 248815
13132 248815 241907 232713 224074 226522 230350 232396 244968 257179 277988 313356 344981 370099 390647
13119 390647 402989 417717 436218 465133 501773 551500 621958 705716 813746 951194 1100828
13108 1100828 1279008 1495662 1743777 2044365 2420627 2917034 3641185 4731937 6414683
13099 6414683 8988398 12637838 17063137 21166416 23377039 22729888 19646557 15514858
13091 15514858 11637370 8639384 6547932 5139666 4178695 3503791 3017868 2658848 2395510
13082 2395510 2195232 2039877 1908355 1792798 1695302 1621667 1581373 1570220 1576982 1611960 1687185
13071 1687185 1803324 1963326 2168786 2412564 2690650 3022962 3459814 4054383 4867529
13062 4867529 5997472 7612725 10012733 13708017 19347550 27288820 36720037 45082574
13054 45082574 48866197 46229916 38572750 29299585 21204519 15302243 11377351 8819752
13046 8819752 7110234 5923729 5043211 4388505 3882924 3469924 3117720 2802258 2521189
13037 2521189 2278459 2086918 1935283 1820423 1741723 1692198 1668811 1669750 1707476 1771560 1870162
13026 1870162 2010927 2191953 2442774 2790251 3264631 3926179 4878973 6300837 8440001
13017 8440001 11567520 15665418 20052907 23328913 24041686 21818834 17710403 13316354
13009 13316354 9707396 7143852 5427902 4280287 3489580 2920910 2494260 2162608 1893833
13000 1893833 1670999 1475377 1298420 1138500 1001235 895213 812127 736642 678175 630611
12990 630611 581888 537292 499037 468964 448881 429599 409830 399050 389663 378478 366868 353982
12978 353982 335402 314528 290538 270585 254776 238707 225663 214133 211167 201886 201653 204511
12966 204511 198889 187575 184916 189387 187103 183250 177143 168824 165607 162942 159579 153790 148352 153315
12952 153315 148148 150364 150929 149620 153444 154297 151010 154853 149792 150555 148315 144019 144926 145593 138557
12937 138557 123919 110525 106357 95830 84017 81667 82415 83268 87001 92409 102736 111145 117851
12924 117851 118394 111797 108153 93955 86897 89779 94907 93952 104242 100276 92588 99494 99455 96270 93939
12909 93939 93521 95315 91464 91915 88473 90588 98439 98072 82533 74298 68465 63212 68062 66116 61939
12894 61939 57968 53555 47477 50549 56450 65385 65853 66011 70693 68657 61613 48206 38256 42522 51756
12879 51756 49613 48034 46510 41845 45032 52086 56161 53190 50679 53914 51358 41778 41122 50969 52546
12864 52546 49290 47723 52362 55075 44708 41019 42538 38672 35582 34280 35073 39354 42193 41232 42220
12849 42220 42507 44105 40881 40907 40443 32243 31827 37833 36604 33169 25606 20471 21322 25191 22547 18336
12833 18336 24174 24480 28276 37440 55758 78852 92051 89141 77968 61735 47485 44209 38200
12820 38200 35626 37561 32711 32943 36651 31513 29742 34166 42446 46821 45939 41505 36689 41528 41822
12805 41822 38983 37632 39729 40926 38983 29864 24977 18195 22128 29795 30768 33693 31791 28229 33954
12790 33954 31981 24943 20740 23464 33320 44741 58233 74922 81776 63401 45204 35327 24567
12777 24567 22197 23871 28732 38100 38504 30927 28258 23395 20771 17526 20038 20163 27856 31430 29723
12762 29723 33078 28378 18744 15519 13111 16704 21374 19785 21298 22878 23894 24676 20103 16622 18364
12747 18364 18951 18361 22258 27864 23594 27685 33960 31316 33101 36489 32373 28439 36091 43550 54204
12732 54204 71097 111721 173614 267650 415862 532931 500886 349017 207471 125884 89990
12721 89990 75120 60630 52149 48344 45363 39934 35457 30661 26727 24417 22826 26750 23481 18833
12707 18833 13779 7073 7720 9277 9080 10524 11223 17377 18894 20901 20298 15866 14602 14467 10891 11364
12691 11364 15188 16736 14206 12411 12418 11361 11413 3998 5643 4786 9774 20357 15122 2360 1549 5805
12675 5805 11227 12494 15465 17358 23083 32211 33826 26461 22480 17527 9430 1175 2341 17101
12661 17101 24639 19074 15441 15889 8973 9334 20465 19906 14299 15984 22518 19806 22676 25170 27070
12646 27070 28341 34081 35492 36545 41467 48154 60779 70749 92549 112359 119097 122922 108002
12633 108002 90039 75075 61845 59081 48539 40630 43127 41989 33193 28978 26521 20495 21559
12620 21559 30318 31898 45534 50161 44848 41585 32035 28751 24825 20825 20011 22332 23415 31728
12606 31728 31690 24284 24110 37281 48693 66500 83295 112485 155071 191935 225929 238362 231005
12593 231005 200973 162857 116006 89350 70617 59539 57253 51108 41416 33345 32384 35160 33326
12580 33326 27151 18988 14332 15206 17988 17167 12214 15974 21963 16510 11406 6062 9281 11424 13288
12565 13288 18050 18009 16497 15286 25712 41106 54245 72459 88351 110003 124820 122657 112757
12552 112757 98343 75330 57376 51620 43252 40968 36315 33222 30947 29088 28312 21381 13155 11999
12538 11999 12708 6824 6509 9665 9830 6861 3644 -1783 1107 8713 15191 22270 24734 27165 23076
12523 23076 16070 18741 23307 17178 11218 17674 13106 3452 592 7348 14750 10263 7462 13536
12509 13536 14644 8970 1512 -1121 366 69 1515 8231 9012 2700 4918 6340 5236 1472 706
12494 706 5208 9700 13342 14802 11621 3617 -1770 1339 9209 10192 -2965 -3042 7006 15010 16955
12479 16955 15120 9559 6743 3126 -520 469 4019 5575 1444 2033 2471 5812 11452 9033 8108
12464 8108 13886 8600 -1994 -7732 -3662 1006 1810 -1649 4152 4549 4067 4161 1612 2665 5323 8145
12448 8145 5909 -2114 -3293 2136 2692 2727 3226 293 -148 9350 8572 2104 10191 12684 7608 6128
12432 6128 2698 2638 9935 11127 13308 10948 3570 9097 11503 2955 -3352 678 660 -8152 -12204 -13585
12416 -13585 -13476 -2007 4178 4654 4350 10430 10847 9966 8529 10005 8058 4680 2334 4055 6950
12401 6950 5280 6697 11195 18591 17897 10621 9873 6569 4525 4111 4750 9790 13220 9131 14967 12151
12385 12151 663 -1065 4658 9189 12519 17843 14946 11584 9339 9245 9214 5147 -14 -5885 -5883 -1851
12369 -1851 -2539 4677 8506 15603 13442 12977 13388 11956 12134 11806 5608 3487 4666 8697 10663 4697
12353 4697 200 3696 6907 615 -1450 -4425 -3042 -2494 -1253 1866 5894 3570 -367 3445 3017
12338 3017 -266 -289 732 -3220 -1725 3530 9687 17652 24201 21117 13450 9862 5989 3514 7481
12323 7481 5153 -1014 2683 4701 -97 -2004 2020 2255 1363 -3515 -7941 -125 5059 -3107 -2863
12308 -2863 1518 6684 4594 6334 7097 7022 2809 239 -711 -2946 -2948 -960 1585 8365 8973 3540 -1158
12291 -1158 -4317 -5964 -1677 5266 4821 1502 -690 -565 -658 242 725 -2219 5873 9020 8250 6627
12275 6627 12292 15694 8473 703 -5461 -3089 2054 3214 8599 7214 2665 -2331 2197 2054 -702
12260 -702 2182 1643 2133 8618 223 -10911 -12401 -6588 -7341 -6879 -5420 -9550 -8037 -2817 -524 -967
12244 -967 -4642 -4405 -13460 -13544 -10173 -9977 -11517 -15127 -10830 267 3342 1536 1201 -7598 -7149 -2855
12228 -2855 6411 14314 12042 15435 14674 8306 6666 4361 7847 9234 1441 6411 9664 3236 -1834
12213 -1834 2440 7186 7927 12539 14292 6915 6660 3249 -1286 9554 9440 7669 7483 4740 2020
12198 2020 -3817 -866 1889 236 1602 1856 -4942 -8705 -3831 726 7641 12437 4451 -3052 -5051
12183 -5051 -11347 -16543 -16726 -12004 -10248 -7437 -8656 -5937 -1781 0 -2097 -3429 537 885 2816
12168 2816 6363 10323 13410 16876 27009 37932 32041 17404 9661 8218 11456 9745 6410 5466
12154 5466 13587 17522 18855 16213 18392 17343 10786 7953 6302 10961 6537 10473 12222 14138 12839
12139 12839 5926 4645 -1357 -3198 -556 1229 744 -396 4628 6923 2543 -5242 -4755 -6735 -6372
12124 -6372 -1846 4637 3007 6742 14489 15471 12632 6019 5453 8161 10189 6917 10369 15841 13672
12109 13672 11467 5801 1918 -1748 -9468 -13377 -9890 -3335 -1625 4825 5713 9572 8444 9831 6764
12094 6764 3152 4831 7217 7908 8937 4933 2198 865 1203 7815 14847 7416 -1030 -375 -487 897
12078 897 8816 15203 6908 5413 6499 893 3597 1919 6348 5247 -1037 3464 5970 5252 -718
12063 -718 -7157 -4962 -5665 -4665 -3536 -3420 2138 7619 6990 5383 4311 5882 12691 12581 7333 7642
12047 7642 12528 15072 15372 17548 23154 18445 12048 13667 14034 14589 8293 2741 2062 4449 5255 2399
12031 2399 6570 5698 4028 755 1503 2281 2033 3323 2943 -2323 -745 -481 1736 5133 1412 3163
12015 3163 1675 1044 8378 7556 6531 3267 -2343 -1562 -4956 -4410 229 8124 11450 2231 -431 3820
11999 3820 7016 3795 -70 3776 6326 3205 8120 4851 1749 454 -5582 -2579 783 2433 1299
11984 1299 7878 5437 3272 2704 3910 -910 5280 4617 1177 1555 8399 9688 7582 8822 3943
11969 3943 5139 11591 12388 8686 11419 12151 9334 14669 14993 11549 4490 4058 1438 -525 -280 -3696
11953 -3696 -1021 787 -1607 970 4711 -267 335 5822 4715 -3128 -11426 -8611 -10705 -4340 6416
11938 6416 14367 12853 7254 910 -6545 -1129 615 -57 -3891 -2914 386 3177 460 307 4902
11923 4902 3879 2080 -2206 -1439 -5242 -3880 1672 6040 8729 9885 12652 10631 7865 11491 17636
11908 17636 17298 12081 8208 7221 5941 7965 9015 9690 12700 10389 4718 6351 4723 3760 218
11893 218 1000 4791 7204 8251 13172 12395 4565 -4460 -1066 465 -3421 -1332 2607 3935 6254
11878 6254 10811 5431 3367 -2474 -228 -2108 3749 416 1575 5738 9595 9444 2622 2502 677
11863 677 -747 3877 7676 2279 -2754 -1856 -1990 -126 -3553 -5992 -6593 128 3820 4781 875 1030
11847 1030 301 2486 1241 -2833 -680 5564 11433 23497 22380 22743 20224 25225 27498 30091 29834
11832 29834 23997 25252 25629 25736 22008 17454 11605 10428 14730 13697 10614 5709 -412 2916 5647
11817 5647 8242 932 464 -1153 -3039 -5151 -11088 -11558 -4128 235 892 -4740 -8003 -3746 -4050 -8176
11801 -8176 -11566 -15262 -7126 -6084 -9569 -7804 -5671 -6274 -12712 -12700 -5737 -627 3033 583 2578
11786 2578 6121 4013 2068 8253 5634 -624 -2572 128 -2397 -8601 -14889 -9223 -11755 -18066 -23156
11771 -23156 -18554 -8182 -3282 -3278 -7616 -7703 1565 -134 761 3445 -34 -3707 2768 5863 6023 955
11755 955 -5290 -7667 -3034 2410 1314 -409 1808 12714 10564 3543 -1148 2165 72 -5822 -1475
11740 -1475 1010 -498 3451 2391 4687 8142 3447 6364 15664 9919 8403 10273 11271 11956 12200
11725 12200 7985 2147 -784 4378 6025 -33 -6936 740 5506 5745 7244 6485 3201 710 1246
11710 1246 9842 8206 -1228 1034 1126 4038 4808 1028 -949 -3247 -3307 1652 -1161 -1736 -2155 -2830 5663
11693 5663 3838 -2835 -10607 -12893 -6042 1883 5670 3027 1740 2049 2865 3180 -2597 -15994 -26379
11678 -26379 -17793 -6692 -5524 -4030 -314 -2145 -3080 -1303 3641 2488 3232 6896 5582 -5134
11664 -5134 -7313 -4104 -6146 -4122 -2212 -4893 -3839 -1909 -2710 -6968 -6983 -5872 814 3153 -400
11649 -400 4723 -744 -1022 709 -1343 1242 -5028 -6605 -12347 -15738 -15018 -9557 -913 -5161 -8937
11634 -8937 -2501 -6914 -1856 -1993 -7906 -7548 -8000 -9876 -1563 764 1497 1700 -7424 -9067 -7738 -9022
11618 -9022 -7996 -11488 -15384 -14640 -15496 -9282 3825 8713 3952 692 2083 7502 7763 463 -2108
11603 -2108 -633 157 -672 -150 3844 11485 12925 5417 2988 3066 -1806 -3028 -4024 -11906 -7897 -3111
11587 -3111 -3237 -3135 -399 1546 -302 1153 5085 4380 3656 1019 -6384 -6677 -4069 -2082 -3673 -1894
11571 -1894 -3841 -7195 -360 5958 5053 2021 -4949 -4701 -3864 -7198 -3265 -4569 -11979 -15781 -12945
11556 -12945 -3899 -4498 -3058 -606 -400 4267 6707 9551 6059 667 -5832 -10896 -7684 1566 -1996
11541 -1996 -6013 994 -530 1433 2475 5801 3901 919 -291 -4435 -7492 -1358 8489 11096 11259
11526 11259 6690 1476 2064 4180 1556 -1721 2396 -19 -3061 -3593 -5257 -3810 2080 1009 1705
11511 1705 -3735 -9129 -5857 1154 -1128 773 2927 4294 -1071 -8535 -13529 -11164 -6050 -13820 -7406
11496 -7406 2614 5738 1283 -2313 1547 6294 13003 19136 15342 8069 1980 925 -1344 5354
11482 5354 12170 13047 7389 -3033 -2137 4487 2942 4680 3952 -2798 -6803 -3468 1568 3708 4623
11467 4623 4929 321 1748 -4848 -6036 -2616 2030 -1768 -3067 3815 2586 1227 1098 -284 3840
11452 3840 14589 21601 21653 18056 17967 10950 9510 6465 -728 -2677 -1795 -8630 -3984 478 3867 1168
11436 1168 -1370 -3725 764 4028 1592 -2610 -2347 293 4250 10545 11894 6657 -4944 -6980 1365
11421 1365 4866 1892 -7226 -16822 -11515 -5280 -11442 -10388 -7705 -4813 -3431 -3368 -3912 -5176 -10043
11406 -10043 -11187 -7679 -1039 1272 -1693 -73 3030 5599 5457 3968 -3631 -3991 -3406 -3475 1772 659
11390 659 4196 7350 4750 -2242 -6260 -10693 -10109 -5968 108 359 -3650 -5129 -3604 -6751 -12431
11375 -12431 -15803 -9136 -10386 -13073 -15510 -13900 -6947 3407 5094 2162 3048 3380 -1264 4 -1055
11360 -1055 2031 461 539 -310 2454 2009 458 -1537 -1136 -514 -682 2958 2723 1511 2377 5610 8267
11343 8267 1490 -1815 8540 6913 7128 8990 12925 15542 14849 8072 6580 7300 4752 10835 9175
11328 9175 9604 4763 -1811 -11155 -18643 -19424 -12771 -4263 1259 6472 10989 7141 4848 3647 1263
11313 1263 3210 -622 404 48 977 9308 9313 6199 -1402 -3491 -5890 -5703 1062 10400 13630 10472
11297 10472 8027 8240 12108 17770 27264 32843 31498 37323 44426 47753 64467 88028 114483 161174
11283 161174 242796 383396 619357 949578 1223052 1295124 1289155 1237446 987580 641000
11273 641000 394860 251703 172631 139422 117292 94207 78189 61826 53717 53539 47973 33481
11261 33481 29554 32670 30650 15997 8995 13660 14022 16745 9169 3801 6460 21741 24300 15948
11247 15948 6224 4866 10441 17028 10933 7905 8983 13729 8168 6201 9132 12061 15558 10922
11233 10922 10313 13587 11137 9035 9631 10885 5791 4793 7088 9539 12459 14662 10394 10345 12454 26333
11217 26333 38070 32536 34276 39341 44539 50650 62851 58479 51852 64443 71255 75238 82683 96461
11203 96461 112214 124835 138854 150380 164163 182773 209935 237733 261240 277522 300544 321589
11191 321589 327781 326371 311212 283912 260212 235432 214293 191054 165728 146948 136667 127192
11179 127192 127635 118442 109181 99213 93077 98250 104621 106773 115399 134870 173293 236191 358978
11166 358978 586765 907557 1120839 1075687 993543 1068534 1124289 925626 610127 373750
11156 373750 248322 183075 143956 113317 93410 84491 74146 63704 48908 46597 46183 50440
11144 50440 43531 43218 43891 45683 38352 32040 29537 24252 21216 17430 17734 21925 18070 18552 19898
11129 19898 20249 17735 19273 21675 23323 22456 18440 11471 8497 8361 4702 1971 -6608 -6131 -2482
11114 -2482 -7047 -9024 -4548 -7476 -1763 6444 6500 29 -10315 -10359 -1820 -6721 -10037 -8815 -529
11099 -529 -5630 -6398 -7661 -9060 -2754 4454 6736 1562 -6081 -6950 -3313 519 7733 10150 9523 8875
11083 8875 1887 -6739 -4118 -4053 -497 1842 568 -1696 1352 5854 4214 2914 2121 -2406 2786
11068 2786 -4462 -3159 3532 7266 7113 7149 1733 -2446 -2022 -2816 -5954 -5864 -6240 -3433 -2140 -2855 -5067
11051 -5067 -10272 -15023 -15042 -14861 -7420 -2129 -3111 -1611 5091 9746 4092 6259 5398 5106 10603 4414
11035 4414 6143 12524 7726 4781 2881 2815 4990 5504 -1573 2048 6213 7367 7697 6606 6049 6178
11019 6178 3730 1536 -115 -4 -1738 3439 9167 6570 -4422 -9416 -8478 -5034 -9931 -2103 4588
11004 4588 7604 4894 1472 -1874 877 406 851 1701 2229 8660 8599 665 -3314 -2175 -7028 -3129
10988 -3129 -1174 -3399 -8980 -12858 -8147 -6789 2702 8034 5902 3708 4953 3675 2069 218 740
10973 740 3579 3324 5146 1633 -4757 -3373 -2243 -4189 -4845 -1617 678 -4913 -6969 -1302 6180
10958 6180 10226 11877 18579 27459 38707 49179 61243 78146 93990 104758 104759 98482 79758 53530
10944 53530 40315 35857 22382 10465 12970 11540 14012 17462 15947 14582 11346 12568 13585 10963
10930 10963 2095 9 -3330 -12686 -11686 -6654 -900 5428 5420 7307 11343 14040 18643 15876 18419
10915 18419 18316 21369 25522 28074 36163 48389 70179 97196 127017 149432 159364 164375 161742
10902 161742 142956 127574 113395 101231 88467 70021 54381 40992 33510 34752 31244 26657
10890 26657 26986 24288 18018 20342 20912 22473 22395 23581 23960 19680 12471 2434 -1196 -440 1664 3970
10874 3970 5505 4585 5557 12508 17413 20288 16428 8303 4431 3554 15742 35316 56572 80020
10860 80020 103663 121274 129612 127779 117690 97080 81430 71155 59002 43945 32354 20904
10848 20904 12474 3893 5920 5910 4121 13307 15939 18486 19137 23128 22417 19276 12379 1444 -3051
10833 -3051 1808 1452 -5001 -10387 -1623 -1522 -8090 -5708 1988 6759 7149 -1709 -4696 5021 5510 11146
10817 11146 18888 12751 4725 3535 9138 8601 12824 8477 10876 18903 22076 11753 10100 3127
10803 3127 4362 9100 6483 8688 11278 10561 14004 16818 23468 26371 23154 16757 15419 13189 10457
10788 10457 15757 23570 21941 20615 21040 14622 10186 5768 -2610 -2363 -7246 -4372 -7080 -1191 4472
10773 4472 3290 3420 -2355 -8963 -3849 6925 10355 12420 9426 4772 2356 6643 10680 8813 6512
10758 6512 7484 13052 15536 15709 15477 15792 13260 9104 4817 1620 2747 9063 13980 23608 30432 19708
10742 19708 18123 16212 6253 -579 -4588 -1988 1053 1917 2187 1446 4382 1883 1681 4126 12379
10727 12379 15818 14595 8809 5419 6084 -890 536 5009 9601 13780 10362 5484 6909 10871 13007
10712 13007 13049 10521 9223 5947 7980 13143 8823 11977 5535 -1252 -1892 3803 7496 12439 15372
10697 15372 6606 3831 11730 11321 15398 17470 9932 3036 -412 3558 14772 9776 6370 7920
10683 7920 9531 10127 6362 3580 -3683 -3425 1042 2524 -1759 -7719 -2017 -477 -6233 -1738 8970
10668 8970 10747 11200 13825 19626 22188 29979 38931 44854 46051 48273 48697 49691 43522 38973 33902
10653 33902 36375 40125 42153 41222 47598 53038 52278 46963 46427 45532 42935 37792 38856 41238 34377
10638 34377 31818 37185 36329 32876 30073 19521 16113 31276 41562 36375 30021 35291 35414 37793
10624 37793 36197 34940 42175 49130 58489 73776 75307 73574 67299 63560 68356 69755 73063 81103
10610 81103 88423 92106 98052 102496 108694 113651 121448 136277 143820 150111 173094 196604 227449
10597 227449 275738 350253 460818 606382 790978 1004463 1210674 1352943 1394826 1340932
10587 1340932 1198493 1000619 800862 635953 495928 393058 320409 271746 243875 225758
10577 225758 223404 214954 210847 218309 225436 239632 257426 276175 294108 303150 305945 303102 300778
10564 300778 301726 312364 328336 339636 353579 375368 398963 421890 458036 505754 572619 658569
10552 658569 748248 860533 987985 1116542 1263995 1449197 1675893 1993421 2452803 3131962
10542 3131962 4142830 5633740 7721322 10359552 13238109 15783331 17383882 17685709
10534 17685709 16655176 14592381 12007912 9443349 7276897 5627389 4444273 3630011
10526 3630011 3085534 2714857 2448872 2246187 2081894 1945981 1827484 1717599 1624431 1546665
10516 1546665 1482325 1439493 1429514 1443065 1497006 1602857 1770576 2018535 2376624 2854566
10506 2854566 3425893 4028828 4568834 4946959 5161933 5326008 5617309 6225465 7375260
10497 7375260 9320691 12333131 16525567 21623339 26708057 30388202 31525861 29993745
10489 29993745 26768424 23259003 20496212 18680246 17345774 15839219 13865568 11591826
10481 11591826 9415763 7657266 6409703 5630139 5239422 5133586 5185742 5225347 5050662
10472 5050662 4587261 3942438 3293005 2751715 2350525 2065948 1870857 1745347 1671427 1644917
10462 1644917 1668151 1730324 1816088 1924413 2043819 2178797 2341605 2559343 2877718 3331826
10452 3331826 3987649 4970814 6455218 8618835 11564932 15145989 18828561 21763242
10444 21763242 23137671 22565227 20267583 16914165 13327175 10146797 7658683 5864226
10436 5864226 4630733 3768437 3170655 2759850 2457418 2216612 2012212 1827856 1671336
10427 1671336 1552759 1444523 1311526 1150035 985888 847809 743517 648612 574646 518176
10417 518176 472616 439857 415988 391531 372795 358074 350153 337288 321085 308105 292351 278977
10405 278977 263459 251347 243404 236125 228983 219523 202905 202469 206966 198924 189895 189955 189130 183888
10391 183888 186183 191950 203824 197070 188996 175469 157490 152650 149132 143303 146499 158502 175378
10378 175378 196609 206930 209318 204921 191006 171720 164444 159610 154063 153185 153081 160501 162641 164012
10364 164012 153821 149700 149829 151522 150590 143628 137303 125576 118462 127475 144842 156547 162060 167908
10350 167908 173430 179882 192439 190794 182123 168168 145400 133842 129516 119420 120683 119804 106024
10337 106024 98614 101805 128816 165502 189701 211070 214287 219179 239602 265151 280204 284125
10325 284125 272817 246533 209537 177258 163659 166173 166184 164816 158245 142870 126610 111093 99306
10312 99306 98563 104962 103406 94074 83592 66470 56130 44552 32590 31607 39017 67128 111656
10299 111656 184714 276011 336335 354312 339891 311904 285507 268913 254336 251579 266754 288335
10287 288335 300571 314761 319283 318451 311281 296684 277766 267484 257426 243951 226194 221034
10275 221034 220382 224590 238918 248067 255184 256207 240850 215853 191045 187833 193772 189938 174558
10262 174558 169641 175191 178581 191852 208160 220069 224078 221332 221152 228024 237742 247142 253605 268565
10248 268565 280217 288346 289886 290672 296849 303679 314488 314883 313808 303703 311693 324350 334961
10235 334961 351714 356843 357741 356370 363179 371269 380036 406638 435267 458699 484914 528324 574790
10222 574790 617105 645029 661976 681403 715266 756640 792679 823704 855430 900015 949645
10211 949645 1008151 1075262 1129454 1160968 1188217 1239264 1317142 1418934 1550968 1726793 1965467
10200 1965467 2276668 2618704 2961116 3320920 3734056 4251918 4874718 5579841 6362926
10191 6362926 7258228 8278949 9363152 10318565 10928566 11309182 11869989 12949075 14774791
10182 14774791 17541915 21496188 27120616 35335421 47827291 67711538 100346174 152986180
10174 152986180 229461542 312810970 353637338 317526425 236046129 160153360 108562086
10167 108562086 76609241 56693337 43830298 35129455 28975842 24486445 21086809
10160 21086809 18450725 16461237 15060685 14099032 13338878 12416938 11175832 9816978
10152 9816978 8555940 7462412 6525259 5730191 5065133 4521760 4101695 3824731 3630620
10143 3630620 3447133 3261271 3081356 2906592 2743839 2606215 2481446 2382694 2339004 2361882
10133 2361882 2477619 2670982 2798514 2686189 2374689 2058690 1831064 1694980 1601318 1532094
10123 1532094 1487917 1478220 1513519 1614985 1788920 2013172 2151068 2059764 1800827 1535017
10113 1535017 1335734 1192369 1087488 1006019 949401 905436 869074 841070 815809 788168 745347
10102 745347 708047 674097 645378 622519 589613 566805 551632 543756 538199 537804 540507 557116
10090 557116 581946 607331 624942 639840 640929 623934 603540 589600 579988 577456 565720 564856
10078 564856 566657 570207 572946 572074 573872 578156 598389 629150 666167 714030 761698 770419 711671
10065 711671 620101 541192 487789 448629 404727 358751 332390 315706 303437 301665 297416 298919
10053 298919 311264 322564 299788 274216 267374 284475 346125 452568 558205 623261 650493
10042 650493 687439 755101 861197 1063027 1464721 2290044 3927566 6701689 7633845 5078290
10032 5078290 2825741 1770617 1276631 1009202 858536 769937 696377 639733 603834 572514
10022 572514 528843 471606 404035 351957 322746 307266 311563 325638 319311 297289 282471 272678
10010 272678 272620 269422 263976 259439 241531 223549 211085 199760 195439 184133 166655 145621 128923
9997 128923 108848 98843 102292 116860 126512 130945 134343 150558 171434 183153 179299 173190 171006
9984 171006 175211 179067 177481 178555 185221 185247 179828 172797 171116 165495 164316 169492 180586 187624 186370
9969 186370 179993 178356 193215 222884 272471 348568 448367 562412 622407 569663 457872 354992
9957 354992 269748 221346 199596 190691 181053 173924 166140 162899 153196 145478 141471 141914 150190 147141
9943 147141 133860 131911 132709 127610 121497 117595 118509 117457 121023 130368 134769 138739 142158 150087 147499
9928 147499 145570 146017 152331 142891 129880 128985 130846 144924 157394 156848 140845 125436 109796 103304
9914 103304 100344 98896 104055 99755 98718 103128 107474 103244 100459 98036 98380 109224 121428 129049
9900 129049 129864 127035 117919 118474 124066 121177 118184 121041 119264 112752 108106 104587 108037 109447 114157
9885 114157 123968 123912 119216 115709 114488 110748 107535 107381 105327 100922 105075 117551 126379 139477 139636
9870 139636 124432 100932 88837 89575 85038 80440 87275 99230 107345 117241 133166 135041 140061
9857 140061 149485 164789 180607 198140 206357 203589 202944 201252 209217 213495 233621 257279 280701
9844 280701 300907 320420 353399 400960 468537 587244 799197 1202940 1966970 3107566
9834 3107566 4061514 4021962 3062747 2010667 1358108 1044482 917432 877501 886079 948813
9824 948813 1074519 1269891 1559800 2002746 2640927 3499845 4490325 5346437 5849435 5994731
9814 5994731 5733308 4991626 3987906 3074261 2384373 1903340 1579910 1360502 1207727
9805 1207727 1104259 1023404 969799 934037 910848 905031 898380 882787 868241 862536 868940 899351
9793 899351 949380 1029166 1147034 1303501 1509446 1761090 2048465 2300552 2461779 2599233
9783 2599233 2845243 3280966 3983544 5087319 6774460 9206074 12219536 15019864 16611257
9774 16611257 16537177 15078081 13222899 11967421 11622931 11766113 11578139 10494434 8722185
9765 8722185 6924562 5510282 4523365 3857491 3433570 3178295 3045537 2999341 3000708 2948347
9755 2948347 2826514 2727714 2736531 2856136 3058219 3319934 3603713 3901609 4225219 4481433
9745 4481433 4470267 4209984 3966094 3935267 4165339 4686567 5567693 6950305 9000726 11665191
9735 11665191 14225182 15504912 15333481 14817993 14927138 16171971 18417987 20692628 21650556
9726 21650556 20438305 17652863 14618160 11995008 9798088 7972312 6568821 5596356
9718 5596356 5004250 4716586 4541399 4215510 3703986 3202071 2821718 2547221 2351229 2219368
9708 2219368 2162940 2185779 2270888 2352683 2324128 2223354 2146655 2135447 2220120 2395871 2673425
9697 2673425 3101681 3719702 4478153 5185804 5607800 5868638 6354334 7337054 8864990
9688 8864990 10814484 12902603 14645395 15359489 14827664 13604257 12023782 10009609 7866211
9679 7866211 6078393 4806604 3966286 3427291 3053107 2712478 2357126 2034018 1779656
9670 1779656 1591289 1433709 1306307 1199702 1100255 1003830 920866 861363 824883 791760 763480
9659 763480 756897 758187 751300 764225 786681 815490 865349 944975 1056464 1214958 1444878 1790166
9647 1790166 2282067 2929611 3636243 4201621 4478279 4494954 4237272 3637474 2862058 2172305
9637 2172305 1655655 1300145 1057768 892876 770432 681557 616632 558876 518628 488331
9627 488331 462275 427278 397539 366424 333219 301808 276193 266647 257962 243618 230238 217817
9615 217817 213513 212577 206081 201843 190855 178786 173801 169678 168348 172058 169706 158600 149718 146323
9601 146323 155989 152807 157249 164590 159764 157386 151505 143635 134471 128662 126811 128614 121993 116187
9587 116187 113984 116121 117192 110154 106393 111433 114042 110720 107408 105850 105975 107718 100651 90081
9573 90081 96530 102277 97108 97155 106676 115577 118688 117977 115599 106749 106487 110540 116663 118006 127105 136750
9557 136750 139708 134995 132891 128609 124197 121009 114860 116316 115928 114176 111344 107141 110472 106834 95428
9542 95428 82669 87309 84095 79697 75404 70719 68892 67233 70543 69782 72114 71759 74878 77962 73692
9527 73692 67158 68551 66428 71265 80410 80786 91882 98182 94931 102738 111124 108923 104774 101613 94866
9512 94866 94408 93284 100293 111307 120243 118360 119902 126063 134596 135756 123505 111846 96351 92313
9498 92313 90633 90824 88893 85078 82645 78467 79805 86341 84245 81549 87431 83419 77692 75603 67007
9483 67007 63420 62225 61631 70306 72009 75590 82435 87875 89887 87131 84370 87974 91495 86880 85114
9468 85114 79689 83733 96962 108060 114639 118842 111726 102199 85847 87841 92674 90489 89399 86764
9454 86764 83917 88309 89665 85344 85445 80821 78669 78162 64553 61463 60840 55643 55242 61761 66307
9439 66307 68890 68595 72804 73033 83114 83753 82854 72309 64398 64902 68974 68273 62331 70709 73619 79921
9423 79921 83848 88190 90145 88951 80733 71985 67418 69893 71381 81803 101227 107922 107788 109549
9409 109549 113049 110416 100852 92934 83907 70727 67774 67522 70002 65831 62790 63717 63305 59388 58699
9394 58699 50359 53560 60538 66620 72275 77229 77783 81401 77569 75652 74777 73288 64915 56563 54388
9379 54388 50740 53298 61102 67976 69082 83758 103545 126224 142640 150420 148384 134005 121665
9366 121665 113706 112651 108655 93209 88784 78915 75378 66716 66459 61956 52934 48436 47971 51612 52748
9351 52748 52777 56856 59499 62898 67375 63552 62554 65524 68468 71914 68547 65995 64258 65540 65981 70331
9335 70331 76163 76719 82678 90246 98820 112786 117015 118168 116874 126804 141243 142162 138717 133911 122902
9320 122902 108085 91834 85518 72995 61619 54152 53079 56310 55657 54148 61015 61333 61227 55832
9306 55832 52549 52039 52570 56673 61600 58578 53756 43357 39937 40862 40277 42895 44513 47311 54951
9291 54951 58121 59772 63713 66273 71134 79410 88209 90254 95664 104366 111692 111602 98390 85740 81983
9276 81983 75076 63477 54196 51151 48594 46839 43078 47466 49566 47061 37810 28353 27702 31960 34216
9261 34216 38567 36578 35108 38627 40125 38518 36425 32452 34723 39801 37851 42248 47902 54901 56111
9246 56111 54673 57043 54210 52909 50346 48301 49590 52460 53651 51028 45290 42113 41875 37515 34444
9231 34444 30912 26456 28695 32228 36837 30141 27198 22135 18651 24685 23020 19027 27744 30641 25639
9216 25639 15329 14295 17432 28509 31107 27664 27370 35180 33551 28513 22780 16422 16366 16467 15816
9201 15816 26376 23218 14982 14384 28688 29889 31947 29681 28036 27679 31173 29750 25144 19658 15366
9186 15366 19589 29156 30864 32363 35734 28524 24605 25397 22793 22207 16046 18543 24177 30408 32358
9171 32358 30159 27916 18566 17290 22910 24873 21984 20106 21385 22452 20461 25196 23298 18984 20105
9156 20105 16695 14139 17712 18483 16984 13655 18144 22777 21433 18512 14299 14487 11245 22730 32822
9141 32822 31010 26941 31436 24831 22474 20371 19959 23242 27991 26529 17827 14951 19654 24543 31174
9126 31174 28948 26638 26025 24250 21320 17494 19197 19092 24678 30017 29042 28629 33110 33851 32401 27501
9110 27501 21603 25674 28771 25606 25506 27403 30335 31209 26331 26259 24317 22751 17858 18035 27166 27179
9094 27179 14845 10479 9160 14004 15628 18303 17491 19274 19121 17552 17496 20248 21873 18912 15409
9079 15409 21868 21055 20958 22007 18719 17820 19727 20710 17252 15631 11356 5863 4418 12304 20481 18579
9063 18579 18027 24069 28257 26221 30379 34661 26842 18680 11771 8525 5626 5578 7803 14454 13310
9048 13310 3254 -2843 4780 16142 20173 20920 25481 22867 21902 24649 29879 35327 34999 29588 22394
9033 22394 20998 32252 37856 31482 26237 22390 16648 19798 22739 20091 23276 25397 26447 27282 31406
9018 31406 28716 29007 25795 15460 5900 5388 5985 10924 13385 9291 8127 10400 7188 8807 16918
9003 16918 20057 20388 20010 16866 19564 20580 19822 25460 17695 13109 15432 19469 24907 22868 25768
8988 25768 33696 41963 46368 40217 35707 24734 17007 20648 24815 26503 24240 22663 22139 27345 29361
8973 29361 31529 25256 19032 25030 20453 14591 19664 20867 14951 16442 20991 18651 18064 9524 2575
8958 2575 4750 5295 9682 5730 6609 10677 17702 23154 25796 26110 29308 33302 33641 38282 44347 43931
8942 43931 38658 38747 38010 31629 17975 11071 7500 10250 13056 11451 10426 12767 9811 6645 6077
8927 6077 8488 8300 11425 16193 20959 27628 26346 24334 18501 16457 21196 22721 22977 21401 17489
8912 17489 21058 16155 11933 16886 24968 28237 28440 31819 31535 30052 30247 35248 44192 47643 45071
8897 45071 34581 26251 26264 24784 24810 25892 24626 24821 28479 28143 26087 27161 29791 27748 29303 28159
8881 28159 26780 23276 22744 20051 23249 25393 22325 21313 22353 21039 19147 19921 24215 23174 19346
8866 19346 13417 21555 24704 28610 42917 56692 58600 46170 37583 33798 27205 20901 13222 10245
8852 10245 5225 5348 8090 10069 12849 16851 18424 15142 17118 26171 28486 32437 28710 28362 26987
8837 26987 30647 33410 24813 20237 24406 28658 25650 21569 14507 10957 11921 13594 7319 6626 13423
8822 13423 11350 12184 15894 20537 24146 22693 19892 13308 15553 22825 22686 21659 19792 15197 11898
8807 11898 15967 17440 19870 23926 23924 21687 14953 10209 8141 11635 15116 24767 27902 24400 14908
8792 14908 9689 9135 11647 13200 16647 18808 13284 14322 19130 18055 20925 18563 17266 18199 21489
8777 21489 23862 21729 20142 20008 20823 12582 10926 16173 22921 19462 17849 21996 26730 24703 20339
8762 20339 16898 15593 16008 14514 19575 21696 18984 19993 18390 19562 21568 18508 14278 16958 22037
8747 22037 20683 15914 18346 20764 25573 23134 17984 24717 32914 29026 16037 10144 14568 21735
8733 21735 23640 21298 20848 25430 27208 27931 23760 25591 31556 32290 28652 24552 16758 21144 28166
8718 28166 28657 30472 32389 28551 27553 24004 22028 24255 30936 32359 29578 23757 19956 17516 20380
8703 20380 21844 15591 10588 14677 29748 29018 25992 28241 31651 38214 36289 26945 21534 15714 10937
8688 10937 15694 23853 29099 29541 27230 29105 25616 17558 14097 20799 23919 24580 26100 28138 26518
8673 26518 26650 29279 33115 35473 34936 33695 34408 43150 44450 47774 46380 39899 35303 35731 38334 41011
8657 41011 38287 34901 34166 34990 37743 40039 41279 48030 52289 54239 55576 52964 52511 55925 63630
8642 63630 78411 93720 99862 111335 138218 183805 269870 427828 709968 1044577 1063529
8631 1063529 742791 454662 301962 228898 183876 149857 128584 109810 96752 95299 100027
8620 100027 96304 89154 92835 97346 97888 99203 92275 81774 83822 87145 84846 81582 88653 88213 95988
8605 95988 99088 105036 113533 121417 131264 141237 146161 154484 177456 192121 213091 255466 310464
8592 310464 387467 533144 811448 1318859 2052905 2305770 1732066 1122220 779911 608834
8582 608834 516642 464264 429555 400437 372908 348166 313099 280728 258182 239291 221809 203648
8570 203648 185690 164087 147357 142372 132134 118568 110290 111908 109558 97635 92860 91524 87580
8557 87580 82794 85485 97870 99277 87986 83985 92882 105824 118991 142541 175311 233490 340938
8544 340938 546598 867191 1073452 884900 571734 362329 244874 179507 136116 110280
8534 110280 94152 82017 69451 67475 74164 74305 64778 67238 68776 67391 64848 63077 62448 58526
8520 58526 59796 60548 50665 40912 47242 51836 53667 55587 52206 50222 49009 37338 33301 35150 36120
8505 36120 32702 28280 25708 28272 42193 46715 41828 41766 40751 37561 33418 35516 38168 39754 32974
8490 32974 27964 33796 32210 32737 27839 28696 25957 29181 29331 27871 23045 20585 17114 14727 13717
8475 13717 19674 26877 23150 23483 22029 22263 23980 23374 21360 15629 17833 19385 20692 23756 21126
8460 21126 27631 35394 36174 33947 32351 35628 40653 38031 30383 27910 28863 28006 24142 29070 25740
8445 25740 12068 8617 11681 10891 16638 21880 19165 20910 28816 31030 29394 26493 27730 25482 25639
8430 25639 30003 28736 28222 19613 12038 11766 17910 19779 24814 22624 17064 23729 30586 27928 24931
8415 24931 22520 22213 26868 29658 18995 16504 13931 6468 7627 15129 18251 9736 4542 6609 6270
8400 6270 7792 13461 15413 11617 5025 11093 22911 16297 12802 16884 14005 12721 17775 21270 24630
8385 24630 26115 23971 20278 22513 29208 28561 17381 17099 22380 26018 19051 19210 23624 25264 26090
8370 26090 33799 32148 27608 23822 20498 20537 15714 23984 24531 29073 30241 23462 15539 16804 15846 10654
8354 10654 10887 15010 14532 12028 10486 15058 12267 13310 12448 14471 16280 19510 22051 24641 21461
8339 21461 28024 25474 21274 22744 21066 13124 16785 15308 10794 12307 16677 23688 28927 26907 29001
8324 29001 34605 39563 42423 32032 16328 9750 3838 6586 12528 16432 18812 17378 17006 10572
8310 10572 6927 9611 19283 23929 20945 15239 13439 20692 20914 17133 15291 8270 2297 2784 3844
8295 3844 6912 8541 7242 5603 8360 16554 19356 15900 10277 8788 12221 10513 13920 23583 31333
8280 31333 44312 52448 56327 53309 49726 47109 29388 18012 15259 18387 22465 27161 21866 15536
8266 15536 7309 2936 8412 9298 15041 15988 18061 19294 19014 12955 12112 12308 12581 10738 11963 16405
8250 16405 23166 18794 13394 12843 18362 16407 14588 16671 19267 28261 21454 15324 9819 13218 21815
8235 21815 29925 33478 38634 38377 33961 24697 16240 18295 15717 16715 19487 27202 26953 23811 15730
8220 15730 6613 5290 4403 4926 7742 12602 11194 9146 5942 4863 9903 12626 8361 11942 16425
8205 16425 11299 1217 -213 2058 11833 13210 14350 3541 -6738 -6319 -1139 -2439 3094 953
8191 953 1904 5413 10328 8922 13236 15942 15349 18190 23064 22802 22096 14189 15066 19842 15682 14096
8175 14096 11289 8957 8300 10679 7494 10101 12021 11722 10695 4912 696 1444 5592 8137 5940
8160 5940 14359 15540 17593 17607 13042 10256 19720 22000 21794 21603 15229 17127 19707 20328 18863 18130
8144 18130 21430 23295 23962 23723 25273 20459 18830 20559 16383 14517 17929 15957 14972 25528 34596
8129 34596 36773 46040 54923 72212 83854 78932 67520 55196 43775 34306 30083 31285 31813 29162
8115 29162 33545 32570 28005 25006 24866 23425 18555 13762 12807 12809 15924 20880 24137 25895 24714 27928
8099 27928 29262 28687 25467 17234 19985 20631 15491 15762 19230 24364 26359 25269 27287 31682 39400
8084 39400 52877 73011 78973 67161 50023 36481 31101 35325 32312 25461 22811 28517 32719
8071 32719 28264 26883 24682 18525 22092 22560 16901 20472 26176 26953 23087 15469 10962 14024 14767
8056 14767 10038 3288 4409 2798 5133 11775 13303 16943 26683 27105 26551 34971 33826 35018 31866
8041 31866 28984 28714 28745 31229 29928 27443 25482 21198 22400 30409 26857 25104 28748 34740 36342
8026 36342 41588 41650 40579 37834 36147 40422 39054 33883 27244 27823 32969 33378 38070 45565 51820 55611
8010 55611 66533 68761 58148 54878 61471 63386 65522 62384 60417 58625 60120 60234 62616 65121
7996 65121 69434 63033 69702 77809 94595 106367 112315 112908 102404 96150 99445 99472 92325 81556
7982 81556 71914 65720 65809 70425 71765 71573 75311 68911 62426 66364 68770 70780 69158 70687 76264
7967 76264 77415 77938 76441 72837 69615 65542 65030 61517 56580 57526 58761 58043 64074 69500 78994 90277
7951 90277 96444 103544 113600 124415 109646 88239 87689 94491 90407 75456 71347 68573 73124 69159
7937 69159 65882 66800 62079 54356 47785 50083 49421 38336 38629 42891 38278 38163 37235 41634 42481 33968
7921 33968 31851 38032 31531 30136 34089 30834 37845 45381 39904 42185 45971 46266 48012 42234 41983
7906 41983 42638 37156 30736 29543 37337 43767 45905 40476 33958 36525 32509 28881 29127 17867 19310
7891 19310 27676 25645 21623 18807 18646 18205 15299 19430 25326 15031 12811 17301 17588 19592 18891
7876 18891 15344 11559 9300 1661 -475 10039 15002 13038 10935 9737 6628 2943 6653 13415
7862 13415 18507 21079 23065 16931 10892 12077 12343 10921 16538 14845 8842 10801 12114 18164 18361
7847 18361 20941 21311 23066 16895 7871 14865 10219 9036 7896 933 -2892 -7337 -6465 -1404 2203
7832 2203 7236 7909 7186 15297 14172 18147 12849 5140 5729 10512 6001 2368 6846 9682 8860 2445
7816 2445 2788 207 -2709 -2923 3994 6117 3302 1216 3973 1094 3240 9621 6334 1032 2247
7801 2247 3765 6103 3674 4264 3232 4723 6463 12847 14427 11949 17228 18789 20690 16074 18312
7786 18312 16655 9752 11391 4595 2594 642 2142 4201 2281 4801 3905 -831 959 6521 1224
7771 1224 -4340 -3192 -2780 2118 4613 822 -2064 -2913 -3445 -826 1530 -1121 1129 4911 1174 -2640
7755 -2640 -3417 246 -5947 -8749 -3068 -557 -4032 -2435 -2337 -6361 -5789 -4986 7237 13243 9735 8168
7739 8168 9509 5896 4489 5759 -1364 -1612 4119 10772 6071 -2063 -5011 -11283 -11698 1768 13852
7724 13852 16346 12879 13208 10010 5679 6959 8573 4406 701 3022 11136 10800 3375 1058 3457
7709 3457 11045 11121 10612 7149 2419 -1078 -2023 902 5452 7985 6021 9304 15822 20892 17477 8250
7693 8250 -1206 -5184 3190 3565 7347 3316 2960 8237 11168 13530 3336 2410 8961 12711 13805
7678 13805 7603 12713 18819 12144 7294 8675 7135 3072 2150 -832 848 -1268 -2206 2481 -1034
7663 -1034 -2148 -4610 -7201 -6454 -3761 -3023 1761 3877 -2341 -3802 -6874 -2454 -2674 -8522 -6785 -7165
7647 -7165 -4995 -7150 -7638 -11558 -5484 1589 7216 5183 6754 9008 11676 9368 6003 10955 11003 8740
7631 8740 17718 14406 11684 8098 2734 -256 313 2385 7534 11716 6152 7337 4840 3371 7833
7616 7833 7304 1076 -2813 -3928 -403 3103 631 9259 11424 10016 1049 2047 7675 6695 -2498 -10276
7600 -10276 -12310 -4418 -547 2625 3019 -562 5038 10716 8828 12949 9358 7214 4725 7686 6357
7585 6357 -817 11276 17718 12280 8317 8627 5248 4730 249 4639 10188 8569 7998 6883 6052 10411
7569 10411 8596 1064 460 7956 11138 10491 12364 11538 9957 2022 2101 10723 8079 4244 4743 6186
7553 6186 12161 3264 5335 8530 5983 1915 2731 -589 -4429 -7029 -6508 -3945 -5135 -7180 -6115
7538 -6115 -7774 -11193 -3673 1011 -2598 -10725 -10384 -4858 1847 1366 -8290 -12710 -16465 -13418 -10614
7523 -10614 -4999 -2559 -2797 1877 -6496 -9778 -10363 -12708 -5718 3993 920 3150 6286 3325 2991
7508 2991 4967 13641 18633 12769 8262 8121 11785 4765 1183 2231 3446 8578 6638 2195 -62
7493 -62 -3602 -454 3971 1872 -584 -4353 -9397 -6052 -6931 -1704 9529 16289 6249 94 4028
7478 4028 8589 12147 9906 7778 8763 12752 12725 10839 10760 1763 -420 -2869 -549 4730 2219 2228 7643
7461 7643 12110 10634 5247 4889 9836 3471 -3624 -55 3230 -1136 3095 3076 2992 10503 12852 4390
7445 4390 -3619 -4043 -1320 -105 -208 4756 8209 3056 -2961 -4609 -5900 -14764 -18756 -15130 -9246
7430 -9246 -5415 -2583 -6003 -4024 -1553 -1653 -7319 -3848 -4926 -1941 -7421 -8615 743 1058 1690 3068
7414 3068 3038 377 4995 3727 -3819 -2497 6699 6149 9789 8751 9958 7531 4067 -1194 -4531 -755
7398 -755 1457 -3472 5356 10130 9978 6567 537 -574 -8088 -10679 -7503 -3480 -6733 -11188 -7345
7383 -7345 -3038 -3409 -2336 -2331 -5344 -131 -201 -222 -263 1287 -3573 -8653 -2942 1388 -2348 -6936 -6212 -2874
7365 -2874 2865 2554 -1913 -4864 -3101 -2063 -2095 3430 9294 7227 1310 811 -838 -3651 -4588 -1275
7349 -1275 3418 4977 1294 3893 4421 -2158 -1902 -3765 -5599 1359 7251 3255 4528 8893 6739
7334 6739 -1667 -3204 -519 1142 9072 7754 5587 2664 1602 4749 5136 4686 3926 2411 1386 112
7318 112 4035 9025 -255 -9704 -12538 -8388 -2624 -2546 -4992 -5104 -3907 478 3974 7959 18281 14232
7302 14232 12683 13482 5603 4617 1161 -2266 152 -2281 -1337 2159 9560 11123 17398 22510 18431
7287 18431 14158 5267 2698 5718 5315 3145 3813 8647 8812 9704 10113 10664 5295 6711 10640 8423
7271 8423 643 -2098 -5309 -1523 -4792 -4046 -5414 -8509 -8227 -2688 10468 12102 6473 7154 10900
7256 10900 14496 10092 5163 1833 650 504 55 3451 6183 1289 -7034 -8316 -6343 -3581 -2119
7241 -2119 -2140 813 2336 3975 2532 -8295 -10429 -3549 2624 6245 8571 1365 -6465 -7763 826
7226 826 6663 4626 445 -2226 -148 3913 2881 5401 6343 1218 3486 111 2739 4140 4597 2359
7210 2359 -5642 -6719 67 1186 -6494 -4081 -2860 -4303 -5089 -6030 -10252 -6701 -890 1389 1339 -4346
7194 -4346 -9543 -7641 2431 5877 8876 5994 11547 11953 2891 -751 -4270 -8194 -15738 -9258 -2260
7179 -2260 -1529 -3612 -5703 -8069 -1342 6500 10787 -34 -4021 -2343 2572 6202 3175 -3203 -6767
7164 -6767 -3757 6351 13347 11506 1946 -8410 -6414 -505 4055 6784 2215 1252 -589 -3988 -1684
7149 -1684 -3361 -3296 -1224 -3540 -7373 -5466 -7977 -5005 -5292 260 5490 8022 5215 3794 8702 10199
7133 10199 10406 12841 13288 5435 1704 590 -1510 -84 -3426 -8256 -7308 -7918 -4040 1415 1908 482
7117 482 -4506 -3051 -3630 -9379 -11327 -9382 -7418 -14018 -14906 -10910 -9836 -4858 -288 3010 -1162 -5969
7101 -5969 -6249 1042 2179 -5924 -10629 -9132 -8062 -12833 -9272 -6431 -4769 -4550 -7125 -7532 -7910 -10675
7085 -10675 -5496 -7236 -14201 -9624 -8470 -7888 -2575 -4724 -4848 -5953 -4264 -3925 -1552 -2891 -2824 4192
7069 4192 6498 5294 10896 6773 4385 1983 404 -2336 -4356 -804 6558 1285 -1182 2807 288
7054 288 -6368 -3491 -2403 -3071 -3231 5522 -2819 -7885 -8397 -15975 -6087 -1569 788 1626 4980 5942
7038 5942 -2356 -9146 -4415 -687 -2410 -4921 -6548 -7553 -1086 -3198 -4442 -4008 -2558 -5288 -6469
7023 -6469 -9794 -7862 -431 595 -4203 -9073 -10916 -9703 -10507 -6469 778 2964 -1568 945 3926
7008 3926 1738 2127 2884 3447 -1979 1468 2600 -424 -2612 -2450 6198 6225 -3020 -12367 -16698 -15056
6992 -15056 -9491 -4404 -2715 -1831 -2450 -4669 -6493 -11119 -7418 -7887 -848 418 1923 3032 9417
6977 9417 13157 16944 15935 7661 4302 -1890 -1245 -2361 -1725 182 -1479 -3259 3614 5240 3908
6962 3908 6746 4536 2262 4751 368 -4834 -5288 -2944 2701 4767 298 -4824 2226 6205 747
6947 747 -7656 -9079 -9760 -13117 -7354 2738 8617 10162 6360 6597 -6357 -8601 -1196 3821 -2360
6932 -2360 -12864 -15352 -13537 -9713 -6318 -2152 5259 2289 -818 -3634 -3904 -4273 -2198 -4990 -4849
6917 -4849 2389 5886 5967 3070 -2385 -4551 -7980 -14000 -9867 -6225 110 4205 7133 8042 2046 -9745
6901 -9745 -8487 -4608 -2832 -4782 -3320 -2142 -4428 -3765 3772 4299 11760 18419 13467 -45 -369
6886 -369 4305 5374 -3419 2310 8552 6123 -4035 -3071 424 -4271 -7448 -3871 -1505 -6180 -11975
6871 -11975 -15236 -17969 -13657 -6880 -6536 -4003 -857 -210 -2156 -9093 -13914 -6636 -10267 -10460 -1283
6856 -1283 1819 1425 3638 6717 5824 3037 6012 7476 10150 -1820 -5502 -7813 -8689 -10552 -16553
6841 -16553 -17117 -5062 988 -454 2000 -9154 -13587 -15057 -11720 -7182 -7284 -13385 -10911 -13702 -12119
6826 -12119 -6325 -1307 -4817 608 3974 7144 8118 3897 7653 7374 -1004 -5756 -3504 -7171 -5166
6811 -5166 -4771 -2124 3015 5602 6382 4103 6344 6163 2336 -1957 3963 11052 5388 -2511 -373 -3338
6795 -3338 -4290 -5622 -2138 -1027 -2479 192 756 -7560 -12007 -15311 -12304 -8527 -6872 5 -1776
6780 -1776 -1109 -594 5930 9396 6715 2043 -2581 -6235 -9800 -9595 -7813 -2778 -941 2428 11087 11756
6764 11756 13262 12883 11598 4990 2010 3056 3833 1733 -1874 2122 1003 -1622 -2024 -4234 -2372
6749 -2372 159 3666 5749 2698 -2032 -5519 -9590 -9959 -9120 -13958 -18314 -20269 -13719 -4710 1915
6734 1915 1053 5937 10907 12681 7322 -581 -9019 -12158 -12707 -11742 -6252 -1314 1991 2192 3218 -1737
6718 -1737 2352 3577 -3616 135 11918 19535 25217 31619 38735 35730 26798 20061 9532 3249
6704 3249 3782 436 -3793 -4341 -642 -4938 -6553 -1747 2206 9514 9556 8022 6117 2869 3454 3087
6688 3087 1087 4658 6312 -3356 -287 -1114 -4444 -1762 -3665 -5467 -8310 -8109 -7826 -5902 -4531 -3280
6672 -3280 12 -3850 -9060 -9271 -2733 -7821 -12669 -19092 -17045 -11790 -8874 -5556 -11254 -27087 -22057
6657 -22057 -16335 -8223 -6497 -13526 -16188 -15545 -6284 -2969 -3741 -310 1648 -60 -5299 -11240 -11353
6642 -11353 -5447 -1754 -146 -4087 -3161 -962 1488 5850 5723 4239 1707 542 2220 -5121 -3219
6627 -3219 6661 10220 3078 54 579 -4942 -14318 -14121 -2553 2061 2236 5471 732 -1809 -3327
6612 -3327 -5351 -2880 42 -2980 -1151 1241 4256 3118 -229 -515 2242 2759 -1417 -6151 -11065
6597 -11065 -9556 -1168 1759 8065 6231 4823 2935 2919 12322 12540 6459 9569 8132 4757 851
6582 851 1618 597 -2766 -3419 4827 9153 6130 4851 13420 14644 14411 3991 -2312 -283 -4293 -2495
6566 -2495 -489 509 1934 -1793 -3687 -12625 -11900 -2235 1935 -1552 -6068 -10548 -10416 1452 5484
6551 5484 6904 384 -4431 -1017 -320 -4791 -10025 -8563 -5616 -7782 -1120 -2999 -11048 -10468 -8990
6536 -8990 -8486 -9274 -4443 -1088 -1078 -1008 -5140 -5808 -1461 -466 1774 -395 -3606 -3465 -5628 -5459 -8711
6519 -8711 -5111 -3187 -7145 -12303 -16872 -5579 -1156 -6328 -5939 -5406 -2227 889 2064 1254 -3544
6504 -3544 -1677 5370 14840 17994 11413 743 -575 -1069 4475 -947 -104 2332 -2814 -6199 -7467
6489 -7467 -4461 -7198 -9227 -6597 -3556 -3898 -5939 -7114 -5081 580 4523 2429 4832 4684 7846
6474 7846 10298 8819 8067 4859 -225 -6134 -11625 -11665 -7408 -4100 -5353 -7949 -10228 -15509 -13208 -12090
6458 -12090 -10902 -9663 -2692 95 -2315 -2282 -4739 -4070 -6695 -4361 1656 2648 -443 -2279 -6706 -2614
6442 -2614 -3902 -1421 780 3404 8111 4904 4590 935 -2706 -5837 2006 5470 5230 2408 3054 2396
6426 2396 2291 999 2145 6398 7562 1336 -8785 -10394 -9792 -8136 -9017 -9920 -850 9394 14838
6411 14838 4500 -10734 -6800 -778 8092 14846 10267 11293 6042 4564 4138 -2337 6539 10516
6397 10516 13511 10529 8838 5655 5619 7210 1864 6093 5150 1290 -3749 -3585 -2394 -2801 -2286 2055
6381 2055 2968 6550 5214 925 -3316 -11070 -13112 -7443 -8762 -7780 -10514 -9846 -5535 -7006 -7135 -8841
6365 -8841 -5571 -2052 873 171 386 -3299 -1695 4627 9990 11346 5248 -1432 -3385 1743 1945 2011
6349 2011 2677 2439 -6060 -2704 -8086 -5663 -2188 -1624 -4496 -7998 -4846 -3779 -2433 -2632 -6242 -3062
6333 -3062 -2666 1250 -5603 -7975 3064 -1326 -943 2320 9959 12086 1848 -5783 -5831 -9288 -10463
6318 -10463 -11700 -10734 -8615 -5076 3608 12488 13495 19048 9955 4213 5734 9314 6862 14263 18069
6303 18069 9329 7668 725 -7423 -10115 -10847 -9540 -8386 -3609 -7354 -5811 -5995 -6946 -6632 -11675 -10795
6287 -10795 -5259 -746 -665 -2981 -1585 2950 4368 -5004 -12542 -13741 -15265 -17797 -14188 -13629 -16823
6272 -16823 -15282 -6118 -712 5647 10298 12901 10934 3983 2241 734 4891 11589 9054 7888 1851
6257 1851 1845 10018 14700 15109 14524 7238 -1500 -4889 299 9691 13485 10340 11750 4784 -818 2992
6241 2992 6249 6673 6551 5542 4279 -684 -3041 476 37 4874 1162 1419 2134 1054 -389 -1836
6225 -1836 -4497 3142 5279 -3672 -14712 -12108 -5832 7172 6503 6687 6880 5104 5028 -145 -4636 -3070
6209 -3070 -2175 -8762 -14562 -15815 -15345 -8217 -3440 -4115 -2855 -5316 4165 10084 1274 -4277 428 2273
6193 2273 562 -1525 -308 -2419 -4075 3594 11693 14032 13915 9018 6401 3843 2792 -6576 -2509
6178 -2509 1949 2330 3353 2673 4218 11314 11910 2523 -5596 -4568 -892 -821 -2842 -5790 -4792 -5488 -7448
6161 -7448 -7571 -1338 -2273 2845 7158 4054 6646 1854 -7313 -11675 -9117 -5567 -4517 -5408 -7162 -7230
6145 -7230 277 -1383 -5592 -4412 -3352 -1806 1577 358 -6256 -9210 -3414 1050 -1423 -2199 -4118
6130 -4118 -4294 -6913 -81 -1859 -4840 -1525 -1467 191 5207 7522 10936 10292 4787 3683 8513 5243
6114 5243 4219 168 -464 -801 -7285 -4915 -1376 -6038 -5144 1249 2145 -1814 151 339 -1749 -1949
6098 -1949 -2595 315 -4141 -7814 -15072 -12988 -4323 -4896 -4626 -8967 -15144 -12598 -12645 -9999 -8402 -5981
6082 -5981 -2267 542 -132 -6041 -7632 -7963 -5437 -5799 -2468 2764 3283 3182 -3093 -8355 -6236 -2408
6066 -2408 -936 3951 2728 -1479 -43 -1252 -411 2815 7302 8521 5531 2499 -202 5041 4843
6051 4843 -662 -472 1695 -1892 -11164 -5448 -3286 -3935 -12058 -16941 -13769 -11664 -10172 -5932 988
6036 988 6869 11016 5790 1557 2520 -1066 1030 -2466 -11022 -6829 -3572 -2199 -5733 -6769 -8470
6021 -8470 -6874 -3795 -6047 -5845 -6382 -12379 -6039 -2104 -4405 -5650 -127 1354 -277 -1491 2846
6006 2846 2580 -1140 -3918 -9615 -18782 -16977 -3598 7928 9337 15106 14830 9860 732 -725 1835
5991 1835 3780 7470 -687 -9305 -8879 -2663 3747 9523 9783 4444 4082 336 -446 -4477 -2787 1005
5975 1005 -7542 -15604 -9720 1154 3168 4788 419 2770 1653 -4692 -10067 -1588 427 668 4694
5960 4694 6319 11626 10979 6626 -150 -3050 1070 -3802 -1838 -4944 -1695 -3393 -5575 -2426 1929
5945 1929 1918 6051 11446 8147 4183 1188 2587 3775 3798 1551 -1663 -5945 -6865 -5998 -864 1247
5929 1247 4773 7662 11354 10369 6386 2076 6241 4752 584 -1908 -5382 -8080 -8262 -8462 -1136 1906
5913 1906 -107 5309 3934 5159 10983 15896 11958 1567 2341 6635 7197 -480 295 -584 -5448 -2230
5897 -2230 -329 -740 3401 -1457 -4713 -4248 -2052 -976 -4108 -7479 -5758 623 2678 3974 6358
5882 6358 9597 10476 4119 3716 -333 -3852 -4212 -6278 -3856 -4367 -5814 -6745 -1291 -4574 -7468 -85
5866 -85 3476 -2714 -9068 -15499 -14871 -12841 -8737 -2606 -1416 2374 5952 6059 1136 -3619 -7158 -9014
5850 -9014 -11396 -10670 -12992 -11407 -9862 -4270 -1937 -5272 -9494 -10210 -5874 -3676 -4461 -8110 -13167 -6659
5834 -6659 -5488 -8349 -4693 -496 3522 4323 6980 8611 8187 2974 -884 -1008 1160 1767 -1119 -1317
5818 -1317 7393 2022 2295 4540 7555 8437 7759 4975 -1737 -11396 -11719 -8795 -6928 -9560 -4962 -2016
5802 -2016 -5531 -10847 -11507 -9272 -3468 -840 -652 -1988 -163 3386 10292 2724 -1272 -3334 -10848
5787 -10848 -10211 -7205 -6411 660 7312 10156 10534 4287 1885 3308 -330 1378 1480 3003 -6348 -16333
5771 -16333 -17350 -21500 -19129 -10167 -2873 276 -80 819 -7646 -15279 -12679 -6621 -5228 -4743 1385
5756 1385 894 555 -2092 -11240 -9621 -6631 -8958 -2303 -1532 -1854 -2259 -3046 -5476 -5228 -7907 -10565 -9721
5739 -9721 -6989 -4389 4272 4325 117 -3716 -7446 -9032 -14692 -17809 -13738 -11205 -10876 -9534 -10620 -4789
5723 -4789 1470 -5874 -6193 -886 -4045 -7011 -11544 -12798 -15046 -13681 -15066 -9084 -2316 -741 825
5708 825 -988 -5898 -4999 -5745 -7444 -5722 -8646 -14716 -11285 -1329 -1872 -3861 -7625 -3712 -4775 2847
5692 2847 327 -5608 -14831 -11856 -8241 -3016 -3344 -4473 2379 -781 -5523 -649 1320 -6236 -4573
5677 -4573 -4051 -10952 -11046 -3959 -178 1425 3438 5244 3977 4001 -553 -1255 -780 1242 -2331 -3506 -2648
5660 -2648 2290 3263 2213 3190 8679 -3431 -6743 -2891 2442 3267 1517 -4312 -2825 2366 8497
5645 8497 8665 1336 -420 -1805 -1154 -1190 -353 -1185 -7627 -7429 -4743 331 -1951 2827 -1841 -5955 -1648
5628 -1648 -2252 -8065 -8740 -3343 -2316 -1344 -38 -4284 -10288 -6599 -6793 -9710 -10247 -4712 -5193 -10208
5612 -10208 -9181 -257 4736 4885 8059 3653 -2414 -4505 -3462 -5514 -2922 1119 421 3595 6467
5597 6467 4252 1468 -533 3273 6155 8853 11493 7536 5232 -2718 -1853 -4916 -232 919 -629
5582 -629 -1490 -2969 -4473 -3512 2173 -720 -6632 -10021 -11058 -8831 -5154 248 4137 2136 -2262 -1034
5566 -1034 -5034 -7566 -3837 1203 2448 608 917 -5236 -7428 -3169 -3188 -4792 -3866 234 7301 10654
5550 10654 3234 2569 -3036 -2519 4027 1101 144 3783 3658 9390 11252 4459 5607 5535 10305 8388
5534 8388 5037 7515 3948 6117 16826 10125 707 5168 12460 7167 5081 3440 -945 -3047 -2597
5519 -2597 -784 -2866 -1189 -2330 -3025 -4167 -5009 -14889 -10915 -4822 -480 -7696 -9643 -5150 -3566
5504 -3566 -6023 -9149 -6236 -6490 -3230 -7067 -7990 -3679 -4278 -3616 820 1888 2297 6912 2765 -3013
5488 -3013 -5413 -6249 -5368 -4791 -5413 -7380 839 8434 2920 -5034 -3458 -275 -2737 -292 4249 -4586
5472 -4586 -7025 -1926 -5583 -6548 -7702 -6951 -2980 -304 -1346 6862 8315 385 -2178 -1417 2529 3678
5456 3678 1161 1023 -3531 -5828 -5866 -7923 -3565 -4143 -7096 -1484 203 -2658 -4691 -4017 -583 812
5440 812 217 5536 12396 12358 5377 3161 -1230 -3921 94 -1289 -3956 -5868 -9897 -6461 466 3105
5424 3105 -1047 -2644 -1069 6379 5347 -3482 -4060 -2360 -1445 1527 9946 10338 3680 -4027 -3899 -2101
5408 -2101 -179 3244 2181 442 -5494 -4563 -5913 -7218 -3349 -3195 -5044 -8272 -16846 -14957 -12201
5393 -12201 -7064 1434 4905 9364 11096 7520 -270 -6294 -1732 6662 2758 4062 3410 5183 2490
5378 2490 -2793 -739 3908 3469 2139 519 5782 4825 10110 9008 9349 6382 6858 5163 -2890 -4054
5362 -4054 -282 -5119 -4838 -4097 -6746 -7589 -2877 -4386 -8257 -7236 -7675 -10915 -12639 -10179 -2740 1729
5346 1729 4712 5338 513 1777 3311 -620 -4756 -3612 -6531 -6055 -35 -639 -3108 -3674 -4337 -9002
5330 -9002 -9467 -6124 -8691 305 4094 3764 -6078 -11969 -9498 -6348 -317 -7001 -14002 -14285 -13424 -9274
5314 -9274 -7885 -8465 -7068 -11064 -10252 -6193 -7970 -9964 -4676 -2740 -4116 -11091 -10872 -2152 3222 4087
5298 4087 1661 -2494 -5490 -8728 -7727 -8843 -6786 -4680 -2762 -8399 -6845 -3619 -8715 -7067 -2000
5283 -2000 566 -4373 -5268 -6104 -8519 -11780 -6745 -5110 -7664 -10380 -13979 -4602 -2149 -7459 -7859 4709
5267 4709 10210 -2409 -16413 -12903 -3920 804 -554 -2460 -3285 -3264 -5748 -9022 -10653 -12644 -13881
5252 -13881 -8277 -7608 -3365 -994 2370 1800 -3932 -7858 915 8633 8413 4630 -5666 -2444 -1833
5237 -1833 -5202 -5779 -3399 -49 -2170 -2513 -1064 -7279 -5717 -4600 -9805 -14072 -11137 -4733 -275
5222 -275 1313 5313 1698 -3671 -465 -5936 -6872 -8007 -5893 -1317 -9613 -12496 -2032 581 -4526
5207 -4526 -11112 -8420 4627 -5276 -15905 -3574 -2728 -6990 -9778 -7488 -3350 -2618 -7666 -11308 -4753
5192 -4753 -8205 -10203 -461 -2272 -6154 231 2377 1805 -892 812 -2530 -10964 -15231 -8042 -735
5177 -735 1711 2328 7424 12904 11878 11032 7599 -4323 -1071 171 -3295 -4059 -5218 -9193 -7726 -8090
5161 -8090 -12315 -13140 -9889 -8634 -3756 1172 -3070 -5019 -462 3869 984 3917 891 264 2327
5146 2327 1747 1826 -5297 -7882 -2837 -4317 -4571 -463 180 184 4581 -6430 -9661 -6145 -7607 -11518 -10414
5129 -10414 -2054 4613 -4424 -10926 -8844 -5716 -701 -1999 3213 -1446 -955 -3443 738 785 -4245
5114 -4245 -5222 -8671 -6809 -7230 -3788 3893 3177 -2096 208 -3795 -8389 -5894 -11703 -11665 -13688 -17922
5098 -17922 -18135 -18737 -14803 -3463 7370 5444 -500 2890 -1130 1311 5671 -1892 -5655 -4498 -4817
5083 -4817 -1720 -179 -1725 593 9226 16138 9612 10470 10458 7775 7884 1042 -5043 -7572 -6139 -1496
5067 -1496 2964 389 27 -4071 -8454 -10772 -16194 -13774 -8127 -6057 -1516 13262 13308 8179 4488
5052 4488 4893 4528 -584 -6301 -8201 -8611 -6942 229 2783 4401 1277 -998 -4191 -11045 -15521 -19165
5036 -19165 -18454 -11863 -5178 -2047 2646 1600 3089 3189 7939 -2206 -1648 -3889 -3101 -1626 -103
5021 -103 -3984 -3071 1342 4149 -2777 -6647 -12602 -7651 2937 5967 6112 5116 10761 8550 267 106
5005 106 -1481 -6244 1514 5261 6100 4453 8459 5357 2019 1644 -684 -2603 -1855 2051 480 -1236
4989 -1236 -1604 883 -96 -5363 -9581 -5000 -6718 -3893 4487 3929 678 4658 4249 7806 10664 7951
4973 7951 3310 -7330 -7950 -6572 -5660 -825 -796 -281 3262 2338 -2277 -5010 -5507 -2392 830 -4353
4957 -4353 -8750 -12912 -6258 -5443 -2796 505 1015 7101 2352 -2710 1292 2760 3898 2716 3723
4942 3723 7072 2702 2951 8576 8338 9596 3178 -448 1572 6561 10758 6662 -1182 -2338 -1817 402
4926 402 3567 793 -7061 -3736 -827 517 -89 1865 -2204 -5540 -7759 -9319 -4374 -9702 -6791
4911 -6791 -8401 -13338 -7566 1781 4934 1798 2595 4198 12923 12739 3868 4972 9086 6813 5787
4896 5787 1020 2432 2464 1754 755 -1345 4210 5593 972 859 859 -4060 -4592 883 2727 -1834 -1371
4879 -1371 4048 3395 -7584 -11334 -8419 -5046 5566 13231 6319 4036 5456 9934 16817 15619 6464
4864 6464 1791 221 -2221 -86 1418 5621 12268 12015 7697 5740 6645 9411 6868 5288 -3789
4849 -3789 -4547 -6425 -2540 -4014 -4955 2196 1945 4208 8975 9939 5903 -2508 -189 2646 -876 -8074
4833 -8074 -9416 -2635 1988 4063 -3307 -3628 -406 -2188 -7012 -9359 -4097 85 -5341 -9995 -9806
4818 -9806 -7784 -7807 -4385 -2197 -1305 912 1654 900 475 2390 3610 1172 -2191 -6250 -4771 -1686
4802 -1686 102 -5874 -6434 -5679 6 -4072 -7376 -8275 -10264 -8316 -3740 1938 6236 5552 7110 4428
4786 4428 8472 8658 3119 7765 12052 10840 6243 6557 6127 8580 9760 6103 2806 -1660 4561 9515
4770 9515 4678 4930 5641 5877 4992 -2535 -7317 -11020 -8785 -5790 -8445 -7129 -11224 -11018 -14540 -14752
4754 -14752 -5185 944 -512 -190 -2130 3645 9301 8719 7257 6600 2838 4679 1817 -810 -2879
4739 -2879 580 2175 4362 10115 6258 7176 6743 3671 -2630 -3740 556 -1055 -7697 -11438 -8147
4724 -8147 -3598 -10040 -10050 -778 100 -3463 -4729 -5812 -4752 -2807 776 -7341 -14001 -11219 -16182 -12902
4708 -12902 -11729 -9815 -1890 -290 6562 9253 5357 8484 9175 6912 4858 826 -104 5484 5179
4693 5179 5849 5793 11833 14781 11782 5394 3240 3123 2039 1844 -592 -164 3151 10685 8690 4449
4677 4449 6808 5167 5640 6278 -200 1012 -3584 2648 4037 3654 5026 -2446 -7572 -4634 -6187 -1084
4661 -1084 -221 1730 3187 2076 -1619 1150 1246 3682 4043 -2368 -6824 -9962 -7859 -6606 -1930 185
4645 185 1004 2991 -1337 -6221 -2712 1273 -192 2163 6937 8953 8443 -60 -766 144 -2346 -2733
4629 -2733 499 2701 2769 2672 3621 -1198 -8329 -5809 -1941 65 883 1750 -7556 -14009 -5954 5468
4613 5468 7138 7025 2523 8994 14751 12324 3354 -5834 -7436 -2369 -1246 2472 4547 10683 13384
4598 13384 4005 -4001 -6079 -5658 -4277 -3471 -8442 -7621 -1912 -1953 -3761 2236 2314 2973 -1518 -5012 -4253
4581 -4253 -9529 -4411 2956 6070 3185 3867 6829 6550 6178 7431 6897 726 -6098 -9249 -6899 -8116
4565 -8116 -11433 -4413 4344 1963 -2784 -8803 -16118 -13593 -13534 -9628 -8019 -11998 -4847 2490 8549
4550 8549 4605 706 -1941 -1927 2299 6801 7484 2661 1894 6974 2047 -8508 -5090 -718 -4760 -461
4534 -461 6525 -1793 -8596 -8209 -7234 -8672 -10849 -16326 -18322 -8418 -673 1676 2697 12186 10966 4045
4518 4045 4090 -1285 5306 6562 -3004 -6542 -2789 -3974 -3355 1702 8821 7975 3909 -1150 -6471 -6988
4502 -6988 -7268 -1317 232 -5412 -3601 -2700 94 3284 4574 -4181 -7450 -5121 -7575 -7754 -3202 -3132
4486 -3132 -5312 -4950 -4442 -4518 -127 2033 -2227 4276 3451 -2642 -13257 -14664 -11918 -4727 -4871 -4891 -1905
4469 -1905 1278 8017 9195 11814 66 -3015 6048 3674 -4176 -6402 -2027 2200 -1363 -6436 -8789
4454 -8789 -3448 -4747 -7023 -6497 -3043 -2093 -3556 -4525 -6336 -12123 -17036 -19281 -16519 -7685 2467
4439 2467 5570 3164 926 -2250 -1851 -1574 -7650 -10523 -8519 -4864 2217 2416 -2872 -3232 -1329 -1976
4423 -1976 -993 -8 -1147 -2025 -2810 -14106 -19796 -15927 -11812 -10664 -10184 -3875 -168 9335 4303 2194
4407 2194 191 2944 6096 10017 9384 4769 -2623 -3603 1140 -2122 -1223 874 3035 4933 5236 3451
4391 3451 -5315 -2669 -286 2329 3800 -4650 -9902 -9825 -3305 -9011 -11094 -12793 -15107 -10835 -14258
4376 -14258 -8749 -9458 -5152 6178 9763 6958 7211 7441 11891 13966 11602 9385 4351 7983 11859
4361 11859 14094 18145 14165 8332 6114 9012 6830 3256 1072 -3357 -6630 -3911 -1966 -731 323
4346 323 567 -1047 -4812 -6675 -5625 -2103 1003 4074 7246 1629 2440 8355 9476 10869 1561 -4616
4330 -4616 -5781 -14445 -16926 -6973 1895 840 105 3016 5880 9277 8123 5473 973 -2568 -3801
4315 -3801 -2269 -4459 -4606 -7789 -15399 -16913 -13404 -10404 -10269 -5280 3635 9245 1444 401 4911
4300 4911 3774 -735 824 600 -15167 -16520 -14561 -12634 -9846 -12192 -10642 -7778 -4304 1089 6275
4285 6275 5213 10211 6205 142 -560 2678 -1094 45 837 2872 -45 -4369 -3496 3468 3146 1755
4269 1755 1724 6127 2692 637 2511 -162 72 -1984 -1410 4365 10705 7070 1136 -304 3881 2495
4253 2495 2281 -492 6725 3969 -2952 2794 1507 -1502 -3634 -2796 -554 865 1280 7135 10433 11575
4237 11575 8971 4074 3584 -845 -1626 -7804 -9507 -3986 -2620 1708 2180 -2320 -3103 2957 8437 10415
4221 10415 8916 6573 7451 3793 3360 10768 7452 1461 -1597 -398 6007 10720 -1217 -1095 7735
4206 7735 5578 -6180 -6383 -4303 -2034 -4868 258 5852 14086 10099 7713 5439 3517 -2789 -2998
4191 -2998 -5336 -4704 -4368 -9206 -8678 -11489 -16150 -3813 5614 -2980 3504 9627 5070 116 8353
4176 8353 11878 5377 2321 1383 5661 9642 7152 4822 7463 10627 8827 8898 7585 8666 4698 4198
4160 4198 5618 1387 2450 3486 5750 3546 3680 97 -5971 -4896 -3598 -3534 -1150 -5058 -9304 -6462
4144 -6462 -8632 -1763 6722 2468 619 2641 1312 -1497 5092 9827 6402 107 -2377 -3256 1241
4129 1241 2675 1489 1288 6845 9796 6094 -282 -3336 -1720 758 4678 314 1500 4213 8035
4114 8035 3142 4758 -356 1072 7069 7145 8359 2924 -1078 -3613 -12056 -13094 -12371 -12343 -4968 3287
4098 3287 14488 20272 18893 14564 8856 2362 6469 -2256 -2323 4666 7374 7987 8884 7065 6619 6669
4082 6669 4392 5478 4943 1077 -2784 -2406 -2694 677 11128 4006 -2926 -2780 -9127 -5787 -5592 -12057
4066 -12057 -13344 -10628 -6187 -3020 -1027 -4337 -8612 -9464 -12805 -18739 -21578 -13356 -5594 -2483 2137
4051 2137 -493 -952 -1095 9099 11561 5888 172 -3580 -3616 -3095 5207 13976 4647 -4616 -3050 -3308
4035 -3308 -2005 -4789 -2031 8511 9320 6826 5455 4032 5729 10844 12911 10324 8498 3349 3535
4020 3535 2364 1782 1610 -2685 -9231 -7694 -3888 78 -971 -573 1421 4271 7026 3206 -48 9
4004 9 -442 -2750 -2903 2865 -425 -7477 -11468 -6123 -2598 361 -1808 -3095 897 1499 2997 5851
3988 5851 7467 -259 -7512 -6401 -4640 317 -1236 -6310 -6326 -5048 -5391 -2060 -6257 -3680 -501 8926
3972 8926 9203 4412 2720 5065 2440 -2396 -8124 -9965 -11036 -12943 -14076 -15618 -11185 -6740 488
3957 488 -6292 -9434 -7058 2088 3310 -2023 -2690 -3328 -5709 -11330 -14946 -15287 -13103 -12501 -8520 -3647
3941 -3647 -6260 -8323 -1944 1981 7201 718 -13115 -15939 -13593 -9549 -8463 -11216 -12013 -6275 409
3926 409 905 -3442 -2706 -3148 -2095 -1512 555 -4996 -6798 -9744 -15397 -15051 -11590 -14409 -14553 -12482 -14432
3909 -14432 -15436 -18107 -17067 -19795 -14515 -3663 -2874 -8353 -6420 -4454 -7927 -1918 2635 364 -4980
3894 -4980 -8056 -6364 -7541 -15191 -12386 -10734 -5261 -4910 -5326 -9136 -11237 -13689 -7842 1957 10030
3879 10030 5344 -467 -4354 -8483 -8642 -788 -469 -5276 -3060 1627 6581 4471 3668 -444 -5515
3864 -5515 -5076 -4588 -1869 2609 988 -1304 -4657 -13748 -10714 -3272 -1152 3180 -2825 320 1777
3849 1777 -831 -3946 1227 1422 -3293 -5595 1012 8254 1084 -3399 -1395 -4950 -5142 3265 7883
3834 7883 4963 -3424 -12057 -9715 -1135 272 5331 4195 -2040 -9411 -4849 -1840 -4466 -3408 -1971
3819 -1971 682 7909 10742 10197 7553 1995 -696 6540 7203 2954 -5885 -4645 1331 7992 3457
3804 3457 -5906 -8810 -3957 5628 2994 3351 2377 -2509 -5819 -9986 -5053 -420 -45 1876 4494 -1251
3788 -1251 -3436 -1527 3233 8615 13086 10911 12595 18741 12239 7735 3213 495 3426 2414 1171
3773 1171 -476 -1719 6992 11033 15402 7363 2561 1402 3571 7178 4772 5052 4914 4736 -1896 -1584
3757 -1584 5275 11708 10954 6767 -779 -8043 -5831 -749 -3323 -5450 -2885 -804 823 345 602 5719
3741 5719 577 -519 2646 4407 -1388 -3935 -610 -145 2864 -170 1330 1557 1443 6444 9472 17404
3725 17404 13724 8706 2931 -5714 -426 1143 2141 -2134 3835 7641 6361 11308 4553 2253 6881
3710 6881 2948 4917 2998 -1115 -663 5531 7317 4183 2477 -1434 -3969 -2375 -2734 -6518 -4637
3695 -4637 -5797 -6310 1866 746 -1461 -4491 -7034 -5432 -7069 -6834 -12111 -10533 -6318 -5972 -3805 3343
3679 3343 5987 9750 8905 4598 -4065 -4598 740 801 5239 5325 5148 6702 6457 -876 -10246 -12954 -10589
3662 -10589 1354 13667 12122 6729 2360 58 -988 -86 -2107 -4041 -5874 -7436 -730 -1465 -937
3647 -937 -5544 947 6426 6831 117 -5435 -13754 -13525 -6453 -10333 -8992 -4907 -10601 -12864 -10711 -2512
3631 -2512 4065 10087 13242 10663 4431 862 3986 6469 7188 1680 -5128 -5899 -9449 -7815 -506
3616 -506 4701 1051 10572 7165 4398 2115 -6403 -3539 -1274 387 5842 5463 245 -414 -1556 -6650
3600 -6650 -10154 -1895 8426 8556 2241 4472 8738 10140 10156 10719 5847 650 2261 222 567 -1610
3584 -1610 -4471 -6817 -8733 -65 5123 5529 3629 3807 3420 1556 -4271 -1311 4031 647 -1452 -3529
3568 -3529 -1307 -2361 5437 7289 6795 5456 268 -1008 -1275 -3434 -676 -4847 -1924 2988 1647
3553 1647 -5607 -6330 -9866 -3907 -1008 -3848 -6917 -3350 -2272 -1469 -553 -210 -1889 -6200 -7405 -1331
3537 -1331 -80 -5477 -2920 -177 1558 -606 439 2538 990 2282 5302 4532 -2565 -6664 -1987
3522 -1987 -2175 396 -5318 -5742 -4307 -3846 -7160 -9899 -12385 -12692 -13507 -12729 -7159 -4041 -3339 -1777 -1227
3505 -1227 -8277 -3278 3927 5355 -3302 -6317 -2474 1471 1739 4002 -1083 -11651 -6154 -9677 -5578
3490 -5578 3603 4210 11 -2606 -250 -710 -2769 -1365 -3297 -3923 4229 3032 -4453 -10571 -6630 -3893
3474 -3893 -3143 -3953 -11089 -19133 -15755 -16518 -11213 -9127 -10554 -5831 -576 -7345 -3544 -8462 -13855 -5894
3458 -5894 1860 4913 1117 -2600 -9835 -260 11550 10920 4194 -1677 -4800 -3584 4709 6664 1746
3443 1746 -1500 -613 -3371 -9022 -6666 -2393 2567 4387 3611 -39 39 -507 -2257 -4976 -7914 -5360
3427 -5360 -494 -1675 -6814 -3396 3548 467 -1171 -2384 -3742 -8178 -14009 -3567 3496 6680 9648
3412 9648 10702 5494 1399 -9301 -15512 -15151 -16877 -12650 -11236 -12423 -8316 -1384 -6434 -1505 -4636
3397 -4636 -18442 -15856 -6420 -3107 1585 3451 5572 6163 4629 6830 5172 1690 -388 -806 -2313
3382 -2313 -3208 -3531 -1942 -9903 -11629 -10094 -19384 -13617 953 4439 -3346 2355 1023 -4706 -8231
3367 -8231 -8809 -5479 3432 5050 4152 -1667 2901 1607 -2184 -6158 5416 12205 235 -6438 -9141
3352 -9141 -14196 -10294 -6110 -1922 -3092 -1690 4883 2152 3251 1199 -1121 -4782 -4410 337 1052
3337 1052 -2211 -4597 -4856 -1934 2883 924 -2065 898 3146 1244 -2001 -2621 -5002 -1749 25
3322 25 -730 -3123 4809 13703 19448 9178 3131 -109 -1558 -4254 -3161 -3666 -4054 -2765 4645 12602
3306 12602 10829 8671 8695 8095 976 -9661 -9170 -12747 -14408 -10513 -11625 -11936 -4726 1754 4640 9212
3290 9212 10878 3906 -1000 -797 1528 1022 1768 -1453 -5324 -3710 5155 8608 -5246 -2039 171
3275 171 2383 3172 10870 10140 3489 -5805 -2846 3306 3082 6981 7186 2372 -1056 -4652 -6899 -1140
3259 -1140 4018 8257 6280 1989 -1855 -2808 -4608 -2704 -2809 -8285 -10041 -1657 3633 2119 3836
3244 3836 2507 -2578 3485 8115 5028 2359 325 2729 6212 9523 7057 -2165 -1948 -731 -830 -1727
3228 -1727 552 3089 5760 3741 6250 14086 11650 3083 3049 4894 -1107 -10625 -5238 6219 11684
3213 11684 12441 2462 2732 -3996 3583 7570 2797 -1428 -4848 -5284 -6123 599 -450 1919 -440 -8212
3197 -8212 -11734 -5679 -85 4872 11839 9763 5099 -3517 -12423 -7726 -3343 -5481 -3042 750 -1
3182 -1 3656 6850 1576 -2912 -6596 -3982 -6993 -14277 -10257 4499 9637 4584 3155 4754 3218
3167 3218 2684 3278 4801 4869 4873 -175 -10770 -16734 -15410 -13837 -9846 -2443 -1965 -1062 388 -2807 -2879
3150 -2879 -3558 -570 4685 775 -982 3059 3127 1217 -9790 -20699 -19478 -15954 -10992 -8303 -1415
3135 -1415 5561 4537 6579 827 -4317 2795 8334 2391 -6655 -5048 -1238 5010 7228 10782 6672
3120 6672 -6785 -14359 -12362 -13173 -12589 -10469 -8226 -9428 -6380 -4721 -6508 -11834 -7806 -4389 2896
3105 2896 4703 5510 5622 -556 -4762 -3688 2840 7662 11035 5971 8024 4411 6197 2899 -1344
3090 -1344 -5605 -9124 -10187 -8208 -9886 -8425 -6944 -3128 134 910 5568 4871 8180 9597 7121
3075 7121 2589 2685 5990 9143 -1582 -9005 -802 -733 -6868 -8370 -9770 -9291 -14006 -9203 -300 -329
3059 -329 -4429 -6617 -8164 1018 2112 -1944 -3257 -3933 -6640 -7624 -5546 -7491 -5455 -2453 -3214 -2323
3043 -2323 3940 1641 -5273 -8568 -2765 -1043 -577 6401 9105 8960 10241 5125 -184 794 2065 7546
3027 7546 12047 11019 3513 -7329 -1067 4431 5128 -138 -215 -2459 -240 -334 1022 2115 -369 4046
3011 4046 8141 6550 8918 10703 10528 15258 8472 5890 482 1709 4354 224 -5432 831 6282
2996 6282 7611 7469 720 -6453 -5873 -5400 -5230 -1461 -589 792 4268 5841 -5178 -9342 -9436 385
2980 385 4984 3588 9142 10171 6727 6299 -4356 -5214 1511 -1436 1573 5910 7832 8775 1269 -3845
2964 -3845 -1195 1994 -2348 -823 -973 636 2340 667 -3633 -9144 -9847 -6687 -7010 -3151 3266 6173
2948 6173 7826 4929 -3844 -5958 183 2868 3597 4031 2904 2015 -157 -100 4431 7673 1140 2529
2932 2529 6130 4803 198 -4326 -7675 -8295 -8309 -6817 -1493 -5866 -17784 -21052 -11754 -5269 -4559 -3414
2916 -3414 -615 -2143 -7652 -4936 -198 1825 3235 5860 5394 -590 4553 19109 16330 10164 5074
2901 5074 3742 7099 4982 4426 9118 8729 4493 -208 -4604 -1891 2919 2596 1769 -1480 -3308 -1213
2885 -1213 -6944 -5218 -6154 -13062 -16492 -15309 -11921 -9967 -11228 -7907 -2759 -179 1975 3802 8047
2870 8047 9038 6722 3237 9520 -308 -5244 743 2843 1073 7850 253 -3040 -6073 -6570 726
2855 726 5905 1003 1843 5994 11410 10822 4898 1010 -3258 -1503 2648 2963 1858 -759 1451 5366
2839 5366 9427 4168 1992 1063 2248 -1909 -3904 -3774 -2985 -3950 -7034 -6708 -5471 -5351 -5831 -7802 -9671
2822 -9671 -7201 -4817 -8302 1269 4801 -1714 -6860 -4209 -5984 -15001 -7261 216 3821 -1389 -7149
2807 -7149 -7787 -1588 267 174 -6289 -11807 -4230 5119 9377 17058 5910 1360 -1519 179 7454
2792 7454 5155 -189 477 3075 4337 8731 7910 4139 3188 5959 -85 -3957 -271 4358 -1798 -8176
2776 -8176 -9898 -5671 -11007 -10408 -4350 -810 471 -6076 -6291 -10087 -3808 4261 5255 -110 -2958 2310
2760 2310 547 7999 11325 11451 9968 1697 3573 9701 5457 8130 9237 -130 -2203 8243 17959
2745 17959 11345 3229 -1330 -6817 -12505 -14642 -13652 -6578 -1197 -5470 -8458 -11573 -7444 -8478 -9488
2730 -9488 2600 4288 -2166 -2313 1490 -5572 -10297 -11885 -8947 -5551 -3711 -4637 1057 9609 10450
2715 10450 3281 6304 8569 12273 11335 3895 -7767 -12138 -7918 -4639 2754 3658 -6731 -5563 -2485
2700 -2485 8220 11497 6181 -1862 -3775 1799 1492 -1785 540 3542 4078 -785 -6757 -11901 -12100
2685 -12100 -3025 -4279 -6571 -1662 -1751 -2113 1856 1493 -5045 -13443 -9079 702 5543 1875 -8691
2670 -8691 -15832 -10814 -5948 1113 4588 -3193 -10864 -6565 -5974 -5992 -7928 -5503 -1383 5019 4492 3786
2654 3786 -2027 -10382 -10725 -14805 -14668 -6370 -5909 -6005 -8974 172 2080 7501 6843 5932 -1149 -4463 57
2637 57 2752 -1150 -69 1868 -4653 1083 -441 -3843 -1222 4608 9915 8775 9204 8892 13831 12820
2621 12820 4338 7360 11546 7330 972 5665 6626 2424 2658 -539 5366 9245 -903 -4799 -3184
2606 -3184 -5495 -7587 -6402 -818 4386 2134 -3488 -5269 -6078 -8710 -14436 -9633 933 2744 2110
2591 2110 6783 6677 3929 -874 3616 5866 -3297 -6185 -7613 -9605 -7395 -4767 -7530 -5381 -60
2576 -60 4989 3429 1360 5830 10652 12874 7381 2323 4641 2927 -1666 -7556 -9632 -1412 -3577
2561 -3577 -4466 -2076 -360 -4685 -6703 -902 700 3535 5138 5081 3418 4752 5550 8903 4264 7997
2545 7997 12622 5479 1772 423 -3041 -954 2829 -1996 627 4737 1128 -2501 -848 766 -993
2530 -993 -7914 -13933 -8905 -4143 4583 963 1717 -1244 901 7668 7673 13272 17224 17139 13407 5491 3547
2513 3547 -5258 -8245 1313 6409 8540 3612 -2179 -733 5628 8712 4706 -8156 -12091 -7007 -9437
2498 -9437 -16304 -15450 -12001 -11087 -9700 -2204 -727 2911 7449 4362 7236 4591 -6599 -8799 -7186
2483 -7186 -7088 -2545 744 3989 9305 13228 10243 12377 11588 9779 -505 -10199 -15682 -12163 -2910
2468 -2910 -1189 1226 -4391 -7051 -4218 -7598 -5834 -4299 -4996 -7550 -6179 -5505 -7908 -9687 -4131
2453 -4131 -4870 -6008 -5484 5328 6871 1449 -348 -1494 -402 -7186 -8635 -4923 -1492 6399 6935
2438 6935 1518 -1409 1809 3140 -6597 -14042 -8120 -2924 -3405 5476 10614 10585 10901 10487 4344 4997
2422 4997 4803 8327 2970 1004 4046 3155 -2850 -3128 2058 7420 18137 16904 11375 5749 9585
2407 9585 15213 14179 -2215 -9504 -8099 -2816 -157 -2334 -1116 856 2687 -2772 -11376 -9580 5747
2392 5747 6395 1299 -4720 -1061 5006 3455 -2081 2064 1448 4329 6997 -77 -4052 -7284 -6805 -5498
2376 -5498 -10547 -4900 1670 5374 2230 -5976 -10461 -2212 7839 5630 5690 1370 -5660 -5630 -1008 1307
2360 1307 3564 9234 3223 -419 -705 2695 -620 3560 -1695 -7002 -13282 -10641 -4372 -2128 -188
2345 -188 -296 -5404 -4943 -1974 -1241 2059 2943 6946 5928 8487 6683 2229 -6464 -11254 -11804 -10272
2329 -10272 -6502 -4107 275 2401 2906 -4387 -2960 -2709 1509 7843 4706 1022 -2394 -6017 -4424
2314 -4424 -5762 -4097 -3655 -3552 -1150 2491 658 -5203 -1474 -1183 -1184 -1952 -402 -2929 -8427 -9137 -7700
2297 -7700 -2675 -331 -596 -577 1317 -2262 -853 5326 5157 -2087 3094 10546 8926 7476 11845 16370
2281 16370 17239 8099 -459 3728 4800 -2597 -2980 -3964 -8350 -4244 -3991 -7830 -10832 -11752 -6823 1634
2265 1634 -496 -4847 -5663 -5023 2312 1665 -3825 -3861 -8810 -9185 -3424 1768 4807 6420 5709 2261 2430
2248 2430 -5295 -2857 5959 2861 10 1999 5017 4432 -4821 -5752 -1173 8035 14030 10955 -3047
2233 -3047 -5970 5495 8819 6787 6024 -2458 -4708 4648 8373 11042 12904 14745 14276 12250 10285
2218 10285 10029 7385 -622 -7543 -4934 -2732 -95 787 -4171 -2975 2269 8987 8472 1880 176
2203 176 5766 4952 49 -3783 -1277 1267 -91 -4136 -2156 2332 -673 -7389 -7807 -6771 -3528 648
2187 648 7407 8952 6113 3580 3223 3869 -506 -1329 3927 1839 3047 3253 4352 9140 9322 1766
2171 1766 -3729 -6465 -5971 -11952 -18514 -17742 -8302 2731 2695 5561 1308 -6905 -2542 4421 9844 4283
2155 4283 8863 6339 8973 14128 12431 8098 7939 5641 6530 10309 8310 5210 7877 5948 2827
2140 2827 -110 -4605 -6948 -7033 -6830 -8069 -8650 -2695 -803 -4132 6304 7472 3 -8058 -8561 -1943
2124 -1943 8276 11456 7791 2221 -3168 -2918 -8710 -9394 -4451 -10184 -13258 -7881 -1164 270 -5225
2109 -5225 -3982 -1701 -5509 -4026 1800 4293 6566 4743 8716 8109 3877 4513 10237 11736 15249
2094 15249 12368 10188 8114 7770 9734 4450 3393 -946 -5201 2218 9595 10615 8020 783 -3149
2079 -3149 -3925 -7449 -10703 -16123 -11265 -6528 -5308 -4103 -7655 -2510 485 2525 4977 3490 -1381
2064 -1381 -7564 -4058 4629 9818 6662 8983 8589 6387 4681 10311 9650 2580 7896 14322 12373
2049 12373 3904 1996 1321 1184 4207 1529 4428 335 3894 7484 6295 3692 -2158 -4942 -2615
2034 -2615 -7956 -6574 1260 9314 13206 13232 7513 10662 9498 150 -2772 -1716 0 -5758 -11386
2019 -11386 -11224 -8686 -6462 -5254 -3310 -1594 7109 13042 12548 8583 2846 7454 2105 -2526 792
2004 792 485 5452 10076 12017 8689 4503 1695 305 34 7214 12933 15273 19150 11738 9751 1476
1988 1476 1140 3930 4056 5256 1783 900 631 1184 6322 10218 11094 14549 6593 3772 1870 4914
1972 4914 1701 3202 4899 7455 8744 11086 6400 4165 -2235 -8649 -5372 525 -4362 -4008 8925
1957 8925 11991 12742 15920 12273 3821 3725 9720 4002 3632 5232 2285 -3155 -1756 2482 -2017 -201
1941 -201 5061 809 -4839 -1157 -7634 -6131 -6916 -8217 1108 4812 2315 5049 4857 4966 2246 8146
1925 8146 5400 1972 6785 5517 1798 -6449 -855 801 -7571 -11608 -9595 -5381 -1155 1215 1275
1910 1275 -2590 -2969 -6425 -7215 -3056 -1197 -3690 -11055 -7914 -8702 -9521 -4394 -1376 -4196 -6490 -5323
1894 -5323 -6279 -3718 506 2938 2447 1111 3480 3313 5383 -259 -5106 -3399 -1429 -978 -1333 -5209
1878 -5209 -4934 -6695 -5592 -7172 -6757 2627 9330 7401 5043 6200 4659 -3729 4511 4297 768 1579
1862 1579 -572 -1553 351 3734 11182 8572 6346 6564 8768 6489 7770 5550 4496 7564 9180
1847 9180 8818 6257 1704 -567 -2624 1500 12234 11089 7912 3104 1328 -4259 -6765 4092 7062
1832 7062 2624 -9699 -13203 -14577 -15074 -14842 -10873 -1214 1888 3334 2057 -2258 -939 856 2783
1817 2783 541 -1547 -507 -66 -3487 2958 8126 3764 2846 8695 10694 8480 4962 4856 1423 1160
1801 1160 5386 4437 2456 5533 8112 8841 6869 1738 -509 3557 7963 15051 5218 -3129 -7328
1786 -7328 -9691 -6512 3222 3487 4283 2387 9792 11664 3064 -1813 -375 2222 5373 11271 13987
1771 13987 10339 -1166 -2155 -585 -4620 -861 4612 6911 4154 -4581 -7308 -5576 -5324 -3417 -2949
1756 -2949 -4474 -3482 3706 7211 3122 245 -2560 -3777 -102 -1261 2308 8287 6175 4403 -5647
1741 -5647 -4954 1687 3547 2126 -1356 -2714 277 -562 1241 3583 5798 -3603 -5188 -4653 -6528 -18372
1725 -18372 -20859 -9085 241 1648 4326 568 1072 -3595 -5012 -4572 -6191 -1088 -440 -3084 4034
1710 4034 8087 5401 10306 8487 3963 4850 6122 4468 -890 573 -353 -7039 -10127 -6112 -652
1695 -652 -3217 -3889 -4125 -7070 -10053 -5948 -4596 -5123 -7312 -5907 -4475 664 -1597 -3733 4177 5304
1679 5304 3946 4196 4189 -247 -5415 935 3596 1389 5430 3205 1577 5760 9294 5952 -2271 -1951
1663 -1951 -1377 2926 3928 -1947 -995 6342 8796 16243 12779 823 -5140 -4261 -11303 -16080 -8463
1648 -8463 -2460 2011 1425 5435 6337 9263 6731 5697 7445 5849 4745 -2331 -2844 1000 3939 6448
1632 6448 4377 3472 -5757 -8835 -4934 -3021 -428 -355 -2242 3699 3624 2245 -467 -2569 -3471 -3502 -5028
1615 -5028 -5088 -1844 -219 1140 3898 4906 5369 588 2614 5694 4291 4581 6376 8887 5370 -5173
1599 -5173 -4145 -3448 -7600 1883 2317 -3527 3846 7650 82 -3525 -2437 -3462 -9331 -5627 -4041
1584 -4041 -11870 -17337 -17666 -15709 -19412 -6715 1204 -1809 -6671 -6975 -1195 5047 4148 1692 -1931
1569 -1931 923 -5563 -5348 3325 5277 6526 5309 1398 -1072 -630 5202 5749 4633 9866 3551 -7655
1553 -7655 -9402 2986 8359 6355 10707 16611 17538 9453 4416 -1286 136 2797 2352 -1794 3819
1538 3819 5428 1794 -3125 4702 7544 3731 2975 985 -1662 -5313 -361 9457 4782 -42 -554
1523 -554 -5062 -9000 -9245 -8598 -10476 -8386 -2509 2529 2455 7063 4952 5167 7792 8943 6183 4325
1507 4325 1108 -2931 -2671 -80 5548 10213 7030 263 -4195 -2606 -1368 70 1513 2922 6104
1492 6104 7092 922 -9726 -4907 -8404 -6443 1566 413 3060 -1486 -3611 556 -76 -4004 -9481
1477 -9481 -7031 -1746 2335 12490 17210 14828 11087 7855 1944 1721 2387 -2521 -765 4251 7209
1462 7209 4959 2393 2393 342 -906 -2256 -2021 -3307 -7581 -13787 -9367 -6169 -2717 -2842 -2482 36
1446 36 -216 -5120 -6487 -8110 1129 4408 3962 10530 9846 9156 7109 6071 1538 3608 2944 4214 -6531
1429 -6531 -14155 -8670 51 6053 2510 -6222 -9488 -7633 -8530 -5277 -1165 4500 6061 4219 -1736
1414 -1736 -4145 -1428 -1122 1053 983 2040 -2930 -9828 -10020 -6625 -5673 -6004 -3050 -7177 -6770 2798 3800
1397 3800 2284 -1006 -5769 -7711 -6763 -7694 -10657 -15275 -14887 -7412 -753 164 -3604 -10087 -6059 6867
1381 6867 6021 6189 7301 5805 3104 -24 431 3210 1308 -2524 -7089 -1984 1198 -2921 1994 8902
1365 8902 11808 9789 7617 -854 1331 11028 6547 -1320 -16715 -14434 -10764 -7607 -4903 -2398 -3150
1350 -3150 -4974 -1190 3088 -401 3494 3825 7639 9549 1526 -2857 -4786 -11343 -14271 -8374 -1277
1335 -1277 -474 -8469 -10398 -7993 -5621 129 1386 -916 4846 6293 5362 9946 5991 7418 5493
1320 5493 6142 5746 4561 10322 4973 -2147 3873 3935 -2867 -635 1614 -4316 -6914 -6213 -1860 4847
1304 4847 -2547 -4906 -5573 114 9032 5812 -447 -4067 -5689 -8995 -6942 -3390 1675 378 -2088
1289 -2088 -542 -3398 -475 2649 3297 3626 10879 8393 2689 8614 5578 1588 2185 6230 9990 5607
1273 5607 7653 4899 3650 7140 7066 9175 7109 -3024 -1239 -3183 -7100 -6341 -1822 -1779 -4080 84
1257 84 -1339 1096 1890 4659 3805 -277 22 136 4153 10001 5702 5689 3412 7344 6429 2180 740
1240 740 4165 10079 7254 9715 12000 6900 35 2238 -4563 -8625 1412 4262 4378 3527 6392
1225 6392 14962 13029 9825 2269 2524 4408 -1869 3423 3848 -4785 -4745 1408 2303 2679 8046 8743 4842
1208 4842 5283 2821 6294 2792 -3203 -4285 -5107 -1660 -2504 -9027 -2631 1719 -3767 312 4848 5856
1192 5856 10782 11191 6199 1886 1302 915 -6156 -4444 -5713 -6215 -1794 -7 -5454 -12645 -13980 -11650
1176 -11650 -7927 -9321 -6473 -1058 1224 1022 1237 -661 -7169 -9414 -8149 -13985 -5259 1673 818
1161 818 -766 3509 4558 -3474 -6061 -5716 -5647 -1473 3656 282 2062 7279 7719 2893 9308 6747
1145 6747 3657 3886 3368 -4352 -6067 -7510 -1794 4133 1481 -596 -4797 -6132 -10703 -8015 -4587
1130 -4587 -855 930 -3297 -8823 -4524 -1779 2559 5563 10559 10633 13154 9941 1419 -288 -1086 6135
1114 6135 13187 16244 13277 9975 9357 6154 6711 2968 -3462 2020 3073 4139 605 -4315 -1349
1099 -1349 -3538 -5650 -4331 -6873 5318 14930 12033 8501 4968 2057 6735 -4047 -11401 -5239
1085 -5239 -1768 -7383 -5082 2970 274 -1406 -5394 -5092 -1698 1699 7238 1703 -1451 913 2935
1070 2935 -1522 -14413 -17403 -8862 -11658 -6312 -4763 -2137 -5316 -4857 2827 2674 -5595 -3550 4467
1055 4467 2419 3694 6714 8899 9998 11379 14565 14519 9750 2035 4477 2516 -102 -4697 -2268
1040 -2268 -2385 -3870 -7130 -12030 -2806 -2726 -4121 -4425 -2518 -6364 -5559 -2479 -2052 4372 11329 12673
1024 12673 8915 2164 -7788 -10130 -4802 -4258 -7991 -11487 -12283 -10935 -10673 -8020 -5878 -6868 -9597 -6650
1008 -6650 -3752 778 562 224 1114 5128 8931 7615 -719 -2142 -2304 3327 2977 45 2449 790
992 790 -3502 5755 6044 7987 7256 9907 10852 7316 5110 484 -2244 -1403 1604 -2419 -6607 -1881
976 -1881 -3302 -3334 2486 4031 -2479 -5132 -9037 -8938 -3847 -4566 -8255 -9178 -10873 -7757 -1545 1716 2471
959 2471 -496 250 -949 100 7348 12474 16477 14243 8347 6572 5401 10080 8890 -2774 -9198
944 -9198 -12987 -13519 -8360 -4699 279 -6944 -5346 -5305 -4933 -1561 5856 6047 1021 1460 10132 18840 14953
927 14953 10292 9649 5833 1637 -2682 3058 4795 -694 395 -2650 763 2127 7874 5107 -4357
912 -4357 -20 8665 5542 3281 2452 956 1316 5172 6363 10960 18798 12175 11433 17905 15857 18054
896 18054 12410 14359 16634 15236 14437 14705 11621 6682 9393 6055 -2708 461 4307 7232 4695
881 4695 7890 6360 364 -1704 -1747 -329 325 3717 12486 13097 9191 6480 -1928 -8032 -1267 2665
865 2665 -1632 -6139 -899 3096 10096 13969 10592 2361 1078 3205 468 2077 1654 2541 -85 -4373
849 -4373 -2526 4595 4729 4368 6866 6180 2787 6103 3877 2213 4836 4898 10478 7888 4670 3310
833 3310 7998 5418 8774 219 -5617 -1472 6115 3800 8654 13251 12188 8889 2943 183 -580
818 -580 1976 -409 1965 -1477 -1668 -1417 -3163 200 -3070 -2203 4084 1265 3610 10970 12502 11069
802 11069 8558 1761 -2431 57 -1930 -4525 -5905 -3384 4900 6820 7769 13760 22224 17206 5508
787 5508 1921 1540 6961 11049 6600 6216 3578 5207 7268 4415 5745 2677 2842 780 -4814 -2608
771 -2608 -8702 -8423 -6728 -6059 -5039 -8110 -4163 365 3019 2628 -5967 160 13461 18095 9472 -275
755 -275 -961 345 4403 5965 3379 5206 2316 -3797 801 3922 -96 -3585 1613 6206 5770 7025
739 7025 8945 4823 2407 1965 -4236 -7991 -6513 1063 -1073 -1099 -2503 1269 20 1583 2516 -224
723 -224 -1830 -3049 -3428 -539 3497 2118 1852 6005 6352 2915 1309 1221 1889 1154 4342 4768 88
706 88 1215 6061 2767 4460 11819 17373 14797 10610 5162 5445 7143 1754 -6258 193 7106 -2066
690 -2066 -8664 -6997 -5336 -516 5002 9231 10598 2978 -4311 -26 4066 4760 7002 4912 6365
675 6365 7981 93 3698 5244 12721 13211 12460 14379 18627 14105 5509 9194 8973 15896 9762 -2818
659 -2818 -7989 -3423 1116 6541 13973 8290 3100 -4418 -7011 309 6020 4514 5741 7880 7397
644 7397 4130 136 4971 3871 1247 -3612 -1814 751 1901 -1460 -8716 -7516 4067 8028 11786
629 11786 18614 12038 -2737 -107 1013 -853 -5049 -8297 -1882 -1649 -2579 4979 7308 8151 13414
614 13414 14129 4805 -708 6157 13204 12435 8506 7386 -1644 2731 15724 8284 1964 -7213 -5540
599 -5540 -10292 -10549 -6053 -5302 -2210 -4845 -12715 -22251 -18766 -16807 -14679 -7491 8150 11580 4206
584 4206 3822 5278 6960 10416 13154 7441 4220 9083 12806 5654 -1494 -8556 -10906 -5167 4267
569 4267 7345 5795 3667 3541 6745 1589 1580 2283 1018 3222 9232 16022 17682 14304 8640 10393
553 10393 10274 12410 18158 20843 17713 17512 11871 7479 4205 -1705 -3597 -821 -2908 1823 -3640
538 -3640 -2617 -5338 -8058 -3191 -317 6203 3569 2370 1988 6064 8705 12548 9862 9326 4477 828
522 828 -3289 -68 1842 1384 1939 9235 2926 -5924 -7025 3519 6059 7220 2326 -2413 -8298 537
506 537 7318 7036 4944 4108 9530 7785 2556 -846 -2001 -135 -456 -3834 -8119 -13672 -11503 -6233
490 -6233 -6745 -9809 -12255 -7653 -1102 1518 2693 2769 3192 -5993 -6521 537 -1852 -10931 -6281 1027
474 1027 3472 -753 -1150 1667 6308 2806 -7581 -2772 5039 3363 -2852 -4498 -1300 6113 7584
459 7584 7873 11442 3533 2708 -2845 -4839 -3488 -3091 1824 258 -1252 -218 -575 -1993 78 3132
443 3132 1944 4268 2833 1682 -2449 2833 370 -1283 -2311 -2240 2092 5571 245 499 161 5534
427 5534 4074 5583 7918 7192 -19 772 6038 2795 -439 3729 8771 9121 9977 12565 13746 14522
411 14522 9026 3121 2007 4981 8017 12833 15004 16119 17491 11943 6437 28 -665 1588 -2770
396 -2770 -1112 5554 5162 2859 2253 -3578 -2091 2231 4009 10043 3928 7009 11342 13038 9041 7040
380 7040 3085 1806 -2620 -6582 -9819 -10015 -5180 363 7158 9953 9116 5464 2374 157 -2385 2282
364 2282 6888 5409 3219 3736 3051 1126 2464 2906 1283 -2251 -2723 4747 9296 8758 3005 -1153
348 -1153 -762 1979 2168 -662 5585 9914 8137 9424 13149 5381 6299 10414 9978 10203 11263 9217
332 9217 6258 5019 12045 13128 11586 13439 13499 12363 10219 2935 12268 16553 18195 15539 10193 10466
316 10466 11440 10598 1508 396 3545 7733 9164 5518 2334 -1883 -4026 -4659 -2669 -3403 3105 7330
300 7330 12414 17512 15877 14065 13958 16112 13324 8862 5537 1843 2513 1705 -51 7892 10344 4439
284 4439 4064 -2740 -3538 -1701 -1030 -555 4793 614 -9679 -14449 -15853 -7350 -3264 -1373 4212 4905
268 4905 7916 9544 6429 4958 -1142 -993 3665 4100 4073 11078 8409 7462 3321 -3297 -3223 2317 1660
251 1660 334 -3351 -5969 -4818 -5377 -4328 -2799 3161 3433 2441 3453 5560 6572 7258 11592 8076
235 8076 7145 3943 5977 8578 7907 3526 9396 13028 10313 5740 4024 -2417 -2136 2066 3165 -2840
219 -2840 -6090 -3567 -3803 -5176 -7939 -6151 -2260 -3064 4429 8121 7084 2263 5228 4166 4301 5422
203 5422 4186 4689 2220 69 690 2935 4090 6462 4092 1 -3784 -427 2941 4110 1625 -1066
187 -1066 286 1489 -221 -4801 -7277 -5248 -5590 844 6782 9969 10013 7687 6548 10394 11880 8867
171 8867 4889 3484 2334 3877 -1086 -2415 1061 -2071 -5626 -7528 -6648 -6265 -3711 -1724 -513 391
155 391 -1883 1180 9014 9444 7824 4916 9590 12715 10078 9338 5698 2577 1564 6839 5916 3549
139 3549 6482 5682 5802 8515 6620 6951 3914 3871 -600 -1612 -1128 4325 6773 5974 7541 7730 8018
122 8018 7376 4609 5678 3301 2340 3167 2411 3509 3922 4909 6843 5600 6353 2510 -2344 2145 5229
105 5229 4504 3929 9992 13296 10566 6056 4482 3530 5622 8734 6766 4993 8269 11351 9983 6025
89 6025 8717 10497 13241 7597 6191 5075 5727 8416 9968 9641 7530 4481 1624 1729 5473 3228
73 3228 782 -1647 -697 -8592 -8887 -6573 -4991 2157 4786 4491 7485 9121 6529 -84 -6002 -6890
57 -6890 -6102 -3720 -4747 -7109 -4318 -4458 -944 4533 5289 1496 -5225 1100 7292 9471 9159 8043
41 8043 7688 4629 3708 1875 945 5838 11888 11774 13933 14477 7272 12254 11419 6858 3914 2571 1995
24 1995 7245 8508 6687 6408 2105 1860 6529 4323 850 7205 11400 7734 1276 2919 4003 1304
8 1304 2412 4850 5320 1459 -2769 -3395 3314 6457
0 6457
$$ Imaginary data points
##PAGE= N=2
##DATA TABLE= (X++(I..I)), XYDATA
32767 33752 30047 26087 25553 26345 26650 25966 28691 34426 39722 40105 40044 44042 41642 35734 28470 34682
32751 34682 38482 41793 44764 41640 45246 46777 49721 51988 48950 43545 44420 46452 47443 50511 46034
32736 46034 42742 44597 46780 50317 50883 48699 48917 50118 49732 50165 48431 43466 44366 50776 53194 51922
32720 51922 46673 46805 55663 56991 58169 61041 64952 63161 62035 64885 66403 63863 58851 54317 53539
32705 53539 59161 57304 54517 60302 65401 63076 59510 60975 63978 59869 60280 65055 71886 72227 71097
32690 71097 69836 69792 67118 68223 64825 62843 66848 69308 65639 65126 65203 68230 71346 71743 73302 70914
32674 70914 70433 74283 73054 73726 75295 76522 79128 74642 75935 77007 77707 79083 82404 77311 74825
32659 74825 74774 78470 81571 86896 89730 89563 83710 81137 80696 79806 80292 87901 89896 85589 79485 80200
32643 80200 77566 79559 80236 81038 81924 84463 84734 86862 86842 85465 88498 91241 89268 89782 93746 93258
32627 93258 90437 87791 88493 92097 98886 98859 97963 97556 97571 99957 100388 95306 90629 90279 90492 96197 100176
32610 100176 103647 108529 103977 94245 96738 99326 100505 102040 104117 105205 105464 102835 103967 102936
32596 102936 102934 99169 97291 97185 92325 87320 86162 87475 92997 95449 102051 104725 106649 109468 111289
32581 111289 108633 104720 101905 98800 96844 100334 102529 98716 96639 99206 102495 102206 99949 104741
32567 104741 105803 104484 106379 110784 110189 114888 114028 110187 110707 111328 110757 115068 115355 112196 109855 110477
32551 110477 118586 126702 128596 125392 126476 120943 120978 119158 111727 114795 113955 109604 116072 123930 125246
32536 125246 123531 128044 129405 126453 123676 126936 121615 122365 125845 126521 122261 120966 119776 121846 128003
32521 128003 127720 129191 125595 121282 130815 135204 130156 128197 128318 126816 125380 127731 134799 137989 132201
32506 132201 132629 136025 132723 133694 126803 124313 130064 128350 131825 129604 125153 120947 124221 129785 130267
32491 130267 130570 125872 126516 129646 125208 126954 132327 140506 147077 146474 137235 128459 130328 138660 144578
32476 144578 145625 146485 147916 145645 137849 135653 142111 146408 145159 141833 142957 147022 150820 145139
32462 145139 143959 141136 135055 135483 134407 132224 129942 132446 136748 139710 146098 144262 145556 147406
32448 147406 149402 147854 146445 144483 144776 143684 141093 146268 148893 149702 144038 146494 141314 137291 145100
32433 145100 152102 154479 153659 153136 152954 146263 149258 152729 148644 147734 145440 143786 143234 147920 154642
32418 154642 160120 159783 155341 155785 158075 153988 150274 148936 153177 152927 155700 156761 155158 155240 155451 155637
32402 155637 153777 157857 157216 153541 154579 155088 157141 156362 156342 154096 154334 145716 143903 145973 146935 153006
32386 153006 160244 164069 162606 156254 153363 152513 157098 157038 161088 155512 159776 160423 152689 150991 154045
32371 154045 158542 157902 156871 162428 165321 159261 156917 164258 170843 170678 165155 160782 154049 155326 160422
32356 160422 164394 158840 157837 153847 159354 165626 166804 166403 166366 164992 166528 171350 170837 167023 164552
32341 164552 159189 153041 150722 153053 155895 156676 161468 162261 167610 171237 168584 168751 166723 167214 170547
32326 170547 168325 166198 164889 166357 167434 164570 164479 157203 153197 155163 154314 155385 155654 155583 152583 154200
32310 154200 154065 148178 152063 156356 154591 151323 155230 156990 160374 163542 165746 159462 158434 164355
32296 164355 164798 163641 161829 156847 154388 152490 150570 151412 158129 160788 158364 162521 169036 163271 154582
32281 154582 156622 164562 161612 160055 162800 162202 161848 158408 155147 163816 164333 162843 158168 155915 156479
32266 156479 160401 161837 162104 160337 157726 156293 156923 161130 166601 168372 164400 157175 152737 162035 171090
32251 171090 171983 170848 168921 172475 176060 174015 168127 164577 167418 173268 176402 173164 167402 170689
32237 170689 167191 162656 161382 169479 174095 167857 163848 160543 165774 169458 165779 164015 165706 164233
32223 164233 159185 162324 165528 163981 163139 164052 169502 171459 174191 177328 177753 173169 172755 175498 178450
32208 178450 178721 177104 171100 170073 176990 174554 169766 167872 167898 171483 175466 177202 180026 178890 174079
32193 174079 165045 163974 170652 167774 173428 172964 165415 163096 171749 169594 170965 180880 177509 174039
32179 174039 172828 175829 173809 170124 170351 175967 177508 174086 164128 162234 160120 160595 161232 162582 163158
32164 163158 168617 171362 169015 167231 170143 169797 167657 169944 174988 174418 169606 168505 178263 177942 182834
32149 182834 179892 175764 176770 177005 174603 166624 163892 162047 165914 172494 171406 160853 162849 162715
32135 162715 158757 163907 170514 177541 179095 177440 174351 170018 167996 176211 175378 170392 164855 169650
32121 169650 165810 163556 167809 169808 173671 183907 179304 167951 164596 165531 166149 170192 174249 176156
32107 176156 178907 179012 170286 172529 177262 175221 169135 166783 167890 175624 173346 170446 170528 173765 174579
32092 174579 169364 166752 163841 164626 159897 159685 166974 167840 170385 176280 181303 184887 178240 166945 165569
32077 165569 172375 173526 174604 174955 175857 179455 183446 182665 182485 177332 167752 168047 171562 174645 178853
32062 178853 174940 178295 183881 183960 179126 180375 178502 177190 176708 177166 178744 174797 166345 165866 172086
32047 172086 173970 167767 163845 170285 175605 174405 168908 163529 161980 164504 168139 166824 172951 183793
32033 183793 184159 178374 178334 179922 180069 178590 175541 169467 167493 171282 176550 180474 177470 171734 169082
32018 169082 167546 170773 174709 174376 170050 173208 170755 165457 165537 167721 179017 180515 176968 175829 179163
32003 179163 183024 184547 183146 178201 177708 180580 178495 166129 164430 172436 177423 177685 176599 176626 174580
31988 174580 173103 171579 173762 176973 170076 165498 165394 170377 172187 171818 175611 181483 181516 176899 174926
31973 174926 177785 175858 175030 173568 178870 176169 170647 174611 175481 173412 170053 168031 164548 169180 171594
31958 171594 177574 186130 183036 183617 181522 178568 176480 174922 172505 170053 168916 168129 170658 174487 177087
31943 177087 185171 193421 185412 171392 165460 166481 163161 161917 171125 177505 180880 180332 184366 178598
31929 178598 182816 184547 180683 182439 176371 175878 179251 183241 181635 181940 182132 184965 184462 176388 182935
31914 182935 189830 188739 187304 191851 180007 177005 178280 177092 174310 172611 171195 168368 161158 165595
31900 165595 167446 173026 172651 172672 171424 173310 171741 172051 173710 176304 174506 175848 179934 175638 175398
31885 175398 176324 176628 185371 181617 179872 177024 178828 180439 180755 179372 172421 174376 170387 173067 176689
31870 176689 174271 173425 170622 177654 182485 177923 172846 174433 176483 171594 172086 179821 176234 170007 169664
31855 169664 169182 171837 172601 175801 177037 180747 176794 174383 171480 169673 168420 168250 170731 173040 169450
31840 169450 163258 163559 164624 169197 171818 171953 174200 173549 175985 179986 174971 179495 178210 171183 160967
31825 160967 155640 159193 164278 170287 175935 177783 181602 179173 177628 180009 181363 176921 176679 181672
31811 181672 182162 172575 172834 176203 167473 166371 174258 180265 183130 181298 176341 174682 181304 183992 187913
31796 187913 184593 180833 175921 176498 181369 182003 183983 184238 177307 172878 178708 179073 174189 163733 168332
31781 168332 176339 177783 179742 178709 176270 178570 178136 179866 181355 180506 181828 182488 178013 179070 179132
31766 179132 185202 180199 177066 176672 176367 171885 170238 169966 165548 164006 164727 168538 175052 182686 179093
31751 179093 177643 175407 166525 163794 170078 178635 180075 175349 169904 168909 169114 174652 175285 173861 176682
31736 176682 172487 173804 176770 178220 177966 175625 165366 162464 166208 170181 176684 177042 175964 171465
31722 171465 170145 174039 174842 175625 174728 172923 169711 163109 169340 172556 173901 174562 179220 176898 181357
31707 181357 180627 173544 173829 176139 177749 181987 179634 187090 190603 180179 173837 172984 171032 181780
31693 181780 188425 183445 179715 182961 190075 193627 193147 191496 187340 187307 188510 184717 182134 180250 175767
31678 175767 175245 178522 175490 176287 177492 178580 182996 185056 182661 180809 182429 192125 182765 166679
31664 166679 165597 173849 173978 182738 181926 181964 190644 188174 182463 178512 175193 181756 184295 184542 184232 182536
31648 182536 182275 187258 184572 187111 186333 185940 184704 183904 187891 183275 178371 177554 181739 182803 185541
31633 185541 197374 196489 192253 182482 178793 176137 174984 178870 185014 181326 175914 174798 177275 175124
31619 175124 168995 167900 170956 182517 190906 192219 185242 177951 168210 165330 164628 170950 178766 181091
31605 181091 179454 178582 176179 173590 170331 168109 174805 168858 168929 169680 171771 168974 166655 165449 167219
31590 167219 168233 171635 178868 180447 178384 176432 173678 171253 167860 172595 180584 183382 183722 188022
31576 188022 189414 189201 186230 183772 181800 183425 188711 191754 185127 181086 182555 183684 186174 190649
31562 190649 184515 180751 173335 172074 177364 182724 183100 183011 183591 182623 183488 177935 172131 173433 174187 175245
31546 175245 181173 182724 180380 180848 179894 184370 186068 182414 185594 187054 182698 184301 183077 177758 174360
31531 174360 176775 173225 166921 169521 170528 177362 182603 177711 169997 175746 183516 179081 182091 185815
31517 185815 183214 184082 182412 176777 179206 180089 183666 183951 175598 167948 169234 174771 178939 187448 194403
31502 194403 188931 184072 187040 185248 176477 172387 174697 176550 174981 182846 189466 192159 184903 177243
31488 177243 174173 177021 184878 181776 177898 171643 172598 172889 174948 174510 171546 177217 177176 181969 185340
31473 185340 185063 186530 187849 188181 192332 197330 198466 196093 196016 184061 178886 179854 182544 185738 183903
31458 183903 178662 186057 191700 186707 183692 178872 180250 185697 187333 178647 175458 174929 177732 183271
31444 183271 181319 178860 176516 176191 181926 177001 171271 167921 173244 180595 192523 189077 181683 177055
31430 177055 177143 181908 180547 178857 175022 178684 181761 180139 179077 177374 174761 171154 171660 172536 170550
31415 170550 175633 177957 180619 182630 180016 178851 175389 174745 179370 178052 169809 169181 171371 174063 177369
31400 177369 171862 174441 178771 179527 176870 175092 173707 177259 180832 188332 186926 185116 184267 184851 180361
31385 180361 177228 170616 168507 176830 174767 172689 173780 177231 178462 180492 184502 188269 188765 193214
31371 193214 187694 191049 196467 197050 199015 200747 204959 198412 192185 191338 193197 194214 196224 204001 199127
31356 199127 196205 194828 196426 192935 189904 189055 187277 183135 180935 180535 187485 186770 189991 189512 188779
31341 188779 189653 190808 190986 188281 189752 191333 186879 179522 177578 179900 180758 182004 182748 180322 184083
31326 184083 189280 186980 185962 187980 188396 188255 189551 188261 190215 192754 192833 185759 188837 191879 186545
31311 186545 189739 195256 195411 193090 192674 189963 188469 189982 189842 187758 180712 176564 185346 185636 179392
31296 179392 174603 172777 179114 177359 171084 171501 183628 191436 192949 192728 179607 174970 173735 174425
31282 174425 179349 181099 175510 171932 170936 166205 157865 157345 164467 172760 173632 172961 178563 183931 185862
31267 185862 184654 175857 174396 170122 169608 173780 181613 184827 176025 180540 190412 196165 195740 187800 185609
31252 185609 189378 190413 182172 176134 171130 176927 176636 180518 186181 185943 178071 174848 180166 181682 176321
31237 176321 181604 186425 187914 184494 179067 180362 182069 187245 189239 185164 185424 177694 171101 174180
31223 174180 172052 175157 181911 184011 183275 185661 183604 176728 177358 180117 179949 173979 169161 169206 177039
31208 177039 184986 185061 182946 184523 185051 184898 181318 182479 188570 190037 193110 190346 186643 189021 182787
31193 182787 178947 178924 181077 182691 179911 179438 176438 179401 186421 185881 186885 189225 187914 182863 185844
31178 185844 192801 192311 179827 177431 180471 187117 190436 188348 187555 186740 182909 180370 181976 184274 183298
$$ [...]
##END NTUPLES=NMR SPECTRUM
##END=
