##TITLE=Analysis number 326148
Compound Code cc 61451
Book Reference 449/180
Project Code adrs
Chemist Name davee
##JCAMPDX= 6.0         $$ Bruker NMR JCAMP-DX V2.0
##DATA TYPE= NMR SPECTRUM
##DATA CLASS= NTUPLES
##ORIGIN= Bruker BioSpin GmbH
##OWNER= nmr
$$ XWIN-NMR		Version 3.5
$$ Thu Jan 25 14:11:33 2007 GMT Standard Time (UT+0h)  MAYBRIDGE\nmr@NMR_250MHZ
##.OBSERVE FREQUENCY= 250.131544655141
##.OBSERVE NUCLEUS= ^1H
##.ACQUISITION MODE= SIMULTANEOUS (DQD)
##.ACQUISITION SCHEME= undefined
##.AVERAGES= 16
##.DIGITISER RES= 18
##SPECTROMETER/DATA SYSTEM= dpx250
##.PULSE SEQUENCE= zg30
##.SOLVENT NAME= DMSO
##.SHIFT REFERENCE= (INTERNAL, DMSO, 0, 16.522)
##AUDIT TRAIL= $$ (NUMBER, WHEN, WHO, WHERE, WHAT)
$$ ##TITLE= Audit trail, XWIN-NMR		Version 3.5
$$ ##JCAMPDX= 5.01
$$ ##ORIGIN= Bruker BioSpin GmbH
$$ ##OWNER= nmr
$$ C:\u/data/dgb/nmr/ADRS/2050/pdata/1/auditp.txt
$$ ##AUDIT TRAIL=  $$ (NUMBER, WHEN, WHO, WHERE, WHAT)
(   1,<2007-01-25 14:11:10.77 +000>,<MAYBRIDGE\nmr>,<NMR_250MHZ>,
      <created by zg, POWCHK disabled, PULCHK disabled
       configuration hash MD5:
       49 4B E0 1D 92 C2 6B 37 9F E6 65 BC 52 41 86 1D
       data hash MD5: 64K
       FB 22 E4 44 AD 70 D3 79 BD F2 26 39 F3 91 2C 79>)
(   2,<2007-01-25 14:11:24.98 +000>,<MAYBRIDGE\nmr>,<NMR_250MHZ>,
      <Start of raw data processing
       ef LB = 0.3 FT_mod = 6 PKNL = 1 SI = 32K 
       data hash MD5: 32K
       97 FE 0D 70 4E 15 98 E2 47 10 33 16 AB 23 0F 33>)
(   3,<2007-01-25 14:11:26.77 +000>,<MAYBRIDGE\nmr>,<NMR_250MHZ>,
      <apk 
       data hash MD5: 32K
       B9 5A 1D A6 61 F0 F7 18 BA 16 B4 5C 6B 50 F7 32>)
(   4,<2007-01-25 14:11:27.55 +000>,<MAYBRIDGE\nmr>,<NMR_250MHZ>,
      <abs ABSG = 5 
       data hash MD5: 32K
       63 BD D1 D7 96 43 2E 23 2D 8E F1 34 61 46 75 6A>)
$$ ##END=
$$ 
$$ hash MD5
$$ 0D AD 22 CA F9 09 ED AA 79 40 59 BF 92 B8 8D 9A
##$RELAX= 
##$RELAX= 
##$RELAX= 
##$RELAX= 
##$RELAX= 
##$RELAX= 
##$RELAX= 
$$ Bruker specific parameters
$$ --------------------------
##$DU= <C:\u>
##$EXPNO= 2050
##$NAME= <ADRS>
##$PROCNO= 1
##$TYPE= <nmr>
##$USER= <dgb>
##$AMP= (0..31)
100 100 100 100 100 100 100 100 100 100 100 100 100 100 100 100 100 100 
100 100 100 100 100 100 100 100 100 100 100 100 100 100 
##$AQSEQ= 0
##$AQ_mod= 3
##$AUNM= <au_zg>
##$AUTOPOS= <36 >
##$BF1= 250.13
##$BF2= 250.13
##$BF3= 250.13
##$BF4= 250.13
##$BF5= 500.13
##$BF6= 500.13
##$BF7= 500.13
##$BF8= 500.13
##$BYTORDA= 1
##$CFDGTYP= 0
##$CFRGTYP= 5
##$CHEMSTR= <none>
##$CNST= (0..31)
1 1 145 1 1 1 1 1 1 1 1 1 1 1 1 1 1 1 1 1 1 1 1 1 1 1 1 1 1 1 1 1 
##$CPDPRG= <>
##$CPDPRG1= <>
##$CPDPRG2= <>
##$CPDPRG3= <>
##$CPDPRG4= <mlev>
##$CPDPRG5= <mlev>
##$CPDPRG6= <mlev>
##$CPDPRG7= <mlev>
##$CPDPRG8= <mlev>
##$CPDPRGB= <>
##$CPDPRGT= <>
##$D= (0..31)
0 1 0 0 0 0 0 0 0 0.06 0 0 0 0 0 0 0.0002 0 0 0 0 0 0 0 0 0 0 0 0 0 0 
0 
##$DATE= 1169734269
##$DBL= (0..7)
120 120 120 120 120 120 120 120 
##$DBP= (0..7)
150 150 150 150 150 150 150 150 
##$DBP07= 0
##$DBPNAM0= <>
##$DBPNAM1= <>
$$ [...]
##$SUBNAM7= <"">
##$SUBNAM8= <"">
##$SUBNAM9= <"">
##$SW= 20.6930455092707
##$SWIBOX= (0..15)
0 0 3 0 0 0 0 0 0 0 0 0 0 0 0 0 
##$SW_h= 5175.983436853
##$TD= 65536
##$TD0= 1
##$TE= 293.16
##$TE2= 300
##$TE3= 300
##$TEG= 300
##$TL= (0..7)
0 120 120 120 120 120 120 120 
##$TP= (0..7)
150 150 150 150 150 150 150 150 
##$TP07= 0
##$TPNAME0= <>
##$TPNAME1= <>
##$TPNAME2= <>
##$TPNAME3= <>
##$TPNAME4= <>
##$TPNAME5= <>
##$TPNAME6= <>
##$TPNAME7= <>
##$TPOAL= (0..7)
0.5 0.5 0.5 0.5 0.5 0.5 0.5 0.5 
##$TPOFFS= (0..7)
0 0 0 0 0 0 0 0 
##$TUNHIN= 0
##$TUNHOUT= 0
##$TUNXOUT= 0
##$USERA1= <user>
##$USERA2= <user>
##$USERA3= <user>
##$USERA4= <user>
##$USERA5= <user>
##$V9= 5
##$VALIST= <valist>
##$VCLIST= <CCCCCCCCCCCCCCC>
##$VD= 0
##$VDLIST= <DDDDDDDDDDDDDDD>
##$VPLIST= <PPPPPPPPPPPPPPP>
##$VTLIST= <TTTTTTTTTTTTTTT>
##$WBST= 1024
##$WBSW= 4
##$XGAIN= (0..3)
0 0 0 0 
##$XL= 0
##$YL= 0
##$YMAX_a= 407078
##$YMIN_a= -384695
##$ZGOPTNS= <>
##$ZL1= 120
##$ZL2= 120
##$ZL3= 120
##$ZL4= 120
##$ABSF1= 16.522
##$ABSF2= -4.171173
##$ABSG= 5
##$ABSL= 3
##$ALPHA= 0
##$AQORDER= 0
##$ASSFAC= 0
##$ASSFACI= 0
##$ASSFACX= 0
##$ASSWID= 0
##$AUNMP= <proc_1d>
##$AZFE= 0.1
##$AZFW= 0.1
##$BCFW= 0
##$BC_mod= 0
##$BYTORDP= 0
##$COROFFS= 0
##$CY= 12.5
##$DATMOD= 1
##$DC= 0
##$DFILT= <>
##$DTYPP= 0
##$F1P= 14.0000005364418
##$F2P= -0.99999901652339
##$FCOR= 0.5
##$FTSIZE= 32768
##$FT_mod= 6
##$GAMMA= 0
##$GB= 0
##$INTBC= 1
##$INTSCL= 1
##$ISEN= 128
##$LB= 0.3
##$LEV0= 0
##$LPBIN= 0
##$MAXI= 10000
##$MC2= 0
##$MEAN= 0
##$ME_mod= 0
##$MI= 0
##$NCOEF= 0
##$NC_proc= -3
##$NLEV= 6
##$NOISF1= 0
##$NOISF2= 0
##$NSP= 0
##$NTH_PI= 0
##$NZP= 0
##$OFFSET= 16.522
##$PC= 1
##$PHC0= 219.0548
##$PHC1= 4.827028
##$PH_mod= 1
##$PKNL= yes
##$PPARMOD= 0
##$PSCAL= 4
##$PSIGN= 0
##$REVERSE= no
##$SF= 250.13
##$SI= 32768
##$SIGF1= 0
##$SIGF2= 0
##$SINO= 400
##$SIOLD= 32768
##$SREGLST= <1H.DMSO>
##$SSB= 0
##$STSI= 32768
##$STSR= 0
##$SW_p= 5175.98343685301
##$SYMM= 0
##$S_DEV= 0
##$TDeff= 65536
##$TDoff= 0
##$TI= <Analysis number 999999
Compound Code 99
Book Reference 9
Project Code 9>
##$TILT= no
##$TM1= 0
##$TM2= 0
##$TOPLEV= 0
##$USERP1= <user>
##$USERP2= <user>
##$USERP3= <user>
##$USERP4= <user>
##$USERP5= <user>
##$WDW= 1
##$XDIM= 32768
##$YMAX_p= 318592147
##$YMIN_p= -461989
$$ End of Bruker specific parameters
$$ ---------------------------------
##NTUPLES= NMR SPECTRUM
##VAR_NAME=  FREQUENCY,     SPECTRUM/REAL,   SPECTRUM/IMAG
##SYMBOL=    X,             R,               I
##VAR_TYPE=  INDEPENDENT,   DEPENDENT,       DEPENDENT
##VAR_FORM=  AFFN,          ASDF,            ASDF
##VAR_DIM=   32768,         32768,           32768
##UNITS=     HZ,            ARBITRARY UNITS, ARBITRARY UNITS
##FACTOR=    0.157963299565203, 1,           1
##FIRST=     4132.6476996994, 0,             0
##LAST=      -1043.33573715361, 0,           0
##MIN=       -1043.33573715361, -461989,     0
##MAX=       4132.6476996994, 318592147,     0
$$ Real data points
##PAGE= N=1
##DATA TABLE= (X++(R..R)), XYDATA
$$ [...]
20852 6877 23896 32399 7838 -14685 7866 33476 40630 34582 24367 11634 19073 25610 26352
20839 26352 21677 8243 21021 24553 36051 31236 21209 6256 -18122 -14669 833 24067
20827 24067 28849 7979 20441 22331 17996 27088 15743 13812 16321 6475 3889 9053 9453 17887
20813 17887 30090 41776 52801 47332 45836 30982 19473 -439 -1075 16334 31673 11526
20801 11526 -1290 4027 14698 22623 23492 17827 8679 8454 9632 5807 9208 27886 32271 25700
20787 25700 9608 15551 20616 14080 4254 14963 32903 27066 1843 7804 8879 18665 8744
20774 8744 4152 7811 9960 26082 38024 25736 32279 43573 18642 3138 5199 5150 -2945 -14813
20760 -14813 -22615 -2862 -5358 -4821 23255 22502 9832 3803 8701 23795 31425 34764 48065 31065
20746 31065 23963 10878 17308 21319 15561 13207 10720 16083 17258 10382 8397 24337 35707 43563
20732 43563 32388 30412 30962 16462 18117 29414 34871 18068 22254 29558 28129 33692 26289 27628
20718 27628 17279 22027 16341 16310 23630 36110 38256 49835 30331 18383 12363 -10491 -21291
20705 -21291 -26521 -15533 -5924 -4981 10544 10249 1971 -12628 -525 23110 29068 25292 13214
20692 13214 -1758 7064 22868 24370 18543 27689 47652 50332 17579 6604 20428 33498 20238
20679 20238 25634 48407 53367 40692 35186 26065 19143 23449 30896 29259 27425 18525 1606 1678
20665 1678 8481 -3182 -4252 16616 26965 14283 23948 24299 31029 31485 26481 31262 36369 32156
20651 32156 41354 31055 8180 1201 2854 631 -992 -6053 -16720 4511 12845 9057 23826
20638 23826 28677 21333 19650 7753 30634 42333 51324 29225 18969 10290 12383 2287 8166
20625 8166 10078 4836 -14282 -12755 -18226 -20002 8530 28497 41138 58693 64193 43441 25305
20612 25305 23923 27687 27820 34382 44938 47955 48128 37371 25634 37817 49544 54069 41435
20599 41435 20947 10052 24310 40978 47863 50437 44180 31059 18568 11639 2569 7681 8726
20586 8726 11191 11258 2150 6552 12138 8598 19212 22825 31551 49310 24371 16668 26805 44126
20572 44126 48506 43971 47702 44108 34967 39132 51120 57077 50804 45856 53831 49493 26945 24268
20558 24268 18833 -4523 -1161 -13283 -10813 14135 45701 36007 31698 22948 30081 51275 47637
20545 47637 37174 46007 53139 52224 41897 57512 45418 36598 38686 26144 14367 14327 19712 25032
20531 25032 28034 15368 940 9265 37445 44517 29101 20487 19877 41891 35654 28261 36489
20518 36489 37132 17003 13316 28292 33240 25108 7268 5886 1449 20058 21650 10776 15042
20505 15042 22360 31437 15994 14707 21695 34281 36661 29522 33989 33287 29766 25458 22840 24058
20491 24058 16210 27717 42513 46630 46041 61428 51431 44401 35528 19856 18553 28065 45545
20478 45545 37884 28168 29307 23096 22287 18300 11750 6848 10280 15390 29744 34525 45162 49806
20464 49806 35126 35387 48444 34093 31355 38605 50517 48059 41023 37231 34221 23722 38532
20451 38532 35863 29510 31958 17755 7569 20750 28071 38668 52933 38006 31225 38801 27403
20438 27403 8279 7022 18955 23148 21572 26881 36407 26394 26343 28524 16817 35507 50365
20425 50365 58872 35951 15499 6376 10295 18958 37834 36286 35660 22296 4966 7642 -1657
20412 -1657 7633 8283 24358 41322 43751 48023 46964 41798 39658 30932 35198 45582 44624 59239
20398 59239 74119 79243 69055 56992 57770 69300 53311 49537 37005 40734 42229 48018 45454
20385 45454 41369 51413 45805 40517 45339 47165 34357 25797 8844 13012 8475 5682 14528 28314
20371 28314 39638 37153 51275 50080 33784 47784 49691 49559 49944 36937 4626 17026 30253
20358 30253 23066 31112 37891 31094 39642 46115 46023 55134 60112 59152 65338 69626 71523 65230 49512
20343 49512 43617 45000 39420 50737 72911 75274 58877 45674 24388 34110 51508 58015 56432
20330 56432 49977 36915 52721 65118 65230 70257 54499 30232 25952 43611 40149 39899 63653
20317 63653 43345 43476 56225 57460 54934 48286 55475 67601 67992 72733 78119 50917 28666 16320
20303 16320 18869 27197 34840 47869 41900 51539 37618 43053 28624 23681 48907 71365 75043
20290 75043 79906 87786 66574 42431 26217 39867 51498 49846 60656 47712 50384 55969 49181
20277 49181 17177 1702 13533 24436 41533 43279 62236 56708 42823 32253 33712 51570
20265 51570 58795 67289 70351 65041 44913 41476 34501 31792 34334 40183 27747 34237 35605 34513
20251 34513 30865 39680 51720 35211 37178 38059 27861 14997 21345 25759 37734 55713 65637
20238 65637 50947 44282 38816 27747 32102 27987 31516 40812 42665 33825 34422 56735 70717 75005
20224 75005 70262 60070 51592 62725 67027 75298 96550 64420 64099 63037 55592 51317 23551
20211 23551 19926 49998 77356 90091 89376 60513 51949 45646 41042 55265 66787 79867 74837
20198 74837 76155 72025 56769 65089 64487 65590 48554 61483 66208 69799 69536 56087 56361 53387
20184 53387 58375 56908 42228 23762 23715 36129 55341 59297 61130 56861 56915 71184 91088 95008
20170 95008 77212 70789 75029 56454 56099 48534 39259 46466 48381 46721 52002 55041 57323 51796
20156 51796 42077 41861 45510 51069 51818 53396 60351 90005 108286 87810 51971 47316 43455 47452
20142 47452 51057 48831 51119 82970 90286 94573 100462 77977 75104 77365 60700 62549 60583 62972
20128 62972 40839 41168 32250 44784 63770 90392 74429 58456 88330 107642 115948 115548 121244
20115 121244 128029 130518 152561 164548 156374 159549 168962 189678 221920 218885 215434 214008 212480
20102 212480 208879 226824 238004 251049 260885 265335 270923 254057 233232 240699 253022 233835
20090 233835 206895 196508 184919 180448 184367 161158 148967 145718 123060 111873 95915 94941
20078 94941 93322 95236 91119 102010 95937 84134 85178 97630 111493 120474 132104 141403 142056
20065 142056 131530 116439 134579 139738 152180 177826 189864 178436 179050 200661 208243 209166 231870
20052 231870 254349 279048 284917 306223 320760 321417 306102 303289 282382 234664 230232 241495
20040 241495 252357 271284 258431 229511 180208 166008 162677 159202 145109 131828 134217 141732
20028 141732 115103 98095 85168 88987 92369 103591 113611 107370 126000 103714 91238 90475
20016 90475 89833 93624 112452 107281 110627 97471 87212 93410 69393 58680 60903 69141 66271
20003 66271 51810 48357 80852 91908 97089 91288 76082 71392 67445 72267 69376 57314 58972
19990 58972 74087 90148 96353 87277 86711 107048 83471 77815 90502 82012 77560 82602 91710
19977 91710 92279 87043 82461 92238 80977 75313 69567 84794 89799 101259 114367 124088 127853 128327
19963 128327 106527 99376 85996 83072 78088 69282 80741 76272 72387 72465 61846 67153 71765 73468
19949 73468 68581 63592 57340 70640 89489 86191 86136 93490 87318 94739 106355 92813 82584 85582
19935 85582 68248 66757 90238 95384 87583 78314 79853 93363 101901 107588 104623 88494 90164
19922 90164 100378 115344 110027 105136 98784 107847 150741 150452 110304 102014 113596 141892 134462
19909 134462 109725 108820 109106 102111 106694 122670 130979 131070 137263 143346 139693 162260 137537 124574
19895 124574 117164 115161 118352 99344 99469 114747 124416 110769 117999 140326 129508 140230 142957
19882 142957 124540 123853 129380 145956 155646 141806 143162 166070 182973 191347 219634 232544 250201
19869 250201 267581 307353 308252 318695 329877 325964 316158 277169 261089 252367 267512 278322
19857 278322 302110 326500 352621 360810 363679 353563 299842 258126 225388 213720 194787 204064
19845 204064 194046 183390 180069 153562 159123 170109 180683 168392 171360 173639 175708 195244
19833 195244 208103 196044 186045 186518 184644 186078 185003 204752 210823 194731 180097 175161 186885
19820 186885 185565 171549 160516 161459 178959 176798 167640 165049 171232 154437 132245 139960 144202
19807 144202 143935 149199 135499 140084 154014 155481 170369 178622 175440 162447 149575 150557 136750
19794 136750 123534 128257 144253 151417 147137 163156 187858 196477 173091 160894 155963 146295 148379
19781 148379 154979 176359 176659 185139 218159 236999 247355 230837 205221 179225 168358 170461
19769 170461 157602 151400 153453 164655 164279 149392 150021 162083 182989 172060 169505 176571 172726
19756 172726 167450 152238 145139 154489 161527 174366 181172 179808 188027 187376 178693 168218 173618 169383
19742 169383 189768 190659 176608 187872 196068 179107 169585 184715 183727 197046 212449 218777 226078
19729 226078 223069 218477 219739 227319 223382 215989 210079 200411 207822 195033 204210 202213 207045 209569
19715 209569 219891 215721 217163 217122 204413 213362 226978 214612 207087 220323 213868 211533 195968
19702 195968 191072 198971 199978 203408 211289 209423 217971 225537 225927 236841 253889 254871 241867 224226
19688 224226 234806 272108 271800 261557 258140 269890 278651 270453 276645 286294 296300 298293 289097
19675 289097 287509 286931 301628 335346 351989 345924 346827 336959 353902 371136 379749 367645 368954
19662 368954 376662 382271 386916 386276 415547 422533 415210 417519 435931 441991 440870 430502 421162 437930
19648 437930 456192 488815 502193 518762 547139 577513 596673 617137 649326 676864 694738
19637 694738 692716 681508 683833 685721 688149 711535 731658 772880 820423 876735 913700 935339
19625 935339 941643 924976 921304 920616 922663 926033 928093 945258 955830 981619 1046790 1110158 1179513
19612 1179513 1272193 1389991 1527299 1660423 1775483 1851652 1922802 1990580 2054960 2155629
19602 2155629 2275957 2440506 2680653 3015794 3440165 4032731 4787672 5755753 6975362
19593 6975362 8368713 9599947 10162511 10018441 9652915 9531424 9834490 10655506 12103872
19584 12103872 14405098 17843076 22880369 30181326 40560176 54202786 67990137 74411287
19576 74411287 71035302 63913485 56540726 48325415 39187673 31309733 26079898 23282419
19568 23282419 22342092 22828321 24221725 25446213 25041002 22378925 18537972 14925104
19560 14925104 12117506 10082210 8641642 7629880 6921126 6429158 6074131 5801998 5582019
19551 5582019 5391517 5289665 5300258 5410790 5594879 5842560 6179954 6637907 7285867 8175062
19541 8175062 9404742 11106226 13429059 16519835 20313562 24208268 26803214 27037894
19533 27037894 25600230 24169044 23891196 25258863 28602615 34413240 43283900 54905169
19525 54905169 66783378 76898889 85710563 91149962 86052461 69455526 51084030
19518 51084030 37222439 27973452 21941311 18004995 15450933 13887369 13076748 12898107
19510 12898107 13219995 13770972 13955080 13073580 11184932 9120383 7428272 6161409 5223054
19501 5223054 4533449 4004807 3595502 3280561 3054324 2872418 2723536 2585064 2451225
19492 2451225 2305839 2179001 2013084 1816485 1616098 1438234 1279263 1162566 1093252 1048057
19482 1048057 984690 906567 863864 816689 763331 717230 672364 609316 560704 535249 508814
19471 508814 516264 502079 481080 470791 467969 458151 443190 411427 389015 366059 350205 354876
19459 354876 354873 360874 370585 366725 378950 395860 392529 392571 393917 388544 376425 381784 369515 354596
19445 354596 351999 335259 315587 316206 301123 295455 288455 272075 266980 245555 221692 212831 206252
19432 206252 195583 191579 199853 186433 182491 179662 160480 142789 145321 146768 155650 185224 177569
19419 177569 174174 167226 150567 152783 164452 150704 148514 150147 152006 149125 148135 150950 151997 149026
19405 149026 158624 193559 224285 217779 203784 213164 210852 221612 214916 204830 201978 200562 198266
19392 198266 205019 210816 184764 158133 142799 149779 166221 167929 173816 181761 194498 197622 188262
19379 188262 186339 180975 174079 171833 149009 151727 151886 153909 154273 131884 126582 136675 156317 183492
19365 183492 185459 188214 175136 160019 171381 175436 174639 163561 158360 158342 167637 151494 167406
19352 167406 159268 149725 146249 134005 153716 158930 155346 168401 175654 190748 188133 176113 170768
19339 170768 157822 154045 146159 146732 152711 163430 173433 184410 211891 219688 231814 232468 219698
19326 219698 224316 231606 222217 212943 240290 250566 233208 221439 220949 234438 236767 239001 257632
19313 257632 258504 253859 237833 235134 234727 250826 268363 276142 269014 271066 277121 268795 262190 238989
19299 238989 242753 255314 253568 247949 251295 271940 314312 331921 323697 332434 352294 357562 357044
19286 357044 365671 371092 395733 397480 410388 413114 406994 395722 396383 424824 448667 467171 481298
19273 481298 484684 504129 542661 556269 567380 590176 614977 637452 656677 697718 758645 819653
19261 819653 864827 908354 964591 1009848 1045550 1083561 1096945 1110833 1143813 1196939 1288585
19250 1288585 1394815 1495325 1592497 1722468 1878129 2054946 2266261 2489624 2703547 2888898
19240 2888898 3040335 3248779 3585430 4019495 4561386 5240315 6182072 7512768 9504006
19231 9504006 12493022 16983088 23699569 33618912 47694971 64090964 72212937 62732356
19223 62732356 45840414 32840091 25088055 20937916 19270829 19656752 22132797 27152098
19215 27152098 35543968 48423911 65496620 79554645 76074240 57247563 38872555
19208 38872555 26752881 19248457 14393027 11138582 8904470 7326013 6184461 5343566
19200 5343566 4725985 4237278 3808218 3446456 3171277 2970211 2791262 2558735 2295684
19191 2295684 2078163 1905942 1759964 1660029 1562368 1451835 1340488 1228513 1163560 1089245
19181 1089245 1015929 958897 887265 828747 747164 689312 645920 606476 595407 603583 586014
19170 586014 547238 476535 415973 383381 351988 329173 317820 322373 305193 295081 288489 297322
19158 297322 308872 302122 299981 292401 297704 272934 265219 279423 268085 269608 265231 265298 274663 276693
19144 276693 277896 281443 285951 282096 270569 278745 277193 271214 268431 282201 291859 294655 295051 275317
19130 275317 267978 253644 241750 229978 224778 234618 239484 250765 266356 251138 257167 271886
19118 271886 264850 253559 248675 240501 243765 241405 246852 249604 278227 288701 284844 280837 278088
19105 278088 267179 252545 268537 280440 311476 347467 364615 364037 345398 343369 346412 335741
19093 335741 337588 357846 375075 385940 383691 399629 435755 460916 465228 449526 422980 411978
19081 411978 426809 434282 433266 436611 440622 453842 473873 483108 487043 486885 484257 526971 554060
19068 554060 546019 548966 560525 596627 622819 637027 637245 636416 634675 657416 670449 704292 725540
19055 725540 747706 775138 799275 827457 862835 887691 910729 939263 972187 1001011 1038686
19044 1038686 1092567 1145784 1218155 1271180 1334359 1381929 1414092 1431214 1457255 1491333 1535189
19033 1535189 1601983 1692873 1801870 1905725 2025305 2185189 2350043 2474966 2605007 2762477
19023 2762477 2973694 3174004 3319586 3486771 3714089 4006454 4391561 4811634 5268519
19014 5268519 5867205 6649362 7680805 9082830 11013064 13643781 17339527 22707937
19006 22707937 30632577 42284512 58282004 75670444 83383481 73962293 57927247
18999 57927247 45854005 38788747 34681252 32351933 31879384 33737231 38561044 47197224
18991 47197224 60675104 78605836 94539153 97450711 91120067 88963083 94472550 101563117
18983 101563117 101746948 93847957 82197427 69482064 57031221 46229613 38146750
18976 38146750 32825036 29759445 28425749 28424912 29213690 29838506 28982697 26056510 22001249
18967 22001249 18047512 14847766 12515356 10850718 9644212 8752954 8050484 7470266
18959 7470266 6940402 6497416 6160934 5916604 5745830 5675325 5683479 5791400 6009366 6362389
18949 6362389 6883905 7607294 8661589 10167019 12254866 15031031 18440182 21845778
18941 21845778 24056916 24289038 23177657 22117469 22106346 23625243 27038997 32663369
18933 32663369 40492306 49637399 58498944 65987359 71753465 73724213 67102330 53264654
18925 53264654 39337679 29001035 22105739 17570034 14579866 12572656 11258857 10478414
18917 10478414 10139868 10185728 10438722 10445586 9756978 8408576 6913919 5656040 4732459
18908 4732459 4079707 3580033 3200453 2893144 2586511 2256580 1986069 1774569 1582038
18899 1582038 1412100 1264005 1143607 1044588 938818 854030 796222 749025 692079 641932
18889 641932 570921 536866 518799 478171 439527 417933 391227 383275 363774 343319 345777 369728
18877 369728 364754 350877 321305 299097 279236 265655 249175 219848 224225 224006 220115 239254
18865 239254 256465 259594 264215 281263 269191 262912 263075 257951 243072 226775 206254 191383 167653
18852 167653 126877 98889 91411 97373 92682 109036 107174 99674 96262 88339 87913 87503 89624 85049
18838 85049 58344 56839 58451 32425 8877 14688 15124 18057 18996 9286 -848 -4863 1661 8669
18824 8669 11927 24044 35737 19291 30984 61911 51801 32727 19439 14430 26421 29163
18812 29163 26174 19105 16915 14863 34106 42128 21623 39150 67521 58895 46299 47049 42049
18799 42049 55243 37026 23898 14798 5422 2669 9949 31911 20291 14171 -5150 -27942 -30704
18786 -30704 -20335 -19132 -32288 -40978 -35107 -35881 -41309 -55004 -66953 -74980 -76550 -50963 -47405
18773 -47405 -59680 -65716 -54413 -54509 -43547 -33073 -52837 -70597 -63640 -40146 -42510 -54171 -52676
18760 -52676 -61782 -67770 -62427 -53296 -52543 -42447 -34749 -41189 -48606 -53185 -52441 -43215 -26841 -29497
18746 -29497 -28358 -28739 -18767 -16174 -25892 -42069 -36822 -20058 -28882 -42697 -46600 -55896 -66085 -54340
18732 -54340 -49991 -47990 -48313 -53489 -47133 -27061 -40504 -52142 -31642 -16612 -37085 -44605 -62558
18719 -62558 -81209 -86374 -91706 -92682 -72548 -50727 -37548 -42065 -40890 -31624 -35296 -37357 -43096 -44722
18705 -44722 -50113 -64482 -58336 -57283 -68662 -70085 -61670 -46678 -34599 -26907 -33604 -18987 -13583
18692 -13583 -13100 -29467 -42365 -49037 -65952 -71262 -75685 -75508 -90624 -80258 -74252 -85122 -54558
18679 -54558 -47616 -73304 -79005 -64994 -45391 -38154 -47926 -61447 -81507 -96759 -84466 -77601 -73229
18666 -73229 -72436 -79838 -74989 -81562 -84190 -69493 -67337 -71527 -51749 -57056 -74195 -81445 -75011 -77081
18652 -77081 -90330 -83589 -69020 -74250 -63146 -51040 -54843 -48694 -51624 -70991 -78935 -87183 -82031
18639 -82031 -71286 -71227 -70039 -60415 -81726 -91006 -77513 -66375 -73770 -80904 -80073 -68593 -85866 -87998
18625 -87998 -86456 -101896 -63755 -48784 -47204 -54621 -54162 -42839 -42025 -46954 -42924 -60181 -70753
18612 -70753 -68148 -77393 -59586 -45364 -47536 -55349 -65226 -61876 -71075 -81676 -87433 -78668 -70123 -64254
18598 -64254 -54506 -40846 -23069 -32208 -27733 -25202 -39946 -37933 -10904 9223 2412 16129 -1871
18585 -1871 378 6539 21100 28609 40118 71508 109840 133299 156967 184967 169133 134005
18573 134005 114434 113809 115616 104936 80362 73419 78476 88025 115199 160769 178999 158885 149121
18560 149121 121687 102086 75287 46592 42514 31915 36727 37360 2708 -28761 -37159 -31740 -24548
18547 -24548 -39070 -47618 -39462 -37552 -38351 -51176 -43328 -42765 -58830 -74815 -75702 -59416 -64607 -66096
18533 -66096 -70862 -67540 -66875 -62707 -79003 -91555 -93669 -71021 -67941 -49807 -58486 -59075 -55899 -60197
18519 -60197 -58592 -26818 -17259 -31279 -52944 -68958 -61912 -66790 -72967 -68889 -53316 -37339 -36201
18506 -36201 -45769 -64522 -76967 -70287 -55671 -39355 -27578 -33331 -63031 -70099 -65553 -70689 -72933
18493 -72933 -69890 -64043 -46236 -22089 -28245 -49488 -64130 -65830 -85414 -88450 -71072 -59029 -52662
18480 -52662 -46211 -53855 -64021 -60436 -46932 -42823 -30044 -31916 -16933 -15809 -5141 -7292 1913
18467 1913 4616 18008 47917 78384 86586 95943 119859 132723 148129 137384 132632 127226 131228
18454 131228 125406 133211 145764 142855 143853 155552 152257 167634 166406 158291 145481 140028 125087
18441 125087 109844 91282 57949 44133 44844 59372 60403 49844 42113 26812 9886 11703
18429 11703 11111 8531 2223 -4337 -15593 -25855 -17518 -8303 10542 28669 5440 -2430 -33815
18416 -33815 -24517 13423 42168 62409 77891 113851 119795 132080 154323 170815 168681 164906
18404 164906 151132 144924 124408 120601 100649 74451 77516 73997 60560 68409 99005 104593 90009
18391 90009 117925 148629 175003 177042 161724 157243 136670 100443 86531 72247 59493 42414
18379 42414 43870 37175 37663 23467 7480 17560 25993 6481 -13788 -20242 -621 22563 47981
18366 47981 73193 101985 106943 116045 131678 143258 176806 189369 193424 203660 164113 135461
18354 135461 133947 128095 114191 100541 86505 91886 113389 126427 151330 147141 128854 104980
18342 104980 90952 65703 49725 43117 29795 12779 -250 -20242 -20761 -30531 -33873 -29748 -41261
18329 -41261 -45151 -58843 -56240 -40031 -26950 -29488 -27960 -41018 -44004 -50653 -51805 -49419 -48693 -47332
18315 -47332 -40480 -36395 -27878 -43188 -36416 -39332 -48343 -50218 -41421 -25174 -10261 -8361 -27973
18302 -27973 -60781 -67505 -73603 -85285 -74280 -39185 -20765 -28083 -36942 -21385 -21476 -34258 -64231
18289 -64231 -79180 -44250 -28183 -20779 -28265 -34780 -25748 -31741 -47570 -70137 -78090 -48133 -17010
18276 -17010 -11605 -697 -37624 -54916 -34068 -36882 -49530 -68564 -95446 -89980 -74253 -69843
18264 -69843 -64941 -53992 -39146 -38411 -47495 -38117 -45976 -45458 -37088 -32749 -36087 -12452 -23111 -39677
18250 -39677 -29163 -21116 -36714 -41693 -53848 -69768 -79642 -65457 -65932 -76010 -78895 -62699 -66588
18237 -66588 -68887 -77490 -81844 -66929 -42955 -45988 -40531 -43694 -53324 -63541 -55612 -32401 -11180
18224 -11180 -14251 -24266 -23283 -16575 -17395 -26573 -26093 -30608 -35482 -28150 -41411 -37369 -30742 -42239
18210 -42239 -58419 -53991 -50260 -65602 -55376 -41376 -50920 -52161 -48315 -45083 -32949 -9063 -24081
18197 -24081 -34184 -44469 -54871 -60316 -66883 -60265 -53326 -38279 -31493 -10784 2735 1861 -20316
18184 -20316 -35656 -53492 -52921 -51763 -46530 -30789 -25428 -15440 -22487 -28457 -22281 -24729 -12174 -19903
18170 -19903 -14855 -18567 -37931 -50906 -48673 -47526 -48227 -39252 -43911 -42699 -27640 -26870 -40281 -34079
18156 -34079 -22668 -18127 -11950 -12658 -26012 -39111 -47964 -43810 -31977 -34455 -43543 -52497 -58377 -56952
18142 -56952 -41308 -27530 -14339 -16116 -18598 -4944 -5696 -26020 -33339 -37238 -35431 -40716 -25899
18129 -25899 -18001 -29535 -48838 -48447 -41226 -30934 -41710 -47387 -37804 -32889 -34729 -38651 -23713
18116 -23713 -17772 -22797 -49944 -56226 -32776 -28569 -25761 -37017 -36815 -41628 -53011 -49487 -44246 -41601
18102 -41601 -35189 -34786 -39093 -23893 -19355 -18501 -10567 -26265 -44474 -38303 -23332 -42871 -38776 -45149
18088 -45149 -42028 -25768 -31615 -35491 -41562 -36808 -39202 -53756 -49236 -40938 -30865 -25010 -37974
18075 -37974 -27618 -28486 -28366 -28043 -8248 -18745 -15836 -19587 -44205 -40712 -40948 -58623 -50173 -32140
18061 -32140 -25088 -27072 1874 1823 -28507 -33790 -28568 -36744 -38683 -28740 -30935 -39134 -30671 -5492
18047 -5492 -4818 -11467 -23713 -12799 -17867 -31249 -26839 -20398 -11343 829 -25016 -40713 -33752
18034 -33752 -44848 -51068 -45585 -58942 -61084 -59961 -60885 -55382 -50009 -38423 -39083 -28255 -20807 -23826
18020 -23826 -19226 -17612 -19010 -15924 -19263 -20877 -15409 -30842 -23169 -29572 -29034 -15673 -18859 -21100
18006 -21100 -29235 -36716 -35132 -18485 -3790 -27340 -36759 -42540 -50965 -43572 -55821 -59783 -53856
17993 -53856 -44660 -35054 -25686 -1359 2866 -23796 -14162 -3738 -15675 -22147 -26023 -31309 -33270
17980 -33270 -31864 -23515 -27707 -35333 -14910 13613 5453 -8190 -8198 -7593 -2950 -11326 -31681 -32943
17966 -32943 -29341 -23475 -13829 -34176 -53400 -47494 -47761 -57901 -49485 -68508 -59822 -53643 -39736
17953 -39736 -45916 -44183 -37169 -33843 -41770 -60219 -45770 -12153 -22916 -39570 -36170 -30739 -28001
17940 -28001 -25451 -34963 -36746 -26631 -24354 -36414 -43481 -49701 -40096 -37580 -33247 -24409 -40436 -61548
17926 -61548 -72072 -55747 -48048 -39356 -33753 -29308 -19972 -29714 -39485 -42534 -30657 -41871 -39797
17913 -39797 -42750 -46434 -50686 -52196 -44909 -31455 -24715 -22311 -21334 -25541 -33028 -14113 -10568 -11325
17899 -11325 -22674 -18761 -8366 -12531 -14526 -10261 -23280 -24531 -8800 -353 3347 -15298 -18213
17886 -18213 -2778 -17508 -32059 -22144 -60653 -58135 -45191 -57030 -52888 -55636 -75733 -60693
17874 -60693 -49163 -36238 -34579 -27634 -41969 -42535 -30230 -25535 -33673 -20537 -17063 -26857 -25248
17861 -25248 -13348 -8631 -8862 -15414 -28276 -45311 -63937 -64874 -57315 -39197 -22884 -24970 -29275
17848 -29275 -33444 -32183 -24827 -18847 -19432 -32567 -33118 -29513 -32884 -37757 -51172 -67036 -51606 -36576
17834 -36576 -18428 4930 -7761 -22836 -38893 -37051 -19855 -16358 -7192 -7047 -8667 3586 3646
17821 3646 -22122 -37602 -41845 -33822 -39343 -21665 -13910 -44555 -55951 -43754 -38228 -46149 -47529
17808 -47529 -37222 -30055 -28513 -16996 -17174 -14643 -20973 -34786 -34105 -31933 -14431 -8096 -24499 -40378
17794 -40378 -53671 -69047 -64960 -57943 -46686 -27675 -44235 -57849 -51371 -40298 -38761 -30612 -11676
17781 -11676 -13199 -23476 -24504 -17925 -30509 -48247 -61610 -50010 -17274 -22222 -10841 -6054 486
17768 486 -3333 -11081 -21195 -33724 -28005 -27291 -23127 -36053 -23645 -9950 -10195 -24804 -23296 -32989
17754 -32989 -45504 -40787 -32496 -41939 -46725 -40614 -28016 -31166 -41037 -48695 -36671 -23366 -15619
17741 -15619 -9680 -7608 -7284 -18605 -36423 -43138 -53354 -51112 -48425 -48948 -50782 -30599 -24540 -29668
17727 -29668 -31246 -29346 -14251 -7243 -22887 -31527 -37028 -25271 -20133 -21408 -23610 -9040 35
17714 35 -21904 -23512 -20233 -17473 -30527 -31585 -28875 -29158 -28103 -16643 -12514 -16525 -21600 -21022 -22093
17699 -22093 -21432 -24748 -21091 -30269 -35364 -7640 13002 6885 -12578 -10090 -19334 -9721 -12359 -24184
17685 -24184 -29880 -21816 -6679 -11825 -28280 -37561 -30453 -12099 -23867 -31110 -21162 -4796 -2128
17672 -2128 -13334 -34909 -39877 -33134 -16551 -16413 -28685 -26529 -14564 -6343 -1732 -8504 -10956 6242
17658 6242 18424 12680 -13932 -29022 -33697 -26868 -26199 -29351 -33874 -34251 -30916 -24031 -29189 -2652
17644 -2652 2204 -14440 -13255 -20881 -28557 -10277 -15783 -31593 -23595 -6048 -7163 -8017 -9488 2049
17630 2049 -9451 -31344 -29437 -23444 -16692 -40884 -45981 -39762 -51150 -65832 -65284 -49072 -39351
17617 -39351 -27832 -31926 -47364 -32680 -26248 -30418 -25868 -13628 -21155 -27719 -22912 -32574 -22504
17604 -22504 -21923 -25986 -34376 -35513 -34689 -20923 -18545 -25044 -28952 -30960 -40471 -28981 -15518 -11045
17590 -11045 3541 59 -19045 -32153 -25759 -18944 -27534 -38624 -36936 -42286 -46582 -41423 -34434
17577 -34434 -26088 -21219 -24795 -35113 -46525 -41938 -25710 -11223 -7151 760 -1823 -16847 -24499
17564 -24499 -31183 -38066 -50274 -40816 -32370 -33486 -24629 -4839 -203 -10169 -15735 -30452 -32185 -24611
17550 -24611 -20914 -14713 -9446 5743 13990 3770 -9435 -17719 -23057 -34128 -42502 -55563 -49638
17537 -49638 -55902 -46147 -13626 -949 -17395 -36789 -55968 -51203 -54696 -59150 -48949 -51482 -37493
17524 -37493 -27174 -22365 -32493 -37791 -18774 -26311 -25910 -32982 -43952 -59404 -57673 -73285 -54362
17511 -54362 -39983 -44932 -29616 -19714 -25252 -25496 -35878 -28379 -22687 -10488 5594 -5679 -26185
17498 -26185 -28963 -41174 -51067 -47189 -39911 -32817 -29854 -34329 -45450 -42011 -47192 -54692 -54191 -49721
17484 -49721 -26883 -24467 -28678 -9558 7197 -423 -2664 -4334 -8433 -17451 -36877 -50596 -45307
17471 -45307 -35913 -35943 -23401 -1992 -12767 -24342 -27392 -34208 -60253 -55634 -42616 -42656 -51099 -46257
17457 -46257 -33955 -34917 -30093 -43475 -44326 -29009 -8956 -17601 -32401 -23613 -30248 -38532 -33034 -37706
17443 -37706 -40902 -36446 -29903 -34718 -31580 -19592 -35055 -32913 -28770 -22292 -14951 -6718 -15391 -28359
17429 -28359 -32960 -17862 -18683 -23341 -23682 -13779 -7697 -12800 -25054 -32198 -23369 -32802 -32406 -22441 -21887
17414 -21887 -13918 -26456 -33323 -31458 -33215 -43336 -38172 -22332 -28809 -48142 -49878 -33997 -25186
17401 -25186 -29339 -17524 4511 1737 -10160 1002 9962 8717 -18223 -22427 -23449 -27584 -22550
17388 -22550 -26528 -28332 -22229 -15745 -13895 -6629 -4659 -16580 -7382 7093 3303 4043 -307 11958
17374 11958 11041 -16151 -30257 -15812 -19318 -14089 -6885 -10147 -16271 -34172 -40475 -30468 -16509
17361 -16509 -21011 -9116 -1295 -1613 -17441 -22104 -15234 -3672 -4882 -11785 -27579 -31653 -43699
17348 -43699 -40381 -37831 -37739 -41063 -45667 -33782 -28744 -39557 -56011 -30980 -9052 -8248 1521 -20828
17334 -20828 -53385 -50131 -26956 -13497 -19560 -8696 -21891 -43119 -39879 -36187 -19164 -5780
17322 -5780 -11302 -19170 -33419 -41550 -41323 -32640 -15199 -621 9096 13889 18159 -4782 -15137 -13839
17308 -13839 -26186 -33898 -11522 2611 11549 -6786 -11307 -16231 -22915 -21225 -21873 -29446 -25726 -10295
17294 -10295 -8076 -22628 -28458 -45382 -48330 -38123 -24342 -17650 -39693 -48479 -32894 -36668 -48605
17281 -48605 -35182 -34982 -9792 -8295 -3010 9779 -2978 -29299 -9905 3 7034 5835 -13173
17268 -13173 -6216 13305 11517 -1423 -9077 -8708 -6118 -27206 -25951 -22123 -16184 -4584 -2093 -16682
17254 -16682 -34902 -35859 -32699 -18580 -9263 9485 13773 10770 2647 -924 -9844 -23207 -39183
17241 -39183 -42725 -22649 -8327 -23398 -28089 -14448 -12470 -19922 -34366 -39152 -47498 -39495 -47477
17228 -47477 -45778 -29934 -21927 -9883 3487 -1398 -5718 8000 2917 -10147 -18380 -18280 -21960
17215 -21960 -15651 -18196 -18640 7037 6042 -582 -8098 -16155 -24465 -15334 2698 -2885 -22988 -30106
17201 -30106 -12319 -22278 -43644 -30550 -35150 -24075 -11225 -21546 -29109 -32274 -29789 -6773 18189
17188 18189 5812 -3685 -24549 -45292 -31724 -16522 -17721 -19417 -10905 -30667 -38967 -33756 -24667
17175 -24667 -6671 -2371 -10408 -3164 -3255 -19815 -38522 -33173 -22655 -6989 5898 20405 -12927
17162 -12927 -32404 -21511 -16822 -8411 -5382 -3967 -8201 -832 8471 10557 -2334 -1321 501 -7706
17148 -7706 9865 11984 5219 -5537 -5806 -10833 -33859 -40188 -42358 -28709 4990 -1703 -15241
17135 -15241 -27960 -34226 -37354 -33389 -25908 -17206 1750 10472 3108 -4104 421 3388 -10027 -12657
17121 -12657 -19859 -16275 -23978 -18621 9080 8239 1699 285 -592 10637 3942 -663 -11102 -33455
17107 -33455 -43762 -24028 -10607 -12077 -32202 -29870 -34139 -29671 -4817 -7953 -1891 4947 5814
17094 5814 9499 23558 1518 -28559 -31829 -30479 -22774 -28086 -10481 -5572 -9394 -780 -13490
17081 -13490 -29144 -17032 -9034 1640 -3276 -3309 -14890 -26435 -25135 -29546 -19272 -2822 -13288
17068 -13288 -23220 -24848 -25718 -30185 -19796 -9260 -2959 3536 -12261 -12852 -11031 -6793 -18600 -14247
17054 -14247 -24946 -30258 -22478 -19364 -25297 -24768 -3321 9109 -8589 -12705 5403 26091 27863
17041 27863 10354 -2271 -933 -2848 -19825 -27847 -25590 -32171 -29196 -21092 -15042 -16657 -20186 -36177
17027 -36177 -45625 -38403 -18152 -12256 -31960 -28150 -26357 -6279 7545 -6480 -2557 849 -7143
17014 -7143 -3136 -22836 -31531 -26167 -23647 -36845 -38544 -44878 -49478 -37688 -27288 -21015 -30074 -32811
17000 -32811 -34586 -37233 -27586 -23653 -22498 -24547 -34184 -23815 -8649 -9973 -10033 -7063 -13145 -4707
16986 -4707 -19260 -19116 -8655 -12348 -12242 -18456 -25001 -15658 -28806 -35028 -37391 -31350 -19279 -13309
16972 -13309 -31251 -33441 -20304 -24615 -27089 -27070 -16444 -16946 -13295 -13698 -29590 -28222 -21455 -26592
16958 -26592 -17184 -17993 -8221 -11744 1719 3306 1431 -11228 -14419 -52 5244 -14040 -36644
16945 -36644 -44724 -17322 -8465 -6968 3033 13873 11159 -364 -7295 -2491 6406 5025 -6245
16932 -6245 -16571 -17141 -15160 -9769 -10515 -7506 -12652 -26966 -38728 -37563 -15265 -6596 -32185 -37559
16918 -37559 -27787 -33594 -45225 -35913 -38051 -25762 -25193 -12457 -33356 -46094 -57411 -45078 -28424
16905 -28424 -22451 -11085 -5340 2636 -1484 -12997 -15521 -17895 -37106 -33811 -29160 -39845 -43169
16892 -43169 -29673 -3349 5101 -8915 -1302 6140 7043 7874 -13720 -18559 -9083 -5131 -1131 3615
16878 3615 -4023 13484 860 8498 -2084 -383 -4798 -6884 -15871 -9175 -5613 -29901 -27112 -20102
16864 -20102 -20159 -31815 -12043 -13500 -11882 10292 9607 1583 -25942 -28458 -36376 -19755 1585 5832
16850 5832 -8900 -24020 -23551 -13084 2697 7939 8749 7021 7250 -20023 -23608 -17671 -16386 -3774
16836 -3774 -16655 -9646 1789 -7813 -6580 -20182 -15499 -11317 -13262 -33452 -38859 -30657 -43483
16823 -43483 -28022 -19705 -16708 -23081 -40589 -53167 -56543 -38251 -18604 -18402 -36099 -55453 -35180
16810 -35180 -26427 -29926 -20176 -15449 -19009 -8367 -13213 -7083 -5948 -24579 -18371 -16618 -25670 -38937
16796 -38937 -20599 -2694 -10796 -26806 -37119 -26535 -30308 -22448 -4145 -1288 4003 -7573 -26483
16783 -26483 -28660 -29132 -23931 -15065 -13991 -16205 -9964 11879 15824 27238 20325 18563 18075 1627
16769 1627 -26723 -29174 -17720 -14313 -14567 -10526 -18154 -8726 -5394 -4930 -13532 -15609 -7039 -14561 -14987
16754 -14987 -6222 -4055 -11176 -19212 -19401 -16124 -17539 -23435 -28518 -16773 -8742 -7368 -3828 -5581
16740 -5581 -378 12502 -568 -5290 -2661 -16813 -7899 2020 2509 -12299 -5425 -6983 -19373 2314
16726 2314 4796 -7346 -17713 -10634 8245 13162 11579 6687 -10641 -19636 -20292 -27803 -27310 1252
16712 1252 18236 16202 39364 45318 23278 -396 -8831 -12992 -21582 -26118 -19754 -29702 -21272 -20895
16698 -20895 3257 24854 27835 18049 5506 3652 4496 23075 18815 -11485 -37529 -47277 -46968
16685 -46968 -43633 -36790 -27946 -15494 -17606 -14626 -19235 -23247 -16978 -17451 -21543 -28526 -18486 -12549
16671 -12549 38 3515 2212 -4392 -21270 -25734 -14548 -7768 4037 4354 17148 36313 18064
16658 18064 19416 5516 -17696 -28405 -28746 -25887 7072 20351 7539 19295 35036 39633 14135
16645 14135 -4086 152 6186 1332 -820 2694 535 843 16144 30456 35604 19710 15191 3876
16631 3876 -596 -1424 -7870 -6321 7426 14648 28315 22387 23445 10199 -9510 -11177 -4488 2628
16617 2628 28874 37782 26689 10877 12017 12623 2992 -12365 -23286 -7701 -8171 9790 7683
16604 7683 11311 17785 28858 38297 24879 14210 1897 -6398 1325 -4079 -15893 -23884 -13934
16591 -13934 1290 -10136 -11413 5047 -3336 -7346 14409 7670 -2340 -63 1267 -4372 -6613
16578 -6613 13434 26038 42592 24841 7570 -12133 -16029 -6784 3145 21832 32724 33594 33053
16565 33053 30322 23187 9001 -4137 -9296 3656 12436 12252 5399 4678 -10178 -6896 -2257 -164
16551 -164 -4407 -10974 9808 14703 4792 4143 -6841 -10258 -15451 -16876 -7798 -9833 -21104 -41574
16537 -41574 -49526 -20932 -8741 -2865 20206 23313 28010 12120 9943 8253 4402 -12981 -15504
16524 -15504 -10941 -20102 -12930 -2073 -7836 13861 23804 13045 -12979 -21182 -28597 -17125 1931
16511 1931 -2808 -5299 -6354 -10884 -19901 -35786 -34997 -32678 -13403 3894 -2216 -4812 -12085 -13453
16497 -13453 -26442 -19797 -11655 344 15664 3638 -12303 2341 7245 -1382 -8979 -8653 537
16484 537 1979 1984 -9288 -20912 -16863 5950 16888 15465 6589 27113 46448 48826 25956 24640
16470 24640 2920 -4700 2869 11050 20032 17198 12120 -2897 -11166 -19209 -26823 -20099 -9168 -10167
16456 -10167 -6065 -1995 1242 5021 -15681 -28921 -33037 -22437 -2831 -10539 -20018 -27715 -27248 -17549
16442 -17549 -16328 -6000 -1038 -4050 -9405 -8019 -12958 -8807 -13963 -14568 -909 7628 6180 13637
16428 13637 18383 16396 5619 13545 39778 37769 21708 14015 17211 -936 -15440 -18213 -28741
16415 -28741 -37062 -21807 -5598 -2362 4917 1949 -7222 -6942 -10903 -16613 -26164 -23329 -7907 16930
16401 16930 20943 11832 -8069 3622 6154 4187 -1404 -4252 -8128 -12416 -7564 16603 4932
16388 4932 5344 -1767 -8577 -270 -4309 -16918 -20205 -30595 -40321 -57519 -45213 -23824 -15513 -26393
16374 -26393 -15581 -10239 -4732 -7130 -180 2986 14333 16494 31896 42738 35595 29621 28959 12298
16360 12298 3536 28399 35128 25692 11369 -9531 -22150 3172 19770 12184 -16665 -17977 10548
16347 10548 33268 27212 5486 -21167 -13523 786 5469 25402 30804 20099 28626 35784 39473
16334 39473 15542 -16160 -31657 -28119 -21117 -12274 -2671 -5305 -19868 -23713 -11225 -1939 5200
16321 5200 16833 11749 17125 9692 7732 8646 -10355 -26414 -9097 -966 7078 16490 8331 8492
16307 8492 4285 -2783 -464 7427 12154 6207 -14515 -28799 -29384 -25425 -10407 -9618 -7348 -1117
16293 -1117 1139 -3921 7038 24235 35543 32508 18271 -4550 -4528 -215 -3481 -18495 6891
16280 6891 25651 25716 6998 -411 -10948 -10029 -3861 21751 18270 9434 -3605 -15454 -14925 9639
16266 9639 -7119 -18820 -12322 5258 16285 -2151 6895 6375 15054 14609 4370 3024 -13819
16253 -13819 -37027 -36483 -24093 -11319 690 -3277 -18225 -7284 -7898 -3826 11841 10972 4129
16240 4129 6585 19377 39304 29984 36796 38055 15397 4283 9191 10544 -4436 -5510 -2359
16227 -2359 -3492 5927 5110 -8084 -20078 2942 3724 2687 24403 25223 27278 24981 29654 26596
16213 26596 18631 17110 15118 179 -8600 -8397 1257 17668 16790 16196 4531 6400 22126 38524
16199 38524 35967 8198 -7133 -2854 2285 1309 6047 -11703 -22993 -34915 -19346 -13654 -13471
16186 -13471 -6733 2981 -138 -1522 20261 20932 8576 6086 -7331 -1732 5371 16646 5079
16173 5079 8427 11976 9368 29770 37134 24762 -1462 -7679 128 4833 7960 9360 21062 28793
16159 28793 7265 -17918 -5182 6547 15593 35345 38975 35635 28229 13370 9297 15274 14579
16146 14579 31738 48551 48340 26429 8886 584 4417 3402 6699 -4951 -6794 -6264 -7671 13860
16132 13860 27427 30742 34699 29479 29538 27750 16417 -3846 8162 5779 14808 9043 4174 9934
16118 9934 14430 6503 -2276 10872 17803 7895 15722 15140 111 480 -36 6227 -12697 -21044 -3585
16103 -3585 8210 22437 26436 22174 17538 -2745 -13765 5358 3409 -9529 -2199 7378 2825
16090 2825 -10367 -12679 -3773 -12951 -35238 -35372 -11165 6674 33949 36614 21524 -633 3347
16077 3347 14134 24042 22767 10859 1020 -14682 -19423 -11160 -9201 -12835 -6082 4362 9884 26335
16063 26335 25438 13014 951 13289 9121 14383 12030 13694 22994 28727 27095 36945 30852 23362
16049 23362 34762 34630 27856 32303 27117 37260 36345 19900 15356 6388 235 -10828 -11340 17458
16035 17458 19220 -6637 -10145 -17657 -12484 12355 20954 5812 13263 23288 28214 32600 18773
16022 18773 15026 3620 -8808 -4481 25252 27302 10094 -2301 -5174 9867 15634 2696 -2573
16009 -2573 5637 2966 16432 23351 19442 19030 14831 5773 7562 13417 12871 11981 10441 10460 9475 20668
15993 20668 27383 23697 16974 22773 27575 6928 12159 13184 12513 11698 9663 19364 22714 -13328
15979 -13328 -21338 -24929 -39639 -50292 -35810 -32137 -40839 -38809 -33785 -23732 -11449 -2675 -5528
15966 -5528 -20679 -10420 -3842 3133 17911 28478 10303 2328 9800 26517 18208 8979 7555
15953 7555 14561 29081 23650 17797 16175 3868 -4300 -7053 -5132 7251 9925 7794 4830 28803
15939 28803 28589 10679 12262 9890 24687 36268 30723 35917 42966 39030 52864 52885 25949 -4586
15925 -4586 -4789 -2645 14145 11993 6399 10116 12882 -10081 -13205 -11867 -10441 -10026 5182 22165
15911 22165 22069 24057 29059 22439 19523 20537 33563 25985 15549 3711 12095 19398 7766 12734
15897 12734 19710 24521 15856 -9693 -2431 1901 6937 18809 31735 24330 14349 17461 19906 16801
15883 16801 19325 43769 39585 32938 27477 27478 34205 32913 3047 -20640 -5919 18001 -8098 -1402
15869 -1402 9931 -8048 -21107 -11240 -3643 -2233 6063 9394 -7039 -28902 -22902 -525 -4164
15856 -4164 13760 30102 36344 37211 13615 15409 -6361 -23836 -282 14036 29125 35679 30126
15843 30126 7882 1072 28683 31400 24749 22899 26496 24138 30772 40151 24244 -5006 -13791
15830 -13791 -8253 3135 -1226 1604 19401 12083 3402 14242 9297 3655 16062 28087 37434
15817 37434 22457 23101 28392 35905 33318 19077 9571 2233 -1850 -5448 -10304 -1440 5310 19198
15803 19198 36111 29837 36069 28754 30913 24235 26115 27660 29841 14179 14303 21284 18315 5396
15789 5396 16245 3952 8543 41270 44686 51085 36450 22661 7988 -8800 -8598 3806 17406
15776 17406 40906 52066 36502 24743 29951 23685 21421 12421 6988 10318 19150 49999 34005
15763 34005 17212 16629 1741 2396 299 14341 19861 23323 13007 16692 11742 14394 30056 23157
15749 23157 5974 33767 66006 62012 31586 28202 25045 44772 36799 18143 734 851 19484
15736 19484 49574 59956 57314 47154 37319 29807 14329 10483 16615 30326 28990 11867 -11513
15723 -11513 -167 19695 11926 -16774 -8318 1936 10253 17520 16244 17717 24660 18246 2858
15710 2858 17279 38695 44784 36181 18275 24017 28971 53242 53818 31340 25740 25882 29317 27194
15696 27194 39960 53976 68789 57128 29266 10521 -10213 -11206 11228 16996 11231 -1291
15684 -1291 2709 3458 -10364 -12758 -9167 -11487 2712 25768 10702 -4156 7486 9229 -5296
15671 -5296 19879 23683 31756 30347 25875 44285 47166 47711 56335 47077 21300 19935 15374 27743
15657 27743 29985 34501 31319 37378 44516 51418 59865 59646 50561 58098 53272 25387 5035 21444
15643 21444 40179 61457 49543 29254 24409 23428 13101 23884 24682 6308 24799 53265 36408
15630 36408 31483 15228 15573 23329 31384 22832 24705 33699 43370 53694 23441 8705 12789 11966
15616 11966 21677 29248 39209 19720 8161 11245 12438 18351 21901 28245 25450 29413 34289 33794
15602 33794 42705 41260 30614 29725 38691 30815 23889 11637 17244 20657 37160 31111 30967 30506
15588 30506 22388 25940 27976 37627 30435 25385 24337 9640 19639 52457 51531 19969 -3528 1818
15574 1818 17635 19215 9685 13337 37329 54674 59270 67941 59305 54279 28553 10071 3548
15561 3548 -1133 7915 11067 16531 32704 32276 48320 44390 32698 32853 34789 32014 31074 39503 52417
15546 52417 58745 44520 26116 24980 963 -18650 -21145 -16666 515 12104 22262 39112
15534 39112 54400 53896 31417 19206 30401 39435 51031 50471 49543 57754 56990 51600 59881 50113
15520 50113 48286 31248 29732 31826 36566 48795 45060 42558 51526 48638 40519 30668 14208 21334
15506 21334 37847 44687 30178 15153 12015 19707 15969 16910 13495 22964 14828 710 11390
15493 11390 30207 50118 62351 64508 40104 24020 30130 36092 23073 21005 23439 5344 14334
15480 14334 37745 38441 37464 21114 1225 4124 10522 3746 7549 12837 35118 60459 46900
15467 46900 30780 21097 25266 31728 29433 7975 9757 16689 20888 29983 10105 9181 13739 25071
15453 25071 10119 9958 22594 35798 30032 35723 43373 50043 33278 12676 10740 20666 22631
15440 22631 5836 25637 37241 46917 46484 56705 64122 56056 44681 54160 48244 31124 51275
15427 51275 50690 40860 31118 42356 45669 34404 5700 23961 35671 46868 47187 22484 17306
15414 17306 12275 25849 39535 44874 22794 8897 27112 36305 43799 43573 34158 42960 58477
15401 58477 38426 42948 66160 85778 71675 50135 47863 36846 23378 23624 26101 26634 35626
15388 35626 42315 45013 51130 37019 25561 20993 23606 34107 26497 11601 2129 10592 25625
15375 25625 27602 16964 6636 20432 40716 43086 52715 68565 71328 73912 61430 47115 55842
15362 55842 52359 49655 48866 38057 34640 42073 55939 74144 73979 58705 66861 82351 72358 59596
15348 59596 52585 60120 62399 59030 46580 29600 21267 17111 28932 32349 33660 48720 35240
15335 35240 41798 38599 24156 20379 23855 24897 27424 47131 59672 50644 49155 55567 72380
15322 72380 69759 64425 68066 59568 60963 66132 69241 58898 45861 33616 38486 46040 33992
15309 33992 23372 25904 34149 32938 46978 53631 48850 52763 44678 36993 38869 45298 35915 35482
15295 35482 40375 47001 40423 49766 55205 56807 49850 33447 28672 30450 34435 46835 49872 50952
15281 50952 55144 85747 115167 118843 97096 77146 51403 41815 49987 52425 62598 61100 36847
15268 36847 36066 45485 48539 54748 66947 85299 80552 77707 59676 40047 24569 26666 35683
15255 35683 55034 67128 60992 68692 61501 46234 44735 45058 42130 54764 41201 29153 29418
15242 29418 36494 31981 27352 35507 44928 30383 36259 45885 41104 42892 41323 47085 36569 18694
15228 18694 31991 51250 60301 65631 68807 54900 46417 63356 79107 66365 49107 65934
15216 65934 48560 52778 37409 50602 68248 79062 88509 70900 51181 41535 47203 49825 30838
15203 30838 47305 77250 75089 52701 29495 16438 31694 35380 40925 58870 61667 44413
15191 44413 34329 39193 34879 26364 42944 46704 38477 26549 34893 49808 37454 29188 32922
15178 32922 19650 33132 28090 40718 52921 47762 48901 69776 62753 69719 87102 60577 40784
15165 40784 45413 53800 54879 61201 70061 62045 46096 22488 17712 29086 36007 46622 49710
15152 49710 53508 45549 60423 48585 42698 31540 19162 31948 39067 32139 36234 40839 18808
15139 18808 24255 16840 12914 18565 35031 54885 68176 58528 41436 42660 26010 30411 32953
15126 32953 28731 33104 27252 16622 19159 14381 -1306 4767 14628 17370 27090 58259 66700 63331
15112 63331 65590 48326 42428 46074 61096 68435 76447 78214 73960 48663 30638 24753 37345
15099 37345 24395 14487 47668 42174 52664 52899 51441 68043 84135 72068 64797 67171 52707
15086 52707 59870 76647 79333 56769 38776 36467 29784 30632 48002 48912 55648 54885 56819 71902
15072 71902 69833 50390 40616 38231 42279 41633 43226 53266 74057 72037 73666 75527 77554 69106
15058 69106 54187 42950 36851 35982 18457 33966 55927 54531 67402 76568 79862 58214 65211
15045 65211 75983 77255 75542 58674 39888 44507 42299 56908 59827 42520 44318 41016 24259
15032 24259 14671 41206 65375 65586 72080 65916 65387 73811 70938 61692 40956 50626 49572 49695
15018 49695 59499 77761 64176 62784 78827 72006 58855 59349 49515 47777 46702 57952 63895
15005 63895 70893 80454 82591 68260 65478 57569 47289 51384 59030 41259 33813 33154 44332 42832
14991 42832 31216 39776 40804 41929 48580 72853 79060 61490 57035 65570 68248 58439 42853
14978 42853 32306 46773 47553 26700 38198 41802 48232 55270 62058 42112 62391 71530 38670
14965 38670 40050 46171 63883 85175 79254 69473 79231 93090 91709 77759 55898 48773 63079
14952 63079 56355 52202 60400 77840 87038 86922 72590 73821 82175 67909 58989 64402 61656 49370
14938 49370 48924 46089 51636 68845 91243 88706 75317 65199 70733 72709 57733 58490 77108
14925 77108 64012 60057 53376 63161 80317 70492 66300 53391 62481 91130 89068 74688 69593
14912 69593 63222 43116 45458 65131 87918 76262 68612 64744 80572 74159 63536 57872 71768
14899 71768 104190 107469 75360 65242 69432 64694 47573 40151 30636 30724 33595 38951 52109 71034
14885 71034 95378 108663 84287 69231 80094 85648 80942 73227 65076 48015 34604 37016 39343
14872 39343 54173 73669 88340 88156 73787 85300 70565 72868 75328 76681 72308 53374 55994
14859 55994 41232 34645 52978 56098 42267 50642 54063 53727 63671 58592 60418 68321 72400 57779
14845 57779 54126 53677 48754 45395 52565 53848 65774 67533 74078 68228 54639 65722 81206 72108
14831 72108 64216 62173 66318 77082 60642 60219 62456 64361 64687 57588 60234 72479 77150 70870
14817 70870 66575 71023 85797 87567 93698 105730 105469 99019 99935 82218 62510 69746 72635 64967
14803 64967 52553 38004 48928 61825 62397 64446 80244 82706 68160 53423 54347 55135 69681
14790 69681 82559 80087 85972 87378 74037 72940 75583 80547 67171 82232 78416 83665 98337
14777 98337 100122 88556 84897 89590 78429 70273 66212 72629 79662 95475 95601 104834 88215 72449
14763 72449 66925 71497 80125 82306 76917 77145 83404 90444 81570 80121 92790 104823 93576 76166
14749 76166 81107 78496 71538 70179 65277 63745 53696 50787 47409 49915 53052 75353 77547 76792
14735 76792 69935 50518 30483 24041 32523 45231 55343 55822 58113 79133 99331 113061 102726
14722 102726 100079 87798 62737 63510 59499 58480 46016 67698 62278 58694 52452 51598 51734 65007
14708 65007 81875 74807 86704 91737 80558 58629 72152 94003 80451 52431 50508 68757
14696 68757 76617 79373 62833 78050 94929 87955 79267 83158 83131 83356 75985 75179 71974 89614
14682 89614 104245 103408 98610 89626 78819 54134 57522 59891 73262 95517 118679 120867 102441
14669 102441 102110 97406 94044 93573 72641 77145 76904 70781 74289 87782 91871 81633 98256 131556
14655 131556 120951 99517 67651 53966 73144 94847 83439 78686 65264 66121 79497 90379
14643 90379 85933 76976 69795 71299 80954 73597 75289 82094 95747 94619 94550 80920 78603 96730
14629 96730 86803 74539 82294 82386 78005 90043 98499 102706 109375 104320 102137 103807 97970 101040
14615 101040 100123 92141 65493 50063 66183 92062 83630 74743 91673 101669 115615 102480 85976
14602 85976 88074 87761 103369 107857 100339 96018 114715 94064 76825 74239 62575 65432 74614
14589 74614 83527 84529 86285 104088 94961 91379 79567 63287 62983 83165 106073 115716 102924
14576 102924 86979 94371 81980 51789 47358 49870 51225 84146 83885 87963 90257 78007 76069
14563 76069 87593 97355 102926 106787 106787 91467 82379 82101 93242 90080 92767 100552 97230 80935
14549 80935 82695 77558 91241 109417 119438 98345 89528 96616 105519 109929 102628 84210 92513
14536 92513 100552 93953 92260 90537 86270 106202 113618 108204 95531 81041 77311 66269 76180
14523 76180 85834 82634 70800 70589 74499 73812 94481 91238 101958 113123 111800 88462 74249
14510 74249 85705 101096 113504 111798 99634 112190 106530 101098 116578 113246 103263 102887 100289
14497 100289 109161 118371 102953 102672 100435 101483 83253 82966 108954 112037 104455 102294 93532 94771
14483 94771 104508 118901 127190 126087 118575 101401 95360 103114 88568 84936 85604 75846 78026 85224
14469 85224 104835 106460 101510 96053 93842 87022 82991 81190 106174 114269 119446 107301 105818 133533
14455 133533 129151 117800 127374 107405 91738 61004 62636 92086 120906 142385 127697 110124
14443 110124 102455 87538 82089 80931 94384 99082 97344 100720 99793 102637 114322 110491 113009 103430
14429 103430 94302 103831 103766 128593 104879 86124 85998 70007 61118 70968 81995 96464 80930
14416 80930 75818 104246 117349 102619 98806 91492 94608 107757 114604 144921 128039 123638 139134
14403 139134 133087 115261 107620 87138 81709 93104 108164 114196 104706 89397 97262 97555 93770
14390 93770 107898 105347 82744 77806 82074 111554 127893 122356 100280 116336 141116 143494 129736
14377 129736 132025 142114 120315 121189 126277 124725 108746 110619 109307 113968 132386 144003 134772
14364 134772 130312 112133 102069 112367 126931 130575 134627 132184 114263 100495 105249 122341
14352 122341 152967 157407 142469 131911 113492 125996 144451 142653 124484 141416 150020 149114
14340 149114 136097 137338 107063 96598 105041 116899 115650 110196 92888 96396 107310 112756 108460
14327 108460 99637 113350 124591 129415 129388 113946 98023 109254 138770 147008 133918 118724 120959
14314 120959 138948 127651 115404 122736 133843 134038 120951 126527 136876 128587 120712 121492 114925
14301 114925 104320 115718 126124 135943 138856 134399 125145 115964 100724 96906 97221 102635 110113
14288 110113 115409 118092 104317 94619 91254 84283 92571 90347 98028 123156 137180 138381 151061
14275 151061 151855 140214 120580 112536 114286 112397 94368 94912 109663 96030 95300 91905 117730
14262 117730 126072 128229 131178 134759 126006 138958 159985 163243 147225 134141 131506 143687 128240
14249 128240 138154 146003 137651 114739 97184 96104 106517 116513 122616 124921 132891 136801 122695
14236 122695 116250 99642 98734 107221 108702 116053 122901 129254 129787 144965 157035 142137 144731 144574
14222 144574 123877 116827 128612 127321 106379 119785 130670 126827 112130 100702 103477 117078
14210 117078 126460 142392 162218 158680 143416 131851 138723 148997 142187 146791 148648 144405 156153
14197 156153 174769 175074 169866 168762 144270 139774 138451 131796 125266 122747 128139 131894 142733 142646
14183 142646 138841 137764 126287 117818 115931 122443 136745 146160 134993 125886 121096 117226 141059
14170 141059 153280 146430 139197 125986 113238 133586 142511 154749 148378 137655 122489 120286
14158 120286 126469 125425 137697 142156 137900 113602 99512 106564 121583 135230 119872 127802 125655
14145 125655 123270 102832 111482 121702 115652 129868 140043 132437 128883 134406 137605 155964 172431
14132 172431 171348 164469 147801 142155 141683 142911 138802 139767 143207 143478 136659 144496 135723 123266
14118 123266 118499 130314 137223 155010 164912 169243 166632 159607 154379 146577 160523 152196 156098
14105 156098 169891 171778 184064 177870 167706 160909 143582 128872 129547 143395 162772 150892
14093 150892 147401 140879 132369 134679 147007 151302 156148 148685 136990 144010 166534 179432 168864
14080 168864 143326 156918 173645 167473 158341 162958 154133 153389 153036 157915 174932 169555 153221
14067 153221 158484 168611 166210 154970 137473 139792 135928 130696 139811 150111 158580 163448 165682
14054 165682 177581 185531 175751 160731 162584 172212 183188 170417 141822 139054 155059 168648
14042 168648 179859 156560 155319 132945 138674 150663 146515 171480 182569 183825 182823 187737 193987
14029 193987 190556 186505 197198 182023 179212 167928 171492 182339 165317 145243 137822 137522 136159
14016 136159 129659 124264 146742 161055 159910 169723 173463 196305 197288 183473 166384 153876 150433
14003 150433 158126 145187 146172 147138 168856 178682 171962 175728 166114 147249 144900 159473 169558
13990 169558 187229 174311 176051 176206 182910 174824 153874 150870 150595 160976 175540 178024 174835
13977 174835 181044 174727 182509 180857 179239 179118 174218 179091 179153 177093 187806 189762 190815 175283
13963 175283 156988 148302 149532 155951 155476 142826 164800 179712 177105 191646 187181 182567 160239
13950 160239 150725 160842 168557 162928 165176 188013 187301 187840 190959 169349 151334 157921 173955
13937 173955 187975 195242 194249 188648 173068 175552 198713 202752 207600 198717 203479 200990 207750 215017
13923 215017 199524 185024 183968 177176 175315 180843 194420 213471 218406 205369 204781 206359 206198
13910 206198 186849 169123 168463 184969 178317 165973 149241 165582 175652 193399 202754 202383 197270
13897 197270 212562 209190 193969 191043 202800 200885 189175 178176 184778 197199 196941 187082 202958
13884 202958 203054 207872 209477 213071 226443 239701 212338 184532 166851 166863 194750 209297 216158
13871 216158 198382 185238 183155 184665 210661 220634 203386 190566 190504 183104 190970 190856 186439 188560
13857 188560 196263 194960 187520 199542 217276 221432 214220 205029 216439 216080 205557 203283 211419
13844 211419 204466 189216 174584 176451 189517 194995 189941 198159 205715 213558 211244 193408 192319
13831 192319 200824 191307 187482 175934 168205 171036 189500 201391 193928 179130 181085 182817 172291
13818 172291 165691 187450 177941 183446 187266 198202 204534 219090 229165 214454 201494 219534
13806 219534 214460 215559 225103 233321 231131 232261 249542 253546 233754 206296 205072 201255 205831
13793 205831 222906 246813 249078 228430 223589 228398 240210 248758 239035 226630 199603 201442 203542
13780 203542 196574 191568 186997 181449 178799 178967 190975 212830 206293 187880 177758 203236 214104
13767 214104 210633 200519 224426 221960 219312 231373 249146 253626 245835 237837 218420 202291 184462
13754 184462 195256 238535 234250 220718 225773 227900 236924 247511 242914 220065 181569 169427
13742 169427 169477 173692 180944 205512 202619 206874 205661 211041 238017 241545 253347 232805 230190 244628
13728 244628 256855 256933 241206 225922 220552 214014 200905 215472 239687 247527 233025 232850 242857
13715 242857 235607 238690 224384 201001 187575 202483 210572 206884 224975 222393 224268 243905 259258
13702 259258 266629 251871 244840 256653 262106 261655 249841 254263 256824 248299 226399 227544 233476
13689 233476 233506 229093 236803 247118 235968 257425 265116 261825 262247 273087 284444 254646 246381
13676 246381 244837 238661 216461 225248 253800 265566 247037 244070 249757 239376 224101 210254
13664 210254 233115 244727 256761 253169 234294 228606 222249 225923 229866 237460 251719 263529 248634
13651 248634 228300 230816 246856 260852 255583 255048 270829 259583 266338 295660 273935 253433
13639 253433 257964 269272 262177 257694 241331 228243 224390 235369 244883 246034 258023 256018 249296
13626 249296 243976 249194 256119 274067 277984 280761 269115 258704 261095 277562 288119 282852 261563
13613 261563 247559 249799 257597 254666 259784 250062 249362 245395 247604 257754 268180 270556 266785 257163
13599 257163 259833 246553 225876 241260 259275 246085 241859 226221 235507 248286 238985 243936
13587 243936 274671 290400 280822 271405 276646 271510 264695 250543 260177 267644 270288 265699 281904
13574 281904 286904 298066 298706 284838 276286 273129 261620 267231 271507 282664 294046 302420 290145
13561 290145 286740 295648 299293 297245 305419 300968 291632 275997 268213 277911 285582 291557 285572 286839
13547 286839 299224 286729 287902 306577 331638 332748 328515 341862 329063 317121 311372 303304
13535 303304 305478 306783 303249 296942 287616 281963 277359 276998 272089 264641 273824 296560 301870 307370
13521 307370 301574 300472 293149 293735 297386 288147 274000 269774 275073 277837 293493 296625 283450 278749
13507 278749 291718 292801 280803 278498 294306 330531 332685 314223 325620 327117 299960 296847
13495 296847 308495 322854 307337 297560 314144 315596 310310 303959 277473 278539 301511 327590
13483 327590 334031 321254 330214 332260 316455 321781 319433 327882 322906 293807 275429 274655 299888
13470 299888 318903 320993 315049 325773 324125 315890 314243 315133 306740 289973 290659 302527 321213
13457 321213 317472 311983 310854 309071 298956 310188 324533 330901 327875 321992 315764 296849 304873
13444 304873 297254 292305 321359 329501 339683 337359 323384 330142 323597 317170 312544 302944 298736
13431 298736 322500 316223 326831 345418 353777 346964 329094 310022 308712 322351 335993 339387
13419 339387 329238 314875 325913 343876 363729 368432 351068 349870 355518 350486 360675 367756
13407 367756 359476 349160 344800 350082 353030 366252 365727 358338 334921 330544 329761 339316 353606 351779
13393 351779 330829 322995 340195 354640 365098 378138 375696 393512 376716 360155 365353 377745
13381 377745 348755 334869 329060 325804 347082 350325 347358 347988 346703 340165 343138 330574 328799
13368 328799 341899 356272 358862 356467 364652 370557 381249 379697 367282 355818 359852 361429 363461
13355 363461 356980 367013 370731 347020 345420 340053 355033 356237 342931 322949 338724 331350 322565
13342 322565 339008 338509 340433 356933 353144 359689 364497 366306 369553 369762 387425 390334 392055 394245
13328 394245 399539 402466 389273 372586 362977 368892 395938 384827 388607 396379 371845 363110 379507
13315 379507 390178 395609 386813 389361 403918 408468 392957 389998 397539 380570 379856 385254 378857
13302 378857 372526 386528 384313 380731 387039 391553 382401 392681 379854 373594 387687 382464 395617
13289 395617 408578 420100 438215 416763 406155 404886 403494 414072 414047 398039 391789 384905 388581
13276 388581 386113 392576 384689 386440 401394 416297 406977 398918 385485 390092 401467 406887 402679
13263 402679 408597 425026 419895 418924 435017 426710 434655 431465 407630 409243 409106 416244 415798 430498
13249 430498 445537 438391 441360 459824 449108 423839 424076 445005 463506 446582 430032 454733
13237 454733 447644 440474 432455 414323 392909 410283 432326 429345 420540 418609 428034 442917 449023
13224 449023 450076 441800 442019 448734 456547 448771 445730 449260 428417 404780 409157 411684 414573 421341
13210 421341 425308 435510 444195 434509 436773 431910 432031 426587 422328 433854 446352 458705 473642
13197 473642 463879 437167 456573 477349 470186 464001 471165 463686 460472 453405 454861 443499 446991
13184 446991 447412 460177 460192 478439 493234 477216 480391 470048 473843 475536 465404 461821 464949
13171 464949 477929 488890 484100 465085 453476 459147 469359 483343 487885 472918 466658 487486
13159 487486 473407 475679 508915 510826 517706 502154 480677 486348 499858 486388 473285 486823
13147 486823 482612 474667 472475 476876 497159 502654 493364 494247 512534 523674 514077 491377 482334
13134 482334 499121 519871 511318 499997 504223 509627 499900 505945 518487 513119 510112 500864 514144
13121 514144 518620 525200 530424 516903 498733 495889 511105 504455 495504 487929 474727 470750 491476
13108 491476 511811 525325 534118 534823 530287 538897 539604 546969 544897 524075 515737 513876 518516 532222
13094 532222 525446 519132 529020 538501 549326 532515 526676 524145 518956 542251 553160 543189 543171 539404
13080 539404 532741 545403 559563 541599 535850 550313 542464 520184 524064 535330 550242 548540
13068 548540 549356 550083 555041 542032 523294 532696 550913 538971 544469 540844 532295 531184 541737
13055 541737 546195 535142 535491 552355 554326 568273 581512 597203 606393 597682 587631 576262 577154
13042 577154 591752 571107 539254 543180 548424 549083 553598 564775 577697 582941 584505 578604 592012
13029 592012 606686 618445 606643 608255 623328 599568 578547 568850 565912 574294 582754 598231
13017 598231 597415 603261 625309 637582 630363 636521 632784 632900 620225 590276 600797 605435 607260
13004 607260 620083 612642 600828 614454 605471 600458 610242 633561 634158 636694 636160 635725 630634 630046
12990 630046 633782 621622 641996 644266 647490 641672 631137 650567 651977 652344 650312 652444 670810
12977 670810 673021 661807 642844 642857 634845 631952 640132 634897 639640 643377 637247 621876 629340 640234
12963 640234 651204 677577 690815 683422 681619 671159 669961 673632 681752 684870 674364 653719 669193
12950 669193 686889 683187 689149 686343 681287 673035 657079 648227 645818 639404 648173 660332 667581
12937 667581 666078 661278 653269 646487 662576 665786 674400 688361 699695 702339 699639 680043 682929
12924 682929 694982 690394 713938 728963 716056 698756 688496 691078 707667 707164 699773 697626 707519
12911 707519 714297 721643 737319 723361 701170 692437 699095 705029 705997 688541 687539 702189 703144
12898 703144 703304 722229 719940 712091 696789 709966 726338 740459 749312 752655 746684 735546 743210
12885 743210 750688 735746 725676 731844 750383 758758 734768 713334 731698 737844 733058 735124 724476
12872 724476 728303 728555 730942 721486 732503 745805 761016 747288 740998 749870 764535 766103 762816
12859 762816 772557 766022 756945 769141 772132 774638 765190 762211 770353 799043 814317 795383 779741
12846 779741 796505 781324 774471 793888 787978 764410 753644 748137 747892 768066 787115 804790
12834 804790 800102 779346 784396 807515 810843 798174 808868 810858 799588 814419 826476 848231
12822 848231 854374 856706 845528 844879 863052 866488 860222 848964 852659 869384 877435 868823 857928
12809 857928 857245 867969 876283 867186 858770 852585 844800 855903 867162 864520 834569 802647 805183
12796 805183 832719 839175 846932 858958 856432 859057 883672 888269 871619 847326 840401 865398 882872
12783 882872 886375 868985 860992 871443 856980 859390 872585 884026 892913 882053 887614 888165 877799
12770 877799 886052 899252 893610 889122 879997 890093 892912 895115 888510 881153 885441 909429 927858
12757 927858 928199 922447 931705 921625 921109 927580 938258 924779 907996 902031 922836 937141 922657
12744 922657 931796 935652 928630 932777 937916 926662 930279 927308 923694 922791 932047 936179 919342 916511
12730 916511 926287 958487 961802 976503 973115 977449 970003 964998 960515 975545 971483 985089 981555
12717 981555 971426 988081 992216 971826 966553 1004798 1017857 1004021 1003992 985032 961096 981839
12705 981839 1000956 992986 978340 982028 995769 1018182 1041333 1037062 1015144 1007220 1011505 1027043
12693 1027043 1026539 1029175 1031182 1047535 1046512 1052647 1039133 1040433 1056930 1036791 996857 985627 1004281
12680 1004281 1011635 1028358 1045786 1053317 1050663 1043754 1034889 1031746 1034764 1039919 1043554 1053443 1067589
12667 1067589 1085060 1081076 1084947 1078682 1062200 1067316 1079438 1095564 1105341 1084772 1080085 1108066
12655 1108066 1108371 1118787 1124620 1115909 1093230 1078595 1094039 1096340 1092637 1112709 1129058 1114265
12643 1114265 1101443 1102288 1089267 1105976 1126681 1128178 1136298 1135214 1135009 1125450 1125496 1128554 1124028 1115904
12629 1115904 1117651 1143423 1135349 1166460 1153034 1154872 1170776 1175400 1165688 1164353 1152420 1156808 1168605
12616 1168605 1168621 1177770 1174436 1177533 1199585 1197772 1187142 1172120 1148603 1152138 1156385 1157633 1182272
12603 1182272 1183939 1185924 1198205 1187110 1189641 1214186 1227777 1213868 1228091 1218818 1201982 1209866
12591 1209866 1218934 1218407 1222800 1229574 1235678 1243725 1253359 1255795 1244457 1226022 1234013 1251537 1245864
12578 1245864 1253734 1254856 1234074 1221301 1241449 1233785 1251000 1267430 1271428 1278796 1294939 1277413
12566 1277413 1267756 1272050 1281244 1276553 1288578 1282226 1283279 1312403 1319479 1305687 1302969 1321704 1334067
12553 1334067 1335801 1318760 1324038 1314730 1303317 1281151 1273598 1286359 1296258 1293455 1294993 1312128 1324595
12540 1324595 1328534 1323138 1339079 1349906 1331198 1329620 1359541 1366264 1366396 1353347 1365095 1381327
12528 1381327 1383636 1379735 1369109 1358612 1346668 1365326 1359112 1365637 1386570 1400831 1395080 1391735
12516 1391735 1394510 1394936 1383924 1390435 1380123 1378512 1386185 1380876 1390051 1411150 1433240 1418783 1424596
12503 1424596 1436627 1428401 1412104 1417671 1434474 1452766 1455448 1459511 1457419 1451276 1458381 1465292 1469558
12490 1469558 1463623 1466217 1463528 1469360 1475014 1478487 1484984 1457022 1451324 1475483 1488288 1494226 1495742
12477 1495742 1483938 1462940 1479399 1502560 1536862 1539423 1534181 1528460 1514694 1511135 1524611 1513259
12465 1513259 1506734 1520784 1537660 1538903 1534993 1535854 1538403 1512207 1497178 1514325 1522190 1529531 1531810
12452 1531810 1541901 1547607 1562245 1550373 1545978 1554602 1559925 1567241 1600151 1603991 1591197 1594596 1605402
12439 1605402 1609398 1615779 1607551 1608778 1593601 1584357 1580833 1598009 1622768 1630481 1633081 1642516 1642489 1655114
12425 1655114 1661240 1656959 1664072 1660696 1673671 1665224 1652493 1660678 1666850 1674611 1670408 1674376 1689889
12412 1689889 1672176 1658242 1652451 1648177 1661023 1657810 1652253 1645280 1646243 1668189 1658211 1649484 1640112
12399 1640112 1630197 1651456 1685405 1706628 1717709 1707699 1696531 1683434 1687401 1701712 1708157 1697879
12387 1697879 1698089 1711833 1709748 1694656 1700268 1712427 1723970 1739399 1737484 1729895 1740197 1746804 1758981
12374 1758981 1747717 1735919 1756108 1767103 1769440 1783171 1789171 1796523 1787321 1778771 1775092 1777810 1797374
12361 1797374 1817959 1819510 1814873 1821078 1831918 1813686 1806678 1807492 1833327 1872134 1886171 1872616
12349 1872616 1863592 1877701 1878931 1864766 1869593 1869979 1853320 1848574 1859174 1862506 1872617 1880497 1883605
12336 1883605 1889637 1880559 1858026 1848127 1861223 1866498 1871260 1861820 1850178 1859922 1872754 1877203 1878760
12323 1878760 1879851 1885904 1890293 1875979 1878706 1904949 1905192 1897051 1898624 1887817 1894264 1926989 1916955
12310 1916955 1909964 1906701 1917387 1911535 1904901 1920756 1934956 1926387 1922366 1928432 1939475 1965895 1973131
12297 1973131 1965559 1948039 1942124 1957132 1965620 1970831 1979473 1978957 1969946 1963213 1980261 2017465 2043349
12284 2043349 2044620 2037482 2025243 2014858 2005141 2026935 2040670 2046860 2029845 2039041 2064291 2054228
12272 2054228 2037398 2016959 2010514 2002740 2008203 2022723 2017364 2022797 2048555 2056724 2059855 2057116 2057773
12259 2057773 2047074 2053086 2051935 2043433 2056085 2037790 2007396 2001173 2048971 2071315 2055601 2070631
12247 2070631 2084615 2072417 2054508 2052051 2089251 2073679 2054721 2054954 2069435 2069964 2077833 2099600
12235 2099600 2092867 2103954 2105117 2109609 2124579 2118059 2103691 2103512 2086620 2091681 2097655 2111105 2103643
12222 2103643 2091618 2096837 2106524 2107589 2124092 2125821 2108264 2098017 2138491 2153568 2149994 2148496
12210 2148496 2142739 2146809 2133473 2141077 2136592 2128151 2116587 2126713 2145449 2161384 2162574 2142581
12198 2142581 2153284 2172352 2180375 2182414 2182600 2174980 2166505 2162680 2159247 2183188 2194297 2184349 2177067
12185 2177067 2172861 2174714 2172818 2156395 2151079 2168974 2194502 2191408 2181355 2182625 2196899 2200074 2201062
12172 2201062 2181756 2159251 2161844 2172571 2193978 2195138 2191060 2208847 2214213 2190008 2176455 2184266
12160 2184266 2191862 2196367 2184103 2186369 2206609 2201958 2206066 2200864 2206681 2216451 2220329 2198314 2207394
12147 2207394 2225491 2224848 2210919 2210217 2211779 2207332 2207434 2215259 2219351 2207138 2188424 2198970 2219026
12134 2219026 2240005 2224242 2216766 2234670 2250254 2260258 2257605 2287738 2326214 2375423 2385016 2344692
12122 2344692 2311284 2295818 2278755 2254415 2230499 2221272 2226553 2235563 2237480 2242558 2235473 2226449 2238571
12109 2238571 2241509 2249626 2255861 2248430 2224852 2210736 2230604 2243876 2253550 2254419 2248193 2238930 2241626
12096 2241626 2255871 2267248 2254837 2268798 2267951 2282555 2297324 2280578 2265253 2266671 2292692 2319145
12084 2319145 2362015 2406467 2472978 2572669 2689445 2649771 2486812 2382751 2323936 2287035 2276863
12073 2276863 2264093 2242827 2239922 2245747 2234232 2230032 2232911 2215504 2207991 2205636 2211976 2229270 2244392
12060 2244392 2256888 2259136 2240813 2244412 2249211 2247602 2244816 2240235 2246679 2261794 2272545 2266990 2243350
12047 2243350 2238077 2231008 2220731 2226152 2234333 2261342 2281085 2308360 2353872 2408753 2520924 2651482
12035 2651482 2683184 2559351 2407092 2317919 2283145 2246045 2224103 2222459 2216778 2205538 2202964
12024 2202964 2199249 2177797 2183933 2196037 2194756 2198950 2199677 2182424 2171530 2183315 2190916 2195039 2202759
12011 2202759 2211523 2197733 2167062 2161305 2161077 2150499 2149011 2142142 2131602 2151953 2164905 2153484
11999 2153484 2157156 2153418 2136773 2141459 2172913 2189961 2201611 2256149 2295905 2264227 2210088 2186106
11987 2186106 2180278 2167819 2157236 2136930 2126940 2132516 2153735 2149805 2156501 2138748 2131045 2141431
11975 2141431 2158902 2164529 2155438 2138005 2129559 2126246 2114622 2114290 2109701 2103539 2090500 2092609 2107448
11962 2107448 2121215 2117460 2105310 2110473 2111649 2108856 2094642 2095859 2099358 2096743 2090728 2072090 2060200
11949 2060200 2050599 2046832 2059378 2072487 2075817 2060291 2043543 2037783 2054216 2061804 2076882 2088444
11937 2088444 2094282 2078943 2073013 2079280 2063583 2056881 2032424 2008375 2012483 2017583 2015129 2032138 2024279
11924 2024279 2028111 2030459 2019083 2022158 2036301 2019651 2001800 1996227 1995702 2019784 2026076 2005553 1992672
11911 1992672 1994620 1987597 1972822 1967259 1981214 2005667 2000575 1992308 1988445 2008878 1997803 1999084 1996425
11898 1996425 1988317 1985557 1979703 1983750 1973411 1952797 1935858 1948220 1964461 1968060 1961989 1962899 1961915
11885 1961915 1941611 1929390 1917877 1927328 1934153 1923871 1909964 1914027 1925725 1910522 1884049 1872645
11873 1872645 1876526 1876255 1891993 1897299 1908041 1891689 1879077 1878479 1871236 1850628 1848449 1853050 1863120
11860 1863120 1870809 1858719 1843494 1833705 1837925 1841601 1835621 1828953 1826681 1826697 1818766 1827594 1845671 1848037
11846 1848037 1834706 1813520 1808359 1812660 1801421 1807147 1817513 1825983 1818110 1820710 1821042 1826801 1819031
11833 1819031 1804215 1776946 1767818 1781218 1766613 1765435 1771988 1762957 1751800 1749639 1742652 1732112
11821 1732112 1732131 1732416 1725608 1720050 1721973 1717377 1724980 1725504 1728288 1741692 1728076 1711768 1713062 1719870
11807 1719870 1712287 1702785 1690484 1684972 1696433 1691334 1695956 1695627 1684513 1678030 1675013 1685937 1675336
11794 1675336 1660587 1675085 1685791 1671841 1657935 1647272 1654887 1661229 1633192 1613081 1623940 1635887
11782 1635887 1658711 1657117 1636167 1637407 1631758 1629553 1617000 1603040 1609332 1623726 1621352 1611035
11770 1611035 1623086 1636729 1643094 1643023 1612245 1588847 1579235 1586122 1591594 1588812 1577725 1571523 1565802
11757 1565802 1556740 1558733 1564746 1581061 1580579 1576081 1545515 1534678 1541914 1534374 1514103 1513260 1527196
11744 1527196 1522254 1517506 1517626 1524938 1528704 1521819 1515397 1505476 1499741 1513993 1522055 1512792 1504695 1512821
11730 1512821 1504280 1503256 1506324 1504776 1509474 1500519 1482720 1473985 1462772 1443740 1456764 1467318 1460729
11717 1460729 1464274 1465214 1469358 1460484 1460777 1469259 1446556 1439690 1435982 1441262 1445243 1445047 1432340 1430132
11703 1430132 1435230 1422442 1424975 1437802 1429561 1427344 1430799 1424236 1420393 1424298 1437687 1423716 1399841
11690 1399841 1380218 1391379 1410509 1411864 1413180 1403927 1399834 1403948 1406536 1404024 1397685 1401758 1403094
11677 1403094 1387033 1369093 1363075 1361734 1377907 1384493 1364524 1333917 1330927 1336991 1335117 1354233
11665 1354233 1367529 1370782 1350601 1341274 1339225 1346529 1334759 1311407 1311419 1322029 1326105 1341810 1344236
11652 1344236 1347371 1339367 1325516 1308666 1308027 1308915 1287318 1259232 1257136 1276514 1293252 1288458 1283385
11639 1283385 1282579 1274362 1273981 1271479 1294889 1329930 1341571 1328771 1345979 1374518 1439467 1521364
11627 1521364 1627867 1807314 2134544 2691166 3242053 2974914 2262955 1828987 1607100
11618 1607100 1478916 1405777 1335345 1311591 1287306 1273539 1262058 1258139 1258718 1232894 1218213 1191187
11606 1191187 1187068 1195094 1190358 1180441 1190431 1202406 1196920 1193806 1170227 1158375 1165771 1180398 1179477
11593 1179477 1182724 1181033 1163226 1156770 1160456 1160243 1162875 1162017 1154591 1149386 1153689 1154189 1144540 1134717
11579 1134717 1143769 1147110 1136670 1096018 1083145 1085376 1098807 1093012 1087313 1091310 1087049 1067694 1059735
11566 1059735 1085551 1082172 1083985 1078812 1082601 1070549 1075433 1082286 1066457 1086858 1082129 1073054 1052377
11553 1052377 1045487 1044245 1069944 1090690 1094141 1085649 1062123 1057304 1077647 1075391 1052946 1050551 1054420
11540 1054420 1039694 1033478 1041643 1038070 1041558 1036722 1040595 1036173 1042947 1044246 1030567 1021590 1027690
11527 1027690 1025410 1016841 1006806 998332 986844 1003183 1007623 1002893 991775 982939 977656 998295 1009750
11514 1009750 996158 1000068 991142 977676 980137 976648 980084 991657 998471 989828 984862 972077 975401
11501 975401 981744 970689 960941 951051 956822 957546 953664 962606 966349 956206 948143 959366 965996 955576
11487 955576 947351 946803 941988 941857 937980 926650 900274 889845 907037 905210 906650 900987 892080 904020
11473 904020 898677 885587 905380 912677 894454 886510 897887 911607 915702 901130 892663 884510 874228
11460 874228 873517 884030 892254 888339 886168 871548 852052 851425 860527 861113 866783 859070 853278 862412
11446 862412 859400 853351 839414 844045 863123 860878 843046 846932 837387 844797 830051 819117 810386
11433 810386 812296 828754 834142 839139 854439 867932 860832 844882 842801 841628 817710 801510 806825
11420 806825 824445 814817 817954 824735 832579 810451 778402 801155 810642 812397 821209 808615 800281
11407 800281 799083 800607 797352 781190 783908 786904 793463 824491 843198 828249 811733 802396 799517
11394 799517 783635 787109 796818 783646 789450 799230 789428 790009 803771 812204 806847 788723 777172
11381 777172 764837 749472 742949 746375 766612 785109 778762 777242 774983 758033 747303 747537 765793
11368 765793 783973 786474 774859 765295 769597 774620 775484 770034 753543 732505 739105 739814 721209
11355 721209 698610 707989 711604 710558 692886 672892 681791 689374 671341 692405 706058 698566 717444
11342 717444 727334 740574 744022 731457 718938 729880 715486 709777 708611 724232 732694 728942 693679
11329 693679 685193 697664 696851 683788 679872 695875 701042 722414 717639 713704 719673 719451 703514
11316 703514 696960 685280 664532 665526 664617 656026 654169 665152 684123 700722 683723 671903 665529
11303 665529 661753 670747 682442 673159 657979 660300 667666 657376 639882 634524 635149 651447 687236
11290 687236 669022 657453 660163 659449 659376 662319 661547 655122 656743 658300 669422 655645 636592 627768
11276 627768 619905 603201 616379 639656 645798 658315 664254 650684 644413 646811 636476 631723 641721
11263 641721 645600 648415 657020 647352 647015 651601 637186 639475 630457 617673 625633 633003 637124 640253
11249 640253 658789 673343 663622 632417 624071 633041 638951 638973 616692 610495 625561 648277 656956
11236 656956 642725 634164 638055 630601 634326 611529 602008 625019 651068 647201 614478 592216 585631
11223 585631 589490 605007 621231 613607 605079 608530 615450 608309 624101 645885 647801 618088 580957
11210 580957 596657 585182 590093 593436 609213 612038 609952 611512 582065 565701 583262 590528 591685
11197 591685 614949 634764 591881 568470 550756 567492 586998 577965 591717 587967 581438 595140
11185 595140 595700 627589 628304 615949 618179 615369 614516 629616 633167 628369 625388 625295 626867 616821
11171 616821 621808 642390 653961 632055 631325 653630 647316 632720 641734 645106 638407 642619 653673
11158 653673 671694 699989 741801 789302 825597 875665 961727 1069555 1206192 1381546 1581750
11147 1581750 1793127 1986045 2071563 1951720 1711568 1473629 1283584 1145296 1030298 968388
11137 968388 917719 843729 767871 732649 712723 689313 671397 658885 655181 639742 615556 611567
11125 611567 608112 594805 592947 595724 586878 583224 559729 554540 550904 559579 575714 589715 599647
11112 599647 580415 555603 522207 504293 514222 533513 555286 554438 546526 559669 552017 534709
11100 534709 520325 527288 533443 533267 542173 532220 548635 557060 543988 537715 511310 493308 519877
11087 519877 528699 515277 518885 523214 544133 532691 503135 510227 518068 518389 522173 521313 506654
11074 506654 514772 524684 528718 552560 551765 552000 564544 553176 526030 530475 543095 561827 563628
11061 563628 549315 536731 530762 523905 531598 567671 561922 564516 578301 595859 592702 578680 576909
11048 576909 570332 587684 597411 622251 661294 665500 671157 670332 650665 633518 636050 660854 695023
11035 695023 722665 725938 723579 754325 757557 713778 659755 634913 647565 682136 703346 702726
11023 702726 724254 746206 772841 754489 735832 730841 706781 687640 668507 679798 691540 707906
11011 707906 725514 730311 726151 707048 683035 640533 631167 614813 616800 623496 619667 624365 637018
10998 637018 646754 620029 611601 610211 599965 583509 565425 560910 570348 582887 606972 640090
10986 640090 679769 723571 753997 784638 795047 790922 757154 706774 654357 618275 615870 601447
10974 601447 578597 556942 554416 564071 573044 583458 582962 579489 567462 533811 519025 533298 536338
10961 536338 539542 544989 557542 564735 567215 559209 563328 566233 556475 542813 540869 566185 590929
10948 590929 577834 572224 560829 563594 569571 578721 581287 567719 583009 595708 597485 603137 580762
10935 580762 567364 564978 558685 566054 579441 562161 549975 559930 579170 576481 561710 557547 559112
10922 559112 555487 545832 559509 561531 560257 571345 564647 538498 503599 495376 505545 529197 550882
10909 550882 566335 577439 587706 604513 617210 627071 613511 587005 598772 605911 593831 613652
10897 613652 600178 572270 590288 586360 577640 583699 606491 629570 626609 620521 630653 638183 653307
10884 653307 684355 701550 729699 750506 746615 722094 706359 714820 697136 677746 672364 686578
10872 686578 700353 725318 741195 761856 786674 784873 799187 809531 790075 782288 790346 792530
10860 792530 801141 808688 797839 779906 768403 726912 691222 692357 711579 744236 778588 792617
10848 792617 794545 810002 804289 805926 810590 819075 833670 836463 839530 846156 859438 881247 881386
10835 881386 863639 868781 878143 889377 904429 920141 943339 960377 968031 984363 992325 1023271
10823 1023271 1006422 1005789 1014834 1029853 1031057 1033423 1038650 1043885 1041745 1043124 1056618 1069314 1076020
10810 1076020 1095964 1117396 1130116 1154871 1183015 1195513 1226252 1253009 1292964 1311022 1323852
10799 1323852 1368975 1401533 1436332 1463211 1476511 1499939 1541820 1586220 1626121 1662185 1704232
10788 1704232 1747652 1796120 1835281 1882733 1917161 1948320 2013187 2088130 2166872 2231669 2271034
10777 2271034 2352284 2425516 2482443 2555648 2617310 2703249 2827455 2940576 3040338 3182314 3387804
10766 3387804 3581595 3738360 3912514 4089669 4279002 4534960 4822493 5139461 5486037
10757 5486037 5883944 6334518 6890198 7554033 8316283 9136565 9939135 10616066 11166772
10748 11166772 11784384 12606721 13665498 15010250 16634252 18620825 21022617 23994936
10740 23994936 27771113 32600778 38829472 47007088 57869490 72504575 92330202 119279985
10732 119279985 155285573 201094117 253567551 301632368 318592147 283957494 223721600
10725 223721600 169162444 128282742 99018103 78025720 62725968 51317843 42641768
10718 42641768 35993314 30814661 26702550 23346414 20579328 18292153 16379499 14750474
10710 14750474 13396418 12267036 11326485 10542465 9915170 9407442 8920628 8312710 7546170
10701 7546170 6761797 6058586 5473762 4975532 4547422 4171429 3823955 3556870 3318561
10692 3318561 3117941 2927644 2778788 2661638 2546684 2421335 2287372 2156639 2026292
10683 2026292 1913392 1812857 1728367 1657410 1593150 1515387 1438524 1413188 1404686 1385895 1361444
10672 1361444 1312182 1248477 1193871 1168345 1148102 1125008 1091238 1067817 1045684 1030573 1024829
10661 1024829 1000352 975353 968746 973409 996440 993954 980612 973961 991757 992248 982762 972646 962657
10648 962657 952069 934148 929763 950536 952011 953960 953896 985520 1036853 1075586 1098506 1131233 1177881
10635 1177881 1223462 1292802 1402029 1513472 1627623 1722250 1806266 1940105 2074558 2221267
10625 2221267 2443450 2732930 3131401 3658171 4387674 5364042 6649603 8278947 10262260
10616 10262260 12481738 14550049 15875266 16147036 15653885 15000372 14682080 14968315 16029792
10607 16029792 17986243 20943247 24895065 29453421 33484247 35278915 34185501 31332015
10599 31332015 28393719 26416066 25758230 26538622 28775606 32499625 37526733 43081510
10591 43081510 47342119 47977566 44420092 38729660 33253085 29156360 26671828 25730635
10583 25730635 26167480 27843580 30448048 33242979 34853225 33881645 30226002 25471588
10575 25471588 21170168 17972625 15919992 14837227 14525552 14754906 15333594 15868412 15822014
10566 15822014 14760192 12759112 10398625 8232579 6486789 5156302 4172731 3448049
10558 3448049 2899750 2497083 2167311 1882076 1653369 1463760 1314784 1171225 1068583
10549 1068583 983691 897475 827769 762577 710680 668663 607512 547333 513766 478517 449859
10538 449859 423233 415469 414462 400353 365040 335442 313423 273750 252077 246006 237707 231846
10526 231846 227339 229586 219167 203429 181929 166880 133165 129316 132028 137708 136872 138714 119863
10513 119863 108747 101156 95901 105623 92830 78678 73791 67815 77421 74342 82601 97027 104937
10500 104937 112435 93573 90235 107310 120879 122437 137781 138572 129585 123150 122550 118234 116672 114409
10486 114409 109133 114358 124860 112359 87180 78862 85101 76121 72871 85411 102028 111322 104335
10473 104335 91753 96509 108759 111386 124012 127838 117984 120555 112431 117330 118007 97292 115183
10460 115183 118447 129331 138874 156350 145513 129594 150067 140124 124211 109368 95022 84321
10448 84321 79061 72040 63350 68428 62552 58898 62279 64008 59498 73141 86599 60738 67541 85740
10434 85740 89975 103430 91772 83660 94181 84680 59870 48831 42030 39798 30311 16489 16053
10421 16053 39104 45670 42348 51512 56059 66710 40052 36665 44506 54564 43712 28958 31018
10408 31018 46064 43143 55760 77206 67566 27283 17691 25842 38626 58631 59336 69344 72888
10395 72888 71719 56821 40274 30936 32192 46801 45924 32154 40584 51586 68479 58004 51836
10382 51836 57640 59813 49169 55769 40749 52700 55723 59300 57958 66749 59240 48251 38522
10369 38522 48592 45463 50891 56595 62958 62679 55041 56417 42401 26298 26026 35100 40678 38618
10355 38618 39049 44424 59883 76765 59029 56630 65907 79174 73774 79201 92507 95455 93241
10342 93241 98502 101079 89950 62143 52306 48317 46183 63403 64998 77846 89582 90810 95751
10329 95751 90160 91048 105930 112550 115689 129579 140105 133616 123299 134048 148213 173702 205928
10316 205928 243691 290758 345416 390263 471460 569201 701787 898616 1132759 1376724 1566315
10305 1566315 1579628 1392207 1116400 886572 701534 582059 494454 382666 299172 245964
10295 245964 210064 193664 192730 177917 158000 146196 123469 114837 101328 77509 58029 62538
10283 62538 53206 37068 24151 18046 38946 40069 24836 15868 22717 34102 61453 53114 28432
10270 28432 29692 34540 43521 65933 78806 71975 39923 32505 14447 7078 25655 43357 41131
10257 41131 26330 30120 24706 31344 46411 42416 44426 36706 55467 57859 35170 11088 2339
10244 2339 15588 31604 45693 41571 37333 30083 18082 34582 32609 15053 23439 39656 52333
10231 52333 61765 51326 32841 29452 52902 35529 24251 42388 56073 41258 32999 34015
10219 34015 17054 15995 29737 42347 37561 34542 33460 43737 30018 29137 45593 58348 61669
10206 61669 61922 44274 28780 48026 67246 81538 75639 71721 64991 58360 62677 77780 85135
10193 85135 92216 85841 52310 62883 83660 95490 98513 72834 60106 68812 81138 71414 68028
10180 68028 83308 82063 70877 95441 107397 110712 127947 118261 115073 125176 136252 132123 140191
10167 140191 179867 203284 198066 192869 177653 167948 173321 163311 156547 180685 218745 251798
10155 251798 272184 301449 294475 273203 229880 200765 194470 195666 203364 182678 171022 195941
10143 195941 218625 230440 212096 207605 189682 166828 155724 123100 123676 123998 123697 124811 130524
10130 130524 113022 75507 49823 21826 34616 35529 38852 33520 20179 21944 26421 25961 37593
10117 37593 46340 34820 31244 25429 23416 25582 25747 22535 16452 28607 53977 61200 64971 69211
10103 69211 59316 56529 62283 54026 44664 31601 17510 9810 9041 22437 17576 7720 11498 8640
10089 8640 -490 -7865 -21509 -24587 -15264 -2988 18873 28277 43943 31925 46202 40331 33834
10076 33834 18895 16962 11988 27985 44374 18301 1818 -13454 -11136 3631 23559 18910
10064 18910 18140 15017 7890 10831 21602 45752 41228 23255 17972 25574 29232 34139 38542 35717
10050 35717 33748 37125 35976 44391 75485 87911 53755 10568 14999 33868 43455 38953 39621
10037 39621 53668 56018 45250 47915 49815 48625 33711 21615 8157 9533 26687 39940 32262
10024 32262 34289 36137 62544 66809 63188 51242 52319 52531 24009 -1474 421 -14701 -15987
10011 -15987 -14448 -2362 22086 21656 13598 15623 15795 10335 36089 39419 26148 14111 -5873
9998 -5873 -9150 -2088 9262 20234 24725 26824 26600 11397 10571 34027 18528 9157 11883 21799
9984 21799 9317 7389 7341 5924 21690 32736 35088 22016 17876 -2289 -14196 -4032 2092
9971 2092 -4464 3933 11935 20651 39126 40130 36903 25074 13907 20414 6293 9992 25154 24219
9957 24219 25718 16252 14289 7798 -2805 9142 1975 6552 14975 20273 9477 1431 623 -7719
9943 -7719 3189 11840 25617 22664 22964 6686 -9567 -20576 -2035 -2646 7513 16261 9950 19856
9929 19856 37121 20272 14242 34853 41742 25858 32509 22786 10733 8931 14485 14957 25825
9916 25825 43479 37231 18543 16518 19338 39060 44061 41754 48845 48406 28754 5659 -24546
9903 -24546 -19605 -2669 20361 32167 15358 -4631 -1113 9012 19823 10751 8251 12889 4605
9890 4605 -10929 -24774 -17554 -23199 -26859 -21399 -13190 -8369 8900 7189 8361 20378 44269 54687
9876 54687 45897 25510 -8553 -21999 -18212 -3302 9729 23131 34856 38060 31845 30621 8371
9863 8371 3219 2690 1189 8491 11163 12113 26855 19759 13624 10340 6728 4460 -497 -9338 -31337
9848 -31337 -40410 -28862 -1226 -3186 -14584 -6033 -4160 3112 -5148 -17169 -24912 -34072 -17587
9835 -17587 237 8871 10676 19157 19605 20916 23318 14449 22249 16453 -7745 -18240 -22091 -36522
9821 -36522 -37205 -29850 -29528 -3119 23378 23650 10818 10662 12749 26785 18082 4198 1363 -21480
9807 -21480 -31709 -24062 -29434 -23404 -10637 1286 9079 -170 -3620 -1989 -23026 -38905 -33399
9794 -33399 -9185 8271 3427 997 10906 -3100 -17328 -11953 5741 44091 44689 10196 -3244
9781 -3244 -3513 -11666 -1949 16296 27279 7087 -5820 -2411 4786 -2364 11477 18498 15384 25253
9767 25253 33473 51352 58026 49568 22100 7706 2040 -7991 8828 12968 2481 17404 22729
9754 22729 42500 40119 27046 38616 48598 30594 1626 -18093 -3835 9381 6994 -4911
9742 -4911 -24116 -16617 1081 -11718 -7293 4995 -4531 8412 23386 6829 -2233 -4671 891
9729 891 8580 13308 3687 -1922 1976 11452 6681 9614 449 -2379 -5275 -4624 1465 10178 -6807
9714 -6807 -1234 16947 13976 7143 13365 -3194 -11801 4852 12601 13987 7709 4086 8016 20265
9700 20265 34733 33780 32407 33949 25213 12189 3486 8023 10999 15236 9439 -4107 -6831 -10937
9686 -10937 -18937 -20008 -11973 21840 36890 30024 17234 8288 5182 12084 246 -3750 -6321 -11817
9672 -11817 -5343 -7366 -11732 -5101 29688 37611 29452 35663 20128 16231 19266 12916 4222 18255
9658 18255 30751 16154 16699 25031 24577 37711 51266 45750 42925 59767 93377 134341 198047
9645 198047 275739 252788 145110 73205 43822 35927 27165 4967 3459 -13343 -13696 12810
9633 12810 13614 -441 1826 18743 5615 1329 532 -6323 -9642 -2481 1043 9797 10865 9577
9619 9577 19072 14897 11357 18890 22089 20300 13440 3768 -2351 7567 8857 11066 16704 -6314 -14590
9604 -14590 -10915 -8009 -1749 5854 4063 11168 28750 15200 -12411 -29529 -26046 -11754 7742
9591 7742 11912 6396 25749 29278 18842 10601 -638 -19322 -16342 -5631 -13327 -19081 -5396
9578 -5396 9439 5660 -718 13162 12090 -14501 -1962 -7894 15195 26373 15829 2796 -8668
9565 -8668 1661 19505 16471 16261 14418 26800 38695 25614 1414 1002 -405 -8912 -14406 -9482
9551 -9482 1327 -3616 -18261 -28766 -13965 -8747 5811 17734 11478 6423 5256 6069 -681 12782
9537 12782 18987 31354 25108 31839 19461 4070 -6603 -11884 -17441 1767 15248 8527 -11819
9524 -11819 -18803 -9083 -2974 -10917 -26483 -17323 -14533 3994 19591 29995 32052 25295 -444
9511 -444 -16766 8409 28476 20969 27543 11005 -14825 4871 7431 414 9864 12700 37
9498 37 -10252 12268 18684 26575 36559 16224 -7730 -30436 -24165 -22095 -12225 2676 10440 9741
9484 9741 10019 4949 -4314 6714 1627 -13499 -19026 -19690 -6867 2979 16324 25816 16066 18657
9470 18657 11278 3428 8807 22827 34166 29956 30290 30066 9931 1023 -5252 -13006 -9980 -6148
9456 -6148 468 14688 22420 13954 17718 22242 12411 -12225 -31320 -27511 -19843 -26245 -39919 -36953
9442 -36953 -26464 -23265 -40950 -37052 -27343 -23876 -9778 10515 9465 -2916 -2274 -5282 -2797 -1123
9428 -1123 -9864 15110 30191 10632 -201 4915 -365 -5925 -6733 -8638 8215 13737 13584 12153
9414 12153 4271 -3364 -14620 -30968 -48318 -54006 -32320 -21681 -20338 -25101 -25519 -22383 -28620 -40425
9400 -40425 -33464 -30394 -30037 -2860 -12057 -28750 -7907 -1359 -23017 -36492 -35033 -17693 -13163
9387 -13163 -17154 -5976 -16427 -23175 -11103 -1228 19374 19137 -5305 -7076 -3593 528 -5378 -13691
9373 -13691 -1702 8646 -787 1270 17685 33337 26737 22193 9169 -7385 -19321 -40982 -57005
9360 -57005 -38815 -27304 -31071 -14278 -8233 -8543 -10802 -9301 -2129 -19406 -9422 -2194 -5070 -11194
9346 -11194 -21014 -28499 -38634 -25016 -12187 4460 14969 -9360 -15411 -4786 7553 19875
9334 19875 20640 7050 -18667 -30372 -2681 -5002 -16001 -30297 -27221 -3098 3691 11464 5421
9321 5421 -20463 -20202 -13022 -10297 -3990 -6871 -12304 -17786 -4892 3413 -4184 -9006 -9672 -1284 2160
9306 2160 -10754 -20709 -23039 -21524 -4109 3111 617 -1925 1793 11618 10947 10837 -4159 -2440 7109
9291 7109 4108 3535 -11747 -5243 -22032 -42690 -34200 -37096 -24899 -27377 -40746 -25068 -12422
9278 -12422 -30590 -35482 -40041 -31918 -20005 -5504 6208 12368 -3698 -17830 -19882 -13177 -12637
9265 -12637 -10220 -28395 -18570 -16984 -8293 13668 14548 -6152 -12969 -10411 1627 17869 12449 112
9251 112 -9847 -22447 -26404 -14524 -29054 -19776 -4293 -6930 -1137 640 8661 3460 -12208 -4449
9237 -4449 -26495 -34943 -15959 -8306 11142 15468 18070 -5466 -10791 10916 26171 41109 33506
9224 33506 14758 -1251 -12958 -29823 -29523 -17411 825 20926 25572 14319 16546 7250 -19679
9211 -19679 -28646 -23895 -19398 -14507 4354 2296 19888 23776 17462 13917 8280 2904 -8953 -14291
9197 -14291 4466 8590 5765 -786 748 -11045 -33953 -53613 -30667 -4308 -2504 -22904 -9263
9184 -9263 14079 10247 -4711 -4362 5824 12821 16490 -9672 4846 -9068 -19389 -17171 -24333
9171 -24333 -10395 -11616 -21340 -15484 -30482 -19648 -4447 5212 29780 29822 37473 20299 14617 19932
9157 19932 13568 9076 19241 15443 22618 24425 10027 -8946 -9528 -65 4306 14122 14008 9408
9143 9408 1958 -10742 -12300 2249 12175 4684 3317 -9474 3396 25944 13313 -13160 -27346
9130 -27346 -24862 -3847 1080 614 -4020 3631 18221 18162 13294 8031 -26395 -31766 -22346 -13852 -17598
9115 -17598 -8517 -23563 -34498 -27004 -7788 -10706 -32084 -34527 -19305 1210 -3505 -18635 -33562
9102 -33562 -25525 -15322 -22532 -20003 -21779 -14344 -5972 -6322 712 -17670 -45065 -35753 -25256 -23020
9088 -23020 -19653 -4007 1110 -17035 -31656 -6202 -49 -5921 -24407 -38626 -22334 -6157 150
9075 150 -14467 -31771 -34394 -28930 -47954 -40822 -25064 -27586 -23219 -7062 -14536 -26946 -48186
9062 -48186 -49355 -42751 -30456 -21085 -23942 -12569 7681 19085 612 -3582 9158 2710 987
9049 987 -4714 -10977 -1538 578 -3646 3931 8677 14009 -11812 -36497 -14262 -4186 -3297 -6374
9035 -6374 -12808 -22701 -27077 -15787 5002 -2317 1975 -13633 -34284 -43081 -20642 -1819 -12063
9022 -12063 -34113 -22710 -26572 -21778 -15985 -26959 -39079 -42505 -40712 -33755 -18149 -8247 -22077
9009 -22077 -15235 -2873 -4699 -9488 -18438 -11631 -1014 1079 -7342 2876 9243 5898 -14856 -34977
8995 -34977 -38676 -24096 2018 -12588 -15159 -14391 -27175 -27993 -24053 -39276 -31666 -25889 -22451 -32199
8981 -32199 -40728 -21266 -7973 -9203 -42900 -77021 -83382 -54870 -24987 3227 14452 14987 5220
8968 5220 -14951 -32223 -21012 5280 3381 -4142 -14542 -17220 4112 6837 352 3807 9523
8955 9523 6093 -12895 -5911 8474 -4467 -22790 -34896 -36083 -34365 -27846 -18228 3407 -425
8942 -425 -7867 -13420 -29405 -63305 -29328 3619 -3105 -9246 15777 11102 2903 4606 13164 9945
8928 9945 8858 19508 10370 -5673 -17271 -17258 -5706 -14817 3770 16139 1574 5736 1221 389
8914 389 8154 7832 -3098 1790 5774 -21386 -30973 -18323 -690 -9982 -31728 -19459 3286 -8853
8900 -8853 -9739 -5186 -313 -2856 -4902 2904 -16951 -18391 -14915 -24435 -30429 -27991 476 11970
8886 11970 -8779 -17379 -4822 -10313 -12857 -19345 -3099 -16756 -31734 -29255 -13877 3656 1254
8873 1254 -9164 -25734 -18854 3948 5461 8206 3268 -12919 -15342 -19538 -15478 -3890 -7984 -16536
8859 -16536 -31183 -29706 -21479 -22869 -43346 -38879 -25167 -33197 -45036 -35070 -34221 -36314 -22259 -20671
8845 -20671 -26104 -27822 -17791 -7863 -6420 -27612 -21950 588 -10294 -29707 -41302 -35192 -32138
8832 -32138 -32589 -16894 -2233 -779 4486 -1333 -10578 -15544 -13645 -14064 -15392 -14631 -14918 -27799 -14525
8817 -14525 2229 -640 -6072 8715 12392 -8387 -37536 -36011 -25580 -13402 -4381 -8651 -6813
8804 -6813 -10668 -7694 -17333 -11984 -5297 -6853 17339 30919 17142 8707 19300 38976 30206 20805
8790 20805 4570 -23435 -37367 -30122 -11421 -2307 -5573 -12092 -9685 -8789 -12444 -23276 -29188 -33979
8776 -33979 -26231 -17020 -940 4715 -3666 -17988 -16832 -15466 -22672 -21062 -14309 4550 22496 11008
8762 11008 -2700 -14382 -13997 -30726 -18103 -7066 -8943 -12745 -16880 -13885 -31512 -21964 -10476
8749 -10476 -10966 -10707 -17264 -25772 -21495 -25957 -19451 -5725 7952 29238 24918 17925 23490 24049 15495
8734 15495 -16945 -18372 -25224 -43327 -15975 3902 19188 2048 -15437 -11849 5687 28067
8722 28067 29361 18762 4199 -10665 7362 10725 -6870 -31977 -8125 -4196 181 4687 -14634
8709 -14634 -40373 -52375 -43963 -42646 -22273 -9761 -8047 -13186 -26129 -23091 -14808 -15850 -4073
8696 -4073 -9440 -7027 -5390 10943 15540 -7196 -8756 -23331 -44082 -44672 -39204 -19936 5214 2021
8682 2021 -21001 -23647 -30269 -28178 -18198 -16108 -18632 -25398 -7549 -11138 -24719 -21865 -18128 -16030
8668 -16030 -7867 -3037 -6305 -11820 8325 21154 6537 10588 -124 -13661 -25058 -26254 -31990
8655 -31990 -34888 -36906 -34500 -17311 -5675 -1860 6569 -10515 -17554 -16360 -33198 -23261 -6651
8642 -6651 -4121 -5671 8976 -3870 -24184 -34114 -28958 -16799 -7853 4202 631 -14076 -16307
8629 -16307 -22485 -22384 -36618 -41906 -51013 -45305 -14840 -17097 -28899 -21384 -17260 -25268 -23938 -30127
8615 -30127 -38785 -43519 -38433 -23221 -13441 -9101 -18872 -26402 -30743 -40299 -24998 9011 15944 12289
8601 12289 19883 22122 21799 26547 417 -16240 -6082 -11200 -13488 -18027 -14940 -19447 -607 9343
8587 9343 11329 4691 -17587 -14344 -9603 -19304 -34033 -46383 -59802 -48121 -49829 -50025 -39818 -13132
8573 -13132 -10 -634 -3002 -5022 -2476 6743 -1977 -5706 -17896 -5083 20124 26950 4461 -22039
8559 -22039 -28126 -23746 -41576 -47306 -38844 -2659 10898 3042 -9052 -18956 -5972 -14236 -14493 -4602
8545 -4602 11871 4319 1686 2558 731 -19006 -23188 -28581 -33692 -17364 -1546 -12635 -32934 -51029
8531 -51029 -34672 -39253 -36275 -16081 -5819 3087 9086 -250 -7084 597 -1231 -3085 915 4494
8517 4494 173 -15650 -20901 -18003 -16467 5087 7182 -657 690 -7019 -21502 -39602 -20817 -8559
8503 -8559 -17210 -8838 2 -10315 -19219 -38707 -43001 -17572 -10685 -23277 -32364 -23375 -4940 -5912
8489 -5912 -12945 3314 16679 25432 11727 -4539 12433 -1802 -21384 -29531 -25768 -23147 -27819
8476 -27819 -6321 -2616 10568 29016 28585 12331 -2629 -27253 -21683 -16151 -26321 -30800 -19193
8463 -19193 -12996 -9675 12503 17218 -705 -33156 -32954 -9034 13369 8299 -2958 -6186 -8840
8450 -8840 -5749 -17902 -10592 -1014 5697 12741 27743 24960 8374 -4951 -13928 -4795 6658 2582
8436 2582 15308 24167 15333 6905 2245 -29952 -46695 -38919 2612 11975 8132 14569 15253 16332
8422 16332 6135 15437 -41 -22945 -6444 -12852 -12432 -10449 -24384 -19834 -33949 -35614 -23234
8409 -23234 -14420 -20607 -30096 -50953 -25931 -6437 2828 3025 10511 14191 19401 4152 17984 27526
8395 27526 27664 23154 23784 17999 12191 -10874 -34036 -29578 -17006 -16068 -32932 -40960 -20181 -5460
8381 -5460 -7539 -9590 -14868 -32178 -25829 -22080 -24957 -23103 -27831 -44461 -29428 -10275 -13522 1128
8367 1128 7925 -1985 -5335 435 6358 22634 17653 -21460 -33999 -21160 -6937 -8060 -4712 -556
8353 -556 -7206 -14308 -10869 -14571 -7237 -4607 -10736 -24084 -23464 -15693 -4236 -700 -3249 7634 23289
8338 23289 15503 25263 23731 23831 10552 11951 12847 30870 71672 107628 179269 305452 466699
8325 466699 468661 323054 189243 118619 71247 56804 45462 15621 1760 8688 24247 21682
8313 21682 18145 24841 16430 10647 -3810 -12914 -9894 17662 6927 -7285 -12100 -13928 -7533 11195
8299 11195 -11755 -20070 6016 23636 20519 28726 26262 30119 33507 34615 43418 83506 119817
8286 119817 177635 264338 358915 560244 868100 977505 703373 420269 237424 153074
8276 153074 112987 86445 72717 61234 42762 32793 16948 19173 -11741 -16701 -7359 474 3536
8263 3536 -14277 -30180 -9440 -7127 -20578 -21848 -32623 -28238 -5387 -5850 -19457 -5956 -3785
8250 -3785 6633 24042 14805 16452 14193 6604 9374 18026 22577 67082 135091 229859 374054
8237 374054 465907 398828 269714 157469 102753 79067 49303 37107 31107 24138 -3936 -7805
8225 -7805 -4643 -207 -1469 15032 19205 -104 -8901 -17053 -18809 -3681 21965 46012 43134 7655
8211 7655 -2053 5801 4541 3710 -5218 -12529 -7192 8123 10084 14025 484 -12717 -20191 -5580
8197 -5580 -10324 -20274 -20249 -28321 -20255 -16406 -15223 -10588 3497 7816 10910 -8378 -516 4308 -15537
8182 -15537 -23545 -18277 -9775 -14841 -28706 -16836 -24405 -29032 -13401 -9367 -24562 -22278 -19175 -308
8168 -308 8852 808 -13315 -24578 -31321 -5250 6089 1312 -16133 -10399 -8349 -30302 -51310
8155 -51310 -43564 -29598 -25179 -35543 -21751 -2360 -14096 -20370 -26064 -18117 -1956 25 -7147
8142 -7147 -10281 -13094 -2851 4788 -13735 -15019 -13888 -24525 -38881 -27196 -2858 20460 31890
8129 31890 14006 12918 2740 -22724 -24581 -32612 -40673 -28030 -21635 -17228 -23122 -29754 -15656
8116 -15656 -23348 -15519 -933 -1956 -6398 -1885 -3824 -11765 -8022 -16764 -13310 -10177 -23575 -35784
8102 -35784 -17944 -7000 -8094 -17261 -16225 -11482 -35445 -33831 -40460 -51767 -38381 -26169 -33779
8089 -33779 -32167 -22066 -17138 -4700 -10343 -16478 -27610 -25152 -22079 -28074 -29467 -29801 -21160 -19979
8075 -19979 -27222 -42804 -35323 -40416 -33657 -9950 -14246 -15578 -26471 -38484 -33533 -26469 -10951
8062 -10951 -11252 -13471 -22302 -37128 -19172 -31746 -27691 -7876 -2517 11138 14298 14917 -8419 -19598
8048 -19598 -21091 -8696 -1552 -2316 -17902 -21833 -18270 604 -15190 -18721 5799 19228 13936
8035 13936 -8920 258 20052 4845 -28977 -43891 -30257 -23909 -33077 -41858 -45203 -33646 -29160
8022 -29160 -20784 -782 -6946 4119 663 -20193 -28297 -11757 -5616 7859 8133 9152 -4608
8009 -4608 -21240 -28268 -33306 -13383 -8288 -11315 -14642 -25002 -40019 -55930 -59496 -50717 -36729
7996 -36729 -15248 -11656 -9479 -2878 -9266 -15820 -4784 -12579 -27858 -25573 -18631 -33463 -39188 -9675
7982 -9675 10515 13304 9023 1593 -1502 -4828 -367 -8328 -1028 10418 11721 14865 9401 -4321
7968 -4321 -15380 842 -6085 -5490 149 -6629 -15350 -6272 4803 6852 -4203 -26831 -20196 406
7954 406 -1750 -5553 5884 2387 13751 13515 5574 -3451 -21137 -34758 -29437 -12281 12580 20231
7940 20231 2089 -14017 -22886 -30001 -23813 -28348 -28580 -20759 3035 -13303 -24273 -15895 -20619 -11281
7926 -11281 -916 14333 20459 3531 -24323 -35055 -34191 -26667 -8653 -7021 -5242 -21559 -15963
7913 -15963 -15731 -12365 -4321 7902 -6687 -20466 -24286 -25959 -19326 -21675 -7205 -6425 -30018 -27165
7899 -27165 -23863 -22078 -15065 -11326 -20725 -34864 -26600 -16823 -19940 -26007 -24115 -18268 -18592 -17716 -13082
7884 -13082 -15802 -16761 -7643 -4939 -4177 2380 3279 -1796 16710 15154 14241 -7033 1487 16050 25072
7869 25072 19966 6817 -10645 -24028 -35144 -26598 -4688 -10015 -23361 -23928 -19453 -27007 -31623
7856 -31623 -19010 -7641 -9563 -21499 -11445 -27289 -21773 -31755 -18923 -12642 -10872 -19130 -29891
7843 -29891 -22067 -20422 -15147 1906 -2884 -24133 -26396 -16450 -14541 -31364 -27590 -22859 -19059 -207
7829 -207 12200 -14143 -10322 -265 13951 1639 -7809 -10866 -12336 -14469 5764 16754 11043
7816 11043 4489 -5614 -3466 4087 1893 -3476 7075 1169 -16996 -29131 -29788 -23866 -22089 -20595
7802 -20595 -11494 -2011 -17318 -7537 -4000 1149 5082 -4060 -2045 -979 -10724 -21236 -20729 -21008 -22272
7787 -22272 -12107 -4546 9237 27925 4296 -18231 -26907 -19173 -19279 -33811 -18813 -14384 -17054
7774 -17054 -26513 -25904 -28496 -32012 -31232 -34713 -50409 -44854 -37202 -28729 -15204 -7608 -9513 -5767 -7055
7759 -7055 308 10252 -6939 -10799 -10767 -11635 -6870 -4713 7015 -11179 -29280 -30802 -28146 -23368 -14365
7744 -14365 -1479 -777 -17791 -28193 -57277 -85307 -67694 -47737 -42061 -27126 1248 1260 5426
7731 5426 5498 -16950 -36825 -39709 -34043 -10647 5994 -24974 -50268 -58255 -43349 -47726 -44953 -25155
7717 -25155 -15536 -38602 -33390 -19602 -2152 14332 -9498 -22527 -30500 -31096 -22002 -25304 -38604
7704 -38604 -43482 -47225 -35392 -15939 -31169 -28346 -3051 -9806 -9221 127 3086 -7413 8693
7691 8693 23040 25804 6670 -7021 -14762 -6825 -9118 -12564 -9013 -25082 -23243 -1871 25068
7678 25068 12330 -6249 -24306 -27567 -20468 -19713 -5551 -17180 -10788 -11847 -16988 -22638 -39786
7665 -39786 -32002 -25349 -20695 -566 4276 -8724 -24289 -14870 -13366 -14362 -26858 -29753 -39928 -24752
7651 -24752 -21512 -4923 3531 -18642 -25077 -36998 -24822 -14523 -24188 -28786 -39236 -39184 -20188
7638 -20188 -15298 -12307 -6832 8324 -1889 -15207 -15843 -19887 -13307 -11852 -18434 -19036 -28904 -17966
7624 -17966 -12241 -12828 -25606 -41053 -49887 -44444 -32212 -34775 -26182 -21975 -30351 -35854 -11153 -24933
7610 -24933 -20473 -7240 9633 2680 -17783 -16091 5670 1100 -2368 -16001 -27238 -18436 -11914
7597 -11914 -16645 -12262 -9854 -6314 -13146 -10555 -37783 -40218 -33709 -24845 -14245 -23501 -19848 -9796
7583 -9796 -4037 -15092 -18236 -31701 -43477 -44861 -40272 -43277 -38078 -14624 6593 9519 2576 -5223
7569 -5223 7540 3946 -9633 -9744 -20230 -24014 -25527 -34854 -34428 -36449 -47352 -36435 -28734 -36869
7555 -36869 -23110 -18678 -21931 -38132 -39245 -23066 -1603 11185 2866 -2285 -5849 11856 11450
7542 11450 14323 5999 -4159 -8924 6013 -2574 -20515 -24330 -28206 -2046 5907 -2254 -18236
7529 -18236 -36092 -33580 -32180 -28050 -46341 -42919 -56714 -50443 -48013 -43167 -17009 -16398 -25578 -30892
7515 -30892 -27494 -26500 -18244 -7462 -17602 -47618 -47272 -26687 -28278 -16512 -18072 -32431 -25626 -29501
7501 -29501 -24146 -13112 -1488 6700 979 -24815 -48950 -30422 -28148 -36613 -32272 -20180 -22661
7488 -22661 -29601 -24812 -11187 -29408 -33124 -39750 -56127 -59171 -46084 -28634 -33339 -54227 -62892
7475 -62892 -32238 -28134 -13858 -8085 -23981 -25983 -18792 -2504 -8989 -13867 -3481 -3825 -15136
7462 -15136 -2683 -1610 -6124 12577 22469 7622 2638 21272 -3973 -29665 -52677 -34030 -21968
7449 -21968 -25536 -22483 -21240 -8329 -8237 -17212 -22506 -20135 -8428 -6115 -11903 -15089 -15661 -12241 -27913
7434 -27913 -25976 -25257 -17647 -2712 -21188 -28939 -26352 -23983 -18174 -8748 5825 24230 2859 -21835
7420 -21835 -45129 -36530 -32680 -40063 -41451 -26449 -23214 -31956 -40986 -41229 -48201 -41943 -41021 -20419
7406 -20419 -10138 -18106 -8530 6733 18917 4005 -10366 -34148 -47545 -40865 -20299 -2103
7394 -2103 -6958 -8963 -25499 -24686 -13551 -5402 -7127 -10551 -8883 -11569 -13209 -11168 -22420 -22623 -25664
7379 -25664 -35540 -23979 -3354 -8279 6515 -12322 -22493 -20320 -5188 16475 23482 40266 24368
7366 24368 4280 5127 14363 10764 8987 4520 -12777 -38803 -39704 -50727 -52689 -57778 -51167 -27393
7352 -27393 -24816 -31108 -37199 -39620 -27858 -38084 -19023 -9901 -7834 -17836 -27018 -37444 -46158
7339 -46158 -35218 -22952 -21238 -22505 -26865 -34167 -36412 -34999 -27466 -24675 -13845 -11771 3462 5513
7325 5513 -5464 -12972 -32506 -38454 -37898 -46110 -45937 -23695 -12086 1400 15909 1172 714 -6355
7311 -6355 4419 4605 -3505 -3624 3148 -2587 -18493 -8452 8527 15080 12006 13582 -902 -4546
7297 -4546 -14423 -14697 -16417 -20488 -42404 -43954 -41331 -33447 -15626 -9193 -6628 796 -15457 -24639
7283 -24639 -17965 -7075 -6962 -9294 2788 7916 1055 10614 5141 6897 3068 26791 33803 15678
7269 15678 -7609 -23782 -15685 -14358 -22339 -11956 -15747 -15744 -19785 -9647 -10889 15362 16044 7133
7255 7133 182 -14937 -21645 -18204 -15685 -19941 543 3778 -7685 -9865 4529 -3563 -13825 -19764
7241 -19764 -20373 -29817 -18495 -3890 -11673 -30730 -29356 -30530 -19360 -11907 -3926 17874 25813 -12224
7227 -12224 -38477 -27306 -22323 -34888 -40966 -49057 -28653 -23529 -5101 -10415 -19528 -27395 -20965
7214 -20965 -11166 -29059 -31254 -22135 -32631 -33241 -13445 14473 17911 15932 8533 5009 -14514 -18266
7200 -18266 -11905 -12795 -6098 -3939 -12188 -15871 -11639 25134 35821 8342 7238 1780 -8518 -41138
7186 -41138 -47337 -56030 -42784 -15821 -15333 2350 21188 12361 15014 5568 -1984 -9956 -16549 -35864
7172 -35864 -26702 -14175 -11070 -11115 436 8498 8586 10133 -5886 -14415 -20161 -33914 -35315 -28112 -38772
7157 -38772 -37403 -8889 -11695 -19144 -19322 -5700 9978 -7558 -5358 -2916 -2393 -13504 -13147 -20874
7143 -20874 -26658 -18587 -22801 -32017 -56322 -60855 -38876 -16090 -1160 -10336 -32336 -39748 -37516
7130 -37516 -29571 -46154 -49060 -37796 -51954 -54399 -29339 -12501 -18124 -17284 -15410 -19932 -40422
7117 -40422 -19590 -27450 -43802 -45597 -29904 -11640 1120 -8748 -5542 9247 20835 19294 8911
7104 8911 -3695 -8510 -12691 -23231 -3076 11664 1091 -13983 -24518 -19293 -18632 -25312 -17986
7091 -17986 5718 23531 7498 -2070 4642 13483 -5979 -21993 -11765 -11019 -13652 -12027 -30730
7078 -30730 -18944 -2430 12474 7539 -2378 -2927 -11576 -12418 4994 9007 -2615 -20587 -34834
7065 -34834 -40262 -30450 -22709 -12747 -17595 -16416 -18551 -14274 -12038 5190 7150 2650 5241 7671
7051 7671 -6288 -34483 -32388 -15457 -7294 -22944 -12925 -3322 -2977 5020 10272 6935 -1502 -5565
7037 -5565 13106 2415 -6797 -11722 391 11720 10688 5877 3170 5082 -5491 -23568 -23502 -20234
7023 -20234 -15942 -12393 -25941 -31746 -23061 -8997 -4218 12007 21088 10050 -21140 -28242 -39186
7010 -39186 -47491 -44977 -21217 -18050 -17538 13095 53956 41980 12059 -5325 -4938 2237 4807 14768
6996 14768 17195 20904 5587 -27141 -45557 -41943 -35424 -16435 -3560 -14840 -18877 -1377 19301
6983 19301 14805 3323 -5643 3900 4281 1255 -1584 -2790 -16114 -22716 -11853 -23029 -19637 -1969
6969 -1969 5635 -1256 6688 7288 4410 -5315 -13121 -32244 -30516 -15800 -20092 -8409 1969 7240
6955 7240 7463 10738 16348 17797 18018 15331 10997 27862 14828 -12722 -39606 -54020 -47495 -15770
6941 -15770 -4309 -4665 -10030 -11547 -10206 -11245 -19907 -31361 -15590 -7912 984 -10150 -19722 -177
6927 -177 23764 33857 17140 -2178 -33313 -45039 -37537 -29746 -33193 -18409 -9785 -14298 -10856
6914 -10856 -13932 -4126 11004 27491 37248 23377 30650 32625 19546 15653 2541 -5390 -16857
6901 -16857 -24809 -6338 4310 -9100 -18544 -19456 -14598 -9775 -13206 -11810 -6576 -1651 -522 284
6887 284 -11172 -7643 -9497 -18702 -34244 -35528 -30199 -31826 -37887 -27558 -9572 -3898 -24736 -48450
6873 -48450 -47637 -48190 -40555 -18628 -22577 -17841 -12921 -2343 -3827 -8564 -3082 12337 25912 1064
6859 1064 -21051 -24298 -39924 -40271 -38744 -41423 -26063 -19343 -18158 -15817 -10371 -9588 3162 8914
6845 8914 -2271 974 -561 -726 11904 14246 6332 -8760 -27869 -27433 -7947 -10586 -13964 -19919
6831 -19919 -19135 -11405 -1784 -8253 -1415 13990 13112 4232 -161 1932 3156 -11976 -6363 7539
6817 7539 1267 -11231 -15295 -9635 2949 2480 -1789 -5336 -12889 -10933 -14713 -13032 -4215 -11424 -10633
6802 -10633 -11339 -1629 8372 -5413 -6381 -10324 -20935 -40526 -22651 -14000 -18302 -9823 -16571 -44992
6788 -44992 -50304 -37267 -22674 -15071 -12831 883 10830 -6687 -21006 -21522 -30652 -38401 -33087 -25298
6774 -25298 -23339 -14680 -25125 -36931 -25287 -4813 -13224 -18777 -16072 -13680 -20863 -5714 20402
6761 20402 15724 2706 6539 7320 -3229 -13092 -16198 -14616 -27025 -20403 -13035 -21105 -24694 -22414
6747 -22414 -8173 3020 12890 23967 19373 -178 -6097 -233 -3671 -20214 -24596 -29477 -44110
6734 -44110 -52631 -43965 -30317 -10578 -13140 -10833 -15284 -24935 -34572 -16477 -5575 9362 8707 -10994
6720 -10994 -7113 -7471 -13951 -14375 -29252 -29166 -7451 8976 17170 19543 12866 11130 -5668 -6025 26104
6705 26104 15120 -3502 -27776 -18119 410 -4446 11081 16799 16501 18797 23575 -6203 -18955
6692 -18955 -33237 -12281 6040 -14036 -9251 -8631 -18612 -33953 -16075 -2889 3911 19532 4120
6679 4120 -20312 -37798 -47924 -37475 -39876 -30005 -22201 -20230 -26183 -25753 -19994 -18469 -7609 -8315
6665 -8315 -3261 2007 2667 457 -19888 -23806 -23427 -27769 -26687 -43207 -63479 -44758 -27137 -18001
6651 -18001 -11663 -14371 -4404 -3296 -10114 -11289 -10477 -14019 -26507 -12468 36 -12525 -30617 -25414
6637 -25414 -32105 -29674 -23334 -23994 -33287 -19661 -494 7638 3803 1697 -9080 -28100 -32922 -28527
6623 -28527 -18043 -30720 -31747 -42111 -41950 -13146 19798 20947 25054 17418 10949 -6123 1535
6610 1535 7134 -5114 1312 -623 -12378 -6605 3364 7573 1722 -10858 -21480 -2303 14690
6597 14690 15940 11152 11603 3263 4246 -2875 -15557 -6486 -6554 -8072 -14733 -11565 -31113 -21645 -11752
6582 -11752 -17003 -22411 -14795 -8676 -3130 -7566 -12285 -12749 -17895 -35442 -35739 -18294 -20294 -26127 -28654
6567 -28654 -17917 -14255 -14601 -16396 -20933 -19628 -9136 4806 3296 -4304 -14951 -20543 -27799 -36541
6553 -36541 -24939 -29424 -12740 -12982 -12670 -18806 -33109 -18364 -4202 11099 2447 -2994 -19861
6540 -19861 -21285 -29088 -16758 2119 598 -403 -12300 -4403 1730 -976 11295 8687 3280 -804
6526 -804 -5605 -26891 -37052 -33062 -27753 -22801 -22831 -31342 -20040 -8097 -1346 441 3419 11537 15619
6511 15619 17449 5546 -17244 -16317 -20973 -17651 5130 2210 5370 -3093 -51 8393 20067 25653
6497 25653 10440 -8632 -20143 -24996 -31217 -21407 1108 -1588 -2203 -4111 -6345 -6349 -20002 -32510
6483 -32510 -21579 -22400 -28517 -16359 296 -2364 -6079 -8041 11972 16748 23682 6907 -2966 -11099
6469 -11099 -10568 -15294 -23813 -25771 -23548 -13073 -10406 -1767 3198 -7340 -4325 -12941 -14261 -7810
6455 -7810 -2068 10690 9380 5531 -10313 -28258 -25708 -28918 -26080 -33139 -26135 -14610 -20903 -15489
6441 -15489 -2006 -4593 -5212 -15058 -32300 -43841 -46734 -26356 -26114 -27314 -8298 -972 -5124 -4402
6427 -4402 622 7401 -4671 10459 15147 17198 20696 139 604 2649 -2198 -8967 -16514 -31958
6413 -31958 -38321 -16194 5209 14540 1789 -8156 859 -351 7130 22347 7503 -1901 -6090
6400 -6090 8467 16529 23578 25761 142 -1104 10861 -8716 -24687 -24257 -1661 9012 12281
6387 12281 11345 5206 -11658 -17079 -1 -11153 -18780 -26138 -36492 -21136 -456 -9522 -1403
6374 -1403 30592 44167 31524 10286 714 -14854 -23859 -18656 -1961 2607 4811 -17095 -39387
6361 -39387 -50841 -54762 -40053 -36711 -41531 -32285 -28995 -12678 -21724 -12299 18795 16540 7524 -901
6347 -901 4407 13457 14223 -5919 -8530 9515 1422 -4454 5491 18651 15080 -3644 -2076 -3293
6333 -3293 -14651 -16801 -14844 -22359 -3810 6527 8394 10451 9239 10546 19900 3907 11067 16043
6319 16043 22742 29695 24041 31526 37439 16642 2523 3180 -9824 -24881 -24606 -33112 -32342 -16918
6305 -16918 -6053 -4479 5338 -431 -14198 -10737 -7666 -1442 4358 1268 1727 -8466 -33973 -40774
6291 -40774 -24625 -3718 5508 -7154 -16788 -19844 -24601 -27106 -35043 -23530 -13781 -2453 -18955
6278 -18955 -28164 -34304 -16870 -11967 -8767 -742 5163 3703 5568 11944 11031 15553 8590 2183 5733
6263 5733 4231 9313 6597 9607 10720 2432 1373 8433 -6593 -6263 4747 -8986 -22343 -23890
6249 -23890 -25400 -25094 -13493 -19767 -16249 -6170 -8852 -5115 -9799 -7061 -2525 -11691 -23191 -20578
6235 -20578 -20622 -27423 -20647 -16364 -598 15124 -2877 -4038 6462 18593 -1036 -33122 -26430
6222 -26430 -7075 -3690 -21686 -31026 -41711 -26016 -9291 -24982 -32140 -30597 -21657 -26642 -34585
6209 -34585 -25933 -17248 -14840 -4202 -36094 -49020 -49372 -46117 -26778 -22469 -3521 -1862 -11049 -1582
6195 -1582 -2251 15426 21865 17310 21731 2662 310 -6616 -11378 -16397 -24509 -21420 -6928 -4604
6181 -4604 -14468 -20944 2317 5401 12909 7690 5242 3281 -355 7383 17144 30667 43675 21512
6167 21512 -1524 7654 10130 2123 6283 10913 16302 33754 30144 27003 22628 26129 3678 9426
6153 9426 28750 1609 -19437 -15187 -12232 -4506 -15516 -17719 -14989 -8629 -182 10254 -2932
6140 -2932 -13475 14317 20694 3733 -10067 -14506 -14143 -17542 -13831 -18842 -19001 -13251 -10327 -11291 -4105
6125 -4105 -13558 -10171 -1359 -10295 -20085 141 16205 12540 11868 -6037 -12374 -6003 -521 18058
6111 18058 17137 396 -6231 4936 17173 308 -14519 -22003 -17774 1139 9036 -7448 1626
6098 1626 -16311 -34015 -34059 -34585 -36641 -27789 -17175 -11512 -5634 -6178 1593 16829 21800 16739 7970
6083 7970 6766 -19112 -32474 -8494 -7651 -12692 -21801 -15061 -7098 -13490 -7447 -9756 1541 3074
6069 3074 12649 11053 -16981 -34604 -17868 6589 17953 620 -28667 -25318 -17908 -11764 -6178
6056 -6178 -10857 -7996 -19929 -20967 -24390 -22123 -17011 -20526 -38199 -56415 -36454 -20620 -27208 -38125
6042 -38125 -48164 -40236 -32775 -40394 -29536 -5653 958 8494 21522 22371 4477 -14985 1680
6029 1680 4081 -8043 3676 16177 13351 18543 -6166 -17851 -806 31748 30193 18525 29253
6016 29253 33668 20349 -9883 -19333 -16829 -19938 -16195 -1539 11841 18766 -4614 -11317 -20145
6003 -20145 -42228 -57468 -47787 -44428 -26934 -2974 11080 15810 15491 14749 14959 -2622 -15039 -6537
5989 -6537 634 7131 9192 775 5954 -9435 -25820 -20832 -19451 -6872 7797 3912 7102 -227
5975 -227 -9737 -5235 -1104 -22009 -15327 20683 38535 35197 23109 16222 9911 -8212 -7322 -15811
5961 -15811 -13623 -11519 -25915 -25902 -14081 -11687 -15028 -15769 -8534 4313 20802 27312 40426 35740
5947 35740 -1181 -27466 -30750 -24135 729 19531 16340 5450 -4962 -6934 -8696 -1709 -7153
5934 -7153 -12567 -11613 2237 4978 -9272 -16246 -6986 10150 10783 -6506 -3415 18928 8055 -8437
5920 -8437 -11942 6003 655 -1824 60 -11392 -4217 -4062 469 9613 -2446 1580 12224 12949
5906 12949 4866 -11244 -17616 -17590 -22763 -17625 -4281 5789 7703 27691 12127 -9651 -521 1430
5892 1430 -9898 2189 5858 -914 -17261 -16367 -2176 -6223 -1858 -14393 -11160 -16393 -13589 -5304
5878 -5304 -27052 -34048 -14258 6789 -11284 -37881 -42908 -20726 -2660 -6391 -1361 580 3061
5865 3061 5488 12956 6515 9880 7838 18769 3408 1302 4498 12534 23723 16152 -9728 15088
5851 15088 6232 -23784 -3490 11152 11292 6790 3574 18540 32024 24038 28062 9084 8812 14525
5837 14525 26863 837 -4265 -13223 -12560 -31715 -44566 -32870 -30112 -30064 -29375 -25510 -13312 -3680
5823 -3680 -6693 -8804 -1198 7603 -2589 -10730 -14948 -30303 -12602 -1055 10348 3570 2583 3375
5809 3375 15062 4836 5035 -9892 -13330 2439 -3832 -20698 755 24771 12689 -6186 -25567
5796 -25567 -24418 -4272 14116 -12519 -12584 7690 3421 -3890 5088 1847 -5738 -1342 -11966 -31032
5782 -31032 -53654 -56444 -36222 -24584 -22282 -14962 -4571 -19871 -6300 10072 14118 -5459 -19577
5769 -19577 -25063 -3741 5002 -9091 -22813 5576 14164 -4927 -5581 10151 28837 33043 31406
5756 31406 24058 14193 24461 34697 31852 35233 5754 -27478 -27278 -1796 1186 -1414 2255 7903
5742 7903 8217 1264 -3045 -7960 -9457 -4577 -15547 2057 9710 22130 5891 8702 19054 20884
5728 20884 9048 6717 769 -1621 -8245 -10094 -12358 6299 534 -19684 -38111 -21822 294
5715 294 3572 -3177 -14966 -21027 -20561 -3372 -7632 9809 17873 14287 8177 12869 34758 25532
5701 25532 2110 -24788 -5864 -7433 3326 -1880 -759 248 10176 30415 26229 10674 -12195
5688 -12195 -12230 8930 2352 -12408 -13355 -14286 -16572 -32736 -40336 -24247 -12256 1063 2046 -7763
5674 -7763 -5832 12246 16060 4074 -25284 -21481 -17671 -6748 -2826 -4571 -2943 4299 7925 -11025
5660 -11025 -7675 -18316 -16439 2684 106 -18653 -21442 -2972 -3739 -12832 -16743 7799 27522
5647 27522 24864 -2613 -14006 -12578 -17326 -23390 -32035 -21853 -20912 -12726 15512 4144 -3421 1137
5633 1137 2698 -4922 -16520 -548 21279 32678 40767 35620 19997 1687 -2942 -9341 -16094
5620 -16094 -12185 -38594 -45682 -39405 -7474 2546 18972 31084 33860 22767 5220 3655 -1806
5607 -1806 -24150 -31478 -23199 -7550 -2198 13327 10917 3741 -19706 -22344 1279 1196 -7296 -14297
5593 -14297 -5042 -9948 -22107 -26441 -23136 -36709 -27770 -16577 -4885 4569 17989 24479 24688 31537
5579 31537 36878 53863 57727 44824 44137 43549 34686 17708 12682 -7822 -26672 -24729 -20145 -29198
5565 -29198 -15007 -10206 -10524 -7614 -8934 -13358 -14964 -18720 -4720 4608 4418 -7178 -25037 -38845
5551 -38845 -38231 -30010 -21285 1680 -1961 6604 7872 1845 -11190 -30259 -37961 -28091 -11534 -5399
5537 -5399 -11096 -6590 -4095 -7892 -17873 839 -9165 -25202 -16983 -7245 15970 21455 18721 16221
5523 16221 17408 -554 -8969 -831 8638 4702 -9796 -26963 -29531 -6589 7337 -4718 -15320
5510 -15320 -524 491 -6509 -8959 -17173 -31784 -18453 -21147 -37991 -43241 -48680 -40035 -21634
5497 -21634 2240 14118 15262 -1409 84 2391 -3675 -14210 -15433 -25478 -12319 12846 10842
5484 10842 -7824 2564 5266 10480 19391 21641 7216 -7924 -28336 -36436 -25640 -8252 -9002
5471 -9002 -8321 -811 10392 -5938 -7486 -1938 -3173 -6644 13482 14760 -3333 -7334 -7661 -9778
5457 -9778 -16607 -28640 -7522 9507 21167 17817 5395 3139 16466 32347 10624 -9798 -10282
5444 -10282 -4272 -11166 -20355 -17085 -29639 -22507 -14463 -8475 -5486 23221 19640 14868 22425 36432
5430 36432 36642 4388 -3341 -9966 -1276 -4365 7937 3717 -11305 -22513 -9669 23561 28050
5417 28050 18028 22121 33660 20042 -6778 -14726 -3971 -789 -2471 -11296 12893 13291 4064
5404 4064 -4418 1652 4860 -17568 -8873 5387 25994 30996 11561 9480 1397 3310 10710 14783
5390 14783 -6155 -19202 -3652 -4687 -21255 -521 11890 20647 32065 28479 5754 2288 2565
5377 2565 890 -9453 -4265 -1997 -623 -12069 -5294 13983 9768 -19319 -22667 -9902 -1231 2953
5363 2953 -21893 -25627 -25725 -16187 -7832 -587 11888 29005 19397 9054 6092 5278 -7588 -2104
5349 -2104 -4952 -22223 -21906 -7548 8423 -2246 6940 38699 41638 23719 -2003 12224 22972
5336 22972 9995 -6405 -10419 29084 47248 49495 30363 7982 3327 16150 35132 30537 20998
5323 20998 23725 18289 21056 24042 14373 4862 -24419 -21088 -16356 -16664 -6677 2649 24407 1529
5309 1529 -10994 -15510 1154 21418 31740 36306 25029 14993 19950 11996 13568 5149 11625
5296 11625 30705 15071 -4766 5406 11439 16250 29309 22035 4526 7889 4191 9771 -139
5283 -139 -1100 -6200 -22585 -29752 -18514 -19557 -9994 2349 3675 284 11862 26504 15893 -1666
5269 -1666 -15814 -15992 -1890 11916 24089 30037 14776 18921 7588 3823 13232 12732 -1483 -7960
5255 -7960 7030 17069 19443 12204 16394 14985 11703 23311 18280 2974 13610 19920 19745 15705
5241 15705 10165 10003 -4810 -11444 5947 14838 9864 -15282 -25671 -14774 -2581 870 9428
5228 9428 28310 39187 24863 15647 26243 22771 20524 -611 -7862 -12660 -4989 7418 15253
5215 15253 825 -9662 -20687 -20373 -5880 1394 8137 15715 11259 4077 -7406 -4763 -12212 -25926
5201 -25926 -377 8711 -11072 -17076 -19953 -14061 10864 34447 42344 12266 -22332 -18162 -21950
5188 -21950 -9893 1705 6885 4049 -8722 -7965 -2990 3424 6828 16924 3059 -3292 -4392 -20230
5174 -20230 -34061 -18374 -9737 6352 27237 14720 11691 20533 32235 25977 1968 -8156 10773
5161 10773 20164 22143 9665 -2236 955 3743 -6181 -16114 -18083 -14396 13648 27596 17488
5148 17488 12302 16979 10942 -7605 -4087 342 12314 20828 3848 -2403 -10726 -14552 -11291 6534
5134 6534 12258 -1560 5563 13927 18508 20502 11565 3487 -6 448 -11979 -24923 -32413 -22826
5120 -22826 4774 18422 -3205 -825 14764 12945 13182 16430 16205 -10166 -33034 -29087 -14347
5107 -14347 -6280 10768 18158 38976 47285 30009 11699 11382 -1249 4540 7035 7283 12518 19734
5093 19734 7101 -17407 -16194 -4011 -3639 7326 5769 853 2423 8456 3700 -10933 -7076 -15373
5079 -15373 -16441 -11110 -3814 -5005 1205 13807 15231 -4266 -126 18724 21019 4852 30580
5066 30580 40676 29436 16173 13753 10286 31817 13835 22294 39244 19967 14598 13341 -408
5053 -408 -7993 -2314 -4989 4159 37369 48706 34782 19529 -259 -6979 -13268 -12699 10036 39512
5039 39512 51757 37382 20507 20812 32618 24705 3848 -3511 -5323 -1173 17256 13367 -4147
5026 -4147 -7436 -7698 -3139 6035 10658 15680 7988 7234 -789 581 7518 12653 3065 -658 4435
5011 4435 6340 -17779 -11126 5299 2513 9120 18718 38305 55916 57042 59536 50623 32925 33048
4997 33048 55047 37347 20584 28326 37392 47359 36069 24474 17398 18734 -4774 -9430 -4119
4984 -4119 6821 13490 28244 20630 10444 13430 9717 -10996 -23601 -6651 31708 25884 32875
4971 32875 33709 8814 4618 11462 29935 30450 6565 -3329 24141 50077 35090 17861 6206
4958 6206 -240 -5778 -10485 -10375 -4571 12638 31985 26471 26410 36560 26933 17936 14769 15220 8018
4943 8018 10928 -2456 3452 18936 15231 6355 13462 15367 8751 -2989 1746 -5807 -7300 784
4929 784 9047 11638 -2816 -9552 2118 784 -14941 -11832 7276 3267 544 5317 12097 16586
4915 16586 6719 22741 32102 25769 14120 -15175 -6116 9984 9565 8653 4841 10426 7380 3851
4901 3851 11701 21712 22628 14862 16638 8921 6821 4081 14294 6042 -11638 -7043 14983 9377
4887 9377 -15660 -9269 18087 18920 11212 13623 27397 25653 28056 32752 27218 16855 15932 10846
4873 10846 16320 22059 -413 -21172 -16019 5514 30346 34045 44858 47435 25314 -9949 -28595
4860 -28595 -16046 -10820 -15229 -17655 -5554 -1234 -9637 1219 9259 11821 -4890 -2371 13286
4847 13286 7124 14724 31834 24386 12708 15207 23008 28013 21831 25167 37263 45707 33705 3528
4833 3528 -14929 -17188 -22759 -29457 -15961 -5957 -8958 -7541 -3106 6340 3560 3174 8325 4228
4819 4228 25035 29819 22925 24654 13991 3953 5715 -17593 -29409 -30347 -21911 -19814 -9145 -11314
4805 -11314 -13502 -1064 16460 17005 544 -11650 -17119 -6489 -12382 -2285 1641 5344 -3555
4792 -3555 1964 11284 11097 20027 18628 24795 11769 -15396 -19816 -14940 4621 18559 9521 16440
4778 16440 14141 -615 6692 20111 27126 17340 5481 9243 12794 8016 -10718 -14929 -8176 -6110
4764 -6110 1386 7295 -11154 -9316 2303 16579 38057 34196 24648 17075 15082 4602 9679 12416
4750 12416 23843 17743 18192 12815 -5335 -899 8535 30676 33495 26495 32004 28418 25991 12749
4736 12749 25943 25187 24124 26526 22276 23321 8223 -13477 -3503 12194 12734 5902 12743 36780
4722 36780 26328 19453 29880 59340 62752 29169 -5588 -13618 -18644 -1887 23024 29616 34484
4709 34484 18086 1365 5525 464 3370 -3209 -10035 -14825 -8709 -2820 9565 2737 -3922 3186
4695 3186 21608 26811 15737 21864 40367 35286 10564 10551 16558 7416 -9598 -9929 -16543 -11494
4681 -11494 3834 -8165 -9544 16757 17292 -4174 -143 4073 -13431 -21187 -10830 6028 9063
4668 9063 15588 13350 32568 20678 2667 3453 -2173 -2012 3048 -5073 4611 16359 27587 37407
4654 37407 44962 26470 17888 12145 4816 -10137 -20206 -20364 -4097 -4799 7587 31805 39007 40212
4640 40212 28042 18639 13378 13078 14734 -1399 -3541 5573 18598 21665 17044 19646 4977 -21068
4626 -21068 -5544 13798 7799 -4910 4614 10921 -854 527 -5890 16861 18781 6360 -4723
4613 -4723 7589 3551 2727 5234 10858 10859 30140 49920 35830 27958 26071 31072 20752 18905 29871
4598 29871 29466 29068 39436 48489 29273 2009 -4745 8025 24343 36260 8648 -11846 -8722
4585 -8722 -10987 -8026 3011 12968 19563 12331 8198 -5279 -4860 -5809 -8589 -5162 278 13086 24882
4570 24882 19513 9044 -5539 -8773 -9176 -4088 -8926 -12709 -6150 9103 22279 9249 -9446
4557 -9446 -5213 3732 11174 23621 31822 32507 31084 39315 24685 17005 25696 19351 25848 -2829
4543 -2829 -20473 -19555 -23732 -10498 10692 34903 47135 31228 15426 -6049 -9334 6755 17841
4530 17841 10458 -1460 6974 14671 7050 15906 21929 13960 33721 51581 38647 20903 26228
4517 26228 35032 39166 22537 7074 4763 16051 24314 2585 -6530 4654 15228 9209 26968
4504 26968 38342 10767 2262 18251 25440 5004 -26266 -38660 -10657 626 4779 19338
4492 19338 13310 -2124 -2948 -9795 -30616 -14892 21 3980 -283 -1678 -499 4686 -3419 1765
4478 1765 -7628 -3932 5236 -484 3797 10146 5171 19879 18920 29017 39845 36133 27300 28103 27749
4463 27749 27627 30764 32336 34036 21176 7850 12331 9366 20479 32913 27661 6345 5303 5658
4449 5658 -11965 -6211 11218 15830 18935 29958 32793 24507 16488 28167 14894 11905 -4238
4436 -4238 11975 18226 28952 16716 6341 5977 23576 35235 33993 16667 9597 4306 16663
4423 16663 23078 4043 -13902 -15584 -12024 -3328 -2415 -21506 -13861 4617 10071 590 -1261 20076
4409 20076 15265 791 7535 14108 14837 21605 33397 39157 27139 1242 -8790 -4046 5708 13777
4395 13777 -73 -14002 -9923 -4209 -3682 -10175 2661 15680 27875 24247 1670 -7695 -6036
4382 -6036 -1623 501 593 1849 8733 15471 20965 33617 31875 12628 -4550 9755 13981 -8387
4368 -8387 -36520 -42801 -30093 1075 12471 12581 26410 49595 47295 43795 27003 38173 25028
4355 25028 2470 -4617 26069 38045 23330 5756 -988 -6812 -3015 -1025 607 -7618 -10837
4342 -10837 -13229 -15368 -19321 -14013 13585 7252 15626 8545 1855 -3256 -12910 2146 18190 12138
4328 12138 19270 14755 736 1860 2707 -6068 -16234 -10175 -24419 -24793 -4643 -7354 -19532 -7238
4314 -7238 14618 25740 25595 26981 22975 12411 3385 8255 -2102 -7099 30203 35323 40258 30640
4300 30640 16542 32332 23795 15567 13627 16408 18673 6264 6920 4701 19719 14826 -12957 -13764
4286 -13764 -22991 -7372 14433 11486 5935 15747 9868 8123 15569 22688 16849 12287 10474 12637
4272 12637 5090 -1598 4573 21317 29667 13542 1804 12256 20957 21217 3094 -8019 4959
4259 4959 18236 18606 12564 22337 20627 6767 -956 1950 24358 32170 30830 51609 42478 35133
4245 35133 35814 38136 37278 19281 7739 18555 38665 37082 17775 2534 4644 -11496 -13754
4232 -13754 -16022 -20385 -15746 10763 19745 -8278 -1455 11413 6109 -9840 -11899 -31553 -40973
4219 -40973 -39627 -21967 -11391 7304 6508 -10512 -5164 9788 9490 8068 9821 -7738 -3006 23958
4205 23958 22334 11525 -441 217 12997 9665 2905 10454 -3069 -4547 -8588 -9061 -10431 17717
4191 17717 23600 9847 -8136 -13034 2563 30778 32688 15418 -5501 -20938 -9707 -2168 -3312
4178 -3312 -9086 -11968 -16877 -15093 -1682 12544 15486 18877 19773 15588 5461 -7757 2847 5143
4164 5143 -9580 -9900 -4580 5119 12676 27844 10184 -10906 -406 4836 -2448 -8726 -23236 -18420
4150 -18420 -13311 -6636 2853 15944 27865 30082 33553 26202 20183 24230 12939 22233 18052 20188
4136 20188 22412 14344 6395 19353 10135 630 5685 9442 11358 17838 3639 4567 12735 26420
4122 26420 36581 21092 17205 18600 34050 39734 53426 49687 40291 32761 22263 9597 12315
4109 12315 8724 -9166 -3674 22064 22593 13025 23147 22643 10629 3867 -7290 16455 23665 13246
4095 13246 19833 25884 15747 11574 27570 17651 -4235 -24129 -50505 -64867 -38799 -16706 -281
4082 -281 -16623 -40745 -33701 -22852 -11039 -7797 -2486 1569 7073 5580 -8238 961 -1667 -7580
4068 -7580 -18940 -28012 -20825 -11474 -26258 -45563 -23440 -7194 -426 -971 20377 18633 -2007
4055 -2007 -3188 -1086 12979 5234 -9482 -1482 2852 6788 13588 3345 -964 -5861 -15429 -31383
4041 -31383 -27448 -22722 -7419 308 -18416 -22291 -8599 -14708 -1580 -13037 -10626 -10523 -16842 -14707
4027 -14707 3429 7910 -13122 -23276 -14094 -20958 -30835 -20903 6880 1913 20809 35190 41813
4014 41813 38042 27480 23044 26658 8197 9761 13825 13020 5027 -4514 1746 21635 13082 10237
4000 10237 22223 15208 16404 13087 10961 2680 -11758 -6153 -18990 -23049 -19916 -8414 -8226 -5528
3986 -5528 -8030 10912 18563 14572 19778 6606 -1828 17246 19551 2279 -6960 3805 12855 16773
3972 16773 10090 1352 11792 18600 13784 8017 30 -5986 -7707 11836 29014 32868 8958 166
3958 166 2957 -6448 -26626 -4166 34367 34012 32353 38708 24878 16885 22897 33193 46584 35797
3944 35797 19107 26347 32725 29592 41308 34282 34875 35994 38006 42857 53673 26901 14670 28858
3930 28858 14897 -469 -5218 -5045 -4927 1724 12620 14559 19212 21756 15970 26356 35296 26933
3916 26933 10627 -2203 9310 14474 26256 15320 -15900 -12496 -5144 -10638 -4351 -5034 -3547
3903 -3547 349 8318 -3217 -16127 -14397 -10151 -23028 -26032 -25809 -29757 -17037 -13575 -12251 -3185
3889 -3185 -7404 -12587 7022 24205 7693 -5367 -1511 22797 19842 29178 1301 -4704 -3712 -13045
3875 -13045 -14682 9041 15576 17466 13885 8451 -6386 -28765 -8547 8871 -10778 -11786 6235
3862 6235 20691 20689 8287 5246 31339 28474 23609 12252 6422 19049 22395 29119 18389 470
3848 470 11427 16691 9620 2954 3074 6081 14347 16540 19333 9726 -7633 -10018 -18294 -3322 5787
3833 5787 -1681 5915 4065 4290 5861 4344 51 -1442 -316 11451 -5668 -14327 -14598 -16040 -11337
3818 -11337 -1162 13186 734 8262 7600 10445 -1360 -6519 20556 10678 -4502 350 18054
3805 18054 24299 16492 2318 -20614 -27009 -34319 -24235 -7942 -37443 -53155 -30953 -15850 -4004
3792 -4004 -2749 -13757 -20963 -12239 1802 -10953 -20524 -4213 1628 -4947 -5172 2682 12530 25654
3778 25654 45076 42375 42215 41079 25589 7603 2996 3867 -11051 -11466 -7746 -14575 -19511 -2854
3764 -2854 4053 -1486 -9442 -10455 -1711 11912 10851 8938 -6914 -19411 -20910 9144 10215 -2409
3750 -2409 -2306 9702 23952 24056 12721 2728 3975 23657 28699 22389 27446 35498 47102 41834
3736 41834 19282 11429 24698 17838 3876 2370 -3607 9445 34565 35774 17633 3554 1206
3723 1206 7054 11043 7741 13147 20806 13635 8855 -1892 -9658 -4760 -14566 2952 -20058 -37876
3709 -37876 -16245 -10786 14820 16133 7810 -2670 -14324 -27210 -9167 -816 3329 9617 20566
3696 20566 35005 30321 40261 46309 44936 36439 39340 49454 41557 17028 25355 35089 40351 32232
3682 32232 24782 1201 10705 18156 23597 32752 20916 -19854 -14929 26223 22688 9889 -9908
3669 -9908 -8421 -9655 -8525 3267 395 11229 12216 -9761 -28811 -19787 1481 10160 9954 3482
3655 3482 11305 21331 26713 19290 18909 8353 -15631 -2322 6811 16799 28951 41791 51592 28418
3641 28418 -1861 -17431 -34487 -25314 -6810 12821 20513 35067 17792 13960 15501 37078 45191
3628 45191 43369 32822 25299 12910 15557 10202 23380 36679 27743 24090 28557 26102 -525
3615 -525 -8395 -4481 -3320 8597 30111 51898 32155 15432 -2501 -8618 10534 20407 5835
3602 5835 -1253 -9052 -10298 -11591 -8689 -10230 2059 291 -4636 12676 17191 21098 17304 24236
3588 24236 26822 19078 21309 27560 28884 34667 35369 47182 41286 3968 -16325 -1378 -5787 -117
3574 -117 -20707 -31993 3327 21466 7219 2910 18902 14550 21024 15686 15565 21642 14660 30603
3560 30603 42947 31665 22005 26173 22016 29705 6408 -5496 -3245 7616 1415 -15771 -12919
3547 -12919 4779 -4412 -16260 -8874 2904 11057 5063 7316 9477 -10438 -21484 -13293 6453
3534 6453 29738 27928 11250 -4358 3504 17341 1805 -9121 -14405 -15363 -17904 -13873 9962
3521 9962 23333 30641 24554 17456 6106 14147 38143 37907 20386 20838 25445 26708 10879 3815
3507 3815 -4173 -5261 10296 22456 28329 6739 -2013 9420 -747 -277 -793 -1290 7449 1905
3493 1905 -236 3113 18849 16055 -2944 -7226 8655 -4443 -14864 -6185 -5269 -4027 1052 11852
3479 11852 -2341 26979 45306 39918 27950 13578 10748 25184 33454 33752 17612 21969 29706
3466 29706 30503 43072 38232 6768 9634 5312 20612 7987 8915 10297 -3806 -1617 3463 -20000
3452 -20000 -18338 1029 22383 28233 21477 10646 4126 -3759 4453 15147 18934 12575 -14421
3439 -14421 -14509 8022 23952 26282 16992 11067 13650 -2660 -2213 14403 5530 19918 24997 15587
3425 15587 13222 9189 8676 1077 11573 -8206 -9500 3246 13489 1414 -8969 6661 18619
3412 18619 12208 16949 3904 -12503 -10270 -5501 3916 7602 12179 13684 5500 -12420 -8987 5521
3398 5521 -260 -22464 -33341 -48213 -47437 -44241 -19555 677 1986 1841 20354 28407 43169 48781
3384 48781 33428 22703 10018 26559 44879 41875 23623 24343 23129 18007 8950 -5006 -13803
3371 -13803 -28919 -32763 -22998 -23623 -17667 -14275 -4901 8838 10752 7671 -3376 -3900 -2442 3109
3357 3109 20117 14419 12373 19422 24641 14777 2679 -19359 -12700 13731 22134 3213 13596
3344 13596 18163 20073 21654 23299 19834 28923 19523 19060 22130 23774 13935 -12179 -22194 -2522
3330 -2522 9874 4448 -10223 1960 19188 25692 12645 13975 18259 7714 9154 29131 36016
3317 36016 1633 -3401 -1251 -3127 -2980 -3302 592 7866 17465 7130 -258 9647 31179 33265
3303 33265 22054 -2031 -800 11000 16585 22844 21684 -3952 -16353 -6047 -9197 -3563 11838
3290 11838 21163 8753 7665 11995 14052 444 -10437 -11106 -8243 -17230 -16913 -22046 -13589 -3110
3276 -3110 3894 14775 8676 2091 4181 15090 24649 3754 -5812 15031 22637 21927 -5277 -5472
3262 -5472 4234 4346 3864 -317 -6568 -7328 -10759 -15400 -6542 3296 -413 -16021 -27581 -16838 -6473
3247 -6473 -8129 -1163 3268 1654 1335 -13908 -8289 5443 7429 944 -8832 -6272 565 -9355 -21435
3232 -21435 -11391 -5252 -4148 18649 27959 7427 2819 22759 22713 30835 15996 -15658 -13425 -11287
3218 -11287 -3526 -19910 -32576 -13161 -6382 -14138 -21801 -6100 3483 24173 23834 13930 11108 1886
3204 1886 -2602 -4636 3983 8166 5394 11240 27441 18059 24339 31092 17856 10073 24215 26881
3190 26881 19524 -3483 1623 2910 1107 15346 22357 22114 31624 22100 14851 7257 2076 -14354
3176 -14354 -3109 419 8110 8597 -6190 -14820 -17321 -2202 -16888 -22967 -9398 2103 17115
3163 17115 29847 24672 23395 24295 26008 15977 4298 12368 20473 22246 7975 -3909 6461
3150 6461 20623 14536 27294 28547 25511 41536 39630 25139 10828 6539 2520 1190 21478
3137 21478 26572 8579 13741 19770 8513 5037 11302 15549 4264 18818 10219 -15816 -8828
3124 -8828 3572 2697 1273 13844 27571 29683 30555 23252 32453 37911 19966 12520 412 -15118
3110 -15118 6842 10372 3743 14614 28422 37816 17536 10667 14254 29689 20813 7961 26878
3097 26878 27873 4839 7505 24329 23896 14644 23697 25926 20914 29145 10247 27820 25346 40569
3083 40569 53180 46597 35345 10346 8169 19054 24805 20601 12618 8695 7316 18233 23774
3070 23774 -3224 -17159 -17569 -14245 2559 30150 29096 3845 6729 14777 14874 5303 11074 24747
3056 24747 15001 3340 -3830 -1938 7019 12672 4975 -4298 -20017 -32227 -27378 10484 13822 17589
3042 17589 23196 29929 35155 3578 -852 17837 20758 238 -4865 32854 61362 49328 25130
3029 25130 25448 31120 54714 57100 21125 4819 1782 64 -3968 12234 17580 22635 8187 3280
3015 3280 -17599 -27109 -21655 -3039 17590 35006 42936 30742 4258 2011 -3210 -13565 -16790
3002 -16790 -16959 -8888 -4123 -18813 -15007 -5500 9893 19115 24397 1411 3613 604 -9054 6032
2988 6032 11798 13109 30937 42595 37893 28138 9465 -1167 7603 24617 27230 12909 5777
2975 5777 6388 12999 21594 16097 28184 35812 45437 45162 46142 56449 43478 34750 37164 21804 -6272
2960 -6272 -7499 -6240 4669 8796 -3862 -247 -2588 3613 8813 -2448 -10971 -20057 -6735 13703
2946 13703 2688 3192 3613 3701 8560 2092 12133 12312 16523 13289 -8404 6324 12436 -7652 -621
2931 -621 -19242 -7454 13377 17139 5785 7521 10782 -2743 -12292 -14143 -9824 -26446 -30059 -17460
2917 -17460 18368 30446 23394 13551 -564 -16793 -14490 -9864 -13271 -8000 -5905 -18459 661
2904 661 27125 20859 8755 1877 -5056 -11967 -5420 -7962 -25266 -20654 -5233 5861 12369 8951
2890 8951 -12219 -15200 2602 2138 7613 22170 50225 45833 39993 34413 4904 -1851 8963 707
2876 707 -8687 -23992 -27020 -19804 -23206 -35949 -15541 8017 16166 10852 -1453 -7340 12716 29621
2862 29621 23525 6944 6209 4906 14363 13646 6010 -859 7902 1262 -7642 -9793 -17931 -7652 -2290
2847 -2290 -12485 4382 21780 42457 37933 18877 19120 33149 17659 1661 11934 19598 32689
2834 32689 42772 31703 21421 19906 19605 13773 5171 -19329 -26757 -3618 -5199 -16005 -9573
2821 -9573 4426 7735 13030 16321 13729 13128 35983 23722 15538 13211 16565 15890 15021 15407 6575
2806 6575 -11513 -6676 3152 882 5209 17346 26430 26547 28118 13618 -5525 12434 13881 25775
2792 25775 39358 55580 47690 32083 23545 13987 49304 46214 21911 34880 43055 31632 8096
2779 8096 12092 7908 6586 15758 9585 75 -3604 11222 7701 -6074 15208 39706 31792 21063
2765 21063 17144 5154 1864 19580 11454 10992 45937 58665 32039 13380 12082 24296 31254
2752 31254 43327 68110 69595 52000 51895 51837 33807 21607 19444 4023 2358 11317 37123 44370
2738 44370 38667 40520 23385 20238 12691 17726 22335 15171 27932 25573 42006 51388 29055 26673
2724 26673 16027 20105 32716 7035 -26906 -37329 -31948 -35746 -32116 5708 21118 0 -30373
2711 -30373 -40250 -12078 6176 18415 13852 24487 18869 26227 31056 12697 -2741 4141 10226
2698 10226 -1039 -4361 -19275 -18205 -21903 -25815 -16463 -750 16082 20223 -2306 -8501 5213
2685 5213 1925 -12045 -12099 905 13389 -6510 -32253 -36633 -20780 2438 23578 24708 9809
2672 9809 -9863 -11264 -5160 3121 -4189 599 12485 23764 30449 17044 7985 5261 69 6520
2658 6520 7481 6066 -5475 3417 27337 25599 18078 21036 22037 22649 20299 8958 -8284 -12534
2644 -12534 -12881 -7022 -616 19320 34147 27608 18358 12538 13202 14451 24468 29867 30074 26216 34673
2629 34673 29871 24603 21085 -7255 -12958 -4798 -8707 -5194 1113 -2330 -1892 -12890 -30216 -21181
2615 -21181 -511 -2204 -9172 -10099 -7843 -15380 -16021 -17767 -22467 -34032 -36155 -20942 -8289 -2177
2601 -2177 9120 20238 17403 25290 13642 1821 -18055 -15223 -14678 -19714 -18794 -10229 -5480 9334
2587 9334 16372 25454 36035 28399 13029 12244 16781 32588 31760 36796 34433 26889 13766 4924
2573 4924 9218 -1127 1247 1349 -6441 -8074 7890 22276 14376 13235 -4088 -8024 -4466 11677
2559 11677 14313 -8464 -19429 -4166 -8285 -22635 -9938 391 -15455 -13230 -1870 -10616 -10719
2546 -10719 -6221 8960 8150 -12687 -11943 -8606 7251 15512 11408 5256 7846 -18314 -25017 -9942
2532 -9942 4740 -12849 -14971 -3869 -14009 7898 22271 22155 11566 -11448 7775 23726 16569
2519 16569 16027 18755 13506 18642 1320 -11004 -12763 -375 519 2721 -8331 8793 9608 12993
2505 12993 16886 9780 17376 25128 7387 -8960 -12474 -3215 26402 19120 37 -21013 -3193
2492 -3193 13937 15300 9371 1954 -10284 4501 27286 25622 21441 8726 -790 -8724 -15239 -10936
2478 -10936 9110 34950 34733 36127 47989 40845 36647 28618 18446 18645 26789 43656 36752 14284
2464 14284 -1108 -3050 9789 19832 4077 6675 13258 21654 36660 47616 48138 22800 -2064
2451 -2064 -24307 -33457 -26568 -22521 -12226 -18647 -32008 -10262 11911 -949 -1385 9125 -1472
2438 -1472 -9930 -7996 -6537 -9449 16229 29025 14865 21232 23846 14384 -2619 4848 -4386 -7675
2424 -7675 7753 4276 -19825 -31348 -25998 -29154 -38660 -28644 -11046 4601 12914 9576 2653
2411 2653 19625 19872 19653 15688 7889 -4272 -6155 -8536 1067 17929 25369 22067 -3842 -21565
2397 -21565 -31882 -24782 -15325 -12310 -22311 -22495 -3667 -6181 -5827 -10056 5083 10129 11589 12752
2383 12752 18932 -5286 -37351 -31502 -14100 -2216 8502 -783 -1834 -1801 -4613 9983 18179 11022
2369 11022 20737 21003 3860 -17089 -19252 -20562 -28842 -53877 -29755 -23667 -18738 -7462 3992
2356 3992 -13728 -14368 -10401 -12272 -13774 -8997 -13363 7248 3488 -17200 -7807 -2716 915 463 -163
2341 -163 4109 8318 25592 15813 -1025 4517 4571 8902 23616 29330 18233 11106 -3038 3329
2327 3329 17467 18305 9643 -931 -9545 -13977 -8159 -16042 -20814 -839 346 199 13578 16867
2313 16867 11345 22267 12797 -2155 10145 15982 26448 16095 7789 18397 2927 -6067 8985
2300 8985 3588 -3761 -1052 -3307 438 -16932 -536 18208 20611 20692 3522 -9136 3230 -4669
2286 -4669 -24233 -14914 -8250 -9466 -13190 -10205 10645 22771 30240 37191 33332 26741 19661 19109
2272 19109 21158 19095 11929 2192 -4362 -2999 22077 35972 36649 30514 15942 28873 41251 38480
2258 38480 21092 17034 13787 -2875 -12490 -8355 -14272 -21220 -27356 -14316 3419 7686 11948 12641
2244 12641 10454 12743 -99 3078 7310 -2368 2884 9609 5455 -6496 4873 18875 19709 16935
2230 16935 25557 12517 -10937 -24858 -31830 -7638 -4843 -13770 -17037 -9966 -12547 -19769 -23993 -17528
2216 -17528 -7635 -11152 -14957 -14966 -6755 1361 4018 1321 -8461 1242 11147 16023 13504 7664 14394
2201 14394 23875 12842 8186 8752 12788 23164 27199 15390 6248 -2116 -13509 -19142 -20365 -19424
2187 -19424 -21858 -26279 -3083 -3633 -156 12708 20305 22287 4248 -4291 -7035 682 -1429 5239
2173 5239 -6514 -11495 -20563 -14143 -15951 -4170 7608 752 38 2725 5346 2080 12397 5568
2159 5568 -9442 -12893 -26706 -45574 -41866 -25063 7409 14671 939 8232 5879 -1064 7031
2146 7031 9027 20001 38034 40337 38240 26807 8684 -5434 1527 -2947 -28059 -25404 -35324
2133 -35324 -27911 -20871 -13125 -4950 -15648 -26042 -15477 578 14853 16326 6644 5551 16657
2120 16657 20112 9338 -3823 -4241 -3169 -18310 -19705 -16113 -8744 -16052 -13869 -5202 -10922 -15346
2106 -15346 -9664 -6630 4225 17196 30171 3320 -19826 -15827 8858 6312 -368 -13636 -17369
2093 -17369 -33050 -39888 -24710 -4872 9212 19853 5114 3345 17505 12339 16669 28694 31845
2080 31845 18267 19073 29661 19111 -12291 -32528 -43919 -27343 -14631 4219 14265 9148
2068 9148 -7270 -14537 -3765 20298 31884 31597 35357 11729 -594 -4496 4317 23702 24848
2055 24848 2605 -6164 804 23840 28242 25361 20377 12614 3228 429 -12536 -9278 1487 2484
2041 2484 15582 21857 18476 27419 39263 44078 48787 55502 46777 39398 27022 35949 18678 -4872
2027 -4872 13015 26472 25691 31847 10184 1033 12996 44984 40463 41740 47290 35150 34612 32760
2013 32760 24668 14388 5684 6492 613 -7021 -20957 -25070 -23154 -12385 -2841 6212 11571 7927
1999 7927 15141 1429 -6982 7750 -1104 -27379 -42760 -43101 -38934 -21620 -8691 8302 21682
1986 21682 672 2288 9219 11721 13862 12776 4717 9592 -560 -5513 13446 7404 11840 32477
1972 32477 19718 10862 8804 512 -1130 -19882 -12958 -30444 -42153 -35058 -27957 -28301 -5037 9500
1958 9500 6838 777 2905 18048 16929 16316 19923 17074 -6933 -7058 954 -9525 -26629 -17222
1944 -17222 -17020 -1298 10510 -6753 -9249 -4948 -5859 12226 22901 18295 14184 17251 9447 8569
1930 8569 13918 7594 13876 -4497 -7896 -536 3437 5283 12687 11193 16036 10423 1889 -4028 -18079
1915 -18079 -10835 2093 3591 -5293 -4283 21502 29403 42311 43377 35809 28864 39407 33943 21731
1901 21731 31167 11464 -23537 -38215 -46241 -35345 -3390 -979 3229 18889 21812 27719 8369
1888 8369 -2253 6775 3860 19208 30887 32169 24197 33472 24798 13028 18005 9028 -2592 -13702
1874 -13702 -18516 -33637 -53310 -34986 -3666 15749 17474 7907 -11369 -21226 -16025 -13851 -26781
1861 -26781 -32291 -44304 -31061 -16092 -9758 -3910 -6366 8039 1402 -1881 2237 -8143 -17480
1848 -17480 -7598 -9870 -24413 -44907 -47317 -37101 -14735 3074 1280 692 2121 -11608 -2882
1835 -2882 4263 -27323 -36619 -14676 -17250 -35275 -24326 -5271 6100 4052 -4711 -4634 -3218 -14466
1821 -14466 -16306 -5185 3607 -5429 -7379 -19138 -16643 18991 35266 30865 31500 30752 14892 17897
1807 17897 35385 26619 14466 -2527 -3873 17355 27205 19678 22140 26245 36553 21924 13175
1794 13175 2782 4738 -5380 -23047 -18107 2486 5715 10115 8953 12904 21350 33809 45964
1781 45964 31433 20747 -68 -25441 -36028 -16018 -11956 -21514 -29519 -22731 -4940 7600 20899
1768 20899 25698 35543 22862 25978 12432 -18078 -20658 5426 2344 -6617 -11628 -13435 -2252
1755 -2252 1362 7390 7685 7674 -1542 1015 10011 9878 9242 5433 -4832 11917 14031 8288 15626 25644
1739 25644 29591 42438 30643 32002 30270 37819 22534 -2733 -16177 -12558 -23226 -14570 -3758
1726 -3758 -9449 -8251 -6630 -17234 -23603 -2518 5294 -18404 -9293 -925 6103 -6081 -20895 -12272
1712 -12272 -11534 -12042 -31415 -31870 -27478 -22597 -35464 -41514 -35014 -18167 -12125 -10002 -8688 -12610 -7022
1697 -7022 1049 -392 -16723 -24706 -15460 -5680 -6983 -16951 -25061 -19503 -14537 -31000 -23042 -17231
1683 -17231 -17520 -23540 -15674 4390 4844 -16010 -12567 -10003 -10722 -3007 -399 5225 17766 21433 6931
1668 6931 16672 19751 16864 12649 -3717 -287 11290 9983 582 6329 10454 9366 9651 -2228
1654 -2228 -4852 -7365 -12832 4203 -6120 -6786 -207 -10595 -7919 11432 16857 20646 22146 21627
1640 21627 20976 12860 100 -4629 -2078 -6722 710 1797 10252 12239 37809 35641 9804 24774
1626 24774 33615 28761 19265 12681 5093 11380 17605 11444 25403 32362 17457 5892 12077 11499
1612 11499 8818 12638 6821 2075 14301 19414 13183 15974 13618 8259 -1260 -16699 -26587 -31839
1598 -31839 -31892 -28225 -1849 5339 7500 22544 27459 19173 28856 23629 9554 -26595 -34176 -10916
1584 -10916 -17937 -19501 -10039 938 15500 5288 6060 -741 -8863 -4682 12943 15504 14573 22898
1570 22898 18964 11158 -3389 -20487 -16911 -14382 -15557 -30405 -29480 -15276 -16978 -7253 18235 36249
1556 36249 33691 5878 -10135 9899 18356 10560 -2884 -25157 -29901 -21874 -11477 -4276 -3162
1543 -3162 -17283 -10414 7162 9851 13513 31728 22270 3095 -28257 -34875 -12973 7480 24437
1530 24437 14628 8952 20641 15125 -2464 12283 13397 -10985 -13499 -1280 13135 10809 -2003
1517 -2003 989 5573 14188 11406 10149 -140 5358 8629 17655 28787 39307 29921 18584 21789
1503 21789 5090 -20772 -18476 2603 4908 -3447 -12146 -7658 15893 14087 5649 -16100 -27471
1490 -27471 -25150 8912 8519 20114 8444 4286 10966 -1526 -12727 -5356 9005 34487 48004
1477 48004 33914 20154 11745 9985 319 -16691 -5685 -12824 7668 20853 25232 13581 -5414
1464 -5414 -4497 4897 24094 31731 17619 16860 15598 12564 13900 17646 7537 9939 6832 -8715
1450 -8715 -20774 -27975 -16388 -19155 -20419 -17225 -12173 -25503 -26247 -13591 -2097 21285 5971
1437 5971 -2929 13739 25673 23496 6458 -111 2082 -14361 -5714 -1550 -8502 -10095 -18162 -4878
1423 -4878 8000 18966 14949 -5951 -9877 -10338 -5035 7228 -6441 -2425 -12884 -18818 -11805 -12059
1409 -12059 736 7120 -10539 -13289 4247 1897 -940 794 -18677 -20714 -19354 -24509 -18292 -11745
1395 -11745 -12709 -1600 6641 2544 -2987 -17650 -23690 -24029 -34755 -32628 -19616 -9022 -21842 -15009
1381 -15009 -5587 -18 -17412 -29996 -32227 -18802 -2957 1970 -11962 -20154 -1459 16041 6665
1368 6665 -4219 -18361 -34819 -37381 -7509 1794 -3998 -16834 -26747 -24997 -19032 -7767 -21694
1355 -21694 -21523 -4555 2901 3421 3962 1861 -2642 -14748 -16741 -7951 -2614 10756 19545 12200 -4048
1340 -4048 -23022 -19733 -23909 -20278 -18845 -9539 -28623 -34511 -28581 -31943 -19686 -24622 -10156 -111
1326 -111 7056 -626 -1834 7322 1839 -153 -2239 17204 12780 10408 5195 -3729 -11932 -13007 -35052
1311 -35052 -34530 -2468 21650 7009 2114 -1148 2660 -1614 -4024 -7801 -11317 -1918 7738 669
1297 669 -20853 -35779 -29577 -10414 -6594 -13981 -23593 -36526 -47377 -46257 -41060 -37641 -27389 -24057
1283 -24057 -5714 -19338 -16110 -22659 -9733 -18585 -35591 -46729 -58962 -53134 -44182 -36529 -33659
1270 -33659 -23397 -15161 -971 -13213 -17919 -11385 -14500 -24361 -41814 -43647 -14183 7942 11732
1257 11732 4160 8377 12069 15072 1183 -19189 -15377 -4472 -9605 12655 25723 14082 20151
1244 20151 11385 9548 11321 -8530 -22802 -21412 -8695 3280 -4854 4353 -4013 -1130 26635
1231 26635 25536 28128 26670 -537 -4057 -83 3117 1489 -2821 1177 -989 5700 1587 -12786
1217 -12786 -14071 -9662 -12772 -31900 -32756 -21436 -9358 -7727 -13063 798 14234 -4097 -27886
1204 -27886 -14496 -2983 -10569 -8066 -17824 -29895 -41402 -31265 -11306 -22592 -8620 6969
1192 6969 3629 -3608 -753 -2394 -2569 -1629 8811 21688 14977 -2583 -6789 -1650 -12373 -23809
1178 -23809 -24364 -17959 -19271 -18243 -36716 -43062 -16198 -3495 -4837 6633 14033 20613 16990 -5149
1164 -5149 -19666 -20744 -36797 -43386 -15585 10783 17136 -4102 -7669 -4790 -448 4360 -6688
1151 -6688 -9972 -4095 -2979 -12647 -23095 -10681 -10014 -28363 -44732 -56018 -52476 -24812 -23565 -19801
1137 -19801 -20532 -31574 -13618 -6242 -23277 -32780 -21225 -33068 -36734 -9148 13725 10047 -6318
1124 -6318 -15556 -24135 -16606 -1419 -1485 3893 -4612 -34551 -33353 -9665 -1267 -5765 -2131 10532
1110 10532 10039 10280 6749 20928 17461 -10306 -17939 -19735 -21786 -27546 -27155 -33582 -20232 -7125
1096 -7125 -5303 -7217 -3500 -6023 244 10788 2196 1207 -19058 -22975 -23389 -33765 -17095 -8053
1082 -8053 -10980 2750 -3841 -8593 -23814 -25846 -17835 -14450 -1557 -7965 -31951 -22799 -9405 -9636
1068 -9636 814 4609 -5854 -15235 -14842 -23096 -31062 -38330 -31713 -40268 -43093 -36628 -26475 -14557
1054 -14557 4201 -11962 -17628 -23047 -28014 -18306 -26675 -27870 -13648 -11933 -23448 -29404 -27734 -42762
1040 -42762 -55227 -62953 -52663 -43615 -31244 -20129 -11210 -9802 -8233 -14938 -11168 2828 -6017
1027 -6017 -11478 -10951 -24387 -8549 8450 1607 1905 -908 -7171 -15172 -30336 -26809 -14821 -15791
1013 -15791 -12803 -34245 -38977 -35517 -26537 -34113 -43310 -29856 -33228 -27493 -20653 -14580 384 20416
999 20416 30025 12564 -17438 -24400 -18681 -6841 2445 -1080 -4743 -26761 -22593 -24950 -33253 -33725
985 -33725 -30357 -6943 -940 -16753 -31080 -20713 -7510 8080 -17049 -17363 -5828 -262 -4878
972 -4878 8152 17419 -9904 -32987 -35485 -38717 -51950 -43171 -19360 -7864 10386 28407 21753
959 21753 16472 12480 7549 5758 -7162 -28400 -22380 -45628 -48452 -40194 -42776 -54642 -53130 -34910
945 -34910 -1036 18552 -2368 -20535 -30339 -40662 -46354 -39035 -28673 -22066 -23899 -21620 -25628
932 -25628 -322 2917 -29350 -24293 -2822 6852 10587 -7898 -21192 -26467 -3350 3519 12547
919 12547 6148 -6156 -22521 -24215 -12868 -9829 -14547 -33272 -22938 -7453 -14276 -19663 -15570
906 -15570 -8062 -11755 -22216 -31003 -42650 -50065 -38546 -13683 -18523 -32826 -21317 -28113 -28792 -21829
892 -21829 -27610 -32774 -36031 -17674 -19013 -26102 -44019 -45939 -47422 -36477 -29010 -17079 -20660 -34901
878 -34901 -32288 -15244 -9512 -6422 230 -8616 -14409 -20616 -29232 -31098 -46557 -54528 -40691 -24911
864 -24911 -31020 -46118 -36748 -32506 -33590 -17897 -5366 11277 6711 -18794 -33833 -41983 -46701
851 -46701 -46534 -32216 -8289 2152 2575 -8593 8 9476 6160 6750 17780 25812 653 -10008
837 -10008 -272 18029 13975 13193 13980 9650 -5379 -8085 11924 10061 -5330 -7324 3967 14049
823 14049 4108 -3712 -8477 -35 3693 -6626 -17974 -13895 -3908 -17543 -33757 -44067 -31691
810 -31691 -30656 -41566 -54333 -59048 -26572 -3099 10662 -3654 -7386 -13958 -13129 -5051 28 8899
796 8899 18429 8831 -14058 -10813 -6275 5258 -3905 -16096 -19313 -22198 -38954 -22513 -10917 -10595
782 -10595 3938 -3913 2718 16321 22298 10642 -517 -14943 -43945 -46123 -47299 -31450 -8395
769 -8395 19011 11604 6390 11222 11953 14352 23583 15349 14873 20051 22919 12723 4270 -1832 -13860
754 -13860 -27321 -27479 -9306 -4985 242 -6612 4757 21397 11545 -4211 -5176 3797 20850 20546
740 20546 5857 9255 14563 6819 -11445 -15277 -27168 -25040 -3765 14794 -8819 -17381 -6481
727 -6481 -1357 -4137 -276 -33488 -47843 -37119 -42421 -32322 -28043 -19828 -10640 -13377 -12562 -6848
713 -6848 -4966 -10710 -5490 -13678 -31924 -27160 -12531 -15107 -38336 -28006 -27356 -46592 -71783 -80890
699 -80890 -49099 -27465 -31421 -26656 -26130 -38385 -46110 -42524 -48819 -34986 -30988 -32047 -34940 -27760
685 -27760 -12452 -22386 -45231 -42121 -26798 -20145 -10112 8899 8767 -6534 -3151 -15878 -36553
672 -36553 -40739 -41775 -40359 -31331 -16622 -12430 -23259 -3183 1294 -8309 -18515 -25192 -12571 1966
658 1966 -3818 -14232 -4490 -1951 -1753 9612 5203 -16569 -36824 -41847 -37022 -28141 261 7880
644 7880 3631 -1649 -4685 -12559 -16844 -20597 -18293 -18140 -1301 7511 6748 9454 10537 10215 -4940
629 -4940 -18785 -14870 -4828 -11284 -7032 10618 5540 -16114 -35938 -30544 -14425 -24387 -13438
616 -13438 -8505 -12907 1839 11196 13253 3021 2003 3721 17350 17807 5815 -8307 -21936 -22461
602 -22461 -22504 -23455 -39135 -31478 -14758 -911 -21 -20259 -36661 -10381 11580 -2829 -2377 -5177
588 -5177 -23730 -2944 2668 -2005 -13497 -18938 -14029 -23293 -686 7211 4073 3053 -14933 -12028
574 -12028 -15949 -23281 -42593 -35787 -15144 -7015 -10827 -8070 1652 -9877 -9406 -29584 -41364 -57527
560 -57527 -57987 -56060 -58075 -32729 -13679 -16806 -12786 -6913 -26443 -29757 -29026 -34966 -45435 -45746 -41456
545 -41456 -29188 -9812 2019 4479 -7138 -18918 -33869 -15215 -7325 -19896 -19567 -9329 1063
532 1063 17045 24911 17786 8615 3656 -559 -5719 -27721 -50785 -57422 -40708 -27379 -13486 -18322
518 -18322 -13176 -20584 2127 14545 7935 1911 7417 6678 -2803 -7761 -16344 -17935 -29118 -22410
504 -22410 -22720 -24975 -42094 -27430 -9339 -19080 -26758 -31153 -37084 -25714 -21444 -14146 -17323 -26545
490 -26545 -45036 -60551 -61695 -38634 -30578 -45420 -42799 -18638 -8525 3132 -3925 -22603 -34218
477 -34218 -42500 -60897 -52085 -27141 -15005 -17422 -9760 2773 13038 -650 -10353 -11855 -4435
464 -4435 12606 21213 10917 -8475 -18591 -1683 -5479 -5808 -843 -9347 -26354 -34007 -45915 -59950
450 -59950 -45867 -22385 -6574 6978 -1425 -12000 -32078 -37805 -25626 -25936 -21869 -31543 -43146
437 -43146 -42096 -43942 -37792 -22362 -15076 -41144 -54155 -40556 -39015 -8557 12898 4161 -16053
424 -16053 -27836 -40667 -49674 -43296 -54657 -42769 -14574 2600 6038 12918 -6238 -20744 -9659
411 -9659 -4556 -1908 -8755 -21683 -19313 -32776 -46332 -43359 -23892 -17686 -13691 -3027 -18439 -22965
397 -22965 -27783 -26771 -23772 -25734 -30257 -20538 -22650 -14980 -33863 -39056 -38322 -35714 -38490 -55541 -46678
382 -46678 -38527 -33884 -14058 -21133 -51546 -65640 -49133 -40802 -39892 -55917 -48800 -24882 -14546
369 -14546 -15702 -26560 -27650 -31943 -32271 -28174 -33927 -38830 -50658 -46717 -32534 -23634 -27534 -23223
355 -23223 -30972 -22857 -27339 -31929 -37721 -33041 -30317 -23443 -29929 -30269 -18399 -477 -9316 -11138 -841
340 -841 9820 -9756 -22777 -15695 -22279 -17865 -640 2861 1746 -9792 -23619 -32481 -30384 -24106
326 -24106 -5129 -6889 -27611 -34600 -14594 -3360 -6885 -22415 -30658 -36608 -29196 -12894 4890
313 4890 18398 21156 23671 19571 14587 -13792 -25970 -21378 -23421 -16976 -22322 -20524 -26330 -21173
299 -21173 -7184 -128 -8273 955 -11649 -30176 -44900 -35614 -26440 -15271 -12431 -22510 -21059
286 -21059 -24777 -9622 12038 -7776 -18943 -25476 -31091 -38211 -11932 -11906 -29686 -28534 -17478 -2296
272 -2296 -13154 -25551 -46702 -40877 -29355 -23342 -36455 -43110 -37310 -35568 -37621 -33437 -28327 -29876
258 -29876 -18207 -10227 -22512 -36642 -38825 -37944 -34158 -9504 -12293 -20754 -38194 -28737 -17476 -27543
244 -27543 -37613 -54451 -58683 -44425 -35804 -31881 -39279 -31431 -20590 -4000 -3163 7787 -5582
231 -5582 -15961 -14138 -15495 -13178 -1871 5336 -13082 -23392 -24190 -22516 -17962 -33429 -41030 -48666
217 -48666 -46768 -53199 -47600 -30664 -19789 -22530 -21423 -27368 -22821 -16623 -29880 -35045 -36732 -39623
203 -39623 -29561 -25785 -30218 -27220 -27880 -36180 -32497 -15874 -11862 -23433 -39282 -48589 -34665 -35562
189 -35562 -28346 -26023 -37507 -30170 -19384 -11720 -18460 -25212 -41624 -41260 -38390 -40795 -39943 -41965 -38375
174 -38375 -31782 -30556 -19515 -22854 -30700 -37524 -37364 -32011 -23160 -15395 -18299 -12199 -15611 -18618 -33767
159 -33767 -34383 -12969 -14872 -13126 -10203 -11423 -23880 -34156 -39344 -49081 -41082 -41349 -43882 -37738 -18743
144 -18743 -15522 -8968 -16690 -8888 -14753 -20064 -19328 -19269 -31100 -48868 -64481 -73110 -52512 -47427 -45781
129 -45781 -51481 -46244 -46022 -54557 -42100 -30843 -17563 -2376 -2586 -8991 -17316 -23855 -19111 -24778
115 -24778 -42801 -51261 -44741 -45446 -41289 -40767 -42509 -38435 -21542 -18723 -39523 -40170 -27550 -24854 -37279
100 -37279 -30787 -23253 -23663 -26926 -34635 -41517 -45342 -36890 -46356 -50852 -53709 -56519 -60596 -43528 -32848
85 -32848 -50022 -34375 -17568 -12503 -10514 -7796 6192 427 -12127 -21437 -39519 -42446 -32568 -24398
71 -24398 -19635 -17072 -28069 -56128 -68152 -47136 -21965 -14201 -11385 -13705 -18247 -29422 -40153
$$ [...]
##END NTUPLES=NMR SPECTRUM
##END=
