##TITLE=Analysis number 326328
Compound Code tl 00209
Project Code adrs
Chemist Name 3b med
##JCAMPDX= 6.0         $$ Bruker NMR JCAMP-DX V2.0
##DATA TYPE= NMR SPECTRUM
##DATA CLASS= NTUPLES
##ORIGIN= Bruker BioSpin GmbH
##OWNER= nmr
$$ XWIN-NMR		Version 3.5
$$ Fri Feb  2 08:40:05 2007 GMT Standard Time (UT+0h)  MAYBRIDGE\nmr@NMR_250MHZ
##.OBSERVE FREQUENCY= 250.131544655141
##.OBSERVE NUCLEUS= ^1H
##.ACQUISITION MODE= SIMULTANEOUS (DQD)
##.ACQUISITION SCHEME= undefined
##.AVERAGES= 16
##.DIGITISER RES= 18
##SPECTROMETER/DATA SYSTEM= dpx250
##.PULSE SEQUENCE= zg30
##.SOLVENT NAME= CDCl3
##.SHIFT REFERENCE= (INTERNAL, CDCl3, 0, 16.522)
##AUDIT TRAIL= $$ (NUMBER, WHEN, WHO, WHERE, WHAT)
$$ ##TITLE= Audit trail, XWIN-NMR		Version 3.5
$$ ##JCAMPDX= 5.01
$$ ##ORIGIN= Bruker BioSpin GmbH
$$ ##OWNER= nmr
$$ C:\u/data/dgb/nmr/ADRS/150/pdata/1/auditp.txt
$$ ##AUDIT TRAIL=  $$ (NUMBER, WHEN, WHO, WHERE, WHAT)
(   1,<2007-02-02 08:39:24.66 +000>,<MAYBRIDGE\nmr>,<NMR_250MHZ>,
      <created by zg, POWCHK disabled, PULCHK disabled
       configuration hash MD5:
       49 4B E0 1D 92 C2 6B 37 9F E6 65 BC 52 41 86 1D
       data hash MD5: 64K
       41 D6 C1 A2 68 89 86 BA 16 A4 85 73 E5 5C F3 C3>)
(   2,<2007-02-02 08:39:43.80 +000>,<MAYBRIDGE\nmr>,<NMR_250MHZ>,
      <Start of raw data processing
       ef LB = 0.3 FT_mod = 6 PKNL = 1 SI = 32K 
       data hash MD5: 32K
       45 DD F9 EA 7B E5 E3 7E 6D 37 91 C8 90 19 D4 29>)
(   3,<2007-02-02 08:39:48.60 +000>,<MAYBRIDGE\nmr>,<NMR_250MHZ>,
      <apk 
       data hash MD5: 32K
       41 9D 01 D7 A1 A2 BC 1F B9 C3 95 95 67 59 7E 51>)
(   4,<2007-02-02 08:39:50.08 +000>,<MAYBRIDGE\nmr>,<NMR_250MHZ>,
      <abs ABSG = 5 
       data hash MD5: 32K
       74 46 1C D6 05 37 4C 5E D6 D5 80 FE C9 9D FF 13>)
$$ ##END=
$$ 
$$ hash MD5
$$ 92 8D EA 2F 8F D9 E3 C0 B4 94 B9 04 AA 86 B3 79
##$RELAX= 
##$RELAX= 
##$RELAX= 
##$RELAX= 
##$RELAX= 
##$RELAX= 
##$RELAX= 
$$ Bruker specific parameters
$$ --------------------------
##$DU= <C:\u>
##$EXPNO= 150
##$NAME= <ADRS>
##$PROCNO= 1
##$TYPE= <nmr>
##$USER= <dgb>
##$AMP= (0..31)
100 100 100 100 100 100 100 100 100 100 100 100 100 100 100 100 100 100 
100 100 100 100 100 100 100 100 100 100 100 100 100 100 
##$AQSEQ= 0
##$AQ_mod= 3
##$AUNM= <au_zg>
##$AUTOPOS= <31 >
##$BF1= 250.13
##$BF2= 250.13
##$BF3= 250.13
##$BF4= 250.13
##$BF5= 500.13
##$BF6= 500.13
##$BF7= 500.13
##$BF8= 500.13
##$BYTORDA= 1
##$CFDGTYP= 0
##$CFRGTYP= 5
##$CHEMSTR= <none>
##$CNST= (0..31)
1 1 145 1 1 1 1 1 1 1 1 1 1 1 1 1 1 1 1 1 1 1 1 1 1 1 1 1 1 1 1 1 
##$CPDPRG= <>
##$CPDPRG1= <>
##$CPDPRG2= <>
##$CPDPRG3= <>
##$CPDPRG4= <mlev>
##$CPDPRG5= <mlev>
##$CPDPRG6= <mlev>
##$CPDPRG7= <mlev>
##$CPDPRG8= <mlev>
##$CPDPRGB= <>
##$CPDPRGT= <>
##$D= (0..31)
0 1 0 0 0 0 0 0 0 0.06 0 0 0 0 0 0 0.0002 0 0 0 0 0 0 0 0 0 0 0 0 0 0 
0 
##$DATE= 1170405563
##$DBL= (0..7)
120 120 120 120 120 120 120 120 
##$DBP= (0..7)
150 150 150 150 150 150 150 150 
##$DBP07= 0
##$DBPNAM0= <>
##$DBPNAM1= <>
##$DBPNAM2= <>
##$DBPNAM3= <>
$$ [...]
##$SUBNAM7= <"">
##$SUBNAM8= <"">
##$SUBNAM9= <"">
##$SW= 20.6930455092707
##$SWIBOX= (0..15)
0 0 3 0 0 0 0 0 0 0 0 0 0 0 0 0 
##$SW_h= 5175.983436853
##$TD= 65536
##$TD0= 1
##$TE= 294.16
##$TE2= 300
##$TE3= 300
##$TEG= 300
##$TL= (0..7)
0 120 120 120 120 120 120 120 
##$TP= (0..7)
150 150 150 150 150 150 150 150 
##$TP07= 0
##$TPNAME0= <>
##$TPNAME1= <>
##$TPNAME2= <>
##$TPNAME3= <>
##$TPNAME4= <>
##$TPNAME5= <>
##$TPNAME6= <>
##$TPNAME7= <>
##$TPOAL= (0..7)
0.5 0.5 0.5 0.5 0.5 0.5 0.5 0.5 
##$TPOFFS= (0..7)
0 0 0 0 0 0 0 0 
##$TUNHIN= 0
##$TUNHOUT= 0
##$TUNXOUT= 0
##$USERA1= <user>
##$USERA2= <user>
##$USERA3= <user>
##$USERA4= <user>
##$USERA5= <user>
##$V9= 5
##$VALIST= <valist>
##$VCLIST= <CCCCCCCCCCCCCCC>
##$VD= 0
##$VDLIST= <DDDDDDDDDDDDDDD>
##$VPLIST= <PPPPPPPPPPPPPPP>
##$VTLIST= <TTTTTTTTTTTTTTT>
##$WBST= 1024
##$WBSW= 4
##$XGAIN= (0..3)
0 0 0 0 
##$XL= 0
##$YL= 0
##$YMAX_a= 249198
##$YMIN_a= -266938
##$ZGOPTNS= <>
##$ZL1= 120
##$ZL2= 120
##$ZL3= 120
##$ZL4= 120
##$ABSF1= 16.522
##$ABSF2= -4.171173
##$ABSG= 5
##$ABSL= 3
##$ALPHA= 0
##$AQORDER= 0
##$ASSFAC= 0
##$ASSFACI= 0
##$ASSFACX= 0
##$ASSWID= 0
##$AUNMP= <proc_1d>
##$AZFE= 0.1
##$AZFW= 0.1
##$BCFW= 0
##$BC_mod= 0
##$BYTORDP= 0
##$COROFFS= 0
##$CY= 12.5
##$DATMOD= 1
##$DC= 0
##$DFILT= <>
##$DTYPP= 0
##$F1P= 14.0000005364418
##$F2P= -0.99999901652339
##$FCOR= 0.5
##$FTSIZE= 32768
##$FT_mod= 6
##$GAMMA= 0
##$GB= 0
##$INTBC= 1
##$INTSCL= 1
##$ISEN= 128
##$LB= 0.3
##$LEV0= 0
##$LPBIN= 0
##$MAXI= 10000
##$MC2= 0
##$MEAN= 0
##$ME_mod= 0
##$MI= 0
##$NCOEF= 0
##$NC_proc= -3
##$NLEV= 6
##$NOISF1= 0
##$NOISF2= 0
##$NSP= 0
##$NTH_PI= 0
##$NZP= 0
##$OFFSET= 16.522
##$PC= 1
##$PHC0= 232.4447
##$PHC1= 7.020113
##$PH_mod= 1
##$PKNL= yes
##$PPARMOD= 0
##$PSCAL= 4
##$PSIGN= 0
##$REVERSE= no
##$SF= 250.13
##$SI= 32768
##$SIGF1= 0
##$SIGF2= 0
##$SINO= 400
##$SIOLD= 32768
##$SREGLST= <1H.CDCl3>
##$SSB= 0
##$STSI= 32768
##$STSR= 0
##$SW_p= 5175.98343685301
##$SYMM= 0
##$S_DEV= 0
##$TDeff= 65536
##$TDoff= 0
##$TI= <Analysis number 999999
Compound Code 99
Book Reference 9
Project Code 9>
##$TILT= no
##$TM1= 0
##$TM2= 0
##$TOPLEV= 0
##$USERP1= <user>
##$USERP2= <user>
##$USERP3= <user>
##$USERP4= <user>
##$USERP5= <user>
##$WDW= 1
##$XDIM= 32768
##$YMAX_p= 495651440
##$YMIN_p= -163154
$$ End of Bruker specific parameters
$$ ---------------------------------
##NTUPLES= NMR SPECTRUM
##VAR_NAME=  FREQUENCY,     SPECTRUM/REAL,   SPECTRUM/IMAG
##SYMBOL=    X,             R,               I
##VAR_TYPE=  INDEPENDENT,   DEPENDENT,       DEPENDENT
##VAR_FORM=  AFFN,          ASDF,            ASDF
##VAR_DIM=   32768,         32768,           32768
##UNITS=     HZ,            ARBITRARY UNITS, ARBITRARY UNITS
##FACTOR=    0.157963299565203, 1,           1
##FIRST=     4132.6476996994, 0,             0
##LAST=      -1043.33573715361, 0,           0
##MIN=       -1043.33573715361, -163154,     0
##MAX=       4132.6476996994, 495651440,     0
$$ Real data points
##PAGE= N=1
##DATA TABLE= (X++(R..R)), XYDATA
$$ [...]
21119 -86303 -109504 -116948 -68091 -36292 -35899 -35621 -52962 -100859 -66499 -63985 -38450 -14116 -10310
21106 -10310 -7423 -12828 -33442 -56323 -47019 -59305 -47355 40187 132732 102337 73354 63852
21094 63852 77899 68972 82166 74145 46718 66640 63353 29249 18030 -11636 -69990 -68738
21082 -68738 -41633 -32304 -101533 -84257 -35880 25574 65106 84633 90393 65117 46410 10063
21070 10063 -21457 -24540 -33851 -67154 -81606 -80314 -44410 -32370 -35035 -20356 -62118 -44324
21058 -44324 -9334 -29640 -32745 -32697 -36423 -29400 -9644 20234 28306 24588 25145 -3811 -31881 -33750
21044 -33750 -44718 -6367 -897 -19154 -19942 -45424 -48658 -57557 -44402 -17895 -10951 18952 14255
21031 14255 3601 6261 11054 1733 20785 29887 9625 -53854 -110541 -110712 -66699 -47802 4827
21018 4827 35929 51249 29668 28931 7290 30891 8642 -42553 -112299 -78165 -44690 -24928
21006 -24928 -2872 -7433 -2169 6760 27325 72016 30091 6627 -17764 -31459 -46235 -62857
20994 -62857 -38810 -23663 -36742 -48713 -9387 12441 -24421 -42347 -6857 -2814 10478 40424
20982 40424 41342 40693 44379 30399 37637 50906 21939 4035 -19485 -41586 -57814 -77387 -78427
20969 -78427 -61249 -19738 7742 -9165 -35651 -61432 -43657 -44376 -14129 6194 18274 35802
20957 35802 41179 60068 30145 5101 32703 27289 17801 22928 27281 12175 -14978 15555 64777
20944 64777 83086 49935 38340 62238 44828 14689 -6626 13499 54563 37664 38412 21722
20932 21722 14098 53054 73570 63244 48844 49963 23817 -6144 -12072 -30546 -36547 -3923
20920 -3923 38654 42260 10214 -20816 -45609 -49614 -38934 -43641 -37477 2043 33001 37997 49011
20907 49011 53129 27938 -89300 -89549 -54922 -13256 -20856 26715 66337 75207 94096 31959
20895 31959 -2646 -2657 -3302 -47533 -57054 5653 65017 48840 -12925 -13802 23501 12823 -12263
20882 -12263 1855 1947 -28547 -70892 -72075 -21349 -10785 -41392 -16652 18485 48348 9779
20870 9779 -25668 -50172 -81801 -48894 14762 11823 18546 32512 27653 -6570 -44439 -28218
20858 -28218 -6609 -5106 29221 49746 43004 31125 -14205 -53098 -55220 -32616 19201 34634
20846 34634 11551 -5511 -1778 -29229 -43441 -49475 -45224 -75332 -26422 -3253 -56165 -90841
20834 -90841 -26796 -1998 -20691 -6308 -13640 -40662 -35227 -22187 -24273 -33878 -48729 -31892
20822 -31892 -6730 -23809 -11794 -8983 -20240 -31211 -32985 -24118 -12693 -26859 -12371 29611
20810 29611 42490 61316 16989 -18112 -28148 -29261 11688 34710 16738 -58754 -61713 -12822
20798 -12822 24999 71109 70807 26465 -16821 -53836 -50942 -18732 21428 19732 31833 40370 -9570
20785 -9570 -69384 -43365 -19970 -12811 -4245 -646 6564 4330 -3405 3586 -22051 -32114 -4750
20772 -4750 35048 44154 37375 27949 -4964 10664 27359 -9090 -11406 -8542 -7744 -58926 -78275
20759 -78275 -93184 -124943 -103861 -76274 -65422 -81727 -97878 -104254 -82175 -84870 -48283 -30403
20747 -30403 -13289 10374 -26809 -5671 -10372 -51007 -37679 -64907 -59093 -10932 -15117 -53430
20735 -53430 -37311 -33460 -38982 -61537 -33934 -16553 -37375 -63022 -19279 490 -25441 -57758
20723 -57758 -28113 -37409 -59681 -51072 -24991 -16011 -15742 1110 -38182 -27741 13556 26003 4603
20710 4603 -8900 -51976 -45306 -3363 -6664 11535 -14391 -28899 -18427 -27111 -67054 -51456
20698 -51456 9326 2863 15046 41606 38412 -1727 -14627 6878 15121 52307 52686 29454 -22032
20685 -22032 2934 22743 -15019 6850 48485 -5079 -27411 -73920 -117474 -89889 -91519 -91539
20673 -91539 -57363 -45339 -19883 -27640 20223 46294 32298 -8768 -4413 1453 38198 14865
20661 14865 6025 25590 31588 6348 36690 45593 48537 29300 988 -35793 -45306 -51029 -80076
20648 -80076 -76185 -64283 -35560 -35453 30784 43740 37668 35335 31996 59226 58457 -5337 -16453
20635 -16453 -9285 -3569 2590 -2424 -4584 4728 -24220 -10980 6212 41141 175 -31227 -35153
20622 -35153 -48456 -41838 -10096 23626 19932 15730 -22861 -33995 -6326 -2871 20019 42551
20610 42551 29679 29921 27662 3100 1010 29944 46143 60325 64944 45900 4103 2611 6699
20597 6699 16553 -7684 -10984 -378 8054 12539 -42729 -79740 -44677 -35834 -21051 -51955 -102489
20584 -102489 -74387 -58779 -8093 -14515 -49538 -45893 -41670 -64892 -37035 -21144 9517 19257
20572 19257 45028 34031 20874 -27778 -37257 15747 25087 1108 -38252 -57042 -69694 -61009
20560 -61009 -84428 -68299 -12849 -11883 -19662 -9780 -9004 -1757 -28157 -84082 -72399 -91314 -83624
20547 -83624 -51867 -28171 16938 26078 28901 11593 8260 12914 11521 -25937 -63252 -62653 -83279
20534 -83279 -54358 -25125 15862 51699 75210 33584 16047 39737 32884 -4314 -26209 -24510
20522 -24510 -26996 -63177 -78120 -47863 -45558 -39732 -50102 -66613 -76988 -68629 -28330 -22052 -77855
20509 -77855 -83568 -63921 -70595 -60988 -85165 -45437 1758 25880 41320 32229 20481 -10692
20497 -10692 -63716 -90053 -73968 -62415 -34188 4067 16922 -15605 5260 14451 11423 20865
20485 20865 10848 -30381 -63840 -69734 -10361 32199 3682 6090 -17756 -20188 -15492 -51737
20473 -51737 -63615 -87404 -82027 -36883 28415 50888 45555 4346 -25558 -52782 -71946 -48266
20461 -48266 -31532 -22773 -69134 -84227 -74284 -64588 -34589 -23952 -5766 62557 49238 21776
20449 21776 44087 35972 44262 43089 36519 61992 48744 844 -15475 -29923 -27233 6445 -10336
20436 -10336 -12498 -5829 12996 55930 76146 28568 -1817 -40051 -44238 1532 34955 63062
20424 63062 82226 87979 85496 98259 87843 87060 48820 25943 13281 40586 36221 4036 -34621
20411 -34621 -20585 -27852 -34042 -68189 -81354 -79445 -94263 -90836 -32499 -6820 17523 47712
20399 47712 52214 32711 -7656 -9514 -43646 -43307 -6279 57816 53023 45413 -11198 -20640 -3032
20386 -3032 2016 -10027 -15427 -17672 -45650 -4571 21288 1832 -7597 19108 21182 -49388 -48246
20373 -48246 -8447 -5630 16353 10427 -13339 -33784 -59429 -39352 -22666 -51255 -62805 -58137
20361 -58137 -46224 -35209 -52601 22273 40735 15204 10942 31085 47436 76821 29166 -5628
20349 -5628 -26711 -19140 -31534 -56811 -64757 -56545 -50047 -65250 -39541 -15628 -37914 -24454 -24736
20336 -24736 -16788 -1352 2953 26398 27819 -13776 -44862 -23722 -19770 -8247 8830 -5446
20324 -5446 12128 4550 13913 24936 28116 -4362 -62400 -88998 -68744 -29644 39324 29677 -17521
20311 -17521 -14999 14993 19433 32813 73334 75856 47082 23701 12064 5619 8595 17133 79966
20298 79966 81559 74671 58387 3818 16002 25516 22241 14031 -15406 -31392 -33004 25559 24800
20285 24800 2853 17689 -4382 -14253 -619 17643 32476 14604 -16391 -4243 14405 35434
20273 35434 26597 -4259 -19814 -51407 -61383 -31409 -24339 -9933 13103 -3434 -4920 -19868
20261 -19868 -5424 27658 -3119 -49291 -45981 -232 15143 23641 17065 -14754 721 43353
20249 43353 9696 -22824 -13451 -10946 -23106 -19632 10999 61256 89560 45805 60954 55444
20237 55444 128 -34628 -8420 20811 48230 76108 72202 113089 115542 59188 41368 41330 25604
20224 25604 -4774 -3891 35614 11165 -28433 -31812 14730 18325 21672 30781 10416 -5217 -25905
20211 -25905 -14974 -35478 -39045 -43933 -2070 45760 46460 55028 15276 1149 -18086 -19915 13258
20198 13258 25750 38862 27923 16713 -26017 -41575 6896 43988 64891 53840 26286 -14165
20186 -14165 -49955 -42065 -21614 -35509 -53166 -38287 -2688 -31912 -35419 15644 47018 66315
20174 66315 80256 64098 41565 26601 -18067 -64262 -63632 -54940 -19926 13625 10127 22217
20162 22217 66457 73223 40255 6061 -7152 -44960 -44018 10798 17604 20112 -3016 -8216 22290
20149 22290 47705 18665 17541 59204 61479 58129 50986 36964 29296 3357 11219 23670 17314
20136 17314 27064 67596 121421 124653 96483 89601 59927 6222 -13946 15695 38788 45321
20124 45321 15543 -25965 -1228 -19990 -17138 -15981 -22264 -27488 -29287 -49603 -35660 -33833 -36998
20111 -36998 -51652 -39116 -22862 326 -15173 -24316 -32136 -12611 31153 27440 24932 14486
20099 14486 -20206 -28468 3207 35354 25832 1761 -926 34596 54575 44009 858 -45234
20087 -45234 -53057 -61599 -80853 -13794 -15305 -45142 -38510 -83012 -75854 -5713 7314 8649 -50988
20074 -50988 -48778 -59221 -55314 -16774 -13872 -54139 -22860 -30632 -51557 -41124 -8921 -8613 -41112
20061 -41112 -47390 -36580 -13669 -8853 -10365 14476 37333 13714 5856 60825 34668 -12784
20049 -12784 -32832 -2959 14098 3466 19769 37537 -924 -17059 -8022 -14369 -21005 -19121
20037 -19121 -9562 23478 22833 13079 15858 20466 7675 19401 53640 60147 100463 84743 36020
20024 36020 33774 26538 7525 2549 2306 -1915 -4099 -10613 6739 -1184 -21264 -25690 -41068 -27569
20010 -27569 6047 12113 37941 46768 21713 28543 8143 24723 23266 -19697 -54056 -26025
19998 -26025 -42566 7875 55062 79801 45929 -2922 -5114 -2856 -2568 -5839 9256 64245 40867
19985 40867 -9749 -36900 -27232 -23128 19797 26719 7560 27417 30522 -8835 -36768 -89814
19973 -89814 -75340 -63884 -35148 -32600 -44664 -9284 -47307 -75165 -25569 14403 46439 13027
19961 13027 4981 -12791 -10381 11054 26423 85080 138536 121875 89643 83417 79355 46778
19949 46778 37350 52506 46023 23668 41539 39612 13714 3945 -22949 -39996 -39307 -12252 -21434
19936 -21434 -9450 15539 -357 -39165 -34830 -24939 -52118 -57559 -26531 1968 16486 626
19924 626 15672 7107 -33714 -63065 -42788 -16509 750 44285 34955 -12654 5905 -8394
19912 -8394 -24427 -25818 -16145 -6113 35610 104057 163150 236583 345281 356549 316924 235749
19900 235749 168113 156769 151933 153822 188501 192285 222188 285373 373505 363258 285795 215604
19888 215604 182897 198796 169588 121049 107819 119019 108962 88346 92646 75879 87007 74407
19876 74407 28955 50893 103289 82156 58257 66527 64044 37603 -6 -26400 -19900 9662
19864 9662 32426 33307 83589 90470 110184 129133 109857 67265 47049 55803 119800 127906 143838
19851 143838 187197 233551 294660 330378 305650 251468 264841 306797 287673 266556 247472
19840 247472 215578 183353 197190 228094 253921 266221 195436 126475 121215 105450 74326 48942
19828 48942 21192 -442 -10055 6601 19759 -3933 13061 -8268 24989 76120 88746 94928
19816 94928 103912 92010 52034 23785 48168 45589 -11022 -60725 -21521 -31902 -73401 -75035
19804 -75035 -35232 23304 65081 65232 54112 40538 1175 18817 55843 20053 -17982 985
19792 985 1638 -40421 -19897 -2544 12804 371 19967 19415 53562 67749 42061 49086 78580
19779 78580 103627 123672 133199 99114 72143 67825 25310 -29671 -24794 13354 -27952 -16806
19767 -16806 -154 33049 56048 64086 60153 2921 32204 89040 79968 64332 16645 -9518
19755 -9518 14407 -1812 -33741 -50391 -73886 -80248 -71308 -26245 51423 50253 20218 6578
19743 6578 -7630 -30346 -29595 6581 13086 9814 -17891 14524 20761 6896 -19626 17596 54964
19730 54964 59777 57480 75795 42010 11343 -5729 -11835 15033 38829 1712 -8501 -28121
19718 -28121 -16876 39642 30599 7992 672 -54371 -49479 -8070 26286 63626 75333 89236
19706 89236 67973 41528 29191 15748 35158 60946 7891 -6424 40452 55323 1946 -57832
19694 -57832 -66225 -26370 -5793 -27073 1483 65528 56579 20799 798 -45379 -45270 -13127
19682 -13127 23907 4901 -27821 -33516 -34330 -34862 -57102 -63455 -49461 -16855 7407 14391 -50073
19669 -50073 -62274 -52302 -80765 -58235 -35742 -15295 -28776 6949 32198 48044 24059 16516
19657 16516 57717 103621 83748 46856 26686 56836 69151 45733 33378 23567 16563 45518
19645 45518 57081 80584 90378 64059 -11383 -33171 -2806 34174 60157 110136 163709 171498
19633 171498 140935 114898 80814 78371 73546 93851 100478 103231 74806 89512 87737 67596
19621 67596 91616 96565 116713 117997 87442 62081 22894 -14055 -954 -12047 -35930 -10102
19609 -10102 54613 63067 82810 86751 44913 49195 63779 87514 89249 60035 46442 58658
19597 58658 73565 99565 102441 38852 32884 68868 69017 79684 85222 91626 65051 80461 56142
19584 56142 66016 53302 77594 112135 205509 216669 237251 241142 177862 139638 119212 128635
19572 128635 116424 115128 122994 142864 73291 44888 29010 59358 103337 64294 9697 62112
19560 62112 42038 -12906 -10493 13859 24825 33706 5483 -31087 -4797 12540 40815 60243
19548 60243 126435 141280 119231 108458 115854 139416 126201 98425 62167 51819 61457 74341
19536 74341 97680 96969 171122 197920 157671 120458 96530 82346 88146 89961 63856 57775 56858
19523 56858 88974 137473 129027 171044 213530 269091 265307 239242 215072 180012 228917 209195
19511 209195 168391 165826 202407 170825 161862 192388 179199 183868 201551 201930 216020 219387 208454
19498 208454 247096 267798 313760 307553 265031 248277 233753 273855 319927 373807 434246 487343
19486 487343 542550 513271 467719 458691 437508 439572 426421 374904 389212 438737 451990 424205
19474 424205 360114 320788 326057 314588 265817 245666 270251 301376 304708 351478 384869 412950
19462 412950 478158 488878 436686 415540 398636 415629 399886 298688 282570 335833 397189
19451 397189 437432 508681 525772 517657 493621 492957 519157 569130 694935 833574 907881 884483
19439 884483 785229 666756 615627 583703 635283 720438 797580 967542 1081855 1114949 1047492
19428 1047492 882450 746067 702297 667728 635810 657479 675906 713141 727048 747817 732501
19417 732501 707154 735578 793600 867710 965125 1009309 1082746 1225125 1373903 1456098 1520315
19406 1520315 1534545 1557342 1583719 1573553 1614729 1743721 1891819 2091196 2365772 2715399
19396 2715399 3156004 3781150 4656535 5961241 7900107 10605577 13031087 13428507 12530872
19387 12530872 11835660 12356011 14647750 19479625 28214050 43295986 64694023 78479924
19379 78479924 74489228 64500028 58964426 56206825 48516411 37527808 27964501 22219761
19371 22219761 20267898 21615406 25649721 29509712 28431769 23164255 17128638 12387682
19363 12387682 9237005 7197521 5952048 5197147 4747174 4518603 4388264 4219600 4176525
19354 4176525 4199065 4255728 4355825 4408641 4339113 4283212 4330359 4531338 4832084 5381952
19344 5381952 6225878 7516888 9646735 13051724 18265459 25515000 31814067 32268377
19336 32268377 28085988 23453380 20990362 21569866 25436793 33514874 47068549 62952177
19328 62952177 73176710 80780367 94319071 104798644 94160143 70485017 47935300
19321 47935300 32865614 24471244 20107752 18511241 19162825 20353789 18992139 15381035
19313 15381035 11567983 8645946 6774538 5592493 4787888 4076964 3453581 2976138 2615452
19304 2615452 2369747 2180104 2095431 2047557 2023554 2045548 2029907 1929647 1789982 1582663
19294 1582663 1328179 1107999 1008243 924879 866431 840533 836706 804472 756517 723424 655268
19283 655268 628878 600453 520766 487556 488279 519899 523923 513357 476917 431326 416240 391866
19271 391866 344630 289973 272361 287178 350863 366263 356171 325359 292633 263295 278465
19260 278465 279215 281034 250431 195424 194688 193983 239071 301863 254888 202847 187093 248428 264426
19247 264426 211923 195053 171954 178423 203063 164226 154560 126003 148579 144015 133308 116985
19235 116985 124179 117635 116858 74234 64288 94928 85728 74049 81757 120583 132164 128750 128845 139997
19221 139997 168381 158251 121473 139652 151716 144650 126050 103400 106721 148629 273228 338782
19209 338782 307187 288366 289787 252722 229477 193468 174405 160925 170864 189979 216153 273867
19197 273867 280137 212576 140453 138678 128662 106073 92809 97541 142101 151240 138252 145656
19185 145656 136045 102783 94927 50832 62743 108895 107337 141438 189462 202907 199808 229115
19173 229115 295490 321068 305836 236059 282773 330271 339709 301658 251784 211987 182407 198278
19161 198278 216574 234705 251495 223511 191395 210905 240027 229615 229100 200343 147107 145584
19149 145584 129205 114816 131199 135581 188312 229676 232602 224827 220529 173056 125912 113521
19137 113521 89007 112926 93349 90148 89493 94252 98487 102516 107849 90225 93512 90838 83512
19124 83512 110557 164825 177636 187312 168387 151699 169012 175996 178727 183875 183192 147572 116543
19111 116543 127580 121309 104355 100861 64871 71351 75019 74903 130385 143058 94500 118032 143631
19098 143631 152158 157877 124450 158368 173578 165948 173937 192000 179985 123960 116530 148330
19086 148330 153875 151315 163029 119766 96090 88420 81772 51242 97552 153081 184474 145098
19074 145098 128366 149446 153597 150461 129464 151552 151785 186732 152418 120599 125200 91041
19062 91041 65106 97822 98848 79031 120369 128949 170621 182399 128112 155398 168137 141838
19050 141838 153244 144227 170319 163971 155304 166379 183347 161407 145925 133118 187931 183433
19038 183433 198425 226196 257777 254259 211305 191937 185463 187789 208890 191021 195468 222492
19026 222492 229300 263227 286330 305893 329312 334306 334733 357440 406878 415245 385771 405867
19014 405867 373962 345703 331297 357532 342299 359878 377924 459940 508199 516540 455979 431942
19002 431942 456321 484342 550641 568912 519321 522269 576938 600230 577731 572553 637499 708411
18990 708411 747706 821679 874053 917813 1019356 1189900 1432124 1689712 1884918 2061268
18980 2061268 2207688 2290308 2400990 2593193 2854661 3249970 3725165 4223862 4885694 5814713
18970 5814713 7259195 9556864 13236896 17393590 19038723 18116070 17088871 17732370
18962 17732370 20985502 27761638 39963472 60927911 88746041 103106382 96295940
18955 96295940 84647023 76897148 66989611 52382549 38238599 28163423 22767827
18948 22767827 20990998 22268357 26366093 31481542 32329150 27463509 20709925 15005988
18940 15005988 11149325 8712693 7213247 6204330 5528081 5070965 4688173 4387528 4200300
18931 4200300 4066789 3961536 3964735 4032214 4112038 4241275 4371784 4481036 4616572 4914057
18921 4914057 5465292 6441457 7995316 10416312 14323989 20238831 26722087 28864308
18913 28864308 26066196 22019587 19622025 20243894 24391547 32980218 44934326 53147890
18905 53147890 55888789 60841280 72955329 80119901 69141756 50073115 33192960
18898 33192960 22468085 16603016 13534672 12319875 12616997 13803767 13694016 11548171
18890 11548171 8868267 6712950 5300305 4427224 3853867 3389539 2991815 2652445 2349633
18881 2349633 2136235 2017512 1913128 1782189 1623721 1411539 1215501 1086452 994238 935356
18871 935356 934057 890976 833655 750086 690986 662201 663030 611298 548173 506570 454363 459467
18859 459467 486030 564910 629646 662102 747222 825094 774752 651174 518715 473859 474268
18848 474268 453759 460461 504149 613539 741496 751653 649305 567933 462971 387870 343685
18837 343685 316844 322004 337530 351177 393172 411220 450504 462854 400103 313295 270444 250278
18825 250278 261769 246141 199138 205529 220543 232931 262807 306868 335138 344451 406860 456783
18813 456783 453193 437294 442004 407548 382569 351052 292955 250470 189557 200890 247348 302138
18801 302138 330305 358708 407598 423597 386722 291571 250863 206290 153224 121679 93479
18790 93479 140514 207436 272025 304680 278286 242027 232000 176442 136410 111175 115835 149164
18778 149164 166109 197580 215656 233246 230747 212141 168933 208218 226081 323503 459102
18767 459102 623955 713790 650804 502823 385965 364453 349985 317365 320867 340217 312958
18756 312958 218226 197471 157634 112733 45702 17340 -40066 -26981 49128 60563 51531 30000
18744 30000 -1884 1590 35379 61040 65212 61432 51843 60459 78896 93558 137882 156086 97293
18731 97293 61335 71043 70666 54439 23785 -11208 -25632 25524 64073 83682 83995 74853 30770
18718 30770 -6956 5427 -42244 -22081 32193 62857 82936 52058 11019 26380 31618 5210
18706 5210 -20560 -21212 -43514 -39710 -38930 -33979 -28790 7661 60936 99447 86874 100052 83494
18693 83494 69802 41443 11455 17261 7074 2933 33347 63757 48179 39573 9693 13187
18681 13187 40042 50725 68089 68633 54862 44708 36994 41950 46703 46725 28354 -6996 36269
18668 36269 49228 23265 21197 57624 39321 18139 59421 85963 67107 83566 78014 54433
18656 54433 70237 74734 40428 -3110 -19114 -38629 -67935 -47112 -18902 4666 7861 -3481
18644 -3481 28833 46206 66811 107647 109679 75969 75150 49731 30484 29500 12998 10552 28452
18631 28452 1715 30730 77550 76983 57932 16593 -27097 -41704 -47022 -31644 -3342 -7836
18619 -7836 35547 50828 29093 44550 14858 13644 56490 93945 105725 105201 81191 83312 61022
18606 61022 66834 60146 39259 14126 18307 55711 41208 32992 54620 73154 90126 31180
18594 31180 8720 -22076 -37593 -26789 -31463 -35452 -27172 -15737 43166 48987 16043 24361 35242
18581 35242 17436 25157 68562 55525 4496 56136 58719 73348 71072 68915 40473 -3061
18569 -3061 -7134 -1205 -25898 -47238 -10012 -21860 -57592 -11489 30578 48865 13791 25021
18557 25021 32361 66714 105689 125407 71481 17392 7392 51075 96854 88855 82358 108008
18545 108008 101696 90355 68041 40361 40252 -6795 4462 -14323 -6156 22325 -11231 -32397
18533 -32397 -5940 54433 49416 22628 -11069 -8378 23083 29728 27296 65657 39126 23811
18521 23811 3959 -13978 -50676 -72535 -41634 -21391 -22742 10813 37947 -19690 -40842 -16281
18509 -16281 1208 14140 3810 -4062 18128 33551 16224 33390 35118 26599 31277 40675 49190
18496 49190 55395 68541 55561 29105 16850 26117 2757 -21192 5601 19685 16127 16673 10470
18483 10470 3157 34575 51199 30589 23614 18651 -1302 -7296 -10786 -34963 -55887 -24389 69654
18470 69654 97465 80027 33093 14712 2379 -15396 30425 -2082 -27504 -11536 -33712 -33777
18458 -33777 2844 -17010 -24514 -27029 -30243 21258 54982 53699 23195 28735 22358 17253 27937
18445 27937 57121 43441 49971 44942 68768 53803 41439 49797 64673 88597 93051 106226
18433 106226 122314 215562 295286 297158 230302 185172 177877 231608 276438 335236 295949 321796
18421 321796 439034 533189 551470 486117 431053 389084 331173 220340 115969 79606 55429
18410 55429 49645 96548 70967 87788 105256 138569 140395 104464 45400 35911 31199 16889
18398 16889 15769 4727 23761 56111 50831 16681 -6489 -10471 15189 44958 78618 91987
18386 91987 91229 91409 136800 178422 231802 300705 329122 278241 219361 232569 280185 270578 243890
18373 243890 220330 169618 166009 184241 217160 257903 323719 417612 497668 498476 465660 391311
18361 391311 260239 156335 170482 160719 104989 79326 74673 61247 87944 112234 81366
18350 81366 77577 86638 43742 24491 -10226 -38434 -46405 -56025 -57295 -68130 -66040 -50537 -32541
18337 -32541 10144 -1446 -3975 -9127 -14945 -28508 -16013 -39383 -34830 -23821 -2893 44181
18325 44181 60543 25642 -4102 -24784 -56954 -85549 -85293 -39135 39006 57137 34435 38052
18313 38052 -11565 -14783 46024 84302 2371 -25306 -1740 37394 74194 22181 42019 40942
18301 40942 20374 7586 28247 31240 10644 -8145 -17536 -41524 -48166 -40648 15620 63493
18289 63493 68673 63369 60749 66940 54259 57288 109180 140869 111875 65137 12114 8768 15872
18276 15872 26473 27378 8046 15265 50587 87377 46322 8945 11852 -6869 -8984 -2983 10324
18263 10324 14765 -5752 -18756 -26985 -5743 27886 34409 25138 27597 16178 -30516 -22185 -25133
18250 -25133 -8537 44438 52903 28741 58304 81885 53665 26534 18314 5774 43288 62501
18238 62501 30211 25915 -10435 -66314 -41474 -1079 29224 17024 3015 35398 61640 32695
18226 32695 23329 -3226 -17184 -29846 -23619 -17328 -8123 -31612 -79780 -69595 -42608 -39076 -6095
18213 -6095 -3514 8544 45844 59289 46653 37855 32179 37176 31085 16235 28580 34880 84117
18200 84117 57073 17991 51570 58133 21699 18506 13938 7961 -4915 14332 45241 22428
18188 22428 4503 2884 33261 42486 46982 42063 31848 37423 54186 46827 46442 15077 4593
18175 4593 -16517 13437 39866 101494 143449 163362 174214 169701 177178 132376 120125 156239
18163 156239 185225 164148 156134 181333 209186 185047 164819 174298 173779 184659 200276 209907
18151 209907 208163 236820 264825 265244 280802 271888 271879 273643 305801 312844 341535 324229 328116 326486
18137 326486 387879 472059 464887 463901 482731 536653 594539 672197 770830 852797 893498 992836
18125 992836 1131856 1313686 1543938 1823663 2098327 2454888 2870101 3449625 4258450 5351772
18115 5351772 6887582 9251794 13199121 20075783 32412251 55030965 90210957 109041718
18107 109041718 91072676 61376056 36908122 22721740 15189569 10801397 8069560
18100 8069560 6206932 4925160 3995833 3266844 2740806 2380526 2083606 1807512 1624501
18091 1624501 1480450 1311479 1169310 1040788 933440 844823 748637 665615 630986 555171
18081 555171 449261 408662 442399 473444 445576 399830 333113 306888 309103 299804 285825 256557
18069 256557 264319 287722 278238 242773 212517 190506 173148 166723 130407 122521 147318 155279
18057 155279 103111 83771 132416 127273 101729 78987 87676 67641 58840 59315 43391 64454
18045 64454 62964 69545 88079 64509 60656 53925 12263 31339 41659 53128 43962 39523 24492
18032 24492 18496 31255 22657 58476 60325 25017 13873 24427 60588 72178 49776 15453
18020 15453 13722 45002 43141 32866 62878 75895 36982 -2541 2443 29036 28716 67822 51397
18007 51397 -1910 -32362 -26403 -14968 18506 28284 17618 11442 -27589 -36448 -14766 12291
17995 12291 26827 23117 37208 77594 45595 57538 59526 43463 49120 50017 64193 41087 58809
17982 58809 172544 257164 189609 74367 14701 25572 32648 34369 31227 2700 -33493 -20097
17970 -20097 -1266 33833 62490 42282 36773 60916 46188 -481 -13022 -9290 5473 48814
17958 48814 53844 545 -11938 12097 36356 3572 -58759 -64815 -5864 -7153 655 18882
17946 18882 37102 25899 10599 12134 14185 24334 9517 22657 35020 11393 33090 32363
17934 32363 28903 14695 19350 -5162 32515 78457 74801 64279 79767 88479 83461 106026 86780
17921 86780 54934 3343 15386 47966 61002 56700 57339 50448 53462 17542 28470 40306 10212
17908 10212 -5570 -12609 -53944 -51874 -49506 -11044 -44242 -26497 12876 21896 21635 8826 7450
17895 7450 42084 66488 45735 14526 -20507 -34175 -21087 -4567 34079 45971 42931 35383
17883 35383 50632 75700 77545 36739 42246 59515 18624 6019 59135 71776 52447 1934
17871 1934 6960 12977 -17434 -27696 -39981 -40212 -28873 -5870 20724 25309 -33152 -16118 -20652
17858 -20652 -17206 4562 26394 16655 -25491 -31578 -44052 -7640 47200 47184 -3952 -8801 14315
17845 14315 21508 6335 -36376 -45210 -5977 -13491 -21455 -8597 -6975 -27767 -7909 2505 -12270
17832 -12270 10264 77041 87391 73266 83141 89124 31744 -38304 -34690 22567 -4949 -1849
17820 -1849 2481 -5816 -22279 -29161 -6496 16350 -23451 -71465 -34393 25051 60733 61413 19903
17807 19903 10456 30156 32597 -23500 -2441 27167 3388 8349 35173 48955 21118 -8963
17795 -8963 30965 38978 12658 -23354 -58383 -45050 -53267 -63133 -35424 -5440 5255 -48109
17783 -48109 -74003 -74313 -47675 -61004 -49804 -12210 6284 -25588 -31161 1393 356 -14481
17771 -14481 37315 53457 14372 -41983 -55743 -49900 -75778 -45194 -66906 -88088 -36144 18499
17759 18499 22100 -13023 14149 35296 46250 85485 36070 -21128 -19661 -10576 13134 -5929
17747 -5929 14326 -38223 -58036 -60661 -75666 -24774 41055 44915 9498 925 2892 2648 25275
17734 25275 22743 7012 -4454 -3444 -4892 -6812 -13097 -14737 26998 35972 13305 -7503 28696
17721 28696 1139 -14815 13768 -3077 -34505 -66047 -76225 -45802 -20486 -55 18602 3333
17709 3333 -40848 -45260 -15379 -31794 -39407 -25682 -7445 -34210 -5841 58329 17937 -39153
17697 -39153 -26975 2236 15472 33478 28720 42576 20320 -19941 -25001 -28416 7282 28333
17685 28333 15133 21354 35882 58844 85531 84805 15144 -36957 -59076 -38433 -9147 -2255
17673 -2255 8296 -9322 -29325 -30483 -12528 19367 12728 -19586 -9610 4680 -14851 -22486 -10820
17660 -10820 11979 37975 27964 -4216 23274 40792 84247 72964 52324 52550 38592 42107
17648 42107 38875 11257 -42394 -44046 -11529 -23185 -41044 9356 19500 -15811 -6288 -583
17636 -583 -6615 -58473 -48624 -23761 -41373 -37471 6975 7084 2912 35246 42316 37812 -4579 -59206
17622 -59206 -58427 -89682 -52492 -10468 -32724 -52189 366 -615 726 4974 26197 46016 66914
17609 66914 54408 31537 -14119 -17032 -2661 -23668 -31447 11555 -2189 -57117 -58515 -28364
17597 -28364 -49510 -56517 -50278 -20857 14145 -7036 -41009 -42890 -50911 -59488 -73657 -51841 -8936
17584 -8936 4155 182 -24533 -34163 -44540 -28123 -13691 -13276 5969 -1273 -30264 -46530 -73092
17571 -73092 -38495 -8635 -47348 -14281 23634 -15979 -27323 -2117 -8308 -22423 -30035 -56353
17559 -56353 -35923 -26150 -15402 7944 19946 30637 25062 -21149 -26565 3358 26316 30202
17547 30202 25574 2980 -28858 -10244 -3591 -27010 -25469 -11241 -11848 17358 14251 1236 21373
17534 21373 5131 -19007 -23105 1435 19391 30242 42950 18744 -7781 3449 22403 28495
17522 28495 5357 -20331 -66741 -50305 -39688 -57467 -49252 -50396 -47091 -57020 -21290 20065
17510 20065 31020 34570 16535 7922 9239 14692 12171 31199 -632 -7861 35988 64176 7995
17497 7995 -10014 -3946 3099 -23828 -75620 -99465 -111017 -55204 -32333 -22815 -2644 -6480 -10059
17484 -10059 -34535 -59027 -60632 -33934 -963 -14187 -34673 -36111 -53215 -25365 -12545 -15677
17472 -15677 -36977 -205 19430 1995 -41127 -4654 34844 58917 46966 38242 17053 4024
17460 4024 1113 29051 13178 -5573 27434 80807 111887 34394 -5991 -18681 5624 7679
17448 7679 38340 99776 118891 119034 219813 419087 589511 554371 403919 257945 197018
17437 197018 157679 153358 117237 71173 27060 23063 39007 79819 82343 74508 92638 50223
17425 50223 -31071 -58061 -39229 17828 64749 112061 85442 48122 29262 27961 35893 37511
17413 37511 62461 55981 88417 96124 81497 104690 96457 73677 65452 35219 12028 28626
17401 28626 41854 59512 38593 19482 -2217 14711 42536 34521 41247 29198 -20385 -20840
17389 -20840 29474 66850 28827 5538 6515 -29601 24486 23267 223 20233 28189 44379
17377 44379 40430 38180 4671 -11970 1660 1992 -4196 -40478 -55493 -48808 -52813 -39494 -42468
17364 -42468 6205 12843 -7607 -27856 -18878 -20607 -35662 -7451 41540 45501 33335 5287
17352 5287 30285 27819 -2785 -22211 22309 59852 80326 76119 41833 29956 81229 104707
17340 104707 84246 37523 21228 28310 14110 -19739 -24337 -14369 -18202 -22680 8137 -18710
17328 -18710 -36052 -21999 7141 -13397 -25197 -17983 -13552 -32815 -71777 -63725 -58957 -72979
17316 -72979 -48481 10382 14863 -11678 -48902 -47358 -49655 -69050 -90175 -90158 -109244 -53637 -25889
17303 -25889 -34188 -33201 -31072 -26808 -12378 -13186 -15073 -38605 -37774 -51299 -29269 24424 19152 -17396
17289 -17396 -31428 -27180 2317 64515 42157 26931 48084 65383 20655 -11587 -22668 -39261
17277 -39261 -45520 -46722 -29409 6154 36482 10538 -2453 -36947 -40151 -20310 -19450 -1688 20582
17264 20582 1267 -18261 -12208 -26766 -29497 -32616 -44014 -11036 30515 28704 -13326 -17219 -143
17251 -143 7217 15133 12005 -2288 -2585 2136 -6475 17528 26154 34928 24427 12675 23544 27180
17237 27180 9642 -3247 -4429 15709 45903 50826 37238 26678 36720 22796 14742 62837
17225 62837 32168 -958 12780 -7019 6051 11930 -24785 -42578 -31273 -12529 -20591 -60775
17213 -60775 -30467 -19653 10426 -17055 -39713 -41953 -44094 -22494 -41114 -25462 -19435 -31242
17201 -31242 -9998 3758 21847 -2803 5623 498 -554 6451 -2374 -4888 -15827 -22547 -7431
17188 -7431 15428 -5087 -514 35479 59992 21442 -11063 -70018 -75861 -36427 -4644 48513
17176 48513 24593 -14191 -20575 -258 8553 17962 -7636 5392 18651 -6684 3120 39307
17164 39307 39267 48469 -6591 -22426 -9470 10835 -2950 25528 44603 18414 25944 479 -17664
17151 -17664 -9779 4104 -25499 -47960 -52952 -18817 -13539 -40502 -61656 -87491 -70225 -27862
17139 -27862 -11940 -12280 5124 19625 16886 -22995 9081 38268 62629 53631 29753 -44046
17127 -44046 -78771 -86119 -59753 -18699 -5702 -15187 -28069 -60940 -35199 33184 32556 15372
17115 15372 -3732 -14091 -34873 -6104 9787 -9899 -29337 -15919 -9119 2486 22255 4801
17103 4801 -22014 -63802 -50271 -42953 1009 77018 59483 28910 20507 15589 5655 -53231 -98818
17090 -98818 -85278 -83584 -94852 -61517 -46378 4756 39548 49581 7584 -50037 -34458 22363
17078 22363 68380 36975 50220 37810 21862 1692 -7805 -16030 -24150 20024 19582 34787 9504
17065 9504 -25311 -16552 -32478 -576 26406 16231 16106 81785 79216 35211 27909 42929 8943
17052 8943 -30074 -75457 -99130 -120378 -134178 -115244 -76735 -69763 -60779 -67574 -63194 -68794 -23922
17039 -23922 45678 41578 6424 10673 31157 8728 -40161 -48597 -43203 -83313 -73709 -57275 -41317
17026 -41317 -51744 -59871 -50744 -15891 24228 26934 19535 43132 473 -79393 -138858 -162507
17014 -162507 -105610 -77286 -40901 -28925 -13063 21682 -17411 -30487 -25828 2556 13407 3652
17002 3652 8309 14020 -13010 10091 -5254 -8614 7568 -21506 -54341 -37582 -11178 23819
16990 23819 -9370 -65094 -90205 -91138 -66448 -52348 -45187 -32779 15150 34305 -14115 -45065
16978 -45065 -14830 6368 -24746 -18383 -19937 -15746 28847 50649 56263 34241 51031 78093
16966 78093 72549 48859 -2153 -20194 -7042 -12281 -17916 -12822 -34237 -41915 -10694 18058 4837
16953 4837 2289 1456 -22400 -61987 -62207 -79225 -58054 -26623 -5992 -58877 -85690 -67247 -55858
16940 -55858 -29105 -44820 -44146 -56319 -67812 -37820 -962 -24007 -57445 -61942 -59252 -19628
16928 -19628 29703 26374 -8055 -2552 5040 10733 14631 46034 63793 39061 -4478 -15382 -4814
16915 -4814 4656 17338 29186 37748 52290 63120 111821 101919 74774 55600 92019 82193 59122
16902 59122 20881 -5801 -260 33300 -7622 -48651 -7351 -2735 4613 -45620 -79941 -23942
16890 -23942 -17118 -29003 10487 41289 36018 38422 51614 35775 43778 46656 52391 18489 7693
16877 7693 -27472 -36117 -54389 -71795 -102463 -100050 -21957 25129 -7966 2517 8313 -8496
16865 -8496 -36089 -43469 -73489 -108817 -106853 -45745 10349 -26902 -55922 -52892 -9643 16875
16853 16875 -14869 -16346 -6746 -2128 -7626 -8778 -37385 -22438 -6596 18958 15909 -21047 -21527
16840 -21527 -12696 -30942 -16903 8168 49129 77244 74036 88294 107808 92620 32583 -2479
16828 -2479 -35445 -60080 -61408 -46793 -56379 -75796 -63171 -35879 -54473 -68022 -56735 -7127
16816 -7127 -15305 14443 -17343 -9928 -336 6689 20243 22606 36542 38796 14953 9098 29626
16803 29626 24328 10447 9718 2843 -25839 -44251 -25177 -58368 -68712 -28733 -6517 -8283 -7903
16790 -7903 -31677 10346 2790 -17999 -25409 -14907 -18207 -13986 -17314 -57366 -52286 2253 5777
16777 5777 -14693 -25522 -35424 -74565 -48589 -18526 -20622 -15302 -10366 -50974 -56748 -28957 -47316
16764 -47316 -44149 -20187 -9561 -33412 -18824 23007 51350 28566 4510 817 15874 21057
16752 21057 39609 67307 54408 6084 -27326 17031 34586 28926 38616 3344 -25404 -269
16740 -269 -5551 -14268 -2884 -31269 -35613 24645 38670 23464 16403 -9655 -18828 -6109 18293
16727 18293 13819 -4073 -1828 21392 45514 19651 14369 33350 25713 25220 15866 -21238 -34116
16714 -34116 -54170 -36698 -5515 -41968 -59948 -19140 -23254 -53156 -49721 -9644 3437 -12366
16702 -12366 -28287 -32575 -909 33578 -4865 -18929 -36317 -49994 -63955 -64982 -45393 -32237
16690 -32237 -25707 -15644 -49839 -57202 -95900 -110885 -91501 -103950 -96093 -75591 -53546 -65113
16678 -65113 -46215 -57719 -97008 -106729 -62133 -41342 11529 45333 49253 25625 30140 14838
16666 14838 -50367 -15452 -607 -2775 -20659 -16292 18128 4793 -17843 -22127 -13867 22288
16654 22288 29805 25279 44978 56012 33241 -3183 15730 40249 23816 5255 12824 22925
16642 22925 -5948 -50353 -66769 -49727 -53659 -34979 12001 -10211 -32229 -20028 -15876 -37018
16630 -37018 -21878 -14456 -33439 5606 28027 3867 6037 28118 8861 12065 -2576 -66649
16618 -66649 -47284 23031 9576 -31717 -1303 38317 42921 4981 -15666 -34500 -33307 -52370
16606 -52370 -50822 -22647 2517 17339 47228 52969 35091 42851 35783 30530 -4909 -71214 -81563
16593 -81563 -61619 -29367 -24072 -32189 -67167 -68055 -15301 -4010 -27383 -28542 -4251 -22140 -30422
16580 -30422 3445 15765 12125 2724 -37001 -35153 -2412 25885 37118 15394 -25960 -49635
16568 -49635 -15945 13836 48601 75236 75686 59668 56373 42795 60818 36950 6463 -2673
16556 -2673 3258 10056 -22239 -29894 -23918 -13868 -28515 -23121 -41159 -3120 8702 -25634 -52617
16543 -52617 -83385 -108833 -83372 -36278 -42670 -1198 -20432 -21168 -10572 -38399 -57060 -19068
16531 -19068 10010 11211 10119 1650 -19506 -21797 14146 75396 48882 24277 51061 78322
16519 78322 62226 27530 11757 -20951 -11735 16443 95276 87326 68450 21387 -13081 5757
16507 5757 -46719 -66000 -38606 -21016 -18317 -57672 -75876 -68965 -44468 -3000 -9774 6271
16495 6271 44768 56690 19404 -4738 -23654 -49982 -41108 8977 16426 11472 -20214 -27917 -16205
16482 -16205 8808 26614 50366 33899 25766 25954 -3588 -13978 3276 15094 -5120 -33431
16470 -33431 -24051 -18639 12362 8743 -18405 -24450 -9544 -10623 -959 -30315 -67962 -74817 -73274
16457 -73274 -64372 -22028 -27105 -54275 -47107 -71920 -83440 -77603 -54150 -30856 -24016 -1526 -41616
16444 -41616 -77530 -57786 -48243 -33683 -21187 24650 39380 35223 -26138 -68823 -42509 -53936
16432 -53936 -38448 23277 28896 71505 44451 10791 15622 -19438 -32318 -7525 -37690 -33698
16420 -33698 -40785 -70230 -71745 -71451 -43865 952 20320 -5157 -28646 -37132 -14174 7526 8151
16407 8151 -30551 -52375 -58115 -67638 -39396 -30948 -13769 12775 -34812 -81561 -20849 -17613 -9070
16394 -9070 53046 55853 47841 -7491 -42848 -62882 -9604 19902 -29128 -56954 -59407 -34158
16382 -34158 14148 48085 33320 -21869 -50609 -53011 -69250 -11514 21226 7865 19315 24285
16370 24285 60021 53932 34308 10768 -14009 -19483 10583 39423 34126 -8054 -64763 -74315
16358 -74315 -30721 -31659 -12252 -1006 -10058 -7370 22812 -3281 -11170 5276 10855 47017 77621
16345 77621 62371 56728 44987 51013 35598 -27708 -33153 -20762 -57009 -88789 -101148 -43448
16333 -43448 481 21183 15186 -4927 -41683 -55447 -51075 -3940 24435 -3797 -30689 -48766
16321 -48766 -46888 -57289 -42272 -48623 -92812 -100570 -53071 -31867 -46288 9544 -19566 -43424
16309 -43424 -55036 -102831 -94286 -69919 -17008 -12489 -45453 -27325 5687 -5559 -36386 -58824
16297 -58824 -24013 14020 28359 38566 46349 36742 36864 16427 -10960 -6728 33505 53475 77994
16284 77994 69049 26868 28312 1846 -29762 -28123 -6936 10325 35991 39763 14907 13574 -8100
16271 -8100 -16019 -16146 -19408 -4603 17787 29905 37508 39021 57165 41301 32831 34474 14746
16258 14746 -34503 -21230 19949 -2499 -24586 -6974 30680 36758 -12234 -39879 -70865 -96196
16246 -96196 -122567 -42899 -58110 -67568 -35357 -44728 -27759 18321 -416 -9338 -34978 -51823
16234 -51823 -22454 22582 24575 5722 -8024 -19198 -28958 -59628 -53080 -42152 -31951 -57771
16222 -57771 -35097 -32906 -14691 -64605 -83025 -71659 -108580 -93296 -46478 -12514 15371 54456
16210 54456 72570 73572 76857 53902 -2502 7826 34005 52686 40213 45467 -5074 -71572
16198 -71572 -96553 -30204 6705 12825 3311 -18411 22187 66690 23349 -6833 2329 34671
16186 34671 -25170 -19686 7292 13193 14984 23681 32709 -2146 -34297 -60188 -37781 -2903 -33730
16173 -33730 -20273 -1852 -3945 -14198 -1581 -16338 -11256 -3091 -28171 -74331 -58397 26278
16161 26278 29251 10155 5010 -21632 -56301 -95769 -82980 -91751 -84824 -18943 19974 11149 14895
16148 14895 18603 -5535 -62790 -37733 -53071 -45535 -26899 4046 16962 21061 2440 41804
16136 41804 101483 98223 63842 42932 10382 8901 -8498 -8375 -24470 -14872 -2232 435 13134
16123 13134 141 -42066 -33693 -11360 -4101 -39911 -43371 -2081 30355 2344 -36790 -14183
16111 -14183 9414 17527 22687 16522 11097 11303 13228 40683 49950 21488 -5795 9555 19684
16098 19684 36008 15905 17249 43558 46159 10767 -4672 13679 20782 268 -6414 -2634 11965
16085 11965 13544 -24409 -27890 -21374 -8439 -1075 25144 5834 36194 50915 63989 63898 73991
16072 73991 21023 25991 53269 56245 19546 6971 -13769 -19311 -42272 -26732 16379 26772
16060 26772 4491 -55702 -78336 -71689 -91198 -54156 -16928 -17427 -29559 18104 68065 27886
16048 27886 -30014 -30400 -13904 -1529 20239 57668 39222 33289 6035 -29139 -79843 -80087 -47916
16035 -47916 -8060 11424 18323 -19827 -5484 25064 -22427 -43925 -39588 -27032 -38630 -57890
16023 -57890 -3822 29707 -28072 -100437 -119875 -77529 2755 -12998 -65774 -40279 -21896 -13818
16011 -13818 -47801 1385 21970 55943 41166 76857 77382 50252 8720 -8703 8635 18207
15999 18207 49389 15929 -4056 -10029 -50615 -51280 -69335 -58489 -22184 -52139 -53798 -66060
15987 -66060 -55987 -15092 12247 -4138 792 -10 13450 735 -37251 -64640 -73106 -68362 -69130
15974 -69130 -44372 -36614 -10340 7327 -15512 -13996 19297 17856 24713 10739 -18960 -23880 -8196
15961 -8196 6338 -64429 -78972 -82741 -56566 -52433 -16640 -33458 -31012 36609 38772 -8187 -31990
15948 -31990 7846 21289 18809 15106 -20720 -7987 -6811 -709 334 -21258 -6159 10166 31555
15935 31555 51700 56113 42115 13659 -10651 -11916 -38043 -34190 -39019 -50088 -42526 -89491 -120290
15922 -120290 -92586 -72084 -68198 -48494 -60732 -58090 -43011 -13987 20643 -13754 -15031 36319
15910 36319 59965 82499 56283 21542 20105 37072 34962 19542 8550 4251 3775 20236 10785
15897 10785 -8018 -27488 -37377 -18182 -3327 -35400 -64208 -56178 10187 56782 2092 -9555
15885 -9555 -11233 9672 4219 35090 -3334 -12946 19043 27669 -893 28552 42753 -4067 -23174
15872 -23174 -7734 13596 -13625 -5736 33520 32065 19691 -24755 -87995 -118731 -124520 -107581
15860 -107581 -94480 -67465 -49248 -42948 -23073 -8724 795 49611 69255 52408 45598 35291
15848 35291 66238 26803 -17703 -15327 -6593 -6657 -30905 -52331 -41409 -9826 -1756 25127 26368
15835 26368 -8757 -75546 -71850 -38427 19037 56664 88503 57091 46781 8119 -1611 -16286
15823 -16286 -33007 -28607 11423 87789 120803 79277 45234 37634 59470 49808 39616 20117
15811 20117 -4433 -24184 -30804 -47975 -26933 -12019 -17651 -13557 -22210 13785 27852 17315
15799 17315 19473 24181 13017 44068 60842 23347 -7806 4159 -29431 -46319 -44376 -31752
15787 -31752 -27643 -49838 -18850 19117 32307 37249 31312 -5661 -45455 -36703 -15754 7683
15775 7683 -12925 -6077 35666 23281 177 -1121 -3924 41347 61704 64985 48557 25515 22877
15762 22877 59915 19905 -11397 -17030 -6927 -5787 2001 14277 -29877 -15929 -15316 -23428 -1551
15749 -1551 -8274 -40171 -24950 -12797 -29351 -22900 3557 13986 -20794 -61836 -57092 -68231
15737 -68231 -22829 -18400 -25242 -30455 6436 13573 19690 -18149 -9484 -833 -18807 -8153 3874
15724 3874 -27331 -31389 -75946 -75215 -50176 -16545 12252 24551 26577 16766 -9588 5756 29854
15711 29854 7443 -63987 -81229 -90233 -60471 -65604 -53731 -9349 -27299 -20444 -53573 -66340
15699 -66340 -4733 19163 -28698 -36743 -52248 -53581 -31695 -14285 14206 34040 37421 20077
15687 20077 -49112 -29331 25804 16936 -32016 -36744 -23239 24094 21425 26874 8087 -14534
15675 -14534 32273 13139 -22670 -24002 -26078 -13939 -33940 -42273 -45964 -92924 -98396 -67259 -47271
15662 -47271 -13017 8266 32179 33027 -27123 -58590 -26749 -41079 -23662 53182 80300 58643
15650 58643 40589 28920 40306 65161 6961 -33917 -9138 -15856 -8653 25169 23180 -1875
15638 -1875 -19884 1025 19063 -27893 -74143 -80124 -62533 -32027 12924 -4928 -8483 23130
15626 23130 54489 11813 16678 16009 -3673 22255 25029 8255 -16034 -9508 -2925 -18940 6679
15613 6679 9348 8570 33506 61927 51068 -23457 -53593 -21234 15223 -5344 -13499 -13881 -7192
15600 -7192 30550 48974 39455 29014 49751 20892 -20786 -16683 -29390 -17790 -3902 20173
15588 20173 31920 16436 14078 11425 3572 -28640 -14792 -53753 -34315 -30470 -56300 -36680
15576 -36680 -10094 30742 48969 91552 93922 69715 63851 25932 -10708 -48907 -61548 -65474
15564 -65474 -60382 -29550 -10943 -18779 945 22231 14818 17411 -12665 -26494 -24410 -19616 -23545
15551 -23545 -20914 5467 -36079 -45019 -24612 -26198 7509 12644 14902 32918 -3977 -9486 9536
15538 9536 13408 2701 25068 64940 47331 35145 36701 49084 24090 3796 -7704 33359
15526 33359 16186 -4048 30575 24781 24362 28395 73476 104032 115678 83297 77921 69488 51675
15513 51675 77959 110221 113893 99249 59796 31406 40037 70083 85281 75724 66927 54037
15501 54037 4502 -11603 -28477 -47876 -51113 -76081 -75924 -16157 50075 25528 21053 5617
15489 5617 5659 20039 9336 4319 15242 15608 -26669 -75245 -32199 21236 59010 61160 69377
15476 69377 90903 58620 3207 -12911 -7648 -37451 -67960 -57612 -57776 -71893 -7824 -9343
15464 -9343 -33478 -58414 -79993 -60793 -53646 -56666 -43883 -30122 14928 24804 13155 21365 50094
15451 50094 28980 32882 27083 26287 20750 204 -6828 -12643 -14133 -18107 -22175 -323 -17565 -6084
15437 -6084 3009 -36395 -67041 -58204 -26114 4313 28552 59487 109614 114871 68255 61982 55146
15424 55146 37108 -12475 -46179 18062 52872 50853 55103 13379 -18757 1497 21505 8532
15412 8532 5862 37106 29398 -3051 -21939 -43267 -51100 -58510 -49361 -45735 -52908 -19658 700
15399 700 146 -20310 17326 27724 -10542 -69428 -70149 -15321 13206 22361 12544 -29657 -32555
15386 -32555 19072 48128 35280 17293 17826 49694 30798 42910 61982 38474 17819 8633
15374 8633 -31671 -20255 -26309 -72488 -73819 -62411 -33235 39973 71323 43056 544 5200
15362 5200 13875 -14816 -32239 -9174 -4876 -2436 20970 24858 -196 9258 389 -15919 -5737
15349 -5737 -35778 -38786 -30412 35412 25814 2488 8206 -4785 17221 -14265 -18325 -22956 -19028
15336 -19028 -7695 36905 52012 53616 49096 9989 21008 21157 -2949 -14008 -45353 -39578 -40721
15323 -40721 -50388 -54295 -46859 -3937 -8768 -40076 -18817 -25162 -43000 -42355 -39389 -57711 -33933
15310 -33933 -5615 -4915 5736 15386 27803 23084 7035 36140 2686 22873 7595 -15552
15298 -15552 -22249 -27039 -57250 -60356 -74823 -76232 -63599 -263 -19827 -21768 -2329 -39708 -70059
15285 -70059 -34818 20666 58117 53526 40276 16116 -27763 -7248 50385 41214 22407 47269
15273 47269 54527 34364 24924 34613 21230 8053 -20885 1221 -24844 -59843 -62470 -56312 -36124
15260 -36124 -38671 -24649 -46634 -38124 -16090 40271 36627 6007 -44784 -46674 -60932 -77351
15248 -77351 -58713 -30536 -78327 -59523 -33926 -41145 -65058 -82688 -13423 18958 31437 61064
15236 61064 22052 -6116 -12714 -46913 -20681 -20451 -12397 -1366 813 -4050 7363 -11004 19360
15223 19360 37052 18977 -14608 -57356 -61718 -30019 6683 -11419 -14760 29143 55121 42854
15211 42854 46004 46381 31532 -12809 -7792 16192 39448 85762 115800 90769 79607 62527
15199 62527 53373 51625 42961 80539 103748 78338 33973 -12274 -7102 10379 -33097 24257
15187 24257 81248 72458 41624 39644 22521 51233 25616 39699 67093 51618 31935 12422
15175 12422 -15397 -30066 -10098 3365 -4461 -19482 21172 16215 -10966 -3810 3304 16339
15163 16339 55870 31755 -4752 -36846 -41733 -38223 -39212 -15640 -14688 -17121 -46314 -17695 29601
15150 29601 18576 -8096 40283 52344 13002 41707 84925 108569 112547 70488 86111 84637
15138 84637 71133 73052 58461 34839 -3323 -40405 -16616 -21808 -2013 18845 137 -29078
15126 -29078 -3535 5689 6549 34223 25992 18902 16425 53437 50812 14105 35731 46499 5750
15113 5750 40613 79669 98913 91061 47304 -26222 -49435 -88216 -115862 -63735 -63857 -87795
15101 -87795 -122418 -86273 -39330 -6271 -22269 -48245 -50558 -65809 -49469 -14358 24658 11348
15089 11348 -37765 -35565 -33320 -57988 -50387 -44578 -58536 -58293 -49175 -29199 17257 18833 -17927
15076 -17927 -22356 -36190 -40453 -52633 -40969 -14129 39464 84222 112197 87965 66136 126666
15064 126666 141077 99130 78595 69429 85893 70204 18656 -29321 -42952 -52950 -69577 -29617
15052 -29617 20605 43858 53348 26811 -6064 -51788 -89992 -58319 -60674 -75010 -39117 -14397
15040 -14397 61077 92453 90184 48403 22857 29148 25547 9034 -26668 -12050 -6900 -25916
15028 -25916 -27317 15710 30018 30061 45437 23273 -9316 -26442 -10099 8861 -8579 -29635
15016 -29635 -45447 -32841 14259 17628 -3792 -24338 -44826 -11233 41849 51240 32349 6117
15004 6117 -28020 -22516 -3685 -18550 -13055 10505 -48842 -90254 -80875 -60889 -93278 -115237
14992 -115237 -58847 -3666 -8736 -13725 27552 57189 42881 33731 9779 -16435 -8828 42732
14980 42732 39794 63644 99270 63180 17521 -5950 -26520 -26835 22827 34990 26761 43033
14968 43033 63935 63151 46697 51816 36234 -1246 -38630 -29262 -34222 -19214 -17424 1814 27871
14955 27871 53655 68708 45143 42802 44389 32464 -18163 -52384 -23837 -23736 -16221 28318 36973
14942 36973 30783 51294 41041 33590 1080 -25226 -18556 8493 48654 26452 -6467 -14443
14930 -14443 -14164 -10348 35923 73637 71703 53755 71663 10016 -21773 6329 3158 35417 46405
14917 46405 51798 59555 33506 19929 30519 46526 82520 44570 24531 12901 -23587 -1577
14905 -1577 -21713 -39758 -32060 -44869 -66057 -36813 -13017 11971 -25371 -48907 -47903 -512
14893 -512 70683 35626 -11252 10046 33608 64481 48548 13706 -5957 -13643 9077 10702
14881 10702 -9023 -13729 -32809 -12620 23801 10872 -9311 -18054 -56202 -58099 -65397 -63226 -30801
14868 -30801 -45344 -54737 -46400 -23540 -13753 -11281 -56491 -83753 -60242 -17733 4358 -39976
14856 -39976 -55012 -15506 34379 68755 29362 -45264 -81889 -60326 -35241 4938 -22517 -65593
14844 -65593 -101645 -85794 -104891 -102428 -109608 -91258 -31141 11840 1794 -4741 13081 -19577
14832 -19577 -8540 26711 53726 29189 13141 -3517 48927 87103 92607 90173 46347 -17650
14820 -17650 -23048 4240 43878 60481 29667 334 -34187 -25786 9174 9745 27467 36441 33948
14807 33948 44673 48102 29026 71687 91343 27434 5892 5938 26934 38163 39500 5576 -17126
14794 -17126 -9426 -7149 16035 12586 16621 18721 -31240 -22984 1768 16348 -28155 -43974 -42239
14781 -42239 -27677 -7535 19279 4106 22185 58222 3369 -4475 4169 3856 8788 -29017 -53795
14768 -53795 -54949 -68813 -77114 -45832 -26674 -10044 -9944 -2287 67319 76685 58387 53635 71937
14755 71937 42231 26028 29641 38042 26509 63253 74370 30981 -6801 -2927 -5587 -8184 11036
14742 11036 -25478 -25529 644 -8711 -44950 -72016 -46216 -10577 1744 856 30373 72855 39114
14729 39114 13017 25146 24321 19838 46448 68744 44435 38140 39700 73232 87880 35184 -16594
14716 -16594 25475 59073 78840 88279 58325 -2795 -65503 -50825 -14913 3043 -7903 -1158
14704 -1158 23151 2950 -43022 -57670 -96624 -86716 -37928 -61316 -69494 -26208 -38301 -43186
14692 -43186 -10025 23295 12259 -28060 -29301 -37976 -13507 44018 12548 -13918 -12353 4050
14680 4050 27206 44566 43666 -3851 -114 1536 2555 38773 78985 71136 43381 24499 19351
14667 19351 23481 30620 15591 -17285 -52467 -77223 -18464 -21484 -18456 -52477 -32448 574
14655 574 -4995 18966 27563 44022 43283 55923 58728 60776 22187 36832 34971 -24278 -6128
14642 -6128 45619 56821 15817 -4948 19026 -2000 -43595 -74794 -56723 -28051 -12921 -10719
14630 -10719 -24585 -38180 -39224 -32693 -17528 -14130 6446 21317 16667 880 -18105 -32804
14618 -32804 -60742 -44666 -14963 -34180 -19985 7181 2460 2722 39296 15397 -5372 -15094
14606 -15094 35837 52133 28250 19645 23666 -44049 -51997 -39427 -39209 3757 42937 16939 -34765
14593 -34765 5543 8180 -17308 6024 9949 2835 -17573 -59926 -20491 -10911 32678 23575 -14456
14580 -14456 11681 577 24490 76564 27840 3246 26966 28709 3848 22897 39325 26066
14568 26066 -27677 -81344 -51960 -11194 20810 36126 1877 -46383 -39178 -92 -1391 -25071
14556 -25071 -27959 5538 4794 9346 25057 41829 49523 55629 53318 13048 -34210 -72465 -40763
14543 -40763 -5593 4705 14471 287 -1563 -14231 -8486 7777 -9493 -35430 -29651 -15450
14531 -15450 -25794 -6946 3221 -24193 -39683 -39625 831 44203 55328 91771 62261 15759
14519 15759 -10216 -34789 -45412 -47887 -40441 -10967 35740 38563 15755 7748 -5218 -18672
14507 -18672 15939 27943 28459 -4341 17561 60925 77567 53118 43711 39485 43876 49306 73870
14494 73870 40771 26327 33732 -837 -10320 -46972 -40600 459 -13273 5141 4839 -51004 -87128
14481 -87128 -84910 -56004 -46730 367 17770 14487 -9308 -8681 -37730 -30988 -16660 -7874 23459
14468 23459 71272 86648 66072 55497 24359 -6521 -22083 -5507 -2173 -2774 -32532 -46591
14456 -46591 -38319 -17968 -55149 -15192 27875 23812 50506 48490 71306 67048 73990 52330 60718
14443 60718 26972 11124 10566 32555 77889 81535 63410 34316 30194 18981 -2940 51953
14431 51953 39821 -12732 -25504 18866 46574 16580 18869 19423 -16657 -44962 -92609 -71201
14419 -71201 -45392 -7643 15135 18258 10526 6539 -309 -43684 -130729 -132555 -86940 -77893 -59040
14406 -59040 -50447 -71803 -57231 -58799 -9450 40456 38750 -6421 17029 26846 22960 41882 45760
14393 45760 33189 -2858 -6857 36301 37549 49283 45883 -1746 -23030 3262 57684 122979
14381 122979 129382 74538 76649 74337 25377 10458 12853 12953 9145 51961 28387 -27698 -20698
14368 -20698 8714 48915 55279 33915 48116 52234 36457 12109 16985 -23626 -18389 -29477
14356 -29477 -15128 22073 37930 24698 12891 52805 37139 10467 13874 -3230 -4224 31623
14344 31623 109091 77322 37158 24522 28427 -7 52506 85573 52203 46690 23218 4185
14332 4185 14854 26039 24833 47899 29883 40124 20451 -667 -13621 -7827 17255 38841
14320 38841 44837 64387 67275 32142 -6910 16072 8760 -22541 13298 30049 -4240 -28576
14308 -28576 -31858 -26163 -6432 -9987 -23642 -21190 5247 47896 36262 18163 2517 -6630 -18899
14295 -18899 -24552 18657 4183 -33172 -46516 2827 21950 23797 36482 27851 15231 22548
14283 22548 -29277 -20217 -25285 3389 61534 75029 50504 17657 -17163 -67426 10818 45229
14271 45229 16577 7619 7904 12147 -5293 31792 42050 14803 15679 41067 16181 7307 7102
14258 7102 -6233 -1991 -22640 -51102 -33928 -17094 -18973 -45324 -6838 37113 21910 -10707
14246 -10707 -37993 -59169 -59278 -41843 -58647 -31768 15075 49587 58670 45671 15356 20484
14234 20484 7581 -16028 1611 27402 612 2437 11528 18157 33063 89153 125437 98746
14222 98746 43049 23731 14435 50392 76833 83985 64462 47804 27133 -299 -31870 -33239
14210 -33239 -4148 -26525 -34154 -56723 -61409 -30613 -26294 4236 32661 11663 -26124 1475
14198 1475 -24198 5029 25169 34340 40146 48417 11022 -2049 -44969 -11043 30867 32764 65979
14185 65979 37352 41122 78761 79690 54227 4459 8874 4627 -22476 -35280 -11488 4506 24525
14172 24525 63225 65599 57095 52883 49864 16577 3607 35097 48299 37733 -13668 -61919
14160 -61919 -46283 -6625 7862 14941 42072 63491 40678 -325 -5611 -26651 -65728 -82434
14148 -82434 -55955 -42497 -39045 -22428 -26192 -32607 -51216 -23847 14944 -668 -1880 -17752
14136 -17752 -28787 -58066 -39633 -12189 19370 63217 73552 88046 82111 49162 52430 37712
14124 37712 38085 54992 44605 75653 69873 9515 -3137 7557 25277 75963 46264 23727
14112 23727 16114 4256 14800 25066 -16349 -4145 22286 66642 77075 72304 75497 68564
14100 68564 84648 62548 66110 92552 68444 34514 62266 80544 54897 9183 5205 30748
14088 30748 68273 47202 10291 -15839 -11555 -33351 -59415 -47871 -16179 -7150 -2488 41574
14076 41574 67517 37094 34070 60259 69633 61563 -1654 -6658 12450 20855 27476 -31469 -65900
14063 -65900 -23056 -34077 -3460 23803 49587 52142 16264 -30667 -24270 -2509 14138 8646
14051 8646 25883 36848 37330 72003 78983 12753 -33496 -57348 -64981 -66534 -59763 -27029 -7867
14038 -7867 25862 14312 -41996 -54380 -21234 -1606 15118 48015 44440 20600 8809 -21973
14026 -21973 -16399 1864 -6881 -3146 -35713 -37017 6422 -4104 -7577 -12193 6201 5028 5493
14013 5493 31717 5349 -40161 -66673 -33569 1175 -36619 -23629 -741 -19503 -26059 -10974
14001 -10974 41100 62816 89956 70322 25371 7782 90 -10147 1401 17886 25833 53779
13989 53779 66576 52916 34331 13508 23200 24943 24886 29595 42862 -6674 25429 41979 5485
13976 5485 -52013 -97723 -108677 -88617 -50911 -32786 -15128 -14750 16871 79708 38535 14203
13964 14203 9914 2662 -27336 -41728 -15191 18312 56691 62805 41741 -30551 -41167 -39801
13952 -39801 376 3454 77732 101309 112871 74350 25020 -6851 35823 47311 28931 -3230
13940 -3230 986 29955 25014 34759 43932 71586 79038 49468 34184 38457 8894 10918 19493
13927 19493 21845 43010 45882 36966 -1948 31096 55013 23207 6046 -4420 -28863 -30771
13915 -30771 -25063 1266 -54421 -85295 -92021 -55243 -63817 -90233 -86652 -34640 -10814 14385
13903 14385 8785 23812 1906 -17901 -2497 39737 49826 37094 30389 66248 129733 132928
13891 132928 97160 33753 26712 -8108 2147 38078 30867 57794 7967 13665 48975 40360
13879 40360 -20889 -25081 -40351 -87218 -107665 -93613 -64018 -38939 -16134 -23281 -5323 -1698
13867 -1698 40954 58720 44828 26355 16554 27677 20123 13909 20202 44673 54070 58655 45064
13854 45064 16087 36023 48964 64686 67934 12161 9598 46631 54578 -4369 -24939 -29245
13842 -29245 -12845 5953 25318 55452 48132 28492 696 -10049 -25129 18224 37458 35062
13830 35062 -3785 -9736 12979 13815 -997 -10583 11258 35420 39923 9425 -30112 -32343 -13172
13817 -13172 27885 35603 56786 39387 10426 29044 49836 34466 60027 63711 7496 -28617
13805 -28617 -29336 -16634 -29750 -36891 -33617 -37153 -56563 -60539 -60298 -30254 -38357 -59905 -63317 -50591
13791 -50591 -58740 -28241 -54438 -97581 -100221 -55302 -39642 -15929 -27164 -24517 -18072 19518
13779 19518 14068 -8055 -34997 -51522 -35088 -876 6941 36581 82772 50954 -21348 -41881
13767 -41881 -19571 -12722 6532 -22936 -44132 -49425 -13086 21741 -12373 -41001 -11093 -18289
13755 -18289 3123 62232 53091 60986 77515 80375 41599 30135 -17995 -65058 -50435 -41182
13743 -41182 -32144 -37874 -31714 -44446 -43373 -23089 -31363 -54787 -51316 -49512 -67600 -66187 -19472
13730 -19472 3117 -4248 -40955 -43734 -4084 26941 -12593 -7439 -26882 -31139 7868 57588
13718 57588 64611 7480 2454 20477 42376 37889 -9739 -38718 -19928 13040 35833 22250
13706 22250 -17608 -31183 -25581 -20506 -15769 1476 33003 10244 3329 46935 34145 38928 5824
13693 5824 -21020 -26327 -35442 -28192 -52613 -57886 -72821 -60003 -10556 -3367 -732 26649 15384
13680 15384 41081 -1610 -31389 -52527 327 5621 24911 28869 14887 -13740 -15436 17999
13668 17999 20518 -7795 -33863 -59444 -30100 -2111 9762 -6105 -3850 -7549 -30344 -38488
13656 -38488 -20410 -525 19092 1115 31988 11671 437 27486 29425 -4448 -5528 -8176
13644 -8176 -25737 2343 24565 -23869 -38217 -6799 -20156 -63690 -29156 4990 36567 66762
13632 66762 56068 26779 -20417 -58327 -63287 -32565 58300 55918 64617 60034 44634 21642
13620 21642 -9804 8464 -9958 -2011 17345 11089 30605 43005 62930 54873 9879 21114
13608 21114 -17529 -39366 -32063 -2742 23853 29743 34489 48643 47599 -6377 -48156 -52703 -11541
13595 -11541 -325 -70660 -103222 -116792 -87046 51 51866 23123 872 22439 22067 44394
13583 44394 57850 67100 43064 30460 28953 9266 -4965 15885 28509 15407 23770 23846 22669
13570 22669 -28825 -58696 -32055 -9294 -1232 -25283 -42771 -19876 24320 74192 72461 43698
13558 43698 49472 54211 72101 54159 24324 47452 70004 42855 48372 52425 57489 57608 45940
13545 45940 15163 -59 -7038 13243 28480 22748 33183 4989 -3988 -37844 -39609 -52745
13533 -52745 -73081 -33222 -4194 -8486 30673 26450 16525 39769 50164 35443 14432 38299
13521 38299 25982 17359 34748 41520 21931 44231 57720 11288 3093 -10089 1445 33687
13509 33687 -8512 -31555 -38558 -21152 5302 9678 -34534 -48592 -29891 -26581 -41061 -255
13497 -255 -4602 -40992 -23149 -35974 -24350 -5470 -38609 -42852 -37724 -53474 -34095 -9829 -17973
13484 -17973 7113 19673 26642 7059 -3306 20887 6870 33309 64746 52039 17634 -15312
13472 -15312 -17647 6271 -6521 9479 11440 11728 10825 -46437 -44495 -94318 -100471 -52176 6055
13459 6055 29309 36425 56028 38134 36802 22698 -21888 -12651 31449 30710 20693 -9557 -43890
13446 -43890 -7161 32833 38607 26667 22212 -13692 -9869 -23685 -33491 -62085 -79040 -62233
13434 -62233 -54029 -47397 -29762 -20526 -15701 8273 21589 -6014 -31297 -47182 -38984 -38718 -61971
13421 -61971 -44133 -11515 -6358 -17661 -27751 -42319 -35338 -21073 27858 50564 4948 7232
13409 7232 17996 44631 20042 -715 1962 47503 33913 -13481 4901 4564 -17445 -46098
13397 -46098 -108508 -102909 -49311 -23168 20607 55096 37812 -8726 -5436 43966 36204 30982
13385 30982 45091 51429 31173 -15809 -74822 -82910 -48144 -35210 3453 40234 59497 42160
13373 42160 16403 5655 -41213 -22850 -2485 -12054 -41072 -52405 -32663 -41230 -1576 27011
13361 27011 43282 -921 -48320 -45672 -5914 24547 34972 739 639 -38732 -74301 -69867
13349 -69867 -25960 49388 28594 23502 37951 45901 47917 6894 5732 -2785 -22655 -45945 -62409
13336 -62409 -110863 -81619 -39058 17290 22657 -19291 -41927 -46639 -33322 2434 -28162 -27563
13324 -27563 -22967 -31236 -23804 -31909 -16959 -1596 -15704 -1557 -21935 -50425 -39241 -12910
13312 -12910 -5123 -10343 -26407 -5246 -30808 -73900 -63658 -63211 -40368 -30690 -46131 -65739 -43816
13299 -43816 -22003 -7179 16250 36341 13057 11908 38127 36295 -12290 23268 55202 96295
13287 96295 89498 25902 14345 9717 36023 48883 28897 62473 30158 13170 -22661 -6528
13275 -6528 8202 12647 15880 -17548 4788 44390 78557 64906 17686 9978 37650 34957 -840
13262 -840 -3611 -20416 -27855 -41689 -42034 -39819 -58123 -42168 -10649 -2043 11471 -19808 -22412
13249 -22412 -25509 27983 47454 14145 -1612 3999 -35789 -86462 -86977 -60257 -39878 -44734 1274
13236 1274 8397 29770 12428 -9738 -16038 -25780 -48994 -45908 -1605 10621 -13084 -22059 -9495
13223 -9495 40669 49054 -1002 -25744 -40588 -17948 12698 28210 -3568 6250 38740 47824
13211 47824 -3216 -8561 -15264 -5222 -11597 -39867 -60218 -97974 -80993 -44674 -55942 -52547
13199 -52547 -40865 -59514 -46070 -45280 -44040 -29411 25019 49722 42416 32679 -2120 -43423 -8100
13186 -8100 25159 37981 33946 58306 45689 43449 28694 22918 52175 84600 21019 5421
13174 5421 -6667 -29524 -30656 -26204 -42895 -17410 26813 2283 -33396 -53481 -90038 -78410
13162 -78410 -59482 -17470 -4849 -15848 -15402 -33839 -13150 -2613 -24204 -37313 -34397 -56141
13150 -56141 -30431 1917 -45391 -27396 7739 31457 32565 52470 41299 3476 7200 -52630
13138 -52630 -61661 -47451 -73960 -68322 -36894 -8563 8983 31707 33503 43159 26099 83621
13126 83621 60404 22131 12695 19982 28609 -6837 -37530 -61969 -58897 -49139 -81502 -56944 -14531
13113 -14531 15659 30324 14863 21796 41269 12963 -5663 -4421 -8247 15814 19357 4704
13101 4704 70339 96625 81585 37095 -33174 -60006 -57988 -75637 -91552 -59249 -78652 -44466
13089 -44466 -25453 41437 27654 4760 364 13855 25729 14931 5112 22184 21714 40924
13077 40924 37200 27435 38248 52974 41852 29322 2211 1916 -6989 -19174 -3567 8948 -409
13064 -409 -6858 18565 12091 -14528 -35549 -61112 -43733 -5759 -38872 -49710 -28760 -30860 -44449
13051 -44449 -14860 57351 81417 60411 76933 28100 -6498 35567 79596 58718 4740 -38044
13039 -38044 -12889 -16021 -20686 -1512 9641 -17314 -10534 -6280 -5908 -5105 -19827 -71049 -36789
13026 -36789 6995 11008 -11934 -3538 26242 25608 43795 18278 -35927 -61974 -27312 -33157 -30043
13013 -30043 -37642 -45277 -42412 -79312 -93268 -67046 -57152 -71038 -84306 -103318 -109601 -78795 -43695
13000 -43695 -38522 -61041 -84554 -96598 -86445 -57588 -36239 -20588 -1423 9046 -20686 -2803
12988 -2803 31243 -21452 -19082 35009 58251 4106 -11655 -38570 -25150 -8957 -11706 -17848
12976 -17848 -15633 -49382 -16545 1973 -15911 -326 1307 -58773 -89819 -41606 -21349 -3177
12964 -3177 10127 11451 -10799 -63846 -58313 -35635 -43000 -45676 -4640 77207 88890 42068 31636
12951 31636 -16968 -8225 4905 24217 36585 2411 -3145 5509 -3726 24817 4869 -12551
12939 -12551 -20282 10782 -11273 -12849 6624 31384 38353 38880 35980 -11535 -6939 62200 70549
12926 70549 25566 6600 -7585 -12579 -4373 -6010 -11108 -44398 -59941 -22352 -23690 -18156 -3175
12913 -3175 38851 62854 29114 42 -8596 11605 6276 23579 -22338 -57257 -29748 -12675
12901 -12675 25279 45208 70701 44405 -4513 9480 25815 52359 58131 47638 48569 55458
12889 55458 70764 111551 114134 165839 240211 292669 256079 171339 101663 25653 -5319 20725
12877 20725 20110 -9478 -12324 1389 49060 112960 119917 99960 74054 38238 20526 14832 22385
12864 22385 58603 75612 59722 79800 68345 46677 16062 -13340 -51642 -38681 31113 61158
12852 61158 50845 59760 74628 -1212 -15906 4693 30056 20820 43584 36492 50699 55576
12840 55576 40905 28977 10761 16634 27796 11835 -31616 -28150 -30219 -31260 -16978 -7536 6609
12827 6609 -9817 -10500 -63114 -65217 -24585 -28196 -31326 29433 34861 30573 22476 31480 -9099 -35735
12813 -35735 -24254 -2655 -10564 37674 -3291 -1040 -17648 -46614 -36442 22462 19001 13111
12801 13111 27583 -10268 -32046 -33468 26978 58165 61893 33324 12027 26889 55570 18466
12789 18466 -16764 14982 9088 -36348 -55203 -47894 -39696 -22523 -34498 2840 36740 -7509
12777 -7509 -54283 -67785 -14975 25909 64516 94547 89810 10413 43866 51531 15603 36688
12765 36688 50687 8476 4108 13536 -23420 -52249 -45105 -7196 -3109 14818 22829 16676 -11655
12752 -11655 -7736 45363 67127 54890 18286 -10011 -11342 -47263 -52891 -64019 -69288 -74434 -56268
12739 -56268 -8105 11063 26510 34697 17868 -20287 -34487 -2324 -24912 -51701 -21151 -14733
12727 -14733 9437 27070 31256 39105 34146 20524 -3705 -37103 -10024 -7091 -27034 -47996
12715 -47996 -42340 727 37414 60837 36535 43169 47320 31613 -17551 -13058 10730 29647
12703 29647 2755 -35910 -34897 -24184 -749 -3252 -5141 -41558 -56448 -23093 9824 20832
12691 20832 28969 12807 -17233 -45613 -60009 -57446 -33865 -17167 -21670 -22369 1307 1257 -24660
12678 -24660 -56748 -52512 -14888 20945 4293 -1732 -12718 12883 33913 58266 61168 18261
12666 18261 -10393 -9975 -35296 -9450 25032 43610 46562 261 9503 11252 18461 -2555 -26576
12653 -26576 -47089 -52302 -29622 -20060 8948 38334 21332 5829 -19029 -34742 -41120 -34832
12641 -34832 -70360 -32626 32452 39070 25380 36642 36348 15489 23475 -24913 -15071 -3276 14633
12628 14633 28623 31117 54665 52169 46374 42696 81661 94412 96908 106222 102459 58702 11608
12615 11608 31619 26886 -10920 -16959 -19283 -13493 11228 33790 24133 24183 44138 33823 79565
12602 79565 57489 11361 -3367 -18293 -30952 -43372 -1703 -3421 -39432 -13097 2314 22033
12590 22033 45237 42680 20226 8920 -56634 -67866 -29788 -15625 -37270 -32972 -27281 2704
12578 2704 3487 -10723 -11117 -11786 -33511 -24196 -8103 -18375 9091 -2073 14527 20457 1656
12565 1656 -11668 -8010 19961 56345 66574 22506 35071 35491 -266 -3567 2398 -6056 -9371
12552 -9371 15825 7222 -32734 -2720 44080 22034 27212 74466 46482 36511 46328 67473 48927
12539 48927 12513 -37491 -42737 -56169 -16642 6549 17620 35208 61869 82174 43233 36480
12527 36480 34049 6378 12642 9759 2113 -23064 -19400 11635 -40621 -49896 -37365 -57312 -51000
12514 -51000 -11638 12606 2344 7780 67431 88921 44075 25155 24315 22274 22621 -16194 -19379
12501 -19379 -1724 43070 54446 34124 20074 8297 -10408 -26767 -13730 -7061 -188 -22140
12489 -22140 -52880 -70022 -44009 -44474 -42450 -96052 -81471 -56474 -36997 -15074 -26186 -21631
12477 -21631 -3823 1865 6908 -12948 -2699 -14289 -44285 -32769 -20625 -29863 -38443 -44989 -18429
12464 -18429 895 8989 14992 26906 52701 41134 -6513 -33759 -49504 -26915 -1936 -16527
12452 -16527 8500 -45189 -61401 -28811 -56432 8583 63270 55151 31428 14786 33984 70203
12440 70203 98562 75070 46484 2550 34294 64430 51224 9146 18391 67382 59929 34670
12428 34670 7609 16106 44845 52236 68413 87723 23853 3229 21280 134 -40419 -60216
12416 -60216 -48030 15546 61211 54116 37939 48980 64218 -857 -1893 23376 26781 51259
12404 51259 -6535 -61956 -60064 -59599 -46098 8736 52311 50578 52420 30901 -6229 -10045 13812
12391 13812 14347 -17584 -44709 -12211 11301 6616 -2609 9355 43718 74373 24145 2395
12379 2395 -15422 -10590 -24833 -33448 -21434 -30789 -12815 3267 34278 42008 28476 3099 -5244
12366 -5244 -4938 4725 8603 28805 34170 19384 38620 53648 23118 -34331 -48079 -57557 -10199
12353 -10199 42241 65631 84371 76134 115796 103268 59282 34256 1238 -30603 6581 70167
12341 70167 46064 50359 56229 18813 -43513 -47827 -17321 -14590 -17773 101 18696 23531 26175
12328 26175 30661 72907 20799 29713 40868 -3612 -17445 -224 4857 -24090 -9138 10613
12316 10613 -19363 -27239 -13847 -25300 -36490 -4094 -26532 -33052 -9019 3959 28935 31576
12304 31576 45026 -5665 -12197 -26773 -19739 -6818 -794 -14545 -4535 40942 58749 39064
12292 39064 1131 -21239 -38512 -26273 16502 12748 15925 12522 3635 -4493 8807 -5425 -660
12279 -660 -41886 -51391 -14065 27408 8109 5791 43768 26557 -20697 -15399 -1562 -21174 -8193
12266 -8193 -10370 5210 42253 14294 -40931 -55234 -28346 -12078 -23825 -20762 -34533 -14960
12254 -14960 -32991 -60455 -53362 27451 57775 57998 46810 145 -8795 9900 4631 -23112 25309
12241 25309 68253 47460 50891 32916 32541 -3123 -22350 -24641 -15297 17692 49055 65859 36085
12228 36085 -11838 -4076 41064 15924 -11631 18050 35553 18270 20507 68005 91234 66046
12216 66046 34154 27543 56430 51208 49694 55617 85602 44183 -22656 -39404 -31058 -47154 -43711
12203 -43711 -34309 -64099 -38829 1301 -12408 10541 34522 49950 51439 58106 76802 69346
12191 69346 29668 22861 25721 36562 5790 -8436 -3499 -55043 -82254 -112343 -74005 -38365
12179 -38365 -9720 2614 -17263 -19883 -19152 -40941 -52381 -38760 -5196 -30491 -322 40371
12167 40371 33232 7559 34415 21964 -11915 -29967 -33520 -16116 -15621 -16742 -27765 -23639 -20305
12154 -20305 3046 26082 17572 -30928 -3921 2451 2818 7600 4697 789 2786 -11918 14829
12141 14829 20001 12655 -5475 32325 34348 -5530 -1552 12207 23832 20596 5044 -48559 -58193
12128 -58193 -844 22908 28734 -9416 -68872 -34475 10292 8301 5929 49746 66101 96552
12116 96552 62473 33608 30814 32464 -10224 -51919 -43049 -37821 -34014 -44793 -30210 -10008 -26058
12103 -26058 -25027 -1311 -2330 12005 28199 21050 -4173 -26874 -34110 -44293 -33640 -48870
12091 -48870 -16912 35550 15699 11653 -9918 -21727 9996 10457 -1397 10273 -11159 16098
12079 16098 46631 91565 53612 18093 -8063 -25244 -31467 -22880 -10622 -24428 -25333 -12117
12067 -12117 -17816 -43536 -45698 -58972 -55801 -42676 -6573 50360 81866 64509 37910 40655
12055 40655 13756 -41624 -18684 38149 55709 15714 -29554 -67630 -110490 -132093 -106183 -97900
12043 -97900 -47075 -60949 -80480 -10806 10645 16746 11547 -40916 -41866 2771 6138 -1958 6446
12030 6446 21652 36310 106244 92231 15001 26404 22603 24913 -5064 2859 38172 42172 21413
12017 21413 3563 -31510 -78 22569 -8908 -9682 4684 25812 -8312 -52476 -64502 -75266
12005 -75266 -40123 -39355 -57370 -17508 -62 18078 45087 1334 -90420 -114960 -83313 -76215
11993 -76215 -30808 -21478 -34438 -13346 -5866 9239 7510 27441 27475 -25982 -56262 -54800 -47687
11980 -47687 -71951 -82912 -78558 -56603 -12678 -22698 -30633 -43337 -63651 -37789 393 -19567
11968 -19567 2328 -12960 -16176 7387 1357 19470 17751 9838 -11419 -25198 -32361 -57004 -33932
11955 -33932 -77299 -51397 36805 44163 18241 -10697 -27996 -3265 19233 -1529 -2944 -17632
11943 -17632 -58583 -57041 -34644 -2088 -6499 24550 35761 49978 62141 38776 50421 15523
11931 15523 23642 18063 27077 15087 -38471 -44440 -65125 -62307 -6402 2428 14353 14022 5191
11918 5191 52257 46999 24082 -22554 -61228 -37531 8507 6317 -7741 -33175 -33156 -6291 6444
11905 6444 30905 18054 -47765 -72166 -79402 -105979 -151578 -121210 -71096 -11866 17262 -3363
11893 -3363 15888 39103 13095 -9408 -5940 -5363 12552 42576 43326 48779 37538 -10539 -6769
11880 -6769 -8205 -31432 -31904 -15783 -7912 5485 10641 -19341 -53987 -44197 -25913 -9314 -26386
11867 -26386 -24462 8843 29381 45953 83114 75487 54702 9001 18671 -595 27176 41949
11855 41949 15745 3018 2125 -26984 -22030 3756 -6984 -14490 -80751 -86868 -67972 -86583 -75652
11842 -75652 -58163 -22031 -9607 13186 43066 62333 29756 -16489 -26665 7649 9590 10413
11830 10413 13175 -17067 16521 24594 7351 -34139 -99592 -88883 -73682 -58987 -74173 -75234
11818 -75234 -48758 -19446 -48596 -41272 -8872 6802 -2551 8757 24592 13452 14331 37873
11806 37873 50330 39687 39181 14129 -34412 -77462 -70955 -64162 -19124 1537 -11145 -42148
11794 -42148 -46156 -12079 -43295 -72762 -35859 -3154 -32852 -56077 -26589 -33679 -28623 -47705
11782 -47705 -46917 -32936 -8051 15711 69683 30229 -27292 -36511 -56053 -28445 -21000 -42508
11770 -42508 -91485 -60982 33616 47804 28057 33651 21027 57046 32461 42745 49204 37636
11758 37636 46030 31058 46854 31827 11966 -3732 -10149 -15261 -20042 -24483 3208 57530 74821
11745 74821 24761 -3976 -24726 -78818 -68928 -77362 -66176 -33967 20245 20120 -22009 -46623
11733 -46623 -43654 -65111 -69450 -49916 13538 21215 3783 4263 27357 34482 9509 -32049 -54480
11720 -54480 -80553 -78644 -30972 -14264 7235 7854 1827 -40107 -23141 -34750 -18435 2357
11708 2357 27395 50354 30060 13827 22537 19284 10386 16889 35891 28657 60 -18706 -8044
11695 -8044 -25642 -30820 -13362 21418 32554 19394 -4736 -15794 -9360 -448 9297 -10841 -54772
11682 -54772 -35986 -1505 21757 20253 13783 -9597 -34764 -26289 -45011 -39472 8167 24358
11670 24358 29679 33109 11481 27374 54158 38326 -6677 -25982 -12416 -20442 -27318 -14547
11658 -14547 -826 -4946 -4725 -18702 -19083 -7351 36444 42668 29970 429 -3980 -8867 -4494
11645 -4494 31194 23470 16419 -38581 -17658 43756 49929 17808 34697 74347 18930 -6341
11633 -6341 3275 -33815 -22056 18689 62337 82848 81755 83547 58733 42303 26791 -20848
11621 -20848 -60877 -39106 -28008 -13442 -12364 -3371 -18685 -9046 -17764 9399 598 24527 51276
11608 51276 4377 -45676 -23707 16079 76990 104157 91082 52364 15055 -14774 12345 37331
11596 37331 120 -41569 -58262 -43163 -57695 -46079 40322 85497 97210 76429 59027 16620
11584 16620 20871 -9237 -42815 -46375 -54504 -57992 -19490 10508 -149 -6056 6223 20504 -1932
11571 -1932 12859 32235 13498 22468 27490 9981 22388 55638 58742 53760 59426 34202 19024
11558 19024 -23577 -35448 -38726 -2197 36615 9717 -30110 -50078 -39722 -9904 -4148 -14963
11546 -14963 -44408 -60364 -32523 -4222 -18136 -45902 -48123 -38428 -40974 -42024 -91164 -61815
11534 -61815 -1419 20176 19476 17894 -6301 -24624 -14447 -28769 -47175 -13287 2940 -21233
11522 -21233 -16655 -17323 -36052 -33732 -5845 21847 1479 -19757 -53665 -16753 2240 -11479
11510 -11479 6383 7215 -21718 -15909 23062 10518 -43290 -26290 -17687 -25806 -16304 -9074 -42092
11497 -42092 -31837 -55371 -65572 -63994 -58251 -34171 -68651 -126583 -92545 -82266 -122798 -125666
11485 -125666 -133256 -102623 -20663 -14312 11453 -40792 -86465 -48303 -38655 -71493 -53115 -23553
11473 -23553 -31090 -27141 -43018 -21989 -683 42766 42321 -26580 -39673 31797 64651 40619
11461 40619 -640 36432 46813 47205 79718 100452 92872 54826 20946 -4447 -16937 -51491
11449 -51491 -36990 -10437 -60877 -89468 -85627 -57773 -9189 -18336 -48604 -53289 -48028 -43757 -29227
11436 -29227 -32041 -329 36205 14831 -31978 -36855 -10890 31906 71803 66887 77642 41348
11424 41348 -22510 -48113 -35939 994 2515 20043 11715 10720 -42208 -24460 41009 86416
11412 86416 65281 25306 -24541 -23812 28156 47516 25447 -22407 -27860 4261 27255 34800
11400 34800 41038 8766 9759 13741 -4443 3502 37259 23479 -8184 24052 14472 -13431 -24372
11387 -24372 16147 42616 33998 2179 -33525 -12094 18810 21533 -16537 -91986 -136398 -124282
11375 -124282 -68415 -51859 -71965 -34623 -25853 -48950 -37258 -30091 -52957 -38580 2095 16871
11363 16871 10898 -3994 -55006 -73720 -39163 -29370 -29182 -42717 -99600 -105820 -47566 14546 20692
11350 20692 24957 -2934 11287 -23101 -35752 -67885 -70538 -26985 -13959 -34014 -54916 -80469
11338 -80469 -98972 -74954 -38564 -43142 -42108 -40860 -2127 22709 3354 4449 12084 40284 50249
11325 50249 24876 -1454 33584 27529 -15679 5906 21275 30039 9440 49265 56767 -728
11313 -728 4553 44733 36890 12827 -2137 -4091 16381 14788 3077 -29566 -48190 -8462 3351
11300 3351 -7128 18719 12750 -16531 -39677 -70547 -61997 -30968 -29656 1726 33168 42459 19244
11287 19244 38940 11366 -13312 -57698 -84327 -23873 -16177 4816 35549 56812 27321 17137
11275 17137 38446 56485 58363 45151 87614 96943 70073 54323 55746 43563 59268 58469 40878
11262 40878 30915 464 -11924 -27643 -32078 -32089 -32687 -68190 -89186 -33360 10896 37642 54139
11249 54139 56981 52092 49598 33911 6326 -57423 -42930 -19437 9529 7642 -6277 -27594
11237 -27594 -46081 -36954 -20597 -18962 -5288 -10042 3712 33566 92301 110830 116681 108425 92341
11224 92341 94482 96109 34498 19846 37917 93263 66748 47478 74726 136102 251606 390292
11212 390292 574248 887557 1375377 2160205 2682739 2405914 1749923 1120932 654276 424204
11202 424204 323919 252193 164446 100869 95652 90225 82186 128901 138689 134750 121798 80062
11190 80062 42147 40303 83710 39575 5221 21120 34008 38383 35688 49084 56756 50352 67536
11177 67536 97519 110938 46078 -8486 -8246 -21940 33403 49535 27404 76765 95829 92456
11165 92456 73362 65781 77945 71386 42439 20190 17472 22033 27090 45202 68782 71164 45500
11152 45500 67602 65243 55124 75275 61206 38026 11584 38862 24718 24195 -6820 -41502
11140 -41502 -24564 3923 -11500 14305 50919 80466 85098 86780 93889 53927 17784 22599
11128 22599 40892 60700 64032 71188 29540 -9623 -28042 -28363 -28470 -23499 13543 36782 68128
11115 68128 92764 89071 100025 122802 129322 80894 51363 39203 27742 -1093 -28313 -40878
11103 -40878 -56705 -70560 -89330 -79967 -42345 9777 57048 79986 77655 56845 52801 68493
11091 68493 73410 80908 27026 -29568 -61506 -29426 -3074 -59285 -92391 -37357 5650 643
11079 643 6061 -9665 18487 44135 9092 13027 -17130 -6330 32066 34834 -814 20403 14432
11066 14432 29991 59863 64705 96648 160480 225962 309684 376832 346736 277103 211048 145551
11054 145551 95561 61105 52974 75020 84165 82634 73804 84769 75997 59943 25047 20192 -11830
11041 -11830 -11561 -19134 -12917 8621 -30665 3052 21060 64808 96095 51323 65574 63246 97024
11028 97024 94051 95312 46528 24625 19510 90658 109574 109420 101837 49819 69504 68428 39876
11015 39876 12361 17288 46285 34342 27275 27547 16579 34195 11916 22590 36847 54863
11003 54863 72892 78170 74952 7628 9751 30086 27360 16333 11146 43925 89469 75024 40830
10990 40830 40418 -3552 -22962 1324 -7003 26534 83057 52499 15198 32247 34901 60163
10978 60163 61936 44879 15128 193 39669 23686 17231 41330 87562 105832 120366 121899
10966 121899 114642 88159 84312 83417 25805 -29533 -43885 -19485 69401 150716 135765 96967
10954 96967 69469 22064 9389 744 -1603 33447 63591 63847 62044 65266 98441 102525 103472
10941 103472 89927 71593 42487 76114 100001 79646 55926 131048 105885 23319 95006
10930 95006 210744 256799 217777 172716 165402 186522 224319 218001 242938 237572 211100 200550
10918 200550 180822 182232 169408 194590 192973 188442 209003 225028 252245 304263 301507 256296
10906 256296 234611 235926 256984 310109 283835 247015 218138 201975 169950 131922 93095 108589
10894 108589 192568 231007 258968 232845 208890 247827 294052 273176 286574 338648 395784
10883 395784 409913 392222 342420 328530 364778 369640 336232 324915 338819 349686 425216 500506
10871 500506 540301 641873 722655 814127 1031789 1353609 1749486 2138891 2309662 2230379
10861 2230379 2178087 2214143 2196746 2033422 1786831 1564289 1398327 1289308 1222335 1164874
10851 1164874 1214862 1300659 1405020 1549262 1824340 2168349 2369791 2277718 2075339 1985552
10841 1985552 1916993 1862717 1790001 1696162 1724454 1830822 2040401 2240775 2422600 2652384
10831 2652384 2967321 3277483 3667207 4156291 4823306 5784338 7059512 8080318 8331148
10822 8331148 8286125 8562662 9409703 10825479 12551971 14534907 16975432 20243752 24749824
10813 24749824 31165110 40837619 56305932 82153019 125982830 201429844 328024206
10806 328024206 474649941 495651440 391144139 261280106 163757782 106706964 74017062
10799 74017062 53837556 40719679 31813510 25563249 20991652 17480176 14742548 12790045
10791 12790045 11369254 10291455 9527238 9002480 8801244 8842866 8360116 7341171 6244850
10782 6244850 5316198 4694081 4235427 3798109 3480438 3250370 3096356 2938493 2787928
10773 2787928 2567490 2317000 2100617 1915182 1794258 1754272 1703207 1608824 1498988 1448468
10763 1448468 1403158 1380240 1324301 1254770 1247151 1177332 1078795 997485 971136 893498 821493
10752 821493 751786 689100 670648 662620 667440 671773 690533 643532 601101 578158 569766 557897
10740 557897 508712 479661 508553 510353 537058 554296 553915 523465 522201 544449 558981 543056
10728 543056 532022 510473 531837 539878 521757 555840 565422 582018 658528 811913 978640
10717 978640 1006481 862279 699535 592700 481963 390030 311303 256003 205343 196857 254920
10706 254920 303572 317074 307335 267248 228520 227887 263277 249514 250356 252957 261787 230433 216341
10693 216341 205821 200625 226217 257595 254333 246810 287246 273468 288225 316506 337986 338126
10681 338126 401638 672705 1068225 1130083 812264 519809 386776 277012 223005 189697
10671 189697 199306 182685 166995 157081 130620 145525 158942 166469 200066 229036 204098 177542
10659 177542 199993 209718 175371 116716 49079 60351 108284 180743 259841 280671 218090 199920
10647 199920 192792 176238 193549 182493 142758 104231 152712 220501 245719 226861 184331 165900
10635 165900 127419 78215 97236 153553 138853 78992 79639 137428 156882 182281 164646 143192
10623 143192 134841 86378 83775 110017 119799 107462 95748 120376 116151 140530 102010 56754
10611 56754 76074 55877 26570 12410 -15539 -16953 31507 79783 113794 120895 70359 48111
10599 48111 51539 51167 70722 74677 68164 55269 35540 64528 50144 66666 97021 117730 73793
10586 73793 50917 42939 6227 28026 54116 86726 116609 150013 151318 122853 118209 115605
10574 115605 118061 72047 75848 103623 66397 33822 24930 28680 -2298 28403 33139 44814
10562 44814 57546 85867 86196 68076 84943 118608 99776 66802 43056 17966 35815 57123
10550 57123 60293 64917 50420 52149 30223 53159 37718 20099 47037 60088 55070 27542
10538 27542 38386 54923 52330 65092 28131 32334 50989 26586 28178 55552 63514 93954
10526 93954 93149 55185 59914 60373 50725 103628 115639 63656 52536 62127 59205 94067 98244
10513 98244 42326 42197 34134 14138 -5839 18642 50906 57325 69809 35532 53231 76205
10501 76205 41753 8087 -46183 -49328 -24927 2172 37927 47562 8496 -18635 -8562 18504
10489 18504 60597 68347 43662 44772 37451 51599 19168 29986 35831 33191 65334 56881 21236
10476 21236 33031 47588 76384 62445 17057 -39492 -48258 -26115 -15186 -16211 -29711 2072
10464 2072 50136 16104 30937 47882 58272 96738 58629 1614 -7281 18953 47865 33702
10452 33702 12139 18245 27373 10350 22079 -17027 -6047 -34855 -47068 -36772 -21408 8457
10440 8457 14176 18566 35429 25573 36551 44759 17937 8800 27734 7220 -18326 -311 18632
10427 18632 49825 29251 7550 -9411 -8969 30524 22946 45545 51377 42576 63919 79805 82898
10414 82898 64242 50664 47510 48755 45412 64726 88880 99372 147518 180861 217736 316090
10402 316090 449898 709830 1226309 2017788 2693327 2555772 1901499 1234135 760392 491551
10392 491551 345680 283862 237439 216207 162305 93574 76590 102058 148553 79940 35698
10381 35698 39310 34857 46689 41066 28025 41550 32897 26005 35076 44887 46897 36479 23345
10368 23345 -11 -21413 -18755 -57559 -65975 -40853 -10122 -12457 -46598 -75027 -112784 -93758
10356 -93758 -47335 -14831 -27764 -57156 -36228 -17897 -19979 -12746 -46121 3277 27377 19836
10344 19836 1637 10839 18146 68505 99245 133413 145692 118919 69879 47907 7840 -9493
10332 -9493 -22283 -9329 7079 -4123 21527 -607 -9246 -752 8439 -16132 -21332 -6405 7488
10319 7488 -12141 -66774 -51400 6587 51150 11383 21032 32739 37953 40957 61962 48565
10307 48565 51750 83441 67019 26099 12060 1930 16222 18676 15013 54062 59993 40544
10295 40544 53140 51117 45736 20037 -13992 -65396 -55570 -9411 8925 -8097 32523 21338
10283 21338 29707 40306 53751 38981 5698 -21933 24395 54726 59284 101115 74821 49557
10271 49557 5049 -33390 -69014 -24664 -18260 -40715 -21690 5703 13244 70622 75175 84972
10259 84972 29585 -33974 -54691 -84035 -63708 -1108 13592 -6864 -43428 -39860 -23694 -1670
10247 -1670 12757 21117 44620 52256 11731 -28257 7009 58402 49269 14109 -12903 -16460 7271
10234 7271 24547 40816 40745 57026 79385 47737 30152 24956 45380 21081 -34225 -63104 -66030
10221 -66030 -27287 7325 27139 24458 -41783 -27882 -18150 -15755 5410 24396 13792 -14574
10209 -14574 -41326 -61412 -48662 -8654 27632 50679 12813 1928 19385 18428 -9777 32051
10197 32051 72025 32255 7734 -29644 -29413 -12203 -4795 19396 26468 23623 -3466 -50288 -66703
10184 -66703 -14067 13612 -15879 -9177 20380 38741 71713 69211 39686 37560 3457 -14889
10172 -14889 -37997 -72185 -83898 -90002 -58721 -14033 -16303 12679 23679 924 -22080 -52387
10160 -52387 -69825 -75819 -80643 -73462 -53681 -30304 8138 6433 -2970 -18866 -8272 46328 69310
10147 69310 62514 33963 -13177 -20913 2732 62689 115448 89722 34665 -21557 -18259 3639
10135 3639 -14697 -35517 -30264 -55442 -72710 -4126 7931 6112 37218 17286 -14686 12308
10123 12308 34039 33558 71150 32654 -44738 -59593 -7907 -2504 5587 -5629 9786 17070 38844
10110 38844 27162 -24975 -65454 -36687 -39282 -58980 18040 73440 76429 25803 -46037 -51763
10098 -51763 -42395 -22050 -4654 6555 -11911 4497 43699 50070 35250 27796 -1800 -16188
10086 -16188 -12220 6033 42939 57145 58697 44426 58129 34398 29304 10739 -27319 -18324
10074 -18324 -16147 -4449 19632 46153 39079 -10182 -16078 -12763 -20104 -32431 -41587 -34252 -6915
10061 -6915 -25524 -18227 -32888 -61902 -74724 -47108 -46174 -32294 -1700 33225 41444 30271 48200
10048 48200 38611 40561 51389 26428 14943 14885 34280 30185 32204 10327 -2913 486 9631
10035 9631 12917 -5533 -24285 -26758 -26286 -19792 9639 6642 23968 26623 42642 31926 23839
10022 23839 -16507 -50938 -21760 -14455 -16452 -48091 -205 23283 15068 -28244 -36228 -20506
10010 -20506 -16343 67180 102147 32207 -26460 -55345 -53877 -29596 -41419 -37001 -33210 -44209
9998 -44209 -38586 -43339 -33188 -3551 21217 77247 94025 97971 113888 109673 73483 38459 32498
9985 32498 2212 -25436 -30600 -39022 -10529 2500 24948 -7818 -7227 6688 4479 14341 43356
9972 43356 60325 78573 129669 120290 92117 112515 114352 135121 93155 80907 103397 89390
9960 89390 68621 40544 -3052 -1715 -38222 -67802 -29088 -29439 -37727 -40268 16979 33909 24887
9947 24887 11071 28017 32693 59010 76578 74003 48539 50476 35627 54354 28353 28095 86447
9934 86447 87073 112623 142585 165670 83301 27678 55036 57383 55192 54645 50627 60401 11446
9921 11446 -63162 -56962 -41619 -46345 -57741 -43749 -30608 -21647 -33587 -52036 -55056 -55709 -17109
9908 -17109 -28393 -32622 7852 44623 31987 29189 26481 11023 -18792 -41880 -21489 15198
9896 15198 10965 -2216 -35896 -19914 -1316 46755 84811 100624 90628 79065 57791 45093
9884 45093 39584 10445 2043 -3137 -17696 -1307 27676 3906 10672 44631 68572 70608 81131
9871 81131 78307 51200 -9190 -15552 5821 -15091 9548 42685 40295 6402 17429 32945
9859 32945 58205 75629 45860 7804 19949 11333 -21497 -24248 23131 26698 8268 7955 54863
9846 54863 78342 46310 -12735 -10737 -15657 -63003 -42586 -25849 -10445 -1586 -9574 -50052 -38149
9833 -38149 -30087 -81965 -54199 14201 -3742 -42302 -18116 -7789 18750 25092 16178 16908 13682
9820 13682 8189 -14540 -78887 -76559 -68442 -49607 -12516 13220 -1264 -34364 -12477 11562
9808 11562 5807 19999 -2669 -11381 -7077 -8640 26725 54770 13947 -8900 -19417 -9992 9525
9795 9525 7215 8003 -13973 3748 -45089 -30011 19322 47497 41300 -3373 35205 42621 61384
9782 61384 27244 18066 31468 32036 34764 13868 13704 17568 -25629 -28878 -7567 -25880 -19735 -36578
9768 -36578 -8289 9190 44241 67195 41473 -18118 -25057 -26447 -39155 -14961 -2834 -1843 -37098
9755 -37098 -62970 -51939 -42394 -30150 -973 -1398 45122 47648 38925 -1201 3809 13331 27507
9742 27507 1985 -7844 -2337 46493 9090 -15369 -33351 -25756 -46026 -20076 -1475 -10727 -19485
9729 -19485 6302 35566 14401 19065 -22318 -23462 -24364 16473 63871 54538 17685 -43843 -66858
9716 -66858 -34754 23495 35415 49601 40629 -3809 -36646 -32018 -15709 -21758 -26832 -53727 -14310
9703 -14310 18172 2281 -66413 -58824 -16146 -47586 -55404 -40171 -37193 -73552 -63069 -33486
9691 -33486 3331 -16615 -57726 -50279 -40276 -68455 -85510 -49779 -33454 -11327 -9527 9983
9679 9983 11796 4634 16254 -12779 -50267 -74518 -70920 -22883 -6868 -41201 -44537 -27857 -51961
9666 -51961 -27715 -16411 -34880 -40690 15779 -4332 -32085 48618 16407 -28678 -63105 -46975
9654 -46975 -55388 -18843 19840 26193 18123 54336 63356 3670 -30683 -36670 -32521 -8993 -72
9641 -72 11031 -19344 -43561 -56242 -51137 -39442 -19790 -46949 -86197 -85617 -67634 -23272 -54252
9628 -54252 -46982 -60910 -93229 -77277 -88668 -116115 -101195 -28413 -7880 27405 46340 9178
9616 9178 -26009 -34863 -51161 -40404 -7604 22031 34143 42531 72909 78205 35600 15138 10226
9603 10226 9263 4442 11401 15688 10912 -4011 -13776 -8573 32164 35892 8222 4343 8171 -11679
9589 -11679 -42284 -21567 -32224 -46040 -23592 -22412 -5733 -8454 -38210 -35508 -52034 -62367
9577 -62367 -59625 -12159 6688 -4010 -6961 21005 22781 33786 -1861 -2424 11165 21943 30284
9564 30284 -20430 -80278 -110575 -110528 -65949 -27723 -29220 -7508 22675 -6620 -2388 12174 4506
9551 4506 41919 82639 78106 76328 85989 76204 99988 96640 82270 95229 68256 53654 80531
9538 80531 43805 35708 17287 16040 -38973 -33423 29413 30912 8168 12847 -8542 -33401 -15820
9525 -15820 -35231 -64156 -101978 -89127 -74894 -60687 -60924 -19154 16258 12255 -8750 4770
9513 4770 5727 -16153 -14916 -4189 -40819 -59585 7988 31854 26709 8682 6721 21462 26929
9500 26929 54929 94121 57092 41821 29899 13354 -2514 8254 -30856 -66059 -61791 -73414
9488 -73414 -66246 -90246 -73981 -68748 -60678 -94188 -87280 -90319 -67453 -13205 -9888 28298 51568
9475 51568 56830 65669 77150 51796 22332 -14364 -4610 13158 -13838 -4944 -29988 -35336 -20768
9462 -20768 -13461 -33378 5031 24496 34736 20181 33060 58911 12391 -80086 -100774 -71582
9450 -71582 -72878 -38256 15657 33095 36428 2781 -25412 -19134 17325 34524 60105 61366 32680
9437 32680 -33625 -62291 -66163 -14255 44650 95415 56340 18167 45021 44941 60901 59727 15509
9424 15509 44538 38715 29174 44192 47878 86783 84252 106814 65873 36222 68154 51061 59516
9411 59516 75910 83115 41315 -20378 -43767 -16243 5266 34300 48312 44337 30643 5892
9399 5892 -3366 -18253 -20851 -28782 -32280 -38568 -66343 -38776 -12718 -15061 15510 8937 4286 37224
9385 37224 53368 36276 33054 23284 36661 13141 -3452 17341 4651 10552 9461 50410 19406
9372 19406 15887 27026 9740 35268 4426 -20568 -33537 -15142 12931 894 17092 36294
9360 36294 -3170 -24410 -44431 -47081 -53885 -78891 -78419 -87825 -66051 -58036 -85758 -96296 -100691
9347 -100691 -134632 -163154 -149238 -106609 -27059 -2891 -23140 -12703 -11102 6740 17680 -4060
9335 -4060 7402 29891 17322 -6126 -47496 -40636 25796 43145 50680 32474 49114 33072
9323 33072 41013 57630 53122 58931 38531 15098 9578 -1829 9345 28148 71065 68111 33115
9310 33115 42194 41972 15744 3958 21225 44402 36828 29277 18445 42926 26164 14780 6942
9297 6942 -23552 -49556 -37669 -24341 -27589 -5975 48601 60553 5666 -28703 19223 32753
9285 32753 39560 7082 -198 -14517 -22919 -14282 2367 -11653 -46941 -29444 -8176 1789 13153
9272 13153 -4423 -28815 -22783 -24400 -14721 -12044 -14269 -40667 -66845 -51004 -54704 -23753 -3650
9259 -3650 -10309 -27211 -10924 -6636 -14117 -42907 -44673 -31521 -5206 6651 29430 25486 -14224
9246 -14224 -38907 -40294 -17423 -19660 -27010 -14538 -31422 -40518 -73482 -31350 -12082 24053 67894
9233 67894 85125 45461 15642 -12230 23378 94584 79304 62636 36108 7483 15055 40975
9221 40975 61926 44852 49451 62921 23974 34318 50066 67259 56580 48106 3898 -31491
9209 -31491 4361 44751 53376 36495 55165 39328 58806 56734 26218 20968 54589 74205
9197 74205 68322 66796 96494 89325 93387 68464 82401 42680 22579 44565 43725 35512 66527
9184 66527 153679 147980 123212 113160 112537 88220 59853 78731 97808 99968 99509 82927 117527
9171 117527 123061 94886 57112 19730 -8158 10782 62489 136998 161237 128936 73763 86207
9159 86207 120743 157290 142607 130416 136406 118145 150351 220695 226201 191540 142018 136548
9147 136548 135351 132624 162551 184398 199565 222072 266578 275687 287680 314273 291489 220768
9135 220768 210725 265661 271327 316468 333205 369833 417066 436295 443931 485014 466552 480713
9123 480713 541460 606442 633940 695513 776441 828204 838608 892237 980024 1102049 1263318
9112 1263318 1418197 1565832 1700971 1885329 2106896 2373874 2590937 2867038 3208804 3550350
9102 3550350 3923127 4293140 4602608 4918358 5147419 5231399 5200031 5122518 4905220 4571406
9092 4571406 4236607 3856754 3487761 3139981 2846235 2588400 2350159 2089372 1847025 1671919
9082 1671919 1572303 1463758 1326823 1196779 1121204 1008338 886496 833807 780951 689631
9072 689631 642656 658081 660941 635588 581256 533236 505017 495977 463069 422976 394691 424614
9060 424614 473891 443744 389205 362035 352833 319163 307865 255250 220264 199002 143545 145822
9048 145822 195031 209579 163623 169140 137886 134523 184076 186390 222478 223843 206524 139645
9036 139645 117796 125739 113633 118021 112939 85761 48525 84385 108486 105522 87298 79004 108576
9023 108576 119655 114447 106595 98662 109122 76107 126980 139368 115835 96056 64893 26651
9011 26651 9433 10017 -27471 10286 65320 74660 97192 45877 25328 46604 65154 90281
8999 90281 96018 90956 90175 44996 36113 46902 33532 -21121 -12512 -9934 40946 71888 52836
8986 52836 26973 29942 -27313 -45355 -15583 30721 49670 34257 31823 60417 39776 22617
8974 22617 14382 36784 47869 54872 15756 33273 40088 69530 105444 78341 56553 73489
8962 73489 46499 23149 8301 26805 49798 77302 99701 98363 94683 58902 63910 95680
8950 95680 63206 39538 25563 46240 53224 36312 23523 40387 52344 64236 65257 50752
8938 50752 28144 50391 40620 36408 24523 41397 34894 33869 2711 -950 35686 -6692 -48747
8925 -48747 -32354 22760 76441 68896 40124 18583 31033 2555 -30770 -35491 -41375 -1375
8913 -1375 45933 59559 14145 12033 56110 56295 25208 12724 -16309 -42620 -71631 -78138 -11741
8900 -11741 26977 34333 22449 -28779 -54460 -37830 -10863 -4053 -42321 -65159 -91201 -89872
8888 -89872 -79781 -93190 -73035 -22257 28266 24338 19057 40626 60862 33877 -21630 -17657
8876 -17657 10399 40902 42908 18610 28134 56242 55773 62694 59543 69784 81753 86063 74433
8863 74433 33858 27957 46733 16527 -13323 -20098 -40169 -29635 -34937 -12833 -20904 -5902 -5274
8850 -5274 16454 21338 24066 37890 27560 26481 5299 149 15775 12181 -12203 -16516 29897
8837 29897 40053 16618 22265 19728 54921 34829 16923 52677 104638 104857 71928 42537 45308
8824 45308 -11649 -2212 18874 50104 46735 639 -71841 -55839 6485 41076 55764 35684
8812 35684 28583 59170 58536 26095 4534 -39890 -55654 -49646 -3566 7422 -37802 -35887 -16022
8799 -16022 18682 -9131 -7236 20770 8207 32501 43336 14183 -1201 13400 -3139 -20180
8787 -20180 -16293 -20440 -18454 -37889 -40391 -39757 -62562 -89172 -65086 11735 9899 -39872 -75200
8774 -75200 -68419 -39105 -21254 -40226 -63068 -41722 -4927 15224 -21988 -38290 10533 68259
8762 68259 42734 65069 83235 81679 94710 45600 -3430 25711 35590 17078 27432 43964
8750 43964 4463 -31285 -4828 -12061 -34898 -18019 -4153 -53553 -68221 -40540 -24821 1937
8738 1937 48633 101609 123299 104693 63858 29126 -15942 17065 -20573 -41975 -41952 -53973 -74719
8725 -74719 -36329 -21799 -18370 -53862 -75005 -86415 -99783 -63174 -20229 14652 44784 99364
8713 99364 81772 20400 -4377 -21404 -19285 -11082 -27423 -71066 -46100 -23650 29002 15610
8701 15610 -866 -20099 -21117 -24415 -16926 12458 4428 -7688 -57215 -54380 -82987 -62254 544
8688 544 3161 -17389 5565 -11653 -30398 -19384 -15081 -446 4739 -44055 -2366 -10239 -25813
8675 -25813 -10434 -22893 -28070 -7117 -8293 -27192 -44413 -61687 -4628 3323 21094 6250
8663 6250 -28486 -38296 -32922 -40455 -33551 -11519 -6537 -21180 -20335 -13512 -29090 -7024 6926 9995
8649 9995 26980 51757 39021 11212 74 42165 78186 35520 -15909 -75481 -93752 -48453
8637 -48453 -35990 -23491 -4063 38195 60387 42510 29718 12385 36837 67115 62839 48219
8625 48219 25467 -25374 -46245 5472 22631 7494 23298 52676 37760 38244 10023 24051
8613 24051 40294 23627 11831 -4764 3605 -1313 41793 73671 53415 3352 15158 61833
8601 61833 58973 27421 32891 9268 -19579 -3954 40681 26656 4031 25851 61468 63967
8589 63967 90467 71642 38403 48831 50905 31814 48471 42666 59855 19984 -1434 35392
8577 35392 45270 27798 36648 43654 45998 46402 43683 69675 29187 -18717 -61013 -95199 -91632
8564 -91632 -68016 -33950 -975 -9471 8343 5463 37720 32269 27545 4196 19181 -2056 -12781
8551 -12781 -19052 -38277 -36596 -3402 -4964 -28681 -70865 -46785 -21876 -1150 -9863 -41037 -51951
8538 -51951 -19798 386 16962 18921 -33735 -63673 -78082 -62966 -53653 -60492 -41915 20180
8526 20180 47801 10208 -23627 -10935 -11085 -9502 -6953 -9197 -11761 -20409 -53395 -64943 -46962
8513 -46962 -52037 -38881 -20080 -9167 -7691 -18032 -13206 -37530 -36635 -35394 -7095 6454 -47314
8500 -47314 -91127 -116645 -132366 -102973 -58302 -47043 -12745 8331 -10091 -9680 -27880 -756
8488 -756 7264 9669 10483 15767 -10857 -11065 -22089 -3894 -39628 -82423 -101954 -104169 -100832 -73423
8474 -73423 -64343 -20257 -13967 -13324 -30559 -38151 2012 -16382 -11117 42689 78783 50382 14936
8461 14936 -9500 -47185 -25121 19142 56494 54758 40366 61081 58284 9119 10773 48502
8449 48502 48505 22745 19402 17784 -34571 -94707 -83866 -38716 -8239 -15447 -15799 19369 27068 13894
8435 13894 18557 24425 43714 -4768 -39352 375 35124 44906 44141 31611 23371 38381 80723
8422 80723 90677 66974 78575 67910 25375 2820 -9731 -5914 37134 17017 337 -3009
8410 -3009 -5439 -21816 -5690 -20643 -36398 -31526 -25533 -5950 -68117 -101232 -70855 -31945 -35222
8397 -35222 13614 52100 84599 50118 -24224 -76706 -70729 -3724 13826 20659 6851 31958
8385 31958 39515 26987 21954 13749 -12217 -61598 -13878 7173 -3273 40786 16994 -30095
8373 -30095 -27838 -14279 3862 -6432 -34477 -66907 -70560 -71134 -59253 -74406 -39291 -7716 5963
8360 5963 -5140 -5015 5221 17528 7902 -43250 -99298 -50532 2890 23244 45641 56905 67883
8347 67883 56031 26924 -26169 -49175 -58334 -50804 -38946 -48187 -24736 -15846 37281 38942 43357
8334 43357 42313 39887 29186 18941 28618 -10057 -59927 -55388 -222 14242 -15735 -24612 -20713
8321 -20713 -28110 -23320 -13909 -30260 -23699 -10707 -32568 -27783 232 2696 41517 74324 54556
8308 54556 29460 5399 -4001 10057 9865 21196 13308 7664 -46950 -41941 -13125 -35759 -28888
8295 -28888 -9659 -16320 -31960 -16636 8651 23999 8550 26737 17690 20432 67049 122398
8283 122398 131595 110860 64074 28348 148 35550 28982 25043 33154 19888 -17787 -17478 -31585
8270 -31585 -30611 -45545 -22305 10245 3287 19348 -457 -24520 -3529 8342 27618 19324 18106
8257 18106 35772 14442 -545 -7659 22631 11871 -207 -21300 -27692 -9422 32664 39809
8245 39809 29887 40977 56595 30592 10779 8769 5410 20523 7 -34965 -55260 -33500
8233 -33500 -7786 59779 53864 1531 -3979 -11351 -49668 -66469 -24727 -23158 -16744 34989 10604
8220 10604 -3492 -22997 -1694 -15566 -7843 21129 36636 39487 3408 14702 33756 38136
8208 38136 1 -55928 -59999 -58135 -53384 -66576 -49286 -12477 22389 49085 63396 39000
8196 39000 41297 27419 24997 -9087 -3646 19754 53012 68451 89709 61141 -8144 -12892 5731
8183 5731 5648 4751 -4526 3060 30124 41922 15349 -19344 -48588 -33871 -8504 5449 -5819
8170 -5819 -48266 -51628 -10332 -9073 -21426 -55520 -85397 -101183 -61250 -55388 -69906 -80259 -84122
8157 -84122 -90222 -63880 -55571 -41777 13972 56172 46664 18916 -6711 -10929 -14806 -29275 -19883
8144 -19883 -29153 -35913 -24374 -20372 -27152 -7199 -12137 -24241 -27582 18971 16523 -10372 15817
8131 15817 11703 -26324 -59117 -41268 -27326 -65109 -39177 -5008 -746 -37756 -14450 30334
8119 30334 50822 1684 -25550 -4955 2663 -15707 -13790 -6273 11481 3859 14629 -18313 -21793
8106 -21793 3593 16921 29155 11903 -34987 -68141 -73580 -97704 -84863 -19745 -7198 -39469
8094 -39469 -59286 -53130 -28498 -15326 24073 9562 19363 8625 -20145 -979 11558 -20071
8082 -20071 -63360 -34349 4720 35046 39062 -5373 8052 -12797 -24713 -7242 -7339 34869 11028
8069 11028 -15148 -14410 -12927 28244 46850 14857 -25598 -5006 15302 22989 30193 51405 48211
8056 48211 31980 -6447 -37976 -40253 -41864 -6711 -15057 -6326 -23886 -14410 27162 9602 -1572
8043 -1572 -828 4379 18208 42453 58914 34955 24418 4244 45388 52678 48011 17799 -20140
8030 -20140 -13722 -23323 -46738 -29559 -46619 -34304 -32684 -20004 -13903 -18291 -23435 -5792 17540
8017 17540 37369 -509 12917 1661 -9149 3388 55505 28680 747 -15108 -19627 -29303
8005 -29303 -25967 -34443 14112 25278 10994 10769 57260 77818 60809 33128 48776 61112 30022
7992 30022 13804 19634 26299 4361 -53266 -63228 -6184 23010 5695 -22991 -25990 -16068 -12745
7979 -12745 -10871 22600 57946 84122 55990 17382 16351 29593 3009 -11790 -11648 3078 5701
7966 5701 12767 40352 55596 50863 29408 3629 -41976 -19915 -11759 10525 6893 9332 21532
7953 21532 17918 48224 68280 98944 67090 -1424 -21937 16268 12436 6998 -21443 -25111 -38717
7940 -38717 -46418 -53804 -27841 -23639 -502 18896 8086 42622 52274 48892 31320 18607 8146
7927 8146 8166 35565 38639 6890 11850 1320 -5834 2218 13855 41411 77116 87815 77791
7914 77791 80081 80093 61005 121 -21784 6100 32548 18152 10033 -6708 6793 14878 18196
7901 18196 8053 13480 39542 51948 64048 62841 43565 10938 6565 15516 -6992 -68170 -74854
7888 -74854 -38371 -36981 -60989 -56535 -17721 -23686 3294 32490 22213 13732 -5824 1464 31507
7875 31507 49599 57344 43572 54549 55618 15250 -13733 -28596 -16866 10491 9053 -2984
7863 -2984 -6008 -773 -30286 -32111 -19755 -21434 -2820 -29304 -51116 -47366 -14583 -2725 -26111
7850 -26111 -17281 -44374 -59802 -39939 -35932 -50471 -59943 -14580 -6167 15737 73710 77208 67324
7837 67324 51744 23073 10073 11332 -19298 -25205 -17666 -29114 -11674 3349 1450 -29444 -36112
7824 -36112 -42852 -41618 -36196 -42606 -38560 -41583 -38628 -11270 -18686 -15828 13849 -4103 -13489 17177
7810 17177 44730 72962 62820 55995 61938 14926 -26782 -2262 10117 -32216 -19854 13370
7798 13370 29497 29636 18291 836 -20382 -16510 -31823 -19669 -21011 -17890 -17790 -54166 -33678
7785 -33678 -8506 32815 53307 41105 12721 -40072 -36981 41097 62477 -1895 -44718 -38670
7773 -38670 -58315 -38821 -5834 -11335 -16266 -38887 -56898 -84985 -107696 -69265 -59440 -5793
7761 -5793 2493 -27744 1336 19622 -12370 -41091 5537 26853 20629 32424 -3338 -30671
7749 -30671 -48689 -74008 -50759 -28356 -19395 -8360 17267 7173 -25385 -32444 -54283 -40541
7737 -40541 -47555 -35529 -47848 -5848 -24625 -53920 -34627 -1304 26774 -15415 -13456 -39142
7725 -39142 -77645 -28109 -25039 -54652 -41564 -31298 -39246 -66972 -70431 -41767 -1432 7473 5516
7712 5516 -4936 -9728 -24353 -14386 -14334 -23977 2451 -50134 -46722 5096 25360 40417 41454 37363
7698 37363 47022 -3683 -62783 -64559 -37217 11899 59244 39161 2590 -6177 -12458 -65725 -60603
7685 -60603 8935 26175 49007 54155 45661 9169 -24580 -48885 -62299 -77256 -86284 -59910
7673 -59910 -11645 16693 13985 17462 14849 6816 6968 55679 92069 77487 69614 66100 41412
7660 41412 -32257 -10127 -13891 -31521 -14618 8433 23061 -4572 -36379 -35616 -66806 -55024
7648 -55024 -10243 53298 23350 -22013 -494 19874 30673 8844 12087 6764 -35351 -51686
7636 -51686 -44759 -41620 -43518 -9739 6614 -3460 -31107 -31704 -17840 6652 -5707 -18774 -34947
7623 -34947 -31720 11835 -6137 -28584 -35882 -32359 -27513 -54513 -29657 -12942 -11217 -24452 -54008
7610 -54008 -100478 -96188 -67299 -49701 -4950 29691 50833 17108 -47428 -28270 -18638 -36324
7598 -36324 -22900 -21331 -61776 -64355 -43679 -27925 -30920 -26090 -14440 22704 -4676 -44214 -58217
7585 -58217 -65904 -43618 -41224 -48038 -37691 -34376 -39548 -69540 -81123 -77873 -64284 -38516 -54547
7572 -54547 -56130 -35096 -44177 6409 -3157 -46600 -43323 -20252 -8053 -1629 -7037 -42023 -35016
7559 -35016 -14151 -1461 -1406 44984 53760 18169 13444 -4213 -18827 -10376 17946 -6347 -28810
7546 -28810 -16161 -13980 -34005 -45126 -39942 -18902 -31326 -35949 -63039 -54421 -50353 -50809 -76348
7533 -76348 -77825 -71980 -63171 -52461 -35113 -17334 19307 14044 -33145 -39454 -22872 -29779 -8547
7520 -8547 9425 -6210 1244 27478 18946 13165 29255 29344 -1230 -4597 9380 -3465 -21535
7507 -21535 -12541 -21587 -63760 -69147 -63052 -46588 3004 35371 16320 -4309 8284 25051 -23674
7494 -23674 -24368 12777 36111 45259 79127 49028 6241 -48191 -50584 2463 -3382 -61617 -39338
7481 -39338 11428 25463 6125 8705 -8255 -36852 -102065 -143290 -111011 -55593 -59381 -37588
7469 -37588 -16978 -10944 -16690 -190 31155 88760 69149 46526 63600 21048 19307 -13505
7457 -13505 -6160 -3234 -12621 -50622 -44963 -36016 -29074 -11699 33731 7545 -19887 -10957 -16503
7444 -16503 -32165 -2444 23188 37994 -9177 -27821 -19362 -9237 26307 8110 -38706 -45542
7432 -45542 -28329 -4453 10861 1774 -38082 -31010 -313 23159 25562 9195 -17448 -41623
7420 -41623 -29302 -20618 -19364 -636 7311 -26400 -22274 -6133 -25102 -19734 -39574 -21535 -12827
7407 -12827 13921 59581 44381 2650 -25591 -13339 -11570 -39223 -60472 -49020 -56584 -33240
7395 -33240 -17043 -9641 -23713 -17509 -26728 -17065 10941 36536 36856 38397 33283 57462 70166
7382 70166 35335 4722 -26983 -54413 -31256 -12893 -56277 -71110 -39430 13217 13913 -31899
7370 -31899 -85685 -97885 -102412 -96772 -95342 -59278 -39910 -12295 17181 11871 -274 20541 -2189
7357 -2189 -1091 -60 -8352 -16414 -45203 -29420 -43850 -107360 -54812 -8255 12560 32275 25344
7344 25344 18924 -27723 -16381 -4087 -6676 -18638 -464 -2127 -27029 24399 22438 -12666 30715
7331 30715 56384 51588 34267 2970 -9433 35909 17537 3948 6054 -23372 -39539 -50630
7319 -50630 -57116 -54891 -34290 -12473 21865 16178 -50574 -56807 -15217 724 13292 -4892 -9934
7306 -9934 -14806 22769 12398 -9332 22539 -12751 -28976 -25058 -42351 -25646 -23935 -49250 -74010
7293 -74010 -82258 -102518 -102317 -55348 -10144 -8505 -35609 -42819 -34433 -24337 -22200 -29702 -9285
7280 -9285 -5040 13709 19050 33959 39118 -14606 -74540 -53256 -19190 -28558 -31785 -45868 -35065
7267 -35065 -44333 -40992 -67227 -69799 -51546 -46625 -12138 -3449 -7197 1346 -14274 -10387 -6640 -37043
7253 -37043 -51135 -44996 -31389 12827 49585 31013 43682 -2801 -61759 -78801 -49097 -26854
7241 -26854 -8622 9688 47440 26466 7671 -2601 37315 93384 57431 10647 18475 -8056
7229 -8056 4073 63999 31177 3797 15452 20639 -20029 -20495 5533 20223 15084 -8656 -12876
7216 -12876 -4781 -11802 -1964 25539 -12684 -22843 -468 29688 -5818 -18945 13897 45880
7204 45880 30251 12361 -4106 7771 -20629 -33105 -8816 11735 17050 14740 39611 43954
7192 43954 73477 123871 80073 33717 9390 -8347 25671 30586 -1514 -18635 5880 2468
7180 2468 14060 14365 -13021 -18133 -12931 1020 -29383 -37016 -22501 -15317 -9723 -20750 -58475
7167 -58475 -54659 -33373 -11556 -21303 -39381 -21203 -29152 -24300 -7285 -5583 -17488 -29210 -19913
7154 -19913 938 11299 61093 40798 4136 -41663 2355 22581 5198 4959 2204 7144 31514
7141 31514 63849 12354 -35156 -81309 -34932 4926 -27341 5953 5165 6346 56279 95441
7129 95441 39934 11197 7742 37590 57378 62996 29236 -4166 14640 48175 38089 17770
7117 17770 5358 -28312 -19832 -15080 -38225 -77738 -72148 -74906 -73706 -105915 -128537 -112938 -89140
7104 -89140 -64776 -18688 -25610 -56311 -11353 30755 33433 14956 -1818 -11914 -22449 -24653
7092 -24653 -4742 -600 -4762 -5681 2660 8099 46046 46610 -18158 -69510 -23767 3339 -19232
7079 -19232 -28992 -12491 973 -1613 7885 -20124 -11909 -29301 -4570 -10757 7045 -6981 10334
7066 10334 41458 -5543 -31475 3220 -31466 -33845 6185 17531 18137 -7573 -16706 -23929 5655
7053 5655 59081 66866 59509 69006 82225 94346 71973 71600 74307 77239 98587 98196 62263 48748
7039 48748 41848 40634 25592 30389 -35681 -55114 -36854 -7484 21618 5288 -36812 -44458 -39224
7026 -39224 -25371 28921 19185 3634 6676 -14031 -19032 -34125 -36321 -27267 -59118 -83294 -69816
7013 -69816 -58237 -79650 -114308 -68911 -97591 -118380 -104149 -81573 -68866 -55890 -22571 15684
7001 15684 50538 36774 50674 32545 34849 39398 44616 31333 -20632 -98304 -77888 -50067
6989 -50067 -19381 7429 -8122 -20130 1345 12964 2346 31049 34522 5165 -5886 -705
6977 -705 -1308 14947 26967 30079 10086 -24514 -21194 -7473 -6124 -39862 -32773 17511 -13276
6964 -13276 -47796 -52392 -21692 38267 97453 79758 47894 33629 25059 40551 46979 31825
6952 31825 30573 60627 68407 15567 -13184 -17240 8863 10598 25648 14941 14555 -2911 -9321
6939 -9321 -13907 -17579 -33908 -51482 -7262 4661 36323 17990 10294 9404 18374 27588 -23569
6926 -23569 -44687 -38141 -37705 -75336 -67877 -31158 -13143 -15129 -40188 -79245 -90871 -71292 -44047
6913 -44047 6074 13042 12128 -12580 -36697 -24307 -25121 9948 6910 -17307 -6392 40046 23394
6900 23394 -9377 -3893 -15668 -44441 -44026 -66355 -73152 -54324 -31497 -18294 -28079 11273 25259
6887 25259 29079 55872 68402 29990 34160 -4196 -42472 -27257 -13171 -10888 19990 10419 -63295
6874 -63295 -94326 -54785 -31444 -26498 3939 -11212 -30278 -28472 18256 20668 9329 -12827
6862 -12827 -26203 -48623 -17325 3964 -29691 -44135 -18375 15638 3226 18706 38551 101474
6850 101474 90039 51220 52199 98017 55356 39949 57306 61470 -8740 -75855 -61453 -32120
6838 -32120 -26881 -42115 -32198 -31355 -8131 41344 32873 49777 50915 45958 71525 45390 -23742
6825 -23742 -76342 -80808 -37984 -7090 -37452 -60134 -1239 -8852 4032 24088 9102 -7437
6813 -7437 1227 -33620 -4068 -465 -30466 -32701 -31323 -44554 -45667 -50699 5296 21876 -3727
6800 -3727 -1128 26089 24913 12009 -9919 36976 93666 107987 58588 48456 49009 5973 -30323
6787 -30323 -35360 5460 39193 91901 46941 38178 41608 66758 34424 11599 13746 450 -37726
6774 -37726 -6811 32489 47364 17751 18022 13966 -25563 -45574 -54297 -46862 -29467 -33210 -18553
6761 -18553 -24095 -26923 -26631 -65178 -102819 -121497 -108816 -104773 -77997 -29548 4198 -35311 -42562
6748 -42562 15959 30264 30790 34651 2883 -2267 -16178 -3798 16211 4798 48719 92253 121617
6735 121617 81626 53007 -11001 -20763 -14490 -9787 12629 26163 5331 -8639 1444 23482
6723 23482 26418 43890 5031 -23932 -39745 -48098 1846 27394 17127 -13806 -31218 -48618
6711 -48618 -65786 -39230 -19015 14754 26774 -4792 -42479 -40259 -68619 -32578 4835 1359
6699 1359 1856 -20303 -33319 -30103 -40348 -65220 -49896 -33440 3580 34902 41158 18413 4120
6686 4120 -27269 -39426 -12382 33819 83113 82051 45543 14656 26588 30252 30386 19380 43023
6673 43023 32132 25281 28648 -1482 4970 -8470 -64153 -52965 -51437 926 10870 5117 -17501
6660 -17501 -2412 -12553 -10565 20468 37945 6632 -6656 -31966 -22319 21528 55371 53245
6648 53245 34869 29773 3247 9124 20094 17566 -13074 -25837 -14999 -8056 -7228 28474 21993
6635 21993 -24919 -9378 8200 -5833 -13475 -9607 -17755 -64975 -44429 -24353 -33195 -52586 -41934
6622 -41934 -50558 -30460 -20318 -48758 -20715 12695 -4279 -32706 -35949 -12237 -1768 -29852
6610 -29852 -53596 -43989 -59137 -56888 -13232 -5208 10519 38077 13354 15377 2764 -2086 16308
6597 16308 -28257 -49400 -6999 -21911 -28223 -32928 -63997 -47148 -32203 -17847 -76248 -104189
6585 -104189 -57319 13896 34583 21973 25098 8432 26382 25168 6477 -8143 -13362 28224
6573 28224 47062 18727 -7445 -12478 52007 77071 73453 -4046 -15556 -14711 -18656 -45376 -67098
6560 -67098 -48178 -27734 -16579 12991 15523 39896 27511 -40856 -87619 -75425 -43603 -34518
6548 -34518 -66802 -92182 -69677 -55068 -36714 -27694 -11389 -6217 22465 -8064 7473 -4853
6536 -4853 -31129 -33889 17670 -9451 -5995 4214 -25589 -46021 -50733 -46738 -16608 4431 38134
6523 38134 56526 49281 18041 -38619 -46071 -22232 15404 -1640 -19031 -63798 -125466 -107943
6511 -107943 -57692 -35811 -27146 -6047 -1059 -25475 -21844 -33319 -43012 -28216 992 805 -16537
6498 -16537 -46500 -16017 -27883 -52377 -9431 40312 27708 50318 53756 45785 8897 -2225
6486 -2225 11920 31542 8409 -3279 -25601 -9965 -23 -25790 -65921 -69614 -72928 -107606 -92643
6473 -92643 -83591 -81392 -46411 -53670 -38316 4477 7578 29793 1516 -23347 -13342 -18437 21582
6460 21582 -1643 28915 42637 -4268 -11900 -17163 3435 18892 -2981 -14333 -1123 460
6448 460 29982 5707 -4976 36716 64302 52077 12411 10234 22550 15221 -3040 -2899 -12713
6435 -12713 -16303 -19376 -11305 3059 16837 -10605 -56153 -51686 -34719 -71840 -56806 -2434 45929
6422 45929 89614 89957 48788 12452 9119 27705 27260 22585 62308 23028 -16664 -22032 -14867
6409 -14867 -11335 8073 42420 40238 5231 -46425 -18374 4631 2000 -33743 -16744 -2231
6397 -2231 -35879 -45892 -43449 -22960 -28491 -40552 13220 42134 58048 22615 -39733 -21828
6385 -21828 20885 38615 4196 -64541 -76626 -35139 -54180 -54986 -85799 -73529 -52707 -27660
6373 -27660 -16507 -31052 -73462 -74087 -46776 -36286 -42920 -55682 -38508 -54326 -15304 -5395 -20061
6360 -20061 -12477 -11532 -39140 9983 66908 71458 24112 -3028 -25434 -36582 -40369 -25977 -11667
6347 -11667 5363 -17728 -25773 -7410 16051 9539 12322 26718 79138 102793 79163 -3947
6335 -3947 -46723 -19970 -15125 -39919 -41152 -49300 -17390 -21920 32695 22035 -6870 3678 2065
6322 2065 -7421 -8559 20837 48009 78780 23708 -27105 -44905 -22868 -37498 -22654 1864
6310 1864 -3264 9367 37478 68027 20481 -30314 -21959 -35360 896 584 -6684 -22369 -40532
6297 -40532 -28337 -29156 -6790 56668 69802 65462 34566 -8841 -365 21337 19972 13212 947
6284 947 -24946 -40307 -58877 -72773 -23194 -30270 -16118 -13371 -39328 -45352 -46547 -11940 -6974
6271 -6974 -1214 -27889 -34641 -17197 -54891 -89167 -74169 -37204 -66780 -111933 -56731 -29277
6259 -29277 -23331 -3842 -8605 12895 26118 40207 22438 -21853 -19774 -22015 -34335 -44669 -30158
6246 -30158 -34961 -284 11025 38156 24981 -25218 -80282 -48764 40430 57683 7981 23609
6234 23609 19776 17835 36846 7083 -4319 -21884 -32401 14101 67616 32318 -20277 -64471
6222 -64471 -20615 -8526 -1159 -45024 -41887 -1721 22586 35447 67151 15827 5075 16438
6210 16438 37341 25268 48142 45247 44778 32746 47248 65174 55823 -8377 -5611 29945 15758
6197 15758 -16703 -42798 -43236 -1051 19287 42824 -4424 -3713 4969 13060 36125 60836 56448
6184 56448 39486 42549 37144 -18043 -4611 -5885 22349 -13550 -34554 7453 35310 25004
6172 25004 10953 5617 35088 50817 21122 -4116 -24186 -6855 -47163 1873 50311 28865
6160 28865 16518 9659 -9443 -24085 -7138 56987 91724 34623 -707 11964 42478 74720
6148 74720 37990 -7042 -8537 18169 18414 -11352 -1250 19042 28860 -3668 8590 22428 15661
6135 15661 -30730 -33385 5631 7346 10185 -13858 -19004 -15087 12351 -1538 -49256 -58432 -53172
6122 -53172 -30577 -39920 -48240 -11697 -4770 -11493 3072 -4237 2799 27914 38579 16820 30367
6109 30367 49008 34732 -8776 -8102 12835 20618 45692 27483 -1109 -47244 -49898 -18226 33560
6096 33560 40251 -4800 -65221 -81794 -59966 -32053 7132 18422 39229 70169 61061 35513
6084 35513 19242 -1694 -4476 -3720 -27834 -5082 25738 5924 -24817 -34434 -35839 -52960 -66486
6071 -66486 -92144 -68429 -40888 -13837 26123 23927 25751 22659 -17360 -8634 -3610 -28883 -34744
6058 -34744 -53254 -87929 -106883 -56534 -56640 -86924 -67306 -34281 -63253 -35485 -9161 -13332
6046 -13332 -23346 21478 68496 43572 17196 32810 26485 20337 -5422 429 21276 18995 29853
6033 29853 -14056 -41256 -69933 -122091 -66200 -36713 -44637 -32895 -36913 -38180 -24018 -13678
6021 -13678 -3686 -34625 -31846 -33180 -30604 -5839 26607 57654 71317 68990 49692 9699 32598
6008 32598 66354 40366 45974 51804 59081 37390 -2724 -25457 -33836 -9792 -12144 -29088 -26829
5995 -26829 -29009 -21673 -35667 -7226 -43088 -54241 -60881 -53544 -53009 -41197 -7507 26113 19951
5982 19951 37265 17743 -7083 -69939 -54415 13141 23475 13183 -21918 2840 -19871 -58550
5970 -58550 -9227 17222 59206 94113 76173 33692 -40370 -57021 -49488 -32616 3067 -10780
5958 -10780 -10717 15002 51201 51234 22738 -9820 7155 7372 -2764 16106 6720 -23550 -53272 -46677
5944 -46677 -9617 15153 -8571 -9308 12459 185 2302 -6176 9937 5024 48041 56450 61822
5931 61822 8259 515 2080 -943 12684 40544 38453 2304 -10136 -39979 -37761 -34639 -41532
5918 -41532 -10951 57424 70509 37599 -29264 -57629 -63189 -29667 31841 47173 -26944 -36425
5906 -36425 -18524 -6450 19772 17997 -3096 -3539 18899 41633 54846 81329 78302 54344 31626
5893 31626 21715 27068 17750 5639 1540 9166 -48467 -66873 -50185 -31567 2565 45514 68788
5880 68788 56826 47480 71071 49158 48360 61052 31138 7096 16372 21852 4554 -1337 2460
5867 2460 7954 -5121 -45613 -95262 -116214 -104534 -80460 -73643 -56822 -15673 -4459 -15640
5855 -15640 -36036 -24488 -24722 3597 13452 16482 25175 38284 45191 22850 31584 39336 44856 62541
5841 62541 110020 113087 64275 -22768 -58473 -3399 27601 69392 73681 76335 52758 9878
5829 9878 30976 -22894 -38005 -22670 -8391 -26232 -48300 -22706 -10913 -5799 -46189 -80114
5817 -80114 -44229 1228 16593 10765 530 13669 30311 12332 -3396 -2876 4632 -30254 -30698
5804 -30698 -15355 7699 1763 -37731 -27427 -6611 11535 -35459 -49795 -26725 -35748 -58371
5792 -58371 -40746 -7034 -5851 -2102 324 -4767 -13385 -30760 -55943 -38198 -1072 15536 -20917
5779 -20917 -47377 -28607 14678 40393 48091 45868 65140 84239 79660 30818 -14114 -26912
5767 -26912 13263 7794 -40726 -27145 27604 71354 77635 50309 62623 90143 35452 -32140
5755 -32140 -63430 -4018 27386 -22241 -34628 -10930 -140 41087 65240 50007 15077 29183
5743 29183 18609 33966 35089 7513 5630 39754 31921 15034 -25566 -13687 1626 -5127 -10712
5730 -10712 -15377 -35294 -35501 -36729 -3012 -8968 -56755 -95926 -52432 -12557 -39963 -35399 -3012
5717 -3012 2518 23169 21700 -15991 -1310 10949 -8666 -38815 -16667 12522 37321 15688
5705 15688 7642 -9590 -31106 -62274 -76329 -32338 -28246 -39868 -30455 2817 13172 6338 3343
5692 3343 8800 -1542 1060 -22848 -19262 -15739 -5334 15780 6631 -39495 -72760 -14079 4616
5679 4616 35447 29916 20520 -2703 -51669 -43990 -50808 -44449 -35613 15434 52564 73210 53235
5666 53235 35298 28135 17798 8414 9152 23427 25137 26908 -1111 -22701 15641 -8912 -44430
5653 -44430 -44441 -30373 -4890 -12230 -25239 -56315 -81181 -107582 -52277 -20842 -31436 -65969 -81497
5640 -81497 -64715 -8370 16842 43903 47688 44414 35314 17180 -4080 7373 -620 -51987 -63519
5627 -63519 -34546 -13608 -26295 -5961 41941 11351 -23769 -21970 16222 60570 61775 47474
5615 47474 16238 -36790 -54877 -61178 -90046 -100983 -77903 -59413 -46372 2993 12853 7553
5603 7553 -19753 -27330 -8952 -29127 -41708 -58730 -14506 32026 -13113 -59738 -23239 11340
5591 11340 28602 2339 12732 2339 5908 -14688 -41493 -40259 -43320 -51430 -62484 23420 36321
5578 36321 34708 23580 20964 18772 7551 -1945 -16849 4777 -18193 -14915 -28472 -38132 -22213
5565 -22213 21729 6247 19415 43410 56974 36960 35204 41566 -11957 -18685 -12598 -54456 -64003
5552 -64003 -72560 -60042 -7855 33373 54188 -22393 -25744 -57636 -48234 -21893 22489 35928
5540 35928 63823 32129 -20040 -53984 -40164 -12199 -20552 25549 58039 33890 13364 1232
5528 1232 7007 49416 40803 18649 7821 -2980 -12518 -3012 39548 26076 -12356 -4199 -794
5515 -794 -11384 20602 59188 97666 106930 102225 63436 19042 27288 63265 21680 45766 45568
5502 45568 20166 2213 9516 -7302 13745 -35253 -16880 47748 55807 20379 11450 8368 2424
5489 2424 34036 26151 9704 8212 -9159 -29382 -3333 18747 12640 -37343 -19894 37588 47660
5476 47660 24174 21660 12130 13343 37894 -6796 -52189 -75003 -62404 -43312 -5046 2179 -35963
5463 -35963 -32725 -30577 -3652 20171 -18603 -43570 -20770 828 1797 14195 14364 42340 30243
5450 30243 3217 -35013 -57850 -68763 -16738 4142 -44176 -18901 -85 -18110 -49151 -98972
5438 -98972 -99430 -51696 -23443 -3976 15621 4321 -22428 -46687 -43202 -15290 22147 43221
5426 43221 47579 47019 41149 43589 23023 11870 56268 62201 61766 70899 46086 32647 6190 30189
5412 30189 42063 34636 2027 -7623 -4798 -35843 -28582 -16413 1124 -1333 -24198 -38155 13234
5399 13234 45974 80503 74260 93792 119192 64036 23458 -26505 -12177 -32410 -74842 -39695
5387 -39695 -16711 -10914 -16906 6904 27197 10640 -3679 16228 30110 31239 3415 -12427
5375 -12427 15096 26797 7161 26119 47013 49260 18140 17376 11578 9252 13640 -28167 -33933
5362 -33933 -56076 -57798 -52993 -41533 -3496 15869 24765 22983 -37396 -58046 -50100 -19884 13917
5349 13917 -6461 -17431 -20097 -43404 -35571 -68712 -28314 15168 32815 50723 60960 78008
5337 78008 58100 27079 9812 25508 30379 29512 -8955 2536 31764 29202 -272 -13224 -21273
5324 -21273 -31170 1949 5069 25747 45631 57185 19037 12971 33035 33403 68608 91883 119306
5311 119306 76441 -428 -19868 -8085 -4657 15182 42914 43481 39669 26327 -26355 -39657
5299 -39657 -29324 -11556 -9191 -27929 -29906 -24039 -3792 -5513 -42485 -50603 -49174 -78176 -50320
5286 -50320 -29938 32610 14295 -18131 -35420 -48075 -12567 21039 28768 19960 -16332 2499
5274 2499 -27295 -63685 -35079 -1659 35185 36144 24153 29053 33103 21933 7470 -14783 -17227
5261 -17227 21849 46557 52447 41045 20581 26336 -12209 8829 15649 14983 20633 -10088 -51726
5248 -51726 -42174 -38587 -68735 -67804 -47439 -22018 -15293 4781 -45897 -68367 -61099 -15387 -12065
5235 -12065 12095 -6574 -178 24216 49234 35373 8196 8177 -12264 -65732 -47261 -42784 -37454
5222 -37454 -3469 -7127 -4161 -31863 -72207 -46701 -13570 -38649 -34805 -35468 866 40722 42321
5209 42321 45249 45932 33556 44286 49522 84074 83552 68786 51420 30704 31530 30192 8936 -39577
5195 -39577 -30892 6007 48611 66831 14698 -43299 -42920 -14153 11721 34683 33532 -32966 -57271
5182 -57271 -47059 -25211 -13945 6485 36194 49709 22709 16838 32793 60146 50318 31524
5170 31524 65484 55745 14167 -24919 -44192 -19539 -18577 -49945 -39890 25165 43299 35229 16244
5157 16244 -6946 -21258 -10584 -12720 19214 41860 20058 -10101 -4962 -990 11483 -206
5145 -206 -9408 -45561 -28671 -27061 -18081 -3018 15889 32164 13523 8798 -32678 -60115 -45483
5132 -45483 -23702 599 1038 4347 -17366 -33608 -34333 -5060 10691 9066 -10464 7951 712
5119 712 -20414 2770 41108 63593 60496 97883 97609 32667 -27018 -9925 25395 -3859 -3376
5106 -3376 41190 7018 9893 14990 -27942 -61045 -97380 -98688 -56013 -47500 -17204 21401 16644
5093 16644 -19029 -36858 -69025 -57433 -31804 5285 25282 -9974 -24970 -14979 43000 35786
5081 35786 28027 49740 26741 4037 27534 20400 9382 37065 6121 19342 15368 -25925
5069 -25925 -9458 -4709 358 11397 -36252 -30801 14723 6814 -20773 687 22804 -15949 -29496
5056 -29496 -17277 -25338 -22962 22777 29230 26732 41777 -5898 -36397 5916 40447 55836 44628
5043 44628 53011 42497 15525 42861 31595 17202 13313 14611 8690 24567 -3743 -33093 -38766
5030 -38766 -19741 35043 79220 49309 42547 73708 23569 -2671 42989 61051 31181 -9083
5018 -9083 -52550 -30897 33281 69566 52918 49946 34762 6505 -4539 -4088 -10857 50490 65339
5005 65339 84578 52232 -16161 -33311 -38534 -17813 -15288 -13618 -30951 -26927 -28751 -57688 -53403
4992 -53403 -36655 -49661 -74718 -70063 -36411 -56789 -108192 -88274 -66764 -78671 -45057 -23034
4980 -23034 15806 4754 -21401 -12328 27457 -1640 -25849 -49225 -39738 -39682 -28290 -37854 -45348
4967 -45348 -48770 -67386 -77032 -89092 -108356 -72977 -40028 -34740 -31064 24236 20464 -28366 -26053
4954 -26053 5294 -5712 13954 31412 29676 -12822 -9886 -20163 -16361 -41906 -39486 -4054 -9968
4941 -9968 -30566 -15533 -5150 14054 -3600 -24547 -21227 -26136 -15537 -18542 -53724 -49882 -45791
4928 -45791 -12620 29411 10730 5888 28555 27755 11308 22041 47220 9964 -15053 -42179
4916 -42179 -52800 -61166 -29186 -22230 -86493 -95430 -68809 -31307 12672 9370 -9284 -12654 -31696
4903 -31696 -56574 -104177 -66831 30670 43106 28809 38821 31955 -459 21020 43472 31106
4891 31106 -3101 -17857 -28924 -23677 -573 14465 -31732 -41920 -50701 -24396 -1671 -19822
4879 -19822 -24118 17227 -46040 -114645 -91640 -40436 -37720 -20632 -36177 -40992 -19286 -13266 -34526
4866 -34526 -49058 -38904 -48445 -47919 -1025 11358 -13787 8956 -2398 -24490 -21921 14638 32836
4853 32836 25079 25271 59557 50905 48817 89047 77084 56960 48612 18661 -14366 -31243 -27802
4840 -27802 -64913 -66739 -40175 -35848 -27528 -21064 -22568 -24709 -11808 6553 -15968 -18597 -34840
4827 -34840 -26432 11363 2591 -8184 13284 14284 -17758 -46323 -23239 -579 9658 -2797
4815 -2797 34689 41257 16953 40062 83351 76931 63421 39591 -1310 16689 24736 5138 -28204
4802 -28204 519 12984 -23636 -18360 -35967 -31892 -39598 -12136 15801 43044 50634 5095 -19211
4789 -19211 -8416 -2010 36537 27406 9416 -8100 -25649 -23516 -20915 13707 11388 -3845 -40665
4776 -40665 -25183 -5912 -11007 2608 6931 -104 -16995 -4461 -16290 -61581 -41214 -46565 -58689
4763 -58689 -66077 -62506 -40199 -33540 -29196 -35672 -12972 38005 75221 42862 -5120 19685 3870
4750 3870 -3662 -6947 -65529 -70603 -53033 -59021 -50893 -1826 4711 -1465 32643 32195 2227 7679
4736 7679 6358 -18062 37770 93487 107863 58794 35820 24088 12110 11966 -14038 -17481 25537
4723 25537 51570 78130 79089 36357 -3491 15323 87085 65742 34590 10277 -9355 6006
4711 6006 14193 40829 55436 761 11657 42203 21057 18850 22955 25712 23614 30035 36488
4698 36488 1050 13337 4596 -6465 -21693 -14959 -5319 2467 -17204 -35171 20363 13245 3199
4685 3199 14412 45434 53985 37546 17941 -2779 -19695 -29470 -2991 14909 21856 31606 57758
4672 57758 30863 18283 12583 -8304 -15638 -29926 -25336 -33296 -20955 -3187 35025 60177 61406
4659 61406 69725 67173 36385 25098 51170 46060 58553 16991 -8923 11767 26827 2711
4647 2711 11998 56686 44530 22429 -2654 -22750 -25968 -28308 -40437 -52994 -56477 -64108 -32279
4634 -32279 -10669 -12177 -54268 -70139 -38866 -26481 -42662 -64293 -18431 -12511 14164 9102
4622 9102 -13096 -9144 14174 32573 78665 63575 15605 -46054 -49576 -32365 -33823 -12397 14829
4609 14829 12257 30174 33983 24684 4318 13234 32655 55698 30154 2402 -9009 -42138 -53025
4596 -53025 -32068 -28012 -41489 -8979 -8682 -49731 -45361 -20260 10744 14222 -23132 3328 24470
4583 24470 -9882 -25309 -56451 -40021 -30001 -25995 -23808 -4300 13052 -5019 -50410 -88260
4571 -88260 -69132 -9174 23850 13833 4046 44815 51455 1139 -34287 9209 54444 46442
4559 46442 26960 15559 63097 76091 49814 31957 34451 40507 50002 49312 34613 44085 72761
4546 72761 51533 21940 -44856 -46642 -25371 1575 39256 72791 80052 66488 31788 6286
4534 6286 17672 41778 16560 -8319 -12402 4502 -19551 -32484 -21106 -12507 -26698 -914
4522 -914 12902 22994 44174 22064 -12387 -37999 491 53051 62718 19890 -15981 -10200 9290
4509 9290 22788 39727 50521 44858 46401 58328 4607 19331 6654 -26363 -44184 -57507
4497 -57507 -31108 5331 20741 -682 -46694 -30889 9735 30364 44549 19694 40438 24579
4485 24579 14393 22218 27401 -9857 6112 -9461 2527 13283 -6572 9324 51980 29415
4473 29415 66942 69990 22985 -27499 -31034 -52617 -60378 -18183 -46427 -17896 29768 21001 -11176
4460 -11176 -25039 -17877 -17454 -3079 5282 27749 -10400 -24057 -11440 126 -759 20483 55185
4447 55185 17946 -19275 -18908 -21193 -22254 -9762 -30674 -40849 -21722 -33266 -27645 18262 25119
4434 25119 1188 -23228 -38434 -37200 -14810 5478 8296 1948 14551 -6064 3950 31823
4422 31823 20432 3642 -35219 -26901 -67 -4439 -12395 30684 -3204 -11922 -7390 -4546 37708
4409 37708 52359 79921 100559 90925 25451 -32120 -48383 -30976 32523 56392 27051 366
4397 366 24786 26724 11272 27508 24732 1536 -69898 -99360 -75290 -49735 -47317 -46885 -29534
4384 -29534 -19258 -12714 -26738 -38902 -23693 -633 -8315 -17168 135 21098 37953 -1156
4372 -1156 -14300 29821 26780 4811 -26252 281 -16741 -35512 -37848 -14397 -33961 -65921
4360 -65921 -77681 -54229 -32599 -7170 7444 -3604 -6189 -4435 35808 13661 -17742 -35
4348 -35 -20067 -23210 -26285 -18222 -41550 -50367 -46257 -45202 -29513 2536 10242 12354 12264 -10207 -2543
4333 -2543 46302 64238 108921 90610 46598 20420 -5758 -26231 -71948 -89235 -54395 -1675
4321 -1675 8624 32910 37377 18984 32827 48042 35009 30648 5915 -51687 -78220 -61672
4309 -61672 -32439 9978 -25225 -48810 -74590 -69946 -23268 18839 23904 17071 23621 21917 -9218
4296 -9218 -53820 -80437 -91283 -100727 -46636 -7018 -19000 -50778 -54273 -38895 -62862 -57541 -41781
4283 -41781 -49907 -52227 -61704 -5657 52676 76818 44845 28692 -12181 -34863 -55125 -33538
4271 -33538 -33243 -39339 -38599 -23936 -28216 -74248 -87833 -35105 -521 2955 -35107 -39604 -27667
4258 -27667 -54265 -95232 -64068 8002 -16326 -39157 -26667 -6940 6824 -5066 -29155 -14461
4246 -14461 -19042 -35625 -52497 -28097 11968 13844 -11271 -19777 -39034 -46403 -9805 5503 22324
4233 22324 66979 84502 37905 20052 8221 -5472 39957 58780 32186 63314 88518 75830
4221 75830 64993 32987 27549 42408 68981 56558 43001 23415 3987 -36364 -69815 -61543
4209 -61543 18737 24701 28497 45975 27090 -43894 -42423 -38137 -8018 1184 -37383 -17165 19762
4196 19762 23124 36260 -23301 -12561 44857 15919 10298 -12801 -27366 29382 6364 -23358
4184 -23358 -68869 -88677 -103356 -69397 -40340 -54022 -12739 44997 98020 105124 83743 85002
4172 85002 93309 16979 -43392 -26016 -14152 26068 -11208 -64877 -38714 -9670 7736 23339
4160 23339 52638 21039 -36404 -24368 20555 21410 33170 -1816 -52021 -61653 -28388 8799
4148 8799 990 27933 34179 36330 -15125 -37165 -13500 -3024 1311 -16039 23804 30233 3235
4135 3235 -3147 23826 78818 86378 47739 23766 84437 79878 93441 120310 139316 134433 91750
4122 91750 74170 70962 49511 -1596 -43493 -58860 -46812 -63215 -66961 -16345 -23593 -35205
4110 -35205 -24134 -65249 -64305 -5046 -6840 -17966 -62836 -102044 -79769 -65293 -97334 -68048
4098 -68048 -32001 -3239 6811 -8881 -26352 -70080 -29614 6305 792 -4544 -17266 -24271
4086 -24271 -912 -7158 -18772 -11218 11267 59121 40118 -10153 -42115 11658 21861 -4750
4074 -4750 -43064 -28718 18642 16998 99 34977 897 -11003 -39784 -56586 -43104 -31332
4062 -31332 -3172 5401 -9020 11086 8413 -37116 -47240 -40449 -17803 11596 30819 2407
4050 2407 27700 -13948 -49049 -44522 -54301 -49000 -6587 30342 48841 45752 19879 -17099 -40067
4037 -40067 -9920 16599 71670 29146 -10532 -32578 26322 61612 51128 19132 -9769 1802
4025 1802 -25060 -10715 9317 7058 5320 31197 20551 6344 1980 -13208 3421 21719 15914
4012 15914 24529 -14018 -27605 -14434 -33609 -53979 -32226 -46483 -51175 -32055 -11228 33655
4000 33655 47684 35370 33203 -5735 -30079 -31056 -10898 24113 -4095 -51079 -34319 -38778 -66179
3987 -66179 -32463 19030 68124 57321 8382 -14026 -19505 -23584 1206 -353 -23885 -2486
3975 -2486 31495 4585 5916 9563 -2460 6297 5977 -37760 -24950 23994 56277 19449 27624
3962 27624 24314 13191 15877 22681 17507 25375 59288 22473 37519 41565 41733 2856 -23204
3949 -23204 -10366 -15602 -37830 -36021 -36029 -50361 -39259 -5655 -10311 -15088 -26508 -18403 -399 22012
3935 22012 26916 9660 -10587 -41477 -40275 -8512 -5742 -46846 -47300 -58499 -76827 -58080 -58532
3922 -58532 -27630 21853 9236 27929 28039 -5436 80 13500 9153 -39363 -24207 -8648 -5784
3909 -5784 24114 19738 -746 1212 34593 27520 40865 28725 3009 -4457 -20484 -26044 -13385
3896 -13385 28711 1498 -70135 -88182 -84389 -29806 -6574 25437 46055 18124 17542 26362 11603
3883 11603 14331 -45701 -39429 -29448 -60107 11310 68603 39605 -45306 -82381 -61729 -19323
3871 -19323 -11047 -17049 -35878 -83134 -74855 -21804 39157 69184 22414 -57 -34164 -79045
3859 -79045 -59725 -43752 -18630 20555 -14819 -44411 -19942 24967 37720 58394 51205 47115
3847 47115 32336 1985 4498 9305 -6907 4785 43319 23266 46677 36525 -37194 -64091
3835 -64091 -8772 34280 69573 71694 88124 61163 45359 6627 -11215 -17784 -8512 14354
3823 14354 -42491 -42002 -52354 -44861 -31123 -14003 -17253 -24686 -3600 13902 6121 42377 22249
3810 22249 -340 21161 9152 -50656 -59209 -19260 22421 25662 16694 16111 -20053 -63936 -72247
3797 -72247 -75097 -65818 -26035 -14664 -19968 -44872 -25429 41459 76704 26759 -15033 9619
3785 9619 -10654 -14632 2710 -10610 -24092 -59101 -65222 -53209 -12323 31386 21316 -41287
3773 -41287 -80595 -63291 -12129 21628 46263 20577 29311 50766 65195 33244 -19240 -37548
3761 -37548 -45872 9531 -5091 -11881 -3609 -39 -11960 49380 49934 38790 46738 21118 4674
3748 4674 18416 11597 17505 49244 54544 72195 77617 62049 66464 12277 -2617 -33920 -45375
3735 -45375 -2912 44234 12879 876 -14429 -35755 -34345 -17182 -17996 52469 113450 113628 98467
3722 98467 33644 -7114 -5581 14122 -19792 -69996 -71083 -54661 -29425 -3718 -85964 -116087
3710 -116087 -93047 -41327 -38865 -47167 7551 42958 54097 74461 50629 36767 24294 40825
3698 40825 72911 47888 33812 47579 65952 38287 22944 6960 -62069 -126986 -131036 -70542
3686 -70542 -46267 -30817 -2157 -24755 -55680 -56777 -27556 -39679 -25668 43794 66421 47069
3674 47069 34505 71552 64786 12604 7420 -30863 -68865 -23364 11289 -287 -574 6283 22507
3661 22507 13081 8163 19464 22322 -3531 -51715 -30320 -3303 44747 67047 55444 17171
3649 17171 -15327 -19538 -36381 -20931 29090 39683 2164 13967 -15565 -47751 -4474 21517
3637 21517 19658 -11385 -48890 -64268 -46351 -48556 -56075 -4082 -21850 -39981 -54039 9908
3625 9908 35177 25307 18981 12977 -23500 -33005 -24006 -20567 10752 -3101 -31421 16865 56345
3612 56345 16817 4665 2535 -2121 11671 -5612 -50856 -42479 -16366 1604 -11553 -6431 16033
3599 16033 34853 20354 15280 42994 34068 -9721 -21347 21385 35185 39722 33283 -2964 -12122
3586 -12122 -33485 8432 20930 -1081 6225 57420 101146 127329 69356 12848 -787 -46686
3574 -46686 -77275 -63613 -41596 3572 14806 -16202 -1995 20189 56174 64672 71099 69981
3562 69981 33590 7084 14769 36945 73580 60166 59397 54501 55295 15211 10531 -10113 -28043
3549 -28043 -17828 -30212 -34645 -4609 4194 30014 34232 -1969 -12302 53229 74201 82032 34525
3536 34525 21189 29309 2369 -4747 -14600 -13328 4552 19082 16796 -16643 1329 -2675 -1832
3523 -1832 -4562 15205 75340 67155 52813 1874 -32255 -2757 37213 63226 36398 -15609
3511 -15609 -29773 -4331 2806 -38947 -31937 -13370 24962 17108 14183 9343 4948 -1355 -28155
3498 -28155 -30782 -41981 -32572 15987 24235 12421 56395 56965 652 -39545 -29915 -26868 -48893
3485 -48893 -28831 2190 -24000 -56496 -23376 -2724 6000 22807 51059 59194 9254 16648
3473 16648 100 -48129 -33746 3104 39441 66232 53142 -6775 -14185 18261 43395 65165
3461 65165 73827 45598 30666 13348 -27667 -10526 8110 37795 54610 39537 23615 12832
3449 12832 3451 20753 27408 25871 6177 -7365 -42937 -31985 28880 39843 -25 -31860
3437 -31860 -58893 -16222 -5398 19476 51678 81172 97910 56592 50350 5284 11612 44674
3425 44674 50265 50840 40577 15297 19249 22980 6194 10352 19739 10467 -12429 2442 26774
3412 26774 6967 28689 9168 10590 -2665 -5651 -47100 -73665 -71011 -30192 -18348 -40480
3400 -40480 -38730 -38224 -28193 -40368 -27123 -20046 -12980 2218 4213 30831 66605 116885 87471
3387 87471 70070 66208 40331 59019 55869 14345 -500 4478 28811 7261 -39321 -27691
3375 -27691 -55885 -70019 -37468 -8802 10413 4406 -20605 -18020 -20621 9320 -12596 -51392
3363 -51392 -37354 13333 -4748 -10937 -45402 -49856 -60710 -57339 -76187 -79809 -37681 16768 33571
3350 33571 31600 24816 1880 23207 36048 31637 25369 31057 49238 67808 32790 33077 17926
3337 17926 -4243 -23334 -35197 -11292 -36089 -58786 -63000 -57828 -26094 -35473 -62276 -64741 -65982
3324 -65982 -34772 -11504 -33413 -49952 -57481 -82613 -71770 -58482 -53245 -31077 -38078 -57262
3312 -57262 -56268 -49887 -26651 -10372 -60276 -32021 -34985 -44425 -41976 -47987 -54623 -66994 -56084
3299 -56084 -41143 -10174 -7868 -36608 -44384 -18801 -3559 42683 59697 42980 52007 58165 37358
3286 37358 9761 14081 30004 4522 -7952 11516 870 5728 -8871 -8402 -1608 26760 7727
3273 7727 -32470 -45569 -61045 -53805 -12874 -48878 -60370 -60574 -61102 -50816 -26147 -45915 -52851
3260 -52851 -61009 -41856 -71773 -64137 -11771 8110 6196 34217 23962 -26819 -13026 -9585 -24232
3247 -24232 -42709 -36468 -18408 -33498 -56686 -50545 -22069 -38764 -20724 -21539 -18073 23775 30975
3234 30975 14027 -4653 -962 -31845 -32956 -6019 25882 15225 -41163 -33437 -25037 -11956 -23713
3221 -23713 -22965 5624 50637 78144 91259 71276 65121 22780 27560 39816 21106 -15523 -8706
3208 -8706 10071 40045 58355 47867 33765 7441 3159 -43045 -17073 21925 57959 57769 4191
3195 4191 -37136 -46155 -4808 35600 35388 20293 10425 71079 90997 48608 16618 -4479 -28822
3182 -28822 -49161 -59637 22486 90651 59463 -1869 -41038 -52235 -43736 -6168 -20377 -86187
3170 -86187 -83778 -39014 15992 44915 34355 57591 55773 9246 -27968 -26968 20233 16287 12138
3157 12138 27346 29681 -3021 10803 29506 63882 89136 72286 33333 -11144 -43307 -32414
3145 -32414 -20417 -58316 -76331 -79554 -69288 -5147 17179 74666 84537 54552 53277 58782 38505
3132 38505 -25541 -46436 -34588 -24969 -55288 -88911 -124476 -120224 -89409 -38978 2157 10588
3120 10588 57905 69067 34090 -2075 -2313 20516 57251 40561 10082 34524 8874 1098
3108 1098 57982 35535 -1554 -18905 17111 33867 54742 13864 -28468 -16253 -11435 11324
3096 11324 3931 -27257 -27637 -56275 -69394 -2277 24236 -21630 -19999 -1019 -15749 -10348 -8860
3083 -8860 -42366 -29670 -23042 -11277 32195 76024 57592 6537 -18633 27267 41178 21689
3071 21689 13261 16615 11739 -28963 -47846 -50936 -16682 5329 35592 67563 76712 50888 14586
3058 14586 -11871 -4129 8635 19704 51129 73829 74380 44315 6116 -31770 -50038 -48360 -34622
3045 -34622 -14890 3577 21149 44109 19495 3214 12445 21086 -19084 -31322 -11351 -13209
3033 -13209 -34215 -20979 24374 40476 60971 62268 47488 59189 26899 49875 73685 82490
3021 82490 10297 -16220 -21382 -23594 -25596 -42699 -46300 -31137 -34312 -32230 -3794 5221 -14798
3008 -14798 3236 14630 49100 16671 4228 13725 -31238 -23362 -37771 -44951 2955 17688
2996 17688 -43148 -46623 9821 59515 34240 -23307 -41541 -21852 -10800 6370 29729 6690
2984 6690 15625 35837 7925 -12429 -27564 6546 6491 2372 43555 60666 65747 55983 9604
2971 9604 -23170 5572 4475 -16438 3474 29957 68018 100739 64307 23648 -3561 -3366 30206
2958 30206 13471 -20754 -16687 24057 55089 40245 7927 -8435 -22067 -49725 -74253 -93025
2946 -93025 -60590 -19760 -47178 -33176 -35747 -51717 -57425 2747 31768 22161 -22123 -38962
2934 -38962 -36718 -3114 43699 28700 62 -13825 -2422 -11210 -4680 -16839 4860 4803 -22631
2921 -22631 7020 2988 -15529 -38563 -19679 9763 15248 13169 16997 -4724 -28484 -42913 -59245
2908 -59245 -31204 -24816 14047 63624 66757 67727 82411 77312 80720 67100 15651 -23035 -13415
2895 -13415 59496 67742 14613 -22676 -29602 -45779 -22948 -23213 -20538 16234 42215 71494 79141
2882 79141 -3344 -18509 -4957 40004 60330 54664 35144 59245 54872 28454 -7976 -48871
2870 -48871 -13203 -19823 -53399 -63468 -30788 -48465 -19758 -4381 5596 1529 18848 19196 7882
2857 7882 2485 32899 37246 17688 -33192 -66941 -57826 -71620 -26434 2439 2971 -2289 -4300
2844 -4300 -21585 -48728 -43151 -20821 66691 108486 112969 47944 50351 69169 28257 -8195 623
2831 623 1027 11070 30717 67573 74802 71263 48645 41339 41434 60853 19252 -6680 -20089 -33783
2817 -33783 3436 53230 79244 50065 52309 32913 21217 20661 13722 -20057 -11333 -9185 20808
2804 20808 42420 31769 11784 -9539 -8339 7613 24784 5157 27974 29499 26968 26844 18398
2791 18398 4090 -6129 -5956 -3520 9348 -6069 -63586 -80789 -92230 -103747 -95012 -80420 -19959
2778 -19959 -26034 -48227 -76895 -96165 -110871 -116350 -110050 -61538 -19651 -9767 -16071 -19181 -15464
2765 -15464 7560 20974 2618 21732 15864 27971 7094 18212 -23694 -30850 -2000 11478
2753 11478 -12203 30834 26665 2036 3223 -123 -13974 -4988 -26137 -54869 -49438 3135 37568
2740 37568 73615 53922 68587 73767 45700 55925 12579 -10116 -17471 -50686 -93473 -84032
2728 -84032 -62662 -39872 -12515 9008 -26965 -38349 -60963 -23855 9221 35434 4331 -20420
2716 -20420 -35082 -19272 -16967 16499 25297 13497 -4921 -36780 -35946 10389 51590 67524 22472
2703 22472 32324 28364 24065 31979 44002 79829 69498 56010 28511 -16785 -67703 -66295 -40825
2690 -40825 -50766 -53973 -70540 -34553 -8904 -16701 -32088 -48652 -20208 5454 34883 50044
2678 50044 32765 33268 -17757 -59478 -68958 -47528 -3114 24167 24338 75347 85543 75255 36026
2665 36026 -29045 -58205 -63965 -61320 -44589 -64309 -37368 -9876 27844 2426 28653 65687
2653 65687 48530 -24538 -37854 -7838 10759 25264 36760 51582 41496 26746 59475 41152
2641 41152 -3260 -15591 -10343 -17981 -52238 -6135 54916 57966 51063 32476 40665 20194 11027
2628 11027 11497 24967 32112 36775 17226 25810 46155 72499 57674 58131 38282 -10788 -49247
2615 -49247 -39023 -39495 -38417 -16055 -38894 -56023 -80538 -78039 -59732 -34788 -11486 -3131 20652
2602 20652 49748 42361 18639 33127 41548 43857 2503 -35443 -51095 3128 50926 23746
2590 23746 27890 79119 42815 -13736 -35012 -19506 -19772 -16864 387 -11653 -5199 11934 -6475
2577 -6475 -5842 -3276 -80 -56384 -24825 52395 38776 21362 14851 43285 54460 59860 71868
2564 71868 69736 98165 125224 121242 106818 110541 65134 11092 -35849 -50234 -53400 -58462 -51721
2551 -51721 -7854 7809 4514 3099 25153 47522 -8242 16463 37928 33897 38633 12628 -13150
2538 -13150 -17717 4525 12226 3427 12152 37277 24311 -6539 -38431 -11731 6249 -1468 -26533
2525 -26533 -25526 -3760 -11771 -39424 -4477 6427 11622 11584 -17488 -19706 -2128 -25002 -45927
2512 -45927 -51472 -18570 -30115 -43078 -18892 16429 20748 10162 -4770 -10671 16541 48896
2500 48896 15329 4689 -1828 8323 15161 3904 -16019 -17517 14270 32724 50415 56263 -21551
2487 -21551 -77214 -84923 -54244 -35520 -26097 -22058 -46554 -54381 -58906 -60425 -43045 -25067 -3201
2474 -3201 5725 -29774 -46335 -49236 -26809 -25515 13983 7382 -22938 13611 65288 42580 -7387
2461 -7387 -2616 16400 13757 28313 27508 2556 -19156 16359 -9678 1448 -17114 -30834 -229
2448 -229 28821 23252 7961 -6850 -71174 -68663 -57439 -65543 -39554 11472 5033 -15981 -28378
2435 -28378 -27317 -19070 -30109 -17024 -41279 -47089 -30149 -52316 -40499 -47708 -19839 -5160 -28283
2422 -28283 -33076 -44834 -25038 -16037 -21758 -47814 -68120 -46100 3952 35892 8249 -2804
2410 -2804 -18397 1257 -1722 -11558 2284 25937 61013 118821 108575 65187 23901 -521
2398 -521 -25398 3225 19826 43046 57753 -6737 -45084 -14527 39594 65914 51322 67818
2386 67818 89297 25838 -44837 -61496 -57106 -40026 -32294 -50159 -16312 8589 -22452 -5632
2374 -5632 -7525 58084 114288 118723 94337 42196 -40685 -54624 -49063 -22248 1135 -18090 -9791
2361 -9791 -12053 -28098 -21047 -13199 -12217 -206 13122 6506 -606 14029 21331 -7041 -13097 -12934
2347 -12934 -16802 7742 46885 -15518 -114999 -122005 -60875 -9472 -34400 -44702 -63880 -59228
2335 -59228 -62512 -92644 -96052 -100980 -77118 -34584 16199 -31415 -63379 -77695 -51404 -14384
2323 -14384 17955 -10246 -12869 -18098 -28534 -34237 -27918 -25510 15038 37119 49498 36570 11661
2310 11661 -24365 6426 39691 14799 -18367 -43818 -19964 37943 52296 65196 68726 23685
2298 23685 -1662 -3962 37245 36428 5971 -25616 -26439 -11380 -6668 -4114 -34566 -21190 -4305
2285 -4305 29667 46476 17330 26107 45721 29828 22021 24065 -22419 -36132 -35502 20823 57208
2272 57208 39536 42223 -17237 -55052 -73062 -50633 -36790 -13378 -18505 -27807 453 52254
2260 52254 37199 30624 24266 14934 30149 -3209 -36514 6989 29515 27014 52616 52973 10258
2247 10258 -20397 -20336 -63512 -74811 -87071 -63587 -19811 -6638 -4512 243 -28460 -31492 24258
2234 24258 63504 70604 83083 83235 49554 8147 20827 25115 27920 69884 66345 30426 -12229
2221 -12229 -12752 -23259 12278 44695 31493 31600 40135 10643 -33639 -20745 18110 27952 51709
2208 51709 55866 89361 73602 63394 51526 38464 22624 23133 50831 73397 23974 11085
2196 11085 -6308 -6932 -30629 -23808 15202 -453 -2024 9281 -28816 -28275 -40226 -57236 -68867
2183 -68867 -56749 -30010 78699 113298 128252 93309 43515 57580 91300 106467 92452 74382
2171 74382 69285 27701 -22632 -48411 -44057 -53661 -20167 10522 29057 60176 67908 39460 29912
2158 29912 36120 10585 7558 45256 14834 7673 11553 63091 38268 867 -3060 9976 22352
2145 22352 28411 10431 45883 23033 2781 5984 10204 30174 43364 41735 44264 37015 19910
2132 19910 39589 -4606 -64190 -28370 22798 16383 37025 -1983 2316 21772 -1881 -22247
2120 -22247 369 11833 24982 47727 20385 -8465 10390 46102 69536 53773 65016 34387
2108 34387 -1433 -9426 40942 58718 15630 5361 323 -28444 -40675 -47589 -41776 -28933 16609
2095 16609 47435 58221 28476 34938 30163 36183 12751 -592 -14828 -50648 -71467 -22158
2083 -22158 3922 34980 88023 74045 7898 -28082 -6249 4547 3726 55612 64097 60524 40813
2070 40813 23962 41103 25446 -16214 3239 48692 25946 1543 3218 -11512 -10550 59859
2058 59859 54448 6573 -17216 -20380 5169 8508 16004 11086 -4161 -3962 10350 21399 17655
2045 17655 15574 18427 7269 -16892 -58184 -41746 -23061 -17164 -29050 -5109 34452 2433
2033 2433 -23212 -4455 52153 39208 58684 41470 -3886 -10541 37155 88367 73658 51620
2021 51620 31493 1169 -23665 11272 40333 13591 -24824 -24408 34363 37648 52912 72689
2009 72689 45927 -30025 -11847 44929 -14609 2107 50981 44702 15513 16149 25949 22371 -2272
1996 -2272 -29987 -27923 -7532 13995 22241 45947 19093 5816 11223 25390 -12681 -18297 -45042
1983 -45042 15782 69453 73851 72293 51417 -2317 -19451 -68205 -90124 -75251 -12635 14263
1971 14263 38101 17204 -20842 -48027 -49368 -34009 -17887 -30340 7594 47365 65053 79774
1959 79774 95522 90950 63499 30091 -4620 -8617 18399 33468 -23593 17601 67380 57852
1947 57852 32383 16329 55083 84155 45278 23029 22093 17681 56903 42260 2855 8598 26861
1934 26861 -17042 -59797 -88317 -69755 -10458 5433 -15686 -36137 -73376 -63296 -20601 2083
1922 2083 -21683 -29321 -6410 34721 39107 28971 48330 33603 18819 -9037 -55599 -62694 -30992
1909 -30992 -55927 -44222 25991 43806 60921 62721 32552 -1601 -12747 -28354 4260 24094
1897 24094 8807 8583 10126 29448 66982 33466 992 -21846 25146 54570 866 2162 32958
1884 32958 80577 76332 49942 26707 16160 45686 86068 76332 62135 40539 34663 45765
1872 45765 66557 28747 30522 51287 36555 17245 9540 23896 42821 39118 -33395 -36079 -698
1859 -698 21155 28493 34986 35586 48890 59440 38928 31251 -3519 40639 44244 38244 95628 57792
1845 57792 36125 38805 54544 50338 20140 -35862 -54079 -61238 -102041 -90571 -40836 -26266
1833 -26266 -41423 -39796 -13888 -19663 16809 43265 28702 37874 8619 -14700 -53016 -43133 -3983
1820 -3983 -35455 -4383 29336 1893 15453 68139 65452 15742 30066 34438 32617 29142 14960
1807 14960 -10196 -50499 -74395 -79938 -40588 5818 -5140 7590 53805 26525 -8388 -423
1795 -423 24651 24960 2219 -18535 -22347 -4128 -8430 -42197 -23719 6545 -5967 -5031 -2530 5172
1781 5172 35827 35528 42505 9865 15443 68172 85672 73323 96645 126270 104832 81719 33760
1768 33760 26582 886 -13604 -26200 3955 43970 30273 -10359 -12905 7106 -14968 -32887
1756 -32887 14762 11968 -47580 -53433 -25346 -9799 -42513 -40723 -22106 -8173 16253 9665 15261
1743 15261 35055 26510 -6119 -14181 20661 23788 14369 23541 5749 -12418 -28529 -4076 25224
1730 25224 23803 10482 -4858 -1781 -2806 2475 35362 14745 -10049 -12905 12905 -10120 -24735
1717 -24735 -52183 -83448 -71051 -21279 33249 34847 -10678 16960 18067 -2452 17632 11871
1705 11871 34189 42667 43777 63355 67116 24680 32143 54324 98053 53690 -12050 -74237 -61482
1692 -61482 -37028 -40346 -22817 -37433 -49182 -46097 -21648 -28629 -44616 -63089 -74491 -48066
1680 -48066 -23642 347 19958 -14160 -31375 -18802 27552 84373 124587 121989 70635 42840
1668 42840 39123 20249 12391 1769 6259 2814 25584 85295 68753 7148 -6749 -8080 -10844
1655 -10844 921 2414 -10036 -40807 -64772 -33164 -8415 -45410 -25374 41220 25933 -36414
1643 -36414 -28757 13301 5510 29282 31335 48273 37550 34755 48528 66677 46054 -12858 -46069
1630 -46069 -11458 -18094 -34102 -50470 -46571 -33519 -17366 -46816 -35875 -4413 26874 29383
1618 29383 38803 38742 36959 -665 -33747 -25427 -18838 -7115 -60121 -43825 4676 -9328 -29702
1605 -29702 -48064 -75735 -82629 -70025 -55044 -37052 -32472 -17884 13344 12314 -4532 -22347
1593 -22347 -16167 -3235 -17313 7932 15854 29697 25431 42556 14180 -3258 -1188 36854 -18259
1580 -18259 -65404 -60712 -37798 2852 -23395 -5175 -3210 -23932 -17733 -22055 -24169 -41172 -5993
1567 -5993 28431 25525 21191 3227 -20555 -7013 8269 14624 27964 -2745 4551 24369 202
1554 202 -4115 10624 30707 52859 6868 25753 73079 69944 47949 30563 56771 67387 33642
1541 33642 21336 5719 22861 -4058 -31479 14549 20863 26351 46451 44631 41598 29398 -11699
1528 -11699 -19340 -28096 -14119 25790 14114 -20006 -15313 9402 41990 35059 18127 -17875 -19611
1515 -19611 -42224 -43320 -15161 -29873 14981 30010 18268 -16757 -77638 -33342 33040 11645
1503 11645 5169 -17013 -22800 -17126 -28778 11362 35411 13485 910 -587 -5945 1221 -12693
1490 -12693 -27248 -29373 -41809 -52722 -17184 14299 -18822 -48210 -72481 -42243 -12063 -51356
1478 -51356 -106995 -109979 -76257 -62139 -42980 -40279 -31229 -55097 -28801 -30895 -34911 3323 43296
1465 43296 844 -6549 -34214 -32349 9085 38538 70508 106788 62342 12306 15219 507
1453 507 -56409 -103451 -64823 -50357 -37278 -27207 6858 49403 60203 41054 19165 -5276
1441 -5276 -45904 -74588 -38310 -19944 -38572 -12204 6705 4306 28891 42965 -10438 -46982
1429 -46982 -30974 -50527 -101778 -89463 -28265 13397 3838 -21400 -26389 18145 11908 -704
1417 -704 5162 -10487 -44109 -69926 -59596 -56515 -29603 -7160 -33798 -33303 -41350 1680 67428
1404 67428 68440 86191 46077 28241 29499 5588 -42530 -9588 22469 27662 644 7049 19516
1391 19516 21405 12622 -24749 -42582 -26607 10928 20244 -13424 -42703 -40161 -7604 33888 11759
1378 11759 4852 19381 35481 26407 -17406 -54345 -31366 -26680 -43889 -16247 -44248 -37516 -14139
1365 -14139 -23659 -16161 -19552 138 16176 23897 63012 95771 102048 52471 2224 -21102 20532
1352 20532 64436 66767 8232 -39418 -19521 38578 38181 -16302 -20386 -43202 -52370 -57436 -56820
1339 -56820 -28463 -12447 43370 31374 26621 13484 22247 18707 39372 21524 19188 38820 10683
1326 10683 -6101 -110 -1244 -29078 -6909 26553 17358 37498 37594 18464 39009 60695 31594
1313 31594 27064 -12359 -12338 -2872 -9802 14580 18960 65627 55515 14624 -11659 22734 23776
1300 23776 44841 53123 76068 62343 95627 74941 54153 6611 11702 30200 44647 68350
1288 68350 46332 36867 19440 6199 -9808 -58479 -53728 19396 21270 -14568 -1332 4200 46354
1275 46354 46012 34103 55081 81339 56720 22297 -24719 -64758 -78333 -31938 6074 -11350
1263 -11350 -5925 -14539 -7525 53416 38692 11849 30290 68513 32750 546 32769 61275
1251 61275 23130 10599 72636 83270 93985 63784 -17488 -11549 -15070 -29217 10626 25673
1239 25673 13858 26411 35051 52104 40184 53595 31703 18485 39042 74559 76526 56504
1227 56504 16886 -6484 -17473 -21750 -11423 -1560 13465 1025 -9035 9210 76180 104175
1215 104175 55819 32510 40478 76040 50720 24987 25402 16704 -11073 -32170 5632 14349 19562
1202 19562 47397 46717 29703 46524 34354 5407 -11145 -21116 1358 -7388 -23251 -21050 -26572
1189 -26572 -32784 -42427 -53041 -8473 3043 -35018 -17354 6504 37858 52949 44172 44659 61762
1176 61762 21508 -13490 -41850 -34455 -13191 9172 -6148 -34662 -21427 -1298 6902 -11925
1164 -11925 -1830 -551 19612 19356 -17666 -62026 1253 36318 35299 14764 12861 61081 56309
1151 56309 52179 41977 16281 16869 6834 18093 36057 51547 19393 -35949 -26927 -22874 2655
1138 2655 62673 40642 50187 45895 22648 30919 36449 24207 35928 23583 5646 17712 -5755
1125 -5755 -5760 -39943 -37019 -63501 -86839 -68372 -29051 -12599 -8296 -1815 -20105 -51882 -65936
1112 -65936 -47257 -45931 -63700 -39516 -19748 -9206 -55514 -25889 -5636 -3299 -26318 -22935
1100 -22935 -15809 -22544 -23942 -8280 -18680 -22194 1158 36912 35623 8388 20080 27362 47854
1087 47854 17240 21288 -7825 -15072 -22113 -37598 -1941 40727 16984 22800 -9277 -35021 -52386
1074 -52386 -84855 -61771 -30305 -47320 -32859 -25067 -23597 9065 17688 7847 -56243 -106792 -51578
1061 -51578 -88552 -102428 -68064 -19735 2318 -8981 -17219 -41340 -18480 18702 58666 45204
1049 45204 28680 18433 9134 27319 29202 11643 -3280 -3463 33156 30203 24942 35816 42982
1036 42982 19922 -4207 9838 18979 -8915 -36751 22083 56238 5206 -17551 9896 3540
1024 3540 -23306 -26491 -18309 -24450 -57656 -61001 -55199 -22552 1796 6065 6231 -27181 -66905 -42374
1010 -42374 -28428 -56563 -58137 -51293 -65200 -59381 -37698 -3199 12043 -13851 -52329 -54980 -48278
997 -48278 -44888 -72290 -114710 -81377 -65778 -32125 -8726 -30169 -61122 -54743 -11296 -5825 -22567
984 -22567 11045 34484 38806 24031 -26452 -36309 -45335 -9752 10065 -17429 -9190 24700 53754
971 53754 14463 -26674 30693 30862 5454 22789 27649 29162 36451 -11700 -37479 -49771 -10179
958 -10179 -16177 -6025 12886 -4555 -32746 -26800 -23546 -8685 -37147 -31003 -9490 -53690 -27498
945 -27498 -6975 -17719 -46486 -42551 10921 55592 83853 38812 486 22023 34933 35290 -13338
932 -13338 -9425 11439 26043 14087 38727 37725 1502 5419 37646 22866 43899 52868 42145
919 42145 81190 114054 93964 44004 27287 4921 16086 12068 -27108 -110104 -98868 -45521
907 -45521 -35725 -8835 17192 8072 11998 5551 -4481 -33446 -63140 -38347 23581 54373 3323
894 3323 -32315 -2507 -1778 6808 -36711 -53603 -59519 -11231 26979 12387 -11675 -83349 -72105
881 -72105 -33660 -31046 -31369 -24853 -6172 10602 -30864 -47081 -35826 -5854 -10051 -16255 -21589
868 -21589 -11272 12259 -14977 -51552 -46013 -74063 -123411 -98705 -58619 -52070 -22148 2859
856 2859 1767 -20214 -16752 -30042 -25364 -37842 -17659 20035 20246 16937 -1974 -26546 -32977 5631
842 5631 34479 32221 46363 7151 -27020 -19997 -5186 19872 45600 27829 -36796 -68382 -55547
829 -55547 -34736 1149 10915 -28408 -85202 -82493 -83656 -84174 -42430 -12179 -33937 -53237 -10260
816 -10260 24742 5210 20773 -12352 -17081 -14312 -39919 -66573 -81278 -75811 -54741 -6036 790
803 790 19990 20339 -236 10901 -14327 -33956 4597 7175 -12955 7462 29672 51081 28736
790 28736 1131 -15798 18439 33348 79501 118667 70310 17744 7905 41429 43466 31690
778 31690 22796 -18943 -47782 -44731 -31254 -29008 -2758 47785 36340 -16485 6785 33477 38575
765 38575 14250 -61525 -61406 -70245 -9556 12885 13237 -8057 -5555 -22010 -27895 -40215 -38751 -39350
751 -39350 -30153 -37780 -44889 -17525 -7595 -35369 -21277 -2392 17568 25493 -17789 -44553 -18583
738 -18583 -44729 -35005 -30113 -19096 -44629 -96857 -118771 -134735 -134150 -88822 -27243 24493 16619
725 16619 -8362 -1133 5813 -24996 15817 41075 41489 6011 12838 29954 8982 -6021 -27849
712 -27849 -28337 19649 15733 -2259 -14457 -38884 -96088 -109157 -60034 -5681 -17509 -961 15090
699 15090 24727 58598 33145 25495 16019 52001 93542 36104 -74660 -44614 9591 19439 -7494
686 -7494 -1878 9365 -14286 -28708 -27912 -8223 -40318 -46772 -48797 -11729 -16307 -36996 -37395 -43543
672 -43543 -76186 -75129 -38902 23980 73845 83178 40900 23993 -436 -4683 -18594 -105649 -90505
659 -90505 -10193 42595 30685 -3401 19081 16908 17304 -2498 -1473 23834 69235 36521 -33018
646 -33018 -56247 -5029 43807 20054 16263 24349 14576 16587 -7677 -38802 -26824 -14241 -70195
633 -70195 -44085 -36526 -30545 21181 23465 21793 -42211 -88794 -72125 -27693 -347 22548 18377
620 18377 -16775 5118 16988 19604 28210 29852 -3718 28106 28243 12594 29821 16354 2882
607 2882 16152 45944 76906 59273 34627 20142 24929 10393 24417 48227 25722 35630 20982
594 20982 -47799 -24291 36182 26979 20598 25229 28031 35522 13845 -32461 -71332 -74373 -80373
581 -80373 -32231 -26869 -15347 -5903 11431 8481 14928 -16513 -40594 -10597 16474 23355 -37732
568 -37732 -107999 -128757 -105869 -66982 -22694 -331 -25635 -23979 -631 -18787 -12013 -9435 -21315
555 -21315 -61108 -63201 -36116 -10281 9523 32713 5266 -42483 17528 37366 -3473 -53885
543 -53885 -57871 -30753 -55572 -58187 -34856 26179 39151 41261 22839 -12162 29326 52010 63872
530 63872 63095 26211 15944 5010 17438 6234 6373 -45332 -39321 -47807 -93949 -57922 -31811
517 -31811 -31897 -13902 4465 -17068 -21220 -42815 -113752 -122564 -81665 -57676 -19339 3921 -17354
504 -17354 -28063 -27594 16799 36259 42425 -4874 -80086 -83217 -22211 29774 63442 58282 18253
491 18253 -14933 -23120 -12774 -16533 11698 22552 -59150 -102318 -63128 -43047 -42634 -26528 -31201
478 -31201 -15360 -5918 -27308 -59374 -63392 -39456 -50036 -78443 -92232 -45653 8859 22590
466 22590 -13197 -15103 -24928 -21668 -35694 -59211 -64893 -34727 -24434 -26108 10978 18884 4947
453 4947 -4002 10635 10196 31378 -274 1586 9898 -2897 -38751 -60822 -80726 -74574 -5095
440 -5095 6690 1298 -36827 -77779 -63646 -17238 -39586 -58103 -50947 -56081 -69179 -58331 4747
427 4747 7142 66243 73037 42344 -20074 -58741 -63549 -21048 9033 -6791 -11328 -29879 -41216
414 -41216 -48968 -31490 -35084 -25945 -23550 26569 59315 59281 61963 48759 30559 26809 46515 68264
400 68264 20982 -584 -11327 -26756 -26518 -26246 -11784 9318 15986 22299 -11977 -10273 -3328 7564
386 7564 23282 34848 -22147 -16675 -5892 -10728 -4866 125 8265 16048 38338 67025 50034
373 50034 37832 67736 93705 54943 63715 47193 10280 -41184 -73615 -64124 -31146 -126
361 -126 10532 8665 -38788 -52459 -36576 -46810 -57403 -35203 2613 -30882 -64969 -61165 -22075
348 -22075 -33697 -40766 -10514 -1452 23290 43049 16559 -27198 -28087 -44388 -47274 -36047 9618
335 9618 836 -2455 -25526 -30681 -36934 -42720 -53787 -24994 -358 20334 30191 27584 -2102 -26570
321 -26570 -50097 -35184 -39532 -33231 -47986 -26651 20172 25732 32970 -14654 -41454 -48531 -22688
308 -22688 5585 -23057 -44905 -24532 -27723 -5792 1756 -27993 -33479 -29823 -30458 -339 2864
295 2864 -13984 -18929 -18531 -37823 -74171 -32490 3748 37176 56999 19362 1463 -30224 -62633
282 -62633 -71705 -84559 -87836 -62579 -1381 13963 9109 995 3415 44339 62303 22213 -15029
269 -15029 -28954 8754 40123 62930 78046 45936 60519 50311 4325 3005 11259 10320 6977
256 6977 -3519 -6810 -13442 -3379 25722 15859 18768 30611 22770 20339 2898 -12065 -23346
243 -23346 -5076 -6332 6611 18698 -790 -587 -38534 -34683 -22718 -24582 -12077 -20589 -26813
230 -26813 -31581 -4468 -10328 -12499 -4945 29992 61132 52968 34258 7106 -37863 -69842 -60933
217 -60933 -19324 -9986 -37823 -81087 -93688 -63985 -54254 -53283 -44038 -31621 -14332 2058 -9450
204 -9450 -50 -13609 -18555 -20867 -14276 33057 21046 6586 -13642 -12223 -37877 -42597 -34534 -7270
190 -7270 14498 -5176 -41181 -28772 -17661 -34771 -88924 -87154 -62727 -20352 8908 -42554
178 -42554 -63007 -41760 -47056 -37374 -9398 -6675 -10409 -14494 -15421 -25628 -43634 -39539 -8097 15489
164 15489 40706 37628 13070 -14153 -39285 -51847 -25630 11448 -19926 -27811 -49127 -33176
$$ [...]
##END NTUPLES=NMR SPECTRUM
##END=
