##TITLE=Analysis number 326507
Compound Code tl 00354
Project Code adrs
Chemist Name ugmt
##JCAMPDX= 6.0         $$ Bruker NMR JCAMP-DX V2.0
##DATA TYPE= NMR SPECTRUM
##DATA CLASS= NTUPLES
##ORIGIN= Bruker BioSpin GmbH
##OWNER= nmr
$$ XWIN-NMR		Version 3.5
$$ Fri Feb  9 09:38:58 2007 GMT Standard Time (UT+0h)  MAYBRIDGE\nmr@NMR_250MHZ
##.OBSERVE FREQUENCY= 250.131544655141
##.OBSERVE NUCLEUS= ^1H
##.ACQUISITION MODE= SIMULTANEOUS (DQD)
##.ACQUISITION SCHEME= undefined
##.AVERAGES= 16
##.DIGITISER RES= 18
##SPECTROMETER/DATA SYSTEM= dpx250
##.PULSE SEQUENCE= zg30
##.SOLVENT NAME= CDCl3
##.SHIFT REFERENCE= (INTERNAL, CDCl3, 0, 16.522)
##AUDIT TRAIL= $$ (NUMBER, WHEN, WHO, WHERE, WHAT)
$$ ##TITLE= Audit trail, XWIN-NMR		Version 3.5
$$ ##JCAMPDX= 5.01
$$ ##ORIGIN= Bruker BioSpin GmbH
$$ ##OWNER= nmr
$$ C:\u/data/dgb/nmr/ADRS/580/pdata/1/auditp.txt
$$ ##AUDIT TRAIL=  $$ (NUMBER, WHEN, WHO, WHERE, WHAT)
(   1,<2007-02-09 09:38:22.22 +000>,<MAYBRIDGE\nmr>,<NMR_250MHZ>,
      <created by zg, POWCHK disabled, PULCHK disabled
       configuration hash MD5:
       49 4B E0 1D 92 C2 6B 37 9F E6 65 BC 52 41 86 1D
       data hash MD5: 64K
       44 67 DC 01 18 3E 4D 80 BB E2 B1 72 E4 E7 64 AC>)
(   2,<2007-02-09 09:38:40.16 +000>,<MAYBRIDGE\nmr>,<NMR_250MHZ>,
      <Start of raw data processing
       ef LB = 0.3 FT_mod = 6 PKNL = 1 SI = 32K 
       data hash MD5: 32K
       25 4E 1E 1C 0E 8F DA AD 1B 98 CE AD 9E 44 C5 89>)
(   3,<2007-02-09 09:38:44.47 +000>,<MAYBRIDGE\nmr>,<NMR_250MHZ>,
      <apk 
       data hash MD5: 32K
       4B 58 E7 13 60 BC BC FC A5 4A 31 D0 35 B9 74 A6>)
(   4,<2007-02-09 09:38:45.91 +000>,<MAYBRIDGE\nmr>,<NMR_250MHZ>,
      <abs ABSG = 5 
       data hash MD5: 32K
       44 1F B9 82 40 CE 57 92 56 CE FC B4 1E 5C E8 C4>)
$$ ##END=
$$ 
$$ hash MD5
$$ 98 51 7B D3 51 05 D7 D4 B9 DD 85 44 38 D9 4A 75
##$RELAX= 
##$RELAX= 
##$RELAX= 
##$RELAX= 
##$RELAX= 
##$RELAX= 
##$RELAX= 
$$ Bruker specific parameters
$$ --------------------------
##$DU= <C:\u>
##$EXPNO= 580
##$NAME= <ADRS>
##$PROCNO= 1
##$TYPE= <nmr>
##$USER= <dgb>
##$AMP= (0..31)
100 100 100 100 100 100 100 100 100 100 100 100 100 100 100 100 100 100 
100 100 100 100 100 100 100 100 100 100 100 100 100 100 
##$AQSEQ= 0
##$AQ_mod= 3
##$AUNM= <au_zg>
##$AUTOPOS= <26 >
##$BF1= 250.13
##$BF2= 250.13
##$BF3= 250.13
##$BF4= 250.13
##$BF5= 500.13
##$BF6= 500.13
##$BF7= 500.13
##$BF8= 500.13
##$BYTORDA= 1
##$CFDGTYP= 0
##$CFRGTYP= 5
##$CHEMSTR= <none>
##$CNST= (0..31)
1 1 145 1 1 1 1 1 1 1 1 1 1 1 1 1 1 1 1 1 1 1 1 1 1 1 1 1 1 1 1 1 
##$CPDPRG= <>
##$CPDPRG1= <>
##$CPDPRG2= <>
##$CPDPRG3= <>
##$CPDPRG4= <mlev>
##$CPDPRG5= <mlev>
##$CPDPRG6= <mlev>
##$CPDPRG7= <mlev>
##$CPDPRG8= <mlev>
##$CPDPRGB= <>
##$CPDPRGT= <>
##$D= (0..31)
0 1 0 0 0 0 0 0 0 0.06 0 0 0 0 0 0 0.0002 0 0 0 0 0 0 0 0 0 0 0 0 0 0 
0 
##$DATE= 1171013901
##$DBL= (0..7)
120 120 120 120 120 120 120 120 
##$DBP= (0..7)
150 150 150 150 150 150 150 150 
##$DBP07= 0
##$DBPNAM0= <>
##$DBPNAM1= <>
##$DBPNAM2= <>
##$DBPNAM3= <>
$$ [...]
##$SUBNAM7= <"">
##$SUBNAM8= <"">
##$SUBNAM9= <"">
##$SW= 20.6930455092707
##$SWIBOX= (0..15)
0 0 3 0 0 0 0 0 0 0 0 0 0 0 0 0 
##$SW_h= 5175.983436853
##$TD= 65536
##$TD0= 1
##$TE= 294.16
##$TE2= 300
##$TE3= 300
##$TEG= 300
##$TL= (0..7)
0 120 120 120 120 120 120 120 
##$TP= (0..7)
150 150 150 150 150 150 150 150 
##$TP07= 0
##$TPNAME0= <>
##$TPNAME1= <>
##$TPNAME2= <>
##$TPNAME3= <>
##$TPNAME4= <>
##$TPNAME5= <>
##$TPNAME6= <>
##$TPNAME7= <>
##$TPOAL= (0..7)
0.5 0.5 0.5 0.5 0.5 0.5 0.5 0.5 
##$TPOFFS= (0..7)
0 0 0 0 0 0 0 0 
##$TUNHIN= 0
##$TUNHOUT= 0
##$TUNXOUT= 0
##$USERA1= <user>
##$USERA2= <user>
##$USERA3= <user>
##$USERA4= <user>
##$USERA5= <user>
##$V9= 5
##$VALIST= <valist>
##$VCLIST= <CCCCCCCCCCCCCCC>
##$VD= 0
##$VDLIST= <DDDDDDDDDDDDDDD>
##$VPLIST= <PPPPPPPPPPPPPPP>
##$VTLIST= <TTTTTTTTTTTTTTT>
##$WBST= 1024
##$WBSW= 4
##$XGAIN= (0..3)
0 0 0 0 
##$XL= 0
##$YL= 0
##$YMAX_a= 267298
##$YMIN_a= -285876
##$ZGOPTNS= <>
##$ZL1= 120
##$ZL2= 120
##$ZL3= 120
##$ZL4= 120
##$ABSF1= 16.522
##$ABSF2= -4.171173
##$ABSG= 5
##$ABSL= 3
##$ALPHA= 0
##$AQORDER= 0
##$ASSFAC= 0
##$ASSFACI= 0
##$ASSFACX= 0
##$ASSWID= 0
##$AUNMP= <proc_1d>
##$AZFE= 0.1
##$AZFW= 0.1
##$BCFW= 0
##$BC_mod= 0
##$BYTORDP= 0
##$COROFFS= 0
##$CY= 12.5
##$DATMOD= 1
##$DC= 0
##$DFILT= <>
##$DTYPP= 0
##$F1P= 14.0000005364418
##$F2P= -0.99999901652339
##$FCOR= 0.5
##$FTSIZE= 32768
##$FT_mod= 6
##$GAMMA= 0
##$GB= 0
##$INTBC= 1
##$INTSCL= 1
##$ISEN= 128
##$LB= 0.3
##$LEV0= 0
##$LPBIN= 0
##$MAXI= 10000
##$MC2= 0
##$MEAN= 0
##$ME_mod= 0
##$MI= 0
##$NCOEF= 0
##$NC_proc= -2
##$NLEV= 6
##$NOISF1= 0
##$NOISF2= 0
##$NSP= 0
##$NTH_PI= 0
##$NZP= 0
##$OFFSET= 16.522
##$PC= 1
##$PHC0= 235.5287
##$PHC1= 8.120038
##$PH_mod= 1
##$PKNL= yes
##$PPARMOD= 0
##$PSCAL= 4
##$PSIGN= 0
##$REVERSE= no
##$SF= 250.13
##$SI= 32768
##$SIGF1= 0
##$SIGF2= 0
##$SINO= 400
##$SIOLD= 32768
##$SREGLST= <1H.CDCl3>
##$SSB= 0
##$STSI= 32768
##$STSR= 0
##$SW_p= 5175.98343685301
##$SYMM= 0
##$S_DEV= 0
##$TDeff= 65536
##$TDoff= 0
##$TI= <Analysis number 999999
Compound Code 99
Book Reference 9
Project Code 9>
##$TILT= no
##$TM1= 0
##$TM2= 0
##$TOPLEV= 0
##$USERP1= <user>
##$USERP2= <user>
##$USERP3= <user>
##$USERP4= <user>
##$USERP5= <user>
##$WDW= 1
##$XDIM= 32768
##$YMAX_p= 346782410
##$YMIN_p= -116465
$$ End of Bruker specific parameters
$$ ---------------------------------
##NTUPLES= NMR SPECTRUM
##VAR_NAME=  FREQUENCY,     SPECTRUM/REAL,   SPECTRUM/IMAG
##SYMBOL=    X,             R,               I
##VAR_TYPE=  INDEPENDENT,   DEPENDENT,       DEPENDENT
##VAR_FORM=  AFFN,          ASDF,            ASDF
##VAR_DIM=   32768,         32768,           32768
##UNITS=     HZ,            ARBITRARY UNITS, ARBITRARY UNITS
##FACTOR=    0.157963299565203, 1,           1
##FIRST=     4132.6476996994, 0,             0
##LAST=      -1043.33573715361, 0,           0
##MIN=       -1043.33573715361, -116465,     0
##MAX=       4132.6476996994, 346782410,     0
$$ Real data points
##PAGE= N=1
##DATA TABLE= (X++(R..R)), XYDATA
$$ [...]
$$ plain form
16820 15893 3039 -11749 -6500 -15818 -51906 -71442 -62975 -27025 -41442 -54751 -37677 7681
16808 7681 36862 33588 -10521 -48233 -45601 -43061 -44161 -26521 -3204 17352 33679 36724 15690
16795 15690 -25659 -19197 -9165 -21728 -25261 -18002 10610 39788 16580 9426 1150 11143 27915
16782 27915 5331 23049 42054 21542 -32556 -23138 18089 11428 -20625 -9909 -15584 -40744
16770 -40744 -41440 -24937 -26630 -25816 -19764 -11042 8403 -8478 -13353 -44117 -53502 -39075 -5641
16757 -5641 2024 -4994 -21507 7364 28880 33642 57972 58689 34107 9545 24227 5521 -27283
16744 -27283 -18930 -29091 -29290 -44290 -43897 -34435 -45703 -40816 -34296 -30486 -8850 -8547 14093 -8701
16730 -8701 -20645 10671 33175 53664 36156 2756 7034 11994 3290 3849 -2847 -6026 -31126
$$ packed form
16820A5893j2854j4788N249r318l6088j9536Q467L5950j4417j3309J7074M5358
16808G681K9181l274m4109l7712K632K540j100J7640K3317K0556J6327L045k1034
16795A5690m1349O462J0032j2563l533P259K8612K9178k3208p154q276R993J6772
16782B7915k2584J7718J9005k0512n4098R418M1227o661l2053J0716n675k5160
16770d0744o96J6503j693Q14O052Q722J9445j6881m875l0764r385J4427L3434
16757e641P665p018j6513K8871K1516M762K4330P17k4582k4562J4682j8706l2804
16744b7283Q353j0161j99j5000L93R462j1268M887O520L810K1636L03K2640k2794
16730h701j1944L1316K2504K0489j7508l3400M278M960q704N59o696l179k5100
$$ plain form
16717 -31126 -15759 -13736 -15362 3014 -16261 14035 51150 74980 55122 44083 27657 346
16705 346 -12330 1234 -15824 -44030 -33709 -22541 -33283 -14652 9905 -9445 -3030 7590
16693 7590 -2013 -4939 -13678 -32252 -28096 -26647 -7583 13089 5259 5614 -9036 39 31421 6253
16679 6253 -8821 -21331 346 13944 14880 -4036 -9472 -592 15956 5222 17731 22635 4562
16666 4562 -15752 -22652 15711 -5781 -15271 10574 16309 -32414 -70697 -62701 -60200 -39908 -27034
16653 -27034 -3409 28 -48728 -53577 -16695 -8264 -10310 -1811 4028 25110 11311 -24448 -58031
16640 -58031 -50264 -53061 -109475 -104359 -67359 -38902 -38622 -29253 -13592 2244 -2015 -12615 -36399
16627 -36399 -34776 -24270 -15326 -10616 26119 32941 14161 18448 47201 42675 11603 14240 24466
$$ packed form
16717c1126J5367K023j626J8376j9275L0296L7115K3830j9858j1039j6426k7311
16705C46j2676J3564j7058k8206J0321J1168j0742J8631K4557j9350O415J0620
16693G590r603k926q739j8574M156J449J9064K0672p830L55j4650R075L1382k5168
16679F253j5074j2510K1677J3598R36j8916n436Q880J6548j0734J2509M904j8073
16666D562k0314o900L8363k1492r490K5845N735m8723l8283P996K501K0292J2874
16653b7034K3625L437m8756m849L6882Q431k046Q499N839K1082j3799l5759l3583
16640e8031P767k797n6414N116L7000K8457K80R369J5661J5836m259j0600k3784
16627c6399J623J0506Q944M710L6735O822j8780M287K8753m526l1072K637J0226
$$ plain form
16614 24466 15811 -22337 -23810 -21196 -10901 -14129 -32213 -28382 -18475 -18917 -18682 -6817 -16195 1149
16600 1149 12051 -5252 18504 21328 4790 -626 6044 17902 27271 22960 40700 24017 7839
16587 7839 -22022 -34775 -15754 -261 26188 9352 4136 28117 47398 71456 70707 32934
16575 32934 11362 14001 12659 -29144 -50448 -28237 -3615 3867 1480 24043 16819 -5180 -9001
16562 -9001 -20234 5261 37510 99621 101243 66794 37962 13871 11145 -7810 -6777 2711 -6264
16549 -6264 -7395 12448 -706 -7670 -7472 6479 4482 2577 -5311 -19348 -27210 -4143 31470
16536 31470 53983 34422 16183 -17867 -31019 -20408 7535 9838 23921 20975 8494 -19897
16524 -19897 -56581 -51370 -17307 1056 28297 10368 -10676 -25630 -29778 -38608 -42182 -29286
$$ packed form
16614B4466q655l8148j473K614J0295l228j8084L831R907m42K35J1865r378J7344
16600A149J0902j7303K3756K824j6538n416O670J1858R369m311J7740j6683j6178
16587G839k9861j2753J9021J5493K6449j6836n216K3981J9281K4058p49l7773
16575C2934k1572K639j342m1803k1304K2211K4622P482k387K2563p224k1999l821
16562i001j1233K5495L2249O2111J622l4449k8832k4091k726j8955J033R488q975
16549f264j131J9843j3154o964J98J3951j997j905p888j4037p862K3067L5613
16536C1470K2513j9561j8239l4050j3152J0611K7943K303J4083k946j2481k8391
16524a9897l6684N211L4063J8363K7241j7929k1044j4954m148q830l574J2896
$$ plain form
16512 -29286 24844 65589 36161 8020 -25552 -60237 -49321 -36521 -24906 -21152 -17161 2580
16500 2580 28701 23769 -8452 -7848 -41877 -54681 -25803 -16066 12202 20619 10868 -18971 -38758
16487 -38758 -31986 -20593 -11000 -18412 -31243 -28012 -46762 -42544 -40664 -24369 -23941 -37833 -27128
16474 -27128 -10246 -7403 -12188 -8945 -2357 10263 30130 21716 16630 23591 23425 22814 -1780 -17211
16460 -17211 -42231 -57248 -35943 -27942 -11284 -1468 13896 36352 39827 43921 33816 31544 29688
16447 29688 52571 54583 12864 -20432 -20719 -6077 -31623 -42640 -6429 -4129 -3529 3770 20181
16434 20181 1022 -14504 -24663 -19985 4879 495 2831 7195 13207 13677 25625 34368 29308
16421 29308 12590 -5697 -11760 36425 50635 31986 16823 27239 36362 54522 44241 9848
$$ packed form
16512b9286N4130M0745k9428k8141l3572l4685J0916J2800J1615L754L991J9741
16500B580K6121m932l2221O04l4029j2804K8878R737K8268Q417r751k9839j9787
16487c8758O772J1393R593p412j2831L231j8750M218J880J6295M28j3892J0705
16474b7128J6882K843m785L243O588J2620J9867q414n086O961j66o11k4594j5431
16460a7211k5020j5017K1305Q001J6658R816J5364K2456L475M094j0105k272j856
16447B9688K2883K012m1719l3296k87J4642k5546j1017L6211K300O00P299J6411
16434B0181j9159j5526j0159M678K4864m384K336M364O012M70J1948Q743n060
16421B9308j6718j8287o063M8185J4210j8649j5163J0416R123J8160j0281l4393
$$ plain form
16409 9848 -23478 -37561 -9709 18440 31409 37025 802 -59634 -68476 -36549 -9332 8426
16397 8426 15480 12214 -9060 -30193 -29576 -27535 -1543 -5979 -18742 -22093 -17467 19562 43146
16384 43146 33706 10112 20728 2147 -5068 -3782 4958 27850 17051 2406 22752 41570
16372 41570 32834 13548 -16190 -36316 -47847 -26714 12082 10969 -10425 -37827 -11164 -5352
16360 -5352 -1705 -6427 -47324 -54334 -41967 -48936 -57407 -27776 16329 38751 33696 40008 51760
16347 51760 52644 36622 -11148 -41043 -20087 8112 1128 -1413 3850 -19818 -52049 -56806 -25331
16334 -25331 -38328 -42931 -34552 -41706 -43638 -2820 -16088 -32968 -20823 12125 7460 12807 -4200
16321 -4200 -4896 5147 18379 46824 29063 -29848 -28147 16239 19235 24729 55965 39970 5984
$$ packed form
16409I848l3326j4083K7852K8149J2969N616l6223o0436q842L1927K7217J7758
16397H426P054l266k1274k1133O17K041K5992m436j2763l351M626L7029K3584
16384D3146r440k3594J0616j8581p215J286Q740K2892j0799j4645K0346J8818
16372D1570q736j9286k9738k0126j1531K1133L8796j113k1394k7402K6663N812
16360e352L647m722m0897p010J2367o969q471K9631M4105K2422n055O312J1752
16347E1760Q84j6022m7770k9895K0956K8199o984k541N263k3668l2231m757L1475
16334b5331j2997m603Q379p154j932M0818j3268j6880J2145L2948m665N347j7007
16321d200o96J0043J3232K8445j7761n8911J701M4386K996N494L1236j5995l3986
$$ plain form
16308 5984 17695 37875 8070 -7057 11421 29149 11984 -2529 -10396 19894 27686 55322
16296 55322 61841 22786 -15864 -33041 -24019 -20229 -11902 26198 11375 -202 10337 26984
16284 26984 12813 -2776 20594 51566 22432 1660 -11835 -28280 -9543 22980 37857 6943
16272 6943 -19032 -25369 -44894 -36357 -20843 -29019 -43995 -33649 1868 -18929 -14503 -23505 -25164
16259 -25164 -7374 -30312 -37645 -34829 -20342 -338 20306 5911 15717 59893 57475 38617
16247 38617 18476 8507 -34878 -20218 14822 10677 49489 30382 17319 -1953 -4281 6238
16235 6238 8269 -1887 -21337 -10645 -13785 -12739 7361 11655 6786 -7859 -27297 -45024 -58029
16222 -58029 -39864 -35048 -38721 -27177 -40716 -32902 -14288 -31936 -31927 -13398 -59226 -45197 -12009
$$ packed form
16308E984J1711K0180k9805j5127J8478J7728j7165j4513p867L0290P792K7636
16296E5322O519l9055l8650j7177R022L790Q327L8100j4823j1577J0539J6647
16284B6984j4171j5589K3370L0972k9134k0772j3495j6445J8737L2523J4877l0914
16272F943k5975o337j9525Q537J5514q176j4976J0346L5517k0797M426r002j659
16259b5164J7790k2938p333K816J4487K0004K0644j4395R806M4176k418j8858
16247C8617k0141r969m3385J4660L5040m145L8812j9107j3063j9272k328J0519
16235F238K031j0156j9450J0692l140J046K0100M294m869j4645j9438j7727j3005
16222e8029J8165M816l673J1544j3539P814J8614j7648RJ8529m5828J4029L3188
$$ plain form
16209 -12009 4934 33631 14109 3610 8191 11655 -7547 -1515 32575 31912 22090 34192 40188
16196 40188 11206 -12036 -20342 -20164 -44999 -62989 -75485 -54321 -32711 -39144 -43863 -21499 6924
16183 6924 -10308 -43868 1017 14875 47457 32156 12743 1416 -4606 3157 22705 20494
16171 20494 42797 52232 68307 48735 22064 35896 66027 68641 52299 24521 -3332 -21865
16159 -21865 -4981 -2549 -16461 -18621 -17999 -32929 -12498 8170 -6213 -670 5994 -2836 -8436
16146 -8436 -67 -3836 -21793 -24975 -10421 -24757 -62843 -37704 -21793 -15030 17654 38181 29645
16133 29645 29580 45636 30686 19952 -10567 -45514 -37004 -7983 16723 13443 -13780 -15323 -20296
16120 -20296 -15696 5491 5469 24994 34775 -6395 -33233 -20068 -5675 10969 14508 20004 -4596
$$ packed form
16209a2009J6943K8697j9522j0499M581L464j9202O032L4090o63r822J2102N996
16196D0188k8982k3242q306J78k4835j7990j2496K1164K1610o433m719K2364K8423
16183F924j7232l3560M4885J3858L2582j5301j9413j1327o022P763J9548k211
16171B0494K2303R435J6075j9572k6671J3832L0131K614j6342k7778k7853j8533
16159b1865J6884K432j3912k160O22j4930K0431K0668j4383N543O664q830n600
16146h436Q369l769j7957l182J4554j4336l8086K5139J5911O763L2684K0527q536
16133B9645o5J6056j4950j0734l0519l4947Q510K9021K4706l280k7223j543m973
16120b0296M600K1187k2J9525R781m1170k6838J3165J4393J6644L539N496k4600
$$ plain form
16107 -4596 -23937 -18640 -15699 -29485 -19960 -12684 24229 19901 -10955 -27212 -21316 -17011 -222
16094 -222 -11270 -274 8697 -16130 -12681 -19039 -13240 1151 -1452 -5823 14349 37760 22677
16081 22677 -17534 -34286 -31133 -12379 4853 1345 -16390 -11767 -25505 -15844 -16192 -28783 -24585
16068 -24585 14141 -10022 -74372 -86828 -65501 -51700 -39327 -44557 -53238 -42354 -20657 -1500
16056 -1500 9791 6148 -5 -16494 -5314 3276 -5555 -27012 -27800 -13572 -6316 -20454 -20775 8761
16042 8761 21042 4472 -3014 8464 -4928 2395 17820 36910 5621 9258 -25167 -46537
16030 -46537 -34216 -47358 -54596 -43422 -28564 -37827 -64645 -79456 -48487 -42195 7331 28806
16018 28806 11263 9446 13978 -193 -20801 -60284 -58474 -38598 -5631 -6338 -22073 -26491 -27950
$$ packed form
16107d596j9341N297K941j3786R525P276L6913m328l0856j6257N896M305J6789
16094b22j1048J0996Q971k4827L449o358N799J4391k603m371K0172K3411j5083
16081B2677m0211j6752L153J8754J7232l508j7735M623j3738R661l48j2591M198
16068b4585L8726k4163o4350j2456K1327J3801J2373n230q681J0884K1697J9157
16056a500J1291l643o153j6489J1180Q590q831k1457p88J4228P256j4138l21K9536
16042H761J2281j6570p486J1478j3392P323J5425J9090l1289L637l4425k1370
16030d6537J2321j3142p238J1174J4858r263k6818j4811L0969O292M9526K1475
16018B8806j7543j817M532j4171k0608l9483J810J9876L2967p07j5735m418j459
$$ plain form
16005 -27950 -19758 -9842 -8802 31749 51405 29254 -433 -40770 -23697 -937 9101 -13405
15993 -13405 -7403 21506 34646 -19931 -54490 -28039 12300 9060 11961 6724 17234 28670
15981 28670 25202 27141 43785 50050 45836 65661 69167 39881 -3334 -13785 -13994 -30891 -33591
15968 -33591 -25317 -12132 -5262 10585 7261 -29266 -46540 -45645 -39752 -30703 -27677 -38717 -22833
15955 -22833 -20450 -33031 -19544 -35666 -40749 -29113 -28420 -19831 -3415 -17204 -56657 -55539 -15407
15942 -15407 -17395 -26198 -21281 -13515 -30607 -4080 15395 1964 -7129 -22704 -29516 -34754 -15046
15929 -15046 -4766 13750 -12422 -25093 -1579 -3679 -7816 30633 11090 -1633 -22449 -44379
15917 -44379 -47248 -46837 -40776 -50083 -18176 17277 14719 1351 -5965 25413 22737 -14504 -4052
$$ packed form
16005b7950Q192R916J040M0551J9656k2151k9687m0337J7073K2760J0038k2506
15993a3405O002K8909J3140n4577l4559K6451M0339l240K901n237J0510J1436
15981B8670l468J939J6644O265m214J9825L506k9286m3215j0451k09j6897k700
15968c3591Q274J3185O870J5847l324l6527j7274Q95N893R049L026j1040J5884
15955b2833K383j2581J3487j6122n083J1636O93Q589J6416j3789l9453J118M0132
15942a5407j988q803M917P766j7092K6527J9475j3431r093j5575o812n238J9708
15929a5046J0280J8516k6172j2671K3514k100m137L8449j9543j2723k0816k1930
15917d4379k869M11O061r307L1907L5453k558j3368p316L1378k676l7241J0452
$$ plain form
15904 -4052 -10281 -7723 22631 30012 15468 -22369 -27012 -21427 -10095 -867 -984 -12178 -19274 -31176
15890 -31176 -2848 16255 -4433 -22712 -9808 43648 42209 14112 7345 16772 50197 60475
15878 60475 62145 41449 35916 -3565 -9521 -32210 -37108 -28236 -14067 123 9986 19408 -19193
15865 -19193 -48153 -39861 -39595 -8881 29894 19733 3227 -15811 -39607 -17956 12141 19731
15853 19731 -16066 2426 24837 32748 5097 -14403 -7018 5925 -11539 -47691 -44494 -59034
15841 -59034 -47653 -17101 -18964 -17453 -25799 -21762 -28549 -18172 518 -20550 -4841 -15067 -3639
15828 -3639 -10151 -7563 27099 35783 44171 47560 27511 -4009 -25004 -18348 -26701 -35237 -1488
15815 -1488 38450 28587 25138 9928 8108 5653 10811 -13032 -20319 -25388 -21287 -17914 1576 1519
$$ packed form
15904d052o229K558L0354P381j4544l7837m643N585J1332R228j17j1194p096j1902
15890c1176K8328J9103k0688j8279J2904N3456j439k8097o767R427L3425J0278
15878F0475J670k0696n533l9481n956k2689m898Q872J4169J4190R863R422l8601
15865a9193k8960Q292K66L0714L8775j0161j6506j9038k3796K1651L0097P590
15853A9731l5797J8492K2411P911k7651j9500P385J2943j7464l6152L197j4540
15841e9034J1381L0552j863J511q346M037o787J0377J8690k1068J5709j0226J1428
15828c639o512K588L4662Q684Q388L389k0049l1520k0995O656q353q536L3749
15815a488L9938r863l449j5210j820k455N158k3843p287n069M101L373J9490n7
$$ plain form
15801 1519 -5150 37768 60244 23991 -7143 -22049 -9609 -3708 3084 -14167 -27478 -36750 -18180
15788 -18180 12360 58122 68265 53918 27298 11953 17555 4138 -8165 -965 -23550 -6132
15776 -6132 16080 3684 23368 -4697 -34002 -23606 -24405 -7182 -22691 -47587 -41478 -7793
15764 -7793 136 -10271 -434 -15894 -28007 -11433 10329 13827 19072 27411 26520 6691 38148
15751 38148 41157 53065 61280 60802 30260 -13581 -10830 29792 54441 47315 26433 5280 -14509
15738 -14509 -30575 -4806 30537 38510 25475 14363 -8408 -23176 -3555 6491 24776 16337
15726 16337 25217 47331 49353 27470 -4289 -4432 5588 32344 16250 12794 32013 18153 -10414
15713 -10414 -28653 -29696 -49058 -75315 -40445 -18454 -3947 7888 8997 -6830 3053 -404
$$ packed form
15801A519o669M2918K2476l6253l1134j4906J2440N901O792j7251j3311r272J8570
15788a8180L0540M5762J0143j4347k6620j5345N602j3417j2303P200k2585J7418
15776f132K2212j2396J9684k8065k9305J0396p99J7223j5509k4896O109L3685
15764g793P929j0407R837j5460j2113J6574K1762L498N245Q339q91j9829L1457
15751C8148L009J1908Q215m78l0542m3841K751M0622K4649p126k0882k1153j9789
15738a4509j6066K5769L5343P973j3035j1112k2771j4768J9621J0046J8285q439
15726A6337Q880K2114K022k1883l1759j43J0020K6756j6094l456J9219j3860k8567
15713a0414j8239j043j9362k6257L4870K1991J4507J1835J109j5827R883l457
$$ plain form
15701 -404 -1359 416 -12276 6252 1887 -31672 -21611 3332 -1562 -4118 26035 35854 28686 34434
15687 34434 68111 45436 14951 5794 15868 37488 30562 1313 -26419 -30122 -27477 -13308
15675 -13308 4649 -270 -11284 7862 20128 -5862 -13972 13759 26715 26205 25741 19123 21956
15662 21956 15318 7710 7875 -2600 -23580 -25001 -12846 -21569 -18581 -33699 -29069 -39192 -13651
15649 -13651 -35425 -29060 6535 30900 52913 32120 -6789 2467 21994 3067 33303 60725
15637 60725 54420 26863 3141 -415 -864 28196 53472 -6745 -41384 -38179 -40193 -17730 -4564
15624 -4564 -6102 8213 1007 -8314 11691 -4768 -30967 -54916 -50499 -50010 -40069 -35625 -17220
15611 -17220 -2749 6753 4861 24517 11339 -377 -9285 -18260 -24372 -17333 -33904 -47853 -56364
$$ packed form
15701d04r55J775j2692J8528m365l3559J0061K4943m894k556L0153R819p168N748
15687C4434L3677k2675l0485r157J0074K1620o926k9249k7732l703K645J4169
15675a3308J7957m919j1014J9146J2266k5990q110K7731J2956n10m64o618K833
15662B1956o638p608J65j0475k0980j421J2155q723K988j5118M630j0123K5541
15649a3651k1774O365L5595K4365K2013k0793l8909R256J9527j8927L0236K7422
15637F0725o305k7557k3722l556m49K9060K5276o0217l4639L205k014K2463J3166
15624d564j538J4315p206r321K0005j6459k6199k3949M417M89R941M444J8405
15611a7220J4471R502j892J9656j3178j1716q908q975o112P039j6571j3949q511
$$ plain form
15598 -56364 -48602 -25734 -56531 -39945 2890 1173 25144 29681 37010 29150 44333 44152 9848
15585 9848 -23414 -11815 -13993 -43519 -58680 -59307 -26839 -32703 -29280 -19176 -48582 -51328 -25563
15572 -25563 -28734 -58470 -52149 -20181 -3475 743 6435 3367 -46252 -51203 -40008 -27009 -5790
15559 -5790 -939 1997 -14603 -15755 -5741 3939 3632 1033 18880 5386 -15664 10585 18494
15546 18494 23714 16753 -260 497 -2072 -16830 -46645 -26916 -46867 -40873 -4207 15618 5883
15533 5883 -8843 13881 -17257 -34938 -4531 894 -3132 -29114 -22939 -7376 -7483 1390 45482
15520 45482 49292 41973 -245 -27041 -20591 -21545 -14112 18843 42593 44844 38118 25050 -6967
15507 -6967 662 22639 19801 30803 -3000 -3269 -12200 -1162 -5624 -14895 10027 20267 -29713
$$ packed form
15598e6364P762K2868l0797J6586M2835j717K3971M537P329p860J5183j81l4304
15585I848l3262J1599k178k9526j5161o27L2468n864L423J0104k9406k746K5765
15572b5563l171k9736O321L1968J6706M218N692l068m9619m951J1195J2999K1219
15559e790M851K936j6600j152J0014R680l07k599J7847j3494k1050K6249P909
15546A8494N220o961j7013P57k569j4758k9815J9729j9951N994L6666J9825r735
15533E883j4726K2724l1138j7681L0407N425m026k5982O175J5563j07Q873M4092
15520D5482L810p319m2218k6796O450r54P433L2955K3750K251o726j3068l2017
15507f967P629K1977k838J1002l3803k69q931J1038m462r271K4922J0240m9980
$$ plain form
15494 -29713 -65247 -53985 -12994 7255 15898 15413 4415 -4195 12230 -4447 -3823 6587 27579
15481 27579 33283 10956 -2870 -4422 -873 18178 28711 12118 21049 16986 18968 7609 -11415
15468 -11415 34175 22856 561 17421 43527 51466 39735 42290 28187 588 -3615 31343
15456 31343 37441 35604 17323 35377 43103 25452 -2434 25748 39637 54362 66205 59640
15444 59640 40800 25509 13236 35843 49303 29745 21309 19619 -10852 -11359 -17636 -16196 17199
15431 17199 -3153 -15796 -12235 -30790 -6213 1747 10564 -28056 -45000 -40847 -40076 -57225 -43594
15418 -43594 -45423 -40112 -12630 -2221 -8885 -10585 1130 -21754 -45463 -37752 -14566 -14201 -16189
15405 -16189 -38869 -32591 6153 25908 27766 54709 80373 56287 29700 17743 13083 4599
$$ packed form
15494b9713l5534J1262M0991K0249Q643m85j0998q610J6425j6677O24J0410K0992
15481B7579N704k2327j3826j552L549J9051J0533j6593Q931m063J982j1359j9024
15468a1415M5590j1319k2295J6860K6106P939j1731K555j4103k7599m203L4958
15456C1343O098j837j8281J8054P726j7651k7886K8182J3889J4725J1843o565
15444E9640j8840j5291j2273K2607J3460j9558q436j690l0471n07o277J440L3395
15431A7199k0352j2643L561j8555K4577P960Q817l8620j6944M153P71j7149J3631
15418d3594j829N311K7482J0409o664j700J1715k2884k3709P711K3186L65j988
15405a6189k2680O278L8744J9755J858K6943K5664k4086k6587j1957m660q484
$$ plain form
15393 4599 23198 21376 23522 185 1353 20524 22750 5833 -19697 -26211 -44112 -30623 -21606
15380 -21606 -12323 -20638 -23622 -24196 -14399 5221 14564 -9851 -8457 -21087 -30153 -58726 -82232
15367 -82232 -62811 -45998 -28231 -2406 -13772 -7674 16338 7749 17321 38240 16951 10222
15355 10222 1677 16999 30125 18456 14072 26373 27144 -13864 -24651 4458 25625 22336 6393
15342 6393 -20347 -29512 -37682 -12580 -17952 -7401 23308 30439 20343 7722 10492 36299 43141
15329 43141 32891 25684 10533 10741 31633 11545 4503 7231 18684 26909 33082 16979 26879
15316 26879 29218 20149 -10476 -21679 -15668 -2715 -37708 -62921 -41949 -37465 -17096 953
15304 953 -11888 -18484 -40450 -28621 -9021 -26740 -27919 -775 -20689 -52982 -21511 11212
$$ packed form
15393D599J8599j822K146k3337J168J9171K226j6917k5530o514j7901J3489R017
15380b1606R283q315k984n74R797J9620R343k4415J394j2630r066k8573k3506
15367h2232J9421J6813J7767K5825j1366O098K4012q589R572K0919k1289o729
15355A0222q545J5322J3126j1669m384J2301P71m1008j0787K9109K1167l289j5943
15342F393k6740r165q170K5102n372J0551L0709P131j0096j2621K770K5807O842
15329D3141j0250p207j5151K08K0892k0088p042K728J1453Q225O173j6103R900
15316B6879K339r069l0625j1203O011J2953l4993k5213K0972M484K0369J8049
15304I53j2841o596k1966J1829J9600j7719j179K7144j9914l2293L1471L2723
$$ plain form
15292 11212 8655 -6903 -8521 -12542 6229 21920 21342 8633 9129 6696 38230 60563 41328
15279 41328 37292 -12681 -31307 570 -15046 -9139 16993 6259 8645 34117 37296 25212
15267 25212 -5803 -26561 -14936 2634 158 17695 15285 26333 37683 36600 18235 35646
15255 35646 31105 4197 -11152 198 -35605 -23139 470 -28804 -32380 99 -15597 -22622
15243 -22622 -967 5499 7119 8508 19048 7987 -13408 -41096 -32259 -6675 -491 15352 76679
15230 76679 56266 4720 -27510 -36039 -13488 24675 -7577 -20796 -10686 -1278 -6623 -25165
15218 -25165 -23806 6967 47703 31095 12008 31863 22832 37693 42446 32243 38300 30978 28162
15205 28162 60691 43670 32324 37668 10326 -811 17534 39153 23491 -9550 -27750 -12502
$$ packed form
15292A1212k557j5558j618m021J8771J5691n78j2709M96k433L1534K2333j9235
15279D1328m036m9973j8626L1877j5616N907K6132j0734K386K5472L179j2084
15267B5212l1015k0758J1625J7570k476J7537k410J1048J1350j083j8365J7411
15255C5646m541k6908j5349J1350l5803J2466K3609k9274l576L2479j5696p025
15243b2622K1655O466J620J389J0540j1061k1395k7688Q837K5584O184J5843O1327
15230G6679k0413n1546l2230q529K2551L8163l2252j3219J0110R408n345j8542
15218b5165J359L0773M0736j6608j9087J9855r031J4861M753j0203O057p322k816
15205B8162L2529j7021j1346N344k7342j1137J8345K1619j5662l3041j8200J5248
$$ plain form
15193 -12502 23301 30866 12173 -2640 -3680 14572 -20198 -42715 -29696 1818 30670 14927
15181 14927 -3146 24197 25866 15691 43966 44703 16687 -25982 -26244 -32025 -32392 -41471 -12543
15168 -12543 6905 5847 10501 7882 20047 14990 14496 13238 29500 40596 52422 28296 -2756
15155 -2756 -17385 -18880 2873 -8822 -24205 -10961 -5623 -5409 -4448 -24924 -17536 4621 -5640
15142 -5640 -4726 -31535 -31154 6720 27761 18055 15892 12692 28721 17902 7021 32944 49107
15129 49107 44891 4569 -14234 4808 30492 29730 20906 -17741 -34155 -50028 -65517 -65920 -49393
15116 -49393 -21741 -46004 -33166 13873 9564 -8672 -16816 -6533 -4656 5667 19245 47489
15104 47489 44292 21986 15110 16342 -7116 -8727 -20920 -17462 -11109 -5985 -10471 -363 -1283 -7487
$$ packed form
15193a2502L5803P565j8693j4813j040J8252l4770k2517J3019L1514K8852j5743
15181A4927j8073K7343J669j0175K8275P37k8016m2669k62n781l67r079K8928
15168a2543J9448j058M654k619J2165n057m94j258J6262J1096J1826k4126l1052
15155b756j4629j495K1753j1695j5383J3244N338K14R61k0476P388K2157j0261
15142e640R14k6809L81L7874K1041r706k163l200J6029j0819j0881K5923J6163
15129D9107m216m0322j8803J9042K5684p62q824l8647j6414j5873j5489m03J6527
15116d9393K7652k4263J2838M7039m309j8236q144J0283J877J0323J3578K8244
15104D7489l197k2306o876J232k3458j611j2193L458O353N124m486J0108r20o204
$$ plain form
15090 -7487 -5054 -29915 -32132 -31193 21117 37736 36289 61996 53112 21447 13388 -14424 -19806
15077 -19806 -7236 4998 11992 15544 -19801 -23430 -13561 -16857 -35723 -63720 -50016 -2899 26858
15064 26858 30878 52087 62424 14723 -5330 4290 26900 30455 31903 29559 21294 40004 42384
15051 42384 3889 -630 12462 17435 -30837 -42976 -35978 -36667 -44016 -25020 -37220 -27455 -28593
15038 -28593 -30818 -32625 -16187 8140 2250 6432 -4674 -28015 -27568 -4312 5175 3764 2264
15025 2264 -3142 858 1334 -19923 -7926 13722 7738 -1699 -15008 -12768 -15496 -8059 -2788 27982
15011 27982 39372 8729 500 59834 73423 58198 17207 16061 8428 -49108 -46207 -25681
14999 -25681 -7417 11329 11578 6315 594 -8936 8892 -14413 -40174 -28533 -18383 10434 11904
$$ packed form
15090g487K433k4861k217R39N2310J6619j447K5707q884l1665q059k7812n382
15077a9806J2570J2234O994L552l5345l629R869l296j8866k7997J3704M7117K9757
15064B6858M020K1209J0337m7701k0053R620K2610L555J448k344q265J8710K380
15051D2384l8495m519J3092M973m8272j2139O998o89p349J8996j2200R765j138
15038b8593k225j807J6438K4327n890M182j1106k3341M47K3256R487j411j500
15025B264n406M000M76k1257J1997K1648n984r437j3309K240k728P437N271L0770
15011B7982J1390l0643q229N9334J3589j5225m0991j146p633n7536K901K0526
14999b5681J8264J8746K49n263n721r530J7828k3305k5761J1641J0150K8817J470
$$ plain form
14986 11904 -28994 -23758 -13474 -46452 -48051 -23625 34826 56480 50492 34121 60618 58446
14974 58446 24386 -2519 -4661 10581 10537 8384 -1772 -44736 -32645 -48637 -35239 -24193 -36445
14961 -36445 -26560 997 -26370 -28208 -15644 -28490 -35112 -28635 -54137 -1136 45011 23256
14949 23256 -3472 -5048 -20125 -8120 -8998 -20072 -28933 -7032 1433 -1046 2142 -5157 234
14936 234 15036 48808 43731 12666 -34630 -63493 -55629 -33029 -37866 -36742 -56077 -8660 13554
14923 13554 -8752 -12760 -23039 -1059 20623 53967 53806 16325 8486 17152 32931 34834 2555
14910 2555 -6533 -29708 -36659 -34734 -39467 -31022 -17622 18473 29595 26337 35027 14896 20577
14897 20577 9698 2686 24235 7237 -13139 -23393 -9225 -18130 -31712 -22871 2066 -4973
$$ packed form
14986A1904m0898N236J0284l2978j599K4426N8451K1654n988j6371K6497k172
14974E8446l4060k6905k142J5242m4k153j0156m2964J2091j5992J3398J1046j2252
14961c6445R885K7557k7367j838J2564j2846o622O477k5502N3001M6147k1755
14949B3256k6728j576j5077J2005q78j1074q861K1901Q465k479L188p299N391
14936B34J4802L3772n077l1065m7296k8863P864K2600m837J124j9335M7417K2214
14923A3554k2306m008j0279K1980K1682L3344j61l7481p839Q666J5779J903l2279
14910B555r088k3175o951J925m733Q445J3400L6095J1122l258Q690k0131N681
14897B0577j0879p012K1549j6998k0376j0254J4168q905j3582Q841K4937p039
$$ plain form
14885 -4973 -7376 1031 -11562 -3690 5699 27651 17308 16583 6270 29027 40811 59844 48460
14872 48460 23739 12008 43842 29633 -3034 15390 16045 -32189 -26855 -25495 -29593 -1779 36183
14859 36183 46984 36069 20378 18438 24114 14596 15150 -1623 -13291 -29599 -41634 -12742 -12056
14846 -12056 -26055 -19501 -16532 -9488 16161 9146 -8268 4585 -902 -7947 -22004 -17304 -20864
14833 -20864 -25770 -9694 1131 -3079 -10060 22059 28390 2672 -15654 -31918 -34185 -32682 -14094
14820 -14094 -2625 4434 -19389 -27412 -3542 -7519 -7220 -13602 -44383 -31866 -22672 -1376 -14084
14807 -14084 4111 9659 4748 -4759 16893 49772 25230 6572 25967 27242 21894 23067 6915
14794 6915 -10679 -17422 -1066 7242 -401 -2868 717 7956 -1697 5527 6068 2158 19315 18242
$$ packed form
14885d973k403Q407j2593P872R389K1952j0343p25j0313K2757J1784J9033j1384
14872D8460k4721j1731L1834j4209l2667J8424O55m8234N334J360m098K7814L7962
14859C6183J0801j0915j5691j940N676r518N54j6773j1668j6308j2035K8892O86
14846a2056j3999O554K969P044K5649p015j7414J2853n487p045j4057M700l560
14833b0864m906J6076J0825m210o981L2119O331k5718j8326j6264k267J503J8588
14820a4094J1469P059k3823q023K3870l977K99o382l0781J2517R194K1296j2708
14807a4084J8195N548m911r507K1652L2879k4542j8658J9395J275n348J173j6152
14794F915j7594o743J6356Q308p643k467L585P239r653P224N41l910J7157j073
$$ plain form
14780 18242 3554 -8753 -12532 -18402 -29126 -44397 -39419 -2333 30492 44318 51447 1953
14768 1953 -24577 -23592 -29690 -26466 8711 35084 -12259 8061 11395 -33709 -44411 -13305 11033
14755 11033 -25707 -61095 -57929 -32690 -12850 1460 15963 22242 40808 45692 53929 42597
14743 42597 18403 16448 14559 19716 27311 42671 44805 40976 24679 10756 16124 27607 23220
14730 23220 52211 51329 49496 9842 -26975 -36136 21676 73777 74124 61559 21036 -29332 -35642
14717 -35642 -13696 -429 7459 -29228 -69878 -42005 -1434 -9227 -24070 4529 19895 12236
14705 12236 9483 -7784 -25837 -13295 -34364 -16471 8904 2741 7023 -4731 -42860 -51981
14693 -51981 -34408 -4078 -23527 -24124 -12605 20969 17834 2240 12013 41213 33349 21312 27742
$$ packed form
14780A8242j4688j2307l779n870j0724j5271M978L7086L2825J3826P129m9494
14768A953k6530R85o098L224L5177K6373m7343K0320L334m5104j0702L1106K4338
14755A1033l6740l5388L166K5239J9840J4310J4503O279J8566M884Q237j1332
14743D2597k4194j955j889N157P595J5360K134l829j6297j3923N368J1483m387
14730B3220K8991q82j833l9654l6817r161N7812N2101L47j2565m0523n0368o310
14717c5642K1946J3267P888l6687m0650K7873M0571p793j4843K8599J5366p659
14705A2236k753j7267j8053J2542k1069J7893K5375o163M282j1754l8129r121
14693e1981J7573L0330j9449n97J1519L3574l135j5594R773K9200p864j2037O430
$$ plain form
14680 27742 4473 -10824 -6075 14234 15342 -24444 -17409 20841 23915 9466 20042 25548 20119
14667 20119 32609 16832 -987 12194 28955 22458 24743 31518 12552 -15964 -46279 -49569
14655 -49569 -25358 -15463 -24426 9735 9839 2072 20651 12664 7556 -24403 -26726 -8955 -9369 -24592
14641 -24592 8343 3951 -5955 -16558 -21868 -8502 -5672 -4157 -17414 -10483 -16742 -16700 -6255 8827
14627 8827 15564 13318 35565 54958 36368 14051 28103 35698 2494 -24642 -22603 -8450 -7081
14614 -7081 -30271 -35933 -36008 -22617 -26564 -29744 -36350 -45095 -64023 -57989 -20382 7737 10382 5447
14600 5447 7592 12809 -6845 4614 10670 13095 -11769 -46277 -46839 -46583 -31631 -9173 -19334
14587 -19334 -48588 -67079 -83009 -39273 -20302 -61344 -55187 -64470 -76948 -49620 -52209 -16511
$$ packed form
14680B7742k3269j5297M749K0309J108l9786P035L8250L074j4449J0576N506n429
14667B0119J2490j5777j7819J3181J6761o497K285O775j8966k8516l0315l290
14655d9569K4211R895q963L4161J04p767J8579p987n108l1959k323J7771m14j5223
14641b4592L2935m392r906j0603n310J3366K830J515j3257O931o259M2J0445J5082
14627H827O737k246K2247J9393j8590k2317J4052P595l3204k7136K039J4153J369
14614g081k3190n662p5J3391l947l180o606q745j8928O034L7607K8119K645m935
14600E447K145N217j9654J1459O056K425k4864l4508n62K56J4952K2458j0161
14587a9334k9254j8491j5930M3736J8971m1042O157r283j2478K7328k589L5698
$$ plain form
14575 -16511 23756 16161 6868 19923 12744 16753 6227 -803 -23597 -19701 -46391 -33365 4146
14562 4146 20209 -10672 -12663 -18649 -21617 -42108 -32914 -13960 2079 17347 14560 4050 -9201
14549 -9201 -28796 -4854 2844 -8968 24607 15521 -561 55 -18474 -9599 24408 61543 26103
14536 26103 3680 19539 20917 -1439 25438 18446 -15903 -30891 -33876 -44289 -44429 -38769 -23774
14523 -23774 -30120 -38883 -37191 -35904 -16372 6755 16393 -9143 -29312 -65850 -58670 -27613 -9983
14510 -9983 -8385 13658 -10334 -12649 -25267 -20693 -8274 3847 3573 42770 48650 -2058 -42689
14497 -42689 -42885 -28943 -22543 -174 11456 39230 57065 55703 29412 18953 28414 48549 18166
14484 18166 6578 -4186 10198 50720 36477 -1407 90 -5811 10021 4979 -1531 -14688
$$ packed form
14575a6511M0267p595r293J3055p179M009j0526p030k2794L896k6690J3026L7511
14562D146J6063l0881j991n986k968k0491R194J8954J6039J5268k787j0510j3251
14549i201j9595K3942P698j1812L3575r086j6082O16j8529Q875L4007L7135l5440
14536B6103k2423J5859J378k2356K6877o992l4349j4988k985j0413j40N660J4995
14523b3774o346q763J692J287J9532K3127R638k5536k0169l6538P180L1057J7630
14510i983J598K2043k3992k315j2618M574J2419J2121k74L9197N880n0708m0631
14497d2689j96J3942O400K2369J1630K7774J7835j362k6291j0459R461K0135l0383
14484A8166j1588j0764J4384M0522j4243l7884J497n901J5832n042o510j3157
$$ plain form
14472 -14688 -27885 -50950 -62947 -55512 -12679 5941 -9676 -1828 -6785 -31971 -44118 -41403
14460 -41403 -35604 -28869 -41068 -21956 17134 4883 -4228 3918 -445 9488 -3287 7876 29484
14447 29484 4347 959 25182 8842 855 6917 22335 26009 15279 13601 8254 -1971 15863
14434 15863 -21 -11931 -25410 -21176 -12752 7175 -17559 -23201 -3444 -1785 1280 3643 -22048
14421 -22048 -36182 -24339 -12538 -16639 -6548 -11661 8217 21332 -898 10714 55637 41872
14409 41872 13270 -1551 -3132 -8440 -17803 7136 21553 3660 -32327 -48815 -43112 -20698
14397 -20698 -8100 2447 11599 -3046 10429 16731 7033 -12713 11330 23262 17719 9993 -3701
14384 -3701 -20584 12556 14514 3711 11702 7836 21746 27014 19719 32230 8028 -50612 -49812
$$ packed form
14472a4688j3197k3065j1997P435M2833J8620j5617P848m957k5186j2147K715
14460d1403N799O735j2199J9112L9090j2251r111Q146m363R933j2775J1163K1608
14447B9484k5137l388K4223j6340p987O062J5418L674j0730j678n347j0225J7834
14434A5863j5884j1910j3479M234Q424J9927k4734n642J9757J659L065K363k5691
14421b2048j4134J1843J1801m101J0091n113J9878J3115k2230J1612M4923j3765
14409D1872k8602j4821j581n308r363K4939J4417j7893l5987j6488N703K2414
14397b0698J2598J0547R152j4645J3475O302r698j9746K4043J1932n543p726j3694
14384c701j6883L3140J958j0803P991l866J3910N268p295J2511k4202n8640Q00
$$ plain form
14371 -49812 -30903 -27612 -988 -8414 -16136 -17364 -23037 1029 11527 13608 20725 18861 -8579
14358 -8579 -18977 -21036 -27992 1872 -5903 -7198 -5303 4033 -20494 -22904 -26255 -27956 -53079 -48255
14344 -48255 -7931 -5084 7514 4692 6585 31471 40825 19105 24215 41201 16518 21683 17585
14331 17585 527 -12483 2184 -9010 -14204 -20337 -8389 6016 5519 -19559 -18014 -27101 16231
14318 16231 35841 16374 -8396 -10882 -965 -9257 -22269 -9979 -4236 25232 19695 -3804 5814
14305 5814 22865 39780 32059 31527 47960 32386 828 9484 6577 4023 -17498 973 31862
14292 31862 3492 -8934 7855 16006 5287 9824 -22603 -39804 -13655 28039 16184 5131
14280 5131 -29622 -49520 -26378 -21513 -20037 2773 14217 -50434 -69243 -37912 -7763 7897
$$ packed form
14371d9812J8909L291K6624p426p722j228n673K4066J0498K081P117j864k7440
14358h579j0398k059o956K9864p775j295J895R336k4527k410l351j701k5123M824
14344d8255M0324K847J2598k822J893K4886R354k1720N110J6986k4683N165m098
14331A7585j7058j3010J4667j1194n194o133J1948J4405m97k5078J545r087M3332
14318A6231J9610j9467k4770k486R917q292j3012J2290N743K9468n537k3499R618
14305E814J7051J6915p721n32J6433j5574l1558Q656k907k554k1521J8471L0889
14292C1862k8370j2426J6789Q151j0719M537l2427j7201K6149M1694j1855j1053
14280E131l4753j9898K3142M865J476K2810J1444o4651j8809L1331L0149J5660
$$ plain form
14268 7897 3766 26427 13683 7805 4052 -7908 -24600 -25310 -24897 -36945 -34832 -37984 -38406 -19807
14254 -19807 -15454 -4105 11526 -29096 -38667 -17936 -379 32133 1673 -10560 19520 9909
14242 9909 5861 3802 23554 24191 2447 -2745 32789 14024 -15784 -31795 -42295 -14727 -7685
14229 -7685 -28549 2216 7913 -11253 -20733 -38485 -76905 -65181 -16024 3845 14075 5320
14217 5320 5682 5951 8430 -3689 11125 21689 25394 28503 41474 18636 14378 1663 13314
14204 13314 37511 37058 38451 61638 59724 64604 20416 -34978 -37858 -42109 -23480 -7472 5299
14191 5299 -6767 -34096 -72861 -57578 -42694 -52321 -52748 -56560 -36665 -5274 -9388 -41073 -54098
14178 -54098 -38815 10385 -3715 -16572 622 11669 5249 39099 41612 51880 34347 -2534
$$ packed form
14268G897m131K2661j2744n878l753j1960j6692p10M13j2048K113l152m22J8599
14254a9807M353J1349J5631m0622r571K0731J7557L2512l0460j2233L0080r611
14242I909m048k059J9752O37k1744n192L5534j8765k9808j6011j0500K7568P042
14229g685k0864L0765N697j9166r480j7752l8420J1724M9157J9869J0230q755
14217E320L62K69K479j2119J4814J0564L705L109J2971k2838m258j2715J1651
14204A3314K4197m53J393K3187j914M880m4188n5394k880m251J8629J6008J2771
14191E299j2066k7329l8765J5283J4884r627m27l812J9895L1391m114l1685j3025
14178e4098J5283M9200j4100j2857J7194J1047o420L3850K513J0268j7533l6881
$$ plain form
14166 -2534 6631 329 -5407 7129 15359 29010 22144 6645 10544 -6522 6256 27409 15845
14153 15845 12175 15406 10451 26376 21918 19941 29879 21539 -5483 676 16347 27850 38858
14140 38858 47462 31112 31849 44955 39188 -725 -26037 -6231 8507 10096 1501 -38301 -30660
14127 -30660 -24521 -21266 -9551 -11640 7795 23572 19100 11514 -2827 -16447 -9439 -1804 -1787 2072
14113 2072 28189 46127 27302 22091 47372 78110 73027 48015 58427 58389 30301 -2997 77
14100 77 20697 31868 57051 62644 60307 72289 43490 41142 36434 44223 47104 48644 61856 48413
14086 48413 53627 33128 19226 10226 5281 34906 42872 26700 43505 23909 20692 26509 6518
14073 6518 12882 -6932 -49642 -59317 -41259 -51827 -51739 -88272 -72437 -26548 10157 13189 13720
$$ packed form
14166b534R165o302n736J2536Q230J3651o866j5499L899j7066J2778K1153j1564
14153A5845l670L231m955J5925m458j977R938q340k7022O159J5671J1503J1008
14140C8858Q604j6350P37J3106n767l9913k5312J9806J4738J589q595l9802P641
14127c0660O139L255J1715k089J9435J5777m472p586j4341j3620P008P635J7L859
14113B072K6117J7938j8825n211K5281L0738n083k5012J0412l8k8088l3298L074
14100G7K0620J1171K5183N593k337J1982k8799k348m708P789K881J540J3212j3443
14086D8413N214k0499j3902r000m945K9625P966j6172J6805j9596l217N817j9991
14073F518O364j9814m2710r675J8058j0568Q8l6533J5835M5889L6705L032N31
$$ plain form
14060 13720 12219 14098 13242 -2447 -118 -10878 -23088 -5334 -1204 -773 31830 40706 36852 37580
14046 37580 34126 396 1296 19639 56797 73029 60867 40166 15758 28783 43493 26065
14034 26065 16825 25404 26574 -4670 -52630 -67434 -44253 -13657 32999 42451 422 16064
14022 16064 33298 54381 29444 2344 28258 41745 34115 12433 17108 21343 -16302 -27489
14010 -27489 -55898 -39737 3017 7757 10772 28389 30375 20376 25549 25171 13344 48726 36768
13997 36768 27395 -13722 8288 24713 14576 46421 45234 39876 51986 11352 -24985 20890
13985 20890 34462 45097 29991 23707 23501 12746 778 8963 24393 36440 19937 1175
13973 1175 -8280 8693 -9858 -8590 11774 -10097 -32042 -31506 -41578 -30757 -15185 -27160 -7761
$$ packed form
14060A3720j501J879q56j5689K329j0760j2210J7754M130M31L2603Q876l854P28
14046C7580l454l3730R00J8343L7158J6232j2162k0701k4408J3025J4710j7428
14034B6065r240Q579J170l1244m7960j4804K3181L0596M6656R452m2029J5642
14022A6064J7234K1083k4937k7100K5914J3487p630k1682M675M235l7645j1187
14010b7489k8409J6161M2754M740L015J7617J986r999N173l78j1827L5382j1958
13997C6768r373m1117K2010J6425j0137L1845j187n358J2110m0634l6337M5875
13985B0890J3572J0635j5106o284k06j0755j1968Q185J5430J2047j6503j8762
13973A175r455J6973j8551J268K0364k1871k1945N36j0072J0821J5572j1975J9399
$$ plain form
13960 -7761 -8993 -6136 -2042 -7897 -12550 -36440 -25469 -9330 10724 36749 33772 -32281 -44796
13947 -44796 -31122 -7936 -2557 55 -16955 -27380 -48021 -47457 -60741 -82218 -53835 -21772
13935 -21772 -5360 14262 4425 7648 -3783 -38148 -26229 43490 66338 58408 27786 9313
13923 9313 22664 30169 11260 3069 14111 3141 6231 -36623 -28462 -30528 -18488 -9897 -22584
13910 -22584 -21964 -30835 -24863 -5327 17183 30872 36499 36037 33328 24847 49694 56161 68839 83701
13896 83701 65473 45112 -5884 -18167 -4102 -17730 -8677 -8491 -16863 -6759 -5786 -4942 -25140
13883 -25140 -29612 -31879 -13896 1964 48579 81138 55665 52419 62977 43712 26989 14243
13871 14243 -25883 -58123 -28381 3575 -18433 -47751 -43914 -21471 -17332 -25097 21981 36360
$$ packed form
13960g761j232K857M094n855m653k3890J0971J6139K0054K6025k977o6053j2515
13947d4796J3674K3186N379K612j7010j0425k0641N64j3284k1477K8383L2063
13935b1772J6412J9622r837L223j1431l4365J1919O9719K2848p930l0622j8473
13923I313J3351P505j8909q191J1042j0970L090m2854Q161k066J2040Q591j2687
13910b2584O20q871N972J9536K2510J3689N627m62k709q481K4847O467J2678J4862
13896H3701j8228k0361n0996j2283J4065j3628R053J86q372J0104R73Q44k0198
13883b5140m472k267J7983J5860M6615L2559k5473l246J0558j9265j6723j2746
13871A4243m0126l2240K9742L1956k2008k9318L837K2443M139p765M7078J4379
$$ plain form
13859 36360 23358 3154 -11930 2659 -299 13029 14957 3024 1820 6174 18942 14796 16236
13846 16236 13217 33200 70988 55099 22779 25043 15964 15283 9696 4088 3486 -12178 -25075
13833 -25075 -35004 -40420 -42302 -33247 -22616 -39445 -52942 -35524 -20389 -14382 -10965 -11348 -6942
13820 -6942 -30423 -11341 12151 5985 -10703 1081 26428 34305 -8336 -14898 -6455 329 36552
13807 36552 36988 39782 33550 1661 5111 22057 -10529 -32075 -28095 -14866 21088 9131 -4386
13794 -4386 19609 44201 36535 24351 5956 -21049 -45109 -54515 -39385 -32326 -41462 -54422 -75960
13781 -75960 -63805 -44887 -11115 9939 16404 4731 17352 17314 32871 47233 47568 30305 30872
13768 30872 36176 40470 31518 33432 7840 -3728 18464 20302 11233 12514 11414 -525 -25141
$$ packed form
13859C6360j3002k0204j5084J4589k958J3328J928j1933j204M354J2768m146J440
13846A6236l019J9983L7788j5889l2320K264r079o81n587n608o02j5664j2897
13833b5075r929n416j882R055J0631j6829j3497J7418J5135O007L417l83M406
13820f942k3481J9082K3492o166j6688J1784K5347P877m2641o562Q443O784L6223
13807C6552M36K794o232l1889L450J6946l2586k1546L980J3229L5954j1957j3517
13794d386K3995K4592p666j2184j8395k7005k4060r406J5130P059r136j2960k1538
13781g5960J2155J8918L3772K1054O465j1673J2621l8J5557J4362L35j7263N67
13768C0872N304M294q952J914k5592j1568K2192J838r069J281j100j1939k4616
$$ plain form
13755 -25141 -39649 -19894 -14174 -32518 -35635 -16494 -5504 -7060 5914 4756 8993 -6927 -4049
13742 -4049 -7664 -35299 -55637 -39198 -24532 -16101 -14149 -13513 -26860 -19834 -26262 -29586 -31255 -44621
13728 -44621 -50181 -20511 -11496 6187 -6730 9149 2609 -14882 -10706 -32859 -42982 -30965
13716 -30965 -12710 -15255 3761 -24283 -46476 -40331 620 2930 -13483 -19737 -41785 -52167
13704 -52167 -39559 -25669 -21823 -13129 -13186 -24460 -23981 -34148 -32632 -38210 -51935 -46217 -50107 -11926
13690 -11926 -3364 -16746 -27138 -12708 -23525 -44260 -40027 -19427 -2436 7529 13139 2051
13678 2051 25584 33819 8713 -13907 34 -7199 -49011 -78820 -69090 -23008 39879 23128
13666 23128 -13222 -43942 -20683 3120 19846 25016 8219 6402 8171 15784 -3097 19161
$$ packed form
13755b5141j4508J9755N720j8344l117J9141J0990j556J2974j158M237j5920K878
13742d049l615k7635k0338J6439J4666Q431J952O36j3347P026o428l324j669j3366
13728d4621n560K9670R015J7683j2917J5879o540j7491M176k2153j0123J2017
13716c0965J8255k545J9016k8044k2193O145M0951K310j6413o254k2048j0382
13704e2167J2608J3890L846Q694n7j1274M79j0167J516n578j3725N718l890L8181
13690a1926Q562j3382j0392J4430j0817k0735M233K0600J6991R965N610j1088
13678B051K3533Q235k5106k2620J3941p233m1812k9809R730M6082O2887j6751
13666B3128l6350l0720K3259K3803J6726N170j6797j817J769P613j8881K2258
$$ plain form
13654 19161 60000 58954 9301 -27940 -53406 -48208 -34469 -44680 -46910 -16887 -5909 91
13642 91 -2156 -6990 -18863 -15577 9864 17462 25524 9245 -17354 -50097 -37685 -35746 -17231
13629 -17231 32027 49698 60941 65704 30289 -20674 -25052 -8053 -10707 -8815 5501 18982
13617 18982 19505 35913 11556 14489 29689 34095 32260 13052 12350 7645 3348 -2535 964 -9833
13603 -9833 -3856 -14436 -37820 -26640 -5304 4842 10707 22457 3068 13723 507 -1215
13591 -1215 -7903 -19991 -25873 -38691 -27779 -27458 -50814 -50790 -62816 -54786 -21166 -2161 -10048 -13786
13577 -13786 -23557 -23977 -24414 -32208 -36419 -48949 -64903 -71675 -44882 -11941 -1874 704 -23289
13564 -23289 -56362 -82011 -78490 -58428 -42341 -38866 -55177 -41529 -52698 -41090 -22172 -12545
$$ packed form
13654A9161M0839j046m9653l7241k5466N198J3739j0211k230L0023J0978O000
13642I1k247m834j1873L286K5441P598Q062j6279k6599l2743J2412J939J8515
13629a7231M9258J7671J1243M763l5415n0963m378J6999k654J892J4316J3481
13617A8982N23J6408k4357K933J5200M406j835j9208p02m705m297n883L499j0797
13603i833N977j0580k3384J1180K1336J0146N865J1750j9389J0655j3216j722
13591a215o688j2088n882j2818J0912L21k3356K4j2026Q030L3620J9005p887l738
13577a3786r771m20m37p794m211j2530j5954o772K6793L2941J0067K578k3993
13564b3289l3073k5649L521K0062J6087L475j6311J3648j1169J1608J8918R627
$$ plain form
13552 -12545 -22698 -32160 -23227 -38424 -57822 -6692 23014 9179 7236 412 -25006 -28392 -13707
13539 -13707 -30032 -29750 -48783 -50919 -24798 15574 3348 13234 19993 7961 5260 23304 1111
13526 1111 -4211 3147 29554 22057 7398 -3423 -25613 -25048 -16604 -27780 -21751 -22753 -42942
13513 -42942 -20981 23453 26805 20314 3906 14680 29233 -302 6430 -13771 8223 41348
13501 41348 49610 44106 41065 32467 -2910 -16000 -39917 -21948 -17464 721 -9478 -33206 -12768
13488 -12768 -12924 -33449 -27200 -17774 -11748 6240 6144 34078 20144 10600 26841 18518 666 4618
13474 4618 546 -8192 -20355 -26548 -37540 -10984 13592 -18360 9653 49958 22232 -212
13462 -212 -31026 -65145 -55868 -26733 -2424 24798 35224 39573 -7056 -21341 -4313 3592 -21079
$$ packed form
13552a2545j0153r462Q933j5197j9398N1130K9706j3835j943o824k5418l386J4685
13539a3707j6325K82j9033k136K6121M0372j2226R886O759j2032k701J8044k2193
13526A111n322P358K6407p497j4659j0821k2190N65Q444j1176O029j002k0189
13513d2942K1961M4434L352o491j6408J0774J4553k9535O732k0201K1994L3125
13501D1348Q262n504l041q598l5377j3090k3917J7969M484J8185j0199k3728K0438
13488a2768j56k0525O249R426O026J7988r6K7934j3934r544J6241q323j7852L952
13474D618m072q738j2163o193j0992K6556K4576l1952K8013M0305k7726k2444
13462b12l0814l4119R277K9135K4309K7222J0426M349m6629j4285J7028P905k4671
$$ plain form
13449 -21079 -24190 -6780 -11709 -8081 -11010 -42934 -13778 -5850 -30547 -8737 22879 -457 -13359
13436 -13359 18506 -13973 -48486 -62096 -48919 -32005 38431 42209 39565 36417 11381 -7187
13424 -7187 10760 31802 26027 8261 -11885 -18190 -20387 -21811 -12088 -36792 -17435 6660 9363
13411 9363 43141 47996 31109 28799 39259 19684 26291 45652 26939 18189 26192 26719 20916
13398 20916 -8948 -12845 22719 42380 42663 57782 42593 -32164 -41120 -25444 -45703 -54404 -38176
13385 -38176 1958 29947 24052 1507 -3629 11172 -3032 3996 11910 -8600 -9974 2102 12989
13372 12989 7162 4113 30147 36561 47944 94707 87263 32944 10096 -918 19043 38183
13360 38183 30472 21633 24865 922 515 37635 74446 69180 65124 34527 20254 38099 48155
$$ packed form
13449b1079l111J7410m929L628k929l1924K9156P928k4697K1810L1616k3336j2902
13436a3359L1865l2479l4513j3610J3177J6914P0436L778k644l148k5036j8568
13424g187J7947K1042n775j7766k0146o305k197j424R723k4704J9357K4095K703
13411I363L3778M855j6887k310J0460j9575O607J9361j8713q750Q003N27n803
13398B0916k9864l897L5564J9661K83J5119j5189p4757q956J5676k0259q701J6228
13385c8176M0134K7989n895k2545n136J4801j4204P028P914k0510j374J2076J0887
13372A2989n827l049K6034O414J1383M6763p444n4319k2848j1014J9961J9140
13360C8183p711q839L232k3943m07L7120L6811n266m056l0597j4273J7845J0056
$$ plain form
13347 48155 19485 2762 32693 22884 5234 2583 -11890 -31436 -20795 763 -30435 -36845
13335 -36845 -8771 3999 -35030 -28311 -28923 -2118 3808 -23095 -30793 -1897 25444 28122 33723
13322 33723 23313 1901 27551 13383 -2509 18128 16409 14652 18101 -4536 -22871 -28809
13310 -28809 -16313 -34892 -36795 -38134 -63724 -53737 -35809 -38215 -15652 25829 45430 42283 23427
13297 23427 15666 18254 39531 46037 65120 45802 20734 6983 14236 10411 31050 8873 -14844
13284 -14844 15560 36481 41602 20416 19651 25812 14867 6319 4246 -3800 -3203 -31696 -33876 -7248
13270 -7248 4048 960 -10441 6658 40374 62655 53971 35841 25035 19006 19163 12794 10204
13257 10204 -14648 -37209 -26478 -20608 -27674 -19309 -14441 10880 28207 39340 24300 34596
$$ packed form
13347D8155k8670j6723K9931r809j7650k651j4473j9546J0641K1558l1198o410
13335c6845K8074J2770l9029O719o12K6805N926k6903p698K8896K7341K678N601
13322C3723j0410k1412K5650j4168j5892K0637j719j757L449k2637j8335n938
13310b8809J2496j8579j903j339k5590R987J7928k406K2563M1481J9601l147j8856
13297B3427p761K588K1277O506J9083j9318k5068j3751P253l825K0639k2177k3717
13284a4844L0404K0921N121k1186p65O161j0945q548k073q046N97k8493k180K6628
13270g248J1296l088j1401J7099L3716K2281q684j8130j0806o029J57o369k590
13257A0204k4852k2561J0731N870p066Q365M868K5321J7327J1133j5040J0296
$$ plain form
13245 34596 63741 49606 -4639 -17416 3240 -27985 -9876 40256 48565 -8863 -41735 -36300
13233 -36300 -11783 -6049 -26070 -24440 5153 9367 4659 40921 78882 80337 70346 34589 1315
13220 1315 -851 21541 46042 34183 -7659 -3818 -6816 -18173 7154 13001 15871 17455 35736
13207 35736 48847 34280 47268 31136 4954 22380 22093 13561 36644 33949 20136 5104
13195 5104 -18660 2221 30340 -2930 -12552 5125 15370 11974 -3852 -8320 20045 23321 38352
13182 38352 34456 16352 -29998 -23439 -12689 -28434 -9791 15550 21353 27277 16368 6162
13170 6162 18337 43493 30382 -4654 -11797 -21642 -18499 -17921 -59276 -64022 -34764 -34859 -24802 -18089
13156 -18089 -15291 -4514 -11117 -11989 -17207 -22500 -10972 -11393 -25296 -20084 -9067 -395 -34423 -21929
$$ packed form
13245C4596K9145j4135n4245j2777K0656l1225J8109N0132Q309n7428l2872N435
13233c6300K4517N734k0021J630K9593M214m708L6262L7961J455r991l5757l3274
13220A315k166K2392K4501j1859m1842L841k998j1357K5327N847K870J584J8281
13207C5736J3111j4567J2988j6132k6182J7426k87q532K3083k695j3813j5032
13195E104k3764K0881K8119l3270r622J7677J0245l396j5826m468K8365L276J5031
13182C8352l896j8104m6350O559J0750j5745J8643K5341N803N924j0909j0206
13170F162J2175K5156j3111l5036p143r845L143N78m1355m746K9258r5J0057O713
13156a8089K798J0777o603q72n218n293J1528m21j3903N212J1017Q672l4028J2494
$$ plain form
13142 -21929 12042 28973 33859 46709 34847 1408 -29013 -28585 -25929 -21097 -12073 21183 48584
13129 48584 39176 32347 50785 47057 44610 43309 34386 38441 27462 9877 3617 -32293 -24997
13116 -24997 19591 32896 26189 29199 26531 23546 19713 15254 11660 -21555 -39881 -28535 -16715
13103 -16715 -14103 8374 38422 42466 13687 2295 -8526 -19402 -44364 -24098 -9639 -5234
13091 -5234 -7347 -1687 2363 -9348 -42402 -46775 -25867 -18051 -12676 -32942 -9681 4030 -32220
13078 -32220 -43125 -56262 -48139 -35297 -22681 -20787 -28266 -22131 -9952 23054 58671 58423 44934
13065 44934 23384 19522 17985 -8005 479 15026 -6379 -2970 8236 32370 46209 12841
13053 12841 15317 14015 39 -2642 156 22642 53381 25685 -4573 2102 24290 24412 14061
$$ packed form
13142b1929L3971J6931M886J2850j1862l3439l0421M28K656M832R024L3256K7401
13129D8584r408o829J8438l728k447j301q923M055j0979j7585o260l5910P296
13116b4997M4588J3305o707L010k668k985l833m459l594l3215j8326J1346J1820
13103a6715K612K2477L0048M044k8779j1392j0821j0876k4962K0266J4459M405
13091e234k113N660M050j1711l3054m373K0908P816N375k0266K3261J3711l6250
13078c2220j0905j3137Q123J2842J2616J894p479O135J2179L3006L5617k48j3489
13065D4934k1550l862j537k5990Q484J4547k1405L409J1206K4134J3839l3368
13053A2841K476j302j3976k681K798K2486L0739k7696l0258O675K2188J22j0351
$$ plain form
13040 14061 36433 32159 12183 6657 -8076 -44193 -50521 3180 16360 4302 2152 -2892 -21641
13027 -21641 -763 331 -3789 928 16684 26160 15983 15125 10465 -25549 -25694 16730 33489
13014 33489 6053 15326 14707 6 11749 5962 -11186 6646 17063 31900 35765 5871 -28265
13001 -28265 -15594 -11140 18953 34432 12727 39150 28751 -2106 14259 -2736 9777 14470
12989 14470 23227 26122 10589 7005 -5827 -43764 -55363 -43010 -26352 -16278 -11860 12444
12977 12444 -2031 -46092 -34767 -33529 -21435 -8570 -12724 -28314 -21509 -4445 24799 -23043
12965 -23043 -40573 -55706 -70157 -13908 16839 -4912 -24166 -39055 3572 -145 -2277 -21672
12953 -21672 -29361 -8865 4583 -5561 -17211 -7956 -3955 -17287 -43906 -20195 20498 -4371
$$ packed form
13040A4061K2372m274j9976n526j4733l6117o328N3701J3180j2058k150n044j8749
13027b1641K0878J094m120M717J5756R476j0177q58m660l6014j45M2424J6759
13014C3489k7436R273o19j4701J1743n787j7148J7832J0417J4837L865k9894l4136
13001b8265J2671M454L0093J5479k1705K6423j0399l0857J6365j6995J2513M693
12989A4470Q757K895j5533l584j2832l7937j1599J2353J6658J0074M418K4304
12977A2444j4475m4061J1325J238J2094J2865m154j5590O805J7064K9244m7842
12965b3043j7530j5133j4451N6249L0747k1751j9254j4889M2627l717k132j9395
12953b1672p689K0496J3448j0144j1650R255M001j3332k6619K3711M0693k4869
$$ plain form
12941 -4371 -22412 -8310 -25578 -19607 -17187 -20924 -1251 16745 21660 -14696 -25109 -23468 -3093
12928 -3093 -15537 -43889 -29445 -5242 -15523 -36929 -46292 -55392 -42050 -31862 -47504 -20170
12916 -20170 1158 -6968 -27860 -23608 -4942 4919 -5393 -28376 -39889 -35497 -31278 -31143 -7612
12903 -7612 27277 19597 7583 3298 9867 -11551 -26133 12526 1820 28784 9696 -6422
12891 -6422 -1490 -25912 -19099 -6151 -18427 -25014 5310 27931 29824 32069 32632 23941 33384 23599
12877 23599 8943 22820 18600 -6493 -17219 -12627 -4839 12838 32339 12920 14990 36540
12865 36540 25895 3859 11392 28677 45484 40093 28398 23731 17201 -2045 -7717 -29380 -17541
12852 -17541 -39693 -42674 -3466 5754 -22139 -33802 -25971 -20370 18698 38298 46577 22863 12253
$$ packed form
12941d371j8041J4102j7268N971K420l737J9673J7996M915l6356j0413J641K0375
12928c093j2444k8352J4444K4203j0281k1406r363r100J3342J0188j5642K7334
12916b0170K1328q126k0892M252J8666R861j0312k2983j1513M392M219J35K3531
12903g612L4889p680j2014m285O569k1418j4582L8659j0706K6964j9088j6118
12891f422M932k4422O813J2948j2276o587L0324K2621J893K245N63q691R443r785
12877B3599j4656J3877m220k5093j0726M592P788J7677J9501j9419K070K1550
12865C6540j0645k2036P533J7285J6807n391j1695m667o530j9246n672k1663J1839
12852a7541k2152k981L9208R220k7893j1663P831N601L9068J9600Q279k3714j0610
$$ plain form
12839 12253 2937 5010 10591 1272 -22127 -30225 -37170 -54704 -32133 -31893 -19115 13410 31991
12826 31991 31880 733 740 32633 60826 66852 38795 44999 44729 39415 -393 -35034 -43780 -41842
12812 -41842 -1935 9456 -18476 -10392 -26643 -52979 -31188 -19354 -6949 10480 35354 31154
12800 31154 51441 51799 14543 29015 30316 26075 43045 72153 109687 102546 84765 79377 63809
12787 63809 67292 54540 31581 7326 3550 25389 15873 26342 33437 38959 34147 3862 16404
12774 16404 51846 68879 63360 38185 13073 -12985 -40355 -33871 -15522 558 -7 -4052 -9941
12761 -9941 -24345 -24317 -174 15703 23135 8984 -7112 -17632 -11648 -33927 -10717 -10552 -40845
12748 -40845 -34509 -65008 -100086 -59910 -45193 -28238 4017 39527 52251 53269 29975 7109
$$ packed form
12839A2253r316K073N581r319k3399q098o945j7534K2571K40J2778L2525J8581
12826C1991j11l1147PL1893K8193O026k8057O204k70n314l9808l4641q746J938
12812d1842L9907J1391k7932Q084j6251k6336K1791J1834J2405J7429K4874m200
12800C1154K0287L58l7256J4472J301m241J6970K9108L7534p141j7781n388j5568
12787F3809L483j2752k2959k4255l776K1839r516J0469P095N522m812l0285J2542
12774A6404L5442J7033n519k5175k5112k6058k7370O484J8349J6080n65m045n889
12761i941j4404K8K4143J5877P432j4151j6096j0520N984k2279K3210J65l0293
12748d0845O336l0499l5078M0176J4717J6955L2255L5510J2724J018k3294k2866
$$ plain form
12736 7109 8277 20350 12535 -16486 -35944 -29456 -17064 5597 18898 -19573 -27702 -15418 -722
12723 -722 11106 7157 10300 1054 -4607 -25606 -28176 -22218 -35359 -13588 -7530 -14091 -311 -897
12709 -897 -1408 -322 13551 29885 29734 7226 8877 16558 4761 -5597 -16755 -17839 -16708 4439
12695 4439 -5973 -30658 1558 8288 -20091 -66028 -52727 -32979 -11041 -14332 -10809 27232
12683 27232 2302 -17769 -7229 -311 -5702 10347 -11705 -48672 -45948 -45476 -55234 -54149 -54481
12670 -54481 -72172 -57834 -26878 -10965 3672 11511 25900 17161 11824 23689 28012 19130 12934
12657 12934 10228 28073 45578 45041 41790 30165 49011 52096 21241 14801 5118 17185 37593
12644 37593 23631 -17002 -57476 -45155 -36712 -21553 -14816 -3355 6880 -14076 -12910 20120
$$ packed form
12736G109J168J2073p815k9021j9458O488J2392K2661J3301l8471q129J2284J4696
12723g22J1828l949L143r246n661k0999k570N958j3141K1771O058o561J3780n86
12709h97n11J086J3873J6334j51k2508J651P681j1797j0358j1158j084J131K1147
12695D439j0412k4685L2216O730k8379m5937J3301J9748K1938l291L523L8041
12683B7232k4930k0071J0540O918n391J6049k2052l6967K724M72r758J085l32
12670e4481j7691J4338L0956J5913J4637P839J4389q739n337J1865M323q882o196
12657A2934k706J7845J7505n37l251j1625J8846L085l0855o440r683J2067K0408
12644C7593j3962m0633m0474J2321Q443J5159O737J1461J0235k0956J166L3030
$$ plain form
12632 20120 9084 23397 30714 21612 17810 -4416 6837 29922 24543 9167 -1482 18847
12620 18847 7980 10817 32232 54675 30650 30628 22594 11547 18944 44797 50296 51123 25455
12607 25455 1401 -18220 -21651 -3364 5104 21857 32086 13442 21913 14660 -21873 -35364
12595 -35364 -60776 -48437 -23835 2022 48870 67300 46073 32223 33795 4677 -4179 -665
12583 -665 6696 20117 31912 20764 13464 25711 40482 51108 39938 24687 45412 47974 6422
12570 6422 9193 18112 51092 109152 120009 72365 24121 11836 -375 20126 4049 -12802
12558 -12802 1274 14948 14322 6591 -1146 -10167 -11616 24020 33422 7861 24404 13432 -5212
12545 -5212 798 14848 24332 20128 2913 -3809 -12833 7644 -17305 -3338 9012 -35194 -31349
$$ packed form
12632B0120j1036J4313P317r102l802k2226J1253K3085n379j5376j0649K0329
12620A8847j0867K837K1415K2443k4025k2q034j1047P397K5853N499Q27k5668
12607B5455k4054j9621l431J8287Q468J6753J0229j8644Q471p253l6533j3491
12595c5364k5412J2339K4602K5857M6848J8430k1227j3850J572k9118q856L514
12583f65P361J3421J1795j1148p300J2247J4771J0626j1170j5251K0725K562m1552
12570F422K771Q919L2980N8060J0857m7644m8244j2285j2211K0501j6077j6851
12558a2802J4076J3674o26p731p737r021j449L5636R402k5561J6543j0972j8644
12545e212O010J4050R484m204j7215o722r024K0477k4949J3967J2350m4206L845
$$ plain form
12532 -31349 -8271 -7057 -23461 -37694 -47602 -34000 -45666 -38592 -49292 -43493 -40227 -54581 -40834
12519 -40834 -38218 -28513 -38611 -29326 -47479 -41704 -15776 10068 40551 55263 20883 -24403
12507 -24403 -8313 -8366 -20342 -29639 -35481 -8239 -7855 -12165 -17561 -5853 -6945 -4723 -11105 -22684
12493 -22684 -38543 -8994 -22970 -39536 -22813 -9982 -4046 28144 50525 43756 21704 -16057
12481 -16057 -45623 -22728 4937 -3118 -32384 -51501 -21659 -874 -11128 -8717 -9722 -24151
12469 -24151 -16887 2367 22901 9961 -1477 10218 5343 -18107 -43221 -33671 -30349 -29568 -29704
12456 -29704 -27851 1234 -32892 -60735 -52495 -71773 -40528 -3189 32740 8018 -14634 3200
12444 3200 8118 -7582 -36365 -43340 -38523 -24720 -27372 -26226 -2299 9616 -8302 -62467 -102364
$$ packed form
12532c1349K3078J214j6404j4233r908J3602j1666P074j0700N799L266j4354J3747
12519d0834K616R705j0098R285j8153N775K5928K5844L0483J4712l4380m5286
12507b4403J6090n3j1976r297n842K7242L84m310n396J1708j092K222o382j1579
12493b2684j5859K9549j3976j6566J6723J2831N936L2190K2381o769k2052l7761
12481a6057k9566K2895K7665q055k9266j9117K9842K0785j0254K411j005j4429
12469b4151P264J9254K0534j2940j1438J1695m875k3450k5114R550L322P81j36
12456b9704J853K9085l4126k7843Q240j9278L1245L7339L5929k4722k2652J7834
12444C200M918j5700k8783o975M817J3803k652J146K3927J1915j7918n4165l9897
$$ plain form
12431 -102364 -69417 -26674 -27019 -28622 -24333 -21502 -42459 -62829 -74791 -31262 -8182 -14530 -14434
12418 -14434 -2841 -11180 -17338 -27913 -30460 -26253 -23806 13413 30587 50855 73160 59055 32717
12405 32717 39795 29654 6620 -14335 6758 12858 5093 -3427 -7310 4252 -26552 -24072 -28181
12392 -28181 -46530 -51088 -49103 -30647 -26679 -31785 -15315 -12751 -9626 6922 25322 5859 8769
12379 8769 -2813 -14702 -23076 -28209 -29797 -16963 -34360 -41988 -8781 6543 4571 7477 7961
12366 7961 -644 -7121 -9755 10557 39701 34721 9475 2651 13034 -13513 -32409 -25335 -12267
12353 -12267 -2518 27248 22067 28987 23638 18919 22377 15630 6227 -35480 -22545 23 14798
12340 14798 10885 4688 24376 38838 38475 31728 25600 33746 17387 19858 -4224 -25776 -15377
$$ packed form
12431a02364L2947M2743l45j603M289K831k0957k0370j1962M3529K3080o348R6
12418a4434J1593q339o158j0575k547M207K447L7219J7174K0268K2305j4105k6338
12405C2717P078j0141k3034k0955K1093O100p765q520l883J1562l0804K480m109
12392b8181j8349m558J985J8456L968n106J6470K564L125J6548J8400j9463K910
12379H769j1582j1889q374n133j588J2834j7397p628L3207J5324j972K906M84
12366G961q605o477k634K0312K9144m980k5246o824J0383k6547j8896P074J3068
12353a2267R749K9766n181O920n349m719L458o747r403m1707J2935K2568J4775
12340A4798l913o197J9688J4462l63o747o128Q146j6359K471k4082k1552J0399
$$ plain form
12327 -15377 193 9926 -20626 -32975 -46299 -38997 -45365 -53003 -45389 -45012 -31684 -44824 -48003
12314 -48003 -14671 1044 -13648 -25606 -31970 -18042 -19234 -1033 20608 41577 41472 11559
12302 11559 -14967 -26280 -27590 -31738 -21292 -3740 24271 -5960 -43525 -43908 -27230 -9080
12290 -9080 -24549 -19696 -8093 5840 21087 -6340 -20196 -1332 -27748 -3067 21703 18396
12278 18396 22595 18055 9038 -2461 -22423 -16648 3219 -7579 -7615 15660 17114 -25099 -33722
12265 -33722 -29258 -21317 -40144 -39345 -16965 7296 22603 -15223 -59885 -49531 -26320 -39025
12253 -39025 -24140 -17184 21303 19242 8339 5285 15733 1980 4709 -6403 -899 6272 -41817
12240 -41817 -61829 -84765 -72545 -48866 -30916 -25728 5145 10414 16024 3524 -14720 -35792
$$ packed form
12327a5377J5570R733l0552j2349j3324P302o368p638P614L77J3328j3140l179
12314d8003L3332J5715j4692j1958o364J3928j192J8201K1641K0969j05k9913
12302A1559k6526j1313j310m148J0446J7552K8011l0231l7565l83J6678J8150
12290i080j5469M853J1603J3933J5247k7427j3856J8864k6416K4681K4770l307
12278A8396M199m540r017j1499j9962N775J9867j0798l6K3275J454m2213q623
12265c3722M464P941j8827P99K2380K4261J5307l7826m4662J0354K3211j2705
12253c9025J4885O956L8487k061j0903l054J0448j3753K729j1112N504P171m8089
12240d1817k0012k2936J2220K3679J7950N188L0873N269N610j2500j8244k1072
$$ plain form
12228 -35792 -66559 -60802 -31051 -13137 -17730 -9438 25391 15768 -3290 11111 16331 18249 6128
12215 6128 -7730 1930 16421 26499 30407 8901 -18235 -15700 12015 61360 81150 71974 52060
12202 52060 35848 12425 -10302 -22652 3543 19468 31186 33153 32010 28244 30663 41895
12190 41895 45566 14324 -16240 17512 34613 31474 34024 50323 4336 -18697 -24629 -36394
12178 -36394 -33846 -8692 -6962 -12625 -16310 8188 -1541 -2687 25651 29922 33423 13523 -17516
12165 -17516 -11000 8142 2288 29140 32231 -4773 -27055 -9701 7387 29338 21674 12194 26974
12152 26974 21200 2311 7034 29002 14106 2723 -7522 -1672 43406 83262 70637 28196
12140 28196 37187 45577 27801 13975 25222 368 -33976 -53114 -24046 -14091 -19359 -10303 15355
$$ packed form
12228c5792l0767N757K9751J7914m593Q292L4829r623j9058J4401N220J918j2121
12215F128j3858R660J4491J0078L908k1506k7136K535K7715M9345J9790r176j9914
12202E2060j6212k3423k2727j2350K6195J5925J1718J967j143l766K419J1232
12190D1895L671l1242l0564L3752J7101l139K550J6299m5987k3033n932j1765
12178c6394K548K5154J730n663l685K4498r729j146K8338M271L501j9900l1039
12165a7516O516J9142n854K6852L091l7004k2282J7354J7088K1951p664r480J4780
12152B6974n774j8889M723K1968j4896j1383j0245N850M5078L9856j2625m2441
12140B8196Q991Q390j7776j3826J1247k4854l4344j9138K9068R955n268R056K5658
$$ plain form
12127 15355 -2103 -10039 545 16121 -7771 -3708 -11827 -25918 -24625 -18944 732 2256 -21258
12114 -21258 -30667 -48361 -64357 -60277 -57697 -49756 -7694 21208 8761 -28877 -25252 454 1026
12101 1026 -5768 6750 18210 15205 23759 45556 61954 70613 60096 -12246 -35137 -13564 9241
12088 9241 32950 35868 48968 20534 2695 -10512 -5239 26233 19165 -18689 -4229 14542
12076 14542 28972 38733 17282 -9933 -39193 -59073 -71748 -45902 -3671 20461 18471 13722
12064 13722 11695 14146 10239 2553 -23687 -22303 7694 33139 18833 27710 2517 9450 16417
12051 16417 37851 38386 31474 13601 -10624 -11109 -24172 -7165 -7504 -11426 10477 35246 28666
12038 28666 10331 11058 12024 1672 -2482 -16867 13879 50777 85411 78266 57394 49751 -5111
$$ packed form
12127A5355j7458p936J0584J5576k3892M063q119j4091J293N681J9676J524k3514
12114b1258r409j7694j5996M080K580P941M2062K8902j2447l7638L625K5706N72
12101A026o794J2518J1460l005Q554K1797J6398Q659j0517p2342k2891K1573K2805
12088I241K3709K918J3100k8434j7839j3207N273L1472p068l7854J4460J8771
12076A4542J4430R761k1451k7215k9260j9880j2675K5846M2231K4132j990m749
12064A3722k027K451l907p686k6240J384K9997K5445j4306Q877k5193O933O967
12051A6417K1434N35o912j7873k4225m85j3063J7007l39l922K1903K4769o580
12038B8666j8335P27R66j0352m154j4385L0746L6898L4634p145k0872p643n4862
$$ plain form
12025 -5111 -9662 2569 -6694 -11891 -7882 -26008 -22122 -1757 31868 34413 45276 2678 -29526
12012 -29526 -30937 -46914 -34216 -18661 269 -5498 -15206 23723 34853 6552 -2475 12794
12000 12794 3705 -9284 -7112 -25420 -33370 -20134 -32876 -47667 -4604 23872 7283 -1663
11988 -1663 -16528 -14694 7222 31646 2147 -16853 17463 41002 32424 33910 40792 21430 -2118
11975 -2118 -14518 -17331 4432 14723 8713 -8035 9289 11529 20647 3413 -22494 -26446 -35645
11962 -35645 -20325 -12195 -4451 18042 32946 11306 -21479 -44947 -26099 4661 -2617 -3866
11950 -3866 -22322 -16494 5449 7368 13666 -14057 -15784 -14776 -23430 -29370 -7742 10145 10986 18040
11936 18040 13747 -3703 -19203 -14025 -11094 -24142 -22725 4286 13786 33386 29295 -7758 -6891
$$ packed form
12025e111m551J2231r263n197M009j8126L886K0365L3625K545J0863m2598l2204
12012b9526j411j5977J2698J5555J8930n767r708L8929J1130k8301r027J5269
12000A2794r089j2989K172j8308p950J3236j2742j4791M3063K8476j6589q946
11988a663j4865J834K1916K4424k9499j9000L4316K3539q578J486O882j9362k3548
11975b118j2400k813K1763J0291o010j6748J7324K240R118j7234k5907l952r199
11962c5645J5320Q130P744K2493J4904k1640l2785k3468J8848L0760p278j249
11950c866j8456N828K1943J919O298k7723j727J008q654n940K1628J7887Q41P054
11936A8040m293j7450j5500N178K931j3048J417K7011R500J9600m091l7053Q67
$$ plain form
11923 -6891 11029 -9714 -15508 9688 27452 17161 11896 -1544 -10660 -7507 22691 33004 22267
11910 22267 15943 10730 -3200 2618 11785 21609 18002 -169 -3547 -11022 -16618 -28307 -31819 -20307
11896 -20307 -29918 -23540 -34513 -37785 -17395 -13656 -27717 -13055 -9480 -11199 9870 -4244 -31664
11883 -31664 -45779 -45555 -43248 -15282 -18505 -15045 -9787 5749 29766 24253 16733 6324 23538
11870 23538 31625 32400 39382 48309 55390 48162 11527 12555 21197 15362 -18895 -27197 -33349 -29259
11856 -29259 -16876 -24621 -22531 -21978 -34902 -37512 -39905 -33735 -17357 -1342 -38166 -33552 -18626
11843 -18626 -9199 -4356 7431 -11936 -22199 183 -16358 -6753 -7709 -16252 -24466 -33966 -21718
11830 -21718 -24722 -19318 -7435 16662 41609 36148 44210 20792 19834 26469 36568 24455 39474
$$ packed form
11923f891J7920k0743n794K5196J7764j0291n265j3440r116L153L0198J0313j0737
11910B2267o324n213j3930N818R167R824l607j8171l378p475n596j1689l512J1512
11896b0307r611O378j0973l272K0390L739j4061J4662L575j719K1069j4114k7420
11883c1664j4115K24K307K7966l223L460N258J5536K4017n513p520j0409J7214
11870B3538Q087P75O982Q927P081p228l6635J028Q642n835l4257q302o152M090
11856b9259J2383p745K090N53j2924k610k393O170J6378J6015l6824M614J4926
11843a8626R427M843J1787j9367j0263K2382j6541R605r56q543q214r500J2248
11830b1718l004N404J1883K4097K4947n461Q062k3418r58O635J0099j2113J5019
$$ plain form
11817 39474 17288 -20710 -35030 -26726 -32275 -17542 -16959 -25771 -34511 -14891 -6114 6577 15494
11804 15494 2167 1884 -7361 -16505 9208 3018 -33495 -49041 -19517 -12619 -2467 3771 -12076
11791 -12076 -22184 -49551 -16429 14277 5944 -4084 -7375 8815 -5400 -10171 8067 21581
11779 21581 19122 17315 40716 60156 23571 -1928 -8302 -4910 -21721 -33558 -48149 -27578
11767 -27578 -21403 1097 16641 6834 -17698 -43275 -16742 -6013 19464 22605 -12418 -19509
11755 -19509 -16330 -9438 -12174 3108 -16437 -32525 -2534 14431 -16265 -38136 -55500 -26349
11743 -26349 -49607 -58412 -55515 -56912 -26539 11712 13654 6430 -18493 -13880 -27456 -11281 11317
11730 11317 31451 4885 -16438 -26883 -35860 -26826 -40450 -22413 33262 31828 2667 -27428
$$ packed form
11817C9474k2186l7998j4320Q304n549J4733N83q812q740J9620Q777J2691Q917
11804A5494j3327k83r245r144K5713o190l6513j5546K9524O898J0152O238j5847
11791a2076j0108k7367L3122L0706q333j0028l291J6190j4215m771J8238J3514
11779B1581k459j807K3401J9440l6585k5499o374L392j6811j1837j4591K0571
11767b7578O175K2500J5544r807k4532k5577K6533J0729K5477L141l5023p091
11755a9509L179O892k736J5282j9545j6088K9991J6965l0696k1871j7364K9151
11743b6349k3258q805K897j397L0373L8251J942p224k4923M613j3576J6175K2598
11730A1317K0134k6566k1323j0445q977R034j3624J8037N5675j434k9161l0095
$$ plain form
11718 -27428 -11800 -5092 -26678 -32712 -7861 799 -4110 -6494 -6284 11138 8652 2330 14016
11705 14016 23389 14100 25105 20160 13806 15476 13614 -1682 13782 4744 28581 57958 25410
11692 25410 39424 32772 22441 -4610 5437 11732 6182 -14649 -13728 -16957 -14513 -7069 -17393
11679 -17393 -58128 -51010 -43481 -5375 2680 -8322 -25276 -18911 16614 53719 58237 44277 36247
11666 36247 53085 20317 -13495 -23418 -30726 -11851 17879 45901 61528 39351 30223 -148
11654 -148 -915 9044 -10080 -40195 -34015 -29307 -20134 -18839 -18829 -20457 22026 44411 21827 -165
11640 -165 -18806 -8469 -20002 -32229 -17937 14583 11919 -29276 -27124 -36715 -40990 -33812 -7032
11627 -7032 -36543 -53030 -79843 -88518 -60306 -25744 -42335 -32418 -26857 -9338 -8825 8711 11665
$$ packed form
11718b7428J5628O708k1586o034K4851Q660m909k384K10J7422k486o322J1686
11705A4016R373r289J1005m945o354J670j862j5296J5464r038K3837K9377l2548
11692B5410J4014o652j0331k7051J0047O295n550k0831R21l229K444P444j0324
11679a7393m0735P118P529L8106Q055j1002j6954O365L5525L7105M518j3960q030
11666C6247J6838l2768l3812r923p308J8875K9730K8022J5627k2177r128l0371
11654a48p67R959j9124l0115O180M708R173J295J0j628M2483K2385k2584k1992
11640a65j8641J0337j1533j2227J4292L2520k664m1195K152r591m275P178K6780
11627g032k9511j6487k6813q675K8212L4562j6591R917N561J7519N13J7536K954
$$ plain form
11614 11665 28456 28530 34125 36099 -8150 -27079 -25526 -27326 -26035 -8346 -17201 -3853 -30997
11601 -30997 -30227 -14892 -13836 -352 11061 -7289 -18262 -7690 2585 20042 45735 33457
11589 33457 -3512 -3978 -31027 -27244 23191 33012 19968 -4116 -7884 -26975 -31980 -23794 22617
11576 22617 29464 12482 -2646 944 8189 31180 50325 67053 55285 41226 45878 34115
11564 34115 33098 25373 26048 42814 73400 90606 152797 181947 160980 111984 85173 51876
11552 51876 -1562 21824 31738 22954 29489 30450 43149 65823 99230 139067 165791 173978 159909
11539 159909 124711 66415 32415 20120 -18752 -24670 -25324 -38170 -30775 1285 18335 12750
11527 12750 -11319 -14182 -1626 -13736 -8376 505 8563 -25562 -21687 -20731 -20732 -35797 -57176 -44180
$$ packed form
11614A1665J6791P4N595J974m4249j8929J553j800J291J7689q855J3348k7144
11601c0997P70J5335J056J3484J1413j8350j0973J0572J0275J7457K5693j2278
11589C3457l6969m66k7049L783N0435R821j3044k4084l768j9091n005Q186M6411
11576B2617O847j6982j5128L590P245K2991J9145J6728j1768j4059M652j1763
11564C4115j017p725O75J6766L0586J7206O2191K9150k0967m8996k6811l3297
11552E1876n3438K3386R914q784O535R61J2699K2674L3407L9837K6724Q187j4069
11539A59909l5198n8296l4000j2295l8872n918o54j2846P395L2060J7050n585
11527A2750k4069k863J2556j2110N360Q881Q058l4125L875R56jj5065k1379J2996
$$ plain form
11513 -44180 -22761 8278 -2331 -29123 -16140 8215 39646 44884 40034 15288 7314 6288
11501 6288 -965 -18259 -16277 -9102 -5628 -3947 4881 5320 -16027 -23558 -34460 -11971 2378 2516
11487 2516 -1634 -17524 -26741 -17577 5288 18911 19171 5039 -22388 12373 14734 4759 -14377
11474 -14377 -22953 -2070 12261 22243 -2375 -3530 17149 45411 41987 27524 4275 15855
11462 15855 24139 8968 -16834 -9354 -15993 -24727 -29504 -37447 -24343 -33086 -44032 -36225 10631
11449 10631 8054 14746 22977 38874 33506 19771 5773 -17661 -47999 -52210 -44491 -77115 -84898
11436 -84898 -69473 -41348 14684 39922 39419 26057 23739 40907 53671 39029 15743 -6997
11424 -6997 -20349 -31063 -30390 -12491 -4994 -17113 -9201 -2557 15301 -1209 -1682 11868 22197
$$ packed form
11513d4180K1419L1039j0609k6792J2983K4355L1431N238m850k4746p974j026
11501F288p253j7294J982P175L474J681Q828M39k1347p531j0902K2489J4349J38
11487B516m150j5890r217R164K2865J3623K60j4132k7427L4761K361r975j9136
11474a4377q576K0883J4331R982k4618j155K0679K8262l424j4463k3249J1580
11462A5855Q284j5171k5802P480o639q734m777p943J3104q743j0946P807M6856
11449A0631k577O692Q231J5897n368j3735j3998k3434l0338m211P719l2624p783
11436h4898J5425K8125N6032K5238n03j3362k318J7168J2764j4642k3286k2740
11424f997j3352j0714O73J7899P497j2119P912O644J7858j6510m73J3550J0329
$$ plain form
11411 22197 32580 15173 26391 2101 -12737 -9424 -11217 -8794 -27034 -23774 -19820 -38887 -25255
11398 -25255 19048 17335 -11842 -24669 -23771 -6890 -5992 -1852 7153 12021 7070 -1674 1491 18509
11384 18509 13852 23766 20921 9820 -13792 -9521 5868 18944 -2973 -1887 1787 -24676 -35005
11371 -35005 -11269 -37834 -46922 -49682 -14164 44533 13228 -18259 -25579 -45354 -39803 -32942 -8227
11358 -8227 -4371 -14086 -22216 -39084 -22130 11003 12243 17009 16674 -7762 -12207 -10179 -3911 -3786
11344 -3786 12022 19649 -8265 -30736 -26843 -3325 17662 17455 25446 37574 41813 11823 -5448
11331 -5448 358 10937 10332 25483 32687 45824 63467 36897 -8930 -12315 -29098 -19848 16415
11318 16415 37600 36523 50352 63503 54135 2204 -26578 -23807 -10403 4692 3584 -20364
$$ packed form
11411B2197J0383j7407J1218k4290j4838L313j793K423j8240L260L954j9067J3632
11398b5255M4303j713k9177j2827Q98J6881Q98M140R005M868m951q744L165J7018
11384A8509m657R914k845j1101k3612M271J5389J3076k1917J086L674k6463j0329
11371c5005K3736k6565r088k760L5518N8697l1305l1487p320j9775N551O861K4715
11358h227L856r715q130j6868J6954L3133J240M766l35k4436m445K028O268J25
11344c786J5808P627k7914k2471L893K3518K0987k07P991J2128M239k9990j7271
11331e448N806J0579o05J5151P204J3137J7643k6570m5827l385j6783R250L6263
11318A6415K1185j077J3829J3151r368n1931k8782K771J3404J5095j108k3948
$$ plain form
11306 -20364 -14694 -5497 -11615 17935 23868 56500 81454 91071 109300 138294 174581 187836 179632
11293 179632 115645 86962 72247 73873 44080 37075 44555 30241 30734 37633 52065 45374 41233
11280 41233 25628 10248 4894 5411 -8522 -20902 -28687 -29680 -16045 -16818 -27508 19679 31950
11267 31950 33430 36351 37404 46061 74231 62248 38666 28115 13482 -2516 -13438 -34097
11255 -34097 -40119 -12043 -21098 -33734 -44496 -68367 -66220 -83826 -76202 -33313 -7473 44536
11243 44536 79239 79540 20971 -16687 -25115 -27181 -22187 3970 -9460 -34817 -53338 -33758 -6582
11230 -6582 17208 52993 10013 -8790 15115 43483 21857 4624 17543 4153 -24857 -40997
11218 -40997 -61939 -63751 -23490 -44505 -32984 -1373 23834 6887 -13362 7892 36289 35082
$$ packed form
11306b0364N670R197o118K9550N933L2632K4954R617J8229K8994L6287J3255q204
11293A79632o3987k8683j4715J626k9793p005P480j4314M93O899J4432o691m141
11280D1233j5605j5380n354N17j3933j2380p785r93J3635p73j0690M7187J2271
11267C1950J480K921J053Q657K8170j1983k3582j0551j4633j5998j0922k0659
11255c4097o022K8076r055j2636j0762k3871K147j7606P624M2889K5840N2009
11243D4536L4703L01n8569l7658q428k066M994K6157j3430k5357j8521J9580K7176
11230f582K3790L5785m2980j8803K3905K8368k1626j7233J2919j3390k9010j6140
11218d0997k0942j812M0261k1015J1521L1611K5207j6947k0249K1254K8397j207
$$ plain form
11206 35082 46652 51637 46313 24353 5600 -8685 -15841 -10391 -10457 6473 -31057 -53448 -37297
11193 -37297 -37889 -33808 -16436 -1106 1785 -14438 -38349 -45587 -11700 -4635 -11608 22847 117876
11180 117876 185731 187880 163947 156850 172542 145480 87332 59454 5664 -25786 -12798 16514
11168 16514 29887 14621 34794 55216 54172 41540 10870 15319 21153 22941 51181 54032 63553
11155 63553 53048 63994 127446 198013 251914 333581 495961 779880 1251431 1714954 1696588
11144 1696588 1252183 826084 559354 400093 277369 180961 134268 122396 80091 50133
11134 50133 55283 52603 49877 32278 45406 65055 63295 38918 18755 -2706 -21666 -24370 3128
11121 3128 17110 20340 42038 45839 34008 11648 31856 28624 13823 20956 26604 31178 9118
$$ packed form
11206C5082J1570M985n324k1960j8753j4285p156N450o6J6930l7530k2391J6151
11193c7297n92M081J7372J5330K891j6223k3911p238L3887P065o973L4455R5029
11180A17876O7855K149k3933p097J5692k7062n8148k7878n3790l1450J2988K9312
11168A6514J3373j5266K0173K0422j044j2632l0670M449N834J788K8240K851R521
11155F3553j0505J0946O3452P0567N3901Q1667J62380K83919M71551M63523j8366
11144A696588m44405m26099k66730j59261j22724r6408m6693j1872m2305k9958
11134E0133N150k680k726j7599J3128J9649j760k4377k0163k1461j8960k704K7498
11121C128J3982L230K1698L801j1831k2360K0208l232j4801P133N648M574k2060
$$ plain form
11108 9118 54732 122502 133893 125964 84313 24074 7983 41391 3618 -40094 -31713 -21591
11096 -21591 -18434 -34539 -40071 -24739 -35923 -49574 -19741 -5914 -6904 -13581 -2808 5985 -15348
11083 -15348 -27432 -8617 -14373 -32531 -16105 -11104 -9230 33319 42812 33055 21343 43190 20736
11070 20736 -438 46846 64023 28572 16153 -9335 -3978 38449 66256 61869 76265 120712
11058 120712 137659 88431 38782 16385 17175 -10692 -23075 -17928 -41403 -48086 -588 29827
11046 29827 13989 -7308 -25392 -47153 -29384 -25025 -11941 -32105 -50384 -34304 -4556 27557
11034 27557 49765 43345 11170 15042 15214 -21989 -43640 -53020 -57121 -37814 -25714 -576 11927
11021 11927 -9794 -35245 -37743 -2929 18575 -6499 -11738 -6364 -8479 1150 2245 20122 60844
$$ packed form
11108I118M5614O7770J1391p929m1651o0239j6091L3408l7773m3712Q381J0122
11096b1591L157j6105n532J5332j1184j3651K9833J3827r90o677J0773Q793k1333
11083a5348j2084J8815n756j8158J6426N001J874M2549R493r757j1712K1847k2454
11070B0736k1174M7284J7177l5451j2419k5488N357M2427K7807m387J4396M4447
11058A20712J6947m9228m9649k2397P90k7867j2383N147k3475o683M7498L0415
11046B9827j5838k1297j8084k1761J7769M359J3084k0164j8279J6080K9748L2113
11034B7557K2208o420l2175L872J72l7203k1651r380m101J9307J2100K5138J2503
11021A1927k1721k5451k498L4814K1504k5074n239N374k115R629J095J7877M0722
$$ plain form
11008 60844 67818 64959 48861 13483 5599 40327 45950 4153 -19972 33028 92146 90330 64008
10995 64008 78142 139244 204520 185219 111222 96848 117102 126635 84941 65137 71104 60640
10983 60640 68587 55979 39828 18786 32579 53039 44444 19300 26658 -835 -24294 -29531
10971 -29531 -12889 -3493 9957 15377 5324 12816 13442 4018 13429 15215 -7174 -8291 -17463 257
10957 257 5456 -8200 14078 27612 44999 68104 57144 57324 24755 -13725 2209 -22376 -47577
10944 -47577 -24010 -24702 -34556 -55032 -39555 -24212 -30064 -46648 -47027 -47397 -32608 -37807 -22920
10931 -22920 9666 20653 28744 10983 -7580 -10779 -21053 -24008 -22883 -13274 -3114 16842 16668
10918 16668 5170 7075 48809 82462 85557 66620 73365 74138 55605 59240 83203 88306 36289
$$ packed form
11008F0844O974k859j6098l5378p884L4728N623m1797k4125N3000N9118j816k6322
10995F4008J4134O1102O5276j9301p3997j4374K0254R533m1694j9804N967j0464
10983F0640P947j2608j6151k1042J3793K0460q595k5144P358k7493k3459n237
10971b9531J6642R396J3450N420j0053P492O26r424R411J786k2389j117r172J7720
10957B57N199j3656K2278J3534J7387K3105j0960J80l2569l8480J5934k4585k5201
10944d7577K3567o92r854k0476J5477J5343n852j6584l79l70J4789n199J4887
10931b2920L2586J0987Q091j7761j8563l199j0274k955J125R609J0160J9956j74
10918A6668j1498J905M1734L3653L095j8937O745P73j8533L635K3963N103n2017
$$ plain form
10905 36289 7165 -3005 -10960 -10672 -9434 4736 -4402 8724 18644 51214 92568 72347 65878
10892 65878 91950 65380 33332 14614 30030 39355 36516 46170 59274 50833 68102 84096
10880 84096 98735 94779 63982 45340 66336 73987 83621 110813 124283 99579 106888 141402
10868 141402 174484 186341 209517 195429 186191 200204 249794 296426 282644 263615 241863 218098
10856 218098 199296 191382 183550 225999 239796 169327 122542 115652 131390 123907 126109 117363 98251
10843 98251 91257 102334 114381 124804 111330 105373 146258 149108 114533 129967 170096 189990
10831 189990 174596 164167 158550 160190 166984 162289 153078 153149 159407 170527 177367 200861 203317 212105
10817 212105 234920 262756 266714 289166 315404 311127 288499 280866 267817 294796 313225 329581
$$ packed form
10905C6289k9124j0170p955K88J238J4170r138J3126R920L2570M1354k0221o469
10892F5878K6072k6570l2048j8718J5416R325k839R654J3104q441J7269J5994
10880H4096J4639l956l0797j8642K0996P651R634K7192J3470k4704P309L4514
10868A41402L3082J1857K3176j4088r238J4013M9590M6632j3782j9029k1752k3765
10856B18098j8802p914p832M2449J3797p0469m6785o890J5738p483K202q746j9112
10843I8251o994J1077J2047J0423j3474n957M0885K850l4575J5434M0129J9894
10831A89990j5394j0429n617J640O794m695r211P1O258J1120O840K3494K456Q788
10817B12105K2815K7836L958K2452K6238m277k2628p633j3049K6979J8429J6356
$$ plain form
10805 329581 353755 382128 381278 358937 363596 372457 379091 397403 439692 491432 504730 493182
10793 493182 519522 540579 554686 598428 669265 677216 695007 710499 731012 730977 758647 776067
10781 776067 807402 845651 894974 953567 999603 1026282 1087049 1180506 1325661 1416269 1516939
10770 1516939 1638177 1778970 2007045 2248798 2497732 2802513 3199382 3695192 4327166
10761 4327166 5170292 6089774 6530525 6566537 6725077 7192161 7971320 9035216 10382196
10752 10382196 12306140 15029211 18795099 23937411 31003604 41067355 55891136 78979694
10744 78979694 118055677 184904588 281040363 346782410 299580828 205623240 134180939
10737 134180939 90052094 63460643 46371667 34971887 27299168 21994211 18284827
$$ packed form
10805C29581K4174K8373q50k2341M659Q861O634J8312M2289N1740J3298j1548
10793D93182K6340K1057J4107M3742P0837P951J7791J5492K0513l5K7670J7420
10781G76067L1335L8249M9323N8593M6036K6679O0767R3457J45155R0608J00670
10770A516939J21238J40793K28075K41753K48934L04781L96869M95810O31974
10761D327166Q43126R19482M40751L6012J58540M67084P79159J063896J346980
10752A0382196J923944K723071L765888N142312P066193J0063751J4823781K3088558
10744G8979694L9075983O6848911R6135775O5742047m7201582r3957588p1442301
10737A34180939m4128845k6591451j7088976j1399780p672719n304957l709384
$$ plain form
10730 18284827 15529498 13298460 11460556 9963946 8775849 7831289 7126570 6662522
10722 6662522 6497029 6468666 6035219 5241112 4534063 4007928 3654820 3394922 3188792 3001652
10712 3001652 2834979 2624098 2406915 2222743 2093801 2000378 1891454 1798500 1747201 1657867
10702 1657867 1549828 1456127 1405639 1311176 1249220 1200363 1178623 1143001 1125266 1150343 1212732
10691 1212732 1342140 1591504 1985062 2634327 3281730 3168051 2517637 1875690 1451459
10682 1451459 1181532 997111 875353 777161 715140 684094 646110 635367 622553 591688 561455
10671 561455 546458 506611 493693 490804 485167 457711 449886 415685 416123 423151 396164 403404 436888
10658 436888 459308 450885 411778 391261 383446 350610 346354 360257 347381 307851 295108 275970
$$ packed form
10730A8284827k755329k231038j837904j496610j188097r44560p04719m64048
10722F662522j65493k8363m33447p94107p07049n26135l53108k59898k06130j87140
10712C001652j66673k10881k17183j84172j28942r3423j08924r2954n1299q9334
10702A657867j08039r3701n0488r4463o1956m8857k1740l5622j7735K5077O2389
10691A212732J29408K49364L93558O49265O47403j13679o50414o41947m24231
10682A451459k69927j84421j21758r8192o2021l1046l7984j0743j2814l0865l0233
10671E61455j4997l9847j2918k889n637k7456p825l4201M38P028k6987P240L3484
10658D36888K2420q423l9107k0517p815l2836m256J3903j2876l9530j2743j9138
$$ plain form
10646 275970 254290 262409 282469 285891 270426 292232 298075 281005 262672 254232 248499 241724 225037
10633 225037 210408 196610 209794 220501 182399 187622 246783 287125 265482 229280 203724 198830
10621 198830 206401 234681 240036 254639 281842 303208 398129 451071 428662 351448 305252 272196
10609 272196 260333 225970 214800 193296 170445 160643 188359 206608 210480 173349 178546 178322
10597 178322 175696 164380 162481 144105 148808 146780 152487 152650 169273 174204 142080 142685 145735 154722
10583 154722 182260 191743 211432 227308 219852 197536 180480 146064 119138 87751 82256 74095
10571 74095 94018 121666 135812 145192 108842 93544 93295 108015 124040 132403 168558 169487 167538
10558 167538 139371 128387 146536 129581 118369 130162 131571 135942 161389 150778 126445 108871
$$ packed form
10646B75970k1680Q119K0060L422j5465K1806N843j7070j8333q440n733o775j6687
10633B25037j4629j3798J3184J0707l8102N223N9161M0342k1643l6202k5556m894
10621A98830P571K8280N355J4603K7203K1366R4921N2942k2409p7214m6196l3056
10609B72196j1863l4363j1170k1504k2851r802K7716J8249L872l7131N197k24
10597A78322k626j1316j899j8376M703k028N707J63J6623M931l2124O05L050Q987
10583A54722K7538R483J9689J5876p456k2316j7056l4416k6926l1387n495q161
10571G4095J9923K7648J4146R380l6350j5298k49J4720J6025Q363L6155R29j949
10558A67538k8167j0984J8149j6955j1212J1793J409M371K5447j0611k4333j7574
$$ plain form
10546 108871 96609 72359 62388 71931 56373 85108 130520 143951 136218 128024 94406 77329
10534 77329 37531 22730 48508 44396 59479 51938 50736 48457 18371 52661 80289 56313
10522 56313 68261 89990 67144 56941 51181 60260 60328 46463 32692 38117 70652 66053 42095
10509 42095 22665 12552 -3917 9254 34998 32226 33921 55574 52919 56226 68784 47658
10497 47658 20703 12796 7005 19363 62761 64592 34984 55117 124682 177427 154781 100176
10485 100176 68801 54652 54289 69158 48684 57136 60593 44594 44226 57290 95602 116232 88119
10472 88119 62585 51043 48508 45585 52390 57742 73343 50779 50560 61357 90968 105058 103349
10459 103349 97119 88208 63412 37829 37476 35959 18044 -13053 1919 92 3004 33356 58620
$$ packed form
10546A08871j2262k4250r971R543j5558K8735M5412J3431p733q194l3618j7077
10534G7329l9798j4801K5778m112J5083p541j202k279l0086L4290K7628k3976
10522E6313J1948K1729k2846j0203n760R079O8j3865j3771N425L2535m599k3958
10509D2095j9430j0113j6469J3171K5744k772J695K1653k655L307J2558k1126
10497D7658k6955p907n791J2358M3398J831k9608K0133O9565N2745k2646n4605
10485A00176l1375j4149l63J4869k0474Q452L457j5999l68J3064L8312K0630k8113
10472H8119k5534j1542k535k923O805N352J5601k2564k19J0797K9611J4090j709
10459A03349o230q911k4796k5583l53j517j7915l1097J4972j827K912L0352K5264
$$ plain form
10446 58620 67380 73047 61869 64535 89928 91426 84446 50008 48592 34482 -716 -7521 -15912
10433 -15912 -2429 11055 4874 20243 32872 37240 17690 -3829 -10545 -6132 14965 36242
10421 36242 30683 11373 -2609 2920 12102 17036 20385 54999 51663 25012 44740 62222 58604
10408 58604 23464 12504 1108 24432 -3410 -7983 21585 14709 -9414 -23228 -15943 31373
10396 31373 56250 77311 66819 44604 50412 71018 43564 22597 25937 25209 8275 6418 45307
10383 45307 79110 81492 68849 60835 56368 38139 20563 18977 21287 12218 -913 -5840 8519
10370 8519 -56 -11156 6627 46614 56575 29977 33996 44124 64534 53914 29770 46016
10358 46016 46788 32942 54453 63938 43006 52412 57048 55965 73759 72687 63681 87869 73532
$$ packed form
10446E8620Q760N667j1178K666K5393J498o980l4438j416j4110l5198o805q391
10433a5912J3483J3484o181J5369J2629M368j9550k1519o716M413K1097K1277
10421C6242n559j9310j3982N529R182M934L349L4614l336k6651J9728J7482l618
10408E8604l5140j0960j1396K3324k7842m573K9568o876k4123j3814P285M7316
10396C1373K4877K1061j0492k2215N808K0606k7454k0967L340p28j6934j857L8889
10383D5307L3803K382j2643q014m467j8229j7576j586K310r069j3131m927J4359
10370H519q575j1100J7783L9987R961k6598M019J0128K0410j0620k4144J6246
10358D6016P72j3846K1511R485k0932R406M636j083J7794j072r006K4188j4337
$$ plain form
10345 73532 66087 54631 69649 106624 139044 156073 173342 199412 227297 321359 436907 602959
10333 602959 947813 1433410 1765029 1568303 1116980 764520 502305 337806 240992 200421
10323 200421 158774 149170 153038 154217 159933 138674 110531 81495 81951 108835 101223 79765 66553
10310 66553 70937 57610 23686 3449 -25202 -38630 -38680 -27427 6053 7729 -21449 -15004 2992
10297 2992 41295 42602 10519 -17298 -9928 1208 6848 535 38288 59175 82696 44713 28705
10284 28705 35925 52705 25693 5573 -9371 1219 14742 10798 17203 38024 31254 69445
10272 69445 91034 62762 50293 54962 57911 45778 30911 35698 43823 52789 40385 43955 85335
10259 85335 76286 35794 32680 30042 8844 2177 12935 2996 12767 17503 -3871 -16863 -32823
$$ packed form
10345G3532p445j1456J5018L6975L2420J7029J7269K6070K7885R4062J15548J66052
10333F02959L44854M85597L31619j96726m51323l52460k62215j64499r6814m0571
10323B00421m1647r604L868J179N716k1259k8143k9036M56K6884p612k1458j3212
10310F6553M384j3327l3924k0237k8651j3428n0J1253L3480J676k9178O445J7996
10297B992L8303J307l2083k7817P370J1136N640o313L7753K0887K3521l7983j6008
10284B8705P220J6780k7012k0120j4944J0590J3523l944O405K0821o770L8191
10272F9445K1589k8272j2469M669K949j2133j4867M787Q125Q966j2404L570M1380
10259H5335r049m0492l114k638k1198o667J0758r939R771M736k1374j2992j5960
$$ plain form
10246 -32823 -18687 -7621 47851 64266 45720 22107 3714 16745 44602 48568 19875 8611
10234 8611 13894 -164 -17781 -402 -2639 20403 60482 48541 78392 88028 65015 72601 56101
10221 56101 38236 32912 28681 23580 28598 43047 20965 -10714 -22017 -15254 -3206 7632 44914
10208 44914 44485 10742 11934 25649 30554 5520 3098 15673 14812 7722 -7691 17501 40426
10195 40426 71821 60780 16537 -1273 48543 30731 22776 23236 25858 33170 30893 39161 12525
10182 12525 -1545 16263 41612 41443 8278 -2048 43184 37744 -18109 -50370 -15979 49808
10170 49808 37084 4712 -19545 1020 18760 14196 11894 1229 4698 -4338 5381 38363 56837
10157 56837 50411 39913 21915 43322 45301 37383 42795 54173 71378 46939 47138 48666 59230
$$ packed form
10246c2823J4136J1066N5472J6415j8546k3613j8393J3031K7857L966k8693j1264
10234H611N283j4058j7617J7379k237K3042M0079j1941K9851R636k3013P586j6500
10221E6101j7865n324m231n101N018J4449k2082l1679j1303O763J2048J0838L7282
10208D4914m29l3743J192J3715M905k5034k422J2575q61p090j5413K5192K2925
10195D0426L1395j1041m4243j7810M9816j7812p955M60K622P312k277Q268k6636
10182A2525j4070J7808K5349j69l3165j0326M5232n440n5853l2261L4391O5787
10170D9808j2724l2372k4257K0565J7740m564k302j0665L469r036R719L2982J8474
10157E6837o426j0498j7998K1407J979p918N412J1378J7205k4439J99J528J0564
$$ plain form
10144 59230 68407 52712 28231 38822 68885 37057 27796 9718 -5303 7580 27337 40050
10132 40050 20398 15329 6616 37 -2088 28235 60620 63079 55830 27821 -5085 -7838 -18957
10119 -18957 -35353 -36260 -27390 -39316 -51519 -64840 -65400 -2366 4909 -10245 8132 26822 7323
10106 7323 7997 10228 7258 13482 6651 -19100 -50090 -65938 -33251 -20376 16447 48627 24827
10093 24827 -2550 -20562 8957 40870 42581 20643 38325 36277 47343 48314 13383 -5223
10081 -5223 -3384 16733 41306 69075 47543 46877 16977 20397 46301 36000 16698 9061 9559
10068 9559 13877 -6118 -11942 -21014 -9604 -6556 7252 14014 -17248 -7432 18924 15344 47064
10055 47064 47400 42676 27256 35503 86397 110325 97463 38314 -11272 -8453 -11225 20215 49890
$$ packed form
10144E9230R177j5695k4481J0591L0063l1828r261j8078j5021J2883J9757J2713
10132D0050j9652n069q713o579k125L0323L2385K459p249k8009l2906k753j1119
10119a8957j6396r07Q870j1926j2203j3321n60O3034P275j5154J8377J8690j9499
10106G323O74K231k970O224o831k5751l0990j5848L2687J2875L6823L2180k3800
10093B4827k7377j8012K9519L1913J711k1938J7682k048J1066R71l4931j8606
10081e223J839K0117K4573K7769k1532o66k9900L420K5904j0301j9302p637M98
10068I559M318j9995n824r072J1410L048J3808O762l1262R816K6356l580L1720
10055D7064L36m724j5420Q247N0894K3928j2862n9149m9586K819k772L1440K9675
$$ plain form
10042 49890 39335 -26811 -54364 -65489 -31526 7255 18421 14244 30614 45910 28476 17329
10030 17329 26217 14130 24170 26255 -21887 -37312 -40428 -35476 -29950 -7903 35370 32141 12590
10017 12590 13703 7665 13294 -925 -38786 -55154 -37492 16197 39205 61626 67489 57026
10005 57026 47571 15788 -6205 -7076 4785 -4838 -3421 917 5070 5807 34595 35670 -13409 -18071
9991 -18071 6228 49026 42955 20775 13540 -1811 -8030 22705 42169 24918 329 -9629 -11255
9978 -11255 -31880 -54179 -56584 -36491 16987 29274 25718 48192 16308 16944 31501 24228 15898
9965 15898 17343 17652 -18749 -34008 -25618 -12452 19535 39267 39301 34302 8620 -22735 -14467 -30729
9951 -30729 -43290 -3597 22888 10413 -1710 -36385 -21991 21745 66742 80908 59723 24840
$$ packed form
10042D9890j0555o6146k7553j1125L3963L8781J1166m177J6370J5296j7434j1147
10030A7329Q888j2087J0040K085m8142j5425l116M952N526K2047M3273l229j9551
10017A2590J113o038N629j4219l7861j6368J7662N3689K3008K2421N863j0463
10005E7026r455l1783k1993q71J1861r623J417M338M153P37K8788J075m9079m662
9991a8071K4299M2798o071k2180p235j5351o219L0735J9464j7251k4589r958j626
9978a1255k0625k2299k405K0093N3478J2287l556K2474l1884O36J4557p273q330
9965A5898J445L09l6401j5259Q390J3166L1987J9732L4m999k5682l1355Q268j6262
9951c0729j2561L9693K6485j2475j2123l4675J4394M3736M4997J4166k1185l4883
$$ plain form
9939 24840 15738 15792 21055 11376 -18751 20400 49390 43155 46239 13850 -3013 -5462 10087 -3832
9925 -3832 -23187 -8751 -16158 -33312 -16986 47869 49080 24706 19865 -2669 -19707 -17259 -39838
9912 -39838 -25243 -5430 4434 12394 7765 4032 2747 -24686 -34615 -27365 -14690 7068 -21169
9899 -21169 -11331 5459 4850 4588 7084 21923 36739 49404 51395 42494 15572 6712 229 5339
9885 5339 -21987 -83792 -79464 -87470 -80090 -47575 -23407 -14620 -4281 -3540 -10171 -8110 14648 -18423
9871 -18423 -31262 -24676 6845 6203 3131 17364 52593 26151 -17478 10879 15910 29025 27939
9858 27939 28469 41465 46890 65820 57472 32242 7383 11751 43985 37724 -6977 -29089 -7016
9845 -7016 -10634 -10010 -12193 -20773 -6059 -261 17785 18742 14507 1318 -8092 -5834 -7508 -18504
$$ packed form
9939B4840r102N4N263r679l0127L9151K8990o235L084l2389j6863k449J5549j3919
9925c832j9355J4436p407j7154J6326O4855J211k4374m841k2534j7038K448k2579
9912c9838J4595J9813R864P960m629l733j285k7433r929P250J2675K1758k8237
9899b1169R838J6790o09k62K496J4839J4816J2665J991q901k6922q860o483N110
9885E339k7326o1805M328q006P380L2515K4168Q787J0339P41o631K061K2758l3071
9871a8423j2839O586L1521o42l072J4233L5229k6442m3629K8357N031J3115j086
9858B7939N30J2996N425J8930q348k5230k4859M368L2234o261m4701k2112K2073
9845g016l618O24k183q580J4714N798J8046R57m235j3189r410K258j674j0996
$$ plain form
9831 -18504 -31991 -28869 -20226 -9002 -2154 -11434 -9857 -17883 -31839 -39907 -11145 24208 41528
9818 41528 4073 2259 4057 20215 27938 15336 -4726 11314 -5766 -15671 -18303 -10104 -28258
9805 -28258 -33965 -40171 -16882 14522 34090 36797 -14631 -26452 -33513 -24797 -5624 6183 16881
9792 16881 -13606 -10481 281 13760 16093 27242 -1530 -39327 -57552 -62569 -24562 -820
9780 -820 5326 9012 -1525 -12796 -5998 1068 17241 25888 23386 1941 -8076 -11776 -18928 -25658
9766 -25658 -29612 -16465 -49126 -56578 -43899 -33108 -43923 -40333 -41290 -64038 -40745 -28016 -16841
9753 -16841 1575 48860 44830 22986 -10357 -899 -6647 -5895 -9413 4684 7631 -5654 -14406
9740 -14406 -33691 -28084 11377 42814 41272 11332 -26506 -45787 -50276 -40096 -41624 -39420 -32447
$$ packed form
9831a8504j3487L122Q643J1224O848r280J577q026j3956q068K8762L5353J7320
9818D1528l7455j814J798J6158P723j2602k0062J6040j7080r905k632Q199j8154
9805b8258n707o206K3289L1404J9568K707n1428j1821p061Q716J9173J1807J0698
9792A6881l0487L125J0762J3479K333J1149k8772l7797j8225n017L8007K3742
9780h20O146L686j0537j1271O798P066J6173Q647k502k1445j0017l700p152o730
9766b5658l954J3147l2661p452J2679J0791j0815L590r57k2748K3293J2729J1175
9753a6841J8416M7285m030k1844l3343R458n748P52l518J4097K947j3285q752
9740a4406j9285N607L9461L1437j542k9940l7838j9281m489J0180j528K204O973
$$ plain form
9727 -32447 -7967 41412 18300 2640 26347 33130 14921 -20836 -43749 -24502 -6559 28147
9715 28147 5989 4536 19749 -4910 8463 17165 853 -10285 -23268 -47938 -34078 -44193
9703 -44193 -44881 -35045 -36055 -43496 -20526 11396 43536 44738 2915 -36247 -58016 -50334 -16449
9690 -16449 10424 34682 56920 25129 -103 -6593 13445 34968 22879 -25584 -38407 -20330
9678 -20330 -23391 -27306 -8469 -1840 -2039 22727 -3009 -36153 -27590 -7439 10177 14534 16738
9665 16738 -6479 -11034 -4685 -18773 -18312 -12498 -5686 19042 -6701 -13517 10174 40759 58876
9652 58876 50050 45382 25237 20760 22204 17966 17181 33130 55178 29289 5072 11812 26911
9639 26911 50432 35023 38061 37648 15301 -9406 -24258 -13685 -1263 -13737 -29207 -40874
$$ packed form
9727c2447K4480M9379k3112j5660K3707O783j8209l5757k2913J9247J7943L4706
9715B8147k2158j453J5213k4659J3373Q702j6312j1138j2983k4670J3860j0115
9703d4193o88R836j010p441K2970L1922L2140J202m1823l9162k1769P682L3885
9690a6449K6873K4258K2238l1791k5232o490K0038K1523j2089m8463j2823J8077
9678b0330l061l915J8837O629j99K4766k5736l3144Q563K0151J7616M357K204
9665A6738k3217m555O349j4088M61N814O812K4728k5743o816K3691L0585J8117
9652E8876q826m668k0145m477J444m238p85J5949K2048k5889k4217O740J5099
9639B6911K3521j5409L038m13k2347k4707j4852J0573J2422j2474j5470j1667
$$ plain form
9627 -40874 -30071 -8060 -12734 19766 26693 32415 21385 17945 19673 30691 28638 25712 29551
9614 29551 18636 33609 59843 37506 -28116 -38991 4058 17435 52843 40602 31602 45207
9602 45207 30998 31633 -3333 -16468 -16889 -1018 10104 -3493 -24297 -35178 -9680 -5012 -30041
9589 -30041 -25310 -4221 -8364 -4745 19100 33891 32684 3720 -2286 16880 13580 11663 36323
9576 36323 41348 16961 14851 2182 -5872 -7660 -7407 -14244 -30311 -32451 -21575 -41339 -51811
9563 -51811 -45759 -43773 -3073 16469 21178 4388 -3296 -4704 12709 2352 12664 21865 44558
9550 44558 45480 8345 33052 39000 31042 33389 28403 -10973 -6136 -13495 -4261 12767 28503 35194
9536 35194 30224 -3663 -16528 3005 7365 -11989 2483 3835 7130 28588 52057 59970 6829
$$ packed form
9627d0874J0803K2011m674L2500O927N722j1030l440J728J1018k053k926L839
9614B9551j0915J4973K6234k2337o5622j0875M3049J3377L5408j2241r000J3605
9602D5207j4209O35l4966j3135m21J5871J1122j3597k0804j0881K5498M668k5029
9589c0041M731K1089m143L619K3845J4791j207k8964o006J9166l300j917K4660
9576C6323N025k4387k110j2669q054j788K53o837j6067k140J0876j9764j0472
9563e1811O052J986M0700J9542M709j6790p684j408J7413j0357J0312R201K2693
9550D4558R22l7135K4707N948p958K347m986l9376M837p359R234J7028J5736O691
9536C5194m970l3887j2865J9533M360j9354J4472J352L295K1458K3469P913n3141
$$ plain form
9523 6829 -49637 -56561 -18417 12412 -221 2861 8526 19966 -5161 6154 5761 -33489 -24365
9510 -24365 -26770 -28851 -38886 -33420 -15658 -22946 -13114 -8803 -16755 -6792 -31198 -15444 -7628 -17636
9496 -17636 -3048 -13826 -20543 -7423 8161 10387 -12717 -23478 -37254 -51110 -24093 -12730
9484 -12730 -45168 -57713 -38183 5705 31857 55081 59899 33494 10392 15793 8253 16646 38790
9471 38790 14668 -24988 -18789 20885 36602 42868 33670 24045 34040 57020 39823 50201 33732
9458 33732 14404 3042 -9677 -32220 -9603 7650 16689 8613 -2948 -6446 13538 -6329
9446 -6329 -24115 -16470 260 31274 62388 46881 34977 31869 26311 17704 19516 -6118 -10874
9433 -10874 -41676 -47952 -26185 -14779 17976 32006 53616 10762 -37010 -38456 -26116 -9712
$$ packed form
9523F829n6466o924L8144L0829j2633L082N665J1440k5127J1315l93l9250R124
9510b4365k405k081j0035N466J7762p288R832M311p952R963k4406J5754P816j0008
9496a7636J4588j0778o717J3120J5584K226k3104j0761j3776j3856K7017J1363
9484a2730l2438j2545J9530M3888K6152K3224M818k6405k3102N401p540Q393K2144
9471C8790k4122l9656O199L9674J5717O266r198r625R995K2980j7197J0378j6469
9458C3732j9328j1362j2719k2543K2617J7253R039q076j1561l498J9984j9867
9446f329j7786P645J6730L1014L1114j5507j1904l108n558q607J812k5634m756
9433a0874l0802o276K1767J1406L2755J4030K1610m2854m7772j446J2340J6404
$$ plain form
9421 -9712 3 -16963 -4357 6494 11055 18360 15974 -4869 -6124 281 16313 19206 25918 14887
9407 14887 14306 27325 32960 18334 -17868 13647 16002 28889 43950 40328 19147 19104 27168 32054
9393 32054 33991 53605 44488 16172 29995 51529 15869 -11547 11901 7372 -11768 -55307
9381 -55307 -52339 -6990 14911 36883 34173 46991 73152 78259 59424 34446 21428 9704
9369 9704 31521 65825 65103 41023 18554 -19100 -41863 -3130 -80 331 40373 61412 53014
9356 53014 61300 58178 45647 44872 41025 73784 87671 44503 14181 -7177 -19076 4852 7518
9343 7518 -3536 18464 59091 88529 91635 63015 49400 64414 66505 52323 64881 43445
9331 43445 34351 9131 -332 7507 16361 37661 57409 61500 64858 20526 -9881 -13230 -22299
$$ packed form
9421i712R715j6966J2606J0851M561P305k386k0843j255O405J6032K893O712j1031
9407A4887n81J3019N635j4626l6202L1515K355J2887J5061l622k1181m3Q064M886
9393C2054J937J9614r117k8316J3823K1534l5660k7416K3448m529j9140m3539
9381e5307K968M5349K1901K1972k710J2818K6161N107j8835k4978j3018j1724
9369I704K1817L4304p22k4080k2469l7654k2763L8733L050M11M0042K1039q398
9356E3014Q286l122j2531p75l847L2759J3887m3168l0322k1358j1899K3928K666
9343G518j1054K2000M0627K9438L106k8620j3615J5014K091j4182J2558k1436
9331D3445r094k5220r463P839Q854K1300J9748M091L358m4332l0407l349r069
$$ plain form
9318 -22299 -55745 -62202 -48403 -2134 672 -23659 -5370 27723 24851 -4955 -14550 -41103 -44739
9305 -44739 -29849 -52545 -63255 -32460 10860 12567 31115 46556 41096 30346 12733 15151
9293 15151 18591 14615 19818 28272 30182 41229 92521 103538 88614 24293 14767 34024 46883
9280 46883 33892 31194 78399 93180 76421 40086 26934 34957 10142 -12376 -11583 -27441 -33750
9267 -33750 -17581 -22902 12593 413 696 15895 40535 22455 -5876 514 26367 51173 48857
9254 48857 17365 26292 34755 21822 4892 15604 1072 9335 32112 63337 99012 95970 72542
9241 72542 45650 31991 27783 47272 25960 2990 8826 25182 43608 45029 -1 13089
9229 13089 93 -10237 16917 32411 15045 3989 12987 28446 35778 17251 53913 87196
$$ packed form
9318b2299l3446o457J3799M6269K806k4331J8289L3093k872k9806r595k6553l636
9305d4739J4890k2696j0710L0795M3320J707J8548J5441n460j0750j7613K418
9293A5151L440l976N203Q454J910J1047N1292J1017j4924o4321r526J9257J2859
9280D6883j2991k698M7205J4781j6759l6335j3152Q023k4815k2518P93j5858o309
9267c3750J6169n321L5495j2180K83J5199K4640j8080k8331O390K5853K4806k316
9254D8857l1492Q927Q463j2933j6930J0712j4532Q263K2777L1225L5675l042k3428
9241G2542k6892j3659m208J9489k1312k2970N836J6356J8426J421m5030J3090
9229A3089j2996j0330K7154J5494j7366j1056Q998J5459P332j8527L6662L3283
$$ plain form
9217 87196 49779 19820 27840 51807 65164 41200 79435 74321 71655 85646 61458 51946 58007
9204 58007 62363 90127 107533 103573 90909 66100 58530 77145 94458 77698 77059 81385 67865
9191 67865 94064 84895 64642 41860 29742 31329 24541 30954 59202 54383 53555 37889 48320
9178 48320 71617 113961 129461 100063 63748 84534 120249 107734 113474 128490 104331 106509
9166 106509 98193 98903 132153 147055 170543 177940 190292 172864 158710 167251 173418 173758 150689
9153 150689 132842 131631 140627 151523 155495 136428 146488 162161 194177 206788 220382 244883
9141 244883 243586 201581 206772 228359 240208 258453 277350 302670 330380 352000 369319 392762
9129 392762 397894 366823 392227 417310 444885 462864 469889 513294 555194 619059 624254 645967
$$ packed form
9217H7196l7417k9959Q020K3967J3357k3964L8235n114k666J3991k4188r512O061
9204E8007M356K7764J7406l960j2664k4809p570J8615J7313j6760o39M326j3520
9191F7865K6199r169k0253k2782j2118J587o788O413K8248m819q28j5666J0431
9178D8320K3297M2344J5500k9398l6315K0786L5715j2515N740J5016k4159K178
9166A06509q316P10L3250J4902K3488P397J2352j7428j4154Q541O167L40k3069
9153A50689j7847j211Q996J0896L972j9067J0060J5673L2016J2611J3594K4501
9141B44883j297m2005N191K1587J1849J8245J8897K5320K7710K1620J7319K3443
9129C92762N132l1071K5404K5083K7575J7979P025M3405M1900O3865N195K1713
$$ plain form
9117 645967 687127 711254 755498 817244 879416 929048 947246 1026465 1113333 1174465 1211194 1242619
9105 1242619 1297184 1383465 1476580 1543801 1618593 1692664 1733780 1803639 1880639 1955513 2030486
9094 2030486 2084659 2096826 2073884 2090624 2092330 2110092 2112288 2063288 2005062 1942204 1907831 1886683
9082 1886683 1835971 1724110 1585715 1473415 1403520 1357235 1288557 1230312 1170431 1122187 1051602
9071 1051602 975236 918473 872759 840339 802923 751837 722899 697164 651768 611276 595837
9060 595837 600961 586087 561565 492575 425043 380859 350424 351274 358646 384200 356870 335536
9048 335536 338620 320098 287870 277709 269314 277947 273781 264939 252586 267026 230658 189554 181327
9035 181327 159404 151590 159850 160132 188062 178087 159192 159565 169771 205110 203352 220335 205070
$$ packed form
9117F45967M1160K4127M4244O1746O2172M9632J8198P9219Q6868O1132L6729L1425
9105A242619N4565Q6281R3115O7221P4792P4071M1116O9859P7000P4874P4973
9094B030486N4173J2167k2942J6740J706J7762K196m9000n8226o2858l4373k1148
9082A886683n0712j11861j38395j12300o9895m6285o8678n8245n9881m8244p0585
9071A051602p6366n6763m5714l2420l7416n1086k8938k5735m5396m0492j5439
9060E95837N124j4874k4522o8990o7532m4184l0435Q50P372K5554k7330k1334
9048C35536L084j8522l2228j0161q395Q633m166q842j2353J4440l6368m1104q227
9035A81327k1923p814Q260K82K7930r975j8895L73J0206L5339j758J6983j5265
$$ plain form
9022 205070 179369 137402 135159 145421 164506 118949 93869 97863 114314 114406 116584 125196 133570
9009 133570 142571 118334 123799 118433 126127 94577 57433 66592 85078 65421 50807 57234 72120
8996 72120 33118 37078 68862 73946 59507 60366 71391 63770 72056 103619 102739 97814 89489 75452
8982 75452 70173 57688 53174 46399 56068 64611 42903 -4361 3872 8323 30012 62271 80126
8969 80126 78068 74940 86941 94528 94702 82036 81999 104038 107780 54556 64379 81604 70925 54444
8955 54444 85595 98020 56758 50309 65724 51179 41046 26595 29336 39167 54375 61163 73612
8942 73612 71574 57917 45438 41337 26038 21022 382 -21165 14711 27815 -5763 -9454 33754
8929 33754 76382 48647 18738 34677 54880 39486 51628 55122 37125 24952 29583 13083
$$ packed form
9022B05070k5701m1967k243J0262J9085m5557k5080L994J6451R2K178Q612Q374
9009A33570R001k4237N465n366P694l1550l7144R159J8486j9657j4614O427J4886
8996G2120l9002L960L1784N084j4439Q59J1025p621Q286L1563q80m925q325j4037
8982G5452n279j2485m514o775R669Q543k1708m7264Q233M451K1689L2259J7855
8969H0126k058l128J2001P587J74j2666l7K2039L742n3224R823J7225j0679j6481
8955E4444L1151J2425m1262o449J5415j4545j0133j4451K741R831J5208O788J2449
8942G3612k038j3657j2479m101j5299n016k0640k1547L5876J3104l3578l691M3208
8929C3754M2628k7735k9909J5939K0203j5394J2142L494j7997j2173M631j6500
$$ plain form
8917 13083 27319 50220 74854 76776 70482 50971 37236 23926 31847 46341 39086 21005 23770
8904 23770 17476 42664 38379 8111 1347 -30762 -55451 -30500 -4324 27654 39458 24356
8892 24356 -16833 -39991 -23363 -14173 -882 2088 28525 45183 54788 47046 26249 38259 53439
8879 53439 60268 46667 15156 7953 -10421 -7833 3535 25967 33956 54941 42052 69941 90656
8866 90656 86191 49968 7551 16034 13402 23971 26536 8534 -4698 16377 26850 -18106 -9865
8853 -9865 6638 -6398 -4452 -21397 -13723 -13573 -22279 -15145 9569 13716 8620 -5841 -5880 -4068
8839 -4068 -1093 -11956 9081 33913 38768 7677 6568 -9423 -20174 -19124 12618 33663 20520
8826 20520 -5738 836 15956 26872 54684 61892 43908 26976 43062 53077 49694 31787
$$ packed form
8917A3083J4236K2901K4634J922o294j9511j3735j3310P921J4494p255j8081K765
8904B3770o294K5188m285l0268o764l2109k4689K4951K6176L1978J1804j5102
8892B4356m1189k3158J6628R190J3291K970K6437J6658R605p742k0797J2010J5180
8879E3439O829j3601l1511p203j8374K588J1368K2432P989K0985j2889K7889K0715
8866I0656m465l6223m2417Q483k632J0569K565j8002j3232K1075J0473m4956Q241
8853i865J6503j3036J946j6945P674J50q706P134K4714M147n096j4461l9J812
8839d068K975j0863K1037K4832M855l1091j109j5991j0751J050L1742K1045j3143
8826B0520k6258O574J5120J0916K7812P208j7984j6932J6086J0015l383j7907
$$ plain form
8814 31787 9567 2794 21866 35444 37608 16823 10224 -8289 -14889 -342 15358 2917 10224
8801 10224 15400 21327 -10452 -39026 -14235 32674 8784 -27668 -5103 40869 42605 27538
8789 27538 22270 -13145 -49970 -53351 -36854 -14515 -3513 25285 42806 20268 -17320 -17924 -25337
8776 -25337 -16500 -25332 -31229 -32925 -16934 -23185 -2798 -917 -11862 -21007 4152 21698 13886
8763 13886 12290 -15178 -10269 24445 20957 -34779 -57603 -24255 9962 -7301 -12019 -12414 -11372
8750 -11372 -28031 -26296 -12354 -2767 30706 23514 25170 35812 53067 38925 30796 34633 21649
8737 21649 -9170 -16129 -13839 -20094 -34001 -37587 -23125 -4813 -7105 -20542 -35980 -54749 -53737
8724 -53737 -33348 -5182 9238 3217 -21225 -23450 -3966 11817 27799 15571 -22472 -30854
$$ packed form
8814C1787k2220o773J9072J3578K164k0785o599j8513o600J4547J5700j2441P307
8801A0224N176N927l1779k8574K4791M6909k3890l6452K2565M5972J736j5067
8789B7538n268l5415l6825l381J6497K2339J1002K8798J7521k2538l7588o04p413
8776b5337Q837q832n897j696J5991o251K0387J881j0945r145K5159J7546p812
8763A3886j596k7468M909L4714l488n5736k2824L3348L4217j7263m718l95J042
8750a1372j6659J735J3942R587L3473p192J656J0642J7255j4142q129L837j2984
8737B1649l0819o959K290o255j3907l586J4462J8312k292j3437j5438j8769J012
8724e3737K0389K8166J4420o021k4442k225J9484J5783J5982j2228l8043q382
$$ plain form
8712 -30854 -27826 -26063 10789 -3553 741 8424 7175 18638 17854 5662 5781 3017 14720 -1111
8698 -1111 3810 15525 -499 -8253 -8393 14024 37477 44038 25728 27274 15750 16466 -1044 -8202
8684 -8202 -23925 -33941 -37078 10471 62278 66710 36308 29226 12685 6171 35349 31073 748
8671 748 -18993 -8333 -6871 -13480 -25971 -24000 -12911 22353 19128 937 26201 54752 48444
8658 48444 35268 35000 69249 78395 94345 64201 29371 -1802 -23490 -9754 286 -4876 10320
8645 10320 9874 30767 49812 52024 41707 52918 54212 49210 16942 3437 -1131 4212 -10078
8632 -10078 19871 44820 63761 20717 -7923 -5030 22673 28644 52944 26627 19592 16374 18697
8619 18697 52156 45571 59904 82931 73549 75785 65375 62918 58229 42293 42758 51798 67245
$$ packed form
8712c0854L028J763L6852j4342M294P683j249J1463p84j2192J19k764J1703j5831
8698a111M921J1715j6024p754j40K2417K3453O561j8310J546j1524P16j7510p158
8684h202j5723j0016l137M7549N1807M432l0402p082j6541o514K9178m276l0325
8671G48j9741J0660J462o609j2491J971J1089L5264l225j8191K5264K8551o308
8658D8444j3176k68L4249R146J5950l0144l4830l1173k1688J3736J0040n162J5196
8645A0320m46K0893J9045K212j0317J1211J294n002l2268j3505m568N343j4290
8632a0078K9949K4949J8941m3044k8640K893K7703N971K4300k6317p035l218K323
8619A8697L3459o585J4333K3027r382K236j0410k457m689j5936M65R040J5447
$$ plain form
8606 67245 48658 42129 -4822 -25865 -24898 -15091 -23536 -5528 737 16646 24613 24657 5395 4673
8592 4673 11573 -3609 -23350 -7463 -6192 -29172 -28312 -8922 5675 41043 12728 -17938 5118
8579 5118 -16568 399 -4163 -2264 5740 17353 30980 36814 26470 42019 48937 26136 14459
8566 14459 6884 16841 23141 36152 12755 20662 19839 7422 21420 37394 32185 51889 42865
8553 42865 6119 -2352 -18418 -23135 -12524 8938 9600 35135 18393 -1776 -28247 -19427 -2633
8540 -2633 41302 56111 50319 26697 -14836 -3319 -3118 2797 -2383 -1693 -12132 -28339 -42486
8527 -42486 -28956 8329 21309 23564 32534 58280 88481 108437 101444 59116 12831 -14332
8515 -14332 -12629 11118 -1805 -32159 -44747 -5458 8380 19542 25631 44849 53783 53587 37103
$$ packed form
8606F7245j8587o529m6951k1043R67R807q445J8008O265J5909P967M4j9262p22
8592D673O900j5182j9741J5887J271k2980Q60J9390J4597L5368k8315l0666K3056
8579E118k1686J6967m562J899Q004J1613J3627N834j0344J5549O918k2801j1677
8566A4459p575R957O300J3011k3397P907q23j2417J3998J5974n209J9704r024
8553D2865l6746q471j6066m717J0611K1462O62K5535j6742k0169k6471Q820J6794
8540b633M3935J4809n792k3622m1533J1517K01N915n180O90j0439j6207j4147
8527d2486J3530L7285J2980K255Q970K5746L0201J9956o993m2328m6285k7163
8515a4332J703K3747j2923l0354j2588L9289J3838J1162O089J9218Q934j96j6484
$$ plain form
8502 37103 29638 47000 60831 22592 9991 13965 -8109 -6274 4712 17824 33252 46489
8490 46489 46337 42097 53766 50576 24945 10538 3461 -8493 295 -7819 -18624 9958 34114
8477 34114 24152 50347 54382 32383 -14829 -8262 -6425 6948 -13851 1971 24622 1037 -15821
8464 -15821 -36940 -23065 23851 55152 60474 44753 -1599 -24508 -45973 -39368 -1136 43751
8452 43751 56445 33390 11784 19676 24923 6942 2625 -11317 -18673 -5856 6055 -6514 -14957
8439 -14957 2463 28888 38266 3146 -27969 3747 5427 6595 -2984 -30206 -32546 -29661 -34048
8426 -34048 -25861 -37624 -42209 -39820 -20673 -13130 -12129 -18569 -13754 27933 52554 41954 13058
8413 13058 -720 5139 50099 86379 62647 26443 12398 22845 27707 -12457 -20166 532
$$ packed form
8502C7103p465J7362J3831l8239j2601L974k2074J835J0986J3112J5428J3237
8490D6489j52m240J1669l190k5631j4407p077j1954Q788q114j0805K8582K4156
8477C4114r962K6195M035k1999m7212O567J837J3373k0799J5822K2651k3585j6858
8464a5821k1119J3875M6916L1301N322j5721m6352k2909k1465O605L8232M4887
8452D3751J2694k3055k1606P892N247j7981m317j3942p356J2817J1911j2569q443
8439a4957J7420K6425R378l5120l1115L1716J680J168r579k7222k340K885m387
8426c4048Q187j1763m585K389J9147P543J001o440M815M1687K4621j0600k8896
8413A3058j3778N859M4960L6280k3732l6204j4045J0447M862m0164p709K0698
$$ plain form
8401 532 11854 -450 28684 57921 70010 67548 27433 9442 18177 28395 23114 938 -18169
8388 -18169 -13348 -19775 -19331 -16068 -23716 -53442 -75458 -64289 -29712 -6425 1373 2050 15535 -4786
8374 -4786 -16160 -18512 -23789 -14549 -15255 -19951 -7293 9395 1444 -2608 -11205 -22469 -33060 -18520
8360 -18520 11870 20373 7083 7921 14611 28201 45228 53517 70779 32619 9965 -22219 -14163
8347 -14163 3694 -3250 8142 -21885 -19295 -16512 3110 -8134 -26864 -33893 -60990 -36398 -12757
8334 -12757 -25520 -40321 -23463 -25995 -46798 -34421 -48923 -20923 -38531 -66500 -31805 5657
8322 5657 8340 22750 -16556 -87397 -86315 -56300 -10912 23758 13793 32174 40219 42172 28269
8309 28269 -14866 -26997 16782 36946 8311 7825 25593 9433 -5242 -11985 17382 28241
$$ packed form
8401E32J1322j2304K9134K9237J2089k462m0115j7991Q735J0218n281k2176j9107
8388a8169M821o427M44L263p648k9726k2016J1169L4577K3287P798O77J3485k0321
8374d786j1374k352n277R240p06m696J2658J6688p951m052q597j1264j0591J4540
8360a8520L0390Q503j3290Q38O690J3590J7027Q289J7262l8160k2654l2184Q056
8347a4163J7857o944J1392l0027K590K783J9622j1244j8730p029k7097K4592K3641
8334a2757j2763j4801J6858k532k0803J2377j4502K8000j7608k7969L4695L7462
8322E657K683J4410l9306p0841J082L0015M5388L4670r965J8381Q045J953j3903
8309B8269m3135j2131M3779K0164k8635m86J7768j6160j4675o743K9367J0859
$$ plain form
8297 28241 6795 12315 2961 12695 18432 15452 -10284 -6226 8296 23482 14906 -6655 -22731
8284 -22731 -19596 -6548 1151 5961 -3876 -17722 -22176 -44250 -82258 -99411 -108804 -72100 -53640
8271 -53640 -63612 -48326 -42009 -51160 -50777 -30056 12898 15244 -776 2228 14621 21252 35172
8258 35172 58227 26901 6869 25598 9015 -24282 -34474 -16436 -6604 -17548 -12242 -4541
8246 -4541 2150 9851 1295 14832 18143 -7026 -9116 6626 11966 24408 32665 11154 5202 -14140
8232 -14140 -29099 -61105 -89252 -91926 -61795 -38137 -20681 386 4062 2498 18474 22223 -7348
8219 -7348 -20753 -31547 -45938 -40946 -41268 -61340 -34224 -3043 18661 38397 28362 23312 26107
8206 26107 15584 -20046 -44503 -57247 -52999 -66274 -60027 -32234 -7404 -20575 -17902 10286
$$ packed form
8297B8241k1446N520r354R734N737k980k5736M058J4522J5186q576k1561j6076
8284b2731L135J3048P699M810r837j3846m454k2074l8008j7153r393L6704J8460
8271e3640r972J5286O317r151L83K0721M2954K346j6020L004J2393O631J3920
8258C5172K3055l1326k0032J8729j6583l3297j0192J8038R832j0944N306P701
8246d541O691P701q556J3537L311k5169k090J5742N340J2442Q257k1511n952j9342
8232a4140j4959l2006k8147k674L0131K3658J7456K1067L676j564J5976L749k9571
8219g348j3405j0794j4391M992l22k0072K7116L1181K1704J9736j0035n050K795
8206B6107j0523l5630k4457j2744M248j3275O247K7793K4830j3171K673K8188
$$ plain form
8194 10286 26506 33512 59980 39687 14692 5130 -3945 -27272 -39444 -52273 -38907 -15059
8182 -15059 2770 21983 8900 -2983 -11379 -24790 -23834 -8030 -13334 12540 28060 7564 9152
8169 9152 -10823 -30092 -543 25508 19444 -18816 -47853 -57475 -63305 -59144 -61731 -34442 1310
8156 1310 32476 45632 10259 -25413 -23759 7726 17494 10450 24347 37825 29093 -660 -14340
8143 -14340 -22495 -41305 -56608 -41830 -29333 -26881 -43811 -54102 -40524 12015 -8041 -28233
8131 -28233 -62404 -78902 -46464 8796 30512 9033 23624 24635 22958 14093 -9750 -5200 -37530
8118 -37530 -66854 -59814 -26300 5206 -5141 -16769 -24646 -18496 -1445 -2861 -16451 -7039 18595
8105 18595 -6591 -47469 -48910 -25171 26139 27159 -22044 -14700 2026 13687 1906 -17968
$$ packed form
8194A0286J6220P006K6468k0293k4995r562r075k3327j2172j2829J3366K3848
8182a5059J7829J9213j3083j1883q396j3411R56J5804n304K5874J5520k0496J588
8169I152j9975j9269K9549K6051o064l8260k9037r622n830M161k587K7289L5752
8156A310L1166J3156l5373l5672J654L1485R768p044J3897J3478q732k9753j3680
8143a4340q155j8810j5303J4778J2497K452j6930j0291J3578N2539k0056k0192
8131b8233l4171j6498L2438N5260K1716k1479J4591J011j677q865k3843M550l2330
8118c7530k9324P040L3514L1506j0347j1628p877O150J7051j416j3590R412K5634
8105A8595k5186m0878j441K3739N1310J020m9203P344J6726J1661j1781j9874
$$ plain form
8093 -17968 -14234 18058 42609 17124 2820 10891 35242 47266 53514 40111 -4820 -6378 4555
8080 4555 16884 7329 -9149 676 33679 26664 22100 24933 45470 38234 37018 33950 -9176 -26489
8066 -26489 -5811 18705 38033 40494 8557 28195 -5713 -49484 -60927 -35733 -20692 -16522
8054 -16522 -29611 -38147 34053 48756 25018 16089 -18380 -25236 -45337 -24571 -16127 -27664 -18186
8041 -18186 -10720 -23100 -24219 -29086 -674 23305 13488 17043 4134 -26299 -43201 -33737 -28544
8028 -28544 -17970 -1760 -12049 -12532 -472 -4260 22159 28826 11199 10665 6017 28848 52991
8015 52991 30733 9596 29337 25098 20028 13284 12473 5602 25490 27265 9576 23542 40737
8002 40737 37814 34925 42022 94484 109428 80458 76911 69044 68156 97950 86770 57317 46797
$$ packed form
8093a7968L734L2292K4551k5485j4304Q071K4351J2024O248j3403m4931j558J0933
8080D555J2329r555j6478R825L3003p015m564K833K0537p236j216l068m3126j7313
8066b6489K0678K4516J9328K461l1937J9638l3908m3771j1443K5194J5041M170
8054a6522j3089q536P2200J4703k3738q929l4469o856k0101K0766Q444j1537R478
8041a8186P466j2380j119m867K8412K3979r817L555j2909l0433j6902R464N193
8028b8544J0574J6210j0289m83J2060l788K6419O667j7627n34m648K2831K4143
8015E2991k2258k1137J9741m239n070o744q11o871J9888J775j7689J3966J7195
8002D0737k923k889P097N2462J4944k8970l547p867q88K9794j1180k9453j0520
$$ plain form
7989 46797 21158 15343 19778 -6840 -2217 -17740 -21597 -12484 -15355 582 37336 43477 38742
7976 38742 38557 56252 83916 66385 20084 14753 21273 36180 31403 -80 6999 9105 13983
7963 13983 36924 64189 82126 61817 76380 82942 74393 67850 50942 44028 90989 103726 49873
7950 49873 13313 12596 14641 23653 19605 4518 -8552 -8695 -23099 -30090 -18114 -4180 -6526 -19071
7936 -19071 -32968 -18520 -11101 9639 16619 20738 -10508 -27070 41441 87538 83208 64061 20718
7923 20718 15419 27988 25714 55709 93495 88854 72865 69130 60834 33715 21554 31445 46752
7910 46752 57986 45176 56885 29772 5645 2508 -740 4991 2825 14912 43992 59072 34705
7897 34705 1231 -16002 -10821 -14620 -29468 -10014 1642 -11506 -13080 1594 -10647 11484
$$ packed form
7989D6797k5639n815M435k6618M623j5523l857R113k871J5937L6754O141m735
7976C8742j85J7695K7664j7531m6301n331O520J4907m777l1483P079K106M878
7963A3983K2941K7265J7937k0309J4563O562q549o543j6908o914M6961J2737n3853
7950D9873l6560p17K045R012m048j5087j3070j43j4404o991J1976J3934k346j2545
7936a9071j3897J4448P419K0740O980M119l1246j6562O8511M6097m330j9147m3343
7923B0718n299J2569k274K9995L7786m641j5989l735q296k7119j2161R891J5307
7910D6752J1234j2810J1709k7113k4127l137l248N731k166J2087K9080J5080k4367
7897C4705l3474j7233N181l799j4848J9454J1656j3148j574J4674j2241K2131
$$ plain form
7885 11484 -709 1524 -20183 -27519 -40791 -8983 12172 -12013 -3234 24378 49715 15550
7873 15550 3013 46324 33344 16079 -21219 -6226 9748 -18236 -21203 994 9940 -893
7861 -893 -13665 -9950 -9020 -22839 -49022 -36049 -34454 -13594 -15151 -23895 -17862 -21548 -57316 -57662
7847 -57662 -46384 -68238 -70186 -45843 -43818 -50451 -37748 -30423 -5598 12874 18865 -1262 -30009
7834 -30009 -29005 -16172 28726 64649 46995 22398 13921 -4096 -8474 -1572 8801 11309 11820
7821 11820 21677 28305 27341 24966 524 6053 4011 12874 -822 -11133 2211 -9411 4250
7808 4250 14689 -7337 -27084 -25310 -9121 6448 23226 5533 3382 16191 -9275 -3235 30920
7795 30920 48388 37644 13404 14212 -2602 10877 51460 68632 40296 9947 -12056 8800
$$ packed form
7885A1484j2193K233k1707p336j3272L1808K1155k4185Q779K7612K5337l4165
7873A5550j2537M3311j2980j7265l7298J4993J5974k7984k967K2197Q946j0833
7861h93j2772L715R30j3819k6183J2973J595K0860j557q744O033l686l5768l46
7847e7662J1278k1854j948K4343K025o633J2703P325K4825J8472N991k0127k8747
7834c0009J004J2833M4898L5923j7654k4597q477j8017m378O902J0373K508N11
7821A1820R857O628r64k375k4442N529k042Q863j3696j0311J3344j1622J3661
7808D250J0439k2026j9747J774J6189J5569J6778j7693k151J2809k5466O040L4155
7795C0920J7468j0744k4240Q08j6814J3479M0583J7172k8336l0349k2003K0856
$$ plain form
7783 8800 15627 16418 33470 47546 26636 11061 -3658 1102 9428 12842 11981 -1191 26382 6981
7769 6981 -20588 -449 14170 43364 32864 24311 -1461 -23550 -22628 -16793 -3791 34192 52468
7756 52468 57764 51923 23011 815 -8330 -30596 -58756 -42122 -33868 -43742 -55479 -33910 -26713
7743 -26713 -49993 -31111 -14029 -4613 -7970 -21695 -31131 -49323 -59157 -80467 -73778 -68088 -36306
7730 -36306 5082 20496 33432 22039 38934 23462 -47759 -70840 -56920 -42094 -43385 -43413 -26040
7717 -26040 -23449 -10177 34427 56711 80832 43869 -6408 -21159 -38137 -28587 -9884 4639
7705 4639 11121 19614 18171 -21626 -31860 -29154 -51788 -27765 -2883 19441 7565 12131 -9541
7692 -9541 -4498 -17352 -18458 -8178 -16199 -4907 6431 14923 12183 2707 -1187 -36562 -59578
$$ packed form
7783H800O827P91J7052J4076k0910j5575j4719M760Q326L414q61j3172K7573j9401
7769F981k7569K0139J4619K9194j0500q553k5772k2089R22N835J3002L7983J8276
7756E2468N296n841k8912k2196r145k2266k8160J6634Q254r874j1737K1569P197
7743b6713k3280J8882J7082R416l357j3725r436j8192r834k1310O689N690L1782
7730c6306M1388J5414J2936j1393J6895j5472p1221k3081J3920J4826j291k8J7373
7717b6040K591J3272M4604K2284K4121l6963n0277j4751j6978R550J8703J4523
7705D639O482Q493j443l9797j0234K706k2634K4023K4882K2324j1876M566k1672
7692i541N043j2854j106J0280q021J1292J1338Q492k740r476l894l5375k3016
$$ plain form
7679 -59578 -70573 -41747 -13323 -11827 -28141 -27098 7178 19371 18952 9123 14694 6512 -2030
7666 -2030 25546 637 -25430 -11292 -11876 -18945 -4952 -21365 -10375 8014 -1398 -19649 -23786
7653 -23786 -4756 -7689 8201 6950 -31182 -36497 -28225 -27603 -51949 -38567 -20094 -35698 -39415
7640 -39415 -16926 -2282 4713 -12168 -21195 -21467 -21169 -28940 -27010 -44549 -25247 4578 14198 -4
7626 -4 17448 1805 -1012 -6672 -7149 -39576 -73397 -71810 -66855 -38579 -20266 -18411 -31885 -36905
7612 -36905 -22268 -20533 -27168 -21474 -16182 -16625 -8119 -1142 -30188 -6109 21095 19085 41004 38632
7598 38632 42132 46883 11961 -23638 -21502 -4708 -15430 -6731 -1026 -3295 -15299 -38105 -36732
7585 -36732 4922 7821 -13101 -2049 8795 21138 23119 50019 39958 33331 15550 22418 22728
$$ packed form
7679e9578j0995K8826K8424J496j6314J043L4276J2193m19r829N571q182q542
7666b030K7576k4909k6067J4138n84p069J3993j6413J0990J8389r412j8251m137
7653b3786J9030k933J5890j251l8132n315Q272O22k4346J3382J8473j5604l717
7640c9415K2489J4644O995j6881r027k72K98p771J930j7539J9302K9825R620j4202
7626dJ7452j5643k817n660m77l2427l3821J587M955K8276J8313J855j3474n020
7612c6905J4637J735o635N694N292m43Q506O977k9046K4079K7204k010K1919k372
7598C8632L500M751l4922l5599K136J6794j0722Q699N705k269j2004k2806J373
7585c6732M1654K899k0922J1052J0844J2343J981K6900j0061o627j7781O868L10
$$ plain form
7572 22728 -1816 -37528 -29447 -11278 -11195 410 18873 6601 -12872 -29014 -7909 -545 -28525
7559 -28525 -32882 -13270 -10431 -35935 -45697 -24786 -23942 -52380 -48123 -41326 -18958 -34406 -58729
7546 -58729 -38626 -37203 -34125 -28010 -28003 -20265 -23584 -7502 7039 31397 38863 37278 38271 52581
7532 52581 50474 656 -26470 21181 20096 1175 -5085 -413 3615 -1223 -16319 -12649 -20957
7519 -20957 -21267 -30169 -31364 -30625 -30456 -5824 26064 42028 23492 29221 45214 36365 1099 19263
7505 19263 12372 3236 860 -5792 -11431 -13259 -9857 -13686 -19465 -16692 -13146 -14620 -53970 -62781
7491 -62781 -45850 -43044 -49290 -37677 -30828 -18713 -8689 -8609 -11402 -6840 17260 7650 -6412 -35801
7477 -35801 -32598 -4603 -5347 -2214 8351 3071 2553 24497 7810 -23058 -24467 -15580 -13053 -22575
$$ packed form
7572B2728k4544l5712Q081J8169Q3J1605J8463j2272j9473j6142K1105P364k7980
7559b8525m357J9612K839k5504r762K0911Q44k8438M257O797K2368j5448k4323
7546e8729K0103J423L078O115PP738l319J6082J4541K4358P466j585R93J4310
7532E2581k107m9818k7126M7651j085j8921o260M672M028m838j5096L670q308
7519b0957l10q902j195P39J69K4632L1888J5964j8536N729J5993q849l5266J8164
7505A9263o891r136k376o652n639j828L402l829n779K773L546j474l9350q811
7491f2781J6931K806o246J1613O849J2115J0024Q0k793M562K4100r610j4062k9389
7477c5801L203K7995p44L133J0565n280n18K1944j6687l0868j409Q887K527r522
$$ plain form
7463 -22575 -34294 -23075 14469 22592 64546 43972 34517 29366 14313 8338 13600 -14480 -14434
7450 -14434 -15050 -24691 -11800 -32323 -53781 -59416 -43697 -38348 -37684 -35926 -29346 -21607 -6243 31775
7436 31775 15576 -1493 -11123 -19803 -21562 267 5110 1846 -7633 -22832 -19332 -17197 -8355 -4402
7422 -4402 1253 12444 32945 2291 -17145 -17562 29943 35700 15593 -29000 -34715 -26065 -19055
7409 -19055 8754 27673 5453 7049 30093 4098 -18407 -1653 -16252 -5471 7249 14372
7397 14372 6637 -4712 -21926 10483 18341 -16157 -28869 -2978 10643 -7680 -17618 -37681
7385 -37681 -53349 -50063 -46728 -39165 -47858 -27276 -19949 -32461 -11021 10098 1817 -3353 -20009
7372 -20009 -15416 -3014 19791 23731 19468 25800 8001 -5887 -52 8610 8284 18229 32346 17838
$$ packed form
7463b2575j1719J1219L7544Q123M1954k0574r455n151j5053n975N262k8080M6
7450a4434o16r641J2891k0523k1458n635J5719N349O64J758O580P739J5364L8018
7436C1775j6199j7069r630q680j759K1829M843l264r479j5199L500K135Q842L953
7422d402N655J1191K0501l0654j9436m17M7505N757k0107m4593n715Q650P010
7409a9055K7809J8919k2220J596K3044k5995k2505J6754j4599J0781J2720P123
7397A4372p735j1349j7214L2409P858l4498j2712K5891J3621j8323r938k0063
7385c7681j5668L286L335P563q693K0582P327j2512K1440K1119q281n170j6656
7372b0009M593J2402K2805L940m263O332j7799j3888N835Q662l26R945J4117j4508
$$ plain form
7358 17838 10969 12695 -3775 -4525 20502 20683 -17253 -24015 16490 20007 30959 48319 38740 21322
7344 21322 23595 -2571 -28369 -34444 -39882 -20349 -19838 -10348 2236 -10488 -27651 7990 46546
7331 46546 14908 16025 -4247 -30873 -22152 -22214 -43275 -28955 -10058 -20630 -29196 -7929 14773
7318 14773 37885 23217 10004 38071 34695 18926 -7014 -9307 -3560 -2115 -13890 -36935 -51257
7305 -51257 -51775 -10410 -11432 -25110 -18679 -14145 -15623 -23501 -33857 -29649 -14633 -13813 -32635 -25128
7291 -25128 -31552 -57657 -54119 10865 50826 42863 28404 28898 25626 -12522 -32836 -20817 -30011
7278 -30011 -44918 -61018 -31720 -17643 11340 10353 -24996 -50937 -48961 -27002 -29946 -39031 -24990
7265 -24990 -21589 -33844 12098 48699 39015 -1074 -6471 24229 -2446 -44430 -64690 -43131
$$ packed form
7358A7838o869J726j6470p50K5027J81l7936o762M0505L517J0952J7360r579j7418
7344B1322K273k6166k5798o075n438J9533N11R490J2584j2724j7163L5641L8556
7331D6546l1638J117k0272k6626Q721o2k1061J4320J8897j0572q566K1267K2702
7318A4773K3112j4668j3213K8067l376j5769k5940k293N747J445j1775k3045j4322
7305e1257n18M1365j022j3678O431M534j478p878j0356M208J5016Q20j8822P507
7291b5128o424k6105L538O4984L9961p963j4459M94l272l8148k0314J2019r194
7278c0011j4907j6100K9298J4077K8983r87l5349k5941J976K1959k944r085J4041
7265b4990L401j2255M5942L6601r684m0089n397L0700k6675m1984k0260K1559
$$ plain form
7253 -43131 -11612 7026 5951 2275 -1083 -11243 -10962 -16723 -14996 -5060 -9024 -8626 -27475 -45173
7239 -45173 -52840 -7011 23162 12460 -13868 -26389 -38442 -56713 -41352 -32402 -41861 -56057
7227 -56057 -39500 -16370 -17166 -14339 -14374 -8851 36580 29676 3983 -5148 -22562 -15960 -23963 -18667
7213 -18667 -7578 11242 28708 35360 2327 -26476 -10909 -38449 -55099 -14793 2604 -16805
7201 -16805 8141 22930 29048 21795 47645 46536 47970 35627 5482 -19335 -24774 -35019 -35635
7188 -35635 -21847 -19589 -14033 14871 26113 4497 2897 15626 50495 53773 15438 -10555 -34908
7175 -34908 -30809 -21225 4116 3331 -1778 6240 11517 32264 27787 -11971 -6625 23660 395 -30221
7161 -30221 -61628 -44905 -30216 -3190 35499 46850 17591 15200 -15617 -5557 28181 13349
$$ packed form
7253d3131L1519J8638j075l676l358j0160K81n761J727R936l964L98j8849j7698
7239d5173p667M5829L0173j0702k6328j2521j2053j8271J5361Q950r459j4196
7227e6057J6557K3130p96K827l5N523M5431o904k5693r131j7414O602q003N296
7213a8667J1089J8820J7466O652l3033k8803J5567k7540j6650M0306J7397j9409
7201a6805K4946J4789O118p253K5850j109J434j2343l0145k4817n439j0245o16
7188c5635J3788K258N556K8904J1242k1616j600J2729L4869L278l8335k5993k4353
7175c4908M099R584K5341p85n109Q018N277K0747m477l9758N346L0285k3265l0616
7161c0221l1407J6723J4689K7026L8689J1351k9259k391l0817J0060L3738j4832
$$ plain form
7149 13349 -6929 -42637 -39604 -3551 -16562 -45865 -56969 -57249 -53659 -18029 -23438 1590 34231
7136 34231 8161 -14899 -15723 -10656 19341 11890 2171 922 -21729 -18002 -17808 -23492 -28552 -15328
7122 -15328 -12930 -11307 -17445 10253 44554 40683 36236 14540 -10618 -9375 13123 10780 43924
7109 43924 23168 -20488 -823 -18618 -53971 -60456 -51117 -45250 -3717 -18198 -12154 -18878 -13138
7096 -13138 -1355 -78 24755 39007 19044 22919 50381 34031 3407 -1432 5036 9644 3352
7083 3352 13520 14049 166 7661 -4412 -30081 -52015 -43157 -29738 -28459 -1688 18276 6324
7070 6324 -31821 -10870 5947 -27218 -27716 -38204 -38254 -29236 -36904 -29980 1957 169 -15048 -3835
7056 -3835 -4007 13008 12395 13987 8127 1402 -13525 -15767 -36391 -20445 31064 32777 26170 9631
$$ packed form
7149A3349k0278l5708L033L6053j3011k9303j1104k80L590L5630n409K5028L2641
7136C4231k6070k3060q24N067K9997p451r719j249k2651L727J94n684n060J3224
7122a5328K398J623o138K7698L4301l871m447k1696k5158J243K2498k343L3144
7109D3924k0756m3656J9665j7795l5353o485R339N867M1533j4481O044o724N740
7096a3138J1783J277K4833J4252j9963L875K7462j6350l0624m839O468M608o292
7083C352J0168N29j3883P495j2073k5669k1934Q858J3419J279K6771J9964j1952
7070F324l8145K0951J6817l3165m98j0488n0R018p668O924L1937j788j5217J1213
7056c835j72J7015o13J592n860o725j4927k242k0624J5946N1509J713o607j6539
$$ plain form
7042 9631 4650 12517 -4679 -5198 -10498 -13862 -883 19355 11241 7174 18891 4121 17242 20572
7028 20572 2254 17558 34320 42449 25084 8687 15250 10263 -1540 -16428 -17516 -4295 14059
7015 14059 8448 1737 19690 32040 24189 7644 -23406 -57383 -63989 -43710 -7381 1690 21029
7002 21029 36609 36946 39588 44841 35150 26070 22707 15091 12401 -11661 -33691 -32893 -8430 -11548
6988 -11548 -876 7583 5205 27353 17493 30330 14258 8681 622 -13487 5756 11312 -3572
6975 -3572 -24592 -9207 8814 -15254 -116 20661 25396 8999 -949 21679 22399 7050 -7411
6962 -7411 -1872 -4643 -43303 -28993 10289 31669 -1115 -33711 -10816 -3693 1664 -6637 -15874
6949 -15874 -9475 10618 14081 11532 33411 51068 41656 20205 4510 4352 3899 15560 3331
$$ packed form
7042I631m981P867j7196n19n300l364J2979K0238q114m067J1717j4770J3121L330
7028B0572j8318J5304J6762Q129j7365j6397O563m987j1803j4888j088J3221J8354
7015A4059n611o711J7953J2350p851j6545l1050l3977o606K0279L6329R071J9339
7002B1029J5580L37K642N253r691r080l363p616k690k4062k2030P98K4463l118
6988a1548J0672Q459k378K2148r860J2837j6072n577q059j4109J9243N556j4884
6975c572k1020J5385J8021k4068J5138K0777M735j6397r948K2628P20j5349j4461
6962g411N539k771l8660J4310L9282K1380l2784l2596K2895P123N357q301r237
6949a5874O399K0093L463k549K1879J7657r412k1451j5695j58m53J1661j2229
$$ plain form
6936 3331 -8232 -14262 -6585 -35660 -56661 -61859 -33797 -1721 2050 -12935 -14874 -5071 -425
6923 -425 -11451 -18910 -21711 -13201 -24919 -35639 -18773 5169 30859 41942 29157 15855 -21596
6910 -21596 -64169 -54812 -21789 -35090 -46395 -76368 -59303 -14733 -8316 -15585 7157 -25597
6898 -25597 -34740 -22438 -29459 -31888 -52177 -23676 -10232 -11779 11791 21392 -19547 -22751 -32281
6885 -32281 -27294 -5146 10642 12419 23205 17297 3139 6958 -19987 -12428 -21114 -9934 12060
6872 12060 -24258 -62667 -87415 -68674 -50801 -35238 -7165 9273 5590 24722 17532 22965
6860 22965 38010 25155 25047 47377 44175 -7139 -39501 -58276 -53404 -56480 -63815 -50326 -60381
6847 -60381 -44613 -15753 -16124 -25285 9330 1620 -37051 -42497 -25152 10531 21668 4066 -3298
$$ packed form
6936C331j1563o030P677k9075k1001n198K8062L2076L771j4985j939R803M646
6923d25j1026p459k801Q510j1718j0720J6866K3942K5690J1083j2785j3302l7451
6910b1596m2573R357L3023j3301j1305k9973J7065M4570O417p269K2742l2754
6898b5597r143J2302p021k429k0289K8501J3444j547K3570R601m0939l204r530
6885c2281M987K2148J5788J777J0786n908j4158L819k6945P559q686J1180K1994
6872A2060l6318l8409k4748J8741J7873J5563K8073J6438l683J9132p190N433
6860B2965J5045j2855j08K2330l202n1314l2362j8775M872l076p335J3489j0055
6847f0381J5768K8860l71r161L4615p710l8671n446J7345L5683J1137j7602p364
$$ plain form
6834 -3298 1613 -11533 -24175 -9856 -27228 -39334 2756 21074 -2906 -13630 -36777 -38917
6822 -38917 -24500 -16379 2920 22238 -14963 -49316 -11242 10636 27175 -4986 -36289 -3868
6810 -3868 23421 44535 27784 16439 -938 -2267 25099 20469 13700 18377 -6564 -10441 -5344
6797 -5344 4714 -14605 -2591 31926 359 -9844 -1661 -27802 -17708 -10210 9856 19241 14283
6784 14283 -20203 -24268 -19146 -37440 -77953 -66230 -53832 -57295 -64414 -34510 4536 16809 -2974
6771 -2974 -38249 -51574 -54799 -56624 -50477 -20249 10790 3 -16959 -20468 -30853 -19148 -12418
6758 -12418 -29840 -15491 -4190 15347 20623 11361 -13142 -27288 -12225 -17598 -22364 -34785 -54765
6745 -54765 -53904 -24196 7149 38942 35979 -334 -3690 2122 11970 21462 31301 15794 -1809
$$ packed form
6834c298M911j3146j2642J4319j7372j2106M2090J8318k3980j0724k3147k140
6822c8917J4417Q121J9299J9318l7201l4353L8074K1878J6539l2161l1303L2421
6810c868K7289K1114j6751j1345j7377j329K7366m630o769M677k4941l877N097
6797e344J0058j9319J2014L4517l1567j0203Q183k6141J0094P498K0066R385m958
6784A4283l4486m065N122j8294m0513J1723J2398l463p119K9904L9046J2273j9783
6771b974l5275j3325l225j825O147L0228L1039j0787j6962l509j0385J1705O730
6758a2418j7422J4349J1301J9537N276r262k4503j4146J5063n373m766j2421j9980
6745e4765Q61K9708L1345L1793k963l6313l356N812R848R492R839j5507j7603
$$ plain form
6732 -1809 -5030 2492 -15818 -3551 23275 27468 39240 61825 34622 43925 54073 52410 46118
6719 46118 30911 8312 -8160 295 26416 13838 7765 7973 5135 -6044 34238 39082 35077
6706 35077 44310 17925 34271 70868 79291 56894 27994 13874 -7453 -17749 -5609 -14723
6694 -14723 -14497 -14308 -11576 7414 15356 26270 40129 21310 -31839 -73158 -83771 -82202 -59440
6681 -59440 -42706 -65642 -52108 -48056 -42027 -14320 -23204 -19314 -36592 -37186 -38481 -14460 -28544
6668 -28544 -28884 -7837 -4261 -14360 7214 12870 -5495 -20029 -30239 -18006 7301 -2710 -1802
6655 -1802 13795 7085 -17895 -16375 -7949 -6920 21793 38966 11849 3807 1140 -6951 -21884
6642 -21884 -11405 -16655 -14052 -10033 11419 34867 33406 18818 33520 4910 22840 23934 -28647
$$ packed form
6732a809l221P522j8310J2267K6826M193J1772K2585k7203R303J0148j663o292
6719D6118j5207k2599j6472Q455K6121j2578o073K08k838j1179M0282M844m005
6706C5077R233k6385J6346L6597Q423k2397k8900j4120k1327j0296J2140r114
6694a4723K26J89K732J8990P942J0914J3859j8819n3149m1319j0613J569K2762
6681e9440J6734k2936J3534M052O029K7707q884L890j7278n94j295K4021j4084
6668b8544l40K1047L576j0099K1574N656j8365j4534j0210J2233K5307j0011R08
6655a802J5597o710k4980J520Q426J029K8713J7173k7117q042k667q091j4933
6642b1884J0479n250K603M019K1452K3448j461j4588J4702k8610J7930J094n2581
$$ plain form
6629 -28647 -52613 -11322 6182 10524 -465 -2311 -19244 -33541 -24503 -22201 18681 11601 -10932
6616 -10932 -6915 9080 -25155 -53602 -50219 -54771 -21792 8374 -10320 -28592 -46138 -29446
6604 -29446 -20396 -11080 10735 32856 11648 1217 -12954 -14417 4497 -8192 -9762 -6641 26177
6591 26177 38587 41471 34479 30600 -15443 -114 31764 14209 -21889 2233 20299 8706
6579 8706 3040 46 -5519 10193 13030 -1365 -21793 -13789 3389 21489 5165 1760 -26431
6566 -26431 -49116 -49665 -32219 -27906 -36190 -39392 -48142 -74916 -98938 -100496 -91842 -73551 -45921
6553 -45921 -33402 -18656 15708 5053 -15678 -21692 -2224 7230 19151 13268 -3334 -28437
6541 -28437 -40717 -42030 -43463 -21274 -16815 24991 36843 14720 6235 -11212 -27603 -13913 3480
$$ packed form
6629b8647k3966M1291J7504M342j0989j846j6933j4297R038K302M0882p080k2533
6616a0932M017J5995l4235k8447L383m552L2979L0166j8694j8272j7546J6692
6604b9446R050R316K1815K2121k1208j0431j4171j463J8914j2689j570L121L2818
6591B6177J2410K884o992l879m6043J5329L1878j7555l6098K4122J8066j1593
6579H706n666k994n565J5712K837j4395k0428Q004J7178J8100j6324l405k8191
6566b6431k2685n49J7446M313q284l202q750k6774k4022j558Q654J8291K7630
6553d5921J2519J4746L4364j0655k0731o014J9468R454J1921n883j6602k5103
6541b8437j2280j313j433K2189M459M1806J1852k2123q485j7447j6391J3690J7393
$$ plain form
6528 3480 -15173 -16728 -31498 -44246 -60636 -65037 -57963 -54188 -42726 -13567 3781 15602 11325
6515 11325 3278 -1834 -9607 13850 22450 30781 35172 27618 34768 13601 -23709 -51964 -17533
6502 -17533 1030 23065 17975 38768 29956 1980 7553 -5215 -13768 31084 35529 2239 -43719
6489 -43719 -43371 -24028 -22048 -3846 -786 10537 -2505 8857 22348 20036 -5957 -18789 -17152
6476 -17152 -33071 -22796 -14077 12299 28465 24035 9218 8328 1338 -19828 -21258 11487 482
6463 482 -27297 -12973 21129 31705 31563 34067 28212 17041 259 -15456 4128 22215 20186
6450 20186 17685 -20243 -50157 -62123 -27146 -18385 -33055 -23990 4688 22605 4091 -24327
6438 -24327 -20260 13348 64006 53028 30566 20818 18614 -18359 -38014 -47205 -53202 -26388 455
$$ packed form
6528C480j8653j555j4770j2748j6390m401P074L775J1462K9159J7348J1821m277
6515A1325q047n112p773K3457Q600Q331M391p554P150k1167l7310k8255L4431
6502a7533J8563K2035n090K0793q812k7976N573j2768q553M4852M445l3290m5958
6489d3719L48J9343J980J8202L060J1323j3042J1362J3491k312k5993j2832J637
6476a7152j5919J0275Q719K6376J6166m430j4817q90o990k1166j430L2745j1005
6463D82k7779J4324L4102J0576j42K504n855j1171j6782j5715J9584J8087k029
6450B0186k501l7928k9914j1966L4977Q761j4670R065K8678J7917j8514k8418
6438b4327M067L3608N0658j0978k2462r748k204l6973j9655r191n997K6814K6843
$$ plain form
6425 455 19010 19472 24034 -8175 -24172 -11064 -9995 11126 38176 29607 22960 30608 19567 3483
6411 3483 -2125 14650 38936 8542 -39354 -28030 -23670 -10996 -23362 -39373 -16070 -25306 -57243
6398 -57243 -71643 -60216 -68120 -59321 -16641 11183 33516 36398 23495 28774 -13963 -31854 -1330
6385 -1330 16739 2328 -15315 -22193 -10537 6028 19793 23419 941 -33245 -34347 4724 25974
6372 25974 23398 25044 36126 -22583 -36311 -19475 -19111 -22127 -22818 10319 15063 13701 -4829 -39221
6358 -39221 -24142 1116 -20683 -36838 -34664 -32847 -69202 -80438 -46562 -14157 4924 15286
6346 15286 -4603 -12463 -23473 -40367 2669 20608 27317 33397 -1122 4309 8439 19673 8048
6333 8048 -9490 -8768 -21272 -55917 -68970 -62305 -12511 25304 21446 -1308 -2311 -8364 -5739
$$ packed form
6425D55J8555M62M562l2209j5997J3108J069K1121K7050q569o647P648j1041j6084
6411C483n608J6775K4286l0394m7896J1324M360J2674j2366j6011K3303r236l1937
6398e7243j4400J1427p904Q799M2680K7824K2333K882j2903N279m2737j7891L0524
6385a330J8069j4411j7643o878J1656J6565J3765L626k2478l4186j102L9071K1250
6372B5974k576J646J1082n8709j3728J6836L64l016o91L3137M744j362j8530l4392
6358c9221J5079K5258k1799j6155K174J817l6355j1236L3876L2405J9081J0362
6346A5286j9889p860j1010j6894M3036J7939O709O080l4519N431M130J1234j1625
6333H048j7538P22j2504l4645j3053O665M9794L7815l858k2754j003o053K625
$$ plain form
6320 -5739 4887 412 14307 19642 -10027 -41591 -11399 23519 14624 7858 964 -41130 -26034
6307 -26034 -3774 9021 26107 17040 24831 426 -19034 -7375 25951 16087 9605 16253 24399
6294 24399 -12092 -12984 -17138 12650 45298 31824 15385 -6821 -13860 576 -1529 40012 49033
6281 49033 13942 -16195 -29235 -10785 -3876 -12604 -18115 15628 7647 11333 20674 15784 22491
6268 22491 26586 32235 18754 8328 -24604 -40393 -12979 4451 -5238 -10769 -3128 -14237 -20865
6255 -20865 -13067 19580 6493 -9256 4797 -4064 6079 9949 3372 -2173 -822 2259 13532
6242 13532 33472 42171 -19970 -41250 -19987 -34670 -25929 -21920 -15039 -142 11998 16602 31960
6229 31960 32205 4961 -16509 -23404 -5417 -13225 -6055 -13302 1560 26483 25797 92 -138 5861
$$ packed form
6320e739J0626m475J3895N335k9669l1564L0192L4918q895o766o894m2094J5096
6307b6034K2260J2795J7086r067P791k4405j9460J1659L3326r864o482O648Q146
6294B4399l6491q92m154K9788L2648j3474j6439k2206p039J4436k105M1541R021
6281D9033l5091l0137j3040J8450O909q728n511L3743p981L686R341m890O707
6268B2491M095N649j3481j0426l2932j5789K7414J7430r689n531P641j1109o628
6255b0865P798L2647j3087j5749J4053q861J0143L870o577n545J351L081J1273
6242A3532J9940Q699o2141k1280K1263j4683Q741M009O881J4897J2140M604J5358
6229C1960K45k7244k1470o895J7987p808P170p247J4862K4923o86k5705k30N999
$$ plain form
6215 5861 33127 16030 14797 29324 1700 -21714 -32337 -18090 11581 28786 52360 49881
6203 49881 44582 35881 35417 1724 183 -13860 -50549 -61155 -41613 -18605 -5098 -5716 -2604
6190 -2604 -2637 -12260 -36864 -58628 -73866 -66113 -47191 -53711 -53413 -38536 -14984 -22587 -27165 -30264
6176 -30264 -4121 7791 14758 6962 5125 -7469 -37121 -43351 -22039 -5681 9709 12441 16310
6163 16310 16096 -13796 10291 23356 -24517 -36239 -27312 -21144 -5173 -11020 -28748 -13336 13360
6150 13360 24453 28086 15321 -35688 -62621 -68183 -44392 3772 5802 -25541 10295 40192
6138 40192 3065 -3219 -17689 1464 -20066 -36106 -25701 -20805 9887 24127 38009 45278
6126 45278 16632 -3557 9841 26626 20953 47935 32041 13598 15528 -15209 -7617 -5538 -13357
$$ packed form
6215E861K7266j7097j233J4527k7624k3414j0623J4247K9671J7205K3574k479
6203D9881n299q701m64l3693j541j4043l6689j0606J9542K3008J3507o18L112
6190b604l3r623k4604k1764j5238P753J8922o520K98J4877K3552p603m578l099
6176c0264K6143J1912O967p796j837j2594k9652o230K1312J6358J5390K732L869
6163A6310k14k9892K4087J3065m7873j1722Q927O168J5971n847j7728J5412K6696
6150A3360J1093L633j2765n1009k6933n562K3791M8164K030l1343L5836K9897
6138D0192l7127o284j4470J9153k1530j6040J0405M896L0692J4240J3882P269
6126D5278k8646k0189J3398J6785n673K6982j5894j8443J930l0737P592K079p819
$$ plain form
6113 -13357 5848 7711 15646 -2031 -16619 -16483 -353 27577 17481 8796 1941 -14402 -13203
6100 -13203 -8940 -2146 26289 27092 -4361 -33192 -28342 12220 22571 22116 25322 -22489 -47705
6087 -47705 -43954 -29823 -12040 5463 -26133 -49041 -44459 -54391 -61264 -45176 -6948 5437 -8668
6074 -8668 3424 10594 19458 71798 59513 15987 -7444 -16436 -30795 -29447 -36973 -24948 -3206
6061 -3206 12350 26110 50515 65431 41807 17182 877 -8366 -12454 -34411 -17308 2553
6049 2553 -14377 -45766 -67980 -74984 -49207 -10869 4838 -3167 -7184 -11531 -19729 -19310 -7433
6036 -7433 -4625 6256 8526 -114 -8386 -33157 -30307 -15991 -11841 -21717 -23636 -10559 -16408 -3442
6022 -3442 -12253 -31383 -39719 -21464 -28047 -30088 -39956 -39787 -24114 7420 39932 36241 94 9023
$$ packed form
6113a3357J9205J863P935j7677j4588J36J6130K7930j0096q685o855j6343J199
6100a3203M263O794K8435Q03l1453k8831M850M0562J0351m55L206m7811k5216
6087d7705L751J4131J7783J7503l1596k2908M582r932o873J6088L8228J2385j4105
6074h668J2092P170Q864N2340j2285m3526k3431q992j4359J348p526J2025K1742
6061c206J5556J3760K4405J4916k3624k4625j6305r243m088k1957J7103J9861
6049B553j6930l1389k2214p004K5777L8338J5707q005m017m347q198M19J1877
6036g433K808J0881K270q640q272k4771K850J4316M150r876j919J3077n849J2966
6022c442q811j9130q336J8255o583k041r868J69J5673L1534L2512l691l6147Q929
$$ plain form
6008 9023 15864 16457 18295 2714 -11456 -2015 -13720 -17643 -5667 -16482 -9643 -12656 15602 1190
5994 1190 -26221 -32741 -40445 -27744 -12859 -17015 -35382 -37482 -32338 -35390 -36375 -21573 -26583 -30217
5980 -30217 -17878 -19210 -13126 -10736 6478 20596 -947 -23161 -48804 -47943 7965 16150 -16813
5967 -16813 -10730 1899 24240 32865 37771 29717 7301 26284 5685 9717 -16203 -7025 14942
5954 14942 21574 14773 13497 17464 -16549 -47190 -23662 1568 -8350 -4423 -6011 4966 -1797
5941 -1797 -3710 -5100 -4082 -12730 -5039 9913 -8711 -27861 -46879 -21149 326 -24707 6839
5928 6839 11134 -2518 -9486 9785 30336 17749 33892 15078 23187 44793 41131 22274 31725
5915 31725 23633 -7189 -28192 -36818 -39431 -22975 -7393 -24739 -43177 -20727 1990 -16619
$$ packed form
6008I023O841N93J838j5581j4170R441j1705l923J1976j0815O839l013K8258j4412
5994A190k7411o520p704J2701J4885m156j8367k100N144l052r85J4802n010l634
5980c0217J2339j332O084K390J7214J4118k1543k2214k5643Q61N5908Q185l2963
5967a6813O083J2629K2341Q625M906q054k2416J8983k0599M032k5920R178K1967
5954A4942O632o801j276L967l4013l0641K3528K5230r918L927j588J0977o763
5941a797j913j390J018q648P691J4952j8624j9150j9018K5730K1475k5033L1546
5928F839M295j3652o968J9271K0551j2587J6143j8814Q109K1606l662j8857R451
5915C1725q092l0822k1003q626k613J6456J5582j7346j8438K2450K2717j8609
$$ plain form
5903 -16619 -47363 -67788 -74106 -56277 -23239 -25925 -34679 -51879 -50515 -25043 -11445 -15543 9254
5890 9254 14009 2712 1424 5683 10661 9286 15960 24033 14595 -3754 -5309 7323 10762 2257
5876 2257 16908 36366 21786 -17887 -21932 -14460 -20503 -2148 36577 22628 13397 32617 27206
5863 27206 10120 -21108 -59523 -67063 -23723 -2155 -9886 16855 27732 10653 -4212 -20093
5851 -20093 -18116 -19595 -21203 -24224 -46183 -38373 -24738 -36429 -56636 -41253 -22352 -28783 -34459
5838 -34459 -4399 -39451 -83344 -66502 -46975 -48225 -35928 -27250 -35777 -40746 -21996 -23605 -9459
5825 -9459 5767 10511 6197 -35621 -49398 -26379 -10641 776 14935 27742 16452 -5754
5813 -5754 5231 27698 16989 7484 31775 59876 63250 34764 34224 9896 14249 19125 26542
$$ packed form
5903a6619l0744k0425o318J7829L3038k686q754j7200J364K5472J3598m098K4797
5890I254M755j1297j288M259M978j375O674Q073r438j8349j555J2632L439q505
5876B257J4651J9458j4580l9673m045P472o043J8355L8725j3949r231J9220n411
5863B7206j7086l1228l8415p540M3340K1568p731K6741J0877j7079j4865j5881
5851b0093J977j479j608l021k1959P810J3635j1691k0207J5383J8901o431n676
5838c4459L0060l5052m3893J6842J9527j250J2297Q678q527m969J8750j609J4146
5825i459J5226M744m314m1818j3777K3019J5738J1417J4159J2807j1290k2206
5813e754J0985K2467j0709r505K4291K8101L374k8486n40k4328M353M876P417
$$ plain form
5800 26542 14165 -1228 12920 22253 40705 65031 65999 75362 80307 55400 16342 -2437 14827
5787 14827 27982 35845 28407 8889 -3714 -26336 -52980 -28412 1135 -1671 -5757 -17162 -13928
5774 -13928 5153 28149 44924 514 -36952 -27410 -8829 -1950 19804 53632 63743 28562
5762 28562 16959 40477 31481 22665 45488 44746 36495 28919 -11118 -17341 3792 10139 40743
5749 40743 34448 7859 -10041 -16453 4616 21521 41621 43384 22491 -2969 -42148 -12447
5737 -12447 -3598 -22388 -25218 -15260 7619 5952 -22210 -26100 2827 12971 19094 50624 34611
5724 34611 8150 18947 26078 -8629 -29435 -15575 27035 37672 -12310 -29959 -26414 -18175
5712 -18175 -8070 25400 30129 -1192 -12190 -5843 -21786 -27470 -14165 -36134 -63166 -51486
$$ packed form
5800B6542j2377j5393J4148R333J8452K4326R68R363M945k4907l9058j8779J7264
5787A4827J3155P863p438j9518j2603k2622k6644K4568K9547k806m086j1405L234
5774a3928J9081K2996J6775m4410l7466R542J8581O879K1754L3828J0111l5181
5762B8562j1603K3518q996q816K2823p42q251p576m0037o223K1133O347L0604
5749D0743o295k6589j7900o412K1069J6905K0100J763k0893k5460l9179K9701
5737a2447Q849j8790k830R958K2879j667k8162l890K8927J0144O123L1530j6013
5724C4611k6461J0797P131l4707k0806J3860M2610J0637m9982j7649L545Q239
5712a8175J0105L3470M729l1321j0998O347j5943n684J3305k1969k7032J1680
$$ plain form
5700 -51486 -51101 -45236 -25869 -18735 -26485 -28952 -43333 -22047 8043 -23928 -37161 -14094 -13325
5687 -13325 -30435 -20120 -48489 -50886 -35588 -50846 -44281 -16778 -13325 -42653 -41159 -35492 -49642
5674 -49642 -78381 -65898 -5314 -9908 -4590 9917 10458 12565 33343 18881 15444 18379 -6291
5661 -6291 -32198 -30555 -31435 -25416 -29508 -32591 1957 38083 11239 -34123 -56514 -66529 -46939
5648 -46939 -63764 -56676 -37408 -15839 6810 60243 63612 64126 14914 -39470 -62382 -29602 -11176
5635 -11176 -14374 -28140 -10382 -11385 1948 12316 4491 18298 36236 57841 66848 35072 14069
5622 14069 -16197 -37565 -50414 -32508 -50116 -53597 -35803 -38938 -42617 -2586 4698 11831 20589
5609 20589 6369 9273 5320 -20543 -37743 6705 22809 25525 4394 12547 13930 -34319 -79557
$$ packed form
5700e1486L85N865J9367P134p750k467j4381K1286L0090l1971j3233K3067P69
5687a3325j7110J0315k8369k397J5298j5258O565K7503L453k9328J494N667j4150
5674d9642k8739J2483O0584m594N318J4507N41K107K0778j4462l437K935k4670
5661f291k5907J643q80O019m092l083L4548L6126k6844m5362k2391j0015J9590
5648d6939j6825P088J9268K1569K2649N3433L369N14m9212n4384k2912L2780J8426
5635a1176l198j3766J7758j003J3333J0368p825J3807J7938K1605R007l1776k1003
5622A4069l0266k1368j2849J7906j7608l481J7794l135l679M0031P284P133Q758
5609B0589j4220K904l953k5863j7200M4448J6104K716k1131Q153J383m8249m5238
$$ plain form
5596 -79557 -39127 -27039 -566 21097 36225 17873 16978 53805 22647 9689 13759 1867
5584 1867 -32200 -38313 -23749 -29228 -2816 27673 58555 56400 49794 41684 25595 3546 -15889
5571 -15889 6604 20052 35344 77238 45137 6586 -28614 -5418 30126 47849 51623 18817
5559 18817 5746 -1753 1241 10046 28197 7140 -21351 -33561 -40751 -33447 -6940 8282 6223
5546 6223 23890 6907 -7449 -1856 11407 14231 10385 12210 10000 51115 70580 25128 8737
5533 8737 7122 12592 14898 -2417 4348 33023 46736 10003 -5024 -16567 20339 34774 28566
5520 28566 14988 -8745 -32652 -30687 -47542 -25879 -42707 -34192 -18868 -10504 5097 36484
5508 36484 49491 54667 41758 31843 52570 72773 56334 30912 44968 33517 22669 23528 48691
$$ packed form
5596g9557M0430J2088K6473K1663J5128j8352q95L6827l1158j2958M070j1892
5584A867l4067o113J4564n479K6412L0489L0882k155o606q110j6089k2049j9435
5571a5889K2493J3448J5292M1894l2101l8551l5200K3196L5544J7723L774l2806
5559A8817j3071p499K994Q805J8151k1057k8491j2210p190P304K6507J5222k059
5546F223J7667j6983j4356N593J3263K824l846J825k210M1115J9465m5452j6391
5533H737j615N470K306j7315O765K8675J3713l6733j5027j1543L6906J4435o208
5520B8566j3578k3733k3907J965j6855K1663j6828Q515J5324Q364J5601L1387
5508C6484J3007N176j2909r915K0727K0203j6439k5422J4056j1451j0848Q59K5163
$$ plain form
5495 48691 42689 47791 52409 32685 28920 19292 -15873 -40199 -58867 -28876 18140 1551 -9259
5482 -9259 -60531 -75272 -88638 -77359 -61861 -19320 -12096 -30888 -24342 6819 -236 -26666 -4389
5469 -4389 -14427 2950 -13835 -14575 11177 22540 12934 -1308 -15601 -29280 -38347 741 9820
5456 9820 -14229 -12601 -16316 -31405 -25448 15703 14310 5200 13062 11194 2820 10320 8925 19394
5442 19394 39904 32416 7787 23532 25850 24106 13208 2585 194 -19512 -40144 -43016 -37206
5429 -37206 -24181 -16847 -8471 -10380 -11710 -21061 14379 38858 37855 44891 60874 39671 20156
5416 20156 27937 25698 11378 22531 32423 22034 14625 6647 -25874 -57040 -50932 -42016 -11097
5403 -11097 5175 -29813 -8288 -4692 -369 9914 3511 4319 9493 -13922 -11224 2625 10086
$$ packed form
5495D8691o002N102M618j9724l765r628l5165k4326j8668K9991M7016j6589j0810
5482i259n1272j4741j3366J1279J5498M2541P224j8792O546L1161p055k6430K2277
5469d389j0038J7377j6785p40K5752J1363r606j4242j4293j3679r067L9088R079
5456I820k4049J628l715j5089N957M1151j393r110P862j868q374P500j395J0469
5442A9394K0510p488k4629J5745K318j744j0898j0623k391j9706k0632k872N810
5429c7206J3025P334Q376j909j330r351L5440K4479j003P036J5983k1203j9515
5416B0156P781k239j4320J1153R892j0389p409p978l2521l1166O108Q916L0919
5403a1097J6272l4988K1525L596M323J0283o403Q08N174k3415K698J3849P461
$$ plain form
5390 10086 24840 32118 18696 -8800 -10986 -1059 -8340 -23864 -12108 2921 380 -20144 -15650
5377 -15650 -10155 -12023 -9606 -6891 -14277 1975 -4385 -18165 -20928 -39464 -15020 26791 20114
5364 20114 -6700 -41584 -43850 -27516 -5304 -14079 -41268 -25075 10656 -9958 -36501 -49355
5352 -49355 -33120 -17180 2093 22028 22878 8181 -99 -5463 1259 11679 45539 31049 26339
5339 26339 468 16612 23162 27565 31636 19653 1698 11981 -7817 -22343 -4060 5650 10146
5326 10146 18683 27506 12497 4070 3404 -33448 -63767 -54710 -20743 15337 24879 -7565 -38931
5313 -38931 -32483 -34356 -36231 -35535 -24907 2797 7757 -4998 -8117 2523 18896 16511 -263
5300 -263 2443 38961 56392 39901 28244 18973 -15634 -6245 4764 2350 -15169 -15197 -20785 -23309
$$ packed form
5390A0086J4754P278j3422k7496k186R927p281j5524J1756J5029k541k0524M494
5377a5650N495j868K417K715p386J6252o360j3780k763j8536K4444M1811o677
5364B0114k6814l4884k266J6334K2212q775k7189J6193L5731k0614k6543j2854
5352d9355J6235J5940J9273J9935Q50j4697q280n364O722J0420L3860j4490m710
5339B6339k5871J6144O550M403M071j1983j7955J0283j9798j4526J8283R710M496
5326A0146Q537Q823j5009q427o66l6852l0319R057L3967L6080R542l2444l1366
5313c8931O448j873j875O96J0628K7704M960j2755l119J0640J6373k385j6774
5300b63K706L6518J7431j6491j1657r271l4607R389J1009k414j7519k8n588k524
$$ plain form
5286 -23309 -20998 -18108 -8559 -20207 -27051 -37981 -13291 29479 28880 1109 -6328 -7734 1052 -4769
5272 -4769 -11698 21687 3930 -10670 -23808 -17275 3006 21125 27171 19920 -4100 -25596 -19322
5259 -19322 -29262 -49645 -55918 -30319 25641 30658 -18667 -38354 -35043 -42077 -20865 -15639 -5183
5246 -5183 -17926 -32403 -20580 -6121 12990 -3940 -27520 -40881 -57776 -64797 -61447 -19134
5234 -19134 -38189 -54815 -57645 -39169 -20139 -15406 1616 -2371 -30530 -42034 -24521 991
5222 991 18497 10226 8189 35861 34504 5417 4385 31812 12591 21988 55937 51009 42412 36522
5208 36522 25222 38987 74453 73302 67222 58345 701 -29369 -23941 1407 24276 46120 50485
5195 50485 40777 39005 8066 -20804 -259 -13116 -22821 6994 21796 11324 524 3386 1036
$$ packed form
5286b3309K311K890R549j1648o844j0930K4690M2770n99k7771p437j406Q786n821
5272d769o929L3385j7757j4600j3138O533K0281J8119O046p251k4020k1496O274
5259a9322r940k0383o273K5599N5960N017m9325j9687L311p034K1212N226J0456
5246e183j2743j4477J1823J4459J9111j6930k3580j3361j6895p021L350M2313
5234a9134j9055j6626k830J8476J9030M733J7022l987k8159j1504J7513K5512
5222I91J7506q271k037K7672j357k9087j032K7427j9221R397L3949m928q597n890
5208C6522j1300J3765L5466j151o080q877n7644l0070N428K5348K2869K1844M365
5195E0485r708j772l0939k8870K0545j2857r705K9815J4802j0472j0800K862k350
$$ plain form
5182 1036 -20006 -38262 -56037 -66665 -41069 -10687 -12894 -18188 2900 27274 38570 15886
5170 15886 -9713 -30623 -13010 47959 73282 66514 52465 19961 -5771 -30286 -15283 -27303
5158 -27303 -42297 -29737 -28434 -42196 -44020 -25479 -11199 -15373 8156 30344 9106 -21163
5146 -21163 -4417 23903 3166 -20389 1802 14463 18372 13609 3917 4503 10 3852 23401
5133 23401 13378 5639 -13896 -59376 -57882 -69106 -82366 -93793 -86673 -64070 -28363 4240
5121 4240 -6091 -15445 -45954 -64372 -12479 -1980 -23762 -6545 25027 44590 42831 19296
5109 19296 8401 24221 56750 75658 77819 48369 35208 22273 4419 4729 25168 2670
5097 2670 -13623 -49614 -35780 -6879 24034 61866 78069 40447 7398 16893 15998 30656 7730
$$ packed form
5182A036k1042j8256j7775j0628K5596L0382k207n294K1088K4374J1296k2684
5170A5886k5599k0910J7613O0969K5323o768j4049l2504k5732k4515J5003j2020
5158b7303j4994J2560J303j3762j824J8541J4280m174K3529K2188k1238l0269
5146b1163J6746K8320k0737k3555K2191J2661L909m763r692N86m493L842J9549
5133B3401j0023p739j9535m5480J494j1224j3260j1427P120K2603L5707L2603
5121D240j0331r354l0509j8418N1893J0499k1782J7217L1572J9563j759k3535
5109A9296j0895J5820L2529J8908K161k9450j3161j2935j7854L10K0439k2498
5097B670j6293l5991J3834K8901L0913L7832J6203l7622l3049R495q95J4658k2926
$$ plain form
5084 7730 16333 44525 46960 14395 24595 20555 -17067 -22643 -39158 -31739 -8841 22034 22338
5071 22338 3116 -10464 6371 9318 -2531 25250 -7173 -18309 -21206 -58282 -68881 -35633
5059 -35633 -17866 -10784 16135 33640 15417 -12451 -7345 -14235 -20070 -31062 -35829 -3692 11553
5046 11553 2141 -5899 9956 25244 20369 4853 4289 7321 -14275 -58431 -55646 -59782 -68087 -34568
5032 -34568 -6172 -8371 -6889 -21056 -56657 -31850 46 2773 11387 14922 27056 29815 33216
5019 33216 36509 21580 15315 15917 16330 20814 11222 -16525 -10977 29220 44687 13296 21664 28364
5005 28364 27775 25846 38590 39339 61704 47643 28824 -579 5194 49224 57959 39803 29318
4992 29318 7209 -5143 25030 28190 28609 30010 12636 4727 2179 17824 10639 13918 12967 45258
$$ packed form
5084G730Q603K8192K435l2565J0200m040l7622n576j6515P419K2898L0875L04
5071B2338j9222j3580J6835K947j1849K7781l2423j1136k897l7076j0599L3248
5059c5633J7767P082K6919J7505j8223k7868N106o890n835j0992m767L2137J5245
5046A1553r412q040J5855J5288m875j5516n64L032k1596m4156K785m136q305L3519
5032c4568K8396k199J482j4167l5601K4807L1896K727Q614L535J2134K759L401
5019C3216L293j4929o265O02M13M484r592k7747N548M0197J5467l1391Q368O700
5005B8364n89j929J2744P49K2365j4061j8819k9403N773M4030Q735j8156j0485
4992B9318k2109j2352L0173L160M19J401j7374p909k548J5645p185L279r51L2291
$$ plain form
4978 45258 61850 59553 27513 28129 34129 12565 31895 23577 11785 12881 -4239 12082 47925
4965 47925 51021 3624 3834 -5107 -37906 -27760 955 -10942 -54572 -91881 -73774 -61399 -51844
4952 -51844 -36510 -15701 1190 2345 -15888 -274 1848 6589 282 11815 7614 8652 7743
4939 7743 13314 23151 21496 11922 -10595 -26252 -22353 -20821 -26022 -33093 -14098 11413 24608 31959
4925 31959 12340 -15232 -14367 -35986 -52431 -32315 -27647 -30572 -11257 -5734 -18133 -72227 -65995
4912 -65995 -47210 -33900 -13050 621 -15032 -34746 -5672 14119 4487 -4415 -20055 -12205
4900 -12205 -1020 -5434 -17568 -28625 -3626 -8029 -36933 -43941 -47299 -36515 -15517 2356 -2460
4887 -2460 -20912 -20066 -10177 -5443 -11748 7125 41157 55409 12452 -14490 -17024 -8374 14312
$$ packed form
4978D5258J6592k297l2040O16O000k1564J9330q318j1792J096j7120J6321L5843
4965D7925L096m7397K10q941l2799J0146K8715j1897m3630l7309J8107J2375R555
4952e1844J5334K0809J6891J155j8233J5614K122M741o307J1533m201J038r09
4939G743N571R837j655r574k2517j5657L899J532n201p071J8995K5511J3195P351
4925C1959j9619k7572Q65k1619j6445K0116M668k925J9315N523j2399n4094O232
4912f5995J8785J3310K0850J3671j5653j9714K9074J9791r632q902j5640P850
4900a2205J1185m414j2134j1057K4999m403k8904p008l358J0784K0998J7873m816
4887b460j8452Q46R889M734o305J8873L4032J4252m2957k6942k534Q650K2686
$$ plain form
4874 14312 8051 -23629 -2014 37869 23262 7154 -8773 1103 23888 30188 35739 23355 -8114
4861 -8114 -28886 -54814 -52949 -62481 -73278 -52095 -42039 -1938 32739 25883 23311 35369 43858
4848 43858 65791 49870 4495 -9358 -25258 -20701 -17780 -23384 -20408 -11750 -3872 -6319 2272
4835 2272 3624 5133 -1745 17617 32116 49928 34416 -13855 -35924 -58080 -48420 -5453 -12346
4822 -12346 -12415 12339 11773 -25885 -39682 -8461 6089 -4987 -6667 2304 16007 16896 19592 27040
4808 27040 -13955 -37926 -51833 -35223 -19541 11201 48316 43910 30489 22836 24946 30743 -3898
4795 -3898 -8071 -20385 -37930 -50170 -32009 24370 44654 11772 12209 28052 -8050 -5945 2639
4782 2639 4816 27836 45611 57126 49084 15894 1126 -14553 -19122 -11210 -11048 -20404 4064
$$ packed form
4874A4312o261l1680K1615L9883j4607j6108j5927R876K2785O300N551j2384l1469
4861h114k0772k5928J865r532j0797K1183J0056M0101L4677o856k572J2058Q489
4848D3858K1933j5921m5375j3853j5900M557K921n604K976Q658P878k447Q591
4835B272J352J509o878J9362J4499J7812j5512m8271k2069k2156R660M2967o893
4822a2346o9K4754n66l7658j3797L1221J4550j1076j680Q971J3703Q89K696P448
4808B7040m0995k3971j3907J6610J5682L0742L7115m406j3421p653K110N797l4641
4795c898m173j2314j7545j2240J8161N6379K0284l2882M37J5843l6102K105Q584
4782B639K177K3020J7775J1515q042l3190j4768j5679m569P912J62r356K4468
$$ plain form
4769 4064 2305 -14683 -9930 -8339 -17706 -3440 22885 35358 1375 -24513 -40658 -33187 -8641
4756 -8641 2916 -18278 -32116 -40349 -13617 22374 17505 15239 20156 -8207 -5780 15140 1813
4743 1813 26123 29739 15647 -16465 -42400 -45627 -31797 -8818 13558 11769 7878 -2148 40939
4730 40939 23417 -28862 -33326 -25208 -17433 -33108 -41379 -14076 -16309 -7011 17591 2921 7704
4717 7704 2012 6457 -14073 -34427 -38646 -61058 -43328 -38944 -29122 -30508 -37856 -11474 18184
4704 18184 -1400 -27607 -37044 -17623 -11159 -10753 -7812 -29710 -61429 -46027 -36219 -24629 -32413
4691 -32413 -30102 -5672 10824 32349 50630 8943 -16044 -18117 -21777 -22962 -18581 -5890 15060
4678 15060 10876 -2122 -15270 -15924 -7175 -2455 5692 -8751 -21697 -22003 -26245 -34310 -34549 -7261
$$ packed form
4769D064j759j6988M753J591r367J4266K6325J2473l3983k5888j6145P471K4546
4756h641J1557k1194j3838q233K6732L5991m869k266M917k8363K427K0920j3327
4743A813K4310L616j4092l2112k5935l227J3830K2979K2376j789l891j0026M3087
4730D0939j7522n2279m464Q118P775j5675q271K7303k233R298K4602j4670M783
4717G704n692M445k0530k0354m219k2412J7730M384R822j386p348K6382K9658
4704A8184j9584k6207r437J9421O464M06K941k1898l1719J5402R808J1590p784
4691c2413K311K4430J6496K1525J8281m1687k4987k073l660j185M381J2691K0950
4678A5060m184j2998j3148o54Q749M720Q147j4443j2946l06m242q065k39K7288
$$ plain form
4664 -7261 16490 19537 38994 17625 -20528 -13901 -22804 -30136 -29021 -14147 21471 6995 12335
4651 12335 49882 57264 31248 -8307 -34291 -18964 -14048 -5979 -8567 -10788 17071 14827 32041
4638 32041 41490 55882 24726 -33543 -30221 9510 14969 32230 38887 23764 16800 14246 -11970
4625 -11970 -47805 -35485 -23796 -30746 -31787 -26885 307 -20650 -31675 -15244 6227 16412
4613 16412 -3818 -5351 15069 24081 -9888 -29895 -23966 10699 15840 -2598 -928 12147 16945
4600 16945 7633 25273 46872 62808 81701 56557 36225 27783 37980 41814 24924 -9566
4588 -9566 -58221 -43062 -16805 3453 9247 -16717 -24164 -24413 -24653 -21591 -24177 -20246 -2499 -254
4574 -254 -16696 -17927 -35512 -59078 -61655 -29316 23765 -23053 -61084 -90834 -77249 -27166 -2511
$$ packed form
4664g261K3751L047J9457k1369l8153O627q903p332J115J4874L5618j4476N340
4651A2335L7547P382k6016l9555k5984J5327M916Q069k588k221K7859k244J7214
4638C2041R449J4392l1156n8269L322L9731N459J7261O657j5123o964k554k6216
4625a1970l5835J2320J1689o950j041M902K7192k0957j1025J6431K1471J0185
4613A6412k0230j533K0420R012l3969k0007N929L4665N141j8438J670J3075M798
4600A6945r312J7640K1599J5936J8893k5144k0332q442J0197L834j6890l4490
4588i566m8655J5159K6257K0258N794k5964p447k49k40L062k586L931J7747K245
4574b54j6442j231j7585k3566k577L2339N3081m6818l8031k9750J3585N0083K4655
$$ [...]
##END NTUPLES=NMR SPECTRUM
##END=
