##TITLE=Analysis number 326315
Compound Code tl 00539
Project Code adrs
Chemist Name aci
##JCAMPDX= 6.0         $$ Bruker NMR JCAMP-DX V2.0
##DATA TYPE= NMR SPECTRUM
##DATA CLASS= NTUPLES
##ORIGIN= Bruker BioSpin GmbH
##OWNER= nmr
$$ XWIN-NMR		Version 3.5
$$ Thu Feb  1 11:51:47 2007 GMT Standard Time (UT+0h)  MAYBRIDGE\nmr@NMR_250MHZ
##.OBSERVE FREQUENCY= 250.131544655141
##.OBSERVE NUCLEUS= ^1H
##.ACQUISITION MODE= SIMULTANEOUS (DQD)
##.ACQUISITION SCHEME= undefined
##.AVERAGES= 16
##.DIGITISER RES= 18
##SPECTROMETER/DATA SYSTEM= dpx250
##.PULSE SEQUENCE= zg30
##.SOLVENT NAME= DMSO
##.SHIFT REFERENCE= (INTERNAL, DMSO, 0, 16.522)
##AUDIT TRAIL= $$ (NUMBER, WHEN, WHO, WHERE, WHAT)
$$ ##TITLE= Audit trail, XWIN-NMR		Version 3.5
$$ ##JCAMPDX= 5.01
$$ ##ORIGIN= Bruker BioSpin GmbH
$$ ##OWNER= nmr
$$ C:\u/data/dgb/nmr/ADRS/110/pdata/1/auditp.txt
$$ ##AUDIT TRAIL=  $$ (NUMBER, WHEN, WHO, WHERE, WHAT)
(   1,<2007-02-01 11:51:24.50 +000>,<MAYBRIDGE\nmr>,<NMR_250MHZ>,
      <created by zg, POWCHK disabled, PULCHK disabled
       configuration hash MD5:
       49 4B E0 1D 92 C2 6B 37 9F E6 65 BC 52 41 86 1D
       data hash MD5: 64K
       BA 86 EA DB DF 5A A4 C6 2D 7F 79 8B 28 AA FB B2>)
(   2,<2007-02-01 11:51:38.72 +000>,<MAYBRIDGE\nmr>,<NMR_250MHZ>,
      <Start of raw data processing
       ef LB = 0.3 FT_mod = 6 PKNL = 1 SI = 32K 
       data hash MD5: 32K
       5B DB AB FC 0D 34 3C 61 6B EA 00 46 A1 D1 DA 09>)
(   3,<2007-02-01 11:51:40.36 +000>,<MAYBRIDGE\nmr>,<NMR_250MHZ>,
      <apk 
       data hash MD5: 32K
       59 B2 AF 93 89 12 C5 B0 53 CA 3C 2A 32 0A 40 1A>)
(   4,<2007-02-01 11:51:41.06 +000>,<MAYBRIDGE\nmr>,<NMR_250MHZ>,
      <abs ABSG = 5 
       data hash MD5: 32K
       BD 41 1F EB 16 61 C2 8F 77 22 ED A5 A6 9F 1A CB>)
$$ ##END=
$$ 
$$ hash MD5
$$ C2 51 69 17 4D 30 DA E3 11 F6 00 38 92 53 91 C4
##$RELAX= 
##$RELAX= 
##$RELAX= 
##$RELAX= 
##$RELAX= 
##$RELAX= 
##$RELAX= 
$$ Bruker specific parameters
$$ --------------------------
##$DU= <C:\u>
##$EXPNO= 110
##$NAME= <ADRS>
##$PROCNO= 1
##$TYPE= <nmr>
##$USER= <dgb>
##$AMP= (0..31)
100 100 100 100 100 100 100 100 100 100 100 100 100 100 100 100 100 100 
100 100 100 100 100 100 100 100 100 100 100 100 100 100 
##$AQSEQ= 0
##$AQ_mod= 3
##$AUNM= <au_zg>
##$AUTOPOS= <53 >
##$BF1= 250.13
##$BF2= 250.13
##$BF3= 250.13
##$BF4= 250.13
##$BF5= 500.13
##$BF6= 500.13
##$BF7= 500.13
##$BF8= 500.13
##$BYTORDA= 1
##$CFDGTYP= 0
##$CFRGTYP= 5
##$CHEMSTR= <none>
##$CNST= (0..31)
1 1 145 1 1 1 1 1 1 1 1 1 1 1 1 1 1 1 1 1 1 1 1 1 1 1 1 1 1 1 1 1 
##$CPDPRG= <>
##$CPDPRG1= <>
##$CPDPRG2= <>
##$CPDPRG3= <>
##$CPDPRG4= <mlev>
##$CPDPRG5= <mlev>
##$CPDPRG6= <mlev>
##$CPDPRG7= <mlev>
##$CPDPRG8= <mlev>
##$CPDPRGB= <>
##$CPDPRGT= <>
##$D= (0..31)
0 1 0 0 0 0 0 0 0 0.06 0 0 0 0 0 0 0.0002 0 0 0 0 0 0 0 0 0 0 0 0 0 0 
0 
##$DATE= 1170330682
##$DBL= (0..7)
120 120 120 120 120 120 120 120 
##$DBP= (0..7)
150 150 150 150 150 150 150 150 
##$DBP07= 0
##$DBPNAM0= <>
##$DBPNAM1= <>
##$DBPNAM2= <>
##$DBPNAM3= <>
$$ [...]
##$SUBNAM7= <"">
##$SUBNAM8= <"">
##$SUBNAM9= <"">
##$SW= 20.6930455092707
##$SWIBOX= (0..15)
0 0 3 0 0 0 0 0 0 0 0 0 0 0 0 0 
##$SW_h= 5175.983436853
##$TD= 65536
##$TD0= 1
##$TE= 294.16
##$TE2= 300
##$TE3= 300
##$TEG= 300
##$TL= (0..7)
0 120 120 120 120 120 120 120 
##$TP= (0..7)
150 150 150 150 150 150 150 150 
##$TP07= 0
##$TPNAME0= <>
##$TPNAME1= <>
##$TPNAME2= <>
##$TPNAME3= <>
##$TPNAME4= <>
##$TPNAME5= <>
##$TPNAME6= <>
##$TPNAME7= <>
##$TPOAL= (0..7)
0.5 0.5 0.5 0.5 0.5 0.5 0.5 0.5 
##$TPOFFS= (0..7)
0 0 0 0 0 0 0 0 
##$TUNHIN= 0
##$TUNHOUT= 0
##$TUNXOUT= 0
##$USERA1= <user>
##$USERA2= <user>
##$USERA3= <user>
##$USERA4= <user>
##$USERA5= <user>
##$V9= 5
##$VALIST= <valist>
##$VCLIST= <CCCCCCCCCCCCCCC>
##$VD= 0
##$VDLIST= <DDDDDDDDDDDDDDD>
##$VPLIST= <PPPPPPPPPPPPPPP>
##$VTLIST= <TTTTTTTTTTTTTTT>
##$WBST= 1024
##$WBSW= 4
##$XGAIN= (0..3)
0 0 0 0 
##$XL= 0
##$YL= 0
##$YMAX_a= 249623
##$YMIN_a= -254497
##$ZGOPTNS= <>
##$ZL1= 120
##$ZL2= 120
##$ZL3= 120
##$ZL4= 120
##$ABSF1= 16.522
##$ABSF2= -4.171173
##$ABSG= 5
##$ABSL= 3
##$ALPHA= 0
##$AQORDER= 0
##$ASSFAC= 0
##$ASSFACI= 0
##$ASSFACX= 0
##$ASSWID= 0
##$AUNMP= <proc_1d>
##$AZFE= 0.1
##$AZFW= 0.1
##$BCFW= 0
##$BC_mod= 0
##$BYTORDP= 0
##$COROFFS= 0
##$CY= 12.5
##$DATMOD= 1
##$DC= 0
##$DFILT= <>
##$DTYPP= 0
##$F1P= 14.0000005364418
##$F2P= -0.99999901652339
##$FCOR= 0.5
##$FTSIZE= 32768
##$FT_mod= 6
##$GAMMA= 0
##$GB= 0
##$INTBC= 1
##$INTSCL= 1
##$ISEN= 128
##$LB= 0.3
##$LEV0= 0
##$LPBIN= 0
##$MAXI= 10000
##$MC2= 0
##$MEAN= 0
##$ME_mod= 0
##$MI= 0
##$NCOEF= 0
##$NC_proc= -5
##$NLEV= 6
##$NOISF1= 0
##$NOISF2= 0
##$NSP= 0
##$NTH_PI= 0
##$NZP= 0
##$OFFSET= 16.522
##$PC= 1
##$PHC0= 219.4142
##$PHC1= 9.414881
##$PH_mod= 1
##$PKNL= yes
##$PPARMOD= 0
##$PSCAL= 4
##$PSIGN= 0
##$REVERSE= no
##$SF= 250.13
##$SI= 32768
##$SIGF1= 0
##$SIGF2= 0
##$SINO= 400
##$SIOLD= 32768
##$SREGLST= <1H.DMSO>
##$SSB= 0
##$STSI= 32768
##$STSR= 0
##$SW_p= 5175.98343685301
##$SYMM= 0
##$S_DEV= 0
##$TDeff= 65536
##$TDoff= 0
##$TI= <Analysis number 999999
Compound Code 99
Book Reference 9
Project Code 9>
##$TILT= no
##$TM1= 0
##$TM2= 0
##$TOPLEV= 0
##$USERP1= <user>
##$USERP2= <user>
##$USERP3= <user>
##$USERP4= <user>
##$USERP5= <user>
##$WDW= 1
##$XDIM= 32768
##$YMAX_p= 420390344
##$YMIN_p= -597435
$$ End of Bruker specific parameters
$$ ---------------------------------
##NTUPLES= NMR SPECTRUM
##VAR_NAME=  FREQUENCY,     SPECTRUM/REAL,   SPECTRUM/IMAG
##SYMBOL=    X,             R,               I
##VAR_TYPE=  INDEPENDENT,   DEPENDENT,       DEPENDENT
##VAR_FORM=  AFFN,          ASDF,            ASDF
##VAR_DIM=   32768,         32768,           32768
##UNITS=     HZ,            ARBITRARY UNITS, ARBITRARY UNITS
##FACTOR=    0.157963299565203, 1,           1
##FIRST=     4132.6476996994, 0,             0
##LAST=      -1043.33573715361, 0,           0
##MIN=       -1043.33573715361, -597435,     0
##MAX=       4132.6476996994, 420390344,     0
$$ Real data points
##PAGE= N=1
##DATA TABLE= (X++(R..R)), XYDATA
$$ [...]
$$ plain form
15829 -173288 246 168410 166110 205442 25079 -25767 -62084 -136778 -276513 -447342 -500091
15818 -500091 -254235 -265755 -312341 -168278 -180161 -158498 -44904 76403 -4195 -43509 -822
15807 -822 39336 12792 -229570 -312493 -199140 -197564 -78643 4755 -3429 -153137 -174914 -218933
15795 -218933 -274309 -234294 -285302 -291661 -400183 -405207 -355170 -341255 -26442 6463 -74469
15784 -74469 -212498 -342074 -268239 -274528 -265135 -56305 5463 3036 125682 131178 202526 74314
15772 74314 -3192 113941 89751 143348 119261 131036 -10357 -86309 -110790 -83563 -49647
15761 -49647 60752 79914 -7167 -106624 -96846 -190363 -200482 -84254 -149516 -216163 -277327
15750 -277327 -250112 -187813 -110487 106136 82380 -98152 -135298 -103878 -141059 -234325 -403877
$$ packed form
15829a73288J73534J68164k300L9332j80363n0846l6317p4694j39735j70829n2749
15818e00091K45856j1520m6586J44063j1883K1663J13594J21307q0598l9314M2687
15807h22M0158k6544k42362q2923J13353J576J18921Q3398q184j49708k1777m4019
15795b18933n5376M0015n1008o359j08522n024N0037J3915L14813L2905q0932
15784g4469j38029j29576P3835o289R393K08830O1768k427J22646N496P1348j28212
15772G4314p7506J17133k4190N3597k4087J1775j41393p5952k4481K7227L3916
15761d9647J10399J9162q7081r9457R778r3517j0119J16228o5262o6647o1164
15750b77327K7215O2299P7326K16623k3756j80532l7146L1420l7181r3266j69552
$$ plain form
15739 -403877 -422027 -351910 -298211 -297813 -409202 -432595 -149058 33495 86152 211887 14237
15728 14237 53517 3529 14876 87076 169774 108542 142231 119890 -115849 -252391 -293022
15717 -293022 -342971 -142673 -12905 -22285 -40915 -142282 -54331 129628 137008 244348 166693
15706 166693 21620 68488 98321 55934 7515 -51879 -116810 -54876 -46280 -50810 -24562 -66472
15694 -66472 -65433 -128392 -272126 -133175 -62143 -82286 -189214 -327208 -359730 -323703 -298711
15683 -298711 -250217 -55678 148934 214657 329356 323609 253729 247612 72559 -146168 -246361
15672 -246361 -378446 -291405 -251532 -256416 -106133 -174518 -197253 -77900 -84235 -62547 9532
15661 9532 49893 107055 -21148 -12569 18011 -104617 -109424 -7802 59875 60965 -33298 524
$$ packed form
15739d03877j8150P0117N3699L98j11389k3393K83537J82553N2657J25735j97650
15728A4237L9280m9988J1347P2200Q2698o1232L3689k2341k35739j36542m0631
15717b93022m9949K00298J29768r380j8630j01367Q7951J83959P380J07340p7655
15706A66693j45073M6868K9833m2387m8419n9394o4931O1934Q596m530K6248m1910
15694f6472J039o2959j43734J38951P1032k0143j06928j37994l2522L6027K4992
15683b98711M8494J94539K04612O5723J14699n747o9880o117j75053k18727j00193
15672b46361j32085Q7041L9873m884J50283o8385k2735J19353o335K1688P2079
15661I532M0361N7162j28203Q579L0580j22628m807J01622O7677J090r4263L3822
$$ plain form
15649 524 -53334 -177483 -302569 -199118 -121613 -218059 -307861 -192693 -88731 49253 171843
15638 171843 198727 209703 134723 174202 203557 25995 -173331 -147117 -69696 32476 108231
15627 108231 185026 103520 -53677 25260 52780 8317 -27170 87587 185442 118306 -50360
15616 -50360 -239333 -284691 -257998 -130501 -99121 -16983 -30342 -184676 -102009 -160418 -207222
15605 -207222 -212635 -270655 -311796 -386664 -380444 -64773 220297 78479 -106461 -120662 -28804
15594 -28804 104361 40830 -40730 24228 44301 78419 91214 -17785 -83075 -90734 3906
15583 3906 -9528 -27889 38092 29557 -73548 -8545 -71867 -196813 -222010 -182182 24594
15572 24594 179245 139941 232000 269211 306436 301627 252036 168522 43658 -120866 -115096
$$ packed form
15649E24n3858j24149j25086J03451P7505r6446q9802J15168J03962J37984J22590
15638A71843K6884J0976p4980L9479K9355j77562j99326K6214P7421J02172P5755
15627A08231P6795q1506j57197P8937K7520m4463l5487J14757R7855o7136j68666
15616e0360j88973m5358K6693J27497L1380Q2138j3359j54334Q2667n8409m6804
15605b07222n413n8020m1141p4868O220L15671K85070j41818j84940j4201R1858
15594b8804J33165o3531q1560O4958K0073L4118J2795j08999o5290p659R4640
15583C906j3434j8361O5981q535j03105O5003o3322j24946k5197L9828K06776
15572B4594J54651l9304R2059L7211L7225m809m9591q3514j24864j64524N770
$$ plain form
15561 -115096 -107064 -112247 22209 47680 -82390 -216308 -257399 -182076 -246513 -269567 -206066
15550 -206066 -401629 -459156 -311255 -138911 -86476 -43274 -130601 -204904 -223179 -178889 -26325
15539 -26325 -32791 2203 -14654 20988 34666 38548 -32816 -163912 -179912 -138944 -19253 117444
15527 117444 120717 96067 118178 121936 120069 42224 1436 -68232 -173088 -229104 -54248 10108
15515 10108 119437 264161 198885 71074 219836 263110 187324 103009 224774 3319
15505 3319 -93468 -147164 -116110 -197886 -210459 -113144 -80371 -5150 53287 111168 114707 125194
15493 125194 89957 64834 10327 40191 103789 121962 216118 180227 46704 -15918 -130489
15482 -130489 -160034 -146644 12686 -138996 -210820 -81883 -88380 -111465 -242169 -244877 -164012
$$ packed form
15561a15096Q032n183J34456K5471j30070j33918m1091P5323o4437k3054O3501
15550b06066j95563n7527J47901J72344N2435M3202q7327p4303j8275M4290J52564
15539b6325o466L4994j6857L5642J3678L882p1364j31096j6000M0968J19691J36697
15527A17444L273k4650K2111L758j867p7845m0788o9668j04856n6016J74856O4356
15515A0108J09329J44724o5276j27811J48762M3274p5786q4315J21765k21455
15505C319r6787n3696L1054q1776j2573R7315L2773P5221N8437N7881L539J0487
15493A25194l5237k5123n4507K9864O3598J8173R4156l5891j33523o2622j14571
15482a30489k9545J3390J59330j51682p1824J28937o497k3085j30704k708Q0865
$$ plain form
15471 -164012 -126807 -134674 -68394 13037 80025 22460 54373 3693 -51798 -82972 -189194
15460 -189194 -236282 -293157 -368838 -343004 -153460 -61409 82642 103429 -117292 -135836 38315
15449 38315 9065 -95534 -215389 -175746 -112758 -27438 -7097 45324 -65651 -134520 -119599
15438 -119599 95662 200604 18526 -65242 -223744 -229408 -70791 92336 -15658 -13009
15428 -13009 134233 273368 271473 114828 -38791 -9989 -51003 -65276 -38809 -370 20107
15417 20107 -4893 -21852 -16909 -109563 -91199 -30065 4066 169550 16080 -91134 -201365
15406 -201365 -79019 58413 -36145 -42275 3380 -216029 -229947 -10667 97969 175296 111351
15395 111351 -66492 42334 108425 100667 224316 395522 324487 151462 57015 -22279 -152926
$$ packed form
15471a64012L7205p867O6280Q1431O6988n7565L1913n0680n5491l1174j06222
15460a89194m7088n6875p5681K5834J89544R2051J44051K0787k20721j8544J74151
15449C8315k9250j04599j19855L9643O2988Q5320K0341N2421j10975o8869J4921
15438a19599K15261J04942j82078q3768j58502n664J58617J63127j07994K649
15428a3009J47242J39135j895j56645j53619K8802m1014j4273K6467L8439K0477
15417B0107k5000j6959M943r2654J8364O1134L4131J65484j53470j07214j10231
15406b01365J22346J37432r4558o130M5655k19409j3918K19280J08636P7327o3945
15395A11351j77843J08826O6091p758J23649J71206p1035j73025r4447p9294j30647
$$ plain form
15384 -152926 -158897 -99930 -168501 -258629 -273828 -268667 -199249 -189590 -90760 104448 71407 -89679
15372 -89679 -235395 -189794 -3878 -25827 -86596 -87913 -19800 25608 64052 49841 50154 -14226
15360 -14226 52352 49547 -27163 -2020 -19762 21947 107861 91548 7883 -16213 42844 140484
15348 140484 -21979 -15474 790 3896 2151 -1252 -27125 -20364 -44073 -80413 40100 96997
15336 96997 113704 53295 -38180 -119413 -79256 53527 100133 -1048 5750 121479 101460
15325 101460 -895 31766 -73481 -29259 -17892 59423 -74880 -129892 -77336 -23357 10537
15314 10537 -20471 -67767 -237500 -184781 -99503 -32083 62719 71872 109224 14348 -130405
15303 -130405 85095 305375 258172 267764 291594 309581 199783 175334 199361 51683 -130572
$$ packed form
15384a52926n971N8967o8571r0128j5199N161O9418R659R8830J95208l3041j61086
15372h9679j45716M5601J85916k1949o0769j317O8113M5408L8444j4211L13o4380
15360a4226O6578k805p6710K5143j7742M1709Q5914j6313q3665k4096N9057R7640
15348A40484j62463O505J6264L106j745l403k5873O761k3709l6340J20513N6897
15336I6997J6707o0409r1475q1233M0157J32783M6606j01181O798J15729k0019
15325A01460j02355L2661j05247M4222J1367P7315j34303n5012N2556N3979L3894
15314A0537l1008m7296j69733N2719Q5278O7420R4802R153L7352r4876j44753
15303a30405K15500K20280m7203R592K3830J7987j09798k4449K4027j47678j82255
$$ plain form
15292 -130572 -216129 -288057 -256055 -135787 103564 89412 -141904 -305610 -282077 -138309
15282 -138309 101277 119113 277882 251508 46714 -148144 -249523 -177951 -148906 -142302 -159986
15271 -159986 -31952 1352 -40209 -89569 63684 130381 160032 84879 -67013 -63345 -139703
15260 -139703 -135995 -13115 -45570 -188371 -372488 -525009 -546412 -365126 -96030 -33012
15250 -33012 103146 252480 118734 37783 -60341 -243764 -66771 43121 104974 120798
15240 120798 -21501 -51724 -51568 -8114 6069 -95166 -279913 -344000 -310720 -346191 -228352
15229 -228352 -190239 -89581 119446 201670 185016 137045 -75376 -152903 -70850 12780 32594
15218 32594 108511 66498 -119757 -279619 -237760 -313137 -338023 -137030 412 -268007 -343502
$$ packed form
15292a30572q5557p1928L2002J20268K39351j4152k31316j63706K3533J43768
15282a38309K39586J7836J58769k6374k04794j94858j01379P1572K9045O604j7684
15271a59986J28034L3304m1561m9360J53253O6697K9651p5153j51892L668p6358
15260a39703L708J22880l2455j42801j84117j52521k1403J81286K69096O3018
15250c3012J36158J49334j33746q0951r8124j83423J76993J09892O1853J5824
15240A20798j42299l0223J56M3454J4183j01235j84747o4087L3280l5471J17839
15229b28352L8113J00658K09027Q2224j6654m7971k12421p7527Q2053Q3630J9814
15218C2594P5917m2013j86255j59862M1859p5377k4886K00993J37442k68419p5495
$$ plain form
15207 -343502 -149153 -178839 -198570 -104560 -148642 -247757 -127902 -213059 -157186 34909 273514
15196 273514 219662 139094 18867 -148325 -235192 -176538 -74809 -227763 -311276 -254579 -205669
15185 -205669 -83601 71854 163651 205403 184436 243108 225142 260211 160313 70892 146353
15174 146353 266110 291234 129588 83328 106625 25425 -25365 104020 143533 172041 -7300
15163 -7300 -132487 -211239 -216769 -105426 -4061 59783 19742 -100376 -169699 -34412 -77181
15152 -77181 -13241 114530 186268 152412 80900 145962 77235 -58990 -34609 81064 156254
15141 156254 99548 11773 -45493 24072 31736 63196 95041 167765 153341 -29837 -77564
15130 -77564 -142127 -153788 -81407 -195301 -159788 70633 -64419 -66593 13616 29942 45920
$$ packed form
15207c43502J94349k9686j9731R4010m4082r9115J19855q5157N5873J92095K38605
15196B73514n3852q0568j20227j67192q6867N8654J01729j52954q3513N6697M8910
15185b05669J22068J55455R1797M1752k0967N8672j7966L5069r9898q9421P5461
15174A46353J19757K5124j61646m6260K3297q1200n0790J29385L9513K8508j79341
15163g300j25187p8752n530J11343J01365O3844m0041j20118o9323J35287m2769
15152g7181O3940J27771P1738l3856p1512O5062o8727j36225K4381J15673P5190
15141A56254n6706q7775n7266O9565P664L1460L1845P2724j4424j83178m7727
15130g7564o4563j1661P2381j13894L5513K30421j35052k174Q0209J6326J5978
$$ plain form
15119 45920 -48076 -68442 -58241 -91350 -263798 -168574 -123539 -264707 -130256 -214824 -219771
15108 -219771 -43827 -45053 -163370 -221458 -122045 36266 95405 42234 -93154 -180548 -128080
15097 -128080 -260715 -137703 -4039 14023 9309 -66058 -130864 -144287 -154660 35487 121192
15086 121192 230534 262053 75592 -48637 1594 -164037 -249231 -78611 -61937 -121356
15076 -121356 -104562 92533 215065 163002 110055 25246 -17172 64257 39374 26254 -58275
15065 -58275 -7656 -82092 -24836 96062 219336 188498 240899 343394 130120 -148723 -202998
15054 -202998 -62349 82183 81474 -64208 -116819 -33646 -9123 -126637 -247177 -265972 -222657
15043 -222657 -86250 -31081 107113 150692 276800 437051 310305 191187 63918 221921
$$ packed form
15119D5920r3996k0366J0201l3109j72448R5224M5035j41168J34451q4568m947
15108b19771J75944j226j18317n8088R9413J58311N9139n3171j35388q7394N2468
15097a28080j32635J23012J33664J8062m714p5367o4806j3423j0373J90147Q5705
15086A21192J09342L1519j86461j24229N0231j65631q5194J70620J6674n9419
15076a21356J6794J97095J22532n2063n2947q4809m2418Q1429k4883j3120q4529
15065e8275N0619p4436N7256J20898J23274l0838N2401J02495k13274k78843n4275
15054b02998J40649J44532p09j45682n2611Q3173K4523j17514j20540j8795M3315
15043b22657J36407N5169J38194M3579J26108J60251j26746j19118j27269J58003
$$ plain form
15033 221921 266530 215325 40949 -129082 -200687 -188208 -40077 5742 -139551 -133181 8336
15022 8336 -83832 -133248 -88175 95432 55696 -20226 -25695 11097 -2237 -69617 6586 18103
15010 18103 -236063 -91676 137981 64927 -147360 -143820 -10878 -45694 -84228 -150015 -105799
14999 -105799 -90899 -141685 -96583 -48331 -216760 -337982 -379146 -440620 -289656 -190462 -55405
14988 -55405 161737 233863 155724 -53248 -218092 -331857 -297320 -144846 -13259 64730
14978 64730 -49889 -149272 -350251 -222560 72674 175954 67107 -53092 165545 282145
14968 282145 248367 -15563 -278902 -362401 -292662 -149461 65293 175510 190726 129776
14958 129776 156715 205621 80289 -123189 -298265 -102795 -20086 -134385 -62730 -37894
$$ packed form
15033B21921M4609n1205j74376j70031p1605J2479J48131M5819j45293O370J41517
15022H336r2168m9416M5073J83607l9736p5922n469L6792j3334o7380P6203J1517
15010A8103k54166J44387K29657p3054k12287L540J32942l4816l8534o5787M4216
14999a05799J4900n0786M5102M8252j68429j21222m1164o1474J50964R9194J35057
14988e5405K17142P2126p8139k08972j64844j13765L4537J52474J31587P7989
14978F4730j14619r9383k00979J27691K95234J03280j08847j20199K18637J16600
14968B82145l3778k63930k63339q3499O9739J43201K14754J10217J5216o0950
14958A29776K6939M8906j25332k03478j75076J95470Q2709j14299P1655K4836
$$ plain form
14948 -37894 -52015 -134786 -267496 -146463 80368 55730 -17431 66574 94585 90598 200784
14937 200784 206939 157089 -152795 -284654 -312640 -252894 -154738 5636 73790 16019 60386
14926 60386 162530 219852 129281 28172 156027 295735 225499 23518 22632 90820 164441
14915 164441 185368 76189 14785 -54610 46423 179319 112751 124845 33434 -77827 -172957
14904 -172957 -183202 -183410 -11982 124814 126953 -11063 -2759 11840 -47326 -131345 -78274 75058
14892 75058 92816 4192 126683 382 -97789 -46841 79293 127740 152980 130546 35893
14881 35893 -15710 189634 200984 189965 194600 184318 201842 93492 -56017 -151795 -11268
14870 -11268 67656 67438 141297 140005 132369 -108188 -255320 -181192 -106939 -5712 -34655 48490
$$ packed form
14948c7894j4121q2771j32710J21033K26831k4638p3161Q4005K8011l987J10186
14937B00784O155m9850l09884j31859k7986N9746R8156J60374O8154n7771M4367
14926F0386J02144N7322r0571j01109J27855J39708p0236k01981q86O8188P3621
14915A64441K0927j09179o1404o9395J01033J32896o6568J2094r1411j11261r5130
14904a72957j0245k08J71428J36796K139j38016Q304J4599n9166q4019N3071J53332
14892G5058J7758q8624J22491j26301r8171N0948J26134M8447K5240k2434r4653
14881C5893n1603K05344J1350j1019M635j0282J7524j08350j49509r5778J40527
14870a1268P8924k18P3859j292p636k40557j47132P4128P4253J01227k8943Q3145
$$ plain form
14858 48490 -74276 -121829 -14399 28705 221898 223984 44098 4589 16733 -14157 -102693
14847 -102693 -170282 -142153 -94308 64636 212112 196784 48536 47801 -171836 -265665 -247222
14836 -247222 -287656 -306330 -213073 -45337 4252 96169 138712 78195 68253 75898 61316 198022
14824 198022 332354 241448 233642 290203 191505 -47906 11466 -1288 -107523 -131833 47665
14813 47665 140271 150949 69865 178748 143659 32988 -61278 31033 142943 117931 -205434
14802 -205434 -189235 -79732 -23455 -44031 124792 20408 -200785 -173036 -60080 -156000
14792 -156000 -326031 -319884 -380990 -277528 -152105 -60411 -88049 -121839 -21631 -117705 -307444
14781 -307444 -279737 -55904 -48076 -187249 58165 118973 -13595 -48180 39029 51997 70751
$$ packed form
14858D8490j22766m7553J07430M3104J93193K086j79886l9509J2144l0890q8536
14847a02693o7589K8129M7845J58944J47476j5328j48248p35k19637r3829J8443
14836b47222m0434j8674R3257J67736M9589R1917M2543o0517r942P645j4582J36706
14824A98022J34332r0906p806N6561r8698k39411N9372j2754j06235k4310J79498
14813D7665R2606J0678q1084J08883l5089j10671r4266R2311J11910k5012l23365
14802b05434J6199J09503N6277k0576J68823j04384k21193K7749J12956r5920
14792a56000j70031O147o1106J03462J25423R1694k7638l3790J00208r6074j89739
14781c07444K7707K23833P828j39173K45414O0808j32568l4585Q7209J2968J8754
$$ plain form
14770 70751 -32906 10148 35641 -119233 -123277 56897 380 92888 55523 63397 69990 -79147
14758 -79147 -147168 -95732 -66186 -25967 -57308 8333 70190 70455 27934 8453 210829 281686
14746 281686 291232 246243 303945 361736 303488 281032 112573 -42412 13306 29672 38433
14735 38433 -49786 -9729 62801 181215 100130 109118 172139 97352 -6285 -94412 -88712 -48212
14723 -48212 -18743 -133663 -64940 475 -156903 -119113 40313 135581 19758 -114468 -152887
14712 -152887 -142938 -210 24280 -33042 70626 161852 190243 123751 -16233 -1945 -19597
14701 -19597 -54073 -94766 -98792 -134286 -93086 -152990 -137116 -93999 -79331 16671 174106 209793
14689 209793 90854 87280 129217 215000 96729 -48376 -71585 7161 -14284 -46752 -110149
$$ packed form
14770G0751j03657M3054K5493j54874m044J80174n6517R2508l7365P874O593j49137
14758g9147o8021N1436K9546M0219l1341O5641O1857K65m2521j9481K02376P0857
14746B81686R546m4989N7702N7791n8248k2456j68459j54985N5718J6366Q761
14735C8433q8219M0057P2530J18414q1085Q988O3021p4787j03637q8127N700M0500
14723d8212K9469j14920O8723O5415j57378L7790J59426R5268j15823j34226l8419
14712a52887R949J42728K4490n7322J03668R1226K8391o6492j39984J4288j7652
14701a9597l4476m0693m026l5494M1200n9904J5874M3117J4668R6002J57435L5687
14689B09793j18939l574M1937Q5783j18271j45105k3209P8746k1445l2468o3397
$$ plain form
14678 -110149 -71251 -9781 -60817 -172095 -218420 -64980 72399 94252 83418 -79601 -150433
14667 -150433 -213087 -207019 -140213 -172023 -198643 -135471 -110433 -148991 -27217 -34361 -63818 -33091
14655 -33091 16984 4674 -121605 -115838 -82970 -99366 -288627 -235355 -4804 30441 3266
14644 3266 -51808 198714 293472 222630 142361 -16116 -28511 -23509 -45927 -1123 70283 -16205
14632 -16205 91867 108358 -16862 -81578 -21312 -153738 -124328 -93591 -144942 -96746 138013
14621 138013 129258 15559 -747 142664 106653 -62598 -148788 -83007 32595 -8534 14227
14610 14227 -81863 -92436 -52507 76780 -58562 -194897 -64774 -58356 -11698 1801 124725
14599 124725 118117 91903 54463 269005 398269 294722 411182 399066 189233 191675 83645
$$ packed form
14678a10149L8898O1470n1036j11278m6325J53440J37379K1853j0834j63019p0832
14667a50433o2654O068O6806l1810k6620O3172K5038l8558J21774p144k9457L0727
14655c3091N0075j2310j26279N767L2868j6396j89261N3272K30551L5245k7175
14644C266n5074K50522R4758p0842q0269j58477j2395N002k2418M4804P1406q6488
14632a6205J08072J6491j25220o4716O0266j32426K9410L0737n1351M8196K34759
14621A38013q755j13699j6306J43411l6011j69251q6190O5781J15602m1129K2761
14610A4227r6090j0573L9929J29287j35342j36335J30123O418M6658J3499J22924
14599A24725o608k6214l7440K14542J29264j03547J16460j2116k09833K442j08030
$$ plain form
14588 83645 -5357 -55541 -209106 -241992 -259277 -260809 -24931 165972 225039 492964 341486
14577 341486 296896 297172 399050 401734 220086 11100 -60645 -154240 -36912 84146 32210
14566 32210 -71965 4039 -6860 40116 103859 18460 -7709 115212 59661 83899 50213
14555 50213 -1431 88365 171517 89145 -100312 -166667 -95611 27033 -54181 21193 32731
14544 32731 -2671 62826 162512 216002 272153 198890 -23388 -151158 20394 -14870 -38230
14533 -38230 752 -51801 -212030 -110639 -105638 1448 132576 -24004 -107099 34934 112055
14522 112055 98713 -136377 -215219 -202853 -244710 -112386 -78057 -125111 -78037 -87002 47120
14511 47120 85257 137008 46458 43955 37 70101 -3411 9178 96725 216041 193770 238591
$$ packed form
14588H3645q9002n0184j53565l2886j7285j532K35878J90903N9067K67925j51478
14577C41486m4590K76J01878K684j81648k08986p1745r3595J17328J21058n1936
14566C2210j04175P6004j0899M6976O3743q5399k6169J22921n5551K4238l3686
14555E0213n1644Q9796Q3152q2372j89457o6355P1056J22644q1214P5374J1538
14544C2731l5402O5497R9686N3490N6151p3263k22278j27770J71552l5264k3360
14533c8230L8982n2553j60229J01391N001J07086J31128j56580q3095J42033P7121
14522A12055j3342k35090p8842J2366m1857J32324L4329m7054M7074q965J34122
14511D7120L8137N1751r0550k503m3918P0064p3512J2589Q7547J19316k2271M4821
$$ plain form
14499 238591 119151 177646 108111 -1439 -1815 112750 109697 46292 85230 163814 186002
14488 186002 322434 356399 216314 137892 143994 33740 -128122 -66013 -56459 -102638 38177
14477 38177 -12159 -163207 -170727 -41992 48761 -19947 15772 -10243 52497 209665 246823
14466 246823 185763 313602 360300 115909 -141202 33881 171787 46266 -55130 -110032
14456 -110032 -78042 -83003 -249523 -321553 -44840 93284 62472 153186 204316 208893 210108
14445 210108 47630 -49816 -9190 205395 207114 213395 132466 93084 210801 259120 8718
14434 8718 4203 143207 -5802 -125978 -186925 -173977 -363328 -280997 -299958 -301213 -154110
14423 -154110 18919 42604 -114883 -106991 -149531 -42306 -113732 14909 139207 -59560
$$ packed form
14499B38591j19440N8495o9535j09550l76J14565l053o3405L8938P8584K2188
14488A86002J36432L3965j40085p8422O102j10254j61862O2109R554m6179J40815
14477C8177n0336j51048p520J28735R0753o8708L5719k6015O2740J57168L7158
14466B46823o1060J27839M6698k44391k57111J75083J37906j25521j01396n4902
14456a10032L1990m961j66520p2030K76713J38124l0812R0714N1130M577J215
14445B10108j62478r7446M0626K14585J719O281q0929l9382J17717M8319k50402
14434H718m515J39004j49009j20176o0947J2948j89351Q2331j8961j255J47103
14423a54110J73029K3685j57487P892m2540J07225p1426J28641J24298j98767
$$ plain form
14413 -59560 -127780 -152566 -239597 -106496 -10239 -24634 -30353 176055 339996 374790 259383
14402 259383 333836 324749 197382 117769 103196 144257 115093 -96495 -74957 138470 19542
14391 19542 -103503 -195007 -52848 -51436 -34302 -14378 17434 -64328 -231406 -203050 -63946
14380 -63946 81139 19710 102890 142245 -54656 -149080 35778 217650 364520 275690 169955
14369 169955 294740 285945 168215 -28095 -209131 -235889 -203377 -48286 66915 35521
14359 35521 18241 -7568 -75165 -45163 -73495 -161352 -311252 -200158 -11746 213039 75361
14348 75361 -10505 -118823 -37770 75491 -17057 -44851 123428 255311 177630 -20178 -68135
14337 -68135 -203963 -291064 -322051 -182928 -109035 13829 28576 -38789 60700 177790 250129
$$ packed form
14413e9560o8220k4786q7031J33101R6257j4395n719K06408J63941L4794j15407
14402B59383P4453r087j27367p9613j4573M1061k9164k11588K1538K13427j18928
14391A9542j23045r1504J42159J412J7134J9924L1812q1762j67078K8356J39104
14380f3946J45085o1429Q3180L9355j96901r4424J84858J81872J46870q8830j05735
14369A69955J24785q795j17730j96310j81036k6758L2512J55091J15201l1394
14359C5521j7280k5809o7597L0002k8332q7857j49900J11094J88412K24785j37678
14348G5361q5866j08318Q1053J13261r2548k7794J68279J31883p7681j97808m7957
14337f8135j35828q7101l0987J39123P3893J22864J4747o7365R9489J17090P2339
$$ plain form
14326 250129 296077 369444 246033 247499 61658 -30718 -212071 -240659 -167754 59061 171096
14315 171096 249594 247998 -360 -80989 108391 332132 440104 183181 22263 145808
14305 145808 233230 356739 370675 219058 -11892 -85676 -95165 -135857 6381 200886 156139
14294 156139 28305 -43749 -114523 -34827 -125998 -273187 -375072 -291985 -328919 -267525 41031
14283 41031 153312 123690 -67337 -101001 -113868 -22585 -141866 -48215 -58276 -248313 -290917
14272 -290917 -250847 -115789 -178549 -154085 -49241 -116747 -101893 -131131 -224472 -249909 -46748
14261 -46748 35214 -5852 -24717 -111766 81069 324899 291748 263672 400074 370177 135376
14250 135376 140460 56474 97364 1985 -135861 -183344 -139400 -215912 -204153 -149879 -128653
$$ packed form
14326B50129M5948P3367j23411J466j85841r2376j81353k8588P2905K26815J12035
14315A71096P8498j596k48358q0629J89380K23741J07972k56923j60918J23545
14305A45808Q7422J23509J3936j51617k30950p3784r489m0692J42238J94505m4747
14294A56139j27834p2054p0774P9696r1171j47189j01885Q3087l6934O1394L08556
14283D1031J12281k9622j91027l3664j2867R1283j19281R3651j0061j90037m2604
14272b90917M0070J35058o2760K4464J04844o7506J4854k9238r3341k5437K03161
14261d6748Q1962m1066j8865q7049J92835K43830l3151k8076J36402k9897k34801
14250A35376N084q3986M0890r5379j37846m7483M3944p6512J1759N4274K1226
$$ plain form
14239 -128653 -233758 -183156 -88306 -132020 -205275 -70942 70639 222103 158946 -5500
14229 -5500 -99916 -108416 -34665 13713 -9442 174689 120085 58287 136659 90279 121619 -1856
14217 -1856 -7794 95632 109060 72532 172730 294756 360734 247254 115168 84393 72261
14206 72261 -35032 -115015 -12207 -54402 -111520 -201553 -9592 235668 266248 40213 14443
14195 14443 25348 36317 -711 -66213 63512 115437 90546 -12118 89931 -24466 -84333
14184 -84333 -207357 -193512 -149738 -168010 -202360 -226332 -170234 -97053 -86515 -47222 1548
14173 1548 107277 84359 37746 -49255 -111761 -249665 -387410 -311878 -89038 -109284 -179066
14162 -179066 -232099 -96250 26309 170358 225425 119624 107632 -56123 -391526 -534089
$$ packed form
14239a28653j05105N0602R4850m3714p3255J34333J41581J51464o3157j64446
14229e500r4416q500P3751M8378k3155J84131n4604o1798P8372m6380L1340j23475
14217a856n938J03426J3428l6528J00198J22026O5978j13480j32086l0775j2132
14206G2261j07293p9983J02808m2195n7118r0033J91961K45260L0580k26035k5770
14195A4443J0905J0969l7028o5502J29725N1925k4891j02664J02049j14397n9867
14184h4333j23024J3845M3774j8272l4350k3972N6098P3181J0538L9293M8770
14173A548J05729k2918m6613q7001o2506j37904j37745P5532K22840k0246o9782
14162a79066n3033J35849J22559J44049N5067j05801j1992j63755l35403j42563
$$ plain form
14152 -534089 -495832 -91274 148638 203216 115743 14311 371 2581 75231 157663 85520
14141 85520 -34970 61591 -35977 -242334 -149403 -119711 -109893 -95511 35146 -56380 -196375
14130 -196375 -304688 -234088 -61443 -91146 -174562 -325291 -395842 -328095 -202322 -68361
14120 -68361 -41244 -210892 -112077 -138433 -121297 -2363 91119 170976 212646 124689 46030
14109 46030 51316 51758 81404 76389 189021 126480 55372 70754 336 -71830 8588 151687
14097 151687 76473 -46861 -147572 -204360 -225939 -148397 -109621 -127700 -178578 -145027 -62036
14086 -62036 123570 157826 128665 92374 184510 187395 36705 -125198 -207760 -236935 -313534
14075 -313534 -333666 -211916 -13980 -6944 -57267 -13545 76069 230004 80980 -72589 -54881
$$ packed form
14152e34089L8257M04558K39912N4578q7473j01432j3940K210P2650Q2432p2143
14141H5520j20490R6561r7568k06357R2931K9692R818J4382J30657r1526j39995
14130a96375j08313P0600J72645k9703q3416j50729p0551O7747J25773J33961
14120f8361K7117j69648R8815k6356J7136J18934R3482P9857M1670q7957p8659
14109D6030N286M42K9646n015J12632o2541p1108J5382p0418p2166Q0418J43099
14097A51687p5214j23334j00711n6788k1579P7542L8776j8079n0878L3551Q2991
14086f2036J85606L4256k9161l6291R2136K885j50690j61903q2562k9175p6599
14075c13534k0132J21750J97936P036n0323M3722Q9614J53935j49024j53569J7708
$$ plain form
14064 -54881 -107197 -88045 -24792 -76462 4743 -30395 -58424 -48842 33210 64872 158254 228123
14052 228123 202824 107107 94366 103852 -130 -22961 46642 13888 -136509 -352903 -517224
14041 -517224 -425125 -371584 -362268 -277773 32476 65353 115996 152048 72723 133164 113107
14030 113107 72341 208300 391449 207493 217932 107686 84198 -13430 -38334 -100690 -193638
14019 -193638 -204714 -144999 -3081 66418 131101 96472 87778 16094 -53473 45519 -9452
14008 -9452 -24480 147045 112090 -85889 -93305 17181 50216 -32401 -167407 -264907 -103364
13997 -103364 -10025 12845 -94434 -123860 -96729 -49450 273483 237312 74382 27657 120643
13986 120643 173975 122271 -21790 -86203 37572 117739 65980 59687 -3797 -22646 99986
$$ packed form
14064e4881n2316J9152O3253n1670Q1205l5138k8029R582Q2052L1662R3382O9869
14052B28123k5299r5717j2741R486j03982k2831O9603l2754j50397k16394j64321
14041e17224R2099N3541R316Q4495L10249L2877N0643L6052p9325O0441k0057
14030A13107m0766J35959J83149j83956J0439j10246k3488r7628k4904o2356r2948
14019a93638j1076N9715J41918O9499O4683l4629q694p1684o9567R8992n4971
14008i452j5028J71525l4955j97979p416J10486L3035q2617j35006r7500J61543
13997a03364R3339K2870j07279k9426K7131M7279L22933l6171j62930m6725R2986
13986A20643N3332n1704j44061o4413J23775Q0167n1759o293o3484j8849J22632
$$ plain form
13975 99986 266232 275745 120208 53393 -97463 -125968 -20022 156436 167461 48673 -145010
13964 -145010 -264676 -252360 -149891 -77669 -44648 98085 197619 -112939 -168382 -91676 51220
13953 51220 232789 127549 -24784 -161027 -207943 -126622 -189376 -273793 -332908 -400919 -373188
13942 -373188 -151426 12303 41436 -50190 -100595 -71698 79606 177178 61043 74766 87093
13931 87093 114663 79355 135860 97314 4270 -23216 18531 103136 29330 189666 261026
13920 261026 120155 87456 82057 129946 47616 68431 159752 166209 94190 282403 323980
13909 323980 357684 223490 46465 80973 74803 -8059 -54656 -208235 -247734 -321194 -262712
13898 -262712 -123926 51444 223474 152566 -75515 -39739 59070 30237 65459 7223 -16493
$$ packed form
13975I9986J66246R513j55537o6815j50856k8505J05946J76458J1025j18788j93683
13964a45010j19666J2316J02469P2222L3021J42733R9534l10558n5443P6706J42896
13953E1220J81569j05240j52333j36243m6916Q1321o2754q4417n9115o8011K7731
13942c73188K21762J63729K9133r1626n0405K8897J51304R7572j16135J3723J2327
13931H7093K7570l5308N6505l8546r3044k7486M1747Q4605p3806J60336P1360
13920B61026j40871l2699n399M7889q2330K0815R1321O457p2019J88213M1577
13909C23980L3704j34194j77025L4508o170q2862m6597j53579l9499p3460N8482
13898b62712J38786J75370J72030p0908k28081L5776R8809k8833L5222n8236k3716
$$ plain form
13887 -16493 103132 46642 15285 29460 87138 43534 107186 -34329 -178506 -135765 -26225
13876 -26225 116793 174743 143727 53314 -24497 -108202 -102943 -134347 -283617 -371012 -284373
13865 -284373 -104248 49280 64330 175961 220949 163694 94658 37944 71448 35330 -8747
13854 -8747 -8003 -47583 -22480 -4463 7539 82957 -39782 -159406 -183699 -198211 -439392 -312558
13842 -312558 -138887 -10300 188053 194133 115593 55087 -77149 -102610 -190074 -148243 103698
13831 103698 415945 423428 464871 341168 176906 97872 97578 158714 155522 -38333 -49398
13820 -49398 -44779 -163613 -269315 -169698 -201088 -131488 -23369 -152511 -307427 -354020 -246542
13809 -246542 -174484 41968 184325 227322 145079 -20078 -40733 -39381 -69159 -224553 -283963
$$ packed form
13887a6493J19625n6490l1357J4175N7678m3604O3652j41515j44177M2741J09540
13876b6225J43018N7950l1016r0413p7811q3705N259l1404j49270q7395Q6639
13865b84373J80125J53528J5050J11631M4988n7255o9036n6714L3504l6118m4077
13854h747P44l9580K5103J8017J2002P5418j22739j19624k4293j4512k41181J26834
13842c12558J73671J28587J98353O080p8540o0506j32236k5461q7464M1831K51941
13831A03698L12247P483M1443j23703j64262p9034k94O1136l192j93855j1065
13820d9398M619j18834j05702R9617l1390O9600J08119j29142j54916m6593J07478
13809b46542P2058K16452J42357M2997q2243j65157k0655J352k9778j55394n9410
$$ plain form
13798 -283963 -167053 -49087 -31453 -7823 20928 -32880 -129872 -111048 -58985 14079 1234
13787 1234 38192 146464 142355 45732 -130361 70273 39723 -236629 -281423 -119233 -140876
13776 -140876 -385220 -324885 -249583 -317957 -356860 -266459 -360051 -364408 -371019 -342022 -301625 -228206
13764 -228206 5198 73713 161651 158879 22515 148876 154047 67572 -2701 -82637 -149926
13753 -149926 -221935 -108500 -226695 -229758 -206214 -138276 -290062 -404662 -356751 -323470 -216874
13742 -216874 -114122 -75472 -55000 1717 2096 51198 -45462 35996 37199 32706 -79152 -203248
13730 -203248 -175198 -97516 -3859 34777 -14834 -102217 -96112 -121305 48341 86866 -166981
13719 -166981 -219572 -179700 -184310 -202495 -214716 -68569 28333 -130706 -304505 -315760 -110608
$$ packed form
13798b83963J16910J17966J7634K3630K8751n3808r6992J8824N2063P3064j2845
13787A234L6958J08272m109r6623j76093K00634l0550k76352m4794J62190k1643
13776a40876k44344O0335P5302o8374l8903R0401r3592m357o611K8997M0397P3419
13764b28206K33404O8515Q7938k772j36364J26361N171q6475p0273p9936o7289
13753a49926p2009J13435j18195l063K3544O7938j51786j14600M7911L3281J06596
13742b16874J02752L8650K0472N6717L79M9102r6660Q1458J203m493j11858j24096
13730b03248K8050P7682R3657L8636m9611q7383O105k5193J69646L8525k53847
13719a66981n2591L9872m610j8185j2221J46147R6902j59039j73799j1255K05152
$$ plain form
13708 -110608 -28781 -5882 -54800 -318562 -277227 -260939 -216769 -52356 -89691 -13018 -120137
13697 -120137 -122212 -181439 -135348 -47291 218687 364742 188013 53840 29957 148561 216272
13686 216272 195045 93996 -27020 -182488 -183327 -107917 -110551 -39990 47233 60512 -60537
13675 -60537 -115933 -81631 -6575 41526 -2547 -23243 125682 250107 171117 -8725 48452
13664 48452 110622 23723 -112132 -130064 -20987 25702 169303 26500 -11693 62375 121075
13653 121075 165505 120342 284017 168707 -4046 -50322 35305 148970 45575 22409
13643 22409 -26327 -40443 13796 70160 153443 146528 177683 133605 137897 151061 226815 278395
13631 278395 357816 497868 321323 144352 24858 -124607 -143371 -106020 8151 23990
$$ packed form
13708a10608Q1827K2899m8918k63762M1335J6288M4170J64413l7335P6673j07119
13697a20137k075n9227M6091Q8057K65978J46055j76729j34173k3883J18604O7711
13686B16272k1227j01049j21016j55468q39P5410k634P0561Q7223J3279j21049
13675f0537n5396L4302P5056M8101m4073k0696J48925J24425p8990j79842N7177
13664D8452O2170q6899j35855j7932J09077M6689J43601j42803l8193P4068N8700
13653A21075M4430m5163J63675j15310j72753m6276Q5627J13665j03395k3166
13643B2409m8736j4116N4239N6364Q3283o915L1155m4078M292J3164P5754N1580
13631B78395P9421J40052j76545j76971j19494j49465j8764L7351J14171J5839
$$ plain form
13621 23990 138791 90329 -43489 -76999 -282605 -289240 -128541 -117218 -36059 213190 131807
13610 131807 -30286 -167589 -269669 -219089 -306705 -237536 -135652 -93532 55904 309598
13600 309598 243297 101436 77455 -4558 -28403 -93354 -53819 65821 99920 174789 208132
13589 208132 79445 -54240 -73742 71700 91306 180796 323282 240631 247656 276693 142079
13578 142079 96425 233143 203495 204779 187315 140771 106068 -13156 -59921 -70434 -6394
13567 -6394 155515 181005 289148 350596 174907 158788 305815 454221 472840 260429 181840
13556 181840 197522 239717 112767 139554 -37726 -67145 -61274 42323 108034 131639 104965
13545 104965 43979 193102 245078 212685 42908 -39626 -73675 -108347 -4833 -15295 -144593
$$ packed form
13621B3990J14801m8462j33818l3510k05606o635J60699J1323Q1159K49249q1383
13610A31807j62093j37303j02080N0580q7616O9169J01884M2120J49436K53694
13600C09598o6301j41861k3981q2013k3845o4951L9535J19640L4099P4869L3343
13589B08132j28687j33685j9502J45442J9606Q9490J42486q2651P025K9037j34614
13578A42079m5654J36718k9648J284j7464m6544l4703j19224m6765j0513O4040
13567f394J61909K5490J08143O1448j75689j6119J47027J48406J8619k12411p8589
13556A81840J5682M2195j26950K6787j77280k9419N871J03597O5711K3605k6674
13545A04965o0986J49123N1976l2393j69777q2534l4049l4672J03514j0462j29298
$$ plain form
13534 -144593 -191466 12619 83022 66668 160540 169269 37321 151129 118322 65518 -28299
13523 -28299 -177655 -154231 -28702 -8382 27302 125193 255875 138005 -16537 -59302 -40530
13512 -40530 -164116 -66479 14482 144026 -67389 -118989 -121581 -32386 81576 42382 -3000
13501 -3000 58242 52920 47868 -68668 -89971 -133681 -185997 -17638 59052 10441 171694 174143
13489 174143 4284 -94185 -236976 -263610 -156311 11196 -8607 -93283 54046 96740
13479 96740 32045 19154 -79967 -103344 -160545 -245350 -182551 -147631 -117943 36874 -10559
13468 -10559 474 -51058 -195997 -222898 13993 172769 256775 92915 -62569 -28659 252654
13457 252654 333553 262236 249880 258154 165939 77121 24229 177755 105140 19476 -18684
$$ packed form
13534a44593m6873K04085P0403j6354R3872Q729j31948J13808l2807n2804r3817
13523b8299j49356K3424J25529K0320L5684R7891J30682j17870j54542m2765J8772
13512d0530j23586R7637Q0961J29544k11415n1600k592Q9195J13962l9194m5382
13501c000O1242n322n052j16536k1303m3710n2316J68359P6690m8611J61253K449
13489A74143j69859r8469j42791k6634J07299J67507j9803q4676J47329M2694
13479I6740o4695j2891r9121k3377n7201q4805O2799L4920K9688J54817m7433
13468a0559J1033n1532j44939k6901K36891J58776Q4006j63860j55484L3910K81313
13457B52654Q0899p1317j2356Q274r2215q8818n2892J53526p2615q5664l8160
$$ plain form
13446 -18684 -28530 -35634 -33339 28004 -7727 -97816 -224022 -222450 -73116 2998 -34009 -72141
13434 -72141 -308779 -379717 -214607 20265 113028 105582 92787 -80593 -202211 -52763 -7425
13423 -7425 38855 16842 -1410 -79636 -374350 -472153 -337472 -167285 -32044 79001 132309
13412 132309 60054 84254 130276 -168884 -383716 -243134 17319 123926 119165 219052 246541
13401 246541 215140 189635 193321 190029 141813 374274 491216 405020 248602 232980 296093
13390 296093 210703 65597 25171 170932 155230 234566 245300 82565 34460 -89041 -138492
13379 -138492 -35879 66029 3558 -35038 -22197 -74238 -99805 -58487 -47122 -148994 -141742
13368 -141742 -69806 -41717 -58817 -51031 -6919 -14503 -15586 -196808 -358491 -225141 10733
$$ packed form
13446a8684r846p104K295O1343l5731r0089j26206J572J49334P6114l7007l8132
13434g2141k36638p0938J65110K34872R2763p446j2795j73380j21618J49448M5338
13423g425M6280k2013j8252p8226k94714r7803J34681J70187J35241J11045N3308
13412A32309p2255K4200M6022k99160k14832J40582K60453J06607m761R9887K7489
13401B46541l1401k5505L686l292m8216K32461J16942q6196j56418j5622O3113
13390B96093q5390j45106m0426J45761j5702P9336J0734j62735m8105j23501m9451
13379a38492J02613J01908o2471l8596J2841n2041k5567M1318J1365j01872P252
13368a41742P1936K8089j7100P786M4112p584j083j81222j61683J33350K35874
$$ plain form
13357 10733 44795 -23525 27321 -44119 -217942 -247424 -174781 -9009 15599 116018 268729
13346 268729 200198 -57142 -61618 -15970 -97972 -135998 -39699 69281 272849 378731 333549
13335 333549 272881 244614 161591 215806 228777 80969 15629 32854 166108 206645 88392
13324 88392 -12393 -42883 -130367 -220037 -266145 -197464 -91111 -135220 -147173 -25484 5372
13313 5372 -81575 -73031 -66504 -200812 -318383 -76799 15421 23859 156269 179384 259262 229753
13301 229753 64841 59206 -11839 -25783 -45286 -1771 -36256 -73121 -29105 -181921 -185836
13290 -185836 -196097 -265635 -294626 -213568 -38749 -153036 -152756 -124873 -318776 -355177 -232375
13279 -232375 -114204 85619 -61959 -114453 -74879 -85161 -110162 -7969 160428 32356
$$ packed form
13357A0733L4062o8320N0846p1440j73823k9482P2643J65772K4608J00419J52711
13346B68729o8531k57340m476M5648q2002l8026R6299J08980K03568J05882m5182
13335C33549o0668k8267q3023N4215J2971j47808o5340J7225J33254M0537j18253
13324H8392j00785l0490q7484q9670m6108O8681J06353m4109j1953J21689L0856
13313E372q6947Q544O527j34308j17571K41584R2220Q438J32410K3115P9878k9509
13301B29753j64912n635p1045j3944j9503M3515l4485l6865M4016j52816l915
13290a85836j0261o9538k8991Q1058J74819j14287K80K7883j93903l6401J22802
13279b32375J18171J99823j47578n2494L9574j0282k5001J02193J68397j28072
$$ plain form
13269 32356 -189331 -266732 -271104 -157285 56758 62293 -133912 -252568 -211057 -271047 -274906
13258 -274906 -127246 -217283 -301594 -274519 -288505 -218431 -20380 -32073 -216577 -392008 -331506
13247 -331506 -237917 -56031 100729 216560 255767 178759 269922 125268 -3717 -19269
13237 -19269 97781 238404 193564 206012 250624 341891 205416 105297 47634 -41885 37161
13226 37161 -65336 -3972 126282 192017 246233 183552 154146 115018 116423 298216 147877
13215 147877 -55906 -223022 -123938 -74901 -10679 11979 -203088 -300662 -126214 -14237
13205 -14237 26222 37886 -47930 -46049 82733 98217 -89622 -218050 -259820 -291605 -115951
13194 -115951 -4326 -41311 -59566 -17636 105268 107655 -35442 -3584 -8443 -33678 -103290
$$ packed form
13269C2356k21687p7401m372J13819K14043N535j96205j18656M1511n9990l859
13258b74906J47660r0037q4311K7075j3986P0074J98051j1693j84504j75431O0502
13247c31506R3589J81886J56760J15831L9207p7008R1163j44654j28985j5552
13237a9269J17050J40623m4840J2448M4612R1267j36475j00119n7663q9519P9046
13226C7161j02497O1364J30254O5735N4216o2681k9406l9128J405J81793j50339
13215A47877k03783j67116R9084M9037O4222K2658k15067r7574J74448J11977
13205a4237M0459J1664q5816J881J28782J5484j87839j28428m1770l1785J75654
13194a15951J11625l6985j8255M1930J22904K387j43097L1858m859k5235o9612
$$ plain form
13183 -103290 -270144 -228502 -232058 -218001 -288785 -310881 -253698 -251198 -305657 -63622 101969
13172 101969 119965 -35289 -33837 104192 14087 -41684 73870 -46486 -48404 -135124 -89044
13161 -89044 -1223 155691 444046 480670 219639 25845 28122 -45966 -138863 -131523 -2006
13150 -2006 35231 82658 166657 168804 -38644 56929 103995 53143 166760 190636 104901 18773
13138 18773 -101202 -117342 36161 184629 201014 106219 34975 66061 251963 106487 27164
13127 27164 51801 92702 69245 47709 50510 262333 174564 102868 115768 116826 -2761 -137975
13115 -137975 -47431 57007 -9787 -29856 -26736 46730 -58552 -157287 -162140 -104822 -98485 -125670
13103 -125670 -39506 -80690 -227644 -288111 -332095 -228505 36376 35580 -161674 -118557 80153
$$ packed form
13183a03290j66854M1642l556J4057p0784k2096N7183K500n4459K42035J65591
13172A01969J7996j55254J452J38029r0105n5771J15554j20356j918q6720M6080
13161h9044Q7821J56914K88355L6624k61031j93794K277p4088r2897P340J29517
13150b006L7237M7427Q3999K147k07448R5573M7066n0852J13617K3876q5735q6128
13138A8773j19975j6140J53503J48468J6385r4795p1244L1086J85902j45476p9323
13127B7164K4637M0901k3457k1536K801K11823q7769p1696J2900J058j19587j35214
13115a37975R0544J04438o6794k0069L120P3466j05282r8735m853N7318O337k7185
13103a25670Q6164m1184j46954o0467m3984J03590K64881p96j97254M3117J98710
$$ plain form
13092 80153 248746 289183 196173 187629 53780 -60852 -51869 128045 227418 109163 77235
13081 77235 125980 28338 160851 123714 93940 84455 111347 82470 -1550 -10845 26840 10840
13069 10840 -13473 -110417 -97910 3426 -82514 -97293 11308 82318 92540 40881 -20720
13058 -20720 21101 47425 114008 234126 151648 121929 92126 -57265 -186023 -24742 281814
13047 281814 343518 303593 275799 196884 94338 103696 98675 69763 15240 68720 189792
13036 189792 142977 256780 249354 269316 237080 168890 254425 266379 177537 186623 280067 236801
13024 236801 263505 212280 173211 225428 280801 278087 252233 235459 137162 69720 26742 -6131
13012 -6131 -87961 -13497 97719 19286 57951 54224 -52415 -95545 -30642 -52461 -41236 123786
$$ packed form
13092H0153J68593M0437r3010q544j33849j14632Q983J79914R9373j18255l1928
13081G7235M8745r7642J32513l7137k9774r485K6892k8877q4020r295L7685j6000
13069A0840k4313r6944J2507J01336q5940j4779J08601P1010J0222n1659o1601
13058b0720M1821K6324O6583J20118q2478k9719k9803j49391j28758J61281L06556
13047B81814O1704l9925k7794p8915j02546R358n021k8912n4523N3480J21072
13036A89792m6815J13803p426J9962l2236o8190Q5535J1954q8842R086R3444m3266
13024B36801K6704n1225l9069N2217N5373k714k5854j6774r8297o7442m2978l2873
13012f131q1830P4464J11216p8433L8665l727j06639m3130O4903k1819J1225J65022
$$ plain form
13000 123786 60615 -128831 -20268 -34698 56604 54808 51973 -58085 -156759 -102672 -11215
12989 -11215 112099 231154 255173 132590 -57997 81707 100496 -2840 204243 196239
12979 196239 204098 331344 260656 197631 219492 107812 158089 103909 211598 357573 125956
12968 125956 -98905 -214262 -228731 -141298 -86489 77163 233138 113565 4433 63986
12958 63986 205908 224415 141589 86919 -41222 -125873 -17364 88521 142442 37040 -134028
12947 -134028 -367506 -296165 -181329 -121910 -128664 -73280 -57870 -2936 123724 243359 333076
12936 333076 242064 289073 274177 88725 28327 -10680 -62792 13794 121035 126419 112151
12925 112151 64643 58994 -102665 -216099 -66239 67024 92937 -113014 -144240 -97824 -34315
$$ packed form
13000A23786o3171j89446J08563j4430R1302j796k835j10058r8674N4087R1457
12989a1215J23314J19055K4019j22583j90587J39704J8789j03336K07083q004
12979A96239P859J27246p0688o3025K1861j11680N0277n4180J07689J45975k31617
12968A25956k24861j15357j4469Q7433N4809J63652J55975j19573j09132N9553
12958F3986J41922J8507q2826n4670j28141q4651J08509J05885N3921j05402j71068
12947a34028k33478P1341J14836N9419o754N5384J5410N4934J26660J19635Q9717
12936C33076r1012M7009j4896j85452o0398l9007n2112P6586J07241N384j4268
12925A12151m7508n649j61659j13434J49860J33263K5913k05951l1226M6416O3509
$$ plain form
12914 -34315 -93063 -174433 -114091 -127741 8806 51268 181933 114592 -115120 -161761 -65782
12903 -65782 -135023 -153173 -231695 -310518 -217627 -36553 91183 225666 101414 74707 137155
12892 137155 102745 -45827 -200257 -134574 -43761 -13835 103240 272480 182568 -67087
12882 -67087 -3831 146405 300666 228837 257975 208657 107292 52658 127601 135286 -80791
12871 -80791 -28165 126713 140596 7222 -18890 126084 271314 240625 121088 -24620
12861 -24620 -134028 -60032 -10897 -106525 -187359 -102773 -84075 -46304 31323 55036 40864
12850 40864 84838 -3648 -3296 93106 132380 5672 -127683 -190245 -176019 -162732 -59146
12839 -59146 113374 260339 231099 198356 241563 360348 392777 267239 122565 164315 225446
$$ packed form
12914c4315n8748q1370O0342j3650J36547M2462J30665o7341k29712m6641R5979
12903f5782o9241j8150p8522p8823R2891J81074J27736J34483j24252k6707O2448
12892A37155l4410j48572j54430O5683R0813K9926J17075J69240q9912k49655
12882f7087O3256J50236J54261p1829K9138m9318j01365n4634P4943P685k16077
12871h0791N2626J54878J3883j33374k6112J44974J45230l0689j19537j45708
12861b4620j09408P3996M9135r5628q0834Q4586J8698L7771P7627K3713j4172
12850D0864M3974q8486L52R6402L9274j26708j33355o2562J4226J3287J03586
12839e9146J72520J46965k9240l2743M3207J18785L2429j25538j44674M1750O1131
$$ plain form
12828 225446 399583 404185 316429 226692 70957 89007 119988 91275 94017 94150 145148 292193
12816 292193 412791 288986 84109 27442 -21762 3611 -11453 -36559 3713 22006 1758
12805 1758 -19596 -46137 49858 85872 -12583 -56089 9136 39126 120551 142835 76763 69293
12793 69293 309738 366891 345334 302050 184820 -85662 -102410 15257 121707 187067 106970
12782 106970 -6347 -137181 -169379 77635 268213 351877 198491 200281 144164 129285 178048
12771 178048 126349 43914 94017 107989 85411 59165 -41936 -92141 67238 210767 158951
12760 158951 41120 177127 193198 22428 -119651 -136838 -53133 -5803 112517 38615
12750 38615 -49398 -16700 48166 1557 -182553 -292039 -293553 -179134 -13798 115773 255291
$$ packed form
12828B25446J74137M602q7756q9737j55735J8050L0981k8713K742J33N0998J47045
12816B92193J20598j23805k04877n6667m9204K5373j5064k5106M0272J8293k0248
12805A758k1354k6541R5995L6014r8455m3506O5225K9990Q1425K2284o6072p470
12793F9293K40445N7153k1557m3284j17230k70482j6748J17667J06450O5360q0097
12782A06970j13317j30834l2198K47014J90578Q3664j53386J790n6117j4879M8763
12771A78048n1699q2435N0103J3972k2578k6246j01101n0205J59379J43529n1816
12760A58951j17831J36007J6071j70770j42079j7187Q3705M7330J18320p3902
12750C8615q8013L2698O4866m6609j84110j09486j514J14419J65336J29571J39518
$$ plain form
12739 255291 27933 8277 131125 118511 34595 -27529 -23711 -56908 -716 -13688 85762
12728 85762 10733 -82934 -303821 -255047 -189533 -170434 -107720 -66012 -64709 -80322 40143
12717 40143 78874 -46497 -175299 -200299 -112349 -58633 139296 81154 -96052 -79188 40303
12706 40303 26962 147118 252165 162320 294657 130651 53141 189988 154103 35458
12696 35458 57977 52324 90881 346969 351775 201658 138394 147571 130719 -1132 -129099
12685 -129099 -287259 -237993 -117995 -25525 -16912 36830 -50101 -68453 6165 129348 60314
12674 60314 63236 124631 201417 209293 304119 130781 -24758 82940 162481 137349 -11099
12663 -11099 -30314 62199 116934 34200 -9301 -51803 215951 197589 6539 29877 94905
$$ packed form
12739B55291k27358j9656J22848j2614q3916o2124L818l3197N6192j2972R9450
12728H5762p5029r3667k20887M8774O5514J9099O2714M1708J303j5613J20465
12717D0143L8731j25371j28802k5000Q7950N3716J97929n8142j77206J6864J19491
12706D0303j3341J20156J05047q9845J32337j64006p7510J36847l5885j18645
12696C5458K2519n653L8557K56088M806j50117o3264R177j6852j31851j27967
12685a29099j58160M9266J19998R2470Q613N3742q6931j8352P4618J23183o9034
12674F0314K922O1395P6786P876R4826j73338j55539J07698P9541k5132j48448
12663a1099j9215R2513N4735q2734m3501m2502K67754j8362j91050K3338O5028
$$ plain form
12652 94905 186371 158877 190501 259449 179480 107476 -94702 -195145 -122167 57287 178625
12641 178625 218542 251557 270036 96937 90808 -23774 -93908 -33948 -145867 -90149 -28968
12630 -28968 1084 -43131 -35539 92150 82519 207366 302487 413557 140633 -20900 -42312
12619 -42312 1743 -52481 129687 172411 -8832 -68177 -60349 15386 115933 111588 198068
12608 198068 248218 151322 89346 197807 317262 301079 320646 381182 398906 451028 373738
12597 373738 287544 265567 237150 -8072 -118498 -108420 -49255 12810 110160 138646 328493
12586 328493 474414 483325 418162 395924 263901 72599 -28606 29278 66250 81171 -84206
12575 -84206 -197408 -94767 87922 250219 266707 210024 318534 316281 213959 188072 286432
$$ packed form
12652I4905R1466k7494L1624O8948p9969p2004k02178j00443P2978J79454J21338
12641A78625L9917L3015J8479j73099o129j14582p0134N9960j11919N5718O1181
12630b8968L0052m4215P592J27689r631J24847R5121J11070k72924j61533k1412
12619d2312M4055n4224J82168M2724j81243n9345P828P5735J00547m345Q6480
12608A98068N0150r6896o1976J08461J19455j6183J9567O0536J7724N2122p7290
12597C73738q6194k1977k8417k45222j10426J0078N9165O2065R7350K8486J89847
12586C28493J45921Q911o5163k2238j32023j91302j01205N7884L6972J4921j65377
12575h4206j13202J02641J82689J62297J6488n6683J08510k253j02322k5887R8360
$$ plain form
12564 286432 357623 409244 327309 242413 320821 247149 196495 165527 243791 220586 234774
12553 234774 247681 242880 210850 71301 1640 211164 258864 151750 122725 48437 46814
12542 46814 182281 319064 276700 178197 163514 130509 114029 37180 114391 235877 361703
12531 361703 262576 359208 301522 189975 89364 230512 257059 275133 429907 552614
12521 552614 528206 323804 254709 332547 397573 302484 361284 394216 355540 246952 310792
12510 310792 537115 549272 445026 348533 363637 410232 354116 197557 152710 322522 575581
12499 575581 616427 446918 267725 303401 288235 283993 198044 132683 108403 127569 253716
12488 253716 341454 330305 408198 351386 282783 209242 74978 130799 265984 200972 230050
$$ packed form
12564B86432P1191N1621q1935q4896P8408p3672n0654l0968P8264k3205J4188
12553B34774J2907m801l2030j39549o9661K09524M7700j07114k9025p4288j623
12542D6814J35467J36783m2364r8503j4683l3005j6480p6849P7211J21486J25826
12531C61703r9127R6632n7686j11547j00611J41148K6547J8074J54774J22707
12521E52614k4408k04402o9095P7838O5026r5089N8800L2932l8676j08588O3840
12510C10792K26323J2157j04246r6493J5104M6595n6116j56559m4847J69812K53059
12499E75581M0846j69509j79193L5676j5166m242q5949o5361k4280J9166J26147
12488B53716Q7738j1149P7893n6812o8603p3541j34264N5821J35185o5012K9078
$$ plain form
12477 230050 342248 317599 410767 382091 346686 365995 230016 287464 462507 469034 425067
12466 425067 539859 403090 321526 453129 527396 641004 634006 492374 346848 326814
12456 326814 270016 413777 441578 462418 462161 341201 235306 220078 117797 201717 397266
12445 397266 503657 698477 573802 537504 627801 607509 606510 537831 407952 368881 535323
12434 535323 693184 703132 747216 670713 515770 469414 507456 660436 518725 546766 675295
12423 675295 682940 766016 609479 520759 623489 718794 675496 807819 793467 756428 599880
12412 599880 616838 866046 927921 1081427 1109187 1022810 737268 664673 690055 761504 756955
12401 756955 658977 705557 831519 926047 872229 747687 822877 904601 974772 927775 952644
$$ packed form
12477B30050J12198k4649R3168k8676l5405J9309j35979N7448J75043O527m3967
12466D25067J14792j36769q1564J31603P4267J13608o998j41632j45526k0034
12456C26814n6798J43761K7801K0840k57j20960j05895j5228j02281Q3920J95549
12445C97266J06391J94820j24675l6298R0297k0292r99o8679j29879l9071J66442
12434E35323J57861R948M4084p6503j54943m6356L8042J52980j41711K8041J28529
12423F75295P645Q3076j56537q8720J02730R5305m3298J32323j4352l7039j56548
12412E99880J6958K49208O1875J53506K7760q6377k85542p2595K5382P1449m549
12401G56955r7978M6580J25962R4528n3818j24542P5190Q1724P0171m6997K4869
$$ plain form
12390 952644 1046975 1138803 1077764 1096740 1150211 1286599 1303786 1408900 1478323 1533198 1621533
12379 1621533 1520649 1245525 1112570 1078645 1042659 1187867 1363432 1404120 1481955 1544765
12369 1544765 1459327 1290051 1378512 1578150 1698712 1691063 1613317 1491988 1502398 1527223 1581171
12358 1581171 1647945 1609072 1663252 1576644 1548089 1694322 1687383 1670477 1879820 2014407 2134627
12347 2134627 2134075 2262141 2373323 2418783 2446080 2351841 2366968 2489045 2777467 2936383 2708076
12336 2708076 2780659 2848965 2829246 2891918 3018723 3323614 3545401 3628774 3587573 3722875
12326 3722875 3822906 3874210 4070487 4259331 4351618 4440285 4593342 4773783 4746791 4943439
12316 4943439 5198266 5349120 5502201 5835263 6095798 6208781 6364208 6476931 6795564
$$ packed form
12390I52644R4331R1828o1039J8976N3471J36388J7187J05114O9423N4875Q8335
12379A621533j00884k75124j32955l3925l5986J45208J75565M0688P7835O2810
12369A544765q5438j69276Q8461J99638J20562p649p7746j21329J0410K4825N3948
12358A581171O6774l8873N4180q6608k8555J46233o939j6906K09343J34587J20220
12347B134627n52J28066J11182M5460K7297r4239J5127J22077K88422J58916k28307
12336B708076P2583O8306j9719O2672J26805L04891K21787Q3373m1201J35302
12326C722875J00031N1304J96277J88844R2287Q8667J53057J80441k6992J96648
12316D943439K54827J50854J53081L33062K60535J12983J55427J12723L18633
$$ plain form
12307 6795564 7080621 7391199 7876105 8443062 9175090 9526832 9735029 10178225 10750312
12298 10750312 11427119 11891688 12468637 12959531 13713245 14406412 15416424 16456446 17351634
12289 17351634 18340039 19456561 20671465 21955682 23636512 25437264 27404865 29542459
12281 29542459 31944108 34563388 37553595 40953755 44731811 48232393 51937232 56166368
12273 56166368 60845680 65989730 71516694 77621148 83928938 90212236 96452180 102553938
12265 102553938 108370539 113451502 117823579 121126214 123320514 124118507 123583724 121795437
12257 121795437 118723417 114594831 109720399 104025565 97866332 91415972 85255531 79371682
12249 79371682 73480682 67752019 62464225 57529572 52908061 48781424 44855369 41592521
$$ packed form
12307F795564K85057L10578M84906N66957P32028L51742K08197M43196N72087
12298A0750312O76807M64569N76949M90894P53714O93167J010012J040022Q95188
12289A7351634R88405J116522J214904J284217J680830J800752J967601K137594
12281B9542459K401649K619280K990207L400160L778056L500582L704839M229136
12273E6166368M679312N144050N526964O104454O307790O283298O239944O101758
12265A02553938N816601N080963M372077L302635K194300P97993n34783j788287
12257A21795437l072020m128586m874432n694834o159233o450360o160441n883849
12249G9371682n891000n728663n287794m934653m621511m126637l926055l262848
$$ plain form
12241 41592521 38526726 35600568 32997977 30739711 28801461 26900617 24989035 23387493
12233 23387493 21919760 20490154 19230660 18143568 17139370 16244166 15338576 14524315
12225 14524315 13809572 13071938 12455504 11892252 11396011 10907638 10466817 10038479 9660628
12216 9660628 9217106 8858260 8485497 8024322 7791062 7576629 7327025 7036480 6650327
12207 6650327 6446185 6150276 5925381 5765599 5482777 5286064 5319355 5087624 4758147 4622891
12197 4622891 4542742 4419955 4363958 4395665 4162201 3943723 4018554 4062232 3768572 3480997
12187 3480997 3503418 3569478 3510266 3303970 3198038 3199473 2983769 2905953 3022552 2939098 2839809
12176 2839809 2706586 2430281 2334279 2378036 2498800 2458654 2359816 2394647 2383444 2247064
$$ packed form
12241D1592521l065795k926158k602591k258266j938250j900844j911582j601542
12233B3387493j467733j429606j259494j087092j004198q95204r05590q14261
12225A4524315p14743p37634o16434n63252m96241m88373m40821m28338l77851
12216I660628m43522l58846l72763m61175k33260k14433k49604k90545l86153
12207F650327k04142k95909k24895j59782k82822j96713L3291k31731l29477j35256
12197D622891q0149j22787n5997L1707k33464k18478P4831M3678k93660k87575
12187C480997K2421O6060n9212k06296j05932J435k15704p7816J16599q3454r9289
12176B839809j33223k76305r6002M3757J20764m0146r8838L4831j1203j36380
$$ plain form
12166 2247064 2083369 1974546 1955280 2070626 2131969 2005967 1806445 1647698 1594955 1683451
12156 1683451 1645207 1666383 1791106 1740483 1696365 1574673 1526317 1361808 1426450 1404986 1377777
12145 1377777 1459272 1376704 1328100 1203243 1022165 1099387 1167013 1202360 1407847 1553405
12135 1553405 1573261 1410963 1379940 1266611 1148197 1011023 1101765 1032605 1009131 1102128
12125 1102128 1056095 1218041 1375763 1342941 1156196 944774 723498 611115 689881 809616
12115 809616 799830 818684 829254 856781 865271 827007 798789 821410 833404 724581 539324
12104 539324 538575 822406 834904 874702 757115 655682 514221 636320 801692 849615 823944
12093 823944 795014 688510 641959 623345 570446 638169 562902 608577 665580 750594 722613
$$ packed form
12166B247064j63695j08823j9266J15346O1343j26002j99522j58747n2743Q8496
12156A683451l8244K1176J24723n0623m4118j21692m8356j64509O4642k1464k7209
12145A377777Q1495q2568m8604j24857j81078P7222O7626L5347K05487J45558
12135A553405J9856j62298l1023j13329j18414j37174R0742o9160k3474R2997
12125A102128m6033J61946J57722l2822j86745k11422k21276j12383P8766J19735
12115H09616r786J8854J0570K7527Q490l8264k8218K2621J1994j08823j85257
12104E39324p49K83831J2498L9798j17587j01433j41461J22099J65372M7923k5671
12093H23944k8930j06504m6551j8614n2899O7723p5267M5675N7003Q5014k7981
$$ plain form
12082 722613 790364 707678 664285 745715 825963 630873 486957 547049 647593 640305 580801
12071 580801 538125 569947 503246 319414 357429 177207 106741 242599 413200 361360 264628
12060 264628 181054 347272 422215 507368 476890 428586 206584 130219 148843 121270 228900
12049 228900 349434 464156 405597 314792 362370 294762 305676 296476 308575 383878 354341
12038 354341 235376 140725 101584 234289 427466 386400 277390 256817 91057 -32765
12028 -32765 83027 206262 141366 169944 30802 144097 381677 560346 585845 591388 631883
12017 631883 493569 280971 278321 328981 189180 198145 404984 351730 252779 228893 319388
12006 319388 167462 175496 289820 311164 307167 195887 139840 225935 174865 112007 91761
$$ packed form
12082G22613O7751q2686m3393Q1430Q0248j95090j43916O0092J00544p288n9504
12071E80801m2676L1822o6701j83832L8015j80222p0466J35858J70601n1840r6732
12060B64628q3574J66218P4943Q5153l0478m8304k22002p6365J8624k7573J07630
12049B28900J20534J14722n8559r0805M7578o7608J0914r200J2099P5303k9537
12038C54341j18965r4651l9141J32705J93177m1066j09010k0573j65760j23822
12028c2765J15792J23235o4896K8578j39142J13295K37580J78669K5499N543M0495
12017F31883j38314k12598k650N0660j39801Q965K06839n3254r8951k3886R0495
12006C19388j51926Q034J14324K1344l997j11280n6047Q6095n1070o2858k0246
$$ plain form
11995 91761 120625 92183 69942 -165244 -149514 158080 368525 322904 506707 384969 297971
11984 297971 254698 124742 92753 123354 149400 200278 366293 416377 387577 316006 250733
11973 250733 261157 297215 345524 199304 291427 349081 278093 259870 158972 91705 76563
11962 76563 199081 370480 572784 467646 327771 427186 386314 360588 377813 360011 213955
11951 213955 231972 247911 334102 134025 62435 159706 185261 275501 415594 380066 212508
11940 212508 176374 238805 300461 226351 104823 83244 110186 262759 273032 259684 228203
11929 228203 137179 183351 324004 369160 242148 235688 112803 143433 426474 370363 220365
11918 220365 250338 428116 413964 365404 323261 248505 202448 147270 -15634 -109446 -74178
$$ packed form
11995I1761K8864k8442k2241k35186J5730L07594K10445m5621J83803j21738q6998
11984B97971m3273j29956l1989L0601K6046N0878J66015N0084k8800p1571o5273
11973B50733J0424L6058M8309j46220R2123N7654p0988j8223j00898o7267j5142
11962G6563J22518J71399K02304j05138j39875R9415m0872k5726J7225j7802j46056
11951B13955J8017J5939Q6191k00077p1590R7271K5555R0240J40093l5528j67558
11940B12508l6134O2431O1656p4110j21528k1579K6942J52573J0273j3348l1481
11929B28203r1024M6172J40653M5156j27012o460j22885L0630K83041n6111j49998
11918B20365K9973J77778j4152m8560m2143p4756m6057n5178j62904r3812L5268
$$ plain form
11907 -74178 59504 76549 69397 288383 411374 313935 314711 286532 339730 187228 121208
11896 121208 105221 100895 92611 -88185 -52771 98146 152519 211103 327084 184808 169834
11885 169834 289257 251463 339773 287616 194282 75913 -32229 58486 212723 331363
11875 331363 421545 292782 136127 116167 148243 262716 121553 181742 321374 181100
11865 181100 126448 107962 148083 81155 140162 73245 155873 176778 15028 31623 76819
11854 76819 207905 138169 -65913 -86239 -6602 152525 85328 46824 113115 217019 237055
11843 237055 109245 83689 26673 52264 56034 100443 153548 284918 328864 336819 234335
11832 234335 138977 -81691 -201495 75 220839 275025 134325 176685 162114 169429 180644
$$ packed form
11907g4178J33682J7045p152K18986J22991r7439P76k8179N3198j52502o6020
11896A21208j5987m326q284j80796L5414J50917N4373N8584J15981j42276j4974
11885A69834J19423l7794Q8310n2157r3334j18369j08142R0715J54237J18640
11875C31363R0182j28763j56655j9960L2076J14473j41163O0189J39632j40274
11865A81100n4652j8486M0121o6928N9007o6917Q2628K0905j61750J6595M5196
11854G6819J31086o9736k04082k0326P9637J59127o7197l8504O6291J03904K0036
11843B37055j27810k5556n7016K5591L770M4409N3105J31370M3946P955j02484
11832B34335r5358k20668j19804K01570K20764N4186j40700M2360j4571P315J1215
$$ plain form
11821 180644 223510 273593 230382 204905 209893 147050 210841 174753 -21738 -170139 -107390
11810 -107390 -42228 146262 219711 84634 127156 197278 141949 73772 5747 -13522 -29212
11799 -29212 32017 92954 53541 76710 160161 214833 12293 -187750 -106366 -18372 5197
11788 5197 130274 66709 -33191 -53373 -87915 -196541 -161591 -184585 -158869 -64591 51963
11777 51963 -56434 -109557 -111212 -34863 22658 6749 -43838 34827 220976 95498 98760
11766 98760 292146 411940 181742 122359 109921 -138611 -239983 -65357 112512 105923
11756 105923 -122840 -68215 147856 65673 200387 264015 217448 130256 145940 100200 60117
11745 60117 -30060 61276 190878 280622 214297 281393 326725 298074 279606 224251 166937
$$ packed form
11821A80644M2866N0083m3211k5477M988o2843O3791l6088j96491j48401O2749
11810a07390O5162J88490P3449j35077M2522P0122n5329o8177o8025j9269j5690
11799b9212O1229O0937l9413K3169Q3451N4672k02540k00043Q1384Q7994K3569
11788E197J25077o3565r9900k0182l4542j08626L4950k2994K5716R4278J16554
11777E1963j08397n3123j655P6349N7521j5909n0587P8665J86149j25478L262
11766I8760J93386J19794k30198n9383j2438k48532j01372J74626J77869o589
11756A05923k28763N4625K16071q2183J34714O3628m6567q7192J5684m5740m0083
11745F0117r0177R1336J29602Q9744o6325O7096M5332k8651j8468n5355n7314
$$ plain form
11734 166937 220774 197752 -118761 -356790 -317346 -246101 -267440 -6843 44189 67268 106372
11723 106372 72102 5972 36733 32079 9415 106970 244685 297110 253269 171259 55215
11712 55215 37311 63739 -19365 -102830 -59360 -58775 -59622 -15633 105540 167267 199973 -28547
11700 -28547 -16668 15154 99506 25659 -27650 -33288 -150593 -40771 -21886 -87415 -88678 -27427
11688 -27427 79747 89562 150802 13985 -76879 -72120 -72613 -29847 39776 -28572 -99886 -117626
11676 -117626 28485 104479 77396 69458 -78671 -143698 44780 201119 248566 137115 212890
11665 212890 182331 222181 142596 85532 215504 341363 407787 332981 179792 147173 93617
11654 93617 30580 -64581 18786 155512 88240 -156151 -446317 -571639 -203818 -19128
$$ packed form
11734A66937N3837k3022l16513k38029L9444P1245k1339K60597N1032K3079L9104
11723A06372l4270o6130L0761m654k2664R7555J37715N2425m3841q2010j16044
11712E5215j7904K6428q3104q3465M3470N85q47M3989J21173O1727L2706k28520
11700b8547J1879L1822Q4352p3847n3309n638j17305J09822J8885o5529j263O1251
11688b7427J07174R815O1240j36817r0864M759m93M2766O9623o8348p1314j7740
11676a17626J46111P5994k7083p938j48129o5027J88478J56339M7447j11451P5775
11665B12890l0559L9850p9585n7064J29972J25859O6424p4806j53189l2619n3556
11654I3617o3037r5161Q3367J36726o7272k44391k90166j25322L67821J84690
$$ plain form
11644 -19128 82865 110346 143242 208271 272849 101469 54803 127984 304973 228300 23404
11633 23404 3841 -22833 10530 83646 84416 119742 142536 124600 98720 17296 118002 239833
11621 239833 227974 89766 -92295 -90562 -120930 -137232 -36633 4246 -109356 -209267 -299513
11610 -299513 -181209 22508 -156385 -260376 -107079 -111638 -155429 -47815 60805 18588
11600 18588 1622 68414 107100 18838 29939 -41463 -225132 -254133 -115854 -56359 -140695
11589 -140695 -90686 -120507 -224495 -147780 -102701 -32753 7717 67079 211875 213484 214632
11578 214632 345276 278808 146354 94407 -11852 -108128 -257320 -330728 -247931 -253054 -284251
11567 -284251 -144600 19461 89107 21993 60701 298537 160217 175797 189412 -15947
$$ packed form
11644a9128J01993K7481L2896O5029O4578j71380m6666P3181J76989p6673k04896
11633B3404j9563k6674L3363P3116P70L5326K2794j7936k5880q1424J00706J21831
11621B39833j1859j38208j82061J733l0368j6302J00599M0879j13602r9911r0246
11610b99513J18304K03717j78893j03991J53297m559m3791J07614J08620m2217
11600A8588j6966O6792L8686q8262J1101p1402j83669k9001J38279N9495q4336
11589a40695N0009k9821j03988P6715M5079O9948M0470N9362J44796J609J148
11578B14632J30644o6468j32454n1947j06259r6276j49192p3408Q2797n123l1197
11567b84251J39651J64061O9646o7114L8708K37836j38320J5580J3615k05359
$$ plain form
11557 -15947 -25868 183780 262477 214290 110228 77529 125369 70170 141341 125619 -68678
11546 -68678 -3651 83404 72925 -11869 -175744 -209980 -160967 -14919 -41773 89270 177917
11535 177917 59469 -10452 -68442 -173961 -212413 -281646 -260454 -208000 -81665 -74124 -4339
11524 -4339 70327 141936 116885 -126727 -205946 -233418 -102608 -200637 -176389 -157348 -198677
11513 -198677 -336522 -410878 -197877 42699 217406 67399 -93260 -113751 -118134 -204412
11503 -204412 -148924 61103 170420 109465 -3182 -80766 47216 74828 -32117 -85300
11493 -85300 99358 149117 -57458 -100411 50464 98637 60518 90143 162361 123262 63418
11482 63418 -115862 -213549 -40099 -49594 32877 169414 91296 24788 94625 15405 92459
$$ packed form
11557a5947r921K09648P8697m8187j04062l2699M7840n5199P1171j5722j94297
11546f8678O5027Q7055j0479q4794j63875l4236M9013J46048k6854J31043Q8647
11535A77917j18448o9921n7990j05519l8452o9233K1192N2454J26335P541O9785
11524d339P4666P1609k5051k43612p9219k7472J30810r8029K4248J9041m1329
11513a98677j37845p4356K13001K40576J74707j50007j60659k0491m383q6278
11503b04412N5488K10027J09317o0955j12647p7584J27982K7612j06945n3183
11493h5300J84658M9759k06575m2953J50875M8173l8119K9625P2218l9099n9844
11482F3418j79280r7687J73450r495Q2471J36537p8118o6508O9837p9220P7054
$$ plain form
11471 92459 198846 152078 142871 -3885 -154047 -168026 -190044 -148858 97469 274094 304429
11460 304429 125380 106540 -24870 90140 271185 365424 169867 36504 11767 2762
11450 2762 -32406 96816 13349 -174830 -277223 -117492 117561 252422 180664 33699
11440 33699 -71502 57309 98011 139857 239968 68907 89869 63545 -14299 59290 153519
11429 153519 76996 -84063 -273084 -96699 69490 300181 318223 191070 4896 -91476
11419 -91476 -133464 -144724 109248 321341 277958 54094 89961 52831 123714 239127 196856
11408 196856 193507 208276 266222 325860 177604 211573 183437 201467 188665 155714 39542
11397 39542 -109321 -35057 -24829 -287079 -355819 -352197 -225802 -205979 -271061 -171378 -249204
$$ packed form
11471I2459J06387m6768r207j46756j50162j3979k2018M1186K46327J76625L0335
11460C04429j79049j8840j31410J15010J81045R4239j95557j33363k4737r005
11450B762l5168J29222q3467j88179j02393J59731K35053J34861p1758j46965
11440C3699j05201J28811M0702M1846J00111j71061K0962k6324p7844P3589R4229
11429A53519p6523j61059j89021J76385J66189K30691J8042j27153j86174r6372
11419i1476m1988j1260K53972K12093m3383k23864L5867l7130P0883J15413m2271
11408A96856l349J4769N7946N9638j48256L3969k8136J8030j2802l2951j16172
11397C9542j48863P4264J0228k62250o8740L622J26395J9823o5082R9683p7826
$$ plain form
11386 -249204 -208412 -199130 -53612 100119 1174 -7588 -55960 120889 116260 88549 314051
11375 314051 222421 252839 213850 125385 174901 239083 238065 256311 153904 32317 107678
11364 107678 215314 306105 333484 18600 -69229 -148838 -100715 30375 -32742 -158116 -188607
11353 -188607 -128718 -101640 -150859 -52392 104200 254855 166328 -53347 -217274 -110692
11343 -110692 -48714 123871 205703 158496 23696 -55028 -40194 7995 121791 221261 371132
11332 371132 260377 236742 179909 77200 114409 143385 148613 62745 160305 217719 15385
11321 15385 -138780 -134627 -180776 3100 76916 161459 349385 391535 76808 76372 187897
11310 187897 121982 69739 75379 -6785 -100128 51864 179646 164523 259016 381097 203065
$$ packed form
11386b49204M0792R282J45518J53731r8945q762m8372J76849m629k7711K25502
11375C14051r1630L0418l8989q8465M9516O4182j018J8246j02407j21587P5361
11364A07678J07636R0791K7379l14884q7829p9609M8123J31090o3117j25374l0491
11353a88607N9889K7078m9219R8467J56592J50655q8527k19675j63927J06582
11343a10692O1978J72585Q1832m7207j34800p8724J4834M8189J13796R9470J49871
11332C71132j10755k3635n6833j02709L7209K8976N228q5868R7560N7414k02334
11321A5385j54165M153m6149J83876P3816Q4543J87926M2150l14727m36J11525
11310A87897o5915n2243N640q2164r3343J51992J27782j5123R4493J22081j78032
$$ plain form
11299 203065 32265 66734 66515 -33550 -277584 -472993 -479500 -486432 -167713 73410 68332
11288 68332 180380 241271 73625 -33299 -151423 -125429 100538 10086 -144039 -132091
11278 -132091 -2027 -41128 31628 206932 292024 135669 21218 10668 208604 254884
11268 254884 -64 -65498 20654 -17332 -19542 162772 171206 63202 72277 102720 55066
11257 55066 50148 188995 354943 383821 233458 54269 -53522 -23377 1996 -13997 -13930
11246 -13930 92283 24598 41659 -73666 -210886 -180461 -69628 -72801 -89272 -167812 -85185
11235 -85185 -51214 97796 138281 213430 202691 57076 140952 136153 -5348 -180321 -148767
11224 -148767 -13850 189763 98749 13285 14505 -55068 88925 60276 -129092 -192879 -138689
$$ packed form
11299B03065j70800L4469k19j00065k44034j95409o507o932L18719K41123n078
11288F8332J12048O0891j67646j06924j18124K5994K25967r0452j54125J1948
11278a32091J30064l9101P2756J75304Q5092j56355j14451j0550J97936M6280
11268B54884k54948o5434Q6152l7986k210J82314Q434j08004R075L0443m7654
11257E5066m918J38847J65948K8878j50363j79189j07791L0145K5373j5993O7
11246a3930J06213o7685J7061j15325j37220L0425J10833l173j6471p8540Q2627
11235h5185L3971J49010M0485P5149j0739j45615Q3876m799j41501j74973L1554
11224a48767J34917K03613r1014q5464J220o9573J43993k8649j89368o3787N4190
$$ plain form
11213 -138689 -128579 -115539 -66295 -88377 -48099 84787 129751 161041 231452 314380 352220
11202 352220 163543 -1839 -85443 -186827 -299170 -173596 -26888 58344 58316 -248423 -396469
11191 -396469 -441571 -303740 -157335 -315559 -350949 -46823 73386 100816 82723 23957
11181 23957 -71517 -9816 -21592 -12907 4205 99541 162064 117845 -65360 -129088 16760
11170 16760 31707 86977 19626 109906 67096 -13152 30435 -54940 -72175 -78496 -164292 -217720
11158 -217720 -73152 -56773 -92562 -169267 -108029 3108 173516 122705 -150851 -76350 -34562
11147 -34562 116769 272381 47179 -50315 -47910 -30072 -6853 -29022 -85449 -158328 -191296
11136 -191296 -112421 -111504 -61214 -47510 -56164 -141662 -175852 -216868 -208368 -60232 164760 220047
$$ packed form
11213a38689J0110J3040M9244k2082M0278J32886M4964L1290P0411Q2928L7840
11202C52220j88677j65382q3604j01384j12343J25574J46708Q5232k8l06739j48046
11191c96469m5102J37831J46405j58224l5390L04126J20209K7430j8093n8766
11181B3957r5474O1701j1776Q685J7112R5336O2523m4219j83205o3728J45848
11170A6760J4947N5270o7351R0280m2810q0248M3587q5375j7235o321q5796n3428
11158b17720J44568J6379l5789p6705O1238J11137J70408n0811k73556P4501M1788
11147c4562J51331J55612k25202r7494K405J7838K3219k2169n6427p2879l2968
11136a91296P8875R17N0290J3704q654q5498l4190m1016Q500J48136K24992N5287
$$ plain form
11124 220047 145954 117725 240887 243360 -13930 -202622 -216763 -203004 -257905 -241598 -118511
11113 -118511 -57796 -53351 117938 243803 195087 74271 166732 91868 73224 280922 387755
11102 387755 247800 11268 -232277 -335015 -191242 -5075 65070 68676 201439 44908
11092 44908 -20991 50631 89179 33214 -81658 -178744 -333853 -235801 -34669 85423 106913
11081 106913 -9262 -141317 -70606 34 48696 94484 89363 29097 -53127 -68330 13795
11070 13795 126556 156327 160689 41205 -5350 10923 -47446 -38020 43090 -50920 -112985 -1965
11058 -1965 -25724 -209011 -222521 -24734 225735 169825 133684 243550 256815 390919 511122
11047 511122 667287 714457 737839 584031 487914 432235 279572 276697 493694 692753 827729
$$ packed form
11124B20047p4093k8229J23162K473k57290j88692j4141J3759n4901J6307J23087
11113a18511O0715M445J71289J25865m8716j20816R2461p4864j8644K07698J06833
11102C87755j39955k36532k43545j02738J43773J86167P0145L606J32763j56531
11092D4908o5899P1622L8548n5965j14872r7086j55109R8052K01132J20092K1490
11081A06913j16175j32055P0711P0640M8662M5788n121o0266q2224j5203Q2125
11070A3795J12761K9771M362j19484m6555J6273n8369R426Q1110r4010o2065J11020
11058a965k3759j83287j3510J97787K50469n5910l6141J09866J3265J34104J20203
11047E11122J56165M7170K3382j53808r6117n5679j52663k875K16997J99059J34976
$$ plain form
11036 827729 936704 1171467 1385081 1596922 1669488 1501182 1402071 1274925 1136384 1013115
11026 1013115 1081002 1191850 1457356 1856850 2328168 2502305 2411993 2128730 1842602 1705708
11016 1705708 1596707 1470616 1376639 1409670 1384712 1440339 1530595 1734384 1648813 1474880
11006 1474880 1292249 960608 651261 469993 479776 513497 679298 702439 769186 701791
10996 701791 698732 572367 410601 390162 282266 251397 267767 -15449 -116180 -10144
10986 -10144 -44081 -95854 -133963 -33096 -35821 -190867 -257164 -189111 -110996 -157286 -157666 -130521
10974 -130521 -154376 -222240 -441468 -428630 -516927 -444674 -307153 -301599 -286847 -185697 -157752
10963 -157752 -133279 52615 -214565 -302090 -213372 -48251 1932 25601 72048 255199 255833
$$ packed form
11036H27729J08975K34763K13614K11841P2566j68306r9111j27146j38541j23269
11026A013115O7887J10848K65506L99494M71318J74137r0312k83263k86128j36894
11016A705708j09001j26091r3977L3031k4958N5627R0256K03789q5571j73933
11006A474880j82631l31641l09347j81268R783L3721J65801K3141O6747o7395
10996G01791l059j26365j61766k0439j07896l0869J6370k83216j00731J06036
10986a0144l3937n1773l8109J00867k725j55046o6297O8053P8115m6290l80K7145
10974a30521k3855o7864k19228J2838q8297P2253J37521N554J4752J01150K7945
10963a57752K4473J85894k67180q7525Q8718J65121N0183K3669M6447J83151O34
$$ plain form
10952 255833 132705 130912 -37047 -43396 11965 110078 72905 114988 84112 -89131 -90516
10941 -90516 -125686 -206568 -69123 55582 119503 100009 2677 18450 -82275 -83531 -117336
10930 -117336 -270832 -245977 -214093 -256244 -230199 -74112 -125770 -290060 -291269 -255171 -139087
10919 -139087 -37049 50432 34972 -10309 -21752 1080 26149 23892 65047 -61093 -210716
10908 -210716 -238806 -343756 -265439 -139626 -259163 -301594 -327316 -216416 -99392 20074
10898 20074 109963 155204 74139 108239 47911 41858 119716 43603 -98659 -25803 99017
10887 99017 194757 146775 194348 93421 43657 -219188 -288852 -216928 -313173 -201029 -119350
10876 -119350 -265174 -246974 -185446 -290486 -369532 -214289 -132175 -49169 -9564 56646 129700
$$ packed form
10952B55833j23128j793j67959o349N5361R8113l7173M2083l0876j73243j385
10941i0516l5170q0882J37445J24705O3921j9494r7332J5773j00725j256l3805
10930a17336j53496K4855L1884m2151K6045J56087n1658j64290j209L6098J16084
10919a39087J02038Q7481j5460m5281j1443K2832K5069k257M1155j26140j49623
10908b10716k8090j04950P8317J25813j19537m2431k5722J10900J17024J19466
10898B0074Q9889M5241q1065L4100o0328o053P7858p6113j42262P2856J24820
10887I9017R5740m7982M7573j00927m9764k62845o9664P1924r6245J12144Q1679
10876a19350j45824J8200O1528j05040p9046J55243Q2114Q3006L9605O6210P3054
$$ plain form
10865 129700 5669 1494 130883 130518 157215 245423 241384 100442 128920 44054 132723 203633
10853 203633 193214 280583 394383 428359 284089 239954 243566 124499 283566 259540 208577
10842 208577 223740 43341 45932 60956 15502 54404 160476 150772 34655 -134722 -81006
10831 -81006 -63432 -138919 -31635 -43288 -9808 -90707 -194633 -20384 -8549 51845 104645
10820 104645 146981 40200 40658 192001 164279 21814 18863 139648 146418 252066 322177
10809 322177 315187 184703 18509 -114532 -166252 -285284 -337312 -360866 -241054 -139160
10799 -139160 -8734 94131 281810 163515 107481 97450 36897 47001 26312 71621 215746
10788 215746 132939 75536 166992 302455 296587 136395 222972 210183 47162 170398 289400
$$ packed form
10865A29700j24031m175J29389l65K6697Q8208m039j40942K8478q4866Q8669P0910
10853B03633j0419Q7369J13800L3976j44270m4135L612j19067J59067k4026n0963
10842B08577J5163j80399K591J5024m5454L8902J06072r704j16117j69377N3716
10831h1006J7574p5487J07284j1653L3480q0899j03926J74249J1835O0394N2800
10820A04645M2336j06781M58J51343k7722j42465k951J20785O770J05648P0111
10809C22177o990j30484j66194j33041n1720j19032n2028k3554J19812J01894
10799a39160J30426J02865J87679j18295n6034j0031o0553J0104k0689M5309J44125
10788B15746q2807n7403R1456J35463n868j60192Q6577j2789j63021J23236J19002
$$ plain form
10777 289400 273738 275166 186728 154743 262302 211506 257721 276963 295161 187652 237475
10766 237475 167069 149504 192036 157248 236021 250360 259138 323438 193373 58114 -69145
10755 -69145 -159965 -199902 -147983 -189283 -270090 -312502 -165465 -137621 -52770 108585 200136
10744 200136 141845 31117 187005 237891 16111 -1205 99660 -9007 -206896 -287972
10734 -287972 -334482 -268480 -152219 -159268 -133614 -53257 120837 174252 203070 120977 35459
10723 35459 22374 -36186 39594 172310 119496 -27167 61528 179426 144876 51467 337267
10712 337267 507075 551922 502646 367178 127177 129393 216983 370437 558869 654968 664912
10701 664912 571323 474854 453189 373827 424242 402616 387527 444272 439874 447362 494223 465548
$$ packed form
10777B89400j5662J428q8438l1985J07559n0796M6215J9242J8198j07509M9823
10766B37475p0406j7565M2532l4788P8773J4339Q778O4300j30065j35259j27259
10755f9145r0820l9937N1919m1300q0807m2412J47037K7844Q4851J61355R1551
10744B00136n8291j10728J55888N0886k21780j7316J00865j08667j97889q1076
10734b87972m6510O6002J16261p049K5654Q0357J74094N3415K8818q2093q5518
10723C5459j3085n8560P5780J32716n2814j46663Q8695J17898l4550r3409K85800
10712C37267J69808M4847m9276j35468k40001K216Q7590J53454J88432R6099R944
10701F64912r3589r6469k1665p9362N0415k1626j5089N6745m398P488M6861k8675
$$ plain form
10689 465548 573757 531042 378455 490446 508406 463797 350483 262988 128787 -73096
10679 -73096 -122104 27993 127813 178631 256419 366545 212373 207500 312872 395886 352843
10668 352843 385493 454404 498035 387035 542676 715717 680386 680433 687098 686694 543076 481250
10656 481250 642680 868833 1039622 1283217 1354143 1348241 1329354 1490431 1588684 1606758 1569653
10645 1569653 1582738 1748672 1737560 1787528 2172680 2424773 2608737 2820071 2990905 3289614
10635 3289614 3678253 4237649 5257159 6444387 7444851 8213887 8616282 9115828 9878043
10626 9878043 10848068 11931891 13770860 16575298 20558413 25991746 33410598 43531232
10618 43531232 57067238 74896285 96536059 117730075 130823238 131322006 122992312
$$ packed form
10689D65548J08209m2715j52587J11991J7960m4609j13314q7495j34201k01883
10679g3096m9008J50097R9820N0818P7788J10126j54172m873J05372Q3014m3043
10668C52843L2650O8911M3631j11000J55641J73041l5331M7O665m04j43618o1826
10656D81250J61430K26153J70789K43595P0926n902j8887J61077R8253J8074l7105
10645A569653J3085J65934j1112M9968L85152K52093J83964K11334J70834K98709
10635C289614L88639N59396J019510J187228J000464P69036M02395M99546P62215
10626I878043R70025J083823J838969K804438L983115N433333P418852J0120634
10618D3531232J3536006J7829047K1639774K1194016J3093163M98768q329694
$$ plain form
10611 122992312 113486815 107594158 107570606 114354478 129273872 154303387 190960841 237065232
10603 237065232 280716248 300154226 285571811 252499356 220865861 199980308 192031865
10596 192031865 196878875 215149934 248768338 298230199 358201349 409264753 420390344
10589 420390344 381813444 321115226 266756670 228438262 205963025 197339758 201403013
10582 201403013 217555425 245297740 278661914 302597620 297535358 260969200 213131563
10575 213131563 172040573 143135069 125339744 116247065 114499907 118579283 126447101
10568 126447101 135069056 138343715 130313438 111237919 88517625 68498532 53081585
10561 53081585 41936430 33704128 27740417 23333810 19976391 17257026 15138416 13546620
$$ packed form
10611A22992312r505497n892657k3552O783872J4919394K5029515L6657454M6104391
10603B37065232M3651016J9437978j4582415l3072455l1633495k0885553p948443
10596A92031865M847010J8271059L3618404M9461861N9971150N1063404J1125591
10589D20390344l8576900o0698218n4358556l8318408k2475237q623267M063255
10582B01403013J6152412K7742315L3364174K3935706n062262l6566158m7837637
10575B13131563m1090990k8905504j7795325r092679j747158M079376P867818
10568A26447101Q621955L274659q030277j9075519k2720294k0019093j5416947
10561E3081585j1145155q232302n963711m406607l357419k719365k118610j591796
$$ plain form
10553 13546620 12151116 11022234 9888496 8896323 7982584 7263219 6699191 6187755 5795887
10544 5795887 5467447 5091200 4736873 4405723 4087225 3858376 3654888 3459534 3207835
10535 3207835 2962701 2586381 2554335 2644035 2615415 2460930 2341611 2229340 2118692 2017289
10525 2017289 1896127 1862404 1768365 1840539 1814641 1628714 1524432 1480868 1374142 1343133
10515 1343133 1267495 1301148 1396390 1355433 1265844 1285502 1345047 1383859 1253602 1109983 1113403
10504 1113403 1126755 1194068 1280633 1255057 1124585 1109626 1220563 1238902 1361702 1354014 1175524
10493 1175524 959895 776830 883172 969928 1021781 1064348 988689 899326 913856 903907 892335
10482 892335 959912 1030391 897210 783027 744944 664797 679277 821609 830911 842147 943409
$$ packed form
10553A3546620j395504j128882j133738r92173r13739p19365n64028n11436l91868
10544E795887l28440l76247l54327l31150l18498k28849k03488j95354k51699
10535C207835k45134l76320l2046Q9700k8620j54485j19319j12271j10648j01403
10525B017289j21162l3723r4039P2174k5898j85927j04282m3564j06726l1009
10515A343133p5638L3653R5242m0957q9589J9658N9545L8812j30257j43619L420
10504A113403J3352O7313Q6565k5576j30472j4959J10937J8339J22800p688j78490
10493A175524k15629j83065J06342Q6756N1853M2567p5659q9363J4530r949j1572
10482H92335O7577P0479j33181j14183l8083q0147J4480J42332R302J1236J01262
$$ plain form
10471 943409 850067 705338 626410 709793 766965 604230 554737 558860 690300 727153 615985
10460 615985 432848 384281 472144 709459 833123 865240 787301 590766 562082 575469 691348
10449 691348 654182 537084 415417 418870 440841 572074 710669 695153 784658 880515 858210
10438 858210 574526 404519 278062 421561 526987 710006 744914 714462 660159 459504
10428 459504 427348 601940 589649 641110 708328 695559 527836 437038 379858 408123 504353
10417 504353 497530 476942 502479 567017 612590 460003 412762 427943 474242 519340 353254
10406 353254 297092 408177 506213 491219 324736 410701 343020 335428 248712 190782 315601
10395 315601 256546 231250 387944 395583 272408 272693 464135 549602 535226 476277 544887
$$ packed form
10471I43409r3342j44729p8928Q3383N7172j62735m9493M123J31440L6853j11168
10460F15985j83137m8567Q7863K37315J23664L2117p7939j96535k8684J3387J15879
10449F91348l7166j17098j21667L453K1971J31233J38595j5516Q9505R5857k2305
10438H58210k83684j70007j26457J43499J05426J83019L4908l0452n4303k00655
10428D59504l2156J74592j2291N1461O7218j2769j67723r0798n7180K8265R6230
10417E04353o823k0588K5537O4538M5573j52587m7241J5181M6299M5098j66086
10406C53254n6162J11085R8036j4994j66483Q5965o7681p592q6716n7930J24819
10395C15601n9055k5296J56694P639j23175K85J91442Q5467j4376n8949O8610
$$ plain form
10384 544887 665211 601633 424962 357452 324895 205481 219436 155898 220654 324259 305314
10373 305314 223851 204549 240590 433849 449478 207199 256418 328002 169024 89624 58002
10362 58002 29345 7261 77310 162323 325919 392003 237941 174464 149112 176142 256456
10351 256456 308154 327087 364449 387375 152165 -16534 49075 127700 197275 211648 253178
10340 253178 333800 464124 554179 567101 532525 427932 288233 180674 124922 218004 383916
10329 383916 392744 403999 305592 384260 369310 308976 263494 414119 349929 402151 478952
10318 478952 385849 273055 314974 429805 406140 389234 426542 472375 227696 126680 159804
10307 159804 185073 137826 252480 403269 228907 249640 210697 160925 183818 172751 230345
$$ packed form
10384E44887J20324o3578j76671o7510l2557j19414J3955o3538O4756J03605j8945
10373C05314q1463j9302L6041J93259J5629k42279M9219P1584j58978p9400l1622
10362E8002k8657k2084P0049Q5013J63596O6084j54062o3477k5352K7030Q0314
10351B56456N1698J8933L7362K2926k35210j68699O5609P8625O9575J4373M1530
10340B53178Q0622J30324R0055J2922l4576j04593j39699j07559n5752R3082J65912
10329C83916Q828J1255r8407P8668j4950o0334m5482J50625o4190N2222P6801
10318D78952r3103j12794M1919J14831k3665j6906L7308M5833k44679j01016L3124
10307A59804K5269m7247J14654J50789j74362K0733l8943m9772K2893j1067N7594
$$ plain form
10296 230345 241593 404950 419760 219435 140954 93650 178815 346310 269830 203350 265945
10285 265945 384096 466785 263840 55712 100528 99205 5076 -573 235060 274738 502
10274 502 -89869 -12508 58645 -32002 -175296 -29016 46399 44304 142746 63858 -683 -47277
10262 -47277 38234 77164 64618 68859 135954 131459 87236 11046 3290 65166 68854 69585 -32691
10249 -32691 28329 203317 114428 76110 46664 -10499 -133106 -72982 138196 174068 250528
10238 250528 255111 132201 66731 59636 48300 10016 103456 332918 380451 262291 272348
10227 272348 454579 467526 414553 306258 197131 185582 253883 278952 177415 160656 140349
10216 140349 222749 217549 75314 142934 269134 160736 10881 57978 137764 8655 -71589
$$ packed form
10296B30345J1248J63357J4810k00325p8481m7304Q5165J67495p6480o6480O2595
10285B65945J18151Q2689k02945k08128M4816j323r4129n649K35633L9678k74236
10274E02r0371P7361P1153r0647j43294J46280P5415k095R8442p8888o4541m6594
10262d7277Q5511L8930j2546M241O7095m495m4223p6190p756O1876L688P31j02276
10249c2691O1020J74988q8889l8318k9446n7163j22607O0124K11178L5872P6460
10238B50528M583j22910o5470p095j1336l8284R3440K29462M7533j18160J0057
10227B72348J82231J2947n2973j08295j09127j1549O8301K5069j01537j6759k0307
10216A40349Q2400n200j42235O7620J26200j08398j49855M7097P9786j29109q0244
$$ plain form
10205 -71589 127164 329019 191774 222718 229889 240071 227817 197213 139373 130792 68017
10194 68017 122159 61326 179891 242418 235420 311727 388585 457448 443381 423049 282450
10183 282450 327687 396412 604866 799478 882255 768911 697718 575562 495206 435627 600824
10172 600824 829120 811587 840119 1023814 1116068 1235398 1671570 1977020 1829597 1670189
10162 1670189 1548605 1424569 1335154 1279238 1276915 1420840 1667847 2131086 2305203 2340198
10152 2340198 2191668 1828866 1434584 1096801 1047789 1087032 1157227 1241438 1445913 1771516
10142 1771516 1914870 1814762 1409649 1037729 1000849 935826 747633 792306 882488 815217
10132 815217 708362 608247 661276 689568 563127 319479 199055 253648 370546 382133
$$ packed form
10205g1589J98753K01855j37245L0944P171J0182j2254l0604n7840q581o2775
10194F8017N4142o0833J18565O2527o998P6307P6858O8863j4067k0332j40599
10183B82450M5237O8725K08454J94612Q2777j13344p1193j22156q0356n9579J65197
10172F00824K28296j7533K8532J83695R2254J19330M36172L05450j47423j59408
10162A670189j21584j24036q9415n5916k323J43925K47007M63239J74117L4995
10152B340198j48530l62802l94282l37783m9012L9243P0195Q4211K04475L25603
10142A771516J43354j00108m05113l71920l6880o5023j88193M4673R0182o7271
10132H15217j06855j00115N3029K8292j26441k43648j20424N4593J16898J1587
$$ plain form
10122 382133 356763 326031 274933 249109 222271 206404 174816 318582 423690 219314 58686
10111 58686 189468 253008 166717 46845 2296 185687 310432 157417 -22812 1088
10101 1088 34982 55280 169055 208357 78073 -5407 1880 19956 -38246 -65222 -65315 -67417
10089 -67417 48457 20425 131192 160521 193443 258937 267267 101715 18565 -37395 86758
10078 86758 84918 -155238 -202451 -155124 -228572 -116080 -9758 43016 180770 370616 395258
10067 395258 457406 168549 -19982 2827 73575 191277 152632 -86200 -215961 -169110
10057 -169110 -88654 -25740 -53212 -84446 -8204 -16944 -98480 -163451 -70211 20863 4315 47033
10045 47033 66155 -74349 -150772 -18668 -20339 136198 349492 269836 44579 -159079 -141111
$$ packed form
10122C82133k5370l0732n1098k5824k6838j5867l1588J43766J05108k04376j60628
10111E8686J30782O3540q6291j19872m4549J83391J24745j53015j80229K3900
10101A088L3894K0298J13775L9302j30284q3480P287J8076n8202k6976r3k102
10089f7417J15874k8032J10767K9329L2922O5494Q330j65552q3150n5960J24153
10078H6758j840k40156m7213M7327p3448J12492J06322N2774J37754J89846K4642
10067C95258O2148k88857j88531K2809P0748J17702l8645k38832j29761M6851
10057a69110Q0456O2914k7472l1234P6242q740q1536o4971R3240R1074j6548M2718
10045D7033J9122j40504p6423J32104j671J56537K13294p9656k25257k03658J7968
$$ plain form
10034 -141111 61771 155784 275738 345648 129458 -82957 -205571 -121371 52475 138527
10024 138527 208365 202459 82142 18322 150890 124414 196879 154960 102902 23404 -64050
10013 -64050 -8185 -17232 169770 252949 240885 195901 137260 178243 5449 29186 -10894
10002 -10894 95826 214480 220293 32081 -136020 -160374 47853 19077 12331 9897 34021
9991 34021 112005 30922 -137008 -193451 -20304 84413 -45804 41383 89284 47703 30460
9980 30460 183202 96484 -34049 -56564 82407 162545 190344 160183 -2043 -3262 -31281
9969 -31281 67656 116368 144976 104747 -12740 -87910 -112714 -93115 -94236 -118482 -114811 -149698
9957 -149698 -40994 143833 162770 207557 118525 3655 -38388 -59931 -82488 -195313 -219230
$$ packed form
10034a41111K02882R4013J19954O9910k16190k12415j22614Q4200J73846Q6052
10024A38527O9838n906j20317o3820J32568k6476P2465m1919n2058p9498q7454
10013f4050N5865r047J87002Q3179j2064m4984n8641M0983j72794K3737m0080
10002a0894J06720J18654N813j88212j68101k4354K08227k8776o746k434K4124
9991C4021P7984q1083j67930n6443J73147J04717j30217Q7187M7901m1581j7243
9980C0460J52742q6718j30533k2515J38971Q0138K7799l0161j62226j219k8019
9969c1281R8937M8712K8608m0229j17487p5170k4804J9599j121k4246L671l4887
9957a49698J08704J84827J8937M4787q9032j14870m2043k1543k2557j12825k3917
$$ plain form
9946 -219230 -26788 -13867 -38541 -120965 -127526 -145519 -154367 -120538 -133269 -250338 -132165
9935 -132165 66250 153946 291810 230935 51041 107409 261148 309918 243080 73488 -133578
9924 -133578 -157859 -115520 -75911 103463 70585 -36900 -176333 -396406 -381639 -166426 -18615
9913 -18615 92871 404348 402751 352751 373174 306109 203994 138492 193397 231524 224464 174769
9901 174769 262232 192155 121432 127900 188374 334945 352169 200782 94552 44252 -78136
9890 -78136 120808 194242 106025 -102600 -155450 -113239 -42543 -146817 -204794 -67569 -10347
9879 -10347 -44643 11105 119337 146651 122076 179334 187656 155957 203876 72625 -213249
9868 -213249 -129494 82182 91442 11204 -81380 -171726 26891 263739 387759 180318 -28219
$$ packed form
9946b19230J92442J2921k4674q2424o561j7993q848L3829j2731j17069J18173
9935a32165J98415Q7696J37864o0875j79894N6368J53739M8770o6838j69592k07066
9924a33578k4281M2339L9609J79374l2878j07485j39433k20073J4767K15213J47811
9913a8615J11486L11477j597n0000K0423o7065j02115o5502N4905L8127p060m9695
9901A74769Q7463p0077p0723O468O0474J46571J7224j51387j06230n0300j22388
9890g8136J98944P3434q8217k08625n2850M2211P0696j04274n7977J37225N7222
9879a0347l4296N5748J08232K7314k4575N7258Q322l1699M7919j31251k85874
9868b13249Q3755K11676R260q0238r2584r0346J98617K36848J24020k07441k08537
$$ plain form
9857 -28219 -128684 -314773 -274023 -198670 -148749 -130480 27697 108291 81815 -8473 -93014
9846 -93014 -183233 -258396 -140898 -54975 -173073 -142151 -63657 -1275 106324 -465 -34287
9835 -34287 -92906 -60074 -38019 100791 69105 -193785 -276469 -108499 61197 165231 177687
9824 177687 99546 37384 -116592 -262137 -301288 -355143 -238803 33298 23092 -150792 -15792
9813 -15792 -31455 10498 -2167 77311 189643 70993 -30616 -48786 127862 205898 253740
9802 253740 344428 238405 165885 145599 156254 219450 169471 185923 299081 143213 4142
9791 4142 30917 62653 129012 108994 -17215 -41137 -172490 -58209 -34444 -203680 -211576
9780 -211576 -78638 -30962 104859 89394 -13893 -68118 56239 93654 34385 20468 -54712
$$ packed form
9857b8219j00465j86089M0750P5353M9921J8269J58177Q0594k6476r0288q4541
9846i3014r0219p5163J17498Q5923j18098L0922P8494O2382J07599j06789l3822
9835c4287n8619L2832K2055J38810l1686k62890q2684J67970J69696J04034J2456
9824A77687p8141o2162j53976j45545l9151n3855J16340K72101j0206j73884J35000
9813a5792j5663M1953j2665P9478J12332j18650j01609j8170J76648P8036M7842
9802B53740R0688j06023p2520k0286J0655O3196m9979J6452J13158j55868j39071
9791D142K6775L1736O6359k0018j26209k3922j31353J14281K3765j69236p896
9780b11576J32938M7676J35821j5465j03287n4225J24357L7415n9269j3917p5180
$$ plain form
9769 -54712 -112714 -189609 -231744 -138394 -42613 -31190 -139964 -119642 -122684 62451 167942
9758 167942 198722 150407 189219 196774 176115 103016 103041 172414 323517 351214 134520 83237
9746 83237 28693 53532 57789 -1098 51116 88446 47769 23162 71003 91426 22579 26500
9734 26500 98394 51820 -18404 -227285 -381865 -251604 -115990 -32296 27431 -31780 -135618
9723 -135618 164440 112909 -17625 58606 6732 130104 315938 273662 -18938 -41765 127256
9712 127256 89373 -53759 -16318 54712 16851 90348 155251 5661 -3933 -3501 -135447 -232456
9700 -232456 -218840 -240819 -244002 -189672 -180592 -50027 72723 101366 4463 -91627 -105082 -200576
9688 -200576 -160914 42726 265185 150878 57592 55669 -34567 -147816 -178675 -168493 -80105
$$ packed form
9769e4712n8002p6895m2135R3350R5781J1423j08774K0322l042J85135J05491
9758A67942L0780m8315L8812P555k0659p3099K5O9373J51103K7697k16694n1283
9746H3237n4544K4839M257n8887N2214L7330m0677k4607M7841K0423o8847L921
9734B6500P1894m6574p0224k08881j54580J30261J35614Q3694N9727n9211j03838
9723a35618L00058n1531j30534P6231n1874J23372J85834m2276k92600k2827J69021
9712A27256l7883j43132L7441P1030l7861P3497O4903j49590r594M32j31946r7009
9700b32456J3616k1979l183N4330R080J30565J22750K8643r6903r6090j3455r5494
9688b00576L9662K03640K22459j14307r3286j923r0236j13249l0859J0182Q8388
$$ plain form
9677 -80105 -60076 -203544 -287993 -299855 -194678 -228727 -257863 -197484 -225531 -313723 -445445
9666 -445445 -330690 5335 77038 82708 130294 265201 171624 99154 163983 164062 289331 345664
9654 345664 296654 265783 401610 365427 205024 176389 123417 126832 135585 112126 78773 30176
9642 30176 11255 -3024 -65973 -97698 -8988 52334 195941 200490 153171 233486 189389 220674
9630 220674 299466 239491 51312 -25474 -221649 -53454 -66633 -92307 -32878 -187344 -212425
9619 -212425 -87221 -124645 -124346 -132303 -74081 -233400 -269881 -254720 -155740 -130580 54590 104962
9607 104962 143497 2519 -18864 161798 211104 26317 41220 -22662 -104162 -197750 -142715
9596 -142715 -47945 21152 19646 57422 91796 122283 207795 129976 20015 -20511 -37100 -171060
$$ packed form
9677h0105K0029j43468q4449j1862J05177l4049k9136O0379k8047q8192j31722
9666d45445J14755L36025P1703N670M7586J34907r3577p2470O4829P9J25269N6333
9654C45664m9010l0871J35827l6183j60403k8635n2972L415Q753k3459l3353m8597
9642C0176j8921j4279o2949l1725Q8710O1322J43607M549m7319Q0315m4097L1285
9630B20674P8792n9975j88179p6786j96175J68195j3179k5674N9429j54466k5081
9619b12425J25204l7424K99p957N8222j59319l6481J5161R8980K5160J85170N0372
9607A04962L8535j40978k1383J80662M9306j84787J4903o3882q1500r3588N5035
9596a42715R4770O9097j506L7776L4374L0487Q5512p7819j09961m0526j6589j33960
$$ plain form
9584 -171060 -28323 33180 103448 -36426 -176968 -14818 69139 12014 -35273 -3153 6500
9573 6500 9830 110409 227503 126483 68839 -75678 -270159 -233976 -151382 -107897 -70356
9562 -70356 36210 18131 -10904 29511 -155651 -257983 -190852 -78448 -5135 -48626 -133926
9551 -133926 -204890 2603 87472 -29739 -69086 -41480 -192497 -215590 27663 126517 -137903
9540 -137903 -336102 -176904 -213924 -299664 -403059 -364508 -354094 -291549 -128589 -267680 -352943
9529 -352943 -259186 -8432 76033 105 26929 139376 278150 310867 251215 131986 87233
9518 87233 43914 18584 -35697 -106564 27824 38891 31436 132709 61338 106336 11241 -71042
9506 -71042 -39728 141159 107476 94481 134321 98881 71313 61196 122523 91287 63787 180929
$$ packed form
9584a71060J42737O1503P0268j39874j40542J62150Q3957n7125m7287L2120R653
9573F500L330J00579J17094j01020n7644j44517j94481L6183Q2594M3485L7541
9562g0356J06566j8079k9035M0415j85162j02332O7131J12404P3313m3491q5300
9551a33926p0964K07493Q4869j17211l9347K7606j51017k3093K43253R8854k64420
9540a37903j98199J59198l7020q5740j03395L8551J0414O2545J62960j39091q5263
9529c52943R3757K50754Q4465p5928K6824J12447J38774L2717n9652j19229m4753
9518H7233m3319k5330n4281p0867J34388J1067p455J01273p1371M4998r5095q2283
9506g1042L1314J80887l3683j2995L9840l5440k7568j0117O1327l1236k7500J17142
$$ plain form
9494 180929 317693 89305 -46879 -56640 -200099 -69863 152466 81921 -68074 55423
9484 55423 123546 214753 300735 347401 361802 263991 3329 -89689 -75934 -42283 -35873 103843
9472 103843 94308 -18170 -63802 -76340 -105102 -145600 -153397 -213010 -244225 -161488 -244969 -122400
9460 -122400 -69287 -84463 -74379 -1810 63514 163684 149945 54751 -19799 -165617 -216790
9449 -216790 -76064 119520 76016 154452 84736 55370 81444 90982 14845 111990 133687
9438 133687 127045 215876 18277 -135385 -197330 -72233 -47807 -40365 -75385 -73301 -34221 87361
9426 87361 173843 215255 107901 -95124 -91287 -137006 -145099 -198299 -332455 -268172 -113440
9415 -113440 43375 210467 266139 217876 119976 17374 -35596 74971 142711 238606 146696
$$ packed form
9494A80929J36764k28388j36184r761j43459J30236K22329p0545j49995J23497
9484E5423O8123R1207Q5982M6666J4401r7811k60662r3018J3755L3651O410J39716
9472A03843r535j12478m5632j2538k8762m0498p797n9613l1215Q2737q3481J22569
9460a22400N3113j5176J0084P2569O5324J00170j3739r5194p4550j45818n1173
9449b16790J40726J95584m3504P8436o9716k9366K6074R538p6137R7145K1697
9438A33687o642Q8831j97599j53662o1945J25097K4426P442l5020K084L9080J21582
9426H7361Q6482M1412j07354k03025L837m5719q093n3200j34156O4283J54732
9415a13440J56815J67092N5672m8263r7900j02602n2970J10567O7740R5895r1910
$$ plain form
9404 146696 38510 52788 37116 -98544 -157909 12019 16762 22837 -34683 -104784 -7347
9393 -7347 20447 11666 49596 -85099 -281637 -152985 -86083 -47097 -16891 23903 -20514 7771
9381 7771 -151728 -351858 -237905 -83401 -31515 -46810 -113192 -51571 11763 64919 93733
9370 93733 31704 -134651 -242812 -196780 -127775 -181207 -169523 -301373 -301160 -289240 -299209 -219356
9358 -219356 -94638 -66530 -110192 -96498 -117738 -99485 -19898 27494 -93714 22531 -14130
9347 -14130 -74299 94757 144201 30668 -128529 -246953 -238021 -234192 -301264 -265132 -105754
9336 -105754 20984 -28569 30593 49487 106235 224390 255270 7367 -208638 -143003 22595
9325 22595 74940 10143 -25226 33329 41520 -133589 -148094 -69549 -24622 -6379 199547 272158
$$ packed form
9404A46696j08186J4278j5672j35660n9365J69928M743O075n7520p0101R7437
9393g347K7794q781L7930j34695j96538J28652O6902L8986L0206M0794m4417K8285
9381G771j59499k00130J13953J54504N1886j5295o6382O1621O3334N3156K8814
9370I3733o2029j66355j08161M6032O9005n3432J1684j31850K13J1920r969P9853
9358b19356J24718K8108m3662J3694k1240J8253P9587M7392j21208J16245l6661
9347a4130o0169J69056M9444j13533j59197j18424Q932L829o7072L6132J59378
9336a05754J26738m9553N9162J8894N6748J18155L0880k47903k16005O5635J65598
9325B2595N2345o4797l5369N8555Q191j75109j4505P8545M4927J8243K05926P2611
$$ plain form
9313 272158 216642 307258 421372 417133 337923 342395 346205 135201 22821 99162 365288
9302 365288 183506 112438 200793 253229 238156 294943 250101 105552 7323 66202 218464
9291 218464 140690 111669 41034 18473 162898 217835 143558 85835 144102 169199 161928 198107
9279 198107 287644 383843 390487 265643 83875 -95820 -105689 -180794 -90511 44480 -76305
9268 -76305 13726 278433 439746 356977 278850 288286 58495 77187 126786 196210 18564
9257 18564 -252045 -203054 -208954 -426527 -388266 -199915 -136819 -23965 1289 -32008 -157363
9246 -157363 -143884 -37685 -4542 -17670 -88492 -153230 -32594 2479 67861 206591 213083
9235 213083 198027 348018 457355 244143 138100 154326 45741 -147148 -219291 -148854
$$ packed form
9313B72158n5516R0616J14114m239p9210M472L810k11004j12380P6341K66126
9302C65288j81782p1068Q8355N2436j5073N6787m4842j44549r8229N8879J52262
9291B18464p7774k9021p0635k2561J44425N4937p4277n7723N8267K5097p271L6179
9279A98107Q9537R6199O644j24844j81768j79695r869p5105R0283J34991j20785
9268g6305R0031K64707J61313q2769p8127R436k29791J8692M9599O9424j77646
9257A8564k70609M8991n900k17573L8261J88351O3096J12854K5254l3297j25355
9246a57363J3479J06199L3143j3128p0822o4738J20636L5073O5382J38730O492
9235B13083j5056J49991J09337k13212j06043J6226j08585j92889p2143P0437
$$ plain form
9225 -148854 -57802 49837 95051 189663 50115 -184311 -229562 -48719 81971 177441 247225
9214 247225 167337 124548 43859 95358 -131192 36421 125525 16242 -39932 84193 149310
9203 149310 140081 -22704 -146434 -172023 27460 101539 22990 -128333 -188250 -108684 -97807
9192 -97807 -99934 -67539 -22338 -3600 -32888 -64012 45684 189752 323669 283296 183310
9181 183310 -41536 -50147 -77268 -51041 -122300 -249201 -15384 92588 208048 112941 167716
9170 167716 -4352 -157752 -87938 -80370 79806 -45902 -122572 -85229 -45550 -111231 -56412
9159 -56412 -137704 -101301 52249 88688 146380 120655 99947 129757 210679 320911 149209
9148 149209 115319 -47783 51663 159598 256693 186303 -51247 -133876 8251 -4496 112410
$$ packed form
9225a48854R1052J07639M5214R4612j39548k34426m5251J80843J30690R5470O9784
9214B47225p9888m2789q0689N1499k26550J67613Q9104j09283n6174J24125O5117
9203A49310r229j62785j23730k5589J99483P4079p8549j51323n9917P9566J0877
9192i7807k127L2395M5201J8738k9288l1124J09696J44068J33917m0373r9986
9181A83310k24846q611k7121K6227p1259j26901K33817J07972J15460r5107N4775
9170A67716j72068j53400O9814P568J60176j25708p6670L7343L9679o5681N4819
9159e6412q1292L6403J53550L6439N7692k5725k0708K9810Q0922J10232j71702
9148A49209l3890j63102R9446J07935R7095p0390k37550q2629J42127j2747J16906
$$ plain form
9137 112410 97346 -7455 111902 145512 188729 161489 233764 228192 -15387 -61080 39540
9126 39540 71476 -36550 39723 200538 107160 78830 45719 -41598 -152963 -292565 -200752
9115 -200752 -61221 71935 -94262 -360615 -347569 -308995 -108354 -45327 -326797 -329224 -370538
9104 -370538 -272209 -33846 101003 49430 142228 365554 393949 111425 89667 307341 452087
9093 452087 451459 332308 255524 261934 152904 18592 15200 -37060 -109398 -11276 -45630 -61738
9081 -61738 19752 89306 18982 28713 -72466 -196596 -146488 -216442 -276642 -413780 -365261
9070 -365261 -209655 -43386 34253 109101 55876 151474 304553 32029 -196682 -54812
9060 -54812 79678 155752 143540 -80591 -132878 -58495 23445 183461 133964 113351 17096
$$ packed form
9137A12410j5064j04801J19357L3610M3217k7240P2275n572k43579m5693J00620
9126C9540L1936j08026P6273J60815r3378k8330l3111q7317j11365j39602R1813
9115b00752J39531J33156j66197k66353J3046L8574K00641O3027k81470k427m1314
9104c70538R8329K38363J34849n1573R2798K23326K8395k82524k1758K17674J44746
9093D52087o28j19151p6784O410j09030j34312l392n2260p2338R8122l4354j6108
9081f1738Q1490O9554p0324R731j01179j24130N0108o9954o0200j37138M8519
9070c65261J55606J66269P7639P4848n3225R5598J53079k72524k28711J41870
9060e4812J34490P6074j2212k24131n2287P4383Q1940J60016m9497k0613r6255
$$ plain form
9049 17096 -71998 51915 89658 143463 76310 58682 99638 180365 107094 -69949 -87219
9038 -87219 -106021 62226 205442 112393 94142 77750 34595 13422 -41032 -67833 -87625
9027 -87625 -201961 -98509 -57248 -153336 -105212 -110254 3254 -28050 -302895 -368066 -265520
9016 -265520 -80003 25833 35948 -53959 -80942 -13526 74115 82116 67029 52327 44298 -47046
9004 -47046 11517 99671 130063 32277 -91859 -13635 111627 223041 266415 276749 128496
8993 128496 38137 119737 157508 120267 52533 105232 195165 103665 70152 52178 51081 196186
8981 196186 262371 274755 180852 221364 147511 66274 161425 203262 208839 254587 160803 147783
8969 147783 53373 18120 -85527 8711 35343 -88519 -66675 -2207 66954 207529 182835
$$ packed form
9049A7096q9094J23913L7743N3805o7153j7628M0956Q0727p3271j77043j7270
9038h7219j8802J68247J43216r3049j8251j6392m3155k1173n4454k6801j9792
9027h7625j14336J03452M1261r6088M8124n042J13508l1304k74845o5171J02546
9016b65520J85517J05836J0115q9907k6983O7416Q7641Q001j5087j4702q029r1344
9004d7046N8563Q8154L0392r7786j24136P8224J25262J11414M3374J0334j48253
8993A28496r0359Q1600L7771l7241o7734N2699Q9933r1500l3513j7974j097J45105
8981A96186O6185J2384r3903M0512p3853q1237R5151M1837N577M5748r3784j3020
8969A47783r4410l5253j03647R4238K6632j23862K1844O4468O9161J40575k4694
$$ plain form
8958 182835 66987 -22794 -12106 137857 99152 75424 127331 98584 -54569 -118662 -123795
8947 -123795 -64797 179315 347760 308352 293821 220446 216127 68532 17833 18051 -32238 -111970
8935 -111970 -79923 -128480 28332 51224 72181 48528 -228423 -374338 -265855 -149848 -41659
8924 -41659 139442 245449 112371 16052 -14108 10997 159553 388391 350245 311242 222788
8913 222788 147374 116309 86412 44924 -63234 -69325 -99687 -52421 76077 79265 113332 192014
8901 192014 162801 189185 92733 -37924 36851 48568 -127627 -267457 -233258 -229448 -203388
8890 -203388 -142890 -107485 -87288 -227312 -352802 -211896 17743 31943 99732 148454 173609
8879 173609 122031 140090 245906 290610 80735 -21702 -111376 -59670 43711 -59705 -93255
$$ packed form
8958A82835j15848q9781J0688J49963l8705k3728N1907k8747j53153o4093n133
8947a23795N8998K44112J68445l9408j4531p3375m319j47595n0699K18n0289p9732
8935a11970L2047m8557J56812K2892K0957k3653k76951j45915J08483J16007J08189
8924d1659J81101J06007j33078r6319l0160K5105J48556K28838l8146l9003q8454
8913B22788p5414l1065k9897m1488j08158o091l0362M7266J28498L188L4067P8682
8901A92014k9213K6384r6452j30657P4775J1717j76195j39830L4199L810K6060
8890b03388O0498L5405K0197j40024j25490J40906K29639J4200O7789M8722K5155
8879A73609n1578J8059J05816M4704k09875j02437q9674N1706J03381j03416l3550
$$ plain form
8868 -93255 -55658 -90866 -47396 15094 40920 36174 -112921 -185994 -90002 -91295 -85367 -168382
8856 -168382 -383471 -252512 -143041 -164379 -202474 -123185 -122970 -179724 -179590 -106463 13068 16433
8844 16433 -101804 -230784 -255730 -211489 -166613 -264581 -218190 -115450 -25272 -91209 -117618
8833 -117618 -98614 -127896 -120957 -27989 108821 33813 31365 136838 75444 3104 172343
8822 172343 155681 -54106 -150632 -240080 -132521 -86828 -82818 -185998 -188473 -159300 -117260
8811 -117260 106331 88846 -90386 -142735 -172429 -5874 106546 115524 119667 94525 -21886
8800 -21886 -61034 12558 -28044 -99519 53596 -87355 -231148 -206696 -169624 23127 180634
8789 180634 148666 15842 -9423 92428 159394 268017 232621 196748 42333 -171886 -215208
$$ packed form
8868i3255L7597l5208M3470O2490K5826m746j49095p3073R5992j293N928q3015
8856a68382k15089J30959J09471k1338l8095P9289K15n6754J34P3127J19531L365
8844A6433j18237j28980k4946M4241M4876r7968M6391J02740R0178o5937k6409
8833a17618J9004k9282O939R2968J36810p5008k448J05473o1394p2340J69239
8822A72343j6662k09787r6526q9448J07559M5693M010j03180k475K9173M2040
8811a17260K23591j7485j79232n2349k9694J66555J12420Q978M143k5142j16411
8800b1886l9148P3592m0602p1475J53115j40951j43793K4452L7072J92751J57507
8789A80634l1968j32824k5265J01851O6966J08623l5396l5873j54415k14219m3322
$$ plain form
8778 -215208 -101964 24083 141458 153773 154518 67063 46208 24021 -11760 181552 185043
8767 185043 145280 80955 18969 -50264 -73011 68653 186715 225341 163109 98126 88259
8756 88259 143320 113980 -47253 -185234 -318405 -307316 -109146 -45837 -30197 145146 206495
8745 206495 170777 263554 123867 68501 147287 148426 247158 230874 100661 -11897 -138241
8734 -138241 -82527 70690 215422 204966 21894 -93088 -76443 -58212 -287443 -443513
8724 -443513 -362616 -283987 -282598 -86017 176639 83368 -49913 7104 20761 -103024 -261194
8713 -261194 -130875 -162860 -123777 -44509 -100317 -293071 -319172 -25218 87574 29403 -85603
8702 -85603 -239094 -147535 -173148 -132059 147545 179450 141509 90952 214355 201704 235072
$$ packed form
8778b15208J13244J26047J17375J2315P45q7455k0855k2187l5781J93312L491
8767A85043l9763o4325o1986o9233k2747J41664J18062L8626o2232o4983r867
8756H8259N5061k9340j61233j37981j33171J1089J98170O3309J5640J75343O1349
8745B06495l5718R2777j39687n5366P8786J139R8732j6284j30213j12558j26344
8734a38241N5714J53217J44732j0456j83072j14982J6645J8231k29231j56070
8724d43513Q0897P8629J389J96581K62656r3271j33281N7017J3657j23785j58170
8713b61194J30319l1985L9083P9268n5808j92754k6101K93954J12792n8171j15006
8702h5603j53491R1559k5613M1089K79604L1905l7941n0557J23403j2651L3368
$$ plain form
8691 235072 56410 80961 150792 244997 44315 -95699 -169442 -239409 -176883 -115709 42070
8680 42070 114618 66093 7713 12104 -101755 -95343 -267934 -229546 -195073 -204370 -103292 -8278
8668 -8278 -10912 -5577 -20369 -487 106055 56267 100938 189923 86521 57906 120649 102520
8656 102520 170037 190715 220042 169895 -67882 -140018 -26635 28681 -84569 -47078 191478
8645 191478 191852 -34426 -227770 -224587 -118102 -27140 -145505 -167003 -198156 -222491 -170692
8634 -170692 -193724 -240059 -287399 -140898 25831 -24559 -156630 -235619 -302868 -288504 -213183
8623 -213183 -112144 29145 240690 324313 287292 185349 -20587 -280121 -305706 -270307
8613 -270307 -129250 -47852 -120605 -54918 92392 19030 -31910 14059 4747 -130641 -174386
$$ packed form
8691B35072j78662K4551O9831R4205k00682j40014p3743o9967O2526O1174J57779
8680D2070P2548m8525n8380M391j13859O412j72591L8388L4473r297J01078R5014
8668h278k634N335j4792J9882J06542m9788M4671Q8985j03402k8615O2743j8129
8656A02520O7517K0678K9327n0147k37777p2136J13383N5316j13250L7491K38556
8645A91478L74k26278j93344L183J06485R0962j18365k1498l1153k4335N1799
8634a70692k3032m6335m7340J46501J66729n0390j32071p8989o7249J4364P5321
8623b13183J01039J41289K11545Q3623l7021j01943k05936k59534k5585L5399
8613b70307J41057Q1398p2753O5687J47310p3362n0940M5969r312j35388m3745
$$ plain form
8602 -174386 -202347 -175636 -224407 -230495 -74364 111332 197695 97168 -80602 -21518 192517
8591 192517 55774 10134 -477 -83436 43408 48861 49386 2507 -69994 -296189 -296968 -28306
8579 -28306 42686 43132 13201 69883 171040 170517 55608 -89593 -280865 -239601 -109800 -201215
8567 -201215 -62700 107301 185343 179242 146496 -24194 -174931 -107674 -13333 76654 134278
8556 134278 22791 -112296 -127566 -106727 27245 117634 217908 196766 -121858 -195481 40501
8545 40501 163140 12075 -51731 -168836 -9196 -38510 -27129 35802 -147430 -249507 -328905
8534 -328905 -320138 -250135 -270511 -152357 -136349 -226492 -170114 -161253 -351637 -442421 -243957
8523 -243957 -9011 171439 -62209 -85554 -84004 -32060 -68076 -76276 -76054 -137174 -112280 -45716
$$ packed form
8602a74386k7961K6711m8771o088J56131J85696Q6363j00527j77770N9084K14035
8591A92517j36743m5640j0611q2959J26844N453N25m6879p2501k26195p79K68662
8579b8306P0992M46k9931N6682J01157n23j14909j45201j91272M1264J29801r1415
8567b01215J38515J70001P8042o101l2746j70690j50737O7257R4341Q9987N7624
8556A34278j11487j35087j5270K0839J33972R0389J00274k1142l18624p3623K35982
8545D0501J22639j51065o3806j17105J59640k9314J1381O2931j83232j02077p9398
8534c28905Q767P0003k0376J18154J6008r0143N6378Q861j90384r0784J98464
8523b43957K34946J80450k33648k3345J550N1944l6016q200K22o1120K4894O6564
$$ plain form
8511 -45716 108044 190237 174851 112333 6499 -126173 2736 119741 -121757 -188324 24563
8500 24563 81987 -158328 -220010 -60903 36576 187958 163496 -19220 -89571 -54602 80409
8489 80409 4421 -193485 -221064 -232398 -226212 -166019 -204405 -218150 -199407 -106783 46966 157517
8477 157517 -45142 -77238 -78251 -88705 -74434 -45621 -30505 51131 108350 176601 136512 148787
8465 148787 143224 204835 356891 451580 203921 -31540 -141517 -91587 -49255 -54629 -77514
8454 -77514 -97341 -111903 27231 166245 221808 334025 232613 197602 161350 45467 134120
8443 134120 270384 294096 217328 223669 314130 356542 273972 285866 313838 211291 173040
8432 173040 97767 43742 -41166 -2671 -85662 9290 120713 14622 18063 55488 176985
$$ packed form
8511d5716J53760Q2193j5386o2518j05834j32672J28909J17005k41498o6567K12887
8500B4563N7424k40315o1682J59107R7479J51382k4462j82716p0351L4969J35011
8489H0409p5988j97906k7579j1334O186O0193l8386j3745J8743R2624J53749J10551
8477A57517k02659l2096j013j0454J4271K8813J5116Q1636N7219O8251m0089J2275
8465A48787n563O1611J52056R4689k47659k35461j09977M9930M2332n374k2885
8454g7514j9827j4562J39134J39014N5563J12217j01412l5011l6252j15883Q8653
8443A34120J36264K3712p6768O341R0461M2412q2570J1894K7972j02547l8251
8432A73040p5273n4025q4908L8495q2991R4952J11423j06091L441L7425J21497
$$ plain form
8421 176985 152552 -3432 -28451 -87693 -109972 -157629 -6923 -113869 -150841 -161187 -192820
8410 -192820 -150113 64278 162162 14895 -11228 -119218 -302265 -214539 -172514 -30200 209604
8399 209604 297931 185262 147939 198791 155864 -78140 -14321 96565 105257 -148651 -170275
8388 -170275 7261 68229 18013 -47396 5423 276 90305 126639 59789 -137012 10388
8377 10388 47756 100641 87064 77539 -91134 -100866 37 -13902 -79185 -35866 -30180 -27954
8365 -27954 -61983 -77037 -50875 162445 220486 179383 46913 8109 -13382 -12366 -46843 89203
8353 89203 109321 140204 160456 155582 134279 86228 191139 72271 132422 157675 139681 244234
8341 244234 299136 204238 199462 53403 -23155 -124238 -93934 92690 -5645 -71101 -141418
$$ packed form
8421A76985k4433j55984k5019n9242k2279m7657J50706j06946l6972j0346l1633
8410a92820M2707K14391R7884j47267k6123j07990j83047Q7726M2025J42314K39804
8399B09604Q8327j12669l7323N0852m2927k34004O3819J10886Q692k53908k1624
8388a70275J77536O0968n0216o5409N2819n147R0029L6334o6850j96801J47400
8377A0388L7368N2885j3577r525j68673r732J00903j3939o5283M3319N686K226
8365b7954l4029j5054K6162K13320N8041m1103j32470l8804k1491J016l4477J36046
8353H9203K0118L0883K0252m874k1303m8051J04911j18868O0151K5253j7994J04553
8341B44234N4902r4898m776j46059p6558j01083L0304J86624r8335o5456p0317
$$ plain form
8330 -141418 -123655 -198941 -192008 -108833 70283 222920 254794 203018 57174 66079 87977
8319 87977 -38984 -237318 -176910 -111071 3651 -55161 -113137 -142101 -72569 -56759 77378
8308 77378 227762 119892 41378 -104467 -152889 -116373 -209507 -270404 -21246 208537 265069
8297 265069 240015 176625 30887 -173215 -482157 -496193 -209180 28170 73193 33412 -16519
8286 -16519 -17670 36291 72600 134670 -17096 30871 5325 29327 -29362 33463 61849 122976
8274 122976 153408 -34739 -102424 -57604 205247 242389 102683 -32030 3247 -113445 -393860
8263 -393860 -387447 -365053 -339964 -229699 -365529 -495908 -475970 -364295 -57902 -8893 -77045
8252 -77045 -85048 108289 129296 337736 206968 104783 63226 -10516 2541 62208 111567
$$ packed form
8330a41418J7763p5286O933Q3175J79116J52637L1874n1776j45844Q905K1898
8319H7977j26961j98334O0408O5839J14722n8812n7976k8964O9532J5810J34137
8308G7378J50384j07870p8514j45845m8422L6516r3134o0897K49158K29783N6532
8297B65069k5054o3390j45738k04102l08942j4036K87013K37350M5023l9781m9931
8286a6519j151N3961L6309O2070j51766M7967k5546K4002n8689O2825K8386O1127
8274A22976L0432j88147o7685M4820K62851L7142j39706j34713L5277j16692k80415
8263c93860O413K2394K5089J10265j35830j30379J9938J11675L06393M9009o8152
8252g7045q003J93337K1007K08440j30768j02185m1557p3742J3057N9667M9359
$$ plain form
8241 111567 986 39876 288083 278282 302890 300485 300873 307052 167638 -42866 -289963 -266448
8229 -266448 -140092 -86339 -76275 -120909 -116135 -183082 -48154 105389 38889 33374 -18139
8218 -18139 -103792 -109991 -175213 -267936 -199740 -143446 -61203 27572 -70652 75817 88957 204360
8206 204360 296750 119297 -48891 2141 -68287 -49517 -116707 -14135 131870 91972 -18507
8195 -18507 7485 147082 6567 -123839 -109453 -213111 -155184 -216920 -200417 74387 216787
8184 216787 289931 107821 -148814 -285030 -277218 -135580 9531 -18176 -23355 -236597 -248561
8173 -248561 -198054 -240252 -206185 -190595 -185875 -152050 -162815 -151739 -182297 -257028 -321003 -304229
8161 -304229 -118265 -52978 -186294 -166254 -68912 47928 -20677 -92051 -23274 138318 101671
$$ packed form
8241A11567j10581L8890K48207r801K4608k405L88O179j39414k10504k47097K3515
8229b66448J26356N3753J0064m4634M774o6947J34928J53543o6500n515n1513
8218a8139q5653o199o5222r2723O8196N6294Q2243Q8775r8224J46469J3140J15403
8206B04360R2390j77453j68188N1032p0428J8770o7190J02572J46005l9898j10479
8195a8507K5992J39597j40515j30406J4386j03658N7927o1736J6503K74804J42400
8184B16787P3144j82110k56635j36216P812J41638J45111k7707n179k13242j1964
8173b48561N0507m2198L4067J5590M720L3825j0765J1076l0558p4731o3975J6774
8161c04229J85964O5287j33316K0040R7342J16840o8605p1374O8777J61592l6647
$$ plain form
8150 101671 50823 208590 204965 326677 308050 259584 231556 135809 -62056 -156398 -65310
8139 -65310 -23506 -104745 -166714 -233524 -185913 -84644 116177 79564 29612 19050 140382
8128 140382 207157 138512 117365 80830 217431 347803 328917 307640 34189 -5080 316601
8117 316601 549979 428484 220198 105342 230329 310825 188098 -6820 -65452 -133810
8107 -133810 -71584 105543 -10065 -112712 -84071 -136878 -18786 26434 50535 15762 -135420
8096 -135420 -160481 -71630 -74562 115376 181700 27698 -30370 37920 -59458 -93999 -43595
8085 -43595 -2184 64757 -49041 60135 132876 99729 -81906 -166411 -380568 -448219 -410155
8074 -410155 -238840 -152952 5043 62385 24694 20068 19923 78850 6001 -169229 -269784
$$ packed form
8150A01671n0848J57767l625J21712j8627m8466k8028r5747j97865r4342R1088
8139f5310M1804q1239o1969o6810M7611J01269K00821l6613m9952j0562J21332
8128A40382O6775o8645k1147l6535J36601J30372j8886k1277k73451l9269L21681
8117C16601K33378j21495k08286j14856J24987Q0496j22727j94918n8632o8358
8107a33810O2226J77127j15608j02647K8641n2807J18092M5220K4101l4773j51182
8096a35420k5061Q8851k932J89938O6324j54002n8068O8290r7378l4541N0404
8085d3595M1411O6941j13798J09176P2741l3147j81635q4505k14157o7651L8064
8074d10155J71315Q5888J57995N7342l7691m626j45N8927p2849j75230j00555
$$ plain form
8063 -269784 -239141 28883 264775 321668 167380 -34293 31882 108860 63782 -65672 -162166
8052 -162166 -89165 110611 348538 256943 221178 214656 57703 76464 55251 -73855 -138182
8041 -138182 -144212 -196478 -196050 -89498 -78406 -161190 -219185 -217958 -212459 -253019 -137409 -84042
8029 -84042 -76934 -175102 -252885 -170748 -79787 -24320 -115497 -161873 -125724 -157027 18875 48522
8017 48522 -43866 -179217 -192403 -216443 -152351 -228224 -211516 -124744 -139133 -129251 -3306 -30770
8005 -30770 -20424 100833 162840 25144 -130327 -84071 -92959 -74246 -49253 -52288 3656 126226
7993 126226 127488 119799 166403 64681 -150319 -206599 -283015 -271038 -141924 25525 1487
7982 1487 -143750 -126230 121132 3126 -136256 -211954 -261975 -208713 -142990 -116659 -143234
$$ packed form
8063b69784L0643K68024K35892N6893j54288k01673O6175P6978m5078j29454r6494
8052a62166P3001J99776K37927r1595l5765o522j56953J8761k1213j29106o4327
8041a38182o030n2266M28J06552J1092q2784n7995J227N499m0560J15610N3367
8029h4042P108r8168p7783Q2137R0961N5467r1177m6376L6149l1303J75902K9647
8017D8522r2388j35351j3186k4040O4092p5873J6708Q6772j4389R882J25945k7464
8005c0770J0346J21257O2007j37696j55471M6256q888J8713K4993l035N5944J22570
7993A26226J262p689M6604j01722k15000n6280p6416J1977J29114J67449k4038
7982A487j45237J7520K47362j18006j39382p5698n0021N3262O5723K6331k6575
$$ plain form
7971 -143234 -179128 -240437 -181092 39756 -13908 -40579 119837 106155 71273 38884 35632
7960 35632 -13497 -83735 -36544 -33154 -93185 -53279 -62856 -49707 13273 57927 -32069 -116616
7948 -116616 -4289 101382 241570 264224 297065 246299 199358 169745 59188 30970 -112793
7937 -112793 -155381 912 -17021 -104818 -141109 -162740 -13395 52102 49596 43863 41917 15873
7925 15873 48215 -16783 2340 21880 -87210 -174054 -176520 -104403 -230116 -288978 -321503 -157990
7913 -157990 -9562 47441 55595 43759 194611 237102 98296 106740 151053 90785 -52338
7902 -52338 -111538 16158 176856 236052 176610 218173 118111 -59100 -236031 -273860 -228489
7891 -228489 -117672 -58643 17300 78715 112913 -69323 -121626 -68971 -56276 -107491 -66729
$$ packed form
7971a43234l5894o1309N9345K20848n3664k6671J60416j3682l4882l2389l252
7960C5632m9129p0238M7191L390o0031L9906r577J3149O2980M4654q9996q4547
7948a16616J12327J05671J40188K2654L2841n0766m6941k9613j10557k8218j43763
7937a12793m2588J56293j7933q7797l6291k1631J49345O5497k506n733j946k6044
7925A5873L2342o4998J9123J9540j09090q6844k466P2117j25713n8862l2525J63513
7913a57990J48428N7003Q154j1836J50852M2491j38806Q444M4313o0268j43123
7902e2338n9200J27696J60698N9196n9442M1563j00062j77211j76931l7829M5371
7891b28489J10817N9029P5943O1415L4198j82236n2303N2655J2695n1215M0762
$$ plain form
7880 -66729 13964 -115820 -144924 -138829 -211079 -131930 -289050 -291321 -302225 -178432 -200160 -134901
7868 -134901 -126861 20397 94517 194963 211450 239428 200890 -33830 -60271 38152 2529
7857 2529 -124824 -139940 -180766 -82819 -46340 -251330 -219067 -183015 -94757 -101938 -29536 -20184
7845 -20184 62916 130288 95867 47601 -35347 -5947 52478 147911 125441 -62844 33938 148979
7833 148979 202691 98114 7817 42290 43364 -46293 -62205 8356 46365 82928 87828 143316
7821 143316 162809 117181 157213 249820 301141 195432 41012 -193 -16346 146070 69858
7810 69858 40718 64282 -15384 -72871 46725 132165 146832 100545 213909 255711 209199
7799 209199 -2359 9822 84118 121010 -44315 -105930 -134999 -196334 -177080 -66239 14414
$$ packed form
7880f6729Q0693j29784k9104O095p2250P9149j57120k271j0904J23793k1728O5259
7868a34901Q040J47258P4120J00446J6487K7978l8538k34720k6441R8423l5623
7857B529j27353j5116m0826R7947L6479k04990L2263L6052Q8258p181P2402R352
7845b0184Q3100O7372l4421m8266q2948K9400N8425R5433k2470j88285R6782J15041
7833A48979N3712j04577r0297L4473J074q9657j5912P0561L8009L6563M900N5488
7821A43316J9493m5628M0032R2607N1321j05709j54420m1205j6153J62416p6212
7810F9858k9140K3564p9666n7487J19596Q5440J4667m6287J13364M1802m6512
7799B09199k11558J2181P4296L6892j65325o1615k9069o1335J9254J10841Q0653
$$ plain form
7788 14414 -197902 -151239 -113747 -148198 -313608 -422187 -179829 107698 135243 -35747 -194382
7777 -194382 -229264 -264003 -205285 -56158 69479 31059 -38734 -61329 -74108 -56996 -132937
7766 -132937 -94765 79917 71918 147037 180081 146569 222740 404054 310992 68715 100231
7755 100231 -6252 -44344 -145906 -235490 -91881 -50920 -221623 -86470 92672 -27009
7745 -27009 -10945 69558 -42760 179561 335794 363085 297956 151801 144955 293823 256562
7734 256562 273087 91645 197488 183969 -13789 80528 157704 183565 46190 21388 38469
7723 38469 -16553 -196132 -177553 -140233 -247711 -338304 -175016 -1489 17742 170986 231460
7712 231460 256017 189889 -24316 -63033 -111326 -257354 -288536 -206371 -56508 -132218 -9080
$$ packed form
7788A4414k12316M6663L7492l4451j65410j08579K42358K87527K7545j70990j58635
7777a94382l4882l4739N8718J49127J25637l8420o9793k2595j2779J7112p5941
7766a32937L8172J74682p999P5119L3044l3512P6171J81314r3062k42277L1516
7755A00231j06483l8092j01562q9584J43609M0961j70703J35153J79142j19681
7745b7009J6064Q0503j12318K22321J56233K7291o5129j46155o846J48868l7261
7734B56562J6525j81442J05843j3519j97758R4317P7176K5861j37375k4802J7081
7723C8469n5022j79579J8579L7320j07478r0593J63288J73527J9231J53244O0474
7712B31460K4557o6128k14205l8717m8293j46028l1182Q2165J49863p5710J23138
$$ plain form
7701 -9080 167866 111454 -37556 -38663 45049 44574 -117286 -158894 8938 142776 43726 122158
7689 122158 -27228 -111735 -12048 -8285 -31634 84098 187609 96052 3442 -68525 -49293
7678 -49293 5016 -86019 19913 48804 24941 -60307 -48172 -86287 -146655 -123793 -167612 -158888
7666 -158888 -120313 113256 87568 -52091 -54293 -46035 11073 -65926 -56279 -174821 -120912 -15000
7654 -15000 37624 -69877 -17096 100905 171414 130027 118821 -28654 -200221 -237193 -162845
7643 -162845 -232917 -339938 -396506 -364340 -146581 5536 -34713 -56014 179271 281241 377224
7632 377224 293106 132481 173646 340181 432581 232673 252310 161642 -98380 -26352 45673
7621 45673 75535 79402 42947 -19910 -106309 -162544 58234 223894 85959 -46592 -8574
$$ packed form
7701i080J76946n6412j49010j107Q3712m75j61860m1608J67832J33838r9050P8432
7689A22158j49386q4507R9687L763k3349J15732J03511r1557r2610p1967J9232
7678d9293N4309r1035J05932K8891k3863q5248J2135l8115o0368K2862m3819Q724
7666a58888L8575K33569k5688j39659k202Q258N7108p6999R647j18542N3909J05912
7654a5000N2624j07501N2781J18001P0509m1387j1206j47475j71567l6972P4348
7643a62845p0072j07021n6568L2166K17759J52117m0249k1301K35285J01970R5983
7632C77224q4118j60625M1165J66535R2400j99908J9637r0668k60022P2028P2025
7621D5673K9862L867l6455o2857q6399n6235K20778J65660j37935j32551L8018
$$ plain form
7610 -8574 69927 110698 -42495 -49380 89818 124564 108805 135616 152971 126101 -83148 -143287
7598 -143287 39180 160863 61524 151022 177297 11984 -201417 -186539 -55119 59786
7588 59786 88558 15581 -121090 -164123 -121147 -48567 40543 91433 122484 143825 117935 44970
7576 44970 12553 -110501 -25697 -3174 -108304 -145046 -191805 -106223 46249 -42280 -66080
7565 -66080 -62368 -96573 -90531 -42455 -109206 -224420 -205756 -139646 -113076 -60745 -69110 -121831
7553 -121831 -168562 -284686 -269236 -119086 -82770 4526 74125 18780 -187030 -348219 -276775
7542 -276775 -239755 -202445 1007 -102810 -187614 -163602 100274 175750 32895 32039 22682
7531 22682 -115409 -181244 -60723 51367 110588 13051 109773 50347 38537 -17151 -142827
$$ packed form
7610h574P8501M0771j53193o885J39198L4746j5759K6811J7355k6870k09249o0139
7598a43287J82467J21683r9339Q9498K6275j65313k13401J4878J31420J14905
7588E9786K8772p2977j36671m3033M2976P2580Q9110N0890L1051K1341k5890p2965
7576D4970l2417j23054Q4804K2523j05130l6742m6759Q5582J52472q8529k3800
7565f6080L712l4205O042M8076o6751j15214J8664O6110K6570N2331q365n2721
7553a21831m6731j16124J5450J50150L6316Q7296O9599n5345k05810j61189P1444
7542b76775L7020L7310K03452j03817q4804K4012K63876P5476j42855q56r357
7531B2682j38091o5835J20521J12090N9221r7537R6722n9426j1810n5688j25676
$$ plain form
7520 -142827 -352057 -373803 -152920 -43122 3298 -41296 -55019 -128773 -192467 -37344 29420
7509 29420 104584 235822 182672 126383 226831 196309 119895 197034 291962 134158 145437
7498 145437 178523 126818 -31604 12574 277898 415876 248857 229158 259567 56205 -45401
7487 -45401 -32694 -6729 -106415 -374562 -311032 -159645 -117605 -86993 -202792 -199843 -101516
7476 -101516 6866 -2610 83275 60464 136562 201837 145874 207243 263267 101355 114876
7465 114876 35548 -60723 -43787 68600 160192 260938 159299 11146 1736 24923 25179
7454 25179 41905 4106 -127707 -74607 6194 26491 -84437 -26244 -44096 181640 63351
7443 63351 -96834 -129739 -146548 13573 26052 26852 -8459 -51990 106311 128197 221066 115569
$$ packed form
7520a42827k09230k1746K20883J09798M6420m4594j3723p3754o3694J55123O6764
7509B9420P5164J31238n3150n6289J00448l0522p6414P7139R4928j57804J1279
7498A45437L3086n1705j58422M4178K65324J37978j67019j9699L0409k03362j01606
7487d5401J2707K5965r9686k68147O3530J51387M2040L0612j15799K949R8327
7476a01516J08382r476Q5885k2811P6098O5275n5963O1369N6024j61912J3521
7465A14876p9328r6271J6936J12387R1592J00746j01639j48153r410K3187K56
7454B5179J6726l7799j31813N3100Q0801K0297j10928N8193j7852K25736j18289
7443F3351j60185l2905j6809J60121J2479Q00l5311m3531J58301K1886R2869j05497
$$ plain form
7431 115569 -14614 63606 215165 -33069 -263326 -153372 70057 37308 171312 89010
7421 89010 33864 -97793 -256735 -427022 -377753 -214001 -175694 -32501 93276 123366 -23236
7410 -23236 -231375 -177353 3139 128490 95932 23198 13722 236501 265256 283875 268044
7399 268044 148943 10107 -79265 -6494 -45712 -161264 -139228 -55688 36285 140192 -112544
7388 -112544 -239089 -38792 -155978 -56397 -2628 113126 217280 53944 154901 147731
7378 147731 88937 122815 200847 261398 226923 144308 112693 187350 12273 -221840 -182311
7367 -182311 -52971 82174 100416 61282 -1365 64591 61456 -88229 -24852 58454 191261
7356 191261 224486 258083 196013 -21923 34570 97976 195005 67382 128670 181143 89516
$$ packed form
7431A15569j30183P8220J51559k48234k30257J09954K23429l2749J34004q2302
7421H9010n5146j31657j58942j70287M9269J63752L8307J43193J25777L0090j46602
7410b3236k08139N4022J80492J25351l2558p2734r476K22779K8755J8619j5831
7399B68044j19101j38836q9372P2771l9218j15552K2036Q3540R1973J03907k52736
7388a12544j26545K00297j17186R9581N3769J15754J04154j63336J00957p170
7378A47731n8794L3878P8032O0551l4475q2615l1615P4657j75077k34113L9529
7367a82311J29340J35145J8242l9134o2647O5956l135j49685O3377Q3306J32807
7356A91261L3225L3597o2070k17936N6493O3406R7029j27623O1288N2473r1627
$$ plain form
7345 89516 -36940 -53107 915 7814 -15099 -33840 -163584 -250525 -62885 55457 92346
7334 92346 147880 202001 259788 190703 269298 232221 136537 271496 241597 54863 117323
7323 117323 169280 113027 255560 209811 57985 84428 -16965 6372 62515 237276 130128
7312 130128 37632 -46303 1387 93539 196060 216039 159334 103192 142990 256687 162234
7301 162234 78413 -22412 52177 62082 56866 -106960 -171409 -197882 -268689 -222004 -154372 -50574
7289 -50574 194872 175878 137711 61749 56994 -109693 -96918 -93452 106460 127031 14509
7278 14509 -26260 50287 -45578 -81436 -232986 -321218 -209484 -87626 22365 -7303 105715
7267 105715 163135 15152 -44377 -66432 -41201 -21787 -17133 143778 185484 88231 53306
$$ packed form
7345H9516j26456j6167N4022O899k2913j8741j29744q6941J87640J18342L6889
7334I2346N5534N4121N7787o9085P8595l7077r5684J34959k9899j86734O2460
7323A17323N1957n6253J42533m5749j51826K6443j01393K3337N6143J74761j07148
7312A30128r2496q3935M7690R2152J02521J9979n6705n6142L9798J13697r4453
7301A62234q3821j00825P4589R905n216j63826o4449k6473p0807M6685O7632J03798
7289e0574K45446j8994l8167p5962m755j66687J2775L466J99912K0571j12522
7278A4509m0769P6547r5865l5858j51550q8232J11734J21858J09991k9668J13018
7267A05715N7420j47983n9529k2055K5231J9414M654J60911M1706r7253l4925
$$ plain form
7256 53306 136269 236326 149746 102656 111682 31783 113169 35752 99290 -1380 56122 81872
7244 81872 -13235 -87437 27151 -4042 6889 -9833 -55583 -37898 12250 -143235 -422316
7233 -422316 -385622 -261100 -140657 -1275 139683 -10975 -134280 -66984 -98114 -134663
7223 -134663 -265535 -263179 -140364 175188 255001 138493 88895 20409 -82481 -66705 -79546
7212 -79546 -32385 -123758 -139952 -129882 -124719 -42405 156000 172212 68446 79141 45787 -73076
7200 -73076 -32188 25182 144899 104255 -53592 -71671 -36778 -249386 -247784 -307716 -265776
7189 -265776 -6092 -10949 -111982 -89746 36107 -68720 -9175 62226 23850 91259 49069
7178 49069 -75518 -118832 -161124 -167746 -97382 -17182 45864 90233 -62859 35168 28496 -93725
$$ packed form
7256E3306Q2963J00057q6580m7090R026p9899Q1386p7417O3538j00670N7502K5750
7244H1872r5107p4202J14588l1193J0931j6722m5750J7685N0148j55485k79081
7233d22316L6694J24522J20443J39382J40958j50658j23305O7296l1130l6549
7223a34663j30872K356J22815L15552P9813j16508m9598o8486j02890J5776j2841
7212g9546M7161r1373j6194J0070N163Q2314J98405J6212j03766J0695l3354j18863
7200g3076M0888N7370J19717m0644j57847j8079L4893k12608J602n9932M1940
7189b65776K59684m857j01033K2236J25853j04827N9545P1401l8376O7409m2190
7178D9069j24587m3314m2292o622P0364Q0200O3046M4369j53092R8027o672j22221
$$ plain form
7166 -93725 -35502 26689 -40796 -147671 -183772 -180978 -219088 -261259 -348691 -398138 -313718 -313652
7154 -313652 -224874 -252287 -56503 18237 -63401 -191746 -278724 -160043 11624 84928 56177
7143 56177 -23475 92175 -14180 -98264 -128279 -263733 -182282 -42518 51769 145138 124195
7132 124195 98203 -23899 -59022 15510 25702 -84262 -223885 -144438 153963 145345 15149
7121 15149 -101961 -131540 -161633 -14226 -35666 -118820 -183001 -164425 -115341 62062 194849
7110 194849 253824 91026 156445 120385 118258 191887 12703 -102360 -12249 13100 -60442
7099 -60442 232978 260220 220482 57467 -114558 -158735 -239346 -429778 -487468 -182140 9284
7088 9284 35008 105941 161357 51320 -11814 154758 311087 281265 194069 202677 181286 106633
$$ packed form
7166i3725N8223O2191o7485j06875l6101K794l8110m2171q7432m9447Q4420O6
7154c13652Q8778k7413J95784P4740q1638j28345q6978J18681J71667P3304k8751
7143E6177p9652J15650j06355q4084l0015j35454Q1451J39764R4287R3369k0943
7132A24195k5992j22102l5123P4532J0192j09964j39623P9447K98401q618j30196
7121A5149j17110k9579l0093J47407k1440q3154o4181J8576M9084J77403J32787
7110A94849N8975j62798O5419l6060k127P3629j79184j15063R0111K5349p3542
7099f0442K93420K7242l9738j63015j72025m4177q0611j90432n7690L05328J91424
7088I284K5724P0933N5416j10037o3134J66572J56329k9822q7196Q608k1391p4653
$$ plain form
7076 106633 65761 -164139 -229510 -226209 18838 100248 168474 223022 242859 312917 18857
7065 18857 5481 -26184 59212 128517 229618 194160 139876 61786 3633 18189 49478 96906
7053 96906 46482 93173 45297 -75078 -82293 -20969 31613 71234 72762 27398 24918 -117093
7041 -117093 -150637 -64468 -152731 -87183 -142778 -280131 -189925 -37641 156179 274716 147439
7030 147439 -48233 6797 26274 28850 -7706 -58814 -74459 3815 -123033 -145984 -68326
7019 -68326 55693 165105 156790 81393 145026 55169 703 8557 127651 116558 -40519
7008 -40519 -140050 -171291 -86692 -16534 -126937 -125604 -15221 -67491 -89905 -106150 -40786 73738
6996 73738 -6218 43318 -72286 -200193 -163400 -55729 -97474 -76727 108475 199321 174787
$$ packed form
7076A06633m0872k29900o5371L301K45047Q1410O8226N4548J9837P0058k94060
7065A8857j3376l1665Q5396O9305J01101l5458n4284p8090n8153J4556L1289M7428
7053I6906n0424M6691m7876j20375p215O1324N2582L9621J528m5364k480j42011
7041a17093l3544Q6169q8263O5548n5595j37353R0206J52284J93820J18537j27277
7030A47439j95672N5030J9477K576l6556n1108j5645P8274j26848k2951P7658
7019f8326J24019J09412q315p5397O3633q9857n4466P854J19094j1093j57077
7008d0519r9531l1241Q4599P0158j10403J333J10383n2270k2414j6245O5364J14524
6996G3738p9956M9536j15604j27907L6793J07671m1745K0747J85202R0846k4534
$$ plain form
6985 174787 115232 180138 205147 307790 232680 118306 -117559 -237480 -214894 -94706 -81041
6974 -81041 -1513 -42180 -14195 -12134 79250 127257 172292 127147 300979 295625 276361 78437
6962 78437 -59940 -79773 -5246 -136230 -244095 -89265 56007 -120764 -150202 -87433 -68641
6951 -68641 -21859 198879 293100 222082 147233 17623 -62936 -6308 -155060 -232207 -304710
6940 -304710 -332138 -276831 -167004 -93314 -36 69772 232995 178678 121618 74771 12509
6929 12509 -32709 -82563 -36400 88445 386443 451130 142724 168979 410239 545252 325643
6918 325643 120381 61461 -129042 -127682 86371 228754 359680 547461 412525 165723
6908 165723 -66153 38905 110533 -77273 -47268 88732 29546 -167876 -296377 -186709
$$ packed form
6985A74787n9555O4906K5009J02643p5110j14374k35865j19921K2586J20188J3665
6974h1041P9528m0667K7985K061R1384M8007M5035m5145J73832n354j9264j97924
6962G8437j38377j9833P4527j30984j07865J54830J45272j76771k9438O2769J8792
6951f8641M6782K20738R4221p1018p4849j29610q0559N6628j48752p7147p2503
6940c04710k7428N5307J09827P3690R3278O9808J63223n4317n7060m6847o2262
6929A2509m5218m9854M6163J24845K97998O4687l08406K6255K41260J35013k19609
6918C25643k05262n8920j90503J360K14053J42383J30926J87781j34936k46802
6908A65723k31876J05058P1628j87806L0005J36000n9186j97422j28501J09668
$$ plain form
6898 -186709 -113574 -24844 -43457 4463 218854 193070 95329 101455 114187 55486 -7659 -240100
6886 -240100 -124210 -52039 -166669 -179449 -169874 15311 106988 103923 96270 197685 121523
6875 121523 147773 142173 -49082 -212705 -311729 -259482 -164937 -29815 -93005 -141083 -134344
6864 -134344 -159758 99385 -18632 -230448 -201452 -275452 -346746 -259425 -79350 -24205 71012
6853 71012 124290 104838 84013 -97685 -8156 204314 127121 -142675 -128608 -82876 -27341
6842 -27341 200961 215656 76723 152978 273822 74189 -83191 12178 22729 97031 110746
6831 110746 50536 21774 -41718 -51704 -44445 -240677 -324590 -281351 -257437 -235320 -161051 -165788
6819 -165788 -114175 -133435 -85311 -154002 -178323 -81934 -213979 -323104 -327528 -256490 -226368
$$ packed form
6898a86709P3135Q8730j8613M7920K14391k5784r7741O126J2732n8701o3145k32441
6886b40100J15890P2171j14630j2780R575J85185R1677l065p653J01415p6162
6875A21523K6250n600j91255j63623r9024N2247R4545J35122o3190m8078O739
6864a34344k5414K59143j18017k11816K8996p4000p1294Q7321J80075N5145R5217
6853G1012N3278j9452k0825j81698Q9529K12470p7193k69796J4067M5732N5535
6842b7341K28302J4695j38933P6255J20844j99633j57380R5369J0551P4302J3715
6831A10746o0210k8762o3492r986P259j96232q3913M3239K3914K2117P4269m737
6819a65788N1613j9260M8124o8691k4321R6389j32045j09125m424P1038L0122
$$ plain form
6808 -226368 -102571 -148264 -137598 -161742 -83299 -32938 -81269 -21905 -68429 -148799 -65304
6797 -65304 44022 -145480 -216992 -88450 -153497 -325802 -291736 -23729 21263 -99328 -171220
6786 -171220 -125027 6040 1005 -69087 -182572 -220185 -250238 -220905 -170039 -206687 -322658
6775 -322658 -415898 -425517 -257169 -140559 -917 -139943 -186515 -192421 -97902 -67507 -38752
6764 -38752 -99541 -94579 87309 84809 -30938 -242834 -196377 -52036 -11907 -59157 29685
6753 29685 113048 107964 50585 48585 95517 -29487 -117862 -187141 -61398 -193512 -212425 -59225
6741 -59225 -21454 -23414 -117153 -97336 28221 -97480 -67091 16454 38161 30588 85242 -84142
6729 -84142 -307205 -265741 -119515 -158372 -360311 -326917 -94969 -44405 -112570 5684 2108
$$ packed form
6808b26368J23797m5693J0666k4144P8443N0361m8331N9364m6524q0370Q3495
6797f5304J09326j89502p1512J28542o5047j72305L4066K68007M4992j20591p1892
6786a71220M6193J31067n035p0092j13485l7613l0053K9333N0866l6648j15971
6775c22658r3240r619J68348J16610J39642j39026m6572n906R4519L0395K8755
6764c8752o0789M962J81888k500j15747k11896M6457J44341M0129m7250Q8842
6753B9685Q3363n084n7379k000M6932j25004q8375o9279J25743j32114j8913J53200
6741e9225L7771j960r3739J9817J25557j25701L0389Q3545K1707p573N4654j69384
6729h4142k23063M1464J46226l8857k01939L3394K31948N0564o8165J18254l576
$$ plain form
6718 2108 -4166 41297 -66721 -213148 -212341 -255803 -230393 -148420 -134324 -244752 -130543 -54935
6706 -54935 -154187 -194342 -129987 -59767 -101151 49660 188212 206161 124032 55563 -76836
6695 -76836 -72806 -58013 -88607 -148252 -125034 -169557 32800 96834 11779 48495 159765 174309
6683 174309 -83802 -205673 -60436 -110496 -206318 -177887 -130574 -84309 68749 -1667 37222
6672 37222 109692 73337 38453 -74487 -136537 -22677 52472 -52615 -276776 -345309 -377152
6661 -377152 -348033 -133167 -34575 -21594 -51860 23557 68766 25352 126449 146670 -21554
6650 -21554 -196633 -222572 -144852 -55087 3444 -113968 -103613 16907 17820 -25288 -41755 -56168
6638 -56168 -4755 -62350 -30383 115713 207715 293512 384535 358819 251256 -134080 -175040
$$ packed form
6718B108o274M5463j08018j46427Q07m3462K5410Q1973J4096j10428J14209P5608
6706e4935r9252m0155O4355P0220m1384J50811J38552J7949q2129o8469j32399
6695g6836M030J4793l0594n9645K3218m4523K02357O4034q5055L6716J11270J4544
6683A74309k58111j21871J45237n0060r5822K8431M7313M6265J53058p0416L8889
6672C7222P2470l6355l4884j12940o2050J13860P5149j05087k24161o8533l1843
6661c77152K9119K14866R8592J2981l0266P5417M5209m3414J01097K0221j68224
6650b1554j75079k5939P7720Q9765N8531j17412J0355J20520R13m3108j6467j4413
6638e6168N1413n7595L1967J46096R2002Q5797R1023k5716j07563l85336m0960
$$ plain form
6627 -175040 -29989 50488 -44750 -104336 -255219 -339845 -122748 -85142 -263551 -102001 64870
6616 64870 -122408 -4205 103090 61325 45299 67402 -114520 -163222 68872 232999 104424
6605 104424 159851 118510 111015 141713 115113 -80310 -193139 -88622 91695 230200 150108
6594 150108 -7817 -74132 -34352 -5381 -26366 -117719 -108813 -78366 -105400 -83085 -35883 54374
6582 54374 188257 199644 -44267 -110784 -78597 -11420 62377 129671 14325 -302565 -174462
6571 -174462 -2543 34904 19351 -130291 -164565 -86468 -186194 -372896 -469666 -301912 -151609
6560 -151609 133141 77077 -224870 -98670 3833 -47250 -250410 -243639 -241754 -245127 -77585
6549 -77585 113903 81122 201263 301463 146612 8725 -31107 -64608 -128110 -163355 -95335
$$ packed form
6627a75040J45051Q0477r5238n9586j50883q4626K17097L7606j78409J61550J66871
6616F4870j87278J18203J07295m1765j6026K2103j81922m8702K32094J64127j28575
6605A04424N5427m1341p495L0698k6600j95423j12829J04517J80317J38505q0092
6594A50108j57925o6315L9780K8971k0985r1353Q906L0447k7034K2315M7202R0257
6582E4374J33883J1387k43911o6517L2187O7177P3797O7294j15346l16890J28103
6571a74462J71919L7447j5553j49642l4274P8097r9726j86702r6770J67754J50303
6560a51609K84750n6064l01947J26200J02503n1083k03160O771J885l373J67542
6549g7585J91488l2781J20141J00200j54851j37887l9832l3501o3502l5245O8020
$$ plain form
6538 -95335 -37688 115241 212448 44718 6459 115858 104822 140600 64483 48233 102872
6527 102872 51872 -192351 -414962 -415224 -337552 -123160 213260 323744 157597 154820 38066
6516 38066 -157220 -183274 -206337 -221235 -269367 -252190 -272737 -117072 -41277 -122866 -209893
6505 -209893 -276312 -134344 53828 164743 237202 246899 44725 -64248 -516 124314 138253
6494 138253 32228 13187 188610 335947 419433 370113 300493 193959 84733 128756 274709
6483 274709 350021 302806 276946 226769 271935 277762 190560 31371 -104947 -264531 -235497
6472 -235497 16583 33988 -43096 -50868 -10258 51075 -102288 -95512 -51074 43777 75699 -18944
6460 -18944 -170704 -243747 -124794 -96155 -16610 45586 -31304 -224206 -267150 -287574 -130702
$$ packed form
6538i5335N7647J52929R7207j67730l8259J09399j1036L5778p6117j6250N4639
6527A02872n1000k44223k22611k62P7672K14392L36420J10484j66147k777j16754
6516C8066j95286k6054k3063j4898m8132J7177k0547J55665P5795q1589q7027
6505b09893o6419J41968J88172J10915P2459R697k02174j08973O3732J24830J3939
6494A38253j06025j9041J75423J47337Q3486m9320o9620j06534j09226M4023J45953
6483B74709P5312m7215k5860n0177M5166N827q7202j59189j36318j59584K9034
6472b35497K52080J7405p7084p772M0610O1333j53363O776M4438R4851L1922r4643
6460a8944j51760p3043J18953K8639P9545O2196p6890j92902m2944k0424J56872
$$ plain form
6449 -130702 11166 26484 98232 177862 182088 166084 -60156 -239074 -380449 -355208 -6771
6438 -6771 78473 165805 116476 95897 63756 28518 4480 -137261 -83259 -32430 -36724 -66495
6426 -66495 150689 219254 96668 -174785 -158268 16236 -69387 -248238 -296571 -101650 -76904
6415 -76904 -60269 -54471 -104259 -303 175576 164080 152205 196963 199917 -42038 -198887
6404 -198887 -310973 -308332 -231313 -234839 -255893 -308032 -267692 -461199 -390777 -180208 -64599
6393 -64599 -1910 -9647 180673 84946 5655 5766 69678 130789 166552 156353 99522 82676
6381 82676 104322 10122 -208961 -163358 -55310 -72247 -184393 -402327 -394943 -197919 -11542
6370 -11542 107748 110068 41605 -107709 -267878 -262057 -258811 -182273 -83277 -33281 -215584 -286757
$$ packed form
6449a30702J41868J5318P1748P9630M226j6004k26240j78918j41375K5241L48437
6438f771Q5244Q7332m9329k0579l2141l5238k4038j41741N4002N0829m294k9771
6426f6495K17184O8565j22586k71453J6517J74504q5623j78851m8333J94921K4746
6415g6904J6635N798m9788J03956J75879j1496j1875M4758K954k41955j56849
6404a98887j12086K641P7019l526k1054n2139M0340j93507P0422K10569J15609
6393f4599O2689p737J90320r5727p9291J11O3912O1111L5763j0199n6831j6846
6381H2676K1646r4200k19083M5603J08048j6937j12146k17934P384J97024J86377
6370a1542J19290K320o8463j49314j60169N821L246P6538R8996M9996j82303p1173
$$ plain form
6358 -286757 -261356 -243675 -235610 -411653 -453220 -339420 -153896 95637 239233 123986 -38441
6347 -38441 -71624 35851 139179 223019 198325 75234 112812 124818 46720 -104784 -92422
6336 -92422 -123870 -103722 -103591 -62316 139388 160073 120908 69468 38502 20520 -9406 26961
6324 26961 67169 71752 9015 23100 49275 10375 69312 120790 158286 123807 140045 47410
6312 47410 -140815 -243125 -120258 25401 -2202 150901 84204 28802 51412 -55107 19755
6301 19755 170234 198357 168446 90635 -10878 62765 126942 65595 -24339 -157931 -132646
6290 -132646 -53745 -128668 -29362 70037 15228 -176935 -336186 -311776 -234039 -114500 -16480
6279 -16480 -55879 -54433 23023 -26683 -76921 2809 9133 27120 145059 164877 118721 70337
$$ packed form
6358b86757K5401J7681Q065j76043m1567J13800J85524K49533J43596j15247j62427
6347c8441l3183J07475J03328Q3840k4694j23091L7578J2006p8098j51504J2362
6336i2422l1448K0148J31M1275K01704K0685l9165n1440l0966j7982k9926L6367
6324B6961M0208M583o2737J4085K6175l8900N8937N1478L7496l4479J6238r2635
6312D7410j88225j02310J22867J45659k7603J53103o6697n5402K2610j06519P4862
6301A9755J50479K8123k9911p7811j01513P3643O4177o1347q9934j33592K5285
6290a32646P8901p4923R9306R9399n4809j92163j59251K4410P7737J19539R8020
6279a6480l9399J446P7456m9706n0238P9730O324J7987J17939J9818m6156m8384
$$ plain form
6267 70337 29181 2158 187661 213990 189649 191772 26133 -152312 -290383 -418235 -361902
6256 -361902 -206612 -45231 -69540 -111205 -110395 -168142 -131728 -60188 88568 -86913 -136522
6245 -136522 45710 117530 -43206 -164841 -143592 -83704 -51366 -25574 -84363 -134346 55326
6234 55326 283215 107720 119476 184318 202878 204889 229616 131146 57893 171320 264620
6223 264620 225902 132391 8487 18507 -85376 -149482 -86881 -167257 -123605 -112942 -166131
6212 -166131 -264267 -170474 -23743 62410 -20501 -41200 -84732 -60329 33304 -60215 -123584
6201 -123584 -125254 37167 236742 219767 89247 17201 133066 89820 154547 250544 226211
6190 226211 -56947 -247654 -226478 -91368 26902 87049 -101488 -195682 -175624 -159571 -241744
$$ packed form
6267G0337m1156k7023J85503K6329k4341K123j65639j78445j38071j27852N6333
6256c61902J55290J61381k4309m1665Q10n7747L6414P1540J48756j75481m9609
6245a36522J82232P1820j60736j21635K1249N9888L2338K5792n8789m9983J89672
6234E5326K27889j75495J1756O4842J8560K011K4727r8470p3253J13427R3300
6223B64620l8718r3511j23904J0020j03883o4106O2601q0376M3652J0663n3189
6212a66131r8136R3793J46731Q6153q2911k0699m3532K4403R3633r3519o3369
6201a23584j670J62421J99575j6975j30520p2046J15865m3246O4727R5997k4333
6190B26211k83158j90707K1176J35110J18270O0147j88537r4194K0058J6053q2173
$$ plain form
6179 -241744 -340939 -193102 3445 -17242 -55925 -2683 -136613 -167571 -180828 -101530 -55207
6168 -55207 9882 -129176 -335437 -374670 -223732 -117293 -73413 -110887 -225233 -259552 -243397
6157 -243397 -301612 -224083 -79890 -267884 -248929 -202476 -160770 -231707 -96347 76860 49386
6146 49386 128123 110520 -3255 -63629 2757 82176 208133 141544 37538 -12047 -3404
6135 -3404 -6786 -84466 -71885 -72274 -61056 -175610 -171809 -145188 -11126 -37801 10585 192239
6123 192239 273165 84789 -22946 79055 -18977 26432 77892 73849 139328 -103531 -177512
6112 -177512 -210698 -8386 118441 47889 158340 226417 95896 -142548 -211498 -232215 -179476
6101 -179476 -139547 -167677 -288731 -426319 -166386 114203 41591 -156275 -214456 -225066 -164603
$$ packed form
6179b41744r9195J47837J96547k0687l8683N3242j33930l0958j3257P9298M6323
6168e5207O5089j39058k06261l9233J50938J06439M3880l7474j14346l4319J6155
6157b43397n8215P7529J44193j87994J8955M6453M1706p0937J35360J73207k7474
6146D9386P8737j7603j13775o0374O6386P9419J25957o6589j04006m9585Q643
6135c404l382p7680J2581l89J1218j14554L801K6621J34062k6675M8386J81654
6123A92239Q0926j88376j07735J02001r8032M5409N1460m043O5479k42859p3981
6112a77512l3186K02312J26827p0552J10451O8077j30521k38444o8950k0717N2739
6101a79476L9929k8130j21054j37588K59933K80589p2612j97866n8181j0610O0463
$$ plain form
6090 -164603 -65251 1790 -77833 -102169 -132014 -48652 -81119 -128044 -199635 -188508 -140067 -214271
6078 -214271 -262145 -80813 -25205 -54557 -117296 -3929 83168 69748 -41541 -47501 -43897
6067 -43897 -42036 -60801 -242537 -143978 29850 135039 234148 337005 235618 115997 164028
6056 164028 201960 316291 274570 72058 -42185 -70623 -72882 -55896 -214469 -193421 -158868
6045 -158868 142320 375188 311813 302877 347911 277959 266583 138556 120601 111668 -33344
6034 -33344 92212 205263 89516 245557 330464 270457 90935 110771 -30204 -7491 165152
6023 165152 287707 99872 -69743 -7904 134495 120381 173790 35457 -86084 -142731
6013 -142731 -38797 46428 -25162 -35523 -98363 -45719 46746 100179 235778 277736 403971
$$ packed form
6090a64603R9352O7041p9623k4336k9845Q3362l2467m6925p1591J1127M8441p4204
6078b14271m7874J81332N5608k9352o2739J13367Q7097j3420j11289n960L604
6067d3897J861j8765j81736R8559J73828J05189R9109J02857j01387j19621M8031
6056A64028L7932J14331m1721k02512j14243k8438k259J6986j58573K1048L4553
6045a58868L01188K32868o3375q936M5034o9952j1376j28027j7955q933j45012
6034c3344J25556J13051j15747J56041Q4907o0007j79522J9836j40975K2713J72643
6023A65152J22555j87835j69615O1839J42399j4114N3409j38333j21541n6647
6013a42731J03934Q5225p1590j0361o2840N2644R2465N3433J35599M1958J26235
$$ plain form
6002 403971 496324 349890 187143 -59345 -160002 -59848 59060 -30712 -268859 -335304
5992 -335304 -423306 -426237 -217177 69564 146512 46460 -225451 -402995 -401222 -334425 -114147
5981 -114147 59608 13830 -141186 -184129 -116340 35781 78766 58829 -111187 -189332 -188773
5970 -188773 -108209 -43219 -55799 -94903 -55505 22764 150668 225471 144925 130376 160037
5959 160037 -96390 -205266 -254937 -81868 -163039 -158611 -67946 -237506 -242188 -14990 90901
5948 90901 -78172 -303000 -273163 -106287 54897 120041 147912 26896 -50429 30432 85774
5937 85774 63593 44203 -8838 -67004 -111599 -35087 -21006 -35781 -48660 -55494 -14596 77548
5925 77548 244450 163186 13099 -105763 9183 -61173 -18191 -9948 -64943 -55902 -120679
$$ packed form
6002D03971R2353j46434j62747k46488j00657J00154J18908q9772k38147o6445
5992c35304q8002k931K09060K86741P6948j00052k71911j77544J773O6797K20278
5981a14147J73755m5778j55016m2943O7789J52121M2985j9937j70016p8145N59
5970a88773Q0564O4990j2580l9104L9398P8269J27904P4803q0546j4549K9661
5959A60037k56427j08876m9671J73069q1171M428R0665j69560m682K27198J05891
5948I0901j69073k24828K9837J66876J61184O5144K7871j21016p7325Q0861N5342
5937H5774k2181j9390n3041n8166m4595P6512J4081j4775j2879o834M0898R2144
5925G7548J66902q1264j50087j18862J14946p0356M2982Q243n4995R041o4777
$$ plain form
5914 -120679 -104482 -30961 40917 -116223 -250354 -111233 102828 190537 149794 121233 4096
5903 4096 -167605 -393593 -285599 1242 94242 27289 -46151 -82889 -2630 31592 -112892
5892 -112892 -206526 -123769 68271 138545 113163 115053 66495 -15285 -169471 -104387 28219
5881 28219 -14610 47384 20152 80046 42535 80831 56075 -120746 -163333 -181746 -53942
5870 -53942 133303 71640 76559 145094 -6521 -86797 -48641 21638 -22999 -40647 -107838 -269102
5858 -269102 -179931 10607 24733 5449 -159913 -83884 -37673 114580 164894 130367 41091
5847 41091 68603 118993 71400 -47979 -25733 90262 -82337 -248884 -180477 -180031 -208233
5836 -208233 -271915 -263620 -311575 -216214 -167493 -10670 -10927 126886 75041 -15109 -133669 -225395
$$ packed form
5914a20679J6197P3521P1878j57140j34131J39121K14061Q7709m0743k8561j17137
5903D096j71701k25988J07994K86841R3000o6953p3440l6738Q0259L4222j44484
5892a12892r3634Q2757J92040P0274k5382J890m8558q1780j54186O5084J32606
5881B8219m2829O1994k7232N9894l7511L8296k4756j76821m2587j8413J27804
5870e3942J87245o1663M919O8535j51615q0276L8156P0279m4637j7648o7191j61264
5858b69102Q9171J90538J4126j9284j65362P6029M6211J52253N0314l4527q9276
5847D1091K7512N0390m7593j19379K2246J15995j72599j66547O8407M46k8202
5836b08233o3682Q295m7955R5361M8721J56823k57J37813n1845r0150j18560r1726
$$ plain form
5824 -225395 -149558 -12330 67198 24146 50000 180413 -9328 -217518 -289196 -177521 -112571
5813 -112571 -12954 66922 -18151 -138550 -41311 133773 68116 -44964 -191389 -95699 -32304
5802 -32304 -158712 -263920 -286579 -168821 -8434 -71824 -174172 -189283 -88300 -88827 -84438
5791 -84438 -86467 14600 74589 -70969 9809 68639 -53185 33639 -1789 -41075 87059
5780 87059 29011 -21466 -96693 -132120 -136278 -172402 -189714 -180330 -72041 198384 256247 185185
5768 185185 56917 -87770 -31795 130644 112111 13768 32294 107305 140697 131136 93627
5757 93627 41585 243433 212787 111154 -6854 -83338 67906 119231 -96627 1748 170340
5746 170340 126149 86882 140019 81355 53818 49927 -41549 -19051 2590 -164236 -175216 -74992
$$ packed form
5824b25395P5837J37228P9528m3052K5854J30413j89741k08190p1678J11675O4950
5813a12571R9617P9876q5073j20399R7239J75084o5657j13080j46425R5690O3395
5802c2304j26408j05208k2659J17758J60387o3390j02348j5111J00983n27M389
5791h4438k029J01067N9989j45558Q0778N8830j21824Q6824l5428l9286J28134
5780H7059n8048n0477p5227l5427m158l6124j7312R384J08289K70425N7863p1062
5768A85185j28268j44687N5975J62439j8533r8343J8526P5011L3392r561l7509
5757I3627n2042K01848l0646j01633j18008p6484J51244N1325k15858R8375J68592
5746A70340m4191l9267N3137n8664k7537l891r1476K2498K1641j66826j0980J00224
$$ plain form
5734 -74992 -42917 -62418 -133466 -223016 -252983 -9802 55259 -18050 -11239 18897 -29106 -18339
5722 -18339 949 18253 -51123 25949 180650 39226 -25778 -64316 -213734 -189513 -187744
5711 -187744 -153721 -32920 -19820 67826 25010 132177 62189 121936 91459 57226 12885
5700 12885 33417 -109102 84890 55149 -700 29079 12640 54390 104328 119545 -35690
5689 -35690 -79007 -138709 -157704 -17691 19889 -4501 -23298 218879 306973 103234 -21857
5678 -21857 -11737 85111 -5837 -155902 -143471 -289064 -291573 5512 122450 36937 -74272
5667 -74272 -76771 -23460 59363 68053 -13295 43619 278684 273274 195514 131815 16200 37113
5655 37113 -67006 27235 36591 29673 69581 -8286 -198647 -189463 4808 20545 -43248 26885
$$ packed form
5734g4992L2075j9501p1048q9550k9967K43181O5061p3309O811L0136m8003J0767
5722a8339J9288J7304o9376P7072J54701j41424o5004l8538j49418K4221J769
5711a87744L4023J20801J3100Q7646m2816J07167o9988N9747l0477l4233m4341
5700A2885K0532j42519J93992k9741n5849K9779j6439M1750M9938J5217j55235
5689c5690m3317n9702j8995J40013L7580k4390j8797K42177Q8094k03739j25091
5678b1857J0120R6848r0948j50065J2431j45593k509K97085J16938q5513j11209
5667g4272k499N3311Q2823Q690q1348N6914K35065n410p7760o3699j15615K0913
5655C7113j04119R4241R356o918L9908p7867j90361R184J94271J5737o3793P0133
$$ plain form
5643 26885 190376 138558 77570 -105709 -20354 42996 -509 -49794 -124150 112371 279158
5632 279158 260580 664 -107902 -21722 -77021 -60427 -111206 -163122 -132907 -182760 -180054
5621 -180054 -12827 -8019 19331 54420 -2242 -172871 -78730 93457 -10920 -93780 -106651
5610 -106651 -113188 -106431 -147829 -31910 -104556 -158051 -266895 -236786 -91333 53430 268848
5599 268848 253439 130726 216851 166222 102062 36124 33502 97431 99829 62968 152057 206152
5587 206152 193808 154565 77376 68630 52931 108775 -25780 57366 62499 -37727 -48356 -35258
5575 -35258 46663 19036 67945 113437 148894 66448 -97548 -136782 -201056 -165124 25517
5564 25517 119944 69903 -28519 19668 -56839 -186073 -189156 -52830 32778 -10726 52348 69945
$$ packed form
5643B6885J63491n1818o0988j83279Q5355O3350m3505m9285p4356K36521J66787
5632B79158j8578k59916j08566Q6180n5299J6594n0779n1916L0215m9853K706
5621a80054J67227M808K7350L5089n6662j70629R4141J72187j04377q2860j2871
5610a06651o537O757m1398J15919p2646n3495j08844L0109J45453J44763K15418
5599B68848j5409j22713Q6125n0629o4160o5938k622O3929K398l6861Q9089N4095
5587B06152j2344l9243p7189q746j5699N5844j34555Q3146N133j00226j0629J3098
5575c5258Q1921k7627M8909M5492L5457q2446j63996l9234o4274L5932J90641
5564B5517R4427n0041r8422M8187p6507j29234l083J36326Q5608m3504O3074J7597
$$ plain form
5552 69945 -48080 -92016 -36829 -73018 115075 86107 18840 36870 -1278 -49187 69577
5541 69577 227872 146251 -15422 -84262 -133687 -70448 -46687 -127582 -16578 59027 -27022
5530 -27022 94679 58201 87133 136264 118848 53833 43435 171472 149867 226812 150835
5519 150835 -61922 -190212 -76990 24237 -72369 -125516 40510 72342 116848 103021 197531
5508 197531 135072 -64871 -97170 45986 58830 55512 19576 85017 -59963 -92722 -27781
5497 -27781 42108 95729 19301 11615 223110 192691 100493 108892 106314 205401 214019 111533
5485 111533 -173781 -213774 -102353 -262301 -266152 -366171 -258678 -164063 -190355 -334952 -464779
5474 -464779 -397722 -254564 -139167 -76527 -87108 -79135 -115948 -106154 -87277 -195181 -35623
$$ packed form
5552F9945j18025m3936N5187l6189J88093k8968o7267J8030l8148m7909J18764
5541F9577J58295q1621j61673o8840m9425O3239K3761q0895J11004P5605q6049
5530b7022J21701l6478K8932M9131j7416o5015j0398J28037k1605P6945p5977
5519A50835k12757j28290J13222J01227r6606n3147J66026L1832M4506j3827R4510
5508A97531o2459j99943l2299J43156J2844l318l5936O5441j44980l2759O4941
5497b7781O9889N3621p6428p686K11495l0419r2198Q399k578R9087Q618j02486
5485A11533k85314l9993J11421j59948l851j00019J07493R4615k6292j44597j29827
5474d64779O7057J43158J15397O2640j0581P973l6813R794J8877j07904J59558
$$ plain form
5463 -35623 -3810 -57229 -149051 -55088 27194 -80078 29979 57772 -116159 -50051 1237
5452 1237 -32322 -115554 -80290 -189220 -200300 -274165 -384569 -166528 136380 284490 260275
5441 260275 294230 150109 5919 7840 37130 -12533 -20394 -128874 32252 82991 29357
5430 29357 -69613 15711 89881 94590 56427 -162559 -207512 -158820 -33191 -155189 -241208
5419 -241208 -61490 -43082 -182231 -193158 -98564 4653 -31463 -24880 30965 69205 76728
5408 76728 -8668 -111107 -92734 -34346 63625 96310 -69079 -2070 -28548 132103 147311
5397 147311 29357 21513 66897 -9525 18812 -9673 -56299 41134 -74495 -312703 -120454
5386 -120454 -54675 -45094 -74220 5258 157334 201659 217643 171347 37772 31564 88591 55671
$$ packed form
5463c5623L1813n3419r1822R3963Q2282j07272J10057K7793j73931O6108N1288
5452A237l3559q3232L5264j08930j1080p3865j10404K18041L02908J48110k4215
5441B60275L3955j44121j44190J921K9290m9663p861j08480J61126N0739n3634
5430B9357r8970Q5324P4170M709l8163k18986m4953M8692J25629j21998q6019
5419b41208J79718J8408j39149j0927R4594J03217l6116O583N5845L8240P523
5408G6728q5396j02439J8373N8388R7971L2685j65389O7009k6478J60651J5208
5397A47311j17954p844M5384p6422K8337k8485m6626R7433j15629k38208J92249
5386a20454O5779R581k9126P9478J52076M4325J5984m6296j33575o208N7027l2920
$$ plain form
5374 55671 93121 -33772 -31059 -12526 -216106 -320828 -206584 -145409 -170738 -54916 140322
5363 140322 173038 71923 3115 -38815 -5130 153067 236475 125932 2508 -70635 -12334
5352 -12334 101777 58646 -111974 -182521 -107684 -86611 -147576 -178919 -190484 -73782 -7107
5341 -7107 -31218 -48007 11608 60350 82621 100060 94658 64221 141460 101691 128022 17895
5329 17895 -85943 -182484 -173011 -218651 -166173 -23107 -34416 -37737 -4200 -90817 -66594 -176333
5317 -176333 -196247 54532 34323 -178361 -224277 -144797 -147619 -131051 -199962 -261011 -316410
5306 -316410 -463575 -377362 -247304 -157105 42275 44259 57107 68921 91449 224577 222227
5295 222227 121907 18981 -69647 -236254 -69018 59695 -65054 -93462 -116579 -65076
$$ packed form
5374E5671L7450j26893K713J8533k03580j04722J14244O1175k5329J15822J95238
5363A40322L2716j01115o8808m1930L3685J58197Q3408j10543j23424p3143N8301
5352a2334J14111m3131j70620p0547P4837K1073o0965l1343j1565J16702O6675
5341g107k4111j6789N9615M8742K2271J7439n402l0437P7239l9769K6331j10127
5329A7895j03838r6541R473m5640N2478J43066j1309l321L3537q6617K4223j09739
5317a76333j9914K50779k0209k12684m5916P9480k822J6568o8911o1049n5399
5306c16410j47165Q6213J30058R0199J99380J984J2848J1814K2528J33128k350
5295B22227j00320j02926q8628j66607J67236J28713j24749k8408k3117N1503
$$ plain form
5285 -65076 -8830 -42270 -27056 50396 104597 108282 123258 299426 326460 165755 70738 -81770
5273 -81770 -9160 10404 -60402 -26445 -2245 -130390 -201751 -154337 -139745 -124517 -229683
5262 -229683 -147364 -134890 -140387 -135301 -232906 -72359 -92648 -217179 -56112 -36038 -56208
5251 -56208 -151302 -94177 -219678 -251101 -56202 -96163 -127462 -245 32405 -38720 -10121
5240 -10121 53140 104850 156232 91189 -222726 -199839 -208691 -161839 14940 177128 298965
5229 298965 21776 -183060 4408 157150 216896 251064 65900 12198 118323 135693
5219 135693 107694 -26615 -145663 -206243 -154589 -54067 225383 309109 71999 -41393
5209 -41393 -60319 -74969 -75184 52699 198768 43016 -90424 -116094 -11357 -37775 -43707
$$ packed form
5285f5076N6246l3440J5214P7452N4201L685J4976J76168K7034j60705r5017j52508
5273h1770P2610J9564p0806L3957K4200j28145p1361M7414J4592J5228j05166
5262b29683Q2319J2474n497N086r7605J60547k0289j24531J61067K0074k0170
5251e6208r5094N7125j25501l1423J94899l9961l1299J27217L2650p1125K8599
5240a0121O3261N1710N1382o5043l13915K2887q852M6852J76779J62188J21837
5229B98965k77189k04836J87468J52742N9746L4168j85164n3702J06125J7370
5219A35693k7999j34309j19048o0580N1654J00522K79450Q3726k37110j13392
5209d1393j8926j4650k15J27883J46069j55752j33440k5670J04737k6418n932
$$ [...]
##END NTUPLES=NMR SPECTRUM
##END=
