##TITLE=Analysis number 327360
Compound Code ac 10403
Book Reference 44180
Project Code adrs flro3
Chemist Name jom
##JCAMPDX= 6.0         $$ Bruker NMR JCAMP-DX V2.0
##DATA TYPE= NMR SPECTRUM
##DATA CLASS= NTUPLES
##ORIGIN= Bruker BioSpin GmbH
##OWNER= nmr
$$ XWIN-NMR		Version 3.5
$$ Thu Mar 22 12:47:02 2007 GMT Standard Time (UT+0h)  MAYBRIDGE\nmr@NMR_250MHZ
##.OBSERVE FREQUENCY= 250.131544655141
##.OBSERVE NUCLEUS= ^1H
##.ACQUISITION MODE= SIMULTANEOUS (DQD)
##.ACQUISITION SCHEME= undefined
##.AVERAGES= 16
##.DIGITISER RES= 18
##SPECTROMETER/DATA SYSTEM= dpx250
##.PULSE SEQUENCE= zg30
##.SOLVENT NAME= DMSO
##.SHIFT REFERENCE= (INTERNAL, DMSO, 0, 16.522)
##AUDIT TRAIL= $$ (NUMBER, WHEN, WHO, WHERE, WHAT)
$$ ##TITLE= Audit trail, XWIN-NMR		Version 3.5
$$ ##JCAMPDX= 5.01
$$ ##ORIGIN= Bruker BioSpin GmbH
$$ ##OWNER= nmr
$$ C:\u/data/dgb/nmr/ADRS/1680/pdata/1/auditp.txt
$$ ##AUDIT TRAIL=  $$ (NUMBER, WHEN, WHO, WHERE, WHAT)
(   1,<2007-03-22 12:46:28.77 +000>,<MAYBRIDGE\nmr>,<NMR_250MHZ>,
      <created by zg, POWCHK disabled, PULCHK disabled
       configuration hash MD5:
       49 4B E0 1D 92 C2 6B 37 9F E6 65 BC 52 41 86 1D
       data hash MD5: 64K
       86 FB 2E AF CF A2 C1 B7 53 2E DB 96 4E 5C 36 1F>)
(   2,<2007-03-22 12:46:46.96 +000>,<MAYBRIDGE\nmr>,<NMR_250MHZ>,
      <Start of raw data processing
       ef LB = 0.3 FT_mod = 6 PKNL = 1 SI = 32K 
       data hash MD5: 32K
       C7 2D 00 1D 26 25 BC 75 50 EB 87 20 4A E1 4F AC>)
(   3,<2007-03-22 12:46:49.47 +000>,<MAYBRIDGE\nmr>,<NMR_250MHZ>,
      <apk 
       data hash MD5: 32K
       14 3E 68 CD B8 B1 AF 83 72 08 20 C7 71 4F A6 C0>)
(   4,<2007-03-22 12:46:50.21 +000>,<MAYBRIDGE\nmr>,<NMR_250MHZ>,
      <abs ABSG = 5 
       data hash MD5: 32K
       C0 33 63 22 04 83 EF C8 B3 79 CC F0 C2 75 A8 B7>)
$$ ##END=
$$ 
$$ hash MD5
$$ 07 33 94 C8 69 8D BB 0C 97 98 32 91 02 CE B0 72
##$RELAX= 
##$RELAX= 
##$RELAX= 
##$RELAX= 
##$RELAX= 
##$RELAX= 
##$RELAX= 
$$ Bruker specific parameters
$$ --------------------------
##$DU= <C:\u>
##$EXPNO= 1680
##$NAME= <ADRS>
##$PROCNO= 1
##$TYPE= <nmr>
##$USER= <dgb>
##$AMP= (0..31)
100 100 100 100 100 100 100 100 100 100 100 100 100 100 100 100 100 100 
100 100 100 100 100 100 100 100 100 100 100 100 100 100 
##$AQSEQ= 0
##$AQ_mod= 3
##$AUNM= <au_zg>
##$AUTOPOS= <27 >
##$BF1= 250.13
##$BF2= 250.13
##$BF3= 250.13
##$BF4= 250.13
##$BF5= 500.13
##$BF6= 500.13
##$BF7= 500.13
##$BF8= 500.13
##$BYTORDA= 1
##$CFDGTYP= 0
##$CFRGTYP= 5
##$CHEMSTR= <none>
##$CNST= (0..31)
1 1 145 1 1 1 1 1 1 1 1 1 1 1 1 1 1 1 1 1 1 1 1 1 1 1 1 1 1 1 1 1 
##$CPDPRG= <>
##$CPDPRG1= <>
##$CPDPRG2= <>
##$CPDPRG3= <>
##$CPDPRG4= <mlev>
##$CPDPRG5= <mlev>
##$CPDPRG6= <mlev>
##$CPDPRG7= <mlev>
##$CPDPRG8= <mlev>
##$CPDPRGB= <>
##$CPDPRGT= <>
##$D= (0..31)
0 1 0 0 0 0 0 0 0 0.06 0 0 0 0 0 0 0.0002 0 0 0 0 0 0 0 0 0 0 0 0 0 0 
0 
##$DATE= 1174567587
##$DBL= (0..7)
120 120 120 120 120 120 120 120 
##$DBP= (0..7)
150 150 150 150 150 150 150 150 
##$DBP07= 0
##$DBPNAM0= <>
##$DBPNAM1= <>
$$ [...]
##$SUBNAM7= <"">
##$SUBNAM8= <"">
##$SUBNAM9= <"">
##$SW= 20.6930455092707
##$SWIBOX= (0..15)
0 0 3 0 0 0 0 0 0 0 0 0 0 0 0 0 
##$SW_h= 5175.983436853
##$TD= 65536
##$TD0= 1
##$TE= 683.16
##$TE2= 300
##$TE3= 300
##$TEG= 300
##$TL= (0..7)
0 120 120 120 120 120 120 120 
##$TP= (0..7)
150 150 150 150 150 150 150 150 
##$TP07= 0
##$TPNAME0= <>
##$TPNAME1= <>
##$TPNAME2= <>
##$TPNAME3= <>
##$TPNAME4= <>
##$TPNAME5= <>
##$TPNAME6= <>
##$TPNAME7= <>
##$TPOAL= (0..7)
0.5 0.5 0.5 0.5 0.5 0.5 0.5 0.5 
##$TPOFFS= (0..7)
0 0 0 0 0 0 0 0 
##$TUNHIN= 0
##$TUNHOUT= 0
##$TUNXOUT= 0
##$USERA1= <user>
##$USERA2= <user>
##$USERA3= <user>
##$USERA4= <user>
##$USERA5= <user>
##$V9= 5
##$VALIST= <valist>
##$VCLIST= <CCCCCCCCCCCCCCC>
##$VD= 0
##$VDLIST= <DDDDDDDDDDDDDDD>
##$VPLIST= <PPPPPPPPPPPPPPP>
##$VTLIST= <TTTTTTTTTTTTTTT>
##$WBST= 1024
##$WBSW= 4
##$XGAIN= (0..3)
0 0 0 0 
##$XL= 0
##$YL= 0
##$YMAX_a= 442443
##$YMIN_a= -309817
##$ZGOPTNS= <>
##$ZL1= 120
##$ZL2= 120
##$ZL3= 120
##$ZL4= 120
##$ABSF1= 16.522
##$ABSF2= -4.171173
##$ABSG= 5
##$ABSL= 3
##$ALPHA= 0
##$AQORDER= 0
##$ASSFAC= 0
##$ASSFACI= 0
##$ASSFACX= 0
##$ASSWID= 0
##$AUNMP= <proc_1d>
##$AZFE= 0.1
##$AZFW= 0.1
##$BCFW= 0
##$BC_mod= 0
##$BYTORDP= 0
##$COROFFS= 0
##$CY= 12.5
##$DATMOD= 1
##$DC= 0
##$DFILT= <>
##$DTYPP= 0
##$F1P= 14.0000005364418
##$F2P= -0.99999901652339
##$FCOR= 0.5
##$FTSIZE= 32768
##$FT_mod= 6
##$GAMMA= 0
##$GB= 0
##$INTBC= 1
##$INTSCL= 1
##$ISEN= 128
##$LB= 0.3
##$LEV0= 0
##$LPBIN= 0
##$MAXI= 10000
##$MC2= 0
##$MEAN= 0
##$ME_mod= 0
##$MI= 0
##$NCOEF= 0
##$NC_proc= -5
##$NLEV= 6
##$NOISF1= 0
##$NOISF2= 0
##$NSP= 0
##$NTH_PI= 0
##$NZP= 0
##$OFFSET= 16.522
##$PC= 1
##$PHC0= 220.3885
##$PHC1= 2.463625
##$PH_mod= 1
##$PKNL= yes
##$PPARMOD= 0
##$PSCAL= 4
##$PSIGN= 0
##$REVERSE= no
##$SF= 250.13
##$SI= 32768
##$SIGF1= 0
##$SIGF2= 0
##$SINO= 400
##$SIOLD= 32768
##$SREGLST= <1H.DMSO>
##$SSB= 0
##$STSI= 32768
##$STSR= 0
##$SW_p= 5175.98343685301
##$SYMM= 0
##$S_DEV= 0
##$TDeff= 65536
##$TDoff= 0
##$TI= <Analysis number 999999
Compound Code 99
Book Reference 9
Project Code 9>
##$TILT= no
##$TM1= 0
##$TM2= 0
##$TOPLEV= 0
##$USERP1= <user>
##$USERP2= <user>
##$USERP3= <user>
##$USERP4= <user>
##$USERP5= <user>
##$WDW= 1
##$XDIM= 32768
##$YMAX_p= 516400464
##$YMIN_p= -202353
$$ End of Bruker specific parameters
$$ ---------------------------------
##NTUPLES= NMR SPECTRUM
##VAR_NAME=  FREQUENCY,     SPECTRUM/REAL,   SPECTRUM/IMAG
##SYMBOL=    X,             R,               I
##VAR_TYPE=  INDEPENDENT,   DEPENDENT,       DEPENDENT
##VAR_FORM=  AFFN,          ASDF,            ASDF
##VAR_DIM=   32768,         32768,           32768
##UNITS=     HZ,            ARBITRARY UNITS, ARBITRARY UNITS
##FACTOR=    0.157963299565203, 1,           1
##FIRST=     4132.6476996994, 0,             0
##LAST=      -1043.33573715361, 0,           0
##MIN=       -1043.33573715361, -202353,     0
##MAX=       4132.6476996994, 516400464,     0
$$ Real data points
##PAGE= N=1
##DATA TABLE= (X++(R..R)), XYDATA
$$ [...]
16399C5480j6366j46o526J0276l5044K1614L6788P4010K9005j9205k8117l9022
$$ 35480 19114 18968 12442 22718 -12326 9288 46076 120086 149091 129886 101769 62747
16387F2747l2578p958m2333J3726L881J1410j2543r9592j7982K888k395K9739
$$ 62747 30169 22211 -20122 -6396 -2515 8895 -3648 -103240 -121222 -118334 -120729 -90990
16375i0990N7176j67k1974l5259J8539N6352o3868n8838L3902N9516L4154J7001
$$ -90990 -33814 -33981 -55955 -91214 -72675 -16323 -80191 -139029 -105127 -45611 -11457 5544
16363E544k8042r7829m2470K6031J8671L2375M6913L4141k9896k8892K2416J2148
$$ 5544 -22498 -120327 -162797 -136766 -118095 -85720 -38807 -4666 -34562 -63454 -41038 -28890
16351b8890k7486j0816L483L8558j9474l7858M2006J1198k2286O311j0739M2565
$$ -28890 -56376 -67192 -63709 -25151 -44625 -82483 -40477 -29279 -51565 -45254 -55993 -13428
16339a3428M5684J4062m0742p5742l5876K4824J9541M9119k7790k1964j8225J8331
$$ -13428 32256 46318 5576 -70166 -106042 -81218 -61677 -12558 -40348 -62312 -80537 -62206
16327f2206M9957m5269p815L7973K0335J3625L3516m2650o9588n6255k6185K6563
$$ -62206 -12249 -57518 -65333 -27360 -7025 6600 40116 -2534 -72122 -128377 -154562 -127999
16315a27999N4602K6149J8476l1486l8877k109L1396P0526M3266j8784m3255L491
$$ -127999 -73397 -47248 -28772 -60258 -99135 -101244 -69848 678 43944 25160 -18095 -14604
16303a4604j9401Q670o051Q110J587L844l1133L5241Q348P301k0615m1791k0654
$$ -14604 -34005 -25335 -31386 -23276 -21689 -17845 -48978 -13737 -5389 1912 -18703 -60494 -81148
16290h1148J3963K7696N9717K8233j9642q6806k4359Q362M4501j6743J1220n922
$$ -81148 -67185 -39489 20228 48461 28819 -57987 -82346 -73984 -29483 -46226 -35006 -40928
16278d0928M3589J7278M0736k1817n1936k0209J2315P518M0047K5142n130m7997
$$ -40928 2661 19939 60675 38858 -13078 -33287 -20972 -13454 26593 51735 46605 -1392
16266a392N1755J6232l4349q204M173l5464k7056L7830O7975J120o5152j0247
$$ -1392 50363 66595 32246 24042 28215 -7249 -34305 3525 71500 72620 7468 -2779
16254b779J791p8555m4901K2005N9966J2247J1692k3168j0236K3225p187l44l6814
$$ -2779 -988 -79543 -124444 -102439 -42473 -30226 -18534 -41702 -51938 -28713 -35900 -36244 -73058
16241g3058m2099p856L5553Q9904K5243p8494K49N3818Q949o089l9564q381k7927
$$ -73058 -115157 -123013 -87460 2444 27687 -50807 -50558 3260 12209 6120 -33444 -41825 -69752
16228f9752j1604N9696Q02p78j3889m7388Q347L3255j0532M9143o642J9476j2468
$$ -69752 -81356 -21660 -20858 -21636 -35525 -82913 -74566 -41311 -51843 -2700 -9342 10134 -2334
16215b334j7982p740K8108J24P072k6399K4366J6262o4488l9767k8376O7890P760
$$ -2334 -20316 -28056 52 176 7248 -19151 5215 21477 -43011 -82778 -111154 -43264 -35504
16202c5504R146r126J5430J8778J5592K0542K770o8503k5516l5196M2137L9115
$$ -35504 -26358 -35484 -20054 -1276 14316 34858 37628 -30875 -56391 -91587 -49450 -10335
16190a0335K1917m8517K5376J0196J4171j2626J412n054k984L6581L7670j8065
$$ -10335 11582 -36935 -11559 -1363 12808 182 1594 -3460 -6444 30137 67807 49742
16178D9742q160j7901M058K67j5505l4895k5059m0804k1614k3770O3639M2655
$$ 49742 41582 23681 27739 28006 12501 -22394 -47453 -88257 -109871 -133641 -70002 -27347
16166b7347m1141J7308q409l8004M4479J5771M2974R947j6225m2800j0654O0730
$$ -27347 -68488 -51180 -59589 -97593 -53114 -37343 5631 15578 -647 -43447 -54101 6629
16154F629J8391l4368o300q993k9523J2249Q724J32R436p289k2467K4526K2457
$$ 6629 25020 -9348 -15648 -24641 -54164 -41915 -33191 -33059 -23623 -30912 -53379 -28853 -6396
16141f396j614K8403J5708r757j6581J1055J0391k5267k8461m1924K2906O3423
$$ -6396 -8010 20393 36101 26344 9763 20818 31209 5942 -22519 -64443 -41537 21886
16129B1886L7603p1907k2481k5548m0672j3266J5109J6102m3427j5492K3221L9324
$$ 21886 59489 -12418 -34899 -60447 -101119 -114385 -99276 -83174 -126601 -142093 -118872 -79548
16117g9548J6827O320m911m1951q184K7456P661R437K9223J2690l2270l683J9310
$$ -79548 -62721 -56401 -61312 -103263 -111447 -83991 -76330 -66893 -37670 -24980 -57250 -60933 -41623
16104d1623J2985m7376k8870J1510P5492K2362o6j2884n0568l3021P630K1899
$$ -41623 -28638 -76014 -104884 -93374 -17882 4480 4414 -8470 -59038 -92059 -84429 -62530
16092f2530J69M2017L7602n2250k5857q145n222M4926P8513o5484J5776K8818
$$ -62530 -62361 -20344 17258 -34992 -60849 -68994 -74216 -29290 49223 -16261 -485 28333
16080B8333L7803m1703j7651K4078J5840J0256P949l6133m7178k3746j7644J5609
$$ 28333 66136 24433 6782 30860 46700 56956 64905 28772 -18406 -42152 -59796 -44187
16068d4187O1146M1243n424K885o328k598M1716L4465m3945o4954j4260r58k3276
$$ -44187 16959 58202 52778 55663 49335 46737 88453 122918 78973 14019 -241 -1199 -24475
16055b4475L8462m8535l7718l1486l409M1240K4637J5168j4810O8567K8095k8936
$$ -24475 13987 -34548 -72266 -103752 -107161 -65921 -41284 -26116 -40926 27641 55736 26800
16043B6800k134R843l1154n055n827l056n8974j0095L6003K5176j9728l2424Q8300
$$ 26800 24666 34509 3355 -1700 -7527 -10583 -69557 -79652 -43649 -18473 -38201 -70625 17675
16030A7675j0688l0411j1268k1083L2487L6727l5959K591J595m0326K6090k0424
$$ 17675 6987 -23424 -34692 -55775 -23288 13439 -22520 -19929 -18334 -58660 -32570 -52994
16018e2994L32K2256l3768j748N4631k5337l9424L0959j4561l4773O0424l095
$$ -52994 -52662 -30406 -64174 -65922 -11291 -36628 -76052 -45093 -59654 -94427 -34003 -37098
16006c7098K4928L0628r114n1016K8625m5568j3094Q1067M442k1771P656L0274
$$ -37098 -12170 18458 9344 -41672 -13047 -58615 -71709 9358 13800 -7971 -315 29959
15994B9959L5743J5712J3138N692l6474j2988k6476o848L501O578K7083m6508
$$ 29959 65702 81414 94552 100244 63770 50782 24306 17458 20959 27537 54620 8112
15982H112o2802l1597l0952K8397k006K3967L4438j8312L7152J9553m0053j6642
$$ 8112 -54690 -86287 -117239 -88842 -90848 -66881 -32443 -50755 -13603 5950 -34103 -50745
15970e0745K3648K667J4387p284m0220K0784j8407j7194J5670L8810M8942j8979
$$ -50745 -27097 -24430 -10043 -17327 -57547 -36763 -55170 -72364 -56694 -17884 31058 12079
15958A2079M026J1654j030j7448l2586n8003n831N9933M2697L395N320j7670L6869
$$ 12079 16105 27759 26729 9281 -23305 -81308 -87139 -27206 15491 18886 24206 6536 43405
15945D3405K302k5687n9413Q88j144M5651L6988j5131r747K7876K6878l3257l9838
$$ 43405 45707 20020 -39393 -38505 -39649 6002 42990 27859 18112 45988 72866 39609 -229
15932b29l102o5638o0102M370M5075K7661j807M6618M166l6396J9535N1169K0119
$$ -229 -3331 -68969 -129071 -124701 -79626 -51965 -53772 -7154 -2988 -39384 -19849 31320 51439
15919E1439K413o3711n265k8303J4591J6818M0524m275l1153n4183l108O5255
$$ 51439 53852 -9859 -15124 -43427 -28836 -12018 28506 24231 -6922 -61105 -64213 1042
15907A042L6298o5339l4902k339j1881K8212r582M60K8919K0374M4561j7689k8481
$$ 1042 37340 -27999 -62901 -65240 -77121 -48909 -58491 -58031 -29112 -8738 35823 18134 -10347
15894a0347k3719k6218L1102L3219L6445L5088l2771j4399k011L2631l0732N2844
$$ -10347 -34066 -60284 -29182 4037 40482 75570 42799 28400 26389 59020 28288 81132
15882H1132l216k1634j8037r3906k009L8780K7739p903L2482m4066j5127O143
$$ 81132 77916 56282 38245 -55661 -57670 -18890 8849 946 33428 -10638 -25765 -19622
15870a9622N8449Q841J1377k2097J7731k4013o9221j0404N034O0320M0861r658
$$ -19622 38827 47668 59045 36948 54679 30666 -38555 -48959 -43925 16395 57256 47598
15858D7598J905L958l1941n5507m775N600J9503p565J0500j2890J3188N1852l1399
$$ 47598 49503 53461 21520 -33987 -38762 -33162 -13659 -21224 -10724 -23614 -10426 41426 10027
15845A0027m8083m114m085N6849L742k3234k1172J547Q490m5055j0555M8224j5334
$$ 10027 -38056 -42170 -46255 10594 14336 -8898 -30070 -28523 -20033 -65088 -75643 -27419 -42753
15832d2753l667k892N435K6988K699j1731O1472N0480j7363n5546o3420p9449
$$ -42753 -46420 -49312 -43877 -16889 -14190 -25921 35551 86031 68668 13122 -50298 -129747
15820a29747J8347N9733m564K3590N2574p9455n0616N6598J7398M0353K585l5449
$$ -129747 -111400 -51667 -56231 -32641 19933 -59522 -110138 -53540 -36142 4211 6796 -28653
15808b8653j470M0612j0959J9784R336K2655J0930l9203N984O721j2703p7734
$$ -28653 -30123 10489 -470 19314 28650 51305 62235 23032 29016 35737 23034 -54700
15796e4700K6346P7709j2067k0636J4288O762l2116n5144J142k899J68M1496N1520
$$ -54700 -28354 49355 37288 16652 30940 37702 5586 -49558 -48416 -51315 -51147 -9651 41869
15783D1869l0465l5457j5603Q908K118j5425M4932J1266n4130k7915O1933L8201
$$ 41869 11404 -24053 -39656 -30748 -28630 -44055 877 12143 -41987 -69902 -7969 30232
15771C0232k0971q1950K393N3975K9333J5274j4796L3332O595o1021n4436L0069
$$ 30232 9261 -72689 -70296 -16321 13012 28286 13490 46822 53417 -7604 -62040 -31971
15759c1971M2423P48J8765k6873l903j360k3607N2433k602m1395j2538j4595o315
$$ -31971 10452 11200 29965 3092 -811 -2171 -25778 26655 24053 -17342 -29880 -44475 -50790
15746e0790K0703K0049r45P340j752k2551o737L0349L130l3998o3366r103K164
$$ -50790 -30087 -10038 -10983 -3643 -5395 -27946 -34683 -4334 -1204 -35202 -98568 -107671 -105507
15733a05507p691M9885P9340k034j9947J5506J0710Q200r993o5390n0770R87K6154
$$ -105507 -113198 -63313 16027 13993 -5954 9552 20262 28462 18469 -46921 -97691 -96704 -70550
15720g0550Q03K0635L8551N2057j0211k0608l5951P292M0694j1221m6915l4707
$$ -70550 -69747 -49112 -10561 41496 31285 10677 -25274 -17982 22712 11491 -35424 -70131
15708g0131J8696k6788o866K1107p641L8489P944m5187j5843M0646R0967M7630
$$ -70131 -51435 -78223 -85089 -63982 -71623 -33134 -25190 -70377 -86220 -45574 45393 93023
15696I3023N10n5158n1202M221l6498j6818J9526L5617j1476k0319q437L621L1867
$$ 93023 93533 38375 -12827 -8606 -45104 -61922 -42396 -6779 -18255 -38574 -47011 -43390 -11523
15683a1523l1269o1644L951j1124L1294P217K1453J3275J3809m6525M8012L6613
$$ -11523 -42792 -104436 -100485 -111609 -80315 -73098 -51645 -38370 -24561 -71086 -23074 13539
15671A3539j243k3532J9891j7204o1056j9223K3577M8558N2322M5094J0048j6374
$$ 13539 12296 -11236 8655 -8549 -69605 -88828 -65251 -16693 35629 80723 90771 74397
15659G4397l3066l3176l7256p647k2629P999K5651N649k6678K429P1879K9932
$$ 74397 41331 8155 -29101 -36748 -59377 -51378 -25727 -20078 -46756 -44327 27552 57484
15647E7484k7460k5803L367l8838k9790L5698J786J4653l073R79m3037l9761O386
$$ 57484 30024 4221 7588 -31250 -61040 -25342 -23556 -8903 -11976 -10997 -54034 -93795 -87409
15634h7409M0423j7703K4238l7709j3924K4238J7619j5324J3578K4305m2993k5771
$$ -87409 -46986 -64689 -40451 -78160 -92084 -67846 -50227 -65551 -51973 -27668 -70661 -96432
15622i6432K4009M8068J8369R883L3213k7456j9566M4604l3227m5801k2312m0800
$$ -96432 -72423 -24355 -5986 3897 37110 9654 -9912 34692 1465 -44336 -66648 -107448
15610a07448k7932N5055M190j957K3716O5584R239l7120k0225N646R454R7051
$$ -107448 -135380 -80325 -76135 -78092 -54376 11208 20447 -16673 -36898 -31252 -21798 75253
15598G5253L1970n0539l0056m1797J1387O188n529N2025P045p9364l3983J2345
$$ 75253 107223 56684 26628 -15169 -3782 2406 -3123 48902 55947 -23417 -57400 -45055
15586d5055j5549q259O6672r515k6046p590j5574K6773J1956R231K8068j5964
$$ -45055 -60604 -68863 -2191 -11706 -37752 -45342 -60916 -34143 -22187 -12956 15112 -852
15574h52j5881j8696l9375j2260O54P623J0679k2606N12M1910O8497j0788l4872
$$ -852 -16733 -35429 -74804 -87064 -86410 -78787 -68108 -90714 -90202 -48292 20205 9417 -25455
15561b5455l8176l1586J9117R3089M3545l7533m6853K298n03o898k3059k850M5362
$$ -25455 -63631 -95217 -76100 16989 60534 23001 -23852 -21554 -22057 -28955 -52014 -54864 -9502
15548i502J0227k7415M408L254K0816M1084J9640J9719P715m8040J3316K4780
$$ -9502 725 -26690 -22282 -19028 1788 42872 62512 82231 89946 41906 55222 80002
15536H0002l40k1303K8782J6287m6409o942O549n1809m5278j2062l9038p666K2663
$$ 80002 79662 58359 87141 103428 57019 50077 56626 4817 -40461 -52523 -91561 -99227 -76564
15523g6564M6556k0809L3917L491j5188k8854L2831l34L7451p210n0466L0886
$$ -76564 -30008 -50817 -16900 -13409 -28597 -57451 -24620 -24954 12497 5287 -45179 -14293
15511a4293O7687M9062k4145m4837j8819N130L4499L4923J9577m9399o1498K643
$$ -14293 53394 102456 78311 33474 14655 19785 54284 89207 108784 59385 -2113 530
15499E30j3208j6297l2261J2480l70O4425r329n2528k6245J4927L7430j8372N0013
$$ 530 -12678 -28975 -61236 -48756 -49126 15299 5970 -46558 -72803 -57876 -20446 -38818 11195
15486A1195L748k9959l7032o8576l3335N7475J07989K3970k3970l430j2872L2581
$$ 11195 14943 -15016 -52048 -120624 -153959 -96484 11505 35475 11505 8075 -4797 27784
15474B7784n8626J5302J0632m4062j805O3954L6284J6976K403N842l2171R163
$$ 27784 -30842 -15540 -4908 -48970 -50775 13179 49463 66439 68842 74684 42513 51676
15462E1676J4418j3854l4331q355l8152j0696M3484L400o3277R644J4879J2972
$$ 51676 66094 52240 17909 9554 -28598 -39294 4190 7590 -55687 -46043 -31164 -18192
15450a8192K8120L2549N4464k640K2974n3768p6531n4584K0463j469L1190l2246
$$ -18192 9928 42477 96941 94301 117275 63507 -13024 -67608 -47145 -48614 -17424 -49670
15438d9670J2738K140k807O71k9396j4057M8367k411O105L4154j3014J3967O1062
$$ -49670 -36932 -34792 -37599 -36928 -66324 -80381 -32014 -34425 -28320 5834 -7180 6787 67849
15425F7849J2269k3429n7772l3910N8456J1172l2620k8860K3006o313l3648L8695
$$ 67849 80118 56689 -1083 -34993 23463 34635 2015 -26845 -3839 -10152 -43800 -5105
15413e105k5556k2086M5415Q5689J4506k8893n2637k4725k872j2207m3496J1139
$$ -5105 -30661 -52747 -7332 78357 92863 63970 11333 -13392 -16264 -28471 -71967 -60828
15401f0828M5761k4944O6287j0631m2309N828K1242L3015J8035q287J0844j7727
$$ -60828 -15067 -40011 26276 15645 -26664 -20836 406 33421 51456 43169 54013 36286
15389C6286n8996M38M2973K4041N4467L3194n8006l4874m546j3066j0407q088
$$ 36286 -22710 -22272 20701 44742 99209 132403 74397 39523 34977 21911 11504 3416
15377C416k9591M264M0385K529j8445k978m185K8728j2022k8482P6949L0676M370
$$ 3416 -26175 -21911 18474 21003 2558 -420 -4605 24123 12101 -16381 60568 91244 95614
15364I5614l1702K0467J502k4586l3375p0295J9203M3162M1618l1655o9202L4217
$$ 95614 63912 84379 85881 61295 27920 -42375 -23172 19990 61608 29953 -39249 -5032
15352e032m2663J0509k3656j242K2786M9882K8212k8791n8801Q714M3285K6894
$$ -5032 -47695 -37186 -60842 -62084 -39298 10584 38796 10005 -48796 -40082 3203 30097
15340C0097J0151n0512m9602K9308N7994m1482o9601O7303R1887L3370j003l6995
$$ 30097 40248 -10264 -59866 -30558 27436 -14046 -83647 -16344 75543 108913 107910 70915
15328G0915j9524m7342M980O518l9268l724J0408K2229q0850m5665J4725R6336
$$ 70915 51391 4049 9029 15547 -23721 -27445 -17037 5192 -75658 -121323 -106598 -10262
15316a0262P9728l384K5763K5007o211Q950p9556l676L1409k5171K9794M5837
$$ -10262 69466 66082 91845 116852 110641 119591 40035 36359 67768 42597 72391 118228
15304A18228o5829o6242K794J9895M2504K5458m245k6954m1091n315M4126m1614
$$ 118228 52399 -13843 -11049 8846 51350 76808 72563 45609 4518 -797 43329 1715
15292A715P730N4705k8558M396L156J9620L401k6569l0864M5456j7763k5904j6986
$$ 1715 9445 64150 35592 39988 43144 62764 66165 39596 8732 54188 36425 10521 -6465
15279f465J3075l646J2027J1642r648L9379L9790K6067J8070j7409n8082j6088
$$ -6465 6610 2964 14991 26633 16985 56364 96154 122221 140291 122882 64800 48712
15267D8712N9295l7071l5918o85k4864k5400Q182r445j9266K8566K5195r261o6786
$$ 48712 108007 70936 35018 34333 9469 -15931 -7749 -17194 -36460 -7894 17301 8040 -58746
15254e8746J5800O1827L3009P244L73l6988m1910j2702O4114L4538q1567j1234
$$ -58746 -42946 18881 51890 59134 59507 22519 -19391 -32093 32021 66559 -15008 -26242
15242b6242K7516J0469k9009n491L3494j8837n468n755j8524L5435K2944Q408
$$ -26242 1274 11743 -17266 -22757 10737 -8100 -13568 -19323 -37847 -2412 20532 28940
15230B8940l4012J2873O245L7227J3334r932o0902K1826J7799J7819K6376L9452
$$ 28940 -5072 7801 14046 51273 64607 54675 -6227 15599 33398 51217 77593 117045
15218A17045J0588j2528n3088l0654K8520L1189m083l1636l8991l3310m5025j3408
$$ 117045 127633 115105 62017 31363 59883 91072 86989 55353 16362 -16948 -61973 -75381
15206g5381K9428Q754L1518K6750J2654k813l8421m1804j8879N7589O6215K369
$$ -75381 -45953 -37199 -5681 21069 33723 30910 -7511 -49315 -68194 -10605 55610 57979
15194E7979l5341m6302J20M8452J0556j5051K8314J0695L9333j5616m0308J293
$$ 57979 22638 -23664 -23544 24908 35464 20413 48727 59422 98755 83139 42831 44124
15182D4124j5681Q413k6692j9248K5140l857k1559K6354r246K5238j1143k5413
$$ 44124 28443 36856 10164 -9084 16056 12199 -9360 16994 7748 32986 21843 -3570
15170c570K1985p5737l5210N4461k7994m2269N1807O3225J1639p785n2339k481
$$ -3570 18415 -57322 -92532 -38071 -66065 -108334 -56527 6698 18337 10552 -41787 -44268
15158d4268j7M6921J5842r630K2124k2565K3052j4897n4217L0275P7507Q765n882
$$ -44268 -44285 2636 18478 8848 30972 8407 31459 16562 -37655 -7380 70127 78892 73010
15145G3010k4054K2071n8457m6820k1383r667N0934N795m049M6621J6947L3614
$$ 73010 48956 71027 12570 -34250 -55633 -65300 -14366 -8571 -12620 34001 50948 84562
15133H4562O711j4259m0208l6048K0544K9592j1688L3093l023k3923j750K0178
$$ 84562 91273 77014 36806 758 21302 50894 39206 72299 69276 45353 43603 63781
15121F3781o070J7888L0188m0633r3269j7184K7020K9158j8790j2716L7093L3579
$$ 63781 57711 75599 105787 65154 -28115 -45299 -18279 10879 -7911 -20627 16466 50045
15109E0045q8194o636M1607l0438N628j5861O994K8717K7767j7884J2583K1271
$$ 50045 -38149 -44785 -3178 -33616 -27988 -43849 -36855 -8138 19629 1745 14328 35599
15097C5599l0086m3741l3345k080K6501P1681j6372J1412L0386Q902l6478o0608
$$ 35599 5513 -38228 -71573 -73653 -47152 24529 8157 19569 49955 58857 22379 -38229
15085c8229l6890J0577M0459L0124m915K6726L0445R584k3395J0486l1319l7443
$$ -38229 -75119 -64542 -24083 6041 1126 27852 58297 67881 44486 54972 23653 -13790
15073a3790q362j5614j438R8592N1035j379j9236j5952J7530j2611m7931J73J8831
$$ -13790 -22152 -37766 -39204 59388 110423 109044 89808 73856 91386 78775 30844 31017 49848
15060D9848K7630k345k6060m7804k8690J0218L0807P784j0679N435k6061J3536
$$ 49848 77478 75133 49073 1269 -27421 -17203 13604 21388 10709 16144 -9917 3619
15048C619N3508j5670l3253m9081J5517N962l2410k4309m904l12j398j6964M4065
$$ 3619 57127 41457 8204 -40877 -25360 -19398 -51808 -76117 -81021 -81333 -82731 -99695 -55630
15035e5630N9800l5293k8900M6753P134J4778j5589j9336p86J0384p480L2433
$$ -55630 4170 -31123 -60023 -13270 -6136 8642 -6947 -26283 -27069 -16685 -24165 8268
15023H268j6070p199k685M2100N8770l5924o8903L1495P051n5156q599J3025l7116
$$ 8268 -7802 -15001 -17686 24414 83184 47260 -21643 9852 16903 -38253 -46852 -33827 -70943
15010g0943P1987K7262j169k3659J514l106J4038N3343j827k6837J9837P1360
$$ -70943 1044 28306 27137 3478 4992 1886 15924 69267 67440 40603 60440 131800
14998A31800K1105O62r2369p2348O71l4308K9140O629J8342J61j3466K2292p2
$$ 131800 152905 153567 61198 -11150 -10479 -44787 -15647 -9018 9324 9485 -3981 18311 18239
14985A8239j8292k2891J7357N5142O6402j8633p5429l7078M556p517J7008K2159
$$ 18239 -53 -22944 -5587 49555 115957 97324 21895 -15183 -10627 -18144 -1136 21023
14973B1023M6688N720m0970k9945J4327K0033K4619n2436k0284k4286J5833M2787
$$ 21023 67711 73431 32461 2516 16843 36876 61495 9059 -11225 -35511 -19678 23109
14961B3109Q327K8442j1878l3159n4715m6027M4633k0622j2609M8387K8889k3076
$$ 23109 31436 59878 48000 14841 -39874 -85901 -41268 -61890 -74499 -26112 2777 -20299
14949b0299l0848L359P0364J4659J349J4011K0807l9021l7122K387M649L9060
$$ -20299 -51147 -47788 22576 37235 38584 52595 73402 34381 -2741 -354 4295 43355
14937D3355K9308k3633l6382J7556l4009n8140O716L4731L1755K0330l4907j7218
$$ 43355 72663 49030 12648 30204 -3805 -61945 -55229 -20498 11257 31587 -3320 -20538
14925b0538P6183l3583P251j7617k4071L3113L7261K2328J7918n6232l1434o0194
$$ -20538 55645 22062 29313 11696 -12375 20738 57999 80327 98245 42013 10579 -49615
14913d9615l7216K7062K5965N1195K9292j0241q9847l4685o954P431M019Q333
$$ -49615 -86831 -59769 -33804 17391 46683 36442 -53405 -88090 -95044 -87613 -83594 -75261
14901g5261P0062M546n262k951Q068R347L1876j584n3462J6825J1425k3162l3001
$$ -75261 -5199 -653 -5915 -8866 -798 8549 40425 38841 -14621 2204 13629 -9533 -42534
14888d2534l2214J2574j3610k1740J5748K3209l565j371J7323P913j0528l442
$$ -42534 -74748 -62174 -75784 -97524 -81776 -58567 -62132 -63503 -46180 -38267 -48795 -52237
14876e2237J03095j3447n9797K3401K5920K9065r213q051J2490k8917k9893L6989
$$ -52237 50858 37411 -22386 1015 26935 56000 46787 38736 51226 22309 -7584 29405
14864B9405N118n9562R232N7366J0035j4833J3579m9635o82l0688j5953K8647
$$ 29405 34523 -25039 -15807 41559 51594 36761 50340 705 23 -30665 -46618 -17971
14852a7971L8160j1020l2770L885J3321L5701L8156L83l6222n6284L830j6100
$$ -17971 20189 9169 -23601 -19716 -6395 29306 67462 67845 31623 -24661 -20831 -36931
14840c6931J6215K4714J99k7266O816L0390l4211k4755N4322J7094K203j4675
$$ -36931 -20716 3998 4197 -23069 -16253 14137 -20074 -44829 9493 26587 28790 14115
14828A4115K9098m1782n275p519k5431J2882J7146M2201n987J2746l3283l6426
$$ 14115 43213 1431 -3844 -11363 -36794 -23912 -6766 35435 29448 42194 8911 -27515
14816b7515j9051m5834P6308M0214J5570J9032L2611k0865j689l0800L4662k384
$$ -27515 -46566 -92400 -16092 24122 39692 58724 91335 70470 68781 37981 72643 70259
14804G0259k1090l5180M8442J6243k3632k2565J5720m7151k143j4324l1202O2053
$$ 70259 49169 13989 62431 78674 55042 32477 48197 1046 -1097 -15421 -46623 15430
14792A5430L263p527Q277K8114N1337p977l2787q768m7917p237j5868K7313j8121
$$ 15430 18693 11166 19443 47557 98894 90917 58130 49362 1445 -5792 -21660 5653 -12468
14779a2468N4471K5664r189k7339o8862L9824q502j0058Q5744K5363o0949j2165
$$ -12468 42003 67667 58478 31139 -37723 2101 -6401 -16459 69285 94648 33699 21534
14767B1534m3003r432N9152L9060m8706k1786K7436j8554k6221k6670L8754N9889
$$ 21534 -21469 -30901 28251 67311 18605 -3181 24255 5701 -20520 -47190 -8436 51453
14755E1453K2645k894k6372l6180l4975m6941L1021N3042r990k912L0072M737
$$ 51453 74098 71204 44832 8652 -26323 -73264 -42243 10799 809 -2103 27969 32706
14743C2706q2995l3383O7054K3940L8323K2920K0204p1981m6298L3804l723O156
$$ 32706 -50289 -83672 -16618 7322 45645 68565 88769 16788 -29510 4294 571 6727
14731F727j8437N881J5219m0104o714P262k815J3111K3499L4252l742m1500k24
$$ 6727 -11710 -5829 9390 -30714 -37428 -30166 -32981 -19870 3629 37881 34139 -7361 -7585
14718g585K7150O0512M1851J1197q899l7830J4911Q15j7332l2317l6470L8385
$$ -7585 19565 80077 121928 133125 124226 86396 101307 102122 84790 52473 16003 54388
14706E4388M3261j7387k1312K6377K702L525j1397l869k5905K522J5124l0654
$$ 54388 97649 80262 58950 85327 88029 91554 80157 76288 50383 52905 68029 37375
14694C7375K3332J5617l286j2904P831K7178K5695P994l0516j3957m7126n4343
$$ 37375 60707 76324 73038 60134 67965 95143 120838 128832 98316 84359 37233 -17110
14682a7110j4525J414N7543m6726k2108K4922K4937m082o9037m9839o520L6268
$$ -17110 -31635 -30221 27322 -19404 -41512 -16590 8347 4265 -64772 -114611 -121131 -84863
14670h4863M4297J9523N3286N9480j2718j9282m3760k8214l9672j197j4171K2084
$$ -84863 -40566 -21043 32243 91723 79005 59723 15963 -12251 -51923 -53120 -67291 -45207
14658d5207L3804J00314O485l7650n2803J503J5586j7769m8291k7445N1343N0535
$$ -45207 -11403 88911 95396 57746 4943 6446 22032 4263 -44028 -71473 -20130 30405
14646C0405O402k4842N0759J6718o9514K738N67J7613K1694L7337n6948m8636
$$ 30405 36807 11965 62724 79442 9928 12666 13233 30846 52540 89877 32929 -15707
14634a5707j8296L1857L2220N420m4376J82N5820J5684K797q321j3035n484L1662
$$ -15707 -34003 -2146 30074 35494 -8882 -8700 47120 62804 65601 57280 44245 38761 70423
14621G0423l0791j6667j6951k5237k4684O2440j9861J40L5897k8955l2497L1449
$$ 70423 39632 22965 6014 -19223 -43907 18533 -1328 -1188 34709 5754 -26743 4706
14609D706J7592k08K7674L6877l8013m9251l0408k3681L648n408q933J647P8155
$$ 4706 22298 22090 49764 86641 48628 -623 -31031 -54712 -51064 -56472 -65405 -63758 14397
14596A4397N6876m299J4645l4749l9113j9575l2031o440J1902N0263J0070O4582
$$ 14397 71273 66974 81619 46870 7757 -11818 -43849 -50289 -38387 11876 21946 86528
14584H6528j1335l7953K1510J436j221m1853k7887L2589j8413j249J8039j1508
$$ 86528 75193 37240 58750 60186 58965 17112 -10775 21814 3401 2152 20191 8683
14572H683P916L4183K0084N4924n94j0696j1311l7161l8612m847M227R9028L9721
$$ 8683 16599 50782 70866 125790 125196 114500 103189 66028 27416 22569 26796 125824 165545
14559A65545n6523k8702j1563M432l4514J4865J9568k1939j7246J8184K1711J8548
$$ 165545 109022 80320 68757 73189 38675 53540 73108 51169 33923 52107 73818 92366
14547I2366n5803k4719K7070L8622J0260L604k9786o619J8868k3181q741j0905
$$ 92366 36563 11844 38914 77536 87796 91400 61614 54995 73863 50682 41941 31036
14535C1036J1035L2564O651J3648p325l6881p0263O226J8828K2106J0062K5270
$$ 31036 42071 74635 81286 94934 87609 50728 -19535 -13309 5519 27625 37687 62957
14523F2957k3018n5166L2455k7034k9705J0931O9538L2158L3420m877l9477m6349
$$ 62957 39939 -15227 17228 -9806 -39511 -28580 40958 73116 106536 101659 62182 15833
14511A5833l7065l704K6601L4265J7475L275m4600n430J0217k4939L659P1284
$$ 15833 -21232 -24936 1665 35930 53405 56680 12080 6650 16867 -8072 -4413 66871
14499F6871o967l4340L3161N0436l9014k8373j2516k5223M3771j2841k712O6755
$$ 66871 59904 25564 58725 109161 70147 41774 29258 4035 47806 34965 32253 99008
14487I9008J9594l4831k3500l5255k2551Q201j2430J1058M8997M1518N1030q604
$$ 99008 118602 83771 60271 25016 2465 10666 -1764 9294 58291 99809 150839 142235
14475A42235l2514k7644k0533L0931J3011l0781n0861M6012J5926k2637q338k527
$$ 142235 109721 82077 61544 92475 105486 74705 23844 69856 85782 63145 54807 52280
14463E2280k5956L4186m5886p1409P322L4341N9784M389m1368J6455J2463L9987
$$ 52280 26324 60510 14624 -56785 -49463 -15122 44662 49051 7683 24138 36601 76588
14451G6588k5797L3986L5420N552o18j6135k4345k5199o8957j9713M3449L659
$$ 76588 50791 84777 120197 125749 125131 108996 84651 59452 -9505 -29218 14231 17890
14439A7890J7240j9711K7510J161L7102L9803j0362l1627l5089l0382m4986P200
$$ 17890 35130 15419 42929 44090 81192 120995 110633 79006 43917 13535 -31451 -24251
14427b4251l5101m6658R7948Q765m306L9689M1206k2766L3946K5442K7753k5128
$$ -24251 -59352 -106010 -8062 703 -3603 36086 77292 54526 88472 113914 141667 116539
14415A16539k0150k3096j3980N4403R172r865m6932m4936l1318n78J5020Q816
$$ 116539 96389 73293 59313 113716 122888 113023 66091 21155 -10163 -10741 4279 13095
14403A3095M4111k1065m8730K898j9565L0013J8334J5389J9025l3016L4152J6240
$$ 13095 57206 36141 -12589 -9691 -29256 757 19091 34480 53505 20489 54641 70881
14391G0881m647J1446m748J494k2176l006K8461k3467l721k4138J8816K4087k6351
$$ 70881 66234 77680 72932 74426 52250 49244 77705 54238 50517 26379 45195 69282 42931
14378D2931k5518K9305j7559k2044K6767J3850L8070J4204k557l6401o1396K1624
$$ 42931 17413 46718 29159 7115 33882 47732 85802 100006 97449 61048 -348 21276
14366B1276K0287l7450j8153K264K941P0962L0415J8698L4606n183q49l455k9987
$$ 21276 41563 4113 -14040 -11776 -8835 62127 92542 111240 145846 140663 139814 136359 106372
14353A06372l5424l9476l1842P835N4040J7838j2435R535N863p1348p954L6899
$$ 106372 70948 31472 -370 7465 61505 79343 66908 76443 82306 10958 3004 39903
14341C9903J7869j3679J500m9274N306L1172J4314O4950J631j2866j1654M235
$$ 39903 57772 44093 45593 -3681 1625 32797 47111 112061 113692 100826 89172 93407
14329I3407L3497q222l7620k6433m7178O5941L8062m0537m9095j4149K1058k8109
$$ 93407 126904 118682 81062 54629 7451 73392 111454 70917 21822 7673 28731 622
14317F22M8064K5904R759k6005M7504P7601J9211J198o182k8669r3181j1362Q199
$$ 622 48686 74590 84349 58344 105848 183449 202660 203858 197676 169007 75826 64464 72663
14304G2663K8780p4570l7268K2652q89J3378K4669R6430L8125l8047l7976J9695
$$ 72663 101443 26873 -10395 12257 11368 24746 49415 145845 183970 145923 107947 127642
14292A27642M5202J028l9218m9898l554m549k0228K5668K930R023L6887J8075
$$ 127642 172844 173872 134654 84756 81202 76653 56425 82093 85023 94046 130933 149008
14280A49008k1775R231k2521o77k0768n6274r829J7469J0050N1187O708m2475
$$ 149008 127233 136464 113943 113266 92498 36224 26395 43864 53914 105101 111809 69334
14268F9334n2710J3047M3708l008k5411K0382P696Q391J2267j0125o30M2591L8763
$$ 69334 16624 29671 73379 70371 44960 65342 73038 81429 93696 83571 82941 125532 164295
14255A64295K9855J7780m8864j21929L1615O1262m0333L8353L688K4405r2561
$$ 164295 194150 211930 163066 41137 72752 134014 93681 132034 135722 160127 67566
14244F7566l7947q475L33l14O4583J6085l8352l2353k5459L4036O8465L5970k3300
$$ 67566 29619 21144 21477 21163 85746 101831 63479 31126 5667 39703 108168 144138 120838
14231A20838L582Q652j3652K046J376j9446L4710Q38k39J4165K8223J9688q7438
$$ 120838 124420 133072 119420 121466 122842 103396 138106 138944 138705 152870 181093 200781 113343
14218A13343j3025J6361P190k5834M4660k6183n261o4993l9037k4956N3143J0599
$$ 113343 100318 116679 123869 98035 142695 116512 111251 46258 7221 -17735 35408 46007
14206D6007J6450N8527m364n3956o2017K026j6202K8107j3159J7673r248K5072
$$ 46007 62457 120984 116620 62664 647 2673 -13529 14578 1419 19092 9844 34916
14194C4916j3024l2193K5215J5368p038K235L5938J901J1674J4462L365L5056
$$ 34916 21892 -10301 14914 30282 23244 25479 61417 63318 74992 89454 92819 127875
14182A27875L1200l0884k4393P293j7277M474L5494N757k2784k6480n9836k0280
$$ 127875 159075 128191 103798 111091 93814 98288 133782 139539 116755 90275 30439 10159
14170A0159K9564K6240p521L6657M3422k9630j7584L0137l9538J0587L1166J1535
$$ 10159 39723 65963 58442 95099 138521 108891 91307 121444 81906 92493 123659 135194
14158A35194k8419j1221q9074p2286K7081L2666K9932k387m9986K4227M1162M0377
$$ 135194 106775 95554 6480 -65806 -38725 -6059 23873 21486 -28500 -4273 36889 77266
14146G7266l5534k8479R779K659J1417r10n7058j4483L1274M0896N1938o886m3492
$$ 77266 41732 13253 23032 25691 37108 36198 -20860 -35343 -4069 36827 88765 81879 38387
14133C8387r477J8157K8213L28k0001j4997l1356K0447O8271j4187r496p860k1023
$$ 38387 28910 47067 75280 75608 55607 40610 9254 29701 97972 83785 74289 66429 45406
14120D5406J0230m807n658N8343l1064k8249K401k134N698M2216J9583M2058l1731
$$ 45406 55636 50829 45171 103514 72450 44201 46602 44468 50166 92382 111965 154023 122292
14107A22292N034m8646r2272L963J7736N2510O3037n1539o2799K087M1614J4882
$$ 122292 127326 78680 -13592 -9629 8107 60617 123654 72115 9316 11403 53017 67899
14095F7899Q360l25l7166J8611L0608K40l2088j7520j4005O7837N8275j1100l6022
$$ 67899 76259 75934 38768 57379 87987 88227 56139 38619 24614 92451 150726 139626 103604
14082A03604J3091n4187l2436k0940K7979N791j0588k5360M6346K7690J3565J4247
$$ 103604 116695 62508 30072 9132 37111 42902 32314 6954 53300 80990 94555 108802
14070A08802P052J991M86k3825K0136k8900Q101L8976q313j8220L8838o5111p634
$$ 108802 115854 117845 118331 94506 114642 85742 93843 132819 124506 106286 145124 80013 72379
14057G2379N331j5469L142L5711l621l9077j3299M4843m894l6638j4084K9943
$$ 72379 77710 62241 65383 101094 97473 58396 45097 89940 85046 48408 34324 64267
14045F4267L1331J446n1889q7840j0735R3949M5754K8423M03n8648m1740P145
$$ 64267 95598 97044 45155 -42685 -53420 40529 86283 114706 115109 56461 14721 21866
14033B1866M0168M116J7127r18q035K4118k0761K9843L598p1569n219n8698M248
$$ 21866 62034 66150 83277 82359 74324 98442 77681 107524 111122 39553 34334 -24364 -20116
14020b0116O9506J15640k0817n9297Q900R343N1928J2757k4149k7386n5353n1161
$$ -20116 49390 165030 144213 84916 93816 103159 155087 167844 143695 116309 60956 9795
14008I795m5445m702P5549Q6958N1703l1659l9561l6974q5442N5227L8545j7261
$$ 9795 -35650 -40352 35197 122155 173858 142199 102638 65664 -19778 35449 73994 56733
13996E6733o286j7157l5727N0251N1484k786m4251K1669Q4482J5561p256K016
$$ 56733 50447 33290 -2437 47814 99298 96512 52261 73930 158412 173973 166717 168733
13984A68733q467m8477l2216J519R003k8384r70K2071J1387J5060j4702j0557
$$ 168733 160266 111789 79573 81092 90095 61711 60741 82812 94199 109259 94557 84000
13972H4000K4251K0636L9257n2085k7367K4284j090p563k8363r319M106m916K7912
$$ 84000 108251 128887 168144 116059 88692 112976 111886 104323 75960 66641 70747 65831 93743
13959I3743m2577n0782N885P9194N1810l1769K205J8506l15K7127K8509k5182
$$ 93743 51166 384 6269 85463 137273 105504 107709 126215 125900 153027 181536 156354
13947A56354j9051j400o1873k5418J6358K8433J7244k8358J9519J5934j7179j3122
$$ 156354 137303 135903 74030 48612 64970 93403 110647 82289 101808 117742 100563 87441
13935H7441K6237Q607k9006J7823K0557J7276k9513l3070m5092k9330J8847P1959
$$ 87441 113678 122285 93279 111102 131659 148935 119422 86352 41260 11930 30777 102736
13923A02736M611M029M1181L0068k9296N047J7192n0449o3438q309Q5192J3313
$$ 102736 107347 111376 152557 182625 153329 158376 175568 125119 61681 53372 138564 151877
13911A51877m8361R838L1755L6588L383j2439l5086j6730p108p1480m7487L7176
$$ 151877 103516 113354 145109 181697 185080 172641 137555 120825 113717 42237 -5250 31926
13899C1926M1923K2942j190l9215J6995R469J4763Q15j5960R83N3005j4877k8085
$$ 31926 73849 96791 95601 56386 73381 82850 97613 98428 82468 83451 136456 121579 93494
13886I3494m3574K5099L0357k0245J6362J8338K7926n0088k5149l0554Q2241L4504
$$ 93494 49920 75019 105376 85131 101493 119831 147757 97669 72520 41966 124207 158711
13874A58711l6671j0852J8190Q118L1772n037j19092j4699L1984N3860k1466K69
$$ 158711 122040 111188 129378 137496 169268 164231 45139 30440 62424 116284 94818 95087
13862I5087r618l4563K6230M897J5542J3845J5053l862o734n391o866j934j0368
$$ 95087 85469 50906 77136 82033 97575 111420 126473 122611 115877 110486 103620 101686 91318
13849I1318P522l8629M5309K5858r639M8157N5434n2834m9155n7927k6966Q0991
$$ 91318 98840 60211 105520 131378 121739 169896 225330 172496 123341 65414 38448 119439
13837A19439j2347j9008r711M873L6224R958o6937n6897M9025o669J0921K8033
$$ 119439 107092 88084 78373 83246 119470 129428 62491 5594 54619 47950 58871 86904
13825H6904j7932L4372k3454k4244K3492l7672k1254Q8846O3800k6406m9805m2451
$$ 86904 68972 103344 79890 55646 79138 41466 20212 109058 172858 146452 96647 54196
13813E4196L4754K8746K0107L0501J1306l5271j12944j7084K2595q724O2158K9953
$$ 54196 88950 117696 137803 168304 179610 144339 31395 14311 36906 28182 90340 120293
13801A20293L6734M2812k9208m7272n5645K494J8725K0536N9427Q771J9673l5492
$$ 120293 157027 199839 170631 123359 67714 70208 88933 109469 168896 177667 197340 161848
13789A61848L4105J7622p120L481J9620m6532o5614l1298j2422l3204P902O041
$$ 161848 195953 213575 206455 209936 229556 183024 117410 86112 73690 40486 48388 54429
13777E4429L561L0796P5860N8064q8109k9202l1831q18K9387L671L0473J7375
$$ 54429 57990 88786 164646 222710 134601 105399 73568 72750 102137 105808 136281 153656
13765A53656J0372o5013l3588K8826K5601L0050k4633O691j5070L9508j7203j6803
$$ 153656 164028 99015 65427 94253 119854 149904 125271 131962 116892 156400 139197 122394
13753A22394J2034k3331j540l3979o2117J551K2143K4111M0807L951K4611K1895
$$ 122394 134428 111097 109557 75578 13461 15012 37155 61266 102073 106024 130635 152530
13741A52530l4968m0013L6494O8821J9955m0546o0613J4227L730L2771n1979L439
$$ 152530 117562 77549 114043 182864 202819 162273 101660 115887 119617 152388 100409 103848
13729A03848k0883J5914j6270L8515O0105K8123l3155q6047J8744M3450p262n5322
$$ 103848 82965 98879 82609 121124 181229 209352 176197 90150 108894 152344 145082 89760
13717H9760l4089L8772M4936J8142j6452l1938L0654M8827m8879l0127J6361J0309
$$ 89760 55671 94443 139379 157521 141069 109131 139785 188612 139733 109606 125967 136276
13705A36276J2168n398m6006K8860J5402k8518j0802N2860L0790j3270n6743l1846
$$ 136276 148444 143046 97040 125900 141302 112784 101982 154842 185632 172362 115619 83773
13693H3773L479N2865L079P710q508M4877K2801q8221o4797n6401j3179R4222
$$ 83773 87252 140117 143196 150906 142398 187275 210076 121855 57058 657 -12522 81700
13681H1700P2407l6170m8229Q217K0071O378J5621Q1617K3402n7533j3879L9874
$$ 81700 154107 117937 69708 77925 97996 104374 119995 201612 225014 167481 153602 193476
13669A93476N3599P285J3471j3754m0288m4933j0623J4312m7169k7853J255N9261
$$ 193476 247075 254360 267831 254077 213789 168856 158233 172545 125376 97523 98778 158039
13657A58039J1065J8978K7707J6734n1141k7864p7716k0265R776J33K1504L4992
$$ 158039 169104 188082 215789 232523 181382 153518 75802 55537 65313 65446 86950 121942
13645A21942N6556M259j1718p7365j2676M6368j8140N4851N2586l3590l5891M7937
$$ 121942 178498 182757 171039 93674 80998 127366 109226 164077 216663 183073 147182 195119
13633A95119L3202m2719k8590K0995J0099J8267N6051j0167o3157o2419o0130
$$ 195119 228321 185602 157012 178007 188106 206373 262424 252257 189100 126681 66551
13622F6551n1244l3917O136P2064P3256o479m9005J1929L8321l1282j7724K0619
$$ 66551 15307 -18610 -12474 59590 132846 126367 77362 89291 127612 96330 78606 99225
13610I9225J410k5617r694O5681K4279n1094j0051Q669n1765L998K9088K0574
$$ 99225 100635 75018 65324 131005 155284 104190 94139 102808 51043 55041 84129 104703
13598A04703K3008K7956j6330l6946j100J7717k2325K3696N1007m8974l6814K4697
$$ 104703 127711 155667 139337 102391 101291 119008 96683 120379 171386 122412 85598 110295
13586A10295N589j6775l7998L0504J5810L1470O012L6696L5020k6514k2261j4484
$$ 110295 115884 99109 61111 91615 107425 138895 144907 181603 216623 190109 167848 153364
13574A53364k499J2229p093l168K3966M2488J3773m4688J2307P305o8628K0438
$$ 153364 150865 163094 156001 152833 176799 219287 233060 188372 200679 207984 139356 159794
13562A59794L0108q2815j0855J2673k3218L2251m5406k3444N1247K1913M1239
$$ 159794 189902 107087 96232 108905 85687 117938 72532 49088 100335 122248 163487
13551A63487j823m8407M4074K5399j665n5985J2956N494k6064l9959k3848j115
$$ 163487 161664 113257 157331 182730 181065 125080 138036 143530 117466 77507 53659 52544
13539E2544K1858M1851K2363k8449k0489J0330K5701J6054k1741K5658j118N081
$$ 52544 74402 116253 138616 110167 89678 100008 125709 141763 120022 145680 144562 149643
13527A49643N6696o5200r6779K5764L3310Q59K1071k8824L4456L1652K3691l545
$$ 149643 206339 141139 44360 70124 103434 104293 125364 96540 130996 162648 186339 182794
13515A82794O275M3519M4433l8624j6917l3326m1331L6624k1511m5618K3245J2821
$$ 182794 189069 232588 277021 238397 221480 188154 146823 183447 161936 116318 139563 152384
13503A52384n491q906K2364O2467K4763k503j8711K7401J9892l9432l5085j2060
$$ 152384 146893 137987 160351 222818 247581 245078 226367 253768 273660 234228 199143 187083
13491A87083J2968M3272Q104m8155j26J8134m6477m0911K6132j4463k9384K1508
$$ 187083 200051 243323 251427 203272 203146 221280 174803 133892 160024 145561 116177 137685
13479A37685O8193N9863j4145j4840m5972o1190o2539M6419M1704P891p621m669
$$ 137685 205878 265741 251596 236756 190784 129594 67055 113474 155178 163069 155448 150779
13467A50779l4364K6662N0869l9724k5457j4930M1746N3647k1375n8288M995L9686
$$ 150779 116415 143077 193946 154222 128765 113835 155581 209228 187853 129565 134560 174246
13455A74246Q0405j5886k9986j4305k0254n4399j3163P0176L4526K6528N8765
$$ 174246 254651 238765 208779 194474 174220 119821 106658 176834 211360 237888 296653
13444B96653K9446m1865r5142K2603M3824J0156k1187p2663k1296j7691j2672
$$ 296653 326099 284234 189092 211695 255519 265675 244488 171825 150529 132838 120166
13433A20166M943M9645k1032K4576K6346j318l2598k1370J5995L6202N0791L1629
$$ 120166 125109 174754 153722 178298 204644 203326 170728 149358 165353 201555 252346 283975
13421B83975o3390k2316n975k7233K4792N7061k5082j9363o347N6523N8162n8712
$$ 283975 220585 198269 192294 165061 189853 246914 221832 202469 196122 252645 310807 252095
13409B52095j1361J0852n1119k3845J2829k483L6119M0356j7979l9646L391M8442
$$ 252095 240734 251586 200467 176622 189451 186968 223087 263443 245464 205818 209209 257651
13397B57651m2816l0890q519M697j1411J9339m881N1565J2480l6669m6086r550
$$ 257651 214835 183945 175426 180123 168712 188051 183170 234735 247215 210546 164460 154910
13385A54910L5383n123J2908J1579n4631j0435L9695L8364Q646l1887l6599K5845
$$ 154910 190293 185170 198078 209657 155026 144591 184286 222650 231296 199409 162810 188655
13373A88655K6952M0854P919l8246k8566M86m5410j7924m2836m715Q7682L6835
$$ 188655 215607 256461 264380 226134 197568 198054 152644 134720 91884 87169 174851 211686
13361B11686j9185J5274K0985q708q073J0697k1088k6855m565j796J1887j1792
$$ 211686 192501 207775 228760 220052 211979 222676 201588 174733 170168 168372 180259 168467
13349A68467l9100q095N8403M4382L9459j4513l2827q010Q638l9113M5439q630
$$ 168467 129367 121272 179675 224057 263516 249003 216176 208166 216804 177691 223130 214500
13337B14500k1747Q50K5651R82p032K3366M7610K1345k1737j5347o0482n0190
$$ 214500 192753 193603 219254 220236 213204 236570 284180 305525 283788 268441 207959 157769
13325A57769K0310L791n3134P286P2299L0159k2555n1587l7745P757k1206j7163
$$ 157769 178079 181870 128736 136022 208321 238480 215925 164338 126593 134350 113144 95981
13313I5981L034M6498N1768M883M4781J4206k8595M2672K5671n9130k117M6766
$$ 95981 99015 145513 197281 202164 246945 261151 232556 275228 300899 241769 239652 286418
13301B86418k5055Q628M1108K9671q5319j8599L2918L2624k2256o2676j5458L9248
$$ 286418 261363 269991 311099 340770 255451 236852 269770 302394 280138 217462 202004 241252
13289B41252K1040j0597k9552l1194k1727L9707M5115l0208k7997j4738M5113
$$ 241252 262292 251695 222143 190949 169222 208929 254044 223836 195839 181101 226214
13278B26214j024K294K7329j1618k2324L0377L1499j1017j6341l7819j8535N421
$$ 226214 225190 227484 254813 243195 220871 251248 282747 271730 255389 217570 199035 204456
13266B04456p0725j7236j315K1576n573J4820J8039J9037q138M2744N2855k9434
$$ 204456 133731 116495 115180 136756 131183 146003 164042 183079 174941 217685 270540 241106
13254B41106m6265J3116l9886k981M5216P583J6618L8928L3773p0436m0322K999
$$ 241106 194841 207957 168071 165090 210306 217889 234507 273435 307208 236772 196450 199449
13242A99449l5733L4446L3512L0197m919M822o528k7727L1942M059J7578M7075
$$ 199449 163716 198162 231674 261871 256952 261774 255246 227519 259461 263520 281098 328173
13230C28173k897K284k7132M325k9340o8793l6241K3333J4704Q595J5533J4541
$$ 328173 325276 327560 300428 304753 275413 206620 170379 193712 208416 217011 232544 247085
13218B47085l4744k6113J2940P1352N1635k6625O981l1601m2010j5892J4304K5584
$$ 247085 212341 186228 199168 270520 322155 295530 302511 270910 228900 213008 227312 252896
13206B52896J7009k3468k887L3960K567k139l91k1047l2289J5475J6189j9959
$$ 252896 269905 246437 243550 277510 280077 277938 277547 256500 224211 239686 255875 235916
13194B35916K9669L206J9415J4837o0928o5464K7399K0362m432N6647P593q08
$$ 235916 265585 268791 288206 303043 242115 176651 204050 224412 219980 276627 284220 283412
13182B83412l040K4352l1387m5884J0631m4732j2127J2924M1742J3761k535N6124
$$ 283412 280372 304724 273337 227453 238084 193352 181225 194149 235891 249652 247117 303241
13170C03241k1371M353M0343K9444q210q319J8470J4405L4869l5146J0646j3929
$$ 303241 281870 286223 326566 356010 347800 339481 357951 372356 407225 372079 382725 368796
13158C68796m4874m5202l5113K2166L7331K1490J6229o5248j9771J5891l4028
$$ 368796 323922 278720 243607 265773 303104 324594 340823 275575 255804 271695 237667
13147B37667J2684O092o617j1955J2070J6201n7825l8848J418J5716L2361L7447
$$ 237667 250351 256443 249826 237871 249941 266142 208317 169469 170887 186603 218964 256411
13135B56411Q9976K7139o1821j4174n2174J2395K1015p409J0761J9170k0245j6595
$$ 256411 346387 373526 311705 297531 245357 257752 278767 271358 282119 301289 281044 264449
13123B64449k955K273k3359J3121J01449j576k8792m0092K191M8665R373m6437
$$ 264449 261494 263767 240408 253529 354978 353402 324610 284518 286709 335374 344747 298310
13111B98310m4909k4521O103N5550j7729o7317J2687L9160P7726J20327J9220
$$ 298310 253401 228880 234983 290533 272804 205487 218174 257334 335060 455387 474607
13100D74607o2641j6895o5208k9873j4005k3254K3688K2479L306k2616M0959j492
$$ 474607 411966 395071 329863 299990 285985 262731 286419 308898 312204 289588 330547 329055
13088C29055L40o3965K1358M7043L1668j7954l1783N1166l577o3167r4743J8540
$$ 329055 329395 265430 286788 333831 365499 347545 315762 366928 363351 300184 205441 223981
13076B23981K4088J3082k6169l3372L483j9230j7497M9234O6390L0678J3752K4035
$$ 223981 248069 261151 234982 201610 205093 185863 168366 217600 283990 314668 328420 352455
13064C52455P1148j2770o0071O417l1957j9926j851J255J2333K3690N2991p371
$$ 352455 423603 410833 350762 357179 325222 305296 303445 304700 317033 340723 393714 386343
13052C86343l1297k3531O0663L5252q222l0992k6570r192k6014K5548J8652o182
$$ 386343 355046 331515 392178 427430 419208 388216 361646 352454 326440 351988 370640 364458
13040C64458j5921k8991j7545l2704J1990J9291M5307J6590j082K4584Q892J2823
$$ 364458 348537 319546 302001 269297 281287 300578 345885 362475 361393 385977 394869 407692
13028D07692j0083N0386J7045n576J8689j0783l5056L0171j2997o4678o5115L5715
$$ 407692 397609 447995 465040 459464 478153 467370 432314 462485 449488 384810 319695 355410
13016C55410k7271j4701K6671M0518L1818k8863n441N5319k4930j5868l2272O0322
$$ 355410 328139 313438 340109 380627 412445 383582 378141 433460 408530 392662 360390 420712
13004D20712L3493J3631p8333j9791K5935o1492J9156q30k7573L1836N8172M1761
$$ 420712 454205 467836 389503 369712 395647 334155 353311 352481 324908 356744 414916 456677
12992D56677k5508j5726M5935M7595k2504l8388m6859n5682j7866l990M9612L483
$$ 456677 431169 415443 461378 508973 486469 448081 401222 345540 327674 323684 373296 376779
12980C76779O4059J5391k2761k1416j2305m6308K3050J9134k7808j6189L8022
$$ 376779 440838 456229 433468 412052 399747 353439 376489 395623 367815 351626 389648
12969C89648M1558J5491m5456m7217L2620O4288J0208k267j8471l7259j8558L2463
$$ 389648 431206 446697 401241 354024 386644 450932 461140 458873 440402 403143 384585 417048
12957D17048j9831m9204P838J0408L4436j9932L3887J1383l8445k898J9604L8447
$$ 417048 397217 348013 355851 366259 400695 380763 414650 426033 387588 384690 404294 442741
12945D42741k0417l4063O521K1612j073K4628j1860o798K0683j213l974n834o2759
$$ 442741 422324 388261 394782 416394 415321 439949 428089 421291 441974 440761 436787 430953 368194
12932C68194M902O1186l0898M709l4629J3400M0806J6527J6764K1712j1079p5151
$$ 368194 373096 434282 403384 408093 373464 386864 427670 444197 460961 482673 471594 396443
12920C96443J065K9783o401k3569j0676m6562K2675N8660L3113j4981j2913L1930
$$ 396443 397508 427291 420890 397321 386645 340083 362758 421418 454531 439550 426637 458567
12908D58567m9191m9327O6532O1557J5906k8460m3637m8901L0026R093m8003J4063
$$ 458567 409376 360049 426581 488138 504044 475584 431947 383046 413072 422165 374162 388225
12896C88225L1948N1756N1732j4770m7493m5405M1863K0667o352J4327L5476J8801
$$ 388225 420173 471929 523661 508891 461398 415993 457856 478523 472171 486498 521974 540775
12884E40775J1015l4961o9741j5141K3944q681q501N2509N524l0297j9663L1641
$$ 540775 551790 516829 447088 431947 455891 447210 438709 491218 496742 466445 446782 478423
12872D78423j2757m8555M8629M8208j939o3214j6629K5631J17740l954o3929j6533
$$ 478423 465666 417111 465740 513948 512009 448795 432166 457797 575537 571583 507654 491121
12860D91121j547O276J4647q984m1347K212M190N1639k0408N2994L7212m5157
$$ 491121 489574 495850 510497 501513 460166 462378 466568 518207 497799 550793 588005 542848
12848E42848n4803k4952k3022M1832K0433J775J0145N3638J4347k9287k0945k9887
$$ 542848 488045 463093 440071 481903 502336 504111 514256 567894 582241 552954 532009 502122
12836E02122K4319K9741j7238l2121L2956N4080K4073l8572K3505K0283j208l1673
$$ 502122 526441 556182 538944 506823 539779 593859 617932 579360 602865 623148 621940 590267
12824E90267L009M3539k4809n399L060j4767k5805l6002j2030j4795J3961J1988
$$ 590267 593276 636815 612006 606607 609667 594900 569095 533093 521063 506268 520229 532217
12812E32217L4766L7934p147k9969m7040q082O225J4116O3649l1287j4528K347
$$ 532217 566983 604917 597770 567801 520761 512679 518904 533020 596669 565382 550854 553201
12800E53201k0854p050K3081m8528k6341M1999L9217P6882K0064M534l0533j3564
$$ 553201 532347 525297 548378 499850 473509 515508 554725 631607 651671 656205 625672 612108
12788F12108k5849M8512K0001n34k8138n9291k3138L7922K0228j1622m0145k7961
$$ 612108 586259 634771 654772 654238 626100 566809 543671 581593 601821 590199 550054 522093
12776E22093j4684K632L2096n737j6346j0154Q4158J14827n185m7409j1829J0938
$$ 522093 507409 510041 542137 536400 520054 509900 594058 708885 703700 656291 644462 655400
12764F55400k7307q0290n018M7044M1761K3271N900k530k6693J5156J5798k0299
$$ 655400 628093 547803 542785 589829 631590 654861 660761 658231 631538 646694 662492 642193
12752F42193q072N4449N8814J8273j7469n4475p5964m6518P0776J3603j1248j3646
$$ 642193 634121 688570 747384 765657 748188 693713 617749 571231 642007 655610 644362 630716
12740F30716l0048k1558M9972n642m4361J7710M9545n503K2290K4400k6176k8595
$$ 630716 600668 579110 629082 623440 579079 596789 646334 640831 663121 687521 661345 632750
12728F32750k4781K1104n371J3588J8947L5004J1277R2194O278L2104J6148l3305
$$ 632750 607969 629073 623702 637290 656237 691241 702518 794712 800990 833094 849242 815937
12716H15937q3925m5310q906j7256L5514L1618Q807n6821j7767J00034n903m7884
$$ 815937 732012 686702 677796 660540 696054 727672 736479 679658 661891 761925 756022 708138
12704G08138M1189N469K6494L0864N502k7706j343m764o2328l4832j6397J4410
$$ 708138 749327 754796 781290 812154 817656 789950 788607 783843 721515 686683 670286 684696
12692F84696M3940j7548j2440J9829l6315j334J771l924L5565J2679k2401j1296
$$ 684696 728636 711088 698648 718477 682162 680828 682599 678675 714240 726919 704518 693222
12680F93222O354J5149Q544M1567q147m589K5360k8879M414j6608j6615L4031
$$ 693222 699576 714725 723269 764836 756689 752100 777460 748581 752995 736387 719772 753803
12668G53803N9322j0767p608L8581k2322j171P887p9275K6095m0519J9742N1087
$$ 753803 813125 802358 794750 833331 811009 809838 817725 738450 764545 724026 743768 794855
12656G94855L5125N7135K9004m2973l1841K1277N0171k38o404j9419j9701k6482
$$ 794855 829980 887115 916119 873146 841305 862582 912753 912515 906111 886692 866991 840509
12644H40509l8085R3285O4800j6145J2596p3944n4174N4968N1818k234J0294m7158
$$ 840509 802424 895709 960509 944364 956960 883016 828842 883810 935628 933394 943688 896530
12632H96530m9007K4326P0299M2045N045L946o449m4748m2396N0881K9905k471
$$ 896530 847523 871849 942148 984193 989238 993184 986735 941987 899591 950472 980377 977906
12620I77906j3527J5298k967j2043m6J3557K6987L0437l5085k0946Q3065J1353
$$ 977906 964379 979677 976710 964667 964621 978178 1005165 1035602 1000517 979571 1062636 1073989
12608A073989j4923j1834K2063L911J7656k6849k9390K9863k2108k2239L8351
$$ 1073989 1059066 1047232 1069295 1073206 1090862 1064013 1034623 1064486 1042378 1020139 1058490
12597A058490K7939K8028M32L3603L6713K0200k4855L2076k3963k335K6038k4181
$$ 1058490 1086429 1114457 1114889 1148492 1185205 1205405 1180550 1212626 1188663 1186328 1212366 1188185
12585A188185o0685j2114k1679J3969P667J6932L0815J1465l6769m323O7618M3990
$$ 1188185 1127500 1115386 1093707 1107676 1115343 1132275 1163090 1174555 1137786 1133463 1201081 1245071
12573A245071K6354l8577m3049J4751P9049P1639J9362j6764l6824j4501j0247
$$ 1245071 1271425 1232848 1189799 1204550 1283599 1355238 1374600 1357836 1321012 1306511 1296264
12562A296264N198J8058k8672j2792J3458Q0957J5378m9783p1266L130M5009K0942
$$ 1296264 1301462 1319520 1290848 1278056 1291514 1372471 1387849 1338066 1266800 1269930 1314939 1335881
12550A335881j6772L0569K7792K8789k0090m3650P27J0561R886J4660p316N6776
$$ 1335881 1319109 1349678 1377470 1406259 1386169 1342519 1343246 1353807 1363693 1378353 1371037 1427813
12538A427813j7324K6561L6439l4674l5146J4448j6576J5637P723L7476K6140
$$ 1427813 1410489 1437050 1473489 1438815 1403669 1418117 1401541 1417178 1424901 1462377 1488517
12527A488517j9267m2413n1303n592M8802M2357J9431l470j823L7471M2406L7414
$$ 1488517 1469250 1426837 1375534 1369942 1418744 1461101 1480532 1477062 1475239 1512710 1555116 1592530
12515A592530j326j5731l5758k4101R6449J45389J3099l3912j8690j5626J0050
$$ 1592530 1591204 1575473 1539715 1515614 1612063 1757452 1770551 1736639 1717949 1702323 1712373
12504A712373N1696R1532k4324k6409l8396K42K3975N2778J3799m0102k7367n0476
$$ 1712373 1764069 1855601 1831277 1804868 1766472 1766714 1790689 1843467 1857266 1817164 1789797 1739321
12492A739321L7285L3497M0216L2353n1168l7776L5379p711J0892K0266j7277
$$ 1739321 1776606 1810103 1850319 1882672 1831504 1793728 1829107 1821396 1832288 1852554 1835277
12481A835277k9176J0887J4920m4846p913O4343O3198J6684L951L6565M82o1377
$$ 1835277 1806101 1816988 1831908 1787062 1779149 1843492 1906690 1923374 1927325 1963890 1964372 1902995
12469A902995P402K4663K8278m424m6520L2644N0879K5475j225K74p774P828K3470
$$ 1902995 1910397 1935060 1963338 1958914 1912394 1945038 1995917 2021392 2020167 2020441 2012667 2020495 2043965
12456B043965j4198J2413k0541k408k0409M4128L4969L2333j228m1173L887N20
$$ 2043965 2029767 2042180 2021639 2019231 1998822 2042950 2077919 2110252 2109024 2067851 2071738 2072258
12444B072258J1065L1309j7402k015J6318O0486K0531L5389O8624J1274j8661
$$ 2072258 2083323 2114632 2097230 2095215 2111533 2172019 2192550 2227939 2296563 2307837 2289176
12433B289176k7784L7869J426l0739Q98J1063q10j1585K56j0713M4312L5750N2099
$$ 2289176 2261392 2299261 2300687 2269948 2270846 2281909 2281099 2269514 2269770 2259057 2303369 2339119 2391218
12420B391218n02n711O822M6943L2669k137l506l602L113K4813L6950r203K1382
$$ 2391218 2390716 2385005 2391827 2438770 2471439 2469302 2465796 2462194 2465307 2490120 2527070 2517867 2539249
12407B539249N5965P1251K4321k966J7625N985p79o125J1288K5959j7402j132
$$ 2539249 2595214 2666465 2690786 2687820 2705445 2711430 2710651 2704526 2715814 2741773 2724371 2723239
12395B723239p9565o095L4208J06489M659l2022N2943l583L5550J8769M4371K3760
$$ 2723239 2643674 2637579 2671787 2778276 2782935 2750913 2803856 2800273 2835823 2854592 2898963 2922723
12383B922723n85L3597l0743k0917N2880L9214j6367K7930J6645M4903P3909L1485
$$ 2922723 2922138 2955735 2924992 2904075 2956955 2996169 2979802 3007732 3024377 3069280 3143189 3174674
12371C174674o1016n4346J4193N9231j345M2511J0808k6217M4299K6703J9153
$$ 3174674 3113658 3059312 3073505 3132736 3131391 3173902 3184710 3158493 3202792 3229495 3248648
12360C248648j9637Q282N0103O9662N0755L5140N1942j2709m2045Q5N1199N1081
$$ 3248648 3229011 3237293 3287396 3357058 3407813 3442953 3494895 3482186 3440141 3440226 3491425 3542506
12348C542506K806N4173k4257K7215N8000P2131L4848K9857r62N5166N7032K0791
$$ 3542506 3545312 3599485 3575228 3602443 3660443 3732574 3767422 3797279 3796317 3851483 3908515 3929306
12336C929306r846o9906k6719Q0760K9629N3011N5407N4341O5324K5691J3671
$$ 3929306 3919460 3849554 3822835 3903595 3933224 3986235 4041642 4095983 4161307 4186998 4200669
12325D200669L6906K4414J7897k0723Q415O7395N2671K606N4776L3925j6823O1052
$$ 4200669 4237575 4261989 4279886 4259163 4267578 4334973 4387644 4390250 4445026 4478951 4462128 4523180
12313D523180K9593l0446J0904n779j6291K3819L6859M9048J12092P6047l2527
$$ 4523180 4552773 4522327 4533231 4527452 4511161 4534980 4571839 4620887 4732979 4809026 4776499
12302D776499l2175O6079N9329M0578N2880O2472L8077J5356J1865L8101M2791
$$ 4776499 4744324 4810403 4869732 4910310 4963190 5025662 5063739 5079095 5090960 5129061 5171852
12291E171852P2111K8657M9850O8197N3634K0430M9414M0013L3844R780M3037
$$ 5171852 5243963 5272620 5322470 5390667 5444301 5464731 5514145 5554158 5588002 5597782 5640819
12280E640819M7682M5758R0090P7568K8870L7554k416M9686Q6819O994O9081N5928
$$ 5640819 5688501 5734259 5824349 5901917 5930787 5968341 5965925 6015611 6102430 6109424 6178505 6234433
12268F234433N5884O9764N2816N785L3706N8976J8506P2924P9311J04685N6745
$$ 6234433 6290317 6360081 6412897 6418682 6452388 6511364 6529870 6602794 6682105 6786790 6843535
12257F843535L2982Q4325O1818P8129L9451Q5117J20455Q3994k7499k4125J46731
$$ 6843535 6876517 6960842 7022660 7100789 7140240 7225357 7345812 7429806 7402307 7378182 7524913
12246G524913J34420O0647O7724L8922O9671M8969L7952M4629J24537J20740K5516
$$ 7524913 7659333 7719980 7787704 7826626 7896297 7945266 7983218 8027847 8152384 8273124 8298640
12235H298640L8453R8761J16915O1648N5310M9283L0941M5398Q8679J07413O7993
$$ 8298640 8337093 8435854 8552769 8614417 8669727 8719010 8749951 8795349 8884028 8991441 9059434
12224I059434O4606Q6434R9723J01710Q2779J41416J00399Q0007M6648O1277O3683
$$ 9059434 9124040 9210474 9310197 9411907 9494686 9636102 9736501 9816508 9863156 9924433 9988116
12213I988116P5976J26047M4359N5428P5085R1920J19639J55237J48705J49081
$$ 9988116 10064092 10190139 10234498 10289926 10365011 10456931 10576570 10731807 10880512 11029593
12203A1029593P9769P7622J12775J03649O9954J38103J71496J38182J18666L6644
$$ 11029593 11109362 11186984 11299759 11403408 11473362 11611465 11782961 11921143 12039809 12076453
12193A2076453L7281R2456J26503J18964J65457J67818J13608J39558J00553Q3614
$$ 12076453 12113734 12206190 12332693 12451657 12617114 12784932 12898540 13038098 13138651 13222265
12183A3222265J90177J71230J36935J29243J47185J43682J11571J52972J69748
$$ 13222265 13412442 13583672 13720607 13849850 13997035 14140717 14252288 14405260 14575008
12174A4575008J22264J13682J70166J47421J57036J90294J68636J58086J44249
$$ 14575008 14697272 14810954 14981120 15128541 15285577 15475871 15644507 15802593 15946842
12165A5946842J35657J79497J83407J62328J52394J83883J88125J93601P9362
$$ 15946842 16082499 16261996 16445403 16607731 16760125 16944008 17132133 17325734 17405096
12156A7405096J19902K09697J58227J82278K30702K31774K70143K27776J84681
$$ 17405096 17524998 17734695 17892922 18075200 18305902 18537676 18807819 19035595 19220276
12147A9220276J55435J46695J75315J50986K23947J88565K19676J90712K37133
$$ 19220276 19375711 19522406 19697721 19848707 20072654 20261219 20480895 20671607 20908740
12138B0908740K76900J68885K31938J93719K49729K37135K19416K48967K35114
$$ 20908740 21185640 21354525 21586463 21780182 22029911 22267046 22486462 22735429 22970543
12129B2970543K15661K08162K94756L03513L53418L01621K61225K57434K49248
$$ 22970543 23186204 23394366 23689122 23992635 24346053 24647674 24908899 25166333 25415581
12120B5415581K28584K38307K17127K21214K06476K50795K97276K70014K99218
$$ 25415581 25644165 25882472 26099599 26320813 26527289 26778084 27075360 27345374 27644592
12111B7644592L41070L31188L27752L10660L32993L37450K25166K58051L33554
$$ 27644592 27985662 28316850 28644602 28955262 29288255 29625705 29850871 30108922 30442476
12102C0442476L53790L91497M08375L44460L77162L52603L87554L16183K39296
$$ 30442476 30796266 31187763 31596138 31940598 32317760 32670363 33057917 33374100 33613396
12093C3613396L97306L88076L63658L96151M17660M14790M07927M06954L67782
$$ 33613396 34010702 34398778 34762436 35158587 35576247 35991037 36398964 36805918 37173700
12084C7173700L99016M34911M42241M29256M96536N54376N98859N20164M60412
$$ 37173700 37572716 38007627 38449868 38879124 39375660 39930036 40528895 41049059 41509471
12075D1509471K37623K72049M04697M33638M27095M45186M81457N20752N72579
$$ 41509471 41747094 42019143 42423840 42857478 43284573 43729759 44211216 44731968 45304547
12066D5304547M85654N11318N82872N95785N96156N41812O05849N78040N56220
$$ 45304547 45790201 46301519 46884391 47480176 48076332 48618144 49223993 49802033 50358253
12057E0358253O54425O72576O61039O61446P42303P48550P07873P94370P30951
$$ 50358253 51012678 51685254 52346293 53007739 53750042 54498592 55206465 56000835 56731786
12048E6731786P10626P56643Q41114Q97469Q67125Q74458R15405Q53367R30358
$$ 56731786 57442412 58199055 59040169 59937638 60804763 61679221 62594626 63447993 64378351
12039F4378351J020589R91073J005230J068423J067682J120344J125628J034285
$$ 64378351 65398940 66390013 67395243 68463666 69531348 70651692 71777320 72811605
12031G2811605R14726Q83384J005873J053937J121664J143920J174800J277346
$$ 72811605 73726331 74609715 75615588 76669525 77791189 78935109 80109909 81387255
12023H1387255J288790J339859J362586J437505J443651J475598J579201J627816
$$ 81387255 82676045 84015904 85378490 86815995 88259646 89735244 91314445 92942261
12015I2942261J608056J677459J751017J773051J803379J828615J832685J914635
$$ 92942261 94550317 96227776 97978793 99751844 101555223 103383838 105216523 107131158
12007A07131158J956106J921444J878234J898054J968424K040360J950419J928354
$$ 107131158 109087264 111008708 112886942 114784996 116753420 118793780 120744199 122672553
11999A22672553J825805J772134J823233J719098J593984J439357J402692J259292
$$ 122672553 124498358 126270492 128093725 129812823 131406807 132846164 134248856 135508148
11991A35508148J166832J072957R00637P14870M85834K30537J08005K7744j71586
$$ 135508148 136674980 137747937 138648574 139363444 139849278 140079815 140187820 140215564 140043978
11982A40043978l34571n39442o75178q15658r54742j147779j295401j326020j446146
$$ 140043978 139709407 139169965 138494787 137679129 136724387 135576608 134281207 132955187 131509041
11973A31509041j575774j634960j662584j761194j849126j828576j885429j852350
$$ 131509041 129933267 128298307 126635723 124874529 123025403 121196827 119311398 117459048
11965A17459048j880279j918265j796488j841541j843059j746977j738508j763280
$$ 117459048 115578769 113660504 111864016 110022475 108179416 106432439 104693931 102930651
11957A02930651j736424j678018j625999j618653j490998j419525j413747j401879
$$ 102930651 101194227 99516209 97890210 96271557 94780559 93361034 91947287 90545408
11949I0545408j374944j258715j266067j215657j193344j128483j117070j053974
$$ 90545408 89170464 87911749 86645682 85430025 84236681 83108198 81991128 80937154
11941H0937154j015348j022430j026837r29712q84125q86664q49763q19275p39555
$$ 80937154 79921806 78899376 77872539 76942827 76058702 75172038 74322275 73503000 72763445
11932G2763445p20955p14364p07876o62161n97641o02863n98022o22971n64573
$$ 72763445 72042490 71328126 70620250 69958089 69360448 68757585 68159563 67536592 66972019
11923F6972019n56901n15645m99503n10930m95071n33554m91461m50604m22337
$$ 66972019 66415118 65899473 65399970 64889040 64393969 63860415 63368954 62918350 62496013
11914F2496013m51526m83980m36273m32419m63177l02869l17184l37201l29452
$$ 62496013 62044487 61560507 61124234 60691815 60228638 59925769 59608585 59271384 58941932
11905E8941932l14915l61329l37745k57901l23528l49448l01388k82362k68312
$$ 58941932 58627017 58265688 57927943 57670042 57346514 56997066 56695678 56413316 56145004
11896E6145004k91343k80998k81959k89903k58008k29870k43591k21627k35754
$$ 56145004 55853661 55572663 55290704 55000801 54742793 54512923 54269332 54047705 53811951
11887E3811951k74957k46232k17358j98247k05130k50040k04731k05318j93598
$$ 53811951 53536994 53290762 53073404 52875157 52670027 52419987 52215256 52009938 51816340
11878E1816340j69987k01072k60103j92936j46510j84771j93103j64489j39431
$$ 51816340 51646353 51445281 51185178 50992242 50845732 50660961 50467858 50303369 50163938
11869E0163938j46875j43664j42431j50437j55501j42938j30365j26760r1385
$$ 50163938 50017063 49873399 49730968 49580531 49425030 49282092 49151727 49024967 48933582
11860D8933582j31257j81067j28737r3787j44675r3172r6903j16735j16618q0476
$$ 48933582 48802325 48621258 48492521 48398734 48254059 48160887 48063984 47947249 47830631 47750155
11850D7750155q4769j22545r0849r2114n9393q8730m4494q9891j14499o5598j02589
$$ 47750155 47665386 47542841 47451992 47359878 47300485 47211755 47167261 47077370 46962871 46897273 46794684
11839D6794684r2473o2513q9103j17691j04887k7905J4449q981n6180n4453r8086
$$ 46794684 46702211 46639698 46550595 46432904 46328017 46300112 46314561 46305580 46249400 46194947 46096861
11828D6096861m1241j669o8115m5453q3336n8791o7406q590k9815j4888m2826
$$ 46096861 46055620 46053951 45985836 45940383 45857047 45798256 45730850 45722260 45692445 45677557 45634731
11817D5634731J4191k191n1773n2822k2963L88q818M6823J8813k9569o9871l7506
$$ 45634731 45648922 45646731 45594958 45542136 45519173 45519561 45510743 45557566 45576379 45546810 45476939 45439433
11805D5439433M1941Q366k0204K3448J5223M2788M4256j2709p0816q299L3081
$$ 45439433 45481374 45489740 45469536 45492984 45508207 45550995 45595251 45582542 45511726 45503427 45536508
11794D5536508J5008Q145M7525N6610K8903L7822J5390K6961N1237K0376k5037
$$ 45536508 45551516 45559661 45607186 45663796 45692699 45730521 45745911 45772872 45824109 45844485 45819448
11783D5819448Q643k1966k6459j6634P2455L4210K1933N3708P6201j9877O7295
$$ 45819448 45828091 45806125 45779666 45763032 45835487 45869697 45891630 45945338 46021539 46001662 46068957
11772D6068957Q7803N6596L6629J5204K8433M0428K5944M0522K7027j0717M0545
$$ 46068957 46156760 46213356 46249985 46265189 46293622 46334050 46359994 46400516 46427543 46416826 46457371
11761D6457371N6154L556M9267M7056L0615P95N7114N7286O4762k6435R3176L5512
$$ 46457371 46513525 46517081 46566348 46613404 46644019 46644814 46701928 46759214 46823976 46797541 46890717 46926229
11749D6926229J1608N1313L2634j1360M0555M4799O4830N6951P1356q775P04j6279
$$ 46926229 46937837 46989150 47021784 47010424 47050979 47095778 47160608 47217559 47288915 47280140 47280844 47264565
11737D7264565N4035M0692P4485L5646l8959K8693M1174M1981L5163K176P357
$$ 47264565 47318600 47359292 47433777 47469423 47430464 47459157 47500331 47542312 47577475 47579651 47587008
11726D7587008J9604r8385l3300R4340O1646K1656O244L2696k3477l5771K0842
$$ 47587008 47606612 47508227 47474927 47569267 47630913 47652569 47658813 47691509 47668032 47632261 47653103
11715D7653103M7593J5391j3219j4947n8402L4222L7512K250l0459o9369l2054
$$ 47653103 47700696 47716087 47702868 47687921 47629519 47663741 47701253 47703503 47673044 47603675 47571621
11704D7571621k3526P293J986o3117m6917K621l5117n3984o0430j5443l8990m4355
$$ 47571621 47548095 47555388 47557374 47494257 47447340 47449961 47414844 47360860 47300430 47284987 47245997 47201642
11692D7201642q9809j01309m9339o3697l6846o2076r8028l8933m6255j12291m5818
$$ 47201642 47111833 47010524 46961185 46897488 46860642 46798566 46700538 46661605 46615350 46503059 46457241
11681D6457241p9786j12745j57100j57981j20838l5120j6956j06256r9978j04272
$$ 46457241 46377455 46264710 46107610 45949629 45828791 45793671 45776715 45670459 45570481 45466209
11671D5466209j52084j34995o1965j16770j77158j08084j71194j90142p8622j45272
$$ 45466209 45314125 45179130 45117165 45000395 44823237 44715153 44543959 44353817 44275195 44129923
11661D4129923j57299j42858j25653j00580j60043j29303j53102j23820j92244
$$ 44129923 43972624 43829766 43704113 43603533 43443490 43314187 43161085 43037265 42845021
11652D2845021k19267j59848j31530r2974j37926j86211j10499j42999k33722
$$ 42845021 42625754 42465906 42334376 42241402 42103476 41917265 41806766 41663767 41430045
11643D1430045k09900j70752k38208k15697k27475k66137k93139k72855k63269
$$ 41430045 41220145 41049393 40811185 40595488 40368013 40101876 39808737 39535882 39272613
11634C9272613k20566j51361k11172k75948k55881k60385k42479k45374k69851
$$ 39272613 39052047 38900686 38689514 38413566 38157685 37897300 37654821 37409447 37139596
11625C7139596l37720k74518j34704j66968k79669k69394k30830k43855k88580
$$ 37139596 36801876 36527358 36392654 36225686 35946017 35676623 35445793 35201938 34913358
11616C4913358l04882k13338k68914l02456k59408k22883k16349k30275k33394
$$ 34913358 34608476 34395138 34126224 33823768 33564360 33341477 33125128 32894853 32661459
11607C2661459l04621k66284k53804j79470j74670k00280k87504k87254k77218
$$ 32661459 32356838 32090554 31836750 31657280 31482610 31282330 30994826 30707572 30430354
11598C0430354k45320k52277k25943k57476k51476k32717k16726k47028k28285
$$ 30430354 30185034 29932757 29706814 29449338 29197862 28965145 28748419 28501391 28273106
11589B8273106k69523k68776k64612k41582j87382k27827k34123k15351k23083
$$ 28273106 28003583 27734807 27470195 27228613 27041231 26813404 26579281 26363930 26140847
11580B6140847k03667j94480k24575k18474k55051k64559k19159k48523k53470
$$ 26140847 25937180 25742700 25518125 25299651 25044600 24780041 24560882 24312359 24058889
11571B4058889j65576j90709k14415j75642k26565k16756k25856j92420k31198
$$ 24058889 23893313 23702604 23488189 23312547 23085982 22869226 22643370 22450950 22219752
11562B2219752k36266k04921k21519k05692j93388j90595j29083k21752k55376
$$ 22219752 21983486 21778565 21557046 21351354 21157966 20967371 20838288 20616536 20361160
11553B0361160j59702j80480k26910j75914j37998j60921k48633k18083j65821
$$ 20361160 20201458 20020978 19794068 19618154 19480156 19319235 19070602 18852519 18686698
11544A8686698j68797j85840j89449k02315j67764j37748j20262j92436j92320
$$ 18686698 18517901 18332061 18142612 17940297 17772533 17634785 17514523 17322087 17129767
11535A7129767j59322j86045j96222j74175j34639j34136j65933q6093j64828
$$ 17129767 16970445 16784400 16588178 16414003 16279364 16145228 15979295 15893202 15728374
11526A5728374j68369j67783j67408j42805j77905k02075q4652n8335p6480j42056
$$ 15728374 15560005 15392222 15224814 15082009 14904104 14702029 14617377 14559042 14482562 14340506
11516A4340506j93850j45646q6036j11636j42514j74676j88333j58458j13802
$$ 14340506 14146656 14001010 13914974 13803338 13660824 13486148 13297815 13139357 13025555
11507A3025555j12331r2965p3355j07761j60583j43818j12501j45803j36490j40391
$$ 13025555 12913224 12820259 12746904 12639143 12478560 12334742 12222241 12076438 11939948 11799557
11497A1799557q8513r4870j50468j00541p9627q8635n7063j15363j47256j27236
$$ 11799557 11711044 11616174 11465706 11365165 11285538 11196903 11139840 11024477 10877221 10749985
11487A0749985r2364j54537j23906r1408l1024k9712j07272j32267j05516j30454
$$ 10749985 10657621 10503084 10379178 10287770 10256746 10227034 10119762 9987495 9881979 9751525
11477I751525p6134k9403p6216j05675j46142q8760p6746m8917o7944q4377q4143
$$ 9751525 9675391 9645988 9569772 9464097 9317955 9229195 9152449 9103532 9035588 8951211 8867068
11466H867068o2444r8888j41936q1744j10953p6371p9953l8242l6844n2779m0582
$$ 8867068 8804624 8705736 8563800 8482056 8371103 8294732 8214779 8176537 8139693 8086914 8046332
11455H046332j21327p3299q7412n4076r0742j49147p8235m0939o7434o7912p7119
$$ 8046332 7925005 7851706 7764294 7710218 7619476 7470329 7392094 7351155 7283721 7215809 7138690
11444G138690r9255n1208o8174n2804m6891r4652o3086M9358k8351p8754r4804
$$ 7138690 7039435 6988227 6920053 6867249 6820358 6725706 6662620 6711978 6683627 6604873 6510069
11433F510069r7913o7070m6919J9898o2750j05537k9246n5367j8987m9343l9087
$$ 6510069 6412156 6345086 6298167 6318065 6255315 6149778 6120532 6065165 6046178 5996835 5957748
11422E957748j4115l9189j01307k0201k381n5110j1506n4448r9931o3779k7467
$$ 5957748 5943633 5904444 5803137 5782936 5780555 5725445 5713939 5659491 5559560 5495781 5468314
11411E468314k850M6644k9407l1636l5500p85j2666l2100K3326K7015N5418J15697
$$ 5468314 5465464 5512108 5482701 5451065 5415565 5414780 5402114 5370014 5393340 5420355 5475773 5591470
11399E591470J6556j4337M3604J38188J82600P0947Q5998R9399R4617Q6853j0879
$$ 5591470 5608026 5593689 5637293 5775481 5958081 6029028 6115026 6214425 6309042 6395895 6385016
11388F385016j8336j23812j40306j74896k37748k53267j72602j55678j80141j72661
$$ 6385016 6366680 6242868 6102562 5927666 5689918 5436651 5264049 5108371 4928230 4755569
11378D755569j62171j24515p4411j04453j14966m9272l3991m6882l7337j0622
$$ 4755569 4593398 4468883 4394472 4290019 4175053 4125781 4091790 4044908 4007571 3996949
11368C996949l9582o0021m5566n4589m0333m3438n2771k7907N286r239o8283l3149
$$ 3996949 3957367 3897346 3851780 3797191 3756858 3713420 3660649 3632742 3638028 3628789 3560506 3527357
11356C527357K9446m4550j22161l6077r243k1360m5233q3441J4802m825L8547
$$ 3527357 3556803 3512253 3390092 3354015 3344772 3323412 3278179 3194738 3209540 3204715 3243262
11345C243262k3906n5932m0192j8641l1823l2241l9620j9060l966r831K7553m0509
$$ 3243262 3219356 3163424 3123232 3104591 3072768 3040527 3000907 2981847 2977881 2968050 2995603 2955094
11333B955094n1606m0551n6206M117K4425l0490k2313L6200k1661n1833j8025
$$ 2955094 2903488 2862937 2806731 2810848 2835273 2804783 2782470 2818670 2797009 2745176 2727151
11322B727151k3387p3346j4797m5310k750j9715p119j456l6897K4678J5526l5465
$$ 2727151 2703764 2630418 2615621 2570311 2567561 2547846 2540727 2539271 2502374 2527052 2542578 2507113
11310B507113k6658n0448Q02m501q416j7998l4216J0128l4631M7746N2602k6791
$$ 2507113 2480455 2430007 2430809 2426308 2417892 2399894 2365678 2375806 2341175 2388921 2441523 2414732
11298B414732p773Q478K8906j4048q6382p0437J1837M3554l914Q319j974j7222
$$ 2414732 2406959 2415437 2444343 2430295 2343913 2273476 2285313 2328867 2324953 2333272 2331298 2314076
11286B314076j877n3454o9986r3811n2531p439p4086M0489M7043l6856l2185J2285
$$ 2314076 2312199 2258745 2188759 2094948 2042417 2034978 1960892 2001381 2048424 2011568 1979383 1991668
11274A991668N1422L3964k3602m3034l6466M944j9465p517j7190m8474L7974o918
$$ 1991668 2043090 2077054 2053452 2010418 1973952 1978896 1959431 1951914 1934724 1886250 1924224 1917306
11262A917306n0560m5222K7151M1478Q0236l296m0683n6535j0309O28K7804P99
$$ 1917306 1866746 1821524 1848675 1890153 1970389 1967093 1926410 1869875 1859566 1860194 1887998 1888797
11250A888797k1055n0852m4059N4474J9609q648j0904K965M647n8678j4232J7327
$$ 1888797 1867742 1816890 1772831 1827305 1846914 1838266 1827362 1830327 1834974 1776296 1762064 1779391
11238A779391M0187M6462M662n0406J5948N1164j4448m0109M227R082K023L069
$$ 1779391 1819578 1866040 1870702 1820296 1836244 1887408 1872960 1832851 1837078 1846160 1848183 1851252
11226A851252M0424j1996J0115K7897j1096l5090M7179N62k0939m0032J2083J6363
$$ 1851252 1891676 1879680 1889795 1917692 1906596 1871506 1918685 1919247 1898308 1858276 1870359 1886722
11214A886722k0395l2515o4499r263M2405j2278k2031n518n1240K71L5457J5598
$$ 1886722 1866327 1833812 1769313 1760050 1802455 1790177 1768146 1762628 1711388 1711659 1747116 1762714
11202A762714N0261l109j5529n2752l0628L2158l9262j2101M796p842M3865j5205
$$ 1762714 1812975 1809866 1794337 1741585 1710957 1743115 1703853 1691752 1696548 1688706 1732571 1717366
11190A717366J8964m080k2340l641j2880K9670J7160n5333n2999m3453m8017r937
$$ 1717366 1736330 1732250 1709910 1706269 1693389 1723059 1740219 1684886 1631887 1588434 1540417 1530480
11178A530480k1508j6917m2165K8343K0586k9593K9949J027K7031K049m0398n2165
$$ 1530480 1508972 1492055 1449890 1478233 1498819 1469226 1499175 1500202 1527233 1529282 1488884 1436719
11166A436719l4612O998N9217J9441p1637m5176j2051O956J7614L7616p7027q7348
$$ 1436719 1402107 1409105 1468322 1487763 1416126 1370950 1358899 1365855 1383469 1421085 1344058 1256710
11154A256710j1895L584K1173K6134L4411j4868l4435k2492J9530P767l0005Q248
$$ 1256710 1244815 1248399 1269572 1295706 1330117 1315249 1280814 1258322 1277852 1285619 1255614 1263862
11142A263862j5905j6834M633L9930K3302m106P605K1232L8451k4735j5007j4608
$$ 1263862 1247957 1231123 1235756 1275686 1298988 1294882 1302487 1323719 1362170 1337435 1322428 1307820
11130A307820J1661M3005N3083J7868O2981j4347j6816J5074l0269k1701L6012
$$ 1307820 1319481 1362486 1415569 1433437 1496418 1482071 1465255 1480329 1450060 1428359 1464371
11119A464371R069k5340l594l7154m5447K1439J7687k8679j4249l6476J2765J6124
$$ 1464371 1473440 1448100 1444506 1407352 1361905 1383344 1401031 1372352 1358103 1321627 1334392 1350516
11107A350516j5719M1864P1656L5136N0678J0432l2395l6252m8193l2267j4971
$$ 1350516 1334797 1376661 1448317 1483453 1534131 1544563 1512168 1475916 1427723 1395456 1380485
11096A380485J8541L3166j0571m0299k2785j7641j1552n9301o2575l7909q0448
$$ 1380485 1399026 1432192 1421621 1381322 1358537 1340896 1329344 1270043 1207468 1169559 1089111
11085A089111m2883j9091p5313j46361j10591p2201r1938n8942k082R3620J03180
$$ 1089111 1046228 1027137 951824 805463 694872 622671 530733 471791 469709 563329 666509
11074F66509J15027R5718Q6128J68441K06365J99110J35607J83862J89605J59239
$$ 666509 781536 877254 963382 1131823 1338188 1537298 1672905 1856767 2046372 2205611
11064B205611J83378J27993P3840O1969R6555O2581Q9965l079K8768O8299R9180
$$ 2205611 2388989 2516982 2590822 2652791 2749346 2811927 2901892 2898813 2927581 2995880 3095060
11053C095060N9905J1010O2898J09581J23541J23197J64022K54421K70639K48038
$$ 3095060 3154965 3165975 3228873 3338454 3461995 3585192 3749214 4003635 4274274 4522312
11043D522312L70931M03513M57472N82024O10136O58016O52011M08278p3331n80131
$$ 4522312 4893243 5296756 5754228 6336252 6946388 7604404 8256415 8664693 8591362 8011231
11033H011231p91321p25875o19739l89366l16506k41317j65433j37164l9474J1394
$$ 8011231 7219910 6494035 5874296 5484930 5168424 4927107 4761674 4624510 4585036 4596430
11023D596430L7074J17478J44013O1455K8725M4337l4197p2025J5221R8911R0548
$$ 4596430 4633504 4750982 4894995 4956450 4985175 5029512 4995315 4923290 4938511 5037422 5127970
11012E127970Q0673P1865J37353J45363M8136J08728J00621k246J23792J94276
$$ 5127970 5208643 5280508 5417861 5563224 5611360 5720088 5820709 5818463 5942255 6136531
11002F136531K31080K10699J85808K23579K84117L18935K64685K50784L22989
$$ 6136531 6367611 6578310 6764118 6987697 7271814 7590749 7855434 8106218 8429207
10993H429207K32860K16111J00324J65341K08017J55262K11097K50015L37347
$$ 8429207 8662067 8878178 8978502 9143843 9351860 9507122 9718219 9968234 10305581
10984A0305581M29099L64051M41113N13143M70581N23893O37719O82022P83923
$$ 10305581 10734680 11098731 11539844 12052987 12523568 13047461 13685180 14367202 15151125
10975A5151125R17476R48384J107792J148001J235062J419329J510568J715015
$$ 15151125 16068601 17016985 18124777 19272778 20507840 21927169 23437737 25152752
10967B5152752J984795K217100K452869K857662L251936L714084M253954M871601
$$ 25152752 27137547 29354647 31807516 34665178 37917114 41631198 45885152 50756753
10959E0756753N643925O600821P665847Q985489J0440454J2106219J4064810J6442463
$$ 50756753 56400678 63001499 70667346 79652835 90093289 102199508 116264318 132706781
10951A32706781J9191747K2488414K6371141L0816829L5774250M1185482M6106897
$$ 132706781 151898528 174386942 200758083 231574912 267349162 308534644 354641541
10944C54641541M9171775M8237984M0596494K3752670k348226l1466443n2823777
$$ 354641541 403813316 452051300 492647794 516400464 514052238 482585795 429762018
10937D29762018o0730059n8221926n0718701m2206441l4373712k7815519k2532032
$$ 429762018 369031959 310810033 260091332 217884891 183511179 155695660 133163628
10930A33163628j8294815j4991952j2414057j0401788q830003p475139o444684
$$ 133163628 114868813 99876861 87462804 77061016 68231013 60755874 54311190
10923E4311190n623742m863623m229838l680114l143077k730837k380951k141424
$$ 54311190 48687448 43823825 39593987 35913873 32770796 30039959 27659008 25517584
10915B5517584j924186j720187j545323j390092j246591j167834j087503r31101
$$ 25517584 23593398 21873211 20327888 18937796 17691205 16523371 15435868 14504767
10907A4504767q44690p88493p69216o76372n91053n30220m91141m67526n08830
$$ 14504767 13660077 12871584 12102368 11425996 10834943 10304723 9813582 9346056 8837226
10898H837226m84846m07128l53672l81673l23654k51704k13598k79510l00637
$$ 8837226 8352380 7945252 7591580 7209907 6886253 6634549 6420951 6141441 5840804
10889E840804k60046j82990k41098k10511j81998j46310j10379r6538j45116k02785
$$ 5840804 5580758 5397768 5156670 4946159 4764161 4617851 4507472 4410934 4265818 4063033
10879D063033j15928r6676j46322j31321q8640j75726j01152p5124r4502o0790
$$ 4063033 3947105 3850429 3704107 3572786 3484146 3308420 3207268 3132144 3037642 2976852
10869B976852o7555j13790q0240p2599o8950m1939l5914r3354n1871q9684n8719
$$ 2976852 2909297 2795507 2715267 2642668 2573718 2531779 2495865 2402511 2350640 2260956 2202237
10858B202237o4612o5094n1330m5794n6491r9827l6334L418n51l9462l7397j33590
$$ 2202237 2137625 2072531 2021201 1975407 1918916 1819089 1782755 1786173 1785622 1746160 1708763 1575173
10846A575173q1361j05442l1240J7433p0513l7255m4012k9378m0807p0149n9851
$$ 1575173 1493812 1388370 1357130 1374563 1304050 1266795 1222783 1193405 1152598 1082449 1022598
10835A022598n1499j887N0172n226k2555k8823j4202l3615j877j8185o8427k5823
$$ 1022598 971099 969212 1019384 1014158 991603 962780 948578 914963 913086 894901 826474 800651
10823H00651r5422o0757J0471M604p0101p665J11428J58001R0215R9674J76680
$$ 800651 705229 644472 654943 659547 589446 581781 693209 851210 941425 1041099 1217779
10812A217779K03770K56795J69072J02146J23970M9863L2456M4501L9168k3679
$$ 1217779 1421549 1678344 1847416 1949562 2073532 2123395 2155851 2200352 2239520 2215841
10802B215841q8455q4685o9233j18455j33548j01634p2354p3408l1407o6404n9777
$$ 2215841 2127386 2042701 1973468 1855013 1721465 1619831 1547477 1474069 1442662 1376258 1316481
10791A316481o1434l0167m0591p6319p3203k2248R5o6595p190M9523M2446K0969
$$ 1316481 1255047 1224880 1184289 1107970 1034767 1012519 1012614 946019 938829 988352 1030798 1051767
10779A051767k2390K0677k3736j3766l7890J656l3559l7484k17l4749l7669L5222
$$ 1051767 1029377 1050054 1026318 1012552 974662 976318 942759 905275 905058 870309 832640 867862
10767H67862J8673l3743k6102J807k5018p9698m2340j8057J4451l1222j4746N10
$$ 867862 886535 852792 826690 828497 803479 723781 681441 663384 677835 646613 631867 632377
10755F32377K31m6746o735K4959k6604l9806l9427j7319O7100P0542k0626o947
$$ 632377 632608 585862 579127 604086 577482 537676 498249 480930 548030 618572 597946 590999
10743E90999K5264j83m4187p5678k3888J9672L5256K634j5853K947k280J3116
$$ 590999 616263 616080 571893 496215 472327 491999 527255 529889 514036 516983 514703 527819
10731E27819L6702J9758k0474p0837l5957m4467J2030P8023Q4407J04130N450
$$ 527819 564521 584279 563805 492968 457011 412544 424574 502597 587004 691134 696584
10720F96584m7257J3231j2853n0174j8784k1432J8006O3345J08289P8488l09p026
$$ 696584 649327 662558 649705 599531 580747 559315 577321 640666 748955 827443 827134 820108
10708H20108K0460k554l3163l9266O935j81J7511O252Q2945L8022O195P173M2794
$$ 820108 840568 838014 804851 765585 772520 772339 789850 796102 879047 917069 923264 930437 973231
10695I73231L2474K4195Q6641k6348m2215L7129M1996K8428J4197J576m0042O2007
$$ 973231 1005705 1029900 1116541 1090193 1047978 1085107 1127103 1155531 1169728 1171304 1131262 1193269
10683A193269R2116j0926P963N0830J00287R4636L4780N2288J4384k0514M9483
$$ 1193269 1285385 1274459 1282422 1333252 1433539 1528175 1562955 1615243 1629627 1609113 1658596
10672A658596l6807j4235k5794q1453q1797o8894k6988P386l9624p4036m7187
$$ 1658596 1621789 1607554 1581760 1500307 1418510 1349616 1322628 1330014 1290390 1216354 1169167
10661A169167K43O6034K8577j3029j1780L3318J5754k5257r937Q4789K7557j5738
$$ 1169167 1169410 1235444 1264021 1250992 1239212 1272530 1288284 1263027 1253090 1337879 1365436 1349698
10649A349698K315P8990N2221R8788P8379P0930R4403M3384R8196J28044J26907
$$ 1349698 1352013 1431003 1483224 1582012 1660391 1731321 1825724 1869108 1967304 2095348 2222255
10638B222255J13687J71913J45389J57710J83330K41014L35974M21112M52697
$$ 2222255 2335942 2507855 2653244 2810954 2994284 3235298 3571272 3992384 4445081
10629D445081M52385M61402M77192O51952Q66570J045186J261844J664084K086814
$$ 4445081 4897466 5358868 5836060 6488012 7354582 8399768 9661612 11325696 13412510
10620A3412510K670585L323164M097356M998697N698568O242660N896278M116334
$$ 13412510 16083095 19406259 23503615 28502312 34200880 40443540 46339818 50456152
10612E0456152J632871m69231j064261j76996J524629L708855O084157Q445778
$$ 50456152 52089023 51619792 50555531 50378535 51903164 55612019 61696176 70141954
10604G0141954J0599401J1733806J0495359N507029j682261o875556p589081n041597
$$ 70141954 80741355 92475161 102970520 108477549 106795288 99919732 92330651 87289054
10596H7289054j185746K840815O643877J0042392J2700608J3423950J0365824
$$ 87289054 86103308 88944123 95588000 105630392 118331000 131754950 142120774
10589A42120774K031652q847136j5728650j5869027j2033956p191061k742621
$$ 142120774 144152426 135305290 119576640 103707613 91673657 84482596 81739975
10582H1739975R73119L925695N851476O068148L452978k650971r743411j3398105
$$ 81739975 82713094 86638789 92490265 98558413 102011391 99360420 89617009 76218904
10574G6218904j2663614r554707o118904l318406j300622J81380R02186P05339
$$ 76218904 63555290 54000583 47881679 44563273 43262651 43444031 44346217 45051556
10566D5051556o80143l075780n502620o804739o447568n157292l885106k877334
$$ 45051556 44371413 41295633 35793013 28988274 22540706 17383414 13498308 10620974
10558A0620974k085368j471232j188908q78580o79561n56742m54638l55517l13362
$$ 10620974 8535606 7064374 5875466 4996886 4317325 3760583 3305945 2950428 2637066
10549B637066l17787k51669j42559j16124k19975j47329r2625j67467j13813j14443
$$ 2637066 2319279 2067610 1925051 1808927 1588952 1441623 1348998 1181531 1067718 953275
10539I53275j4825m3258j06773j34192l6847k4012q781K3351p716j5590l9352
$$ 953275 938450 895192 788419 654227 617380 593368 584587 607938 600222 584632 545280
10528E45280o2717k0071L723m2361p086L7815O430p7440n7010Q575l9728n243
$$ 545280 482563 462492 466215 423854 416768 454583 461013 383573 326563 335138 295410 290167
10516B90167K4920j3737l8848K4053O5880M321r631O5389L710l8074O5226j9105
$$ 290167 315087 301350 262502 286555 352435 356756 347125 412514 416224 378150 443376 424271
10504D24271m3625k1414K7931O6230M8319J35799Q1771K9251o095N5329Q0515
$$ 424271 380646 359232 387163 453393 501712 637511 719282 748533 742438 797767 878282
10493H78282J28606R3157J18586J64720J97180J58173J81647J99870O4071n6165
$$ 878282 1006888 1100045 1218631 1383351 1580531 1738704 1920351 2120221 2184292 2128127
10483B128127j35121j01268j96061k36481j34964j66249j82568j26942q7488j11734
$$ 2128127 1993006 1891738 1695677 1459196 1324232 1157983 975415 848473 760985 649251
10473F49251k6091k0926l1888n5416n1850o9772l0571K4878J1702J0691M3123
$$ 649251 623160 602234 570346 514930 463080 393308 362737 387615 399317 410008 453131
10462D53131M4255k0719k3727O53k4964L4623K9853K0414L1519J6276j1097m5574
$$ 453131 497386 476667 452940 453593 428629 463252 493105 513519 545038 561314 550217 504643
10450E04643m7148k2286k693M7086n378p6072m5566k8481Q079J5659j4274J9424
$$ 504643 457495 435209 432516 479602 474224 398152 352586 324105 332184 347843 333569 352993
10438C52993Q440m9314n8622l1624m263k5796j9412j2340M6916N8583j1513k7118
$$ 352993 361433 312119 253497 221873 217610 191814 172402 160062 206978 265561 254048 226930
10426B26930J003j3218J7381n330k1898j7317K2679n0J4370r744M0789k7705k0576
$$ 226930 227933 214715 232096 226766 204868 187551 210230 210180 224550 214806 255595 227890 207314
10413B07314k2531j64j0919j5761l4612k0450k9887K040M1769L3755r246M0583
$$ 207314 184783 184619 173700 157939 123327 102877 72990 75030 116799 150554 141308 181891
10401A81891O538n5691m942j347M407J7806M6129m0680k6030L654M4694L4505
$$ 181891 188429 132738 127796 126449 130856 148662 194791 154111 128081 131735 176429 210934
10389B10934o3059p528K0758j0654n2534j0366j5564J8498K7320J7352m6359J7623
$$ 210934 147875 140347 161105 150451 97917 87551 71987 90485 117805 135157 88798 106421
10377A06421N9460M96l5496m3538m519J473k1390j3365K7893J7502k4350k8119
$$ 106421 165881 166377 130881 87343 82824 84297 62907 49542 77435 94937 70587 42468
10365D2468m190L2805J6012J3759j3277L5176M7618M719j3033J45n675J8901m455
$$ 42468 38278 71083 87095 100854 87577 122753 170371 175090 162057 162202 156527 175428 170973
10352A70973o2224j6271J3577m3350J583J679N6765L8205n6673q538N7404l1916
$$ 170973 108749 92478 106055 62705 64288 65967 122732 160937 104264 95726 153130 121214
10340A21214k531M2534K4057K746m0292J7127N092m2769k9168n8535n2660J157
$$ 121214 118683 161217 185274 188020 147728 164855 169947 127178 98010 39475 -13185 -12028
10328a2028P5807o523l2700K0191N183k841q277J3227q581K1311K3151K4306K8995
$$ -12028 63779 57256 24556 44747 49930 47089 38812 52039 43458 64769 87920 112226 141221
10315A41221j5608o0439r752K3036K0855q7590k2388K0890K2786M0429L2876j4
$$ 141221 125613 65174 55422 78458 99313 11723 -10665 10225 33011 73440 106316 106302
10303A06302k6929K5838j4381l9556r554L5549K8398M7222r808k4588J5053r1194
$$ 106302 79373 105211 90830 51274 41720 77269 105667 152889 143081 118493 133546 42352
10291D2352o0172O813M30j6623O976M33K5988L3537o8949J670r102k6256k5423
$$ 42352 -17820 -11007 -10577 -27200 -20224 -19791 6197 39734 -29215 -27545 -36647 -62903 -88326
10278h8326j572N6933L3387K0097k9240m4649J7710j668m8005M3345Q3662K9156
$$ -88326 -89898 -32965 422 20519 -8721 -53370 -35660 -37328 -85333 -41988 41674 70830
10266G0830m1945o1544j3761L2253k5341M641K134q44L524M0585O4279L3070l7230
$$ 70830 28885 -32659 -46420 -14167 -39508 -34867 -32733 -33577 -30053 10532 74811 107881 70651
10253G0651m4149j0458m6545j1209n0058o323N9243L2041j7604J5015L1927j1384
$$ 70651 26502 16044 -30501 -41710 -91768 -98091 -38848 -6807 -24411 -9396 22531 11147
10241A1147p70k899l0299J4860K1688J4736L7417l3462m5393O4555J1988q5363
$$ 11147 10377 7478 -22821 -7961 13727 28463 65880 32418 -12975 51580 63568 -21795
10229b1795l5512k1253L5652M8963J0888l4401l5627M2674R4857N8690l8984q5541
$$ -21795 -57307 -78560 -42908 6055 16943 -17458 -53085 -10411 84446 143136 104152 18611
10217A8611k6929O498M0705J4910L508K9769M4342R778k8155p5756k6167L8585
$$ 18611 -8318 -1820 38885 53795 57303 87072 131414 141192 113037 37281 11114 49699
10205D9699j8201j4729o102k0832O84Q567K8683K3881N81J6199P666J0293J0398
$$ 49699 31498 16769 10667 -10165 -9481 -914 27769 51650 52231 68430 76096 86389 96787
10192I6787L1533K0060n0567l7943o138M5343j0638K0690n852q324K7863L4797
$$ 96787 128320 148380 97813 59870 53732 99075 88437 109127 103275 94951 122814 157611
10180A57611M0188L3835P0307M2700k7960m4416l0329J39N942K6213N479j955
$$ 157611 197799 231634 301941 344641 316681 272265 241936 242075 248017 274230 279709 277754
10168B77754P5833J33091J04830N3654l1139m1757p9918n729j2972o8644j751
$$ 277754 353587 486678 591508 645162 614023 572266 492348 486619 473647 405003 403252
10157D03252O6183Q3635Q8804L9549N9509M3746n7566q9822l3578l0206j03984
$$ 403252 469435 553070 641874 681423 740932 784678 727112 637290 603712 573506 469522
10146D69522l9149M8011N5468N2953K0929K491n1235l4221m7970k6642j05877
$$ 469522 430373 478384 533852 586805 607734 610225 558990 524769 476799 450157 344280
10135C44280l2580n1693r3733j4184M3646L7759J5475l7303m9915m5545r260k3073
$$ 344280 311700 260007 166274 152090 195736 233495 248970 211667 161752 116207 106947 83874
10123H3874k4645l1043J5937k4320k9260j9340j1052K3875k6018l1171j6544j1903
$$ 83874 59229 28186 44123 19803 -9457 -28797 -39849 -15974 -41992 -73163 -89707 -101610
10111a01610o390M7603N1729l4429j7968k8766M432N2859L3812J217J7334o7018
$$ -101610 -108000 -60397 -8668 -43097 -61065 -89831 -85399 -32540 1272 2489 19823 -47195
10099d7195p0170J2029L6204N697M9963L6422n906m3200k319N8188K624K421Q872
$$ -47195 -117365 -105336 -69132 -63435 -13472 22950 17044 -26156 -28475 29713 32337 34758 43630
10086D3630q6629k8935K8176j5179J8936J7173j0821J8759q928M338M380N5302
$$ 43630 -42999 -71934 -43758 -58937 -40001 -22828 -33649 -14890 -23818 -19480 -15100 40202
10074D0202M1090n6008m8782l5064j7939M2486l0736P649m997l0421P067M0070
$$ 40202 81292 25284 -23498 -58562 -76501 -34015 -64751 -57102 -62099 -92520 -85453 -45383
10062d5383j6275l0122j2284M4418M8741M7687L4851n5242o8192J4438M6555j6887
$$ -45383 -61658 -91780 -104064 -59646 -10905 36782 71633 16391 -51801 -37363 9192 -7695
10050g695p5527J8209Q5402r907l5302m6378J1671J2471R0999J9412j2629k3726
$$ -7695 -83222 -65013 20389 10482 -24820 -71198 -59527 -47056 43943 63355 50726 27000
10038B7000M104l1165j83J1223k5239M3047P2444q83m6847n4271j9220p043m2738
$$ 27000 31104 -61 -244 10979 -14260 28787 101231 100348 53501 -770 -19990 -27033 -69771
10025f9771m8635N860L3080O9114J9309o8037n2135k6614O9559K9161j9056m7936
$$ -69771 -118406 -112546 -79466 -10352 8957 -59080 -111215 -137829 -68270 -39109 -58165 -106101
10013a06101J108J03200r005j6974l552M3083L5842N726k2243N931K1382R45k5823
$$ -106101 -104993 -1793 -10798 -27772 -31324 11759 47601 53327 31084 37015 58397 59342 33519
10000C3519l4927k5494M8753N6020p0893n0188L6424K5595J2355O473q976j3829
$$ 33519 -1408 -26902 21851 77871 6978 -43210 -6786 18809 31164 37637 28661 14832
9988A4832m3394o2033j3549L2790J4230O974j1670L4979K5585K9113L6635j1253
$$ 14832 -28562 -90595 -104144 -71354 -57124 -50150 -61820 -26841 -1256 27857 64492 53239
9976E3239l9079o5653l7214O0608N8443K840J4287j6368m2889m4709M1054j0747
$$ 53239 14160 -51493 -88707 -28099 30344 33184 47471 31103 -11786 -56495 -15441 -26188
9964b6188m8598j0447M6094M8864l2473m1038m1379R209K9869K7587k4182L1439
$$ -26188 -74786 -85233 -39139 9725 -22748 -63786 -105165 -95956 -66087 -38500 -62682 -31243
9952c1243k5353m6937N5690k4957J9514l361N3351N1685j0200K4264j0027k7772
$$ -31243 -56596 -103533 -47843 -72800 -53286 -56647 -3296 48389 38189 62453 52426 24654
9940B4654r602J283k772J7226j3563l6643J7293K2948O2531N8108j7371K1994
$$ 24654 15052 16335 13563 30789 17226 -19417 -2124 20824 83355 141463 124092 146086
9928A46086J1764M7628N8341K2194L8840J32391J27035J29758K68254K41218k79325
$$ 146086 157850 205478 263819 286013 324853 457244 584279 714037 982291 1223509 944184
9917I44184m12337k62593n7653l9417j3373Q945n2566o49o8842l1426n5659k3877
$$ 944184 531847 269254 211601 172184 158811 167756 115190 114541 45699 14273 -41386 -65263
9905f5263M8287R727N2980J6510J652k7176M1343o728r6069o2971M4753L1769
$$ -65263 -16976 -7249 45731 62241 63893 36717 78060 71332 -24737 -87708 -42955 -11186
9893a1186K2919M3714N635m6023j832o455q0311M0055K5548J4785N961N5354k9776
$$ -11186 11733 55447 61082 15059 13227 6772 -73539 -33484 -7936 6849 12810 68164 38388
9880C8388n4151m691k2696k1051K3213K8951o6539k6780K168K0462m8591l3498
$$ 38388 -15763 -20454 -43150 -64201 -40988 -12037 -78576 -105356 -103188 -82726 -131317 -164815
9868a64815R2144N2674j1125J3026J5534M439j5525J5011l8460j8570K7624M484
$$ -164815 -72671 -19997 -31122 -18096 -2562 1877 -13648 1363 -37097 -55667 -28043 -23559
9856b3559j7404j345N653L4271j618l2611R299N1982j5290p3975l8016J2906L8078
$$ -23559 -40963 -42308 -36655 -2384 -4002 -36613 -27314 24668 9378 -64597 -102613 -89707 -51629
9843e1629O706M3786l2058l3999M5269K0582m6224k425k4415r38J250M2758K8136
$$ -51629 -44923 -1137 -33195 -67194 -21925 -1343 -47567 -49992 -74407 -75345 -74095 -31337 -3201
9830c201L3531l8839Q207K2895n1313O434K8542J243M198l1952k5681k2509m588
$$ -3201 30330 -8509 -302 22593 -28720 -22286 6256 7499 11697 -20255 -45936 -68445 -73033
9817g3033m3148j6983p76K8446K1869P694M4715K1903M982l1089PJ5852J9337
$$ -73033 -116181 -133164 -133940 -105494 -83625 -75931 -31216 -9313 -4331 -35420 -35413 -19561 -224
9804b24l435J8493l7836K938K0722L0887k1539K0328J0640m8354J8524l8667m4244
$$ -224 -3659 14834 -23002 -20064 658 31545 10006 30334 40974 -7380 11144 -27523 -71767
9791g1767J311J0967P088M9405O2130k3836n3614k8883J0327j002j3071j1138
$$ -71767 -70456 -59489 -52401 -2996 59134 35298 -18316 -47199 -36872 -37874 -50945 -62083
9779f2083k6875j4623M4647j6607J9693L3679K6752L4955p965j0157k8741L3660
$$ -62083 -88958 -103581 -58934 -75541 -55848 -22169 4583 39538 31573 21416 -7325 26335
9767B6335M3145l9479n3877L262M7144L6270j7257n51O1950k4762k1344l3335
$$ 26335 69480 30001 -23876 -20614 26530 62800 45543 44992 106942 82180 60836 27501
9755B7501m0103N731k1519j876j4318o1176L0965o427m9915k3959j5920M6569
$$ 27501 -12602 -6871 -28390 -30266 -44584 -105760 -74795 -81222 -131137 -155096 -171016 -124447
9743a24447M6716o073K4745L0647K908M1906N2233j9881n639o949l3687l3145
$$ -124447 -77731 -83804 -59059 -28412 -25504 16402 68635 48754 43115 36166 2479 -30666
9731c0666k7631R369K4385N040L4962j188l88l6563m3842K506Q499J9669K2703
$$ -30666 -58297 -48928 -24543 -19503 15459 14271 13883 -22680 -66522 -64016 -55517 -35848 -13145
9718a3145l0159q030J2511N6503P205j7422K3465M4010O830P7117O8869M779l042
$$ -13145 -43304 -51334 -38823 17680 24885 7463 30928 74938 81768 158885 227754 232533 229491
9705B29491j2085L7848N7594j8242l4155m0738j1501l4803n7599r7228m5454M0400
$$ 229491 217406 255254 312848 294606 260451 219713 208212 173409 115810 18582 -26872 13528
9693A3528O9962K0433J2504l1018k1294n4080k5512K622M1436K9228L83j4665
$$ 13528 83490 103923 116427 85409 64115 10035 -15477 -12855 28581 57809 58192 43527
9681D3527J1357J8140J1050m8583j7831K8009N4273n9626j7444K4556j7388K4543
$$ 43527 54884 73024 84074 35491 17660 45669 99942 40316 22872 47428 30040 54583
9669E4583k112L966p1012o395R232K6685P049k5173J7804K5439k9299L770L5855
$$ 54583 52471 56437 -14575 -20970 -11738 14947 21996 -3177 14627 40066 10767 14537 50392
9656E0392K8571k26q7215j54N0374K4253M8108J7912l4365K7004N8252O6516J45019
$$ 50392 78963 78737 -8478 -8632 41742 65995 114103 132015 97650 124654 182906 249422 394441
9643C94441P9436J92023Q2580j94126k54084j03800J8073j9737J8611r971o7384
$$ 394441 473877 665900 748480 554354 300270 196470 214543 194806 213417 203446 136062
9632A36062o9721l0335N1415K3268J8851L2036L5681m6415k1919P0444p745J9683
$$ 136062 66341 36006 87421 110689 129540 161576 197257 150842 128923 199367 191622 211305
9620B11305J5280J7649k1888n0394j6715N299m5053n2106L217J7798K0700k0296
$$ 211305 226585 244234 222346 171952 155237 160536 115483 63377 66594 84392 105092 84796
9608H4796k5736k1278n1404k0079M0945K6880n158K5665J8921n3880m5106L5967
$$ 84796 59060 37782 -13622 -33701 7244 34124 28966 54631 73552 19672 -25434 10533
9596A0533j4656m7505J5720N6850N4823J4081j0849o7951k4315R397J7422Q945
$$ 10533 -4123 -51628 -35908 20942 75765 89846 78997 11046 -13269 -3872 13550 22495
9584B2495j073K6453J6986m6234k57o264o7816k9008N9323L3106J5538j1232j8562
$$ 22495 21422 47875 64861 18627 18370 12106 -55710 -84718 -25395 7711 23249 12017 -6545
9571f545n6056j6293j7338k24J0344j3994L8999l9792M350M3620R3120M0220j6898
$$ -6545 -62601 -78894 -96232 -96456 -86112 -100106 -61107 -100899 -96549 -52929 40191 80411 63513
9558F3513j8622m0036p0964l2454J4292j0168K851M7394P6700k2990J2706Q5121
$$ 63513 44891 4855 -66109 -98563 -84271 -94439 -91588 -44194 32506 9516 22222 107343
9546A07343j3671k8338o9178k0113L2979l1903l848P482K5748J0468J7726N231
$$ 107343 93672 65334 -3844 -23957 9022 -22881 -26729 -19247 6501 16969 34695 39926
9534C9926J3636P545m0904j1397J849r198n416K922k6074k067K9402j3642l896
$$ 39926 53562 61107 20203 8806 10655 1457 -3959 -1037 -27111 -29178 224 -13418 -17314
9521a7314l1688K5104M6371l7734K269J8104k9316n3896k0108L2368M103j1141
$$ -17314 -49002 -23898 22473 -15261 -12992 5112 -24204 -78100 -98208 -65840 -61737 -72878
9509g2878O8818K6820l1550L087J292K262k3929j8067l7804m3475Q486L0963L875
$$ -72878 -4060 22760 -8790 -5703 -4411 -2149 -26078 -44145 -81949 -125424 -116938 -85975 -82100
9496h2100Q5825L5347l275j8258O53J0649M0263L4003l545m2146n4795j007M2393
$$ -82100 3725 39072 35797 17539 18192 28841 69104 103107 99562 57416 2621 1614 44007
9483D4007p814k7722m9877n8998P6770P8164K1667k275o294n0795j1021k3510
$$ 44007 36193 8471 -41406 -100404 -23634 54530 76197 73922 67628 16833 5812 -17698
9471a7698o3960L0444N2882j8328m770N734N76J2446N335Q433l7913J0602l668
$$ -17698 -81658 -51214 1668 -16660 -21430 -15696 -15120 -2674 2661 11094 -26819 -16217 -19885
9458a9885K4848K1099l7390l8221o668N254J1227L7773Q960p678M62l4618k5760
$$ -19885 4963 26062 -11328 -49549 -56217 -50963 -39736 -1963 6997 -681 -219 -34837 -60597
9445f0597l1698j1844J0257N340O328K469K9136N7596O5563j8897m4864l7024
$$ -60597 -92295 -104139 -93882 -88542 -82214 -79745 -50609 6987 72550 53653 8789 -28235
9433b8235m846N0035k484j0474k8407O4415N528p2443l3996K979Q350Q2954J759
$$ -28235 -33081 16954 14470 3996 -24411 40004 45532 -26911 -60907 -57928 -49578 33376 35135
9420C5135o1969n4642l6351j3928M8612L7616L9124J177K3868J4655m4153k6660
$$ 35135 -26834 -81476 -117827 -131755 -83143 -45527 -6403 -5226 18642 33297 -10856 -37516
9408c7516r291K1793K1773k6558j3719j3001L0158K3865j111L1920K184p0866
$$ -37516 -46807 -25014 -3241 -29799 -43518 -56519 -26361 -2496 -3607 28313 30497 -40369
9396d0369l2417Q842K1035J341o2544K7169Q1316k8345p2465o089L195J1868J8820
$$ -40369 -72786 -63944 -42909 -41568 -104112 -76943 4373 -23972 -96437 -102526 -99331 -87463 -68643
9383f8643J7354J6956m2827q4449M74L1651M1783J6244K0713K0443j516K4101
$$ -68643 -51289 -34333 -77160 -161609 -161135 -129484 -87701 -71457 -50744 -30301 -31817 -7716
9371g716k2832o4500m495M4497Q767j7796m409R969M2081O5771j5095p8203J148
$$ -7716 -30548 -95048 -99543 -55046 -46279 -64075 -68484 -58515 -16434 49337 34242 -43961 -42813
9358d2813L8245K4600J2212l9066J056j4094K0600J7876M2109K809m7379k0577
$$ -42813 -4568 20032 32244 -6822 -5766 -19860 740 18616 60725 63534 16155 -4422
9346d422l3432J8446j901J2213j4090L0224M2648J8684k5752M458J4299m9439
$$ -4422 -37854 -19408 -21309 -9096 -23186 7038 49686 68370 42618 47076 61375 11936
9334A1936o723L5242J942j6430j3285k6402J4496K459k5550n825Q102R775Q138
$$ 11936 5213 40455 42397 25967 12682 -13720 776 3235 -22315 -28140 -20038 -10263 -2125
9321b125J3547J434M2484L2739p0107q0320k2538K771L2241N3509k6099l2412
$$ -2125 11422 12856 55340 88079 17972 -62348 -84886 -82115 -49874 3635 -22464 -54876
9309e4876K2170l4070P633O0128k7434l0967j4887L2543K6752L009L843K1331
$$ -54876 -32706 -66776 -59143 985 -26449 -57416 -72303 -39760 -13008 -9999 -6156 15175
9297A5175J9820Q45j5872m250m529R972L0416j8043m6334j65J3464l6030O661
$$ 15175 34995 35840 19968 15718 11189 21161 51577 33534 -12800 -12965 499 -35531 -28870
9284b8870j944j682p203M2320L0097j2929o650j3847m4370J0589K4782k1888j9300
$$ -28870 -30814 -32496 -39699 2621 32718 19789 13139 -708 -45078 -34489 -9707 -31595 -50895
9271e0895r106r653R707J8538L2872L6727k1483n081j3803l6454M1917o164n0941
$$ -50895 -60001 -69654 -59947 -41409 -8537 28190 6707 1626 -12177 -48631 -6714 -12878 -63819
9258f3819J2751M7962K5803m129k7620l7712K1583L9125J4244j8245j8935L2972
$$ -63819 -51068 -3106 22697 18568 -9052 -46764 -25181 13944 28188 9943 -8992 23980
9246B3980q730m874k8061j7479J7349K1492k334L9925j4305o1437j8555K347o876
$$ 23980 15250 10376 -17685 -35164 -17815 3677 1343 41268 26963 -34474 -53029 -50682 -57558
9233e7558n5155k2910K2611l5738P5797M3084j8674L4535N116O926k7920J6034
$$ -57558 -112713 -135623 -113012 -148750 -72953 -29869 -48543 -14008 -8892 -1966 -29886 -13852
9221a3852L5870J6023k1089l9430j2228k5845k7237O7346R9987K0193j1950o2537
$$ -13852 22018 38041 16952 -22478 -34706 -60551 -87788 -20442 79545 99738 87788 25251
9209B5251l214L9722r879k2457l7602k039J3633J1993n8966L1082l6745O210J6879
$$ 25251 22037 61759 51880 29423 -8179 -10218 3415 15408 -43558 -12476 -49221 -43011 -26132
9196b6132K784j321K3271L5322L538l6717K0171N6473m17m847o4496n4301j5627
$$ -26132 -23348 -24669 -1398 33924 37462 745 20916 77389 76972 72125 7629 -46672 -62299
9183f2299N9337L9564k3325n648m105J0345L9870l1078j6229j649j8556r707J1037
$$ -62299 -2962 36602 13277 7629 3524 13869 53739 22661 6432 4783 -13773 -23480 -12443
9170a2443J6690K175N389K8810l989k713O860M028m8984k2703P84N2316N9296
$$ -12443 4247 6422 11811 40621 36632 33919 40779 44807 -4177 -26880 -26096 26220 85516
9157H5516j9996o2975K0242J4550r321j1906J6256o2656n9716m4795K2777N1742
$$ 85516 65520 2545 22787 37337 28016 16110 32366 -30290 -90006 -134801 -112024 -60282
9145f0282K2727J2435J1087J8547n526N390k8980l0800q872L8008K1515K8540
$$ -60282 -37555 -25120 -14033 4514 -1012 4378 -24602 -55402 -64274 -26266 -4751 23789
9133B3789j8253k0014j0247K2701N2066j1000k9090q434P601K265L2992j9124
$$ 23789 5536 -14478 -24725 -2024 50042 39042 9952 1518 9119 11384 44376 25252
9121B5252l2260o780R129k2452M4917K41m1663n3825N900L8282O3637L8911m2167
$$ 25252 -7008 -13788 -4659 -27111 17806 18047 -23616 -77441 -71541 -33259 30378 69289 27122
9108B7122p5075l686M1029J589O103J2747l4925l9841J7394K0753L8606Q093n1060
$$ 27122 -47953 -51639 -10610 -9021 -2918 9829 -25096 -64937 -47543 -26790 11816 19909 -31151
9095c1151k0101M0775j7567k9985L0538p067j6451j9992K3770K5280p803J2020
$$ -31151 -51252 -10477 -28044 -58029 -27491 -34558 -51009 -71001 -47231 -21951 -29754 -17734
9083a7734N0642j0322m7189P561K8559O625l6794r92j8606j1287K5260N731l6087
$$ -17734 32908 22586 -24603 -17042 11517 18142 -18652 -19644 -38250 -49537 -24277 -18546 -54633
9070e4633L3114j8180k2493J848L105L019k3221J3773N1940L8013k2781K6978
$$ -54633 -21519 -39699 -62192 -60344 -57239 -54220 -77441 -63668 -11728 26285 3504 30482
9058C0482J7567l51J7354l2852n8024j501j0079K6710q578q896n2324M0009N6663
$$ 30482 48049 47698 65052 32200 -25824 -27325 -37404 -10694 -19272 -28168 -80492 -40483 16180
9045A6180J0639p9628l991L2853L6033j5284k9851K7186k1390m8869K611q098
$$ 16180 26819 -52809 -56800 -23947 12086 -3198 -33049 -5863 -27253 -76122 -73511 -81609
9033h1609Q483j2005j8010K7668M5569n8469l219K6819P1981j065j3721k0969
$$ -81609 -73126 -85131 -103141 -75473 -29904 -88373 -91592 -64773 7208 6143 -7578 -28547
9021b8547m339P8550J534k5358L7142j025K524o1395j5006L068K3228O1866R805
$$ -28547 -32886 45664 47198 21840 58982 57957 60481 -914 -15920 -12852 10376 72242 82047
9008H2047m7681K8358K4967l5138J2376j318n9232j7621J4738K8024k6649J1779
$$ 82047 34366 62724 87691 52553 64929 63611 4379 -13242 1496 29520 2871 14650
8996A4650K0255j2211p0537l5958J0163K2311L5176j1596J4332N3795j2860m0190
$$ 14650 34905 22694 -47843 -83801 -73638 -51327 -16151 -27747 -13415 40380 27520 -12670
8984a2670l289j9424l969K6563l0745k4200O054J8876Q870k5996M5704l0951Q624
$$ -12670 -15959 -35383 -39352 -12789 -43534 -67734 -61680 -42804 -33934 -59930 -14226 -45177 -36553
8971c6553n5225j3854K4244k472n222O2030N516j653J0124O792J2095L6048O2709
$$ -36553 -91778 -105632 -81388 -83860 -89082 -27052 -21536 -23189 -13065 -6273 5822 41870 104579
8958A04579j632j12313p5596K0624O2249l2425k898O3237J2530N0924L3887o39
$$ 104579 102947 -9366 -84962 -64338 -2089 -34514 -37412 25825 38355 89279 123166 122527
8946A22527k7348k1275L0543l7624n2532L6385l4083l3209L9975K9124N6957K6560
$$ 122527 95179 73904 104447 66823 14291 50676 16593 -16616 23359 52483 109440 136000
8934A36000p4446r3932K2883L9485k8907J1017l1848n0750J382K8028M3589l047
$$ 136000 61554 -32378 -9495 29990 1083 12100 -19748 -70498 -69116 -41088 2501 -546
8922e46k8233o1987K8596N1173k6247O973m8149J5062K5792K8963N8725J746r142
$$ -546 -28779 -90766 -62170 -10997 -37244 -30271 -78420 -63358 -37566 -8603 50122 51868 42726
8909D2726m334L6791o2241R61j7564k2828q160k1659K000k6862k129J285Q5788
$$ 42726 38392 75183 12942 13903 -3661 -26489 -34649 -56308 -54308 -81170 -83299 -82014 3774
8896C774l28k0349L7713M202k6285k3745M3535N4552m9002k5601M0952K302j3823
$$ 3774 3446 -16903 20810 25012 -1273 -25018 18517 73069 24067 -1534 39418 41720 27897
8883B7897N4754k4757k8659J813K0804L4778m6725k2532L1716J0216n438o1554
$$ 27897 82651 57894 29235 31048 51852 86630 39905 17373 49089 59305 53867 -7687
8871g687q2508p635R425M8445K2794k777m2468N8292M8936m9471k5470m9965l3129
$$ -7687 -90195 -97830 -88405 -39960 -17166 -19943 -62411 -4119 44817 -4654 -30124 -80089 -113218
8858a13218M1519J2686L265O702n337j6371j302J1073K1574O9714k0324n6351
$$ -113218 -71699 -59013 -55748 -49046 -54383 -70754 -72056 -60983 -39409 30305 9981 -46370
8846d6370P915N914Q173j2313q979L5817K3694j8557l447m2058q097m652L1548
$$ -46370 -38455 -32541 -24368 -36681 -45660 -9843 13851 -4706 -8153 -50211 -58308 -62960 -31412
8833c1412N8689J4060j7422k9862k1821p371J0708k3392r778R725Q4964M2114
$$ -31412 27277 41337 23915 -5947 -27768 -35139 -24431 -47823 -57601 -47876 37088 79202
8821G9202n1275m4177q419n88P76k9840L1023K7348o4119l8000M2148M3051o063
$$ 79202 27927 -16250 -24669 -25257 -24481 -54321 -23298 4050 -60069 -98069 -55921 -12870 -18933
8808a8933Q724J5133O047r637L6405J9039q991m437l5974L194j326M630N4665
$$ -18933 -10209 4924 10971 1334 37739 56778 47787 43350 7376 10570 9244 13874 68539
8795F8539P292j886L629j9970k0292N771M4589k8717k0826L5636o1652n0186J0306
$$ 68539 75831 73945 77574 57604 37312 43083 87672 58955 38129 73765 12113 -38073 -27767
8782b7767M9296R888j5277O737k0936L243n495k5280J2926O125M777K3861l8102
$$ -27767 21529 31417 16140 22877 1941 5184 -311 -25591 -12665 -6540 -1763 22098 -16004
8769a6004n4239L3891k273o653M3950K9820L7355K0385l7705K6462k3782k3195
$$ -16004 -70243 -36352 -38625 -45278 -1328 28492 65847 86232 48527 74989 51207 28012
8757B8012K39n1598K1284R3440K5654p718l9827L763K6236K490m692j0272j3973
$$ 28012 28251 -23347 -2063 91377 117031 109313 69486 73249 99485 101975 97283 87011 73038
8744G3038k812l3941J3726j0951J9032K8284K6965j8255r7897k9199k3184J743
$$ 73038 70226 36285 50011 39060 58092 86376 113341 95086 -2811 -32010 -55194 -53451
8732e3451P4607j4185k4076K2123K1527k6193n491j1961m0784r697M7304M1173
$$ -53451 21156 6971 -17105 5018 26545 352 -5139 -17100 -57884 -67581 -20277 20896
8720B0896M852J3406j6929j3226l980J2180K9111K3161K3700k9557m6044L363
$$ 20896 25748 39154 22225 8999 5019 17199 46310 69471 93171 63614 17570 20933
8708B0933J754k6586l5483k3760L904N6184L1478P643p7665K389J9546K8333M2904
$$ 20933 22687 -3899 -39382 -63142 -59238 -3054 28424 36067 -41598 -39209 -19663 8670 51574
8695E1574m6734m7755k4586j6734Q3797M6978n4979q9236j7675J3542K7810L1978
$$ 51574 4840 -42915 -67501 -84235 -438 46540 -8439 -97675 -115350 -101808 -73998 -42020
8683d2020O847l78K5034J8488J0704N16P738K5753K3572K2326m9733j6701j8776
$$ -42020 -35173 -35551 -10517 7971 18675 19191 26929 52682 76254 98580 48847 32146 13370
8670A3370j3624j7337J6934j6794K3163K362m7575j5699K4733j7590n430L6063
$$ 13370 -254 -17591 -657 -17451 5712 8074 -39501 -55200 -30467 -48057 -53487 -17424
8658a7424M6198N1946n893m2851l9867j7923J8140Q864l0209J2915M5719l6592
$$ -17424 28774 80720 74827 31976 -7891 -25814 -7674 1190 -29019 -16104 29615 -6977
8646f977K2588J1080n2562l4070K2744M4258l1250M662K2581k2360m1332j5983
$$ -6977 15611 26691 -25871 -59941 -37197 7061 -24189 -19527 3054 -19306 -60638 -76621
8634g6621M5004J2376J6174J8655k2984q60O3328K8038J8087r409R628l0336K8662
$$ -76621 -31617 -19241 -3067 15588 -7396 -8256 55072 83110 101197 91788 101416 71080 99742
8621I9742R324o2405m2795l5872K8556K5215l695J6663l1133p161q648N8401L0830
$$ 99742 109066 46661 3866 -32006 -3450 21765 18070 34733 3600 -3561 -12209 46192 77022
8608G7022k2617l3449k5421m9210N3343j491N2616L3349l3654j8232k9253m5891
$$ 77022 54405 20956 -4465 -53675 -332 -1823 50793 84142 50488 32256 3003 -42888
8596d2888L0110J00127L961K3397J1120l8636N580M6152j8614m7912l1659o0566
$$ -42888 -12778 87349 91310 114707 125827 87191 92771 138923 120309 72397 40738 -19828
8584a9828k1332O0306P9536J0662k6041K5922j1221p0106k8730n0587m687K3792
$$ -19828 -41160 19146 98682 109344 83303 109225 98004 27898 -832 -51419 -56106 -32314
8572c2314r645l867N5666K5533J3390J2499n297K551L509m4598j9706K2086J0285
$$ -32314 -41959 -45826 9840 35373 48763 61262 55965 58516 62025 17427 -2279 19807 30092
8559C0092m6883m9392K6812J5679j4026K3932O8200o327N587j4530p5340K6074
$$ 30092 -16791 -66183 -39371 -23692 -37718 -13786 54414 48087 53674 39144 -36196 -10122
8547a0122O2503j8891l2820J1108L8098k43l2165k6909p4724m322K6244J2346
$$ -10122 52381 33490 670 11778 49876 49633 17468 -9441 -84165 -88487 -62243 -49897
8535d9897r532n071j0324N6236k3113m4428m9026M9736J9410l708K9487M3158
$$ -49897 -59429 -64500 -74824 -18588 -41701 -86129 -135155 -85419 -66009 -69717 -40230 2928
8523B928J2759L7962Q5952R31m3621l4786o764m2196n8915j7590k2522K0809N1284
$$ 2928 15687 53649 139601 140532 96911 62125 55361 13165 -45750 -63340 -85862 -65053 -13769
8510a3769n708K7806L9912r523j2451k9866m6068J9936K2426L8409n0721n793
$$ -13769 -19477 8329 48241 38718 26267 -3599 -49667 -29731 -7305 31104 -19617 -25410
8498b5410N5514P242j9825k1769l1238r680k885R716N4531j2513m1902K924K547
$$ -25410 30104 37346 17521 -4248 -35486 -45166 -48051 -38335 16196 3683 -38219 -35295 -32748
8485c2748m4674k9828J3265K9168M563n381r068l1227m273k0891o155N1250J6551
$$ -32748 -77422 -107250 -93985 -64817 -60254 -65635 -74703 -105930 -110203 -131094 -137249 -85999 -69448
8472f9448n4424M3895N2129L073J9153J1743K917J4399K0323m198l0062p2592
$$ -69448 -123872 -79977 -27848 -24775 -5622 6121 9038 23437 43760 39562 9500 -63092
8460f3092l061K2005k796k7207R32k2499l6868Q556L8128Q727J3270J2958P0292
$$ -63092 -66153 -44148 -46944 -74151 -73219 -95718 -132586 -124030 -85902 -77175 -63905 -50947 19345
8447A9345O390p6088m1750p736K4625M4624n215J7015M0358M8260L821j6989o7597
$$ 19345 25735 -50353 -92103 -99839 -75214 -30590 -35805 -18790 21568 69828 73649 56660 -10937
8434a0937j1489j8202o2149M0831M8504K2742j1830j3845J091J9203L6524N6365
$$ -10937 -22426 -40628 -102777 -61946 -13442 9300 -2530 -16375 -15284 3919 40443 96808
8422I6808l2067M7785n5021o7507j4797L748L84M50M915K3485N5651L3236k083
$$ 96808 64741 112526 57505 -10002 -24799 -21051 -20667 -20217 -15302 8183 63834 97070 94987
8409I4987j9846j3329m8562q3299l6808K3415K7557N1417l0926j4959n183J9026
$$ 94987 75141 61812 13250 -70049 -106857 -83442 -55885 -4468 -35394 -50353 -55536 -36510
8397c6510L4473Q036j0719K9095j2179l5848j9624L4077K2148K3611M5838O883
$$ -36510 -2037 5999 -4720 24375 12196 -23652 -43276 -9199 12949 36560 82398 89281
8385H9281n4500K8682L8720J4539q452j8383M038m4929n2066l8735M7135J623
$$ 89281 34781 63463 102183 116722 108270 89887 93925 48996 -3070 -41805 5330 6953
8373F953j1847l3607j714R952p948j1999J1000o768k4016n17J1106M3787K0362
$$ 6953 -4894 -38501 -40215 -30263 -38211 -50210 -39210 -45978 -69994 -70511 -59405 -15618 4744
8360D744J0437j010o4484m5316M3464N4847L1230L2637j4976J8650K0756n058
$$ 4744 15181 14171 -50313 -95629 -52165 2682 33912 66549 51573 70223 90979 85921
8348H5921o7006l9412l7141L615Q2298J2842J9162J1204o0977j1139M9091O7430
$$ 85921 18915 -20497 -57638 -54023 28275 41117 60279 71483 10506 -633 48458 115888
8336A15888l4981m5228J0401K8444K5961K8900N2011P9817N0923J12562R9822
$$ 115888 80907 35679 46080 74524 100485 129385 181396 261213 312136 424698 524520
8325E24520J00005Q9023p3398k55682j44974p0877r1565o6421l2173o0833J9994
$$ 524520 624525 713548 640150 384468 239494 168617 77052 10631 -21542 -82375 -62381
8314f2381K9705R998p680k0554o547k6177l4347M6189N7433O644m777M466K2811
$$ -62381 -32676 -22678 -30358 -50912 -57459 -83636 -117983 -71794 -14361 -7717 -12494 -8028 14783
8301A4783k1367l1706k4688L3338K0968j1063K8719L4845L4184k329J5723L5802
$$ 14783 -6584 -38290 -62978 -29640 -8672 -19735 8984 43829 78013 75684 91407 127209
8289A27209K5085J3720J20213L8248j4545J40190J77589K43985L13227K73808
$$ 127209 152294 166014 286227 324475 309930 450120 627709 871694 1184921 1458729
8279A458729j44093m10361l55195j78458o7672r9234q7329l6399j8412j4082k5632
$$ 1458729 1314636 904275 549080 370622 302950 203716 116387 79988 61576 47494 21862
8268B1862m490k3782o5614j5471K4812Q0827l269j1535o3246l4457L3660L8379
$$ 21862 17372 -6410 -72024 -87495 -62683 18144 14875 3340 -59906 -94363 -60703 -22324
8256b2324l7712M4310M6434j9232K9209p159N636p014k6990j1368R669J403Q784
$$ -22324 -60036 -15726 30708 11476 40685 33526 39162 32148 5158 -6210 3459 4862 13646
8243A3646P778J6137J26172J17102N3559O2094J04028J22092K1279j50686j70352
$$ 13646 21424 37561 163733 280835 334394 396488 500516 622608 643887 493201 322849
8232C22849j65644r1260o5046k2516J2064j9642n676n946m3962O995Q757N881
$$ 322849 157205 65945 899 -21617 -9553 -29195 -34871 -40817 -84779 -77784 -69027 -63146
8220f3146N7073j818m7343l3355K4086K2898k9O2403k2088m2414J2903Q195N147
$$ -63146 -6073 -7891 -55234 -88589 -64503 -41605 -41634 20769 -1319 -43733 -30830 -22635 -17488
8207a7488j1306K022P320L7384o021J5884m4985k7818k9894P4266O7226l8436
$$ -17488 -28794 -26772 -19452 17932 11911 27795 -17190 -45008 -74902 -636 66590 28154
8195B8154n2823L55q510l4320n3470L1350l749j103J2267M0871m3166l9529M5995
$$ 28154 -24669 -24314 -32824 -67144 -120614 -89264 -93013 -94116 -81849 -40978 -84144 -123673 -77678
8182g7678m3642k0132L6830J0139M0275p34m9072r684N9364P6050L5505R453n273
$$ -77678 -121320 -141452 -104622 -94483 -54208 -54942 -104014 -113698 -54334 21716 57221 66674 61401
8169F1401L657L2909m5810n6692P927K6442j2057l8754L8061j4349k0961p441
$$ 61401 65058 97967 52157 -4535 3392 29834 17777 -20977 17084 2735 -18226 -25667
8157b5667k3153k3967K7973M3414K1996k7930j5952J5668L839k7708K430L9782
$$ -25667 -48820 -72787 -44814 -1400 20596 -7334 -23286 -7618 -3779 -31487 -29057 10725
8145A0725k6871L4837Q8297J3229o7598k9486k9638J4650J9108n3514k7761k5030
$$ 10725 -16146 18691 106988 120217 52619 23133 -6505 8145 27253 -26261 -54022 -79052
8133g9052J7443K3955r73J248J2051m9283m3700J4745N6485J2702M6947L4301
$$ -79052 -61609 -37654 -38627 -37379 -25328 -74611 -118311 -103566 -47081 -34379 12568 46869
8121D6869m8299j3470K1710J5434N735k0947m5760J3508N3775M8512j9162k3494
$$ 46869 -1430 -14900 6810 22244 27979 7032 -38728 -25220 28555 77067 57905 34411
8109C4411j1184l2508r768l0528k6229j9314P955K5077M6830K1996M774j4649
$$ 34411 23227 -9281 -19049 -49577 -75806 -95120 -87165 -62088 -15258 6738 11512 -3137
8097c137k6811k6938J6339p526J2496k5520O725O6625L5245k8345r3681j5379
$$ -3137 -29948 -56886 -40547 -48073 -35577 -61097 -54372 12253 47498 19153 -74528 -89907
8085h9907N5581K7969K1827j6110l1954j8141L5812O0281M4597j6934m3610n9752
$$ -89907 -34326 -6357 15470 -640 -32594 -50735 -14923 45358 89955 73021 29411 -30341
8073c0341m0965j0595L8341L2301k8533K8833J9845j7923j5914L1781R41J49k1327
$$ -30341 -71306 -81901 -43560 -11259 -39792 -10959 8886 -9037 -24951 6830 7771 7920 -13407
8060a3407j9339K4051j1670k8039M3189L4651j6365k5246K8231J7848j0207K4968
$$ -13407 -32746 -8695 -20365 -48404 -5215 29436 13071 -12175 16056 33904 23697 48665
8048D8665N620m7330l1265m4986q971k6558M5267J0591K6243M8565O331n317J7729
$$ 48665 54285 6955 -24310 -69296 -78267 -104825 -59558 -48967 -22724 25841 32172 26855 44584
8035D4584m4356K1571k1295k5388J1885J1900J9391J1196m1171l9709J6031L3252
$$ 44584 228 21799 504 -24884 -12999 -1099 18292 29488 -11683 -51392 -35361 -2109
8023b109P34K1127K0954Q833M9726m4214p1952M7143L0745k059j0766n6789m6281
$$ -2109 -1375 19752 40706 49539 99265 55051 -16901 30242 60987 58928 48162 -8627 -54908
8010e4908j1826J662o540k611J6424K744N6502N0321J0147o142l578k7596j2929
$$ -54908 -66734 -65072 -71612 -74223 -57799 -55055 1447 51768 61915 55773 52195 24599 11670
7997A1670J4258J1495J3078L8170k0654k1956j4793m0622n6303l541j0169M1390
$$ 11670 25928 37423 50501 88671 68017 46061 31268 -9354 -65657 -69198 -79367 -37977
7985c7977L5350K7279n380j6377l4072K8686K647M0017m1706J4120n984l484j9082
$$ -37977 -2627 24652 19272 2895 -31177 -2491 156 40173 -1533 12587 6603 3119 -15963
7972a5963J4633N8610J4791j3197J338Q061R949n9374k2619r368r558L1814M0320
$$ -15963 -1330 57280 72071 58874 60212 68273 78222 18848 -3771 -13139 -22697 9117 49437
7959D9437l5474k3345o379N8845L8031j6036k0854m2864k9945p2454L1327N2500
$$ 49437 13963 -9382 -15761 43084 81115 65079 44225 1361 -28584 -101038 -69711 -17211
7947a7211j422R096L98M6700n1067k2326l526K2672k4790p0123O800L3371J4598
$$ -17211 -18633 -9537 -9139 37561 -13506 -35832 -39358 -16686 -41476 -111599 -104799 -71428 -56830
7934e6830L0601j2762j1213N1834J9312j1536N937r769l459j8949L5133k4843
$$ -56830 -26229 -38991 -50204 1630 20942 9406 15343 5574 2115 -16834 18299 -6544
7922f544J5866J4668l5517j5798M3028k6161j0396N9964M3385k1564l3230J3887
$$ -6544 9322 23990 -11527 -27325 15703 -10458 -20854 39110 82495 60931 27701 41588
7910D1588o465L062j9191n216o2648j3683k9584k8501l5422M0125M9147M5276
$$ 41588 35123 38185 18994 13778 -48870 -62553 -92137 -120638 -156060 -115935 -66788 -21512
7898b1512R732K5782K5856l1031N9333j4627N73m6203O817j6638k8123j7352n269
$$ -21512 -11780 14002 39858 8827 68160 53533 54106 7903 14720 -1918 -30041 -47393 -52662
7885e2662J0458o338M1345k1075M598j1457R224L3186M5494l5580q2137l9403
$$ -52662 -42204 -48542 -7197 -28272 -23674 -35131 -25907 7279 52773 17193 -64944 -104347
7873a04347L2975N8629M3760n0214l675R671K2211J3429j0156j9618r746L5975
$$ -104347 -71372 -12743 31017 -19197 -22872 -13201 9010 22439 12283 -7335 -17081 18894
7861A8894k7639p68L7713j885k4298o3606m3677P4310M6097j4206j1300P5370
$$ 18894 -8745 -9513 28200 26315 2017 -61589 -105266 -30956 15141 935 -10365 65005
7849F5005j308j5260m309m0875L4363K9976q4438k7172N1827M3336l8504k536
$$ 65005 63697 48437 44128 3253 37616 67592 -16846 -44018 7809 51145 12641 10105
7837A0105j6330K7599j6394q1719J0572K2565K212p8753j4963Q4499J5881J4981
$$ 10105 -6225 21374 4980 -76739 -66167 -43602 -41390 -120143 -135106 -50607 -34726 -19745
7825a9745L3161N680k1103m9818k656M9660m828p3393L7184L5459Q568l879J4292
$$ -19745 13416 19096 -2007 -51825 -54481 -4821 -9649 -83042 -45858 -10399 -1831 -5710 8582
7812H582K8394N4627k161j9956j4629j9036k0019m212L586k1243l8875K845L3168
$$ 8582 36976 91603 89442 69486 54857 35821 15802 11590 15176 -6067 -44942 -42097 -8929
7799h929J2541K1092M2749k9271l4682k7026R09M363J0417K0032Q142N831J1566
$$ -8929 3612 24704 67453 38182 3500 -23526 -22617 -18254 -7837 12195 20337 26168 37734
7786C7734L735J0625L449J7063k7147l3873M927j1638o9004K106J4784N1101L0604
$$ 37734 41469 52094 55543 72606 45459 11586 16513 4875 -64129 -62023 -47239 3862 34466
7773C4466R175j9816m2547L5800j0073o3081j1090R7736L7343l5458j8900n0539
$$ 34466 43641 23825 -18722 17078 7005 -56076 -67166 30570 67913 32455 13555 -36984
7761c6984j5719K7110K8293P479N128R782J3524l6390m016j8766K330J3407M3034
$$ -36984 -52703 -25593 2700 10179 15307 25089 38613 2223 -1793 -20559 -18229 -4822 38212
7748C8212m1643m8625l4945m113j1582J8173O8070j0204J8272J0778L8000M858
$$ 38212 -3431 -52056 -87001 -91114 -102696 -84523 -16453 -26657 -8385 2393 40393 45251
7736D5251R660k8600m2481J122N906L0430m5718j3651J732K9087O050K2526J7449
$$ 45251 54911 26311 -16170 -15048 -9142 21288 -24430 -38081 -36349 -7262 -1212 21314 38763
7723C8763l6832K592k6401k4453j8325M5779M918L7401M5473j4218J9661j1905
$$ 38763 1931 4523 -21878 -46331 -64656 -18877 -13959 23442 68915 54697 74358 62453
7711F2453p600O676j0315J1364J1263M895m6785o804j4126J1473O314K8307m6225
$$ 62453 54853 61529 51214 62578 73841 78736 31951 25147 11021 22494 28808 57115 10890
7698A0890n9753J9840J4963K8326j1176j2400p727J95j2664O719M6979O5375r846
$$ 10890 -48863 -29023 -14060 14266 3090 -9310 -17037 -16842 -29506 -22787 24192 89567 79721
7685G9721J4754P122o2409j7523N0267j0038l5632J6937j3397m2924j1270l973
$$ 79721 94475 101597 39188 21665 71932 61894 26262 43199 29802 -13122 -24392 -28365
7673b8365k3642K3473O7101O4102L8210r9635l7874R333J7434Q438p3475k8530
$$ -28365 -52007 -28534 38567 102669 140879 41244 3370 12703 30137 38575 -34900 -63430
7661f3430J1630q305K166m635l0629Q8579O8866n722k6243q5798K6168J318k2605
$$ -63430 -51800 -60105 -57939 -62574 -93203 -4624 64242 58520 32277 -53521 -27353 -26035 -48640
7648d8640k1671j4339J4219m9k4146M5805N7584O3214K1372m6151K612J6543n9761
$$ -48640 -70311 -84650 -70431 -70480 -94626 -48821 8763 71977 93349 47198 49810 66353 6592
7635F592J8849j8764k9258n346K6685L437P884o479K3763N7546M5821K8036k1025
$$ 6592 25441 6677 -22581 -27927 -1242 2195 10079 3600 27363 84909 130730 158766 137741
7622A37741m4430n7447N130n0929k2879M723P2300P567l2493l7954k1216j511
$$ 137741 93311 35864 40994 -9935 -32814 -28091 44209 51776 19283 -18671 -39887 -41398
7610d1398L860K3549k0536l2596k2160K291N3420N9529m3607j8313j3383r822
$$ -41398 -37538 -13989 -34525 -67121 -89281 -86990 -33570 25959 -17648 -35961 -49344 -59166
7598e9166K5391L3560L3878k399M5974L193k9282l0831p7844j8668J2533K0672
$$ -59166 -33775 -215 33663 31264 77238 80431 51149 20318 -57526 -76194 -63661 -42989
7586d2989J8894J8260k312O295k3004J1189J9001L4291J4611l5338p056l6767
$$ -42989 -24095 -5835 -8147 -1852 -24856 -13667 5334 39625 54236 18898 11842 -24925
7574b4925J4031k8961L2058K1815K11L9696L6451l2619j5869k4129j6348k028
$$ -24925 -10894 -39855 -7797 14018 14229 53925 90376 57757 41888 17759 1411 -617
7562f17j7076j0861k3071m4237O337P683M8669K8190j0612j7279J9375k0079o9441
$$ -617 -17693 -28554 -51625 -95862 -89525 -81842 -33173 -4983 -15595 -32874 -13499 -33578 -103019
7549a03019K4025R2378K8603l3321l1215k1502j3205r208O6263P8132M987m707
$$ -103019 -78994 13384 41987 8666 -22549 -44051 -57256 -66464 -201 77931 82918 78211
7537G8211q4372l2835q40N304M567L3656L0506L427M4747J2706k4873n0961L1384
$$ 78211 -6161 -38996 -39836 -34532 -29965 3691 34197 37624 82371 95077 70204 19243 50627
7524E0627k5296p430M686M5310J5914n9893l6866Q105K3737l3099l8159J2216
$$ 50627 25331 17901 22587 67897 83811 23918 -12948 -4843 18894 -14205 -52364 -40148
7512d0148O6166k0072o617k5938m0964O6638M2854k0892j9639L3286M8401K1335
$$ -40148 26018 5946 -671 -26609 -67573 -935 41919 21027 1388 34674 83075 104410
7500A04410O612o9216p3472l354L7913M9231N3619k1249m1700N83L8057k8128
$$ 104410 111022 41806 -31666 -35020 2893 52124 105743 84494 42794 43377 81434 53306
7488E3306o5422m334O417L3973J3254M548k0357o4631m900o323K3810m1111j0225
$$ 53306 -12116 -16450 -10033 23940 37194 41742 21385 -43246 -48146 -54469 -30659 -71770 -81995
7475h1995P0495M4367m6188m4562r49K6573k0388J4721L6678K3424K020k2391
$$ -81995 -11500 32867 -13321 -57883 -58832 -32259 -52647 -37926 -1248 22176 24196 1805
7463A805J4871n6470o402K7620n8571o3770K8616L2414K224K0163J0987N4985
$$ 1805 16676 -39794 -46196 -18576 -77147 -140917 -112301 -79887 -77663 -57500 -46513 8472
7451H472J5136k1103j0602P19O2051j190J9484O672m4903m3325M90j8427N910
$$ 8472 23608 2505 -8097 -7378 54673 53483 72967 79639 34736 -8589 -8099 -26526 -20616
7438b0616L1646k6405l1327M785K0191K8807n278j6568k1990K7579l1598L4297
$$ -20616 11030 -15375 -46702 -41917 -21726 7081 1803 -14765 -36755 -9176 -40774 -6477
7426f477M1907M3997J3305m5479l7800L7839M653o2205O476R696K0376L5183l1538
$$ -6477 35430 79427 92732 47253 9453 47292 51945 -10260 -3784 5912 26288 61471 29933
7413B9933o5298K1515J3611K6808P3458n778l4760n4248m5193j7766K2244N591
$$ 29933 -35365 -13850 -239 26569 100027 94249 59489 5241 -39952 -57718 -35474 -29883
7401b9883k5621l2837K2447M6444J8160p016l378O947O4548m0986l3062J494J5055
$$ -29883 -55504 -88341 -65894 -19450 -1290 -8306 -11684 -4737 59811 18825 -14237 -12743 2312
7388B312L9556o9765q4698l5122K1356M6126J7744l2766L1852N1884k7593m0849
$$ 2312 41868 -27897 -112595 -147717 -126361 -80235 -62491 -95257 -63405 -11521 -39114 -79963
7376g9963J4804J2212L9283J818O251k8955m266K2717l9574J6496J2149j1382
$$ -79963 -65159 -52947 -13664 -11846 -5595 -34550 -38816 -16099 -55673 -39177 -27028 -38410
7364c8410l8487j3330N3348N5586M3091m2882m8033j4262L284K8681J4476L0928
$$ -38410 -76897 -90227 -36879 18707 61798 18916 -29117 -43379 -40095 -11414 3062 33990
7352C3990L085k8360k5597O1259j7990p139k583o762n6480n929L7466j4782K256
$$ 33990 37075 8715 -16882 44377 26387 19248 16665 9903 -46577 -52506 -15040 -29822 -27566
7339b7566P685m1279O2632j8839r1641L8696l4720j9796Q1108L5448N7429k0797
$$ -27566 -19881 -61160 1472 -17367 -109008 -70312 -105032 -124828 -43720 -8272 49157 28360
7327B8360j3289l8577N794j0987R322l860p007P145l1222K1174O4771J0036j1057
$$ 28360 15071 -23506 -17712 -28699 -19377 -23237 -30244 -23099 -54321 -33147 31624 41660 30603
7314C0603L1854L383k905j599Q34n3108m9077m2529K2065M5812K3433n6498J643
$$ 30603 62457 65840 62935 61336 62170 9062 -40015 -82544 -60479 -14667 8766 -47732 -46089
7301d6089M5649j1794L8014J2845p5941j8974j4174j4619M5920N5581L387M895
$$ -46089 -440 -12234 25780 38625 -37316 -56290 -70464 -85083 -39163 16418 19805 24700
7289B4700k3021R06l6707r292M4129n6357p2851J7047L9969J7439l1584L6844
$$ 24700 1679 2585 -34122 -43414 715 -55642 -128493 -111446 -71477 -54038 -85622 -48778
7277d8778N1952L2762j1118l3025j019L7104M6141J1324l3079O068J8988p3869
$$ -48778 3174 35936 24818 -8207 -9226 27878 74019 85343 52264 58332 77320 3451
7265C451l2833P908m0141J5768L4719K0115m9943M1923K7606k7560M648L5183
$$ 3451 -29382 -21474 -61615 -45847 -11128 8987 -40956 967 28573 1013 5661 40844
7253D0844l4862l8256m3464n412M5833J6394M940N2511M2408k5885J0765L1698
$$ 40844 5982 -32274 -75738 -81150 -35317 -18923 -13983 38528 80936 55051 65816 97514
7241I7514k1911m515r992o452m5629k3459l9722J4861L8750J1428J7479J406l4611
$$ 97514 75603 71088 61096 54644 9015 -14444 -54166 -39305 -555 10873 28352 29758 -4853
7228d853j263K6434j9062j865k3084J0238L3336j6465k3521L5217l5637J7584
$$ -4853 -6116 20318 1256 -609 -23693 -13455 19881 3416 -20105 15112 -20525 -2941
7216b941n5247K4373O5125Q777l5662k8639l9889N319m5167l4729n503J387K4450
$$ -2941 -58188 -33815 31310 40087 4425 -24214 -64103 -58784 -103951 -138680 -144183 -142796 -118346
7203a18346M3473J4447k260L5084M6211N050j2148N437o353k7135j6301K3184
$$ -118346 -74873 -60426 -62686 -27602 18609 23659 11511 16948 10595 -16540 -32841 -9657
7191i657M0543K1906N201j9778M1666N4050n9012l8975q910j1912j1803j7213
$$ -9657 30886 52792 57993 38215 79881 133931 74919 35944 27034 15122 3319 -13894
7179a3894q5741J3570L3111N0880K6074J0926j748N961k4461j7260j3981J7922
$$ -13894 -99635 -86065 -52954 -2074 24000 34926 33178 39139 14678 -2582 -16563 1359
7167A359N213k7954j4069K7549P7529O5136K7780q8334m6636K5463L1291m7163
$$ 1359 6572 -21382 -35451 -7902 69627 134763 162543 74209 27573 53036 84327 37164
7155C7164O36J3403j16o7794k651p181o089J1328K2370K3997p324l7414l8024
$$ 37164 37800 51203 51087 -16707 -19358 -26539 -32628 -21300 1070 25067 17743 -19671 -57695
7142e7695K18J4636l2534O048K4688M5358r975M0649q491j3408l1171M1254L6807
$$ -57695 -57477 -42841 -75375 -69327 -44639 719 -9256 31393 22902 9494 -21677 19577 56384
7129E6384m1421m7923j3593M0879K5007R889l364l4165j4538N5743K5436l8852
$$ 56384 14963 -32960 -46553 -5674 19333 29222 25858 -8307 -22845 32898 58334 19482
7117A9482K8592j3996j3532K0471O1213r302l8805l1961n852k1481N1763L879
$$ 19482 48074 34078 20546 41017 102230 92928 54123 22162 16310 -5171 46592 50471
7105E0471q866N7346n7049Q421P8527l4414r5376J1043J1957K100J3674l5090
$$ 50471 41605 98951 41902 50323 128850 94436 -940 10103 22060 24160 37834 2744
7093B744l8575L6848N5986K5561j1262M383m3320l7071l0106L8123K679n945J5113
$$ 2744 -35831 1017 57003 82564 71302 75685 32365 -4706 -34812 3311 5990 45 15158
7080A5158k5903j7892N038L1982l3871N184K156Q90r412l1940J3873l9639M4157
$$ 15158 -10745 -28637 -23599 8383 -25488 -20304 -18148 -17258 -26670 -58610 -44737 -84376 -40219
7067d0219N162j0461M1553N3200l4199k3761K3839Q76J3404q2326k2080O4412
$$ -40219 -35057 -45518 -3965 49235 15036 -8725 15114 15990 29394 -52932 -75012 -10600
7055a0600M6412J9829l0869J8186O5711j5864j0819l2468q8532l2727l370O8292
$$ -10600 35812 55641 24772 42958 108669 92805 81986 49518 -39014 -71741 -75111 -6819
7043f819K8347o4686K7129J3626l6111j4546M3349O0219J7073j5538M4989J1102
$$ -6819 21528 -43158 -16029 -2403 -38514 -53060 -9711 50508 67581 52043 97032 108134
7031A08134l6313l4569L2408o729n0009l6026O8469J0500m8527K392J2822j0383
$$ 108134 71821 37252 69660 62931 12922 -23104 45365 55865 7338 9730 22552 12169
7019A2169k2721J1718O8858o2493p9224J4715L5232O6523M0386k4173q5185k625
$$ 12169 -10552 1166 70024 7531 -71693 -56978 -21746 44777 85163 60990 -24195 -26820
7007b6820l1085m4854N2864M5973j5498k1672L516j3455J2897n0556j76N1149
$$ -26820 -57905 -102759 -49895 -3922 -19420 -41092 -37576 -51031 -38134 -88690 -88866 -37717
6995c7717P9677q545l0446j8901m0135p153K4531P448N2579J0217k3000J6143
$$ -37717 41960 33415 2969 -15932 -56067 -63220 -38689 -31241 21338 31555 8555 24698
6983B4698j1459k9453l3263k560K1089l055r601M0005L0493j7734M580j5274K4178
$$ 24698 13239 -16214 -49477 -52037 -30948 -34003 -43604 -3599 26894 9160 13740 -1534 22644
6970B2644O208R176m3771m234L5874J7024m4960k9843K154L5710j2409m1575P598
$$ 22644 28852 38028 -5743 -9977 25897 42921 -2039 -31882 -29728 5982 -6427 -48002 -40404
6957d0404R3154j067r091r056m3664r589L3373L0908k5817k9742j5396J3588l6830
$$ -40404 52750 51683 42592 33536 -10128 -19717 13656 44564 18747 -10995 -26391 -12803 -49633
6944d9633m4084J0327L2356j6960q728L6707J9812k987O4681o046m1274Q21J759
$$ -49633 -93717 -83390 -51034 -67994 -76722 -40015 -20203 -23190 41491 35445 -5829 -5008 -3249
6931c249j1051j4472J287m036j2995j044k59k2489j0374K377L6441J1338L6032
$$ -3249 -14300 -28772 -27485 -31521 -44516 -45560 -45819 -68308 -78682 -76305 -39864 -28526 7506
6918G506Q688l3612m1759j2105m70O1430N5400P5116j1215m1646O493M690k1683
$$ 7506 16194 -17418 -59177 -71282 -71752 -10322 45078 120194 108979 67333 73826 78516 56833
6905E6833j8055k088m7538j0865o8778l9507L6017O5585M87m1662L3261P9213
$$ 56833 38778 36690 -10848 -21713 -90491 -129998 -93981 -28396 -27909 -69571 -36310 42903
6893D2903L3685m325l9285k2670O026j4026l7606l5286j6737J3002P7457P0429
$$ 42903 76588 72263 32978 10308 16334 2308 -35298 -70584 -87321 -74319 3138 73567
6881G3567l291j8209p347O046k4604K3497n0003n0095j9878M7959K3261m472k1357
$$ 73567 70276 52067 44720 50766 26162 49659 -344 -50439 -70317 -22358 903 -3569 -24926
6868b4926O80k6212K2851N9903K3625L1530J8978k6107J6273n5990j9457j2675
$$ -24926 -24246 -50458 -27607 32296 55921 87451 106429 80322 96595 40605 21148 8473
6856H473j6185L9096P588l591R90k9366J2710n4214k5068p233K2958o559j9464
$$ 8473 -7712 31384 38972 35381 36371 7005 19715 -34499 -59567 -66800 -43842 -50401 -69865
6843f9865m176j3552K2013L7677J5472n5929R924L318j5820K8297K5283P251L0430
$$ -69865 -74041 -87593 -65580 -27903 -12431 -68360 -58436 -55118 -70938 -42641 -17358 -10107 20323
6830B0323R301o0005k2097O0189o129k4812O7816K4860k8634p947j9945L9083
$$ 20323 29624 -30381 -52478 7711 1582 -23230 44586 69446 40812 32865 12920 52003
6818E2003M5870l6727p611l2002p408K7815k935j0908k0710l1007N5251P727k1124
$$ 52003 97873 61146 53535 21533 14125 41940 39005 28097 7387 -23620 31631 39358 18234
6805A8234J0618j8444n4265J068k0255K0337m195o502o473M7246K8963N5680n815
$$ 18234 28852 10408 -43857 -42789 -63044 -42707 -46902 -53404 -59877 -12631 16332 72012 66197
6792F6197l8370L0544k0521q220n762l6366L0611K6557M386J7999l3338j3515
$$ 66197 27827 58371 37850 29630 23868 -12498 18113 44670 49056 67055 33717 20202
6780B0202L2722J7850j2205n2470L9643k0725m8710m1072o5780L5269Q9240L4511
$$ 20202 52924 70774 58569 6099 45742 25017 -23693 -64765 -130545 -95276 -6036 28475
6768B8475m8068m7363J7615j5116j3751k083J7480L5861k2234O630O6999K5252
$$ 28475 -19593 -66956 -49341 -64457 -78208 -80291 -62811 -26950 -49184 -42554 24445 49697
6756D9697m788n2244k0100M151j6262L6930Q2287k2848n1456q972n2419k1634
$$ 49697 44909 -7335 -27435 -23284 -39546 -2616 79671 56823 5367 -3605 -56024 -77658
6744g7658K6739p905L6465O033j6372j4805L9854j6573Q535N1054n27n9420n3896
$$ -77658 -50919 -58824 -22359 -16326 -32698 -47503 -7649 -24222 -15687 35367 34840 -24580 -78476
6731g8476k8893k0434M7930O2744k7503J2880p171K4996M3382j5286j8777l1240
$$ -78476 -107369 -127803 -79873 -17129 -44632 -31752 -38923 -13927 29455 14169 -4608 -35848
6719c5848n0568j463P9080N747o258J9469o1710n1381j5335m42M2310q189k7137
$$ -35848 -86416 -87879 -8799 -3052 -9310 10159 -51551 -102932 -118267 -118709 -76399 -84588 -111725
6706a11725K2697J5494M7007L5322J6457n2910J0233k710N6886l4140n0641L3066
$$ -111725 -89028 -73534 -26527 8795 25252 -27658 -17425 -20135 36751 2611 -48030 -14964
6694a4964l236L201N494O1078N7697n2936r9551r139k0439l6087r517M0281K9056
$$ -14964 -18200 -14999 -9505 51573 109270 56334 -43217 -52356 -72795 -108882 -118399 -78118 -49062
6681d9062K4928J737M41p613k3512j4237k5319K8677N4998j5964P148L2415J6734
$$ -49062 -24134 -22397 -21956 -29569 -53081 -67318 -92637 -63960 -8962 -24926 -17778 14637 31371
6668C1371r350J8668m726n181n515l1309k3418m3378r727K0931N3209K0732o7557
$$ 31371 22021 40689 35963 30782 25267 -6042 -29460 -72838 -82565 -61634 -8425 12307 -55250
6655e5250k9981J2728K0420J8920N8257K1548m8366j8439K5109K1065J6266Q003
$$ -55250 -85231 -72503 -52083 -33163 25094 46642 -1724 -20163 4946 26011 42277 50280
6643E0280L3287n598l9951l0613o2727J0970K0505Q883J6914j0853l5335J9871
$$ 50280 83567 77969 38018 7405 -55322 -44352 -23847 -14964 1950 -8903 -44238 -24367
6631b4367J0463L691K358r047O855q872m2570L601K1107K9555j7443j6521m012
$$ -24367 -13904 -10213 -7855 -16902 -10047 -18919 -61489 -57888 -36781 -7226 -24669 -41190 -45202
6618d5202j286q277N4096L9184j4761J0565k9792j9683j9131o2790K4055M4138
$$ -45202 -46488 -54765 -669 38515 23754 34319 4527 -15156 -34287 -97077 -73022 -28884
6606b8884j9731N7908J4917L633L6366j8227J683J5540n942J4787J5448q2734
$$ -28884 -48615 9293 24210 27843 64209 45982 47665 63205 57263 72050 87498 4764
6594D764j7135N1323J9789j4597k80k9146p720P0181L3908N358N380m6505o2559
$$ 4764 -12371 38952 58741 44144 43864 14718 6998 77179 111087 116445 121825 75320 12761
6581A2761k606O8374O6154k0439k1658K1963k5054o6812o1675q546j1589k2900
$$ 12761 10155 78529 144683 124244 102586 124549 99495 32683 -28992 -37538 -49127 -72027
6569g2027L1724k013L0841K2022l7042Q134L0893j0930m0648m1183N074L4893
$$ -72027 -40303 -42316 -11475 10547 -26495 -18361 12532 1602 -39046 -80229 -75155 -40262
6557d0262N0566L6861K4756j8435N604q0451J5266N7913N1264m635l6923m6469
$$ -40262 10304 47165 71921 53486 59090 -21361 -6095 51818 103082 98447 61524 15055
6545A5055l3032j8434n4830L7234K2372M2862M5527R652j06990m8106M8330M1002
$$ 15055 -17977 -36411 -91241 -54007 -31635 11227 56754 66406 -40584 -88690 -40360 642
6533F42L0392J6640R365k4631l2781n1856j4514K3684j833K7788m043L551J29
$$ 642 31034 47674 57039 32408 -373 -52229 -66743 -43059 -44892 -17104 -21147 -17596 -17467
6520a7467J0385m998l1704L3673J4851j6212k441m923M5146L6272n0609o9447
$$ -17467 -7082 -12080 -43784 -10111 4740 -11472 -13913 -18836 26310 62582 11973 -57474
6508e7474M656K6072N0460O8854k7784m7493o829l3715K5336M5509m2016o2574
$$ -57474 -52818 -26746 23714 92568 64784 17291 10462 -23253 2083 47592 5576 -56998
6496e6998J9124L7481n241l0948l5615J8226K8305L0487k635K6831J721r240Q922
$$ -56998 -37874 -393 -5634 -36582 -72197 -53971 -25666 4821 2186 29017 30738 21498 30420
6483C0420K353L5478J8553J293l7234K8899l4607l5871M910n544Q254n7966j2816
$$ 30420 32773 68251 86804 88097 50863 79762 45155 9284 14194 8650 16904 -41062 -53878
6470e3878M8618P187M245J7235k0767l4058j2616N5763o698k833P541L5187N900
$$ -53878 -5260 1927 6172 23407 2640 -31418 -44034 11729 5031 2198 9739 44926 50826
6457E0826L7240k793l678j7733o0234m4177j1473K3823k3973o573J2610K8345
$$ 50826 88066 85273 81595 63862 3628 -40549 -52022 -28199 -52172 -58745 -46135 -17790
6445a7790K9530j6947m0840J1936K5788o5686p109M8536R871L9022P357L2543
$$ -17790 11740 -5207 -46047 -34111 -8323 -74009 -81118 -32582 -22711 16311 23668 56211
6433E6211L0020J114p1027k1201L7548l8506l7576K4216J6689j8535l3848l8153
$$ 56211 86231 87345 16318 -4883 32665 -5841 -43417 -19201 -2512 -21047 -54895 -93048
6421i3048J7215N6282m4685n334K8296N9906L9965l0240k9435l9794j0092O219
$$ -93048 -75833 -19551 -64236 -69570 -41274 18632 58597 28357 -1078 -40872 -50964 -44745
6409d4745Q619J9765O9883K6212k6393m6433K19K7757l7400N2147J7299k7073
$$ -44745 -36126 -16361 53522 79734 53341 6908 7127 34884 -2516 49631 66930 39857
6397C9857l4907K692M1026k2170l1147k8369P681J0356J7338J6125l2054p267
$$ 39857 4950 7642 48668 26498 -4649 -33018 -25337 -14981 2357 18482 -13572 -20839
6385b0839K0539J398j2360L246l1548J3556J3922m3194J6215k2566J8467K8290
$$ -20839 -300 1098 -11262 -8016 -39564 -26008 -12086 -55280 -39065 -61631 -43164 -14874
6373a4874P9104R806m4436j5338j0824l6661J411k0992J7879M7808N9708k8778
$$ -14874 64230 74036 29600 14262 3438 -33223 -31812 -52804 -34925 12883 72591 43813
6361D3813j6965P193m475J9309K8664J5061K8003J7006J5752j441n0725m5940
$$ 43813 26848 34041 29566 48875 77539 92600 120603 137609 153361 151920 101195 55255
6349E5255l9149l9268m459m8806j467N019L4565j1992K8784L1963N0717K9371
$$ 55255 16106 -23162 -27621 -76427 -77894 -72875 -38310 -50302 -21518 10445 61162 90533
6337I0533J8200k9523l2893n8094K6323J2439l6677m1541J3137P2037k1606n0422
$$ 90533 108733 79210 46317 -11777 14546 26985 -9692 -51233 -38096 33941 12335 -38087
6325c8087k0258L1739J2814M0484J3113k0960K601j9008L5561m1653k537l2815
$$ -38087 -58345 -26606 -13792 26692 39805 18845 21446 2438 37999 -3654 -6191 -39006
6313c9006l2315J0262K7897O0999l1718m0341K7513K6577q274J3877J6074m902
$$ -39006 -71321 -61059 -33162 27837 -3881 -44222 -16709 9868 1594 15471 31545 26643
6301B6643K1063l633Q6079K0333n4046q5355k3665M907J5739o3969l2571M2574
$$ 26643 47706 44073 130152 150485 96439 11084 -12581 -7674 8065 -55904 -88475 -45901
6289d5901K8248J1830j5008J6319L1638K8410K5126m5647K5096m3809m4027K4649
$$ -45901 -17653 -5823 -20831 -4512 27126 55536 80662 35015 60111 16302 -27725 -3076
6277c076N2708J2722o8330k5420M2927P137m0138j5800j8050M0202j6574o6323
$$ -3076 49632 62354 -5976 -31396 11531 18668 -21470 -37270 -55320 -15118 -31692 -98015
6265i8015O0416N3079j2158k1192J9915L1656k3877o5741L341L7274J3816J9536
$$ -98015 -37599 15480 3322 -17870 2045 33701 9824 -55917 -52576 -15302 -1486 18050
6253A8050M9323k656q6425l8687J0052L7587j1120k249R573j2477n008j0125J4605
$$ 18050 67373 64717 -21708 -60395 -50343 -12756 -23876 -26125 -16552 -29029 -34037 -44162 -29557
6240b9557P758o1456M2152J4075j1396j6152O3309Q010P598R821k4310l9124M3237
$$ -29557 -21799 -83255 -41103 -27028 -38424 -54576 8733 16743 24341 34162 9852 -29272 13965
6227A3965K8291J0767k7370k9900l5174l6753K3072L4312j1208n0220J7661M2312
$$ 13965 42256 53023 25653 -4247 -39421 -76174 -53102 -18790 -29998 -80218 -62557 -20245
6215b0245K0987m393n1049K0244N5765k5219l9538l1280j1395j561P5215L8884
$$ -20245 742 -3651 -54700 -34456 21309 -3910 -43448 -74728 -86123 -87684 -12469 26415
6203B6415k9105k96M7723O584k4260l3579L064L57m978J1780J3881k1775R136
$$ 26415 -2690 -2986 44737 51321 27061 -6518 -3454 -3097 -8075 3705 17586 -4189 4947
6190D947J1001j7530p7169l3272M8719J09856Q8460J9344p8471p601O2006J7809
$$ 4947 15948 -1582 -78751 -112023 -63304 46552 135012 154356 75885 68284 130290 148099
6178A48099k3177o0403l1517O690J3946J5651l8763j3452J3953M2785j7969k2871
$$ 148099 124922 64519 33002 39692 53638 69289 30526 17074 31027 73812 55843 32972
6166C2972K5372n8096L675p00M010K7109P2418P623j8543p3037j6366p636K3838
$$ 32972 58344 248 3923 3223 7233 34342 106760 114383 95840 22803 6437 -1199 22639
6153B2639R077m423k5679q303m0704k5841k5019O969l1250j1595N4028N0249j0306
$$ 22639 31716 27293 1614 -6689 -47393 -73234 -98253 -91284 -122534 -134129 -80101 -29852 -40158
6140d0158k8063L3646K159l8560K6946J5477l343k4261J5536L8172J3073j6656
$$ -40158 -68221 -34575 -32416 -70976 -44030 -28553 -31896 -56157 -40621 -2449 10624 -6032
6128f032P415k6792l292K9052k7777j0005L4866K0296j6275o0970k0068R862k7356
$$ -6032 1383 -25409 -28701 351 -27426 -37431 -2565 17731 1456 -59514 -79582 -69720 -97076
6115i7076J7996Q8018j206Q676K1711L4899r336j8753m3219k0299J2127K875L0182
$$ -97076 -79080 8938 7732 16408 38119 73018 63682 44929 1710 -18589 -6462 -3587 26595
6102B6595M2191k3879P948M2457m4013P198k7604j4298k9524J5340J3905j519
$$ 26595 68786 44907 52855 95312 51299 58497 30893 16595 -12929 2411 16316 14797
6090A4797j5414k7681j0699M2131j3525K0512m4503m3174L4894L1315J5584K2031
$$ 14797 -617 -28298 -38997 3134 -10391 10121 -34382 -77556 -42662 -11347 4237 26268
6078B6268M8891k4032k5073j2312J129L6561j527J8488k7673n941p35J254l0464
$$ 26268 75159 51127 26054 13742 14871 51432 49905 68393 40720 34779 34044 35298 4834
6065D834l4957l2915L2746j5895p427L9478O4756O9521m0603l3912n4210k7292
$$ 4834 -30123 -63038 -30292 -46187 -53614 -14136 50620 120141 79538 45626 -8584 -35876
6053c5876k7503M0272J8232J685L5674k5148m802N601k2303K7689k3048p2456
$$ -35876 -63379 -23107 -4875 -3190 32484 7336 2534 8135 -14168 13521 -9527 -81983
6041h1983l8030J0073J5859R793j0574m314K5744M0970N1536L2423j153M4560
$$ -81983 -120013 -109940 -94081 -84288 -94862 -99176 -73432 -32462 19074 51497 50344 94904
6029I4904L335j9742j4637o3005J960P6131l453l2208m6110L5673o693k5808M0966
$$ 94904 98239 78497 63860 855 2815 78946 75493 43285 -2825 32848 26155 347 41313
6016D1313j1404m9391j7054L3321K356k4241m3589m5691N5168M2473l2692l4577
$$ 41313 29909 -19482 -36536 -3215 -859 -25100 -68689 -114380 -59212 -16739 -49431 -84008
6004h4008K3778L5732O7249L9339k417P484j2378l6173n2767L371j0525o788K8357
$$ -84008 -60230 -24498 42751 82090 79673 87157 74779 38606 -14161 -10790 -21315 -28103 254
5991B54l0995l3401K399J1384K4436K935J7004Q477k6634r906q109N360L9796
$$ 254 -30741 -64142 -61743 -50359 -25923 -22988 -5984 2493 -24141 -34047 -42156 -36796 3000
5978C000J8067j3748l2044J0788j2620r505L699j1872K3123J1438k7721L9046
$$ 3000 21067 7319 -24725 -13937 -26557 -36062 -32363 -44235 -21112 -9674 -37395 1651
5966A651O0935J3078n1876j8147k0767k8902k6118L3173J4096K807n7016Q296
$$ 1651 62586 75664 23788 5641 -15126 -44028 -70146 -36973 -22877 -20070 -77086 -68790
5954f8790M5784K9455M1865j5938j7808K1140k1857l399O0211J1728o1459m5970
$$ -68790 -23006 6449 48314 32376 14568 35708 13851 10452 70663 82391 20932 -25038
5942b5038N622q210M0817L1809K7226l2586o7772m5011P637N008m959k5981q332
$$ -25038 -19416 -27626 13191 45000 72226 39640 -28132 -73143 -65506 -60498 -65457 -91438 -99770
5929i9770o021K2814K2387p763L4268N7693k4951q2532K3526L5962Q2520j5468
$$ -99770 -105791 -82977 -60590 -68353 -34085 23608 -1343 -83875 -60349 -24387 58133 42665
5917D2665o4608j2391j5309l3459k471M0638L9381r887k2653k6786J9748j9908
$$ 42665 -21943 -34334 -49643 -83102 -85573 -44935 -5554 -15441 -38094 -64880 -45132 -65040
5905f5040j2640N8644K215O495L6500k0861N973L9481j9420J34k1005l3392N375
$$ -65040 -77680 -19036 -16821 -10326 26174 5313 11286 50767 31347 31481 10476 -22916 -17541
5892a7541M2803L1077m1515n2447N3878N7254J8947n4159J4703L6686n0389k4547
$$ -17541 25262 56339 14824 -37623 16255 73509 92456 38297 53000 89686 39297 14750
5880A4750L7624P931n6857K3390K6902m5062l85R787K6832p9864p1225L6286K4074
$$ 14750 52374 60305 3448 26838 53740 8678 8293 18080 44912 -34952 -106177 -69891 -45817
5867d5817l302j0772j8209L402N7099J0072n0595K042o9850m5444O1510M933j2675
$$ -45817 -49119 -59891 -78100 -74698 -17599 -7527 -58122 -56080 -125930 -171374 -109864 -104931 -117606
5854a17606N9921Q8950l49K2910L907q246j1576k8447j7445j6324M9427N6337
$$ -117606 -57685 31265 30916 53826 57733 49487 37911 9464 -7981 -24305 25122 81459
5842H1459J0011L2411j1458j660k1756m068l0708J4675R265j3193k4712L1912
$$ 81459 91470 123881 112423 110763 89007 84939 54231 68906 78171 64978 40266 72178
5830G2178L0133k1277n1933j3568j0001j9428J4850K7812N434p2986L27K2549
$$ 72178 102311 81034 29101 15533 5532 -13896 954 28766 34200 -38786 -38459 -15910
5818a5910n238k7000j6169M0195O789L7063K5647P121o482O2726k1583l5468J8545
$$ -15910 -21148 -48148 -64317 -24122 -17333 19730 45377 52498 46016 108742 87159 51691 70236
5805G0236J0428m8111l9989q0176K784L4499K1480l9O159K0363J8099j2418p5878
$$ 70236 80664 32553 -7436 -87612 -84828 -50329 -28849 -28888 -22729 -2366 15733 3315 -72563
5792g2563k6534J6738j6392m4125N428L5067J6366q225j2694K2291K6811l0931
$$ -72563 -99097 -82359 -98751 -142876 -137448 -102381 -86015 -94240 -106934 -84643 -57832 -88763
5780h8763J4233P8412j7524p1235m5729J4437K4220N8680L4667L2160M908q184
$$ -88763 -74530 3882 -13642 -84877 -130606 -116169 -91949 -33269 1398 33558 38466 30282
5768C0282N1974j8743o3721k6549K1047J6539l6213m7353J717K5507j8311n081
$$ 30282 82256 63513 -208 -26757 -5710 10829 -25384 -72737 -71020 -45513 -63824 -68905
5756f8905L1732L8220k7467n975J6364J0407L029l6657J361k2094n827l5963L5070
$$ -68905 -37173 1047 -26420 -32395 -16031 -5624 -2595 -39252 -37891 -59985 -65812 -101775 -66705
5743f6705M7364L5992P9870m2335o6745k7296K496j7182O8847r828n2510k147
$$ -66705 -19341 16651 96521 54186 -12559 -39855 -37359 -54541 14306 4478 -48032 -50179
5731e0179N834J2742M2659K6485q2805k4633J8800O9262j1344M623o898Q934M0429
$$ -50179 -44345 -31603 11056 37541 -45264 -69897 -51097 18165 6821 11444 4546 13480 53909
5718E3909J8695J3278k7073n2669j4518J3421k331P320j5273m3057m7738K3062
$$ 53909 72604 85882 58809 6140 -8378 5043 2712 10032 -5241 -48298 -96036 -72974
5706g2974R4756Q877J4061R316j62l8429k0495j890M835K6557L4318N072R854
$$ -72974 21782 30659 44720 54036 53874 15445 -5050 -6940 -2105 24452 58770 63842 73696
5693G3696o6052J3345j6187K1280N2386k6629L813j3579J9002l5115o837L5839
$$ 73696 7644 20989 4802 26082 78468 51839 55652 42073 61075 25960 19123 54962
5681E4962M710m6719n0917j6683k1956j30M1098O3761k6363P12J3364j6683k0305
$$ 54962 59672 12953 -37964 -54647 -76603 -76733 -35635 28126 1763 2475 15839 -844 -21149
5668b1149P723l7946j9619R138O5102R454k8752l323l4103L9804j773k5149l4488
$$ -21149 -13426 -51372 -70991 -61853 3249 12703 -16049 -19372 -53475 -13671 -15444 -40593 -75081
5655g5081P793M3530P3240k0865l757J3656J9183j6218j7694L579L130j1002L5635
$$ -75081 -67288 -23758 49482 28617 24860 38516 57699 41481 23787 27366 30496 19494 55129
5642E5129n915J5626j0843p690n004k4446j9323o488r987M0119k0417m2525l3021
$$ 55129 49214 64840 53997 46307 41303 16857 -2466 -8954 -18941 21178 761 -41764 -74785
5629g4785N0735J1337J9142M0405O10L395k7708j1032K826j5648l879j99q343
$$ -74785 -24050 -12713 6429 46834 47444 50839 23131 12099 14925 -723 -4602 -4801 -13144
5616a3144m5087M9360K2455o7374m5205K797P7832K8034n6146l2714N3004K6365
$$ -13144 -58231 -8871 13584 -53790 -98995 -96198 -18366 9668 -46478 -79192 -26188 177
5604A77O137n157N1144j3572L909j1277k3682k8474L5837J1145K1532j213n6018
$$ 177 6314 1157 52301 38729 42638 31361 7679 -20795 15042 26187 47719 46506 -9512
5591i512M509K8368L1514q553p921p5457o4935P890K6058M4024Q40O6046L1000
$$ -9512 -5003 23365 54879 46326 38405 -37052 -101987 -94097 -68039 -24015 -23175 42871 73871
5578G3871q0690J4009o412l2533k8065L4284J7579J5538j3453m2918m552M5680
$$ 73871 -6819 7190 778 -31755 -59820 -25536 -7957 7581 -5872 -48790 -53342 -7662
5566g662N0390p949q7797J2784O0020L5687m7477K5433m053r705K0802K1637j3959
$$ -7662 42728 34779 -53018 -40234 19786 55473 7996 33429 29376 19671 40473 62110 48151
5553D8151r3612l826r031K0024N3169k2918L1420K3919j8199M978K6237L4258
$$ 48151 -45461 -49287 -58318 -38294 14875 -8043 23377 47296 29097 34075 60312 94570
5541I4570O987q0721n8199K3787L6395j0343K9937J4665k707Q431J1613r219Q727
$$ 94570 101557 20836 -37363 -13576 22819 12476 42413 57078 54371 62802 74415 65196 73923
5528G3923j6529j6738L4450j2654j4045l7246m4229n863J6203L2011l4394l9287
$$ 73923 57394 40656 75106 62452 48407 11161 -33068 -38931 -22728 9283 -25111 -64398
5516f4398N0353J7805q428L222k8394M770K1973m0576n4301O8157L0750j1877
$$ -64398 -14045 3760 -4668 -1446 -29840 -25070 -3097 -43673 -97974 -29817 933 -10944
5504a0944l1995K3705K2136R466K0690M5966K7972k7459l9153l7453N684K481
$$ -10944 -42939 -19234 2902 12368 33058 79024 106996 79537 40384 2931 8615 11096
5492A1096O5140O784l8353j4531r783K179n6981K994M5494P225J3072K5469O784
$$ 11096 76236 83020 44667 30136 20353 22532 -34449 -31455 14039 21264 34336 59805 66589
5479F6589N9646j2138m7513n2724O754k3441n5188m685K2770O7355M293k504p936
$$ 66589 126235 114097 66584 13860 20614 -2827 -58015 -62700 -39930 27425 31718 29214 21278
5466B1278k1110K0256N424N0778M524J2692l0865l2488J6742k2873l166J4284
$$ 21278 168 20424 25848 76626 81150 93842 62977 30489 47231 24358 21192 35476
5454C5476m4800m832j2121O577Q3649R8879K0928o4005q8796q6502O0254L8319
$$ 35476 -9324 -14156 -26277 -19700 63949 162828 183756 119751 30955 -55547 4707 43026
5442D3026m5177j5181P9190N0338j8263m4208l7049L3179k9006J3309L4972M1343
$$ 43026 -2151 -17332 61858 112196 93933 49725 12676 45855 16849 30158 65130 106473
5430A06473p8654k0098K9327J1530m653J5596P285O452k8888j2196m8674n6921
$$ 106473 27819 7721 37048 48578 43925 59521 66806 73258 44370 32174 -16500 -73421
5418g3421M1369L5441M3056O121m1696k1663L6510L5617k5245m626N6776O145
$$ -73421 -32052 3389 46445 52566 10870 -10793 25717 61334 36089 31463 88239 94384
5406I4384m539o4917o6266K789m15j2995o6287K9372L2452K5154J2742l243k227
$$ 94384 89845 24928 -41338 -38549 -38964 -51959 -118246 -88874 -56422 -31268 -18526 -21769 -23996
5393b3996j508p389K6336L6135K4719K4223m8303k6129K1435J4720k6774o0982
$$ -23996 -25504 -32893 -6557 29578 54297 78520 30217 4088 25523 40243 13469 -47513
5381d7513L7684J4852l928r601P2543L822l0659k5743j1940m4955l3656L7832
$$ -47513 -9829 5023 1095 -8506 64037 67859 37200 11457 -483 -45438 -79094 -41262
5369d1262R389K8132M6766N9981p4439o6008M132N9242l536m8200L8908N6894
$$ -41262 -31873 -3741 43025 103006 28567 -37441 -33309 25933 22397 -25803 13105 69999
5357F9999L1758k5995m3816K2137K0897l441p7460J0884M5329k4085K8461k0925
$$ 69999 101757 75762 31946 54083 74980 71539 -5921 4963 50292 26207 54668 33743
5345C3743N991k4169p125M4549L3155M0927J8054n7030n4419l0704o9643j1089
$$ 33743 39734 15565 8440 52989 86144 127071 145125 88095 33676 2972 -66671 -77760
5333g7760Q1000M3625K5472j1226l4743J412K4950O691l292n1077L074J550j4266
$$ -77760 3240 46865 72337 61111 26368 27780 52730 59421 56129 5052 8126 9676 -4590
5320d590N170j1774J7351L176r202J0395k8177m1329M7577k6436k1580N5331O1736
$$ -4590 580 -11194 6157 9333 131 10526 -17651 -58980 -11403 -37839 -59419 -4088 57648
5307E7648j0075L5582k8650j5086j1005k2885p1217l5488M9487J9853N8629M4645
$$ 57648 47573 83155 54505 39419 28414 5529 -65688 -101176 -51689 -31836 26793 71438
5295G1438m3417n9654k3011J7485j317K8749M0278p8553n0230O473J4691J8921
$$ 71438 28021 -31633 -54644 -37159 -38476 -9727 30551 -48002 -98232 -91759 -77068 -58147
5283e8147P3370O4830k7359l5172J306K5867k0638n2523j6611j6776M4407M8057
$$ -58147 15223 80053 52694 17522 18828 44695 24057 -28466 -45077 -61853 -17446 30611
5271C0611n117M923O145r163K3626L0751j8394l8156R156k5816j6421J3411Q041
$$ 30611 25494 30417 36562 27399 51025 81776 63382 25226 34382 8566 -7855 5556 13597
5258A3597J6535M751P620k1645n3478j5743K9047k2053l1842K4640O8390O668
$$ 13597 30132 34883 42503 20858 -32620 -48363 -19316 -41369 -73211 -48571 19819 26487
5246B6487l2148K1308J6129n1112l5072j8533L8816M1914J6940j1913m5838j8358
$$ 26487 -5661 15647 31776 -19336 -54408 -72941 -34125 7789 24729 12816 -33022 -51380
5234e1380M7674L5695j9731j2122j7527Q96p567N9316K3640j8644k5000R343L9614
$$ -51380 -3706 31989 12258 136 -17391 -16495 -24062 35254 58894 40250 15250 24593 64207
5221F4207k5382j5558k1026J5785P454J815m5122j5598K6664N0511J551j9958
$$ 64207 38825 23267 2241 18026 25480 27295 -17827 -33425 -6761 43750 45301 25343
5209B5343l7352k3515j7718L7191M3046P601m3676k6557j2348M7120L577K621
$$ 25343 -12009 -35524 -53242 -16051 26995 34596 -9080 -35637 -47985 -865 2712 5333
5197E333J7365p617Q270M6506j0779j3654m2813L4249L534l7649j7212l884K7665
$$ 5333 22698 15081 23351 69857 59078 45424 2611 36860 40394 2745 -14467 -18351 9314
5184I314J3010j631r314l9228J387N517q129j0337O913M171J00791M2659r524
$$ 9314 22324 20693 11379 -27849 -26462 -20945 -29074 -39411 -32498 -28327 72464 115123 105599
$$ [...]
##END NTUPLES=NMR SPECTRUM
##END=
