##TITLE=Analysis number 146719
Compound Code ac 11666
Book Reference 146719
Project Code qc-fl
Chemist Name jom
##JCAMPDX= 6.0         $$ Bruker NMR JCAMP-DX V2.0
##DATA TYPE= NMR SPECTRUM
##DATA CLASS= NTUPLES
##ORIGIN= Bruker BioSpin GmbH
##OWNER= nmr
$$ XWIN-NMR		Version 3.5
$$ Tue Apr 10 09:37:53 2007 GMT Daylight Time (UT+1h)  MAYBRIDGE\nmr@NMR_250MHZ
##.OBSERVE FREQUENCY= 250.131544655141
##.OBSERVE NUCLEUS= ^1H
##.ACQUISITION MODE= SIMULTANEOUS (DQD)
##.ACQUISITION SCHEME= undefined
##.AVERAGES= 16
##.DIGITISER RES= 18
##SPECTROMETER/DATA SYSTEM= dpx250
##.PULSE SEQUENCE= zg30
##.SOLVENT NAME= CDCl3
##.SHIFT REFERENCE= (INTERNAL, CDCl3, 0, 16.522)
##AUDIT TRAIL= $$ (NUMBER, WHEN, WHO, WHERE, WHAT)
$$ ##TITLE= Audit trail, XWIN-NMR		Version 3.5
$$ ##JCAMPDX= 5.01
$$ ##ORIGIN= Bruker BioSpin GmbH
$$ ##OWNER= nmr
$$ C:\u/data/dgb/nmr/ADRS/700/pdata/1/auditp.txt
$$ ##AUDIT TRAIL=  $$ (NUMBER, WHEN, WHO, WHERE, WHAT)
(   1,<2007-04-10 09:37:27.20 +100>,<MAYBRIDGE\nmr>,<NMR_250MHZ>,
      <created by zg, POWCHK disabled, PULCHK disabled
       configuration hash MD5:
       49 4B E0 1D 92 C2 6B 37 9F E6 65 BC 52 41 86 1D
       data hash MD5: 64K
       16 9A C7 E3 F3 C5 3C D9 64 9A A8 3D B1 F0 BA 6E>)
(   2,<2007-04-10 09:37:44.03 +100>,<MAYBRIDGE\nmr>,<NMR_250MHZ>,
      <Start of raw data processing
       ef LB = 0.3 FT_mod = 6 PKNL = 1 SI = 32K 
       data hash MD5: 32K
       75 10 47 6C 81 08 C8 92 79 89 EC D8 9A 3A 22 78>)
(   3,<2007-04-10 09:37:46.38 +100>,<MAYBRIDGE\nmr>,<NMR_250MHZ>,
      <apk 
       data hash MD5: 32K
       B6 ED 56 EC B5 43 64 5D 2F 32 0F 74 6B E7 EB 6B>)
(   4,<2007-04-10 09:37:47.18 +100>,<MAYBRIDGE\nmr>,<NMR_250MHZ>,
      <abs ABSG = 5 
       data hash MD5: 32K
       2D 98 24 F5 C5 BE 8D AD 66 20 DB EF E9 84 A9 4D>)
$$ ##END=
$$ 
$$ hash MD5
$$ 2E E8 D0 0E 1C E2 A7 BB D6 EB 8F 5F 65 FE BA 1B
##$RELAX= 
##$RELAX= 
##$RELAX= 
##$RELAX= 
##$RELAX= 
##$RELAX= 
##$RELAX= 
$$ Bruker specific parameters
$$ --------------------------
##$DU= <C:\u>
##$EXPNO= 700
##$NAME= <ADRS>
##$PROCNO= 1
##$TYPE= <nmr>
##$USER= <dgb>
##$AMP= (0..31)
100 100 100 100 100 100 100 100 100 100 100 100 100 100 100 100 100 100 
100 100 100 100 100 100 100 100 100 100 100 100 100 100 
##$AQSEQ= 0
##$AQ_mod= 3
##$AUNM= <au_zg>
##$AUTOPOS= <7 >
##$BF1= 250.13
##$BF2= 250.13
##$BF3= 250.13
##$BF4= 250.13
##$BF5= 500.13
##$BF6= 500.13
##$BF7= 500.13
##$BF8= 500.13
##$BYTORDA= 1
##$CFDGTYP= 0
##$CFRGTYP= 5
##$CHEMSTR= <none>
##$CNST= (0..31)
1 1 145 1 1 1 1 1 1 1 1 1 1 1 1 1 1 1 1 1 1 1 1 1 1 1 1 1 1 1 1 1 
##$CPDPRG= <>
##$CPDPRG1= <>
##$CPDPRG2= <>
##$CPDPRG3= <>
##$CPDPRG4= <mlev>
##$CPDPRG5= <mlev>
##$CPDPRG6= <mlev>
##$CPDPRG7= <mlev>
##$CPDPRG8= <mlev>
##$CPDPRGB= <>
##$CPDPRGT= <>
##$D= (0..31)
0 1 0 0 0 0 0 0 0 0.06 0 0 0 0 0 0 0.0002 0 0 0 0 0 0 0 0 0 0 0 0 0 0 
0 
##$DATE= 1176194246
##$DBL= (0..7)
120 120 120 120 120 120 120 120 
##$DBP= (0..7)
150 150 150 150 150 150 150 150 
##$DBP07= 0
##$DBPNAM0= <>
##$DBPNAM1= <>
$$ [...]
##$SUBNAM7= <"">
##$SUBNAM8= <"">
##$SUBNAM9= <"">
##$SW= 20.6930455092707
##$SWIBOX= (0..15)
0 0 3 0 0 0 0 0 0 0 0 0 0 0 0 0 
##$SW_h= 5175.983436853
##$TD= 65536
##$TD0= 1
##$TE= 683.16
##$TE2= 300
##$TE3= 300
##$TEG= 300
##$TL= (0..7)
0 120 120 120 120 120 120 120 
##$TP= (0..7)
150 150 150 150 150 150 150 150 
##$TP07= 0
##$TPNAME0= <>
##$TPNAME1= <>
##$TPNAME2= <>
##$TPNAME3= <>
##$TPNAME4= <>
##$TPNAME5= <>
##$TPNAME6= <>
##$TPNAME7= <>
##$TPOAL= (0..7)
0.5 0.5 0.5 0.5 0.5 0.5 0.5 0.5 
##$TPOFFS= (0..7)
0 0 0 0 0 0 0 0 
##$TUNHIN= 0
##$TUNHOUT= 0
##$TUNXOUT= 0
##$USERA1= <user>
##$USERA2= <user>
##$USERA3= <user>
##$USERA4= <user>
##$USERA5= <user>
##$V9= 5
##$VALIST= <valist>
##$VCLIST= <CCCCCCCCCCCCCCC>
##$VD= 0
##$VDLIST= <DDDDDDDDDDDDDDD>
##$VPLIST= <PPPPPPPPPPPPPPP>
##$VTLIST= <TTTTTTTTTTTTTTT>
##$WBST= 1024
##$WBSW= 4
##$XGAIN= (0..3)
0 0 0 0 
##$XL= 0
##$YL= 0
##$YMAX_a= 572283
##$YMIN_a= -652133
##$ZGOPTNS= <>
##$ZL1= 120
##$ZL2= 120
##$ZL3= 120
##$ZL4= 120
##$ABSF1= 16.522
##$ABSF2= -4.171173
##$ABSG= 5
##$ABSL= 3
##$ALPHA= 0
##$AQORDER= 0
##$ASSFAC= 0
##$ASSFACI= 0
##$ASSFACX= 0
##$ASSWID= 0
##$AUNMP= <proc_1d>
##$AZFE= 0.1
##$AZFW= 0.1
##$BCFW= 0
##$BC_mod= 0
##$BYTORDP= 0
##$COROFFS= 0
##$CY= 12.5
##$DATMOD= 1
##$DC= 0
##$DFILT= <>
##$DTYPP= 0
##$F1P= 14.0000005364418
##$F2P= -0.99999901652339
##$FCOR= 0.5
##$FTSIZE= 32768
##$FT_mod= 6
##$GAMMA= 0
##$GB= 0
##$INTBC= 1
##$INTSCL= 1
##$ISEN= 128
##$LB= 0.3
##$LEV0= 0
##$LPBIN= 0
##$MAXI= 10000
##$MC2= 0
##$MEAN= 0
##$ME_mod= 0
##$MI= 0
##$NCOEF= 0
##$NC_proc= -3
##$NLEV= 6
##$NOISF1= 0
##$NOISF2= 0
##$NSP= 0
##$NTH_PI= 0
##$NZP= 0
##$OFFSET= 16.522
##$PC= 1
##$PHC0= 259.0094
##$PHC1= -32.37388
##$PH_mod= 1
##$PKNL= yes
##$PPARMOD= 0
##$PSCAL= 4
##$PSIGN= 0
##$REVERSE= no
##$SF= 250.13
##$SI= 32768
##$SIGF1= 0
##$SIGF2= 0
##$SINO= 400
##$SIOLD= 32768
##$SREGLST= <1H.CDCl3>
##$SSB= 0
##$STSI= 32768
##$STSR= 0
##$SW_p= 5175.98343685301
##$SYMM= 0
##$S_DEV= 0
##$TDeff= 65536
##$TDoff= 0
##$TI= <Analysis number 999999
Compound Code 99
Book Reference 9
Project Code 9>
##$TILT= no
##$TM1= 0
##$TM2= 0
##$TOPLEV= 0
##$USERP1= <user>
##$USERP2= <user>
##$USERP3= <user>
##$USERP4= <user>
##$USERP5= <user>
##$WDW= 1
##$XDIM= 32768
##$YMAX_p= 498066996
##$YMIN_p= -344875
$$ End of Bruker specific parameters
$$ ---------------------------------
##NTUPLES= NMR SPECTRUM
##VAR_NAME=  FREQUENCY,     SPECTRUM/REAL,   SPECTRUM/IMAG
##SYMBOL=    X,             R,               I
##VAR_TYPE=  INDEPENDENT,   DEPENDENT,       DEPENDENT
##VAR_FORM=  AFFN,          ASDF,            ASDF
##VAR_DIM=   32768,         32768,           32768
##UNITS=     HZ,            ARBITRARY UNITS, ARBITRARY UNITS
##FACTOR=    0.157963299565203, 1,           1
##FIRST=     4132.6476996994, 0,             0
##LAST=      -1043.33573715361, 0,           0
##MIN=       -1043.33573715361, -344875,     0
##MAX=       4132.6476996994, 498066996,     0
$$ Real data points
##PAGE= N=1
##DATA TABLE= (X++(R..R)), XYDATA
$$ [...]
$$ plain form
13863 -6061 56 -12217 -24316 -22456 -12890 -3970 -2648 -2420 -8919 -17715 -24782 -19265 -7294 5247
13849 5247 3352 -8624 -3487 14073 862 -12038 -17191 -22739 -31263 -40722 -46104 -37353 -35828 -42996
13835 -42996 -29417 -13672 5299 3308 -10783 -13585 -11561 -10969 -23287 -21318 -10968 -6537 -16091
13822 -16091 -21013 -33887 -40830 -41977 -35187 -18288 -23109 -26085 -24429 -34483 -38312 -31461 -28328 -36879
13808 -36879 -45717 -47650 -47118 -45845 -44395 -28603 -15720 -22331 -19292 -28078 -38505 -43661 -48057 -45684
13794 -45684 -50100 -43807 -26788 -12978 -15410 -14812 -35829 -28700 -10022 -1486 -18185 -34256 -29666
13781 -29666 -16493 -2461 34 -24125 -25655 -27012 -33229 -31005 -13456 -6885 -7128 -15092 -21362 -23908
13767 -23908 -19291 -30389 -43023 -51834 -53215 -35403 -29326 -28623 -22565 -23854 -5320 868 -16502
$$ packed form
13863f061O117j2273j2099J860R566Q920J322K28o499q796p067N517J1971J2541
13849E247j895j1976N137J7560j3211j2900n153n548q524r459n382Q751J525p168
13835d2996J3579J5745J8971j991j4091k802K024N92j2318J969J0350M431r554
13822a6091m922j2874o943j147O790J6899m821k976J656j0054l829O851L133q551
13808c6879q838j933N32J273J450J5792J2883o611L039q786j0427n156m396K373
13794d5684m416O293J7019J3810k432N98k1017P129J8678Q536j6699j6071M590
13781b9666J3173J4032K495k4159j530j357o217K224J7549O571k43p964o270k546
13767b3908M617j1098j2634q811j381J7812O077P03O058j289J8534O188j7370
$$ plain form
13754 -16502 -25460 -11772 -18845 -19729 -873 5431 -3027 -7038 2924 5452 -3426 -12532 -26509 -43468
13740 -43468 -38437 -33591 -34548 -31150 -22138 -29492 -31287 -7677 -3676 216 2540 -13585 -19494 -30317
13726 -30317 -32903 -24220 -22188 -13769 -10237 -12686 -17886 -28966 -38833 -35251 -25923 -27883 -37581 -41039
13712 -41039 -41658 -33993 -38014 -31461 -21558 -17147 -18012 -15213 -9800 -19278 -23384 -7089 952 -10177
13698 -10177 1434 -3692 -29466 -42141 -44676 -33731 -25574 -23871 1383 18359 10066 1220 -3618
13685 -3618 -5155 -11640 -9589 -6725 -14646 -8052 -3593 7922 4462 -15609 -21633 -26578 -29549 -33068
13671 -33068 -33258 -26732 -15236 -15441 -31440 -30923 -26274 -41842 -47619 -39589 -32228 -22382 -2214 -796
13657 -796 -8853 -8575 -14381 1462 3508 -5854 -24425 -24215 -4203 7477 11026 -9510 -26198 -26105
$$ packed form
13754a6502q958J3688p073q84J8856O304q458m011R962K528q878r106j3977j6959
13740d3468N031M846r57L398R012p354j795K3610M001L892K324j6125n909j0823
13726c0317k586Q683K032Q419L532k449n200j1080r867L582R328j960r698l458
13712d1039o19P665m021O553R903M411q65K799N413r478m106J6295Q041j1129
13698a0177J1611n126k5774j2675k535J0945Q157J703K5254J6976q293q846m838
13685c618j537o485K051K864p921O594M459J1515l460k0071o024m945k971l519
13671c3068j90O526J1496k05j5999N17M649j5568n777Q030P361R846K0168J418
13657g96q057K78n806J5843K046r362j8571K10K0012J1680L549k0536j6688R3
$$ plain form
13643 -26105 -15574 3311 13851 -4555 -21114 -21031 -25276 -39545 -45839 -53297 -57792 -45930 -30515
13630 -30515 -13250 6306 12591 1239 -9095 -3564 -12714 -28015 -27146 -20937 -25427 -26559 -18636
13617 -18636 -17956 -20987 -17404 -8304 8922 3571 -3326 -4999 -8875 -18510 -28451 -24462 -18419 -4679
13603 -4679 4161 518 -8903 -20381 -11960 -180 -9638 -1110 -3159 795 4177 -4167 -5361 -10671
13589 -10671 -9953 1991 -12401 -19280 -23748 -9763 -5453 -15117 -15861 -19886 -7737 3146 -3500 -17007
13575 -17007 -23383 -23116 -11449 -9563 -8198 -15101 -12987 -7515 -5691 -24803 -26489 -22272 -25332 -25822
13561 -25822 -13045 -9695 -9099 -927 1577 -9057 -22448 -17464 -13960 3103 -4375 -19505 -6999
13548 -6999 -2800 1712 1792 -3055 -9997 -15509 -8487 -3906 -1607 3483 -3876 -1224 -6298 -11421 -12217
$$ packed form
13643b6105J0531J8885J0540j8406j6559Q3m245j4269o294p458m495J1862J5415
13630c0515J7265J9556O285j1352j0334N531r150j5301Q69O209m490j132P923
13617a8636O80l031L583R100J7226n351o897j673l876r635r941L989O043J3740
13603d679Q840l643r421j1478Q421J1780r458Q528k049L954L382q344j194n310
13589a0671P18J1944j4392o879m468J3985M310r664p44m025J2149J0883o646j3507
13575a7007o376K67J1667J886J365o903K114N472J824j9112j686M217l060m90
13561b5822J2777L350N96Q172K504j0634j3391M984L504J7063p478j5130J2506
13548f999M199M512Q0m847o942n512P022M581K299N090p359K652n074n123p96
$$ plain form
13533 -12217 -13386 448 1396 -6363 -2266 -10023 -19546 -7868 -9526 -14622 -7213 3969 12173 8159
13519 8159 9874 20160 15349 5052 562 9602 17956 4150 5849 5823 12151 3748 -1416 -1922 -3596
13504 -3596 1915 18839 31018 13646 -3470 -7993 12049 3878 6464 10383 6184 2028 5216
13491 5216 -328 -9726 -16527 -12875 -14388 -5691 5228 256 -5835 -11048 -15947 -20459 -12370 -11891 -16559
13476 -16559 -14422 -10452 1985 13842 13440 17636 9667 -261 -7384 -12075 -24964 -18305 -7156 -3360
13462 -3360 -8700 -10766 -10628 2408 422 -3402 -745 -2738 -287 -5411 -25783 -29965 -17628 -13603
13448 -13603 -6205 -4076 -152 1413 -5608 -3912 -185 466 6238 13122 180 -14761 -12736 -1980
13434 -1980 -4459 -2031 7746 425 -9472 554 5016 9338 18400 30045 36588 37603 41385 37133
$$ packed form
13533a2217j169J3834R48p759M097p757r523J1678j658n096P409J1182Q204m014
13519H159J715J0286m811j0297m490R040Q354j3806J699k6O328q403n164n06j674
13504c596N511J6924J2179j7372j7116m523K0042q171K586L919m199m156L188
13491E216n544r398o801L652j513Q697J0919m972o091n213m899m512Q089M79m668
13476a6559K137L970J2437J1857m02M196p969r928p123m691j2889O659J1149L796
13462c360n340k066J38J3036j986l824K657j993K451n124k0372m182J2337M025
13448a3603P398K129L924J565p021J696L727O51N772O884j2942j4941K025J0756
13434a980k479K428R777p321r897J0026M462M322R062J1645O543J015L782m252
$$ plain form
13420 37133 28415 19289 11110 -2194 -3605 -2460 -4893 -8922 6399 7779 -2440 -2204 8839 -4209
13406 -4209 -2088 -4806 -27460 -24821 -12622 -4603 6325 20957 22639 22064 16548 15013 16155 -2209
13392 -2209 -16071 -24754 -14983 405 18205 15375 8646 2129 -12869 -15627 -4647 -2172 -9233
13379 -9233 4537 5777 2060 -4820 -4041 -9174 -7167 1236 7226 9406 1853 -7514 -1979 -8434 -6546
13364 -6546 12490 3193 -3747 -5796 2056 -161 -3628 3875 5075 -1600 -27759 -32065 -4227 11225
13350 11225 9357 9642 13267 10758 19396 15907 17462 3397 207 -8423 4994 11629 8002 12301
13336 12301 11987 18012 19167 19538 23320 24053 20872 18071 21979 26421 24797 22084 24118 39569 36522
13321 36522 46789 48167 33025 28011 229 -3652 7622 15478 17908 17501 35072 30347 8155
$$ packed form
13420C7133q718r126q179j3304j411J145k433m029J5321J380j0219K36J1043j3048
13406d209K121k718k2654K639J2199Q019J0928J4632J682n75n516j535J142j8364
13392b209j3862q683R771J5388J7800k830o729o517j4998k758J0980K475p061
13379i233J3770J240l717o880P79n133K007Q403N990K180p553r367N535o455J888
13364f546J9036r297o940k049P852k217l467P503J200o675k6159m306K7838J5452
13350A1225j868K85L625k509Q638l489J555j4065l190q630J3417O635l627M299
13336A2301l14O025J155L71L782P33l181k801L908M442j624k713K034J5451l047
13321C6522J0267J378j5142n014k7782l881J1274P856K430m07J7571m725k2192
$$ plain form
13308 8155 -11929 -9975 -14884 -3913 6797 1240 -7605 -16345 -21794 -12158 -10464 -14876 -19494 -20176
13294 -20176 -15202 -9988 -5889 -7272 -10045 -14070 -14076 3116 11392 4328 5180 -490 -17005 -18506 -7286
13279 -7286 -12359 -4166 -1761 -10031 -4233 -10345 -11997 -7427 744 1769 -4094 1523 -150 15749
13265 15749 35126 37254 19790 13235 20796 14248 21878 20677 11660 13107 9219 -2323 -10640 -8459
13251 -8459 -6142 -19294 -28944 -41391 -40613 -41098 -25417 -9808 -19305 -19912 -6415 -6567 -15636 -19313
13237 -19313 -13585 -16473 -26019 -30859 -14172 -9267 -2094 16484 15010 8327 9916 -1786 11306
13224 11306 24124 22034 24016 17863 12960 12603 9394 -1343 -3416 -12845 -13110 -2427 -12313 -15501
13210 -15501 -62 1364 6009 9792 -331 21 12958 765 -7699 -7132 -5942 581 11427 6443
$$ packed form
13308H155k0084J954m909J0971J0710n557q845q740n449R636J694m412m618o82
13294b0176M974N214M099j383k773m025oJ7192Q276p064Q52n670j6515j501J1220
13279g286n073Q193K405q270N798o112j652M570Q171J025n863N617j673J5899
13265A5749J9377K128j7464o555P561o548P630j201r017J447l888j1542q317K181
13251h459K317j3152r650j2447P78m85J5681J5609r497o07J3497j52r069l677
13237a9313N728k888r546m840J6687M905P173J8578j474o683J589j1702J3092
13224A1306J2818k090J982o153m903l57l209j0737k073r429k65J0683r886l188
13210a5501J5439J426M645L783j0123L52J2937j2193q464N67J190O523J0846m984
$$ plain form
13196 6443 -11749 -9597 -5448 -6127 4989 6474 7383 23985 18655 3438 857 -8610 -9679 -7601
13182 -7601 -8520 -9174 1464 24986 31367 20126 20597 18503 5489 5442 14352 15681 8480 237 -2906
13167 -2906 -7938 -7964 -1712 9037 6099 -10229 -19363 -23876 -27701 -31123 -22876 -31878 -13362 -5638
13153 -5638 860 15317 21877 20616 11377 21799 17100 5702 11837 13400 8198 4882 6469 3823
13139 3823 11041 14600 13045 16209 21911 17053 16517 20775 -1289 -18884 -14139 -6820 6214 8096
13125 8096 8222 4506 -3065 -6366 -2115 13012 8942 8558 18770 14436 11182 23392 37310 27379
13111 27379 20205 31558 26016 24772 23250 32284 28929 34627 49071 47375 28607 7587 11773
13098 11773 13878 16290 22960 23881 30975 26724 22565 14863 3339 -1962 1811 6826 12487 22165
$$ packed form
13196F443j8192K152M149o79J1116J485R09J6602n330j5217k581r467j069K078
13182g601r19o54J0638K3522O381j1241M71k094j3014m7Q910J329p201q243l143
13167b906n032k6O252J0749k938j6328r134m513l825l422Q247r002J8516P724
13153e638O498J4457O560j261r239J0422m699j1398O135J563n202l316J587k646
13139C823P218L559j555L164N702m858n36M258k2064j7595M745P319J3034J882
13125H096J26l716p571l301M251J5127m070l84J0212m334l254J2210J3918r931
13111B7379p174J1353n542j244j522R034l355N698J4444j696j8768k1020M186
13098A1773K105K412O670R21P094m251m159p702j1524n301L773N015N661R678
$$ plain form
13084 22165 24972 19542 20495 14228 17450 24873 19611 15057 13886 9884 -992 -13599 -608 950
13070 950 4728 7140 3583 11703 21989 21865 15715 26591 34963 33312 29204 22085 34784 40565
13056 40565 28355 29735 41812 30547 33388 24823 7136 -14952 -7573 9352 22836 28531 37314
13043 37314 46421 44356 33080 29333 25075 16843 19171 48731 60492 52313 43882 41787 44077 24908
13029 24908 18525 15488 26450 14744 -4754 -4221 2235 4241 3865 11156 16726 16205 14499 12784
13015 12784 18469 18055 21012 14384 7003 -862 8399 23159 30183 36032 15926 14936 18448 34363
13001 34363 45088 29071 19433 17986 4245 13994 19290 15027 12457 10745 -1053 -4801 2551
12988 2551 17025 17713 -2345 -6541 3144 20307 25664 15362 -5432 12761 27693 33984 25217
$$ packed form
13084B2165K807n430R53o267L222P423n262m554j171m002j0876j2607J2991J558
13070I50L778K412l557Q120J0286j24o150J0876Q372j651m108p119J2699N781
13056D0565j2210J380J2077j1265K841q565j7687k2088P379J6925J3484N695Q783
13043C7314R107k065j1276l747m258q232K328K9560J1761q179q431k095K290j9169
13029B4908o383l037J0962j1706j9498N33O456K006l76P291N570n21j706j715
13015A2784N685m14K957o628p381p865R261J4760P024N849k0106r90L512J5915
13001C4363J0725j6017r638j447j3741R749N296m263k570j712j1798l748P352
12988B551J4474O88k0058m196R685J7163N357j0302k0794J8193J4932O291q767
$$ plain form
12975 25217 22025 21973 21021 -1716 -10984 2900 20700 21913 14303 5441 7633 6454 11668 5983
12961 5983 -5382 -76 6360 17390 25665 22308 31962 29668 20641 29021 29579 20149 15992 8774
12947 8774 -306 2711 17873 11242 1967 -897 -1000 -7683 -17175 -21609 -16713 -11491 -15225 -3088
12933 -3088 2388 -1576 -7605 -14676 4538 18230 7282 -805 -833 2739 2339 -389 2489 1503 -4833
12918 -4833 -5282 15301 18913 22038 23917 23591 23659 21806 14036 11193 31843 33863 23299 10317 5899
12903 5899 13033 17794 19859 26210 5938 -11126 849 18147 20325 11675 7639 14464 -114
12890 -114 -6387 1797 6594 244 -459 10101 18208 13565 1653 -5813 14144 24860 27125 38252
12876 38252 43137 35723 33021 29029 14931 8800 8687 -2669 -11212 -5443 -12219 -20702 -6059 3932
$$ packed form
12975B5217l192n2r52k2737r268J3884J7800J213p610q862K192j179N214n685
12961E983j1365N306O436J1030Q275l357R654k294r027Q380N58r430m157p218
12947H774r080L017J5162o631r275k864j03o683r492m434M896N222l734J2137
12933c088N476l964o029p071J9214J3692j0948q087k8L572m00k728K878r86o336
12918d833m49K0583L612L125J879l26O8j853p770k843K0650K020j0564j2982m418
12903E899P134M761K065O351k0272j7064J1975J7298K178q650m036O825j4578
12890a14o273Q184M797o350p03J0560Q107m643j1912p466J9957J0716K265J1127
12876C8252M885p414k702l992j4098o131j13j1356q543N769o776q483J4643R991
$$ plain form
12862 3932 11045 14694 3129 -6972 -14173 -8350 -6972 -14195 -5777 -9676 -12994 -10716 -4046 2888
12848 2888 -3610 -5131 20285 44904 35312 25679 25981 23998 17208 15806 2001 -3513 -10182 -6259
12834 -6259 10576 21851 23193 14819 15995 21517 16881 18975 33326 43513 51130 38983 20575
12821 20575 11097 -1002 6478 -464 -4363 -4835 6356 20705 14254 3421 -2122 -11687 4405
12808 4405 8785 9986 12721 20 -22869 -28651 -22238 -3435 13482 9380 -7703 -9792 -4761
12795 -4761 1616 -4396 -11896 -9827 -12466 -9708 -10385 -7613 584 -2408 -7042 -9154 -2024 977 -2422
12780 -2422 -875 -3398 -15469 -30032 -30521 -28550 -29846 -26554 -17695 -21350 -25044 -24216 -13516 -16266
12766 -16266 -28478 -37224 -8839 1984 -10710 -9021 5709 5154 748 -6006 -16220 -15270 -15708 -24403
$$ packed form
12862C932P113L649j1565j0101p201N823J378p223Q418l899l318K278O670O934
12848B888o498j521K5416K4619r592r633L02j983o790j402j3805n514o669L923
12834f259J6835J1275J342q374J176N522m636K094J4351J0187P617j2147j8408
12821B0575r478j2099P480o942l899m72J1191J4349o451j0833n543r565J6092
12808D405M380J201K735j2701k2889n782O413J8803J6917m102j7083k089N031
12795d761O377o012p500K069k639K758o77K772Q197k992m634k112P130L001l399
12780b422J547k523j2071j4563m89J971j296L292Q859l655l694Q28J0700k750
12766a6266j2212q746K8385J0823j2694J689J4730n55m406o754j0214R50m38q695
$$ plain form
12752 -24403 -24045 -11425 -2575 -5399 -14334 -23837 -30349 -12842 -8885 -4610 -3684 -6512 -9921 -11249
12738 -11249 -14702 -17660 -10505 -13098 -10766 -12790 -14722 -10153 -6920 -13750 -12753 -6256 -8466 -20423
12724 -20423 -33325 -24531 -20740 -9743 7377 7584 -15019 3466 19868 19057 10215 8765 -8493
12711 -8493 -13504 -9718 -7234 -2377 9423 8191 3251 -3474 -5578 -12741 218 7598 5921 7544
12697 7544 1284 -1577 -947 -17468 -23912 -27585 -19128 -12565 -19114 -15779 -15320 -6096 -854 -7107 -13200
12682 -13200 -8691 972 4419 3891 -7620 216 -289 -20841 -38559 -46635 -60873 -48281 -33761
12669 -33761 -30123 -16460 -907 10147 1898 -3501 -4537 -6324 -7955 -3982 12413 4298 -13423
12656 -13423 -18617 -23958 -14773 -17017 -11043 -16730 -19893 -24633 -27783 -11011 9212 8197 -5926 -11489
$$ packed form
12752b4403L58J2620Q850k824q935r503o512J7507L957M275R26k828l409j328
12738a1249l453k958P155k593K332k024j932M569L233o830R97O497k210j1957
12724b0423j2902Q794L791J0997J7120K07k2603J8485J6402q11q842j450j7258
12711h493n011L786K484M857J1800j232m940o725k104p163J2959P380j677J623
12697G544o260k861O30j6521o444l673Q457O563o549L335M59R224N242o253o093
12682a3200M509R663L447n28j1511P836n05k0552j7718q076j4238J2592J4520
12669c3761L638J3663J5553J1054q249n399j036j787j631L973J6395q115j7721
12656a3423n194n341R185k244N974n687l163m740l150J6772K0223j015j4123n563
$$ plain form
12642 -11489 -5378 -9686 -13982 -12927 -28371 -31961 -19404 -16829 -13308 -13067 -5041 -10048 -9341 -5169
12628 -5169 -5051 -20146 -19128 -17096 -17881 -5450 -14271 -13855 -12869 3988 3986 -8020 -887 6293 6630 9142
12612 9142 -3429 -10207 -9121 -12355 -8556 -4925 5434 -5549 -13846 -29949 -29035 -14905 -9198 -7604
12598 -7604 -8905 -18830 -20608 -2718 -5140 -8746 -17450 -30465 -25917 -24850 -25550 -30761 -28781 -15822
12584 -15822 -19389 -23007 -20295 -22251 -19452 -16402 -15531 -7121 -6497 -20512 -30188 -29422 -34538 -23566 -21414
12569 -21414 -14032 -8446 -7985 -12737 -27090 -29505 -29612 -39838 -40221 -35889 -27643 -5470 16774 5038
12555 5038 -17066 -25509 -33633 -38625 -22842 -23595 -30551 -17669 -3602 7249 1917 -13601 -10901
12542 -10901 -12954 -21834 -5713 -5754 -10008 -6188 -409 -16284 -32794 -41452 -34246 -32723 -26761 -25224
$$ packed form
12642a1489O111m308m296J055j5444l590J2557K575L521K41Q026n007P07M172
12628e169J18j5095J018K032p85J2431q821M16R86J6857kj2006P133P180L37K512
12612I142j2571o778J086l234L799L631J0359j0983q297j6103R14J4130N707J594
12598g604j301r925j778J7890k422l606q704j3015M548J067p00n211J980J2959
12584a5822l567l618K712j956K799L050Q71Q410O24j4015r676P66n116J0972K152
12569b1414P382N586M61m752j4353k415j07j0226l83M332Q246K2173K2244j1736
12555E038k2104q443q124m992J5783p53o956J2882J4067J0851n332j5518K700
12542a0901k053q880J6121m1m254L820N779j5875j6510q658P206J523N962J537
$$ plain form
12528 -25224 -21962 -17699 -3651 9358 2678 -2917 4027 -1423 -1554 11163 7917 289 -10943 -135
12514 -135 5874 12265 10187 13352 18908 21234 27694 11934 -4632 -12594 -29 1563 2834 -5669
12500 -5669 -5069 -10034 -1196 -1506 -4860 113 -8499 -15268 -5024 -3537 -14732 -6108 -1267 -5299 -4091
12485 -4091 7551 8995 -11696 -5186 494 355 -5508 -16808 -32069 -12541 -4322 -415 -2347 -7855
12471 -7855 -9521 10621 19298 17570 28475 21946 21953 15823 2120 -14222 -7299 5168 4908 17095
12457 17095 9526 -2381 -946 1979 1206 1474 1269 1024 244 -3664 -7300 755 10250 15045 -875
12442 -875 2037 15747 18896 14527 2549 15468 22925 20654 6650 -11915 -5098 1748 5196 2384
12428 2384 -4072 -2801 -14580 -12043 5988 4690 10651 8535 -8049 -15698 -11548 0 8819 27044
$$ packed form
12528b5224L262M263J4048J3009o680n595O944n450j31J2717l246p628j1232J0808
12514a35O009O391k078L165N556K326O460j5760j6566p962J2565J592J271q503
12500e669O00m965Q838l10l354M973q612o769J0244J487j1195Q624M841m032J208
12485d091J1642J444k0691O510N680j39n863j1300j5261J9528Q219L907j932n508
12471g855j666K0142Q677j728J0905o529Po130j3703j6342O923J2467k60J2187
12457A7095p569j1907J435K925p73K68k05k45p80l908l636Q055R495M795j5920
12442h75K912J3710L149m369j1978J2919P457k271j4004j8565O817O846L448k812
12428B384o456J271j1779K537J8031j298N961k116j6584p649M150J1548Q819J8225
$$ plain form
12414 27044 25223 14866 6057 7789 13094 17937 326 -13794 -4606 8908 7294 10060 585
12401 585 -5125 7616 10865 6381 5259 1611 -3447 181 -4800 3240 8242 8244 4244 2051 169
12386 169 6585 894 -7555 -11358 -3217 4621 15166 25735 25648 27004 29742 28736 31770 26529 19402
12371 19402 23686 26548 36030 42277 37227 40000 45011 31564 22707 7858 -2475 5836 18359
12358 18359 31397 31225 18080 16539 26133 20680 9670 6181 9429 -7383 -15586 4009 45
12345 45 -33 1721 -7991 -7775 -11827 -9278 5121 8375 943 2376 14409 20715 15952 14774 18983
12330 18983 16350 9666 -1847 -13927 -17587 -9429 -2890 2787 9029 1954 3934 8821 9562 11717
12316 11717 4755 -13232 -11318 -3044 -3822 -1521 9178 5205 1253 6552 10283 12094 17449 22141
$$ packed form
12414B7044j821j0357q809J732N305M843j7611j4120R188J3514j614K766r475
12401E85n710J2741L249m484j122l648n058L628m981Q040N002Km000k193j882
12386A69O416n691q449l803Q141P838J0545J0569q7J356K738j006L034n241p127
12371A9402M284K862R482O247n050K773N011j3447q857j4849j0333Q311J2523
12358A8359J3038j72j3145j541R594n453j1010l489L248j6812q203J9595l964
12345D5p8J754r712K16m052K549J4399L254p432J433J2033O306m763j178M209
12330A8983k633o684j1513j2080l660Q158O539N677O242p075J980M887P41K155
12316A1717o962j7987J914Q274p78K301J0699l973l952N299L731J811N355M692
$$ plain form
12302 22141 18930 20745 16546 17896 7195 3091 3495 -6434 -11289 -8925 7499 16493 11165 14111
12288 14111 16718 7655 -5666 -10283 2361 5061 -2109 -5656 -2626 -1101 -7061 5218 18236
12275 18236 12817 -5969 -2788 -2903 -11554 -18229 -20183 -8318 -6641 -12751 -5742 -1363 -1858 -7744
12261 -7744 -7890 -13319 -18238 -17657 -27790 -26289 -7910 8677 7582 12056 10820 12336 21713 20849 21269
12246 21269 19054 3563 16359 10069 10978 12069 17551 24015 12702 2520 11285 28333 33972
12233 33972 31862 14563 1364 8502 16008 10294 19003 20927 3876 -1733 -4374 -9768 -7109 -2795
12219 -2795 1152 6121 3425 -3128 -4438 -377 5666 7890 25907 30860 34426 27375 14693 12829
12205 12829 3590 -2066 -4995 -2058 7568 32051 35286 24817 4177 4702 5210 -1651 4903 10804
$$ packed form
12302B2141l211J815m199J350j0701m104M04r929m855K364J6424Q994n328K946
12288A4111K607r063j3321m617J2644K700p170l547L030J525n960J2279J3018
12275A8236n419j8786L181j15q651o675j954J1865J677o110P009M379m95n886
12261g744j46n429m919N81j0133J501J8379J6587j095M474j236J516R377q64M20
12246B1269k215j5491J2796o290R09J091N482O464j1313j0182Q765J7048N639
12233C3972k110j7299j3199P138P506n714Q709J924j7051n609k641n394K659M314
12219b795L947M969k696o553j310M061O043K224J8017M953L566p051j2682j864
12205A2829r239n656k929K937R626K4483L235j0469k0640N25N08o861O554N901
$$ plain form
12191 10804 26508 26789 24215 32087 28325 10489 7690 11534 296 11139 24324 27889 34833
12178 34833 25065 12729 8312 3496 -6894 -2460 -6323 332 -243 -3857 -4592 -2186 -228 2990
12164 2990 5623 9874 8267 14022 10628 24329 36682 28640 13058 -1613 -3680 505 17151
12151 17151 25029 38288 34180 28617 24522 12125 5420 -6779 -11739 -13459 -16607 -20969 -29229 -25466
12137 -25466 -16863 -26088 -22874 -10877 -7645 -5800 -7406 -3801 3777 4272 7247 8542 6458 4886
12123 4886 18205 21447 14946 5994 15206 10420 -3501 -4613 530 2696 13879 12555 9261 4057
12109 4057 11426 24501 33816 47356 40656 14713 3880 12374 8109 9198 10536 7903 -1779 -8555
12095 -8555 -6723 -6215 -443 3781 91 -3769 -4685 889 1552 1505 7555 13023 3669 1652 8264 5334
$$ packed form
12191A0804J5704K81k574P872l762j7836k799L844j1238J0843J3185L565O944
12178C4833r768j2336m417m816j0390M434l863O655n75l614p35K406J958L218
12164B990K633M251j607N755l394J3701J2353q042j5582j4671k067M185J6646
12151A7151P878J3259m108n563m095j2397o705j2199m960j720l148m362q260L763
12137b5466Q603r225L214J1997L232J845j606L605P578M95K975J295k084j572
12123D886J3319L242o501q952R212m786j3921j112N143K166J1183j324l294n204
12109D057P369J3075R315J3540o700k5943j0833Q494m265J089J338k633r682o776
12095h555J832N08N772M224l690l860r16N574O63m7O050N468r354k017O612k930
$$ plain form
12079 5334 2378 -16979 -26429 -18970 -12132 -8295 -7667 -17692 -22312 -26382 -20514 -22462 -13239 -5501
12065 -5501 -4332 11162 22565 26409 26121 32140 25133 8251 11982 10906 5849 16400 15947 18311
12051 18311 11875 11540 11163 7552 2277 -6801 1468 2694 -2017 2026 9582 13226 15448 21792 29384
12036 29384 43818 37084 27514 22340 17070 12887 2203 2065 -3686 -761 -8233 -8592 -10123 -23086
12022 -23086 -20827 -10880 -21526 -30944 -22664 -12584 -1188 18338 27039 17463 5585 210 20684
12009 20684 26927 10894 6220 5929 8575 15069 11366 -2763 -727 377 -404 5725 10057 10975 30296
11994 30296 45746 42066 52413 36604 9353 3822 8805 14635 3922 55 12003 12919 -482
11981 -482 -5660 13628 25247 29369 28848 35569 48307 44404 34593 36626 28281 22785 20396 13413
$$ packed form
12079E334k956j9357r450P459O838L837O28j0025m620m070N868j948R223P738
12065e501J169J5494J1403L844k88O019p007j6882L731j076n057J0551m53K364
12051A8311o436l35l77l611n275r078Q269J226m711M043P556L644K222O344P592
12036B9384J4434o734r570n174n270m183j0684j38n751K925p472l59j531j2963
12022b3086K259R947j0646r418Q280J0080J1396J9526Q701r576j1878n375K0474
12009B0684O243j6033m674k91K646O494l703j4129K036J104p81O129M332R18J9321
11994C0296J5450l680J0347j5809k7251n531M983N830j0713l867J1948R16j3401
11981d82n178J9288J1619M122n21O721J2738l903r811K033q345n496k389o983
$$ plain form
11967 13413 3755 3965 5977 282 -11843 -7020 -2284 -1536 3359 11515 16996 16656 24876 24523 13176
11952 13176 8473 27254 35700 40233 41819 35582 27793 32090 46392 38586 17002 13445 12485 9960
11938 9960 8410 17763 22897 10667 19171 37939 32918 45631 46177 33192 25043 21625 15758 12564
11924 12564 18810 28873 18996 10343 13385 15952 17686 19334 16422 15926 22734 32737 25612 13195
11910 13195 34569 43634 44491 44195 35751 38908 38867 32616 35903 34367 28482 26979 24963 36093 56341
11895 56341 54407 56385 57078 48509 38190 33225 42778 43236 53933 66374 56881 30143 28378 31037
11881 31037 40787 41169 41828 44048 44642 39319 35139 16267 8527 7534 20530 32672 33387 26582 12031
11866 12031 2443 3677 11380 10973 7003 23203 21623 25449 26970 8230 1457 10866 4014 -4665
$$ packed form
11967A3413r658K10K012n695j2125M823M736P48M895Q156N481l40Q220l53j1347
11952A3176m703J8781Q446M533J586o237p789M297J4302p806k1584l557r60k525
11938I960j550R353N134j2230Q504J8768n021J2713N46j2985q149l418n867l194
11924A2564O246J0063r877q653L042K567J734J648k912m96O808J0003p125j2417
11910A3195K1374R065Q57k96q444L157m1o251L287j536n885j503k016J1130K0248
11895E6341j934J978O93q569j0319m965R553M58J0697J2441r493k6738j765K659
11881C1037R750L82O59K220N94n323m180j8872p740r93J2996J2142P15o805j4551
11866A2031r588J234P703m07l970J6200j580L826J521j8740o773R409o852q679
$$ plain form
11852 -4665 -8182 -2341 21034 29734 39885 39344 41792 43355 40273 38344 32942 32414 37146 27735 30393
11837 30393 21986 13097 23970 21538 22318 21748 17491 8055 -3165 -7519 -1555 11218 30810 28944
11823 28944 22942 12131 11519 25578 24528 6519 11080 22878 35123 24243 8086 11123 7033
11810 7033 -8162 -9210 -7155 -1287 4013 12701 16681 10842 27138 26295 23351 22539 24213 8367
11796 8367 151 -4069 -741 11943 8740 9922 14028 20444 25188 16121 24081 18459 4359 -12373
11782 -12373 -13013 -6212 303 14873 22189 22115 33848 46624 50525 32774 17841 20386 32627 27947
11768 27947 34074 18486 21668 18677 12505 13594 2335 -10455 -15426 -22473 -7057 2194 5381
11755 5381 9185 16138 22379 22249 14278 24663 33952 23832 18966 12091 20997 15002 14275 24659
$$ packed form
11852d665l517N841K3375Q700J0151n41K448J563l082j929n402n28M732r411K658
11837C0393q407q889J0873k432P80n70m257r436j1220m354N964J2773J9592j866
11823B8944o002j0811o12J4059j050j8009M561J1798J2245j0880j6157L037m090
11810G033j5195j048K055N868N300Q688L980n839J6296q43k944q12J674j5846
11796H367q216m220L328J2684l203J182M106O416M744r067P960n622j4100j6732
11782a2373o40O801O515J4570P316p4J1733J2776L901j7751j4933K545J2241m680
11768B7947O127j5588L182k991o172J089j1259j2790m971p047J5416R251L187
11755E381L804O953O241j30p971J0385R289j0120m866o875Q906n995p27J0384
$$ plain form
11741 24659 29714 36572 29394 21397 18375 14450 20612 24901 18169 13206 29736 30704 17104 12649
11727 12649 21611 11995 7340 31395 42936 32331 42640 49552 48800 48504 51330 56791 63201 57207
11713 57207 65515 56939 56653 54201 42591 43355 49666 52543 53040 43666 43540 52470 48516 30095 22800
11698 22800 27436 43706 50826 57884 54009 47080 38590 34127 36661 46118 47668 35289 44990 57246
11684 57246 37553 27495 27055 29503 20123 13814 18292 25126 25937 28181 34311 31736 39859 50392
11670 50392 54337 69316 76734 84846 109649 127444 145267 173653 208131 264343 337323 407413
11658 407413 506694 616684 739954 862832 930281 954337 918943 843603 739636 647849 551705
11647 551705 467935 419694 391207 367355 363519 375546 430437 498939 569254 657737 727586 767130
$$ packed form
11741B4659N055O858p178p997l022l925O162M289o732m963J6530R68j3600m455
11727A2649Q962r616m655K4055J1541j0605J0309O912p52k96K826N461O410n994
11713E7207Q308q576k86k452j1610P64O311K877M97r374j26Q930l954j8421p295
11698B2800M636J6270P120P058l875o929q490m463K534R457J550j2379R701J2256
11684E7246j9693j0058m40K448r380o309M478O834Q11K244O130k575Q123J0533
11670E0392L945J4979P418Q112K4803J7795J7823K8386L4478N6212P2980P0090
11658D07413R9281J09990J23270J22878O7449K4056l5394p5340j03967r1787r6144
11647E51705q3770m8241k8487k3852l836J2027N4891O8502P0315Q8483O9849L9544
$$ plain form
11635 767130 763149 714391 615247 504607 413797 335561 273024 225931 191849 201444 210840 191586
11623 191586 180883 170638 166347 180047 191988 193903 190504 184260 168128 172470 182557 169654
11611 169654 161751 154332 151760 166619 183516 204448 235163 283414 344014 401067 478078 535917
11599 535917 562793 567200 541251 510712 494543 477503 488560 528262 566413 615341 647067 673999
11587 673999 664709 623258 560014 506628 462983 403885 353385 328169 324712 343580 381765 431509
11575 431509 498134 578813 653933 684876 681857 651662 583778 502884 425190 364836 308702 249468
11563 249468 211063 184034 164269 141173 115482 111302 110393 103446 90924 110425 129037 120136
11551 120136 108329 100672 102201 133949 152728 154970 144635 142591 148795 139165 163135 170345 194216
$$ packed form
11635G67130l981m8758r9144j10640r0810p8236o2537m7093l4082R595R396j9254
11623A91586j0703j0245m291J3700J1941J915l399o244j6132M342J0087j2903
11611A69654p903p419k572J4859J6897K0932L0715M8251O0600N7053P7011N7839
11599E35917K6876M407k5949l0539j6169j7040J1057L9702L8151M8928L1726K6932
11587F73999r290m1451o3244n3386m3645n9098n0500k5216l457J8868L8185M9744
11575D31509O6625Q0679P5120L0943l019l0195o7884q0894p7694o0354n6134n9234
11563B49468l8405k7029j9765k3096k5691m180r09o947j2522J9501J8612q901
11551A20136j1807p657J529L1748J8779K242j0335k044O204r630K3970P210K3871
$$ plain form
11538 194216 212692 220805 216160 203554 194064 176642 167407 159499 150060 130658 121076 128402 123245
11525 123245 124583 142668 170206 182081 196548 190369 187166 181214 143683 107166 92666 96139
11513 96139 96485 76594 60164 63480 75717 75004 58936 30249 26392 22116 28179 26960 19627 23054
11499 23054 11800 11944 11503 10990 10999 16808 29821 41222 37927 33659 24929 32353 42525 34604 44000
11484 44000 46562 40459 23139 12748 15818 38844 39033 49912 73051 74588 87470 127099 141936
11471 141936 141734 146538 146687 138048 140700 137683 124293 108791 93360 83858 100419 103891 100276 93526
11457 93526 104970 120470 142291 158743 158093 146526 126790 110410 80802 59466 47633 43598
11445 43598 42017 18830 5781 3456 -7381 -19971 -44355 -45049 -42059 -33295 -4241 6351 14554
$$ packed form
11538A94216J8476Q113m645j2606r490j7422r235p908r439j9402r582P326n157
11525A23245J338J8085K7538J1875J4467o179l203n952l7531l6517j4500L473
11513I6139L46j9891j6430L316J2237p13j6068k8687l857m276O063j219p333L427
11499B3054j1254J44m41n13RN809J3013J1401l295m268q730P424J0172p921R396
11484D4000K562o103j7320j0391L070K3026J89J0879K3139J537J2882L9629J4837
11471A41936k02M804J49q639K652l017j3390j5502j5431r502J6561L472l615o750
11457I3526J1444J5500K1821J6452o50j1567j9736j6380k9608k1336j1833m035
11445D3598j581k3187j3049k325j0837j2590k4384o94K990Q764K9054J0592Q203
$$ plain form
11432 14554 22777 21803 18037 22286 10634 10234 114 -7794 -14780 -22455 -31217 -45199 -35163 -24161
11418 -24161 -18790 -12473 -13800 -19307 -26797 -35547 -37053 -23322 -24857 -14347 -16392 -39711 -46777 -43056
11404 -43056 -37745 -37979 -35778 -46594 -52752 -33766 -24820 -24377 -34628 -42537 -44776 -49926 -53763 -65566
11390 -65566 -80928 -91967 -95994 -90740 -86358 -91005 -73419 -49316 -41959 -33883 -21804 -6647 2184
11377 2184 -505 -5310 -14528 -24817 -31484 -34533 -32317 -46659 -52318 -53903 -72961 -74327 -69709 -56853
11363 -56853 -55865 -52305 -45517 -21531 -19257 -27464 -35821 -29420 -51015 -68174 -77905 -82022 -82660 -85920
11349 -85920 -102481 -106756 -105819 -95832 -75376 -58976 -70241 -82025 -86784 -97416 -116436 -124566 -128318
11336 -128318 -146102 -147813 -145245 -152395 -139812 -137435 -143072 -142528 -139274 -135308 -128671 -116669 -110379 -107645
$$ packed form
11432A4554Q223r74l766M249j1652m00j0120p908o986p675q762j3982J0036J1002
11418b4161N371O317j327n507p490q750j506J3731j535J0510k045k3319p066L721
11404d3056N311k34K201j0816o158J8986Q946M43j0251p909k239n150l837j1803
11390f5566j5362j1039m027N254M382m647J7586K4103P357Q076J2079J5157Q831
11377B184k689m805r218j0289o667l049K216j4342n659j585j9058j366M618J2856
11363e6853R88L560O788K3986K274q207q357O401k1595j7159r731m117o38l260
11349h5920j6561m275R37R987K0456J6400j1265j1784m759j0632j9020q130l752
11336a28318j7784j711K568p150J2583K377n637N44L254L966O637J2002O290K734
$$ plain form
11322 -107645 -121841 -129529 -139330 -150186 -149871 -141773 -143147 -148205 -148801 -155400 -161616 -141209 -109585 -87432
11308 -87432 -74844 -44286 -3888 26002 47579 55931 54614 37841 6220 -13023 -12700 -6498 -4913
11295 -4913 13606 30336 41025 77759 139302 213892 305832 405855 513229 603132 665558
11284 665558 683584 651214 600984 555505 520020 495608 493181 517269 568026 648494 727642 799149
11272 799149 872777 936054 993621 1087491 1224911 1408662 1611866 1825715 2054257 2305535
11262 2305535 2613453 3031277 3633025 4498647 5753990 7623193 10442916 14652889 20629409
11253 20629409 28317990 37077791 46070986 54418481 60425796 61517786 56490534 47403260
11245 47403260 37610744 29382018 23355223 19358053 17078663 16232422 16699664 18659439
$$ packed form
11322a07645j4196p688r801j0856L15Q098j374n058n96o599o216K0407L1624K2153
11308h7432J2588L0558M0398K9890K1577Q352j317j6773l1621j9243L23O202J585
11295d913J8519J6730J0689L6734O1543P4590R1940J00023J07374Q9903O2426
11284F65558J8026l2370n0230m5479l5485k4412k427K4088N0757Q0468P9148P1507
11272G99149P3628O3277N7567R3870J37420J83751K03204K13849K28542K51278
11262B305535L07918M17824O01748Q65622J255343J869203K819723M209973N976520
11253B0629409P688581Q759801Q993195Q347495O007315J091990n027252r087274
11245D7403260r792516q228726o026795l997170k279390q46241M67242J959775
$$ plain form
11237 18659439 22509849 28813629 37952045 49327911 60386933 67304262 68184282 63964110
11229 63964110 56838483 48245393 39068928 30394448 23239146 17954241 14264590 11693317
11221 11693317 9854822 8475179 7404535 6566025 5900482 5360712 4930235 4602582 4332985
11212 4332985 4122516 3972553 3892220 3830533 3797315 3785877 3738771 3655030 3527602 3381073
11202 3381073 3270300 3208935 3180556 3200817 3191583 3171328 3125425 3069298 3045352 3073409 3180565
11191 3180565 3378306 3688130 4097874 4637769 5315360 6179208 7299535 8847860 11108403
11182 11108403 14497345 19545916 26700088 35802988 45951176 55978991 64867493 71183679
11174 71183679 72608033 67397973 57014740 45235028 35207223 28051113 23476038 20953587
$$ packed form
11237A8659439L850410O303780R138416J1375866J1059022O917329Q80020m220172
11229F3964110p125627q593090r176465q674480p155302n284905l689651k571273
11221A1693317j838495j379643j070644q38510o65543n39770m30477l27653k69597
11212D332985k10469j49963q0333o1687l3218j1438m7106q3741j27428j46529
11202C381073j10773o1365k8379K0261r234k0255m5903n6127k3946K8057J07156
11191C180565J97741L09824M09744N39895O77591Q63848J120327J548325K260543
11182A1108403L388942N048571P154172R102900J0148188J0027815Q888502O316186
11174G1183679J424354n210060j0383233j1779712j0027805p156110m575075k522451
$$ plain form
11166 20953587 20107994 20812036 23308378 28045117 35495863 45875887 58609992 71410601
11158 71410601 80069385 81634432 76636947 67807294 57391689 46634163 36602354 28264904
11150 28264904 21996621 17565010 14469266 12232935 10560968 9280702 8247211 7391980
11142 7391980 6687162 6097514 5599778 5185235 4839537 4556988 4338548 4159689 4006359
11133 4006359 3859032 3729476 3577142 3391519 3195343 2998077 2810387 2640790 2493578
11124 2493578 2369113 2261573 2176012 2115029 2041583 1969966 1934999 1907041 1863797 1819823 1774382
11113 1774382 1721767 1668081 1601233 1529619 1477918 1432189 1376038 1315595 1259091 1216104 1191379
11102 1191379 1145190 1105421 1084273 1072617 1049430 1043240 1037189 1032937 1036311 1042563 1037393 1012604
$$ packed form
11166B0953587q45593P04042K496342M736739P450746J0380024J2734105J2800609
11158G1410601Q658784J565047m997485q829653j0415605j0757526j0031809q337450
11150B8264904o268283m431611l095744k236331j671967j280266j033491q55231
11142G391980p04818n89648m97736m14543l45698k82549k18440j78859j53330
11133D006359j47327j29556j52334j85623j96176j97266j87690j69597j47212
11124B493578j24465j07540q5561o0983p3446p1617l4967k7958m3244m3974m5441
11113A774382n2615n3686o6848p1614n1701m5729n6151o0443n6504m2987k4725
11102A191379m6189l9769k1148j1656k3187o190o051m252L374O252n170k4789
$$ plain form
11090 1012604 989611 989380 969208 938231 901409 878265 871434 853592 831443 809539 804791 798214
11078 798214 780366 773944 764536 767716 773847 757735 739714 718557 706280 691547 659857 645098
11066 645098 630331 632823 610367 585613 582222 575003 579059 570457 563535 551224 543058 536223 546320
11053 546320 519981 512254 506491 488982 485906 481118 483223 464488 461934 457042 451305 452660 464136
11040 464136 478854 479752 482332 474943 473279 478345 471885 472767 471556 478903 479937 464470 433093 403388
11026 403388 391005 381026 371314 371875 377610 365743 364753 375925 379338 385718 386028 381683 376299 387249
11012 387249 398934 387282 377625 372235 358193 350387 352612 333757 325288 320616 323015 316518 317776
10999 317776 328239 335407 344035 348757 339478 324959 312031 300507 293456 290034 279922 266505 262595
$$ packed form
11090A012604k2993k31k0172l0977l6822k3144o831j7842k2149k1904m748o577
11078G98214j7848o422r408L180O131j6112j8021k1157j2277j4733l1690j4759
11066F45098j4767K492k2456k4754l391p219M056q602o922j2311q166o835J0097
11053E46320k6339p727n763j7509l076m788K105j8735k554m892n737J355J1476
11040D64136J4718Q98K580p389j664N066o460Q82j211P347J034j5467l1377k9705
11026D03388j2383r979r712N61N735j1867r90J1172L413O380L10m345n384J0950
11012C87249J1685j1652r657n390j4042p806K225j8855q469m672K399o497J258
10999C17776J0463P168Q628M722r279j4519j2928j1524p051l422j0112j3417l910
$$ plain form
10986 262595 248553 242596 249639 231832 221461 219657 233837 248640 254260 235814 233841 246919
10974 246919 254903 261805 264187 267520 256071 249109 240181 224535 213697 205166 198576 195912 191706
10961 191706 196133 192828 203780 225727 234348 248458 268087 273063 267100 270058 282969 287806 304192
10948 304192 311078 304526 295371 288578 289984 285960 319312 367789 411800 472903 547142 633439 748800
10935 748800 907603 1121814 1429962 1844329 2417092 3223707 4301042 5547805 6754211
10926 6754211 7663801 8051980 7754459 6821284 5582676 4419076 3547527 2976021 2620555
10917 2620555 2435023 2359992 2389437 2565741 2911709 3493188 4328218 5378860 6373068 6967077
10907 6967077 7019799 6536429 5695356 4762346 3931360 3319492 2905794 2670502 2561371 2553517
$$ packed form
10986B62595j4042n957P043j7807j0371j804J4180J4803N620j8446j973J3078
10974B46919P984O902K382L333j1449o962q928j5646j0838q531o590k664m206
10961A91706M427l305J0952K1947Q621J4110J9629M976n963K958J2911M837J6386
10948C04192O886o552r155o793J406m024L3352M8477M4011O1103P4239Q6297J15361
10935G48800J58803K14211L08148M14367N72763Q06615J077335J246763J206406
10926F754211R09590L88179k97521r33175j238608j163600q71549n71506l55466
10917B620555j85532p5031K9445J76304L45968N81479Q35030J050642R94208N94009
10907F967077N2722m83370q41073r33010q30986o11868m13698k35292j09131p854
$$ plain form
10897 2553517 2662200 2918168 3300220 3868552 4691413 5898410 7632675 10118184 13450753
10888 13450753 17345337 21095885 23908481 25102291 24065232 20902790 16782594 13089033
10880 13089033 10426880 8709673 7677408 7147073 7005192 7234638 7894065 9159076 11220929
10871 11220929 14232755 17984556 21577573 23803148 24153613 22959097 21074860 19333911
10863 19333911 18159503 17379135 16564220 15307945 13543011 11657523 10102760 9093281
10855 9093281 8640248 8692536 9223765 10313554 12130001 14897303 18710820 23318050 28009450
10846 28009450 31868330 33948565 33397203 30229356 25608634 20970688 17157369 14351558
10838 14351558 12446857 11273623 10717187 10719806 11335757 12712800 15062747 18510285 22768815
$$ packed form
10897B553517J08683K55968L82052N68332Q22861J206997J734265K485509L332569
10888A3450753L894584L750548K812596J193810j037059l162442m120196l693561
10880A3089033k662153j717207j032265n30335j41881K29446O59427J265011K061853
10871A1220929L011826L751801L593017K225575L50465j194516j884237j740949
10863A9333911j174408p80368q14915j256275j764934j885488j554763j009479
10855I093281m53033N2288N31229J089789J816447K767302L813517M607230M691400
10846B8009450L858880K080235n51362l167847m620722m637946l813319k805811
10838A4351558j904701j173234n56436K619O15951J377043K349947L447538M258530
$$ plain form
10829 22768815 26808121 29503396 30669323 30985180 31524337 33027911 35441351 37744046
10821 37744046 38521627 36661168 32111303 26334607 21126379 17411792 15079590 13742104
10813 13742104 13122822 13151288 13881577 15473677 18107318 21901521 26749969 32110241 36662859
10804 36662859 38688949 37582290 34044051 29178030 24046003 19510945 16051030 13647147
10796 13647147 12051483 11068330 10608231 10666366 11259373 12400504 13914375 15501082 17007265
10787 17007265 18552475 20548499 23404756 27215136 31400589 34714538 35901301 34114757
10779 34114757 29519414 23734441 18595470 14941104 12620772 11251709 10567973 10416667
10771 10416667 10799485 11820760 13681593 16664836 20896345 25976063 30525480 32788814
$$ packed form
10829B2768815M039306K695275J165927L15857N39157J503574K413440K302695
10821C7744046P77581j860459m549865n776696n208228l714587k332202j337486
10813A3742104o19282K8466P30289J592100K633641L794203M848448N360272M552618
10804C6662859K026090j106659l538239m866021n132027m535058l459915k403883
10796A3647147j595664r83153m60099N8135N93007J141131J513871J586707J506183
10787A7007265J545210J996024K856257L810380M185453L313949J186763j786544
10779C4114757m595343n784973n138971l654366k320332j369063o83736j51306
10771A0416667L82818J021275J860833K983243M231509N079718M549417K263334
$$ plain form
10763 32788814 32191038 29319920 25080383 20410618 16125330 12755583 10351828 8703560
10755 8703560 7557531 6746290 6179419 5797473 5562053 5485976 5588041 5922609 6525647
10746 6525647 7467346 8775325 10351034 11853334 12842297 13023049 12255142 10715062 8898072
10737 8898072 7288753 6127922 5377359 4918479 4690391 4674159 4843824 5266971 6014834
10728 6014834 7132957 8631939 10292537 11580663 12023797 11552455 10372468 8814223
10720 8814223 7207515 5812137 4723628 3933137 3359876 2945895 2642043 2377431 2164457
10711 2164457 2005244 1875609 1769808 1689310 1611343 1545138 1479509 1439433 1400963 1344938 1294110
10700 1294110 1283308 1276110 1260383 1243684 1221452 1177732 1127931 1075370 1034744 1009746 976162
$$ packed form
10763C2788814n97776k871118m239537m669765m285288l369747k403755j648268
10755H703560j146029q11241n66871l81946k35420p6077J02065L34568O03038
10746F525647R41699J307979J575709J502300R88963J80752p67907j540080j816990
10737H898072j609319j160831p50563m58880k28088j6232J69665M23147P47863
10728F014834J118123J498982J660598J288126M43134m71342j179987j558245
10720H814223j606708j395378j088509p90491n73261m13981l03852k64612k12974
10711B164457j59213j29635j05801q0498p7967o6205o5629m0076l8470n6025n0828
10700A294110j0802p198j5727j6699k2232m3720m9801n2561m0626k4998l3584
$$ plain form
10689 976162 956129 938705 913169 891241 891478 902934 905420 877384 858019 862025 859111 841707
10677 841707 827825 817138 789334 757835 716599 696377 682092 669549 665528 654963 642411 646086
10665 646086 639761 627235 621211 619145 627177 623480 619266 614434 616921 614975 611408 592964 576318
10652 576318 554356 556798 558257 551780 558089 552427 545207 561588 567520 568143 562766 560967 564730 577868
10638 577868 579169 583704 593818 617094 631865 643196 666536 715016 772442 831545 905422 985460
10626 985460 1024641 997691 941398 875475 813415 751965 710718 662876 633966 618039 599068
10615 599068 581388 575477 560560 545190 530119 526876 528894 525130 512838 494865 485979 481038 483816
10602 483816 486425 474844 455396 461032 472016 463367 451756 434244 422226 426337 430488 430854 438310
$$ packed form
10689I76162k0033j7424k5536k1928K37J1456K486k8036j9365M006k914j7404
10677H41707j3882j0687k7804l1499m1236k0222j4285j2543m021j0565j2552L675
10665F46086o325j2526o024k066Q032l697m214m832K487j946l567j8444j6646
10652E76318k1962K442J459o477O309n662p220J6381N932O23n377j799L763J3138
10638E77868J301M535J0114K3276J4771J1331K3340M8480N7426N9103P3877Q0038
10626I85460L9181k6950n6293o5923o2060o1450m1247m7842k8910j5927j8971
10615E99068j7680n911j4917j5370j5071l243K018l764j2292j7973q886m941K778
10602D83816K609j1581j9448N636J0984q649j1611j7512j2018M111M151L66P456
$$ plain form
10589 438310 428782 431371 438039 438732 440032 447753 460759 457349 453017 447431 464867 473129 479949 482628
10575 482628 493791 507060 521954 536348 552963 568840 612871 647556 700066 782718 866537
10564 866537 977435 1114548 1291812 1470979 1601200 1652007 1641180 1544210 1399474 1249405
10554 1249405 1128209 1039345 957168 904056 890091 890374 896124 913502 894994 835783 785978 769574
10542 769574 760274 750845 717952 660786 612875 561850 506533 480217 453517 444394 444024 425037
10530 425037 425749 427011 439742 433111 425031 422856 411395 409065 411688 407310 383958 375586 377098 383023
10516 383023 392393 387499 361326 365405 379860 392959 404319 409910 418505 439075 448779 457466 486068
10503 486068 500825 515807 541525 575442 617235 681499 762703 865948 947725 1012921 1083029
$$ packed form
10589D38310r528K589O668O93J300P721J3006l410m332n586J7436Q262O820K679
10575D82628J1163J3269J4894J4394J6615J5877M4031L4685N2510Q2652Q3819
10564H66537J10898J37113J77264J79167J30221N0807j0827r6970j44736j50069
10554A249405j21196q8864q2177n3112j3965K83N750J7378j8508n9211m9805j6404
10542G69574r300r429l2893n7166m7911n1025n5317k6316k6700r123l70j8987
10530D25037P12J262J2731o631q080k175j1461k330K623m378k3352q372J512N925
10516C83023R370m894k6173M079J4455J3099J1360N591Q595K0570R704Q687K8602
10503D86068J4757J4982K5718L3917M1793O4264Q1204J03245Q1777O5196P0108
$$ plain form
10492 1083029 1134852 1167214 1174023 1138244 1113447 1134602 1150474 1169153 1212398 1277956 1346789
10481 1346789 1397817 1400450 1329782 1201481 1071367 968345 887214 845205 827779 802251 796933
10470 796933 782505 750102 722419 703571 707491 723306 748445 771539 798337 804140 831599 858255
10458 858255 881921 922593 964900 1005819 1070702 1158115 1260253 1373123 1493446 1637354 1823841
10447 1823841 2051128 2348461 2756383 3308593 4025443 4950386 6162790 7811772 10066128
10438 10066128 13312113 18195717 25702049 37043223 52774851 71215209 87546122
10431 87546122 95801283 92748601 80211862 63498937 47695927 35377392 26726995
10424 26726995 20856756 16769076 13752520 11474053 9744587 8430964 7426429 6655087
$$ packed form
10492A083029N1823L2362O809l5779k4797K1155J5872J8679M3245O5558O8833
10481A346789N1028K633p0668j28301j30114j03022q1131m2009j7426k5528n318
10470G96933j4428l2403k7683j8848L920J5815K5139K3094K6798N803K7459K6656
10458H58255K3666M0672M2307M0919O4883Q7413J02138J12870J20323J43908J86487
10447A823841K27287K97333M07922N52210P16850R24943J212404J648982K254356
10438A0066128L245985M883604P506332J1341174J5731628J8440358J6330913
10431H7546122Q255161l052682j2536739j6712925j5803010j2318535q650397
10424B6726995n870239m087680l016556k278467j729466j313623j004535p71342
$$ plain form
10416 6655087 6051832 5569830 5201277 4934167 4732247 4593455 4424980 4187165 3913146
10407 3913146 3648316 3423419 3231559 3047823 2881812 2757294 2692477 2662348 2651748 2622345
10397 2622345 2548102 2466716 2419566 2386776 2358358 2330975 2320211 2331357 2379248 2461228 2576028
10386 2576028 2707999 2849056 3017572 3192906 3396125 3660945 4040429 4565086 5270101
10377 5270101 6204723 7472364 9192552 11598461 15097438 20349410 28213239 39316948
10369 39316948 53126510 66953090 76364016 77806471 71472781 61446163 52721327 48741458
10361 48741458 50857285 58794143 70555011 81924559 87669521 84675456 73883846 59370557
10353 59370557 45327215 34144120 26163767 20698199 16928468 14234768 12228021 10706904
$$ packed form
10416F655087o03255m82002l68553k67110k01920j38792j68475k37815k74019
10407C913146k64830k24897j91860j83736j66011j24518o4817l0129j0600k9403
10397B622345p4243q1386m7150l2790k8418k7383j0764J1146M7891Q1980J14800
10386B576028J31971J41057J68516J75334K03219K64820L79484N24657P05015
10377E270101R34622J267641J720188K405909L498977N251972P863829J1103709
10369C9316948J3809562J3826580R410926J442455o333690j0026618q724836l979869
10361D8741458K115827P936858J1760868J1369548N744962k994065j0791610j4513289
10353E9370557j4043342j1183095p980353n465568l769731k693700k006747j521117
$$ plain form
10345 10706904 9524771 8556305 7722242 6997156 6348680 5785619 5340231 4978962 4654900
10336 4654900 4382513 4160734 3967752 3784782 3606309 3436461 3257105 3096945 2961698
10327 2961698 2819706 2697690 2611016 2523620 2453397 2418013 2380381 2356539 2352499 2369128 2389148
10316 2389148 2412499 2454155 2506987 2559407 2609962 2676459 2743485 2835021 2966290 3164604 3452746
10305 3452746 3844478 4385164 5114426 6085147 7439827 9355374 12139376 16345994 22684005
10296 22684005 31672568 42849437 54026522 61468119 62053886 55456659 44638867 33448983
10288 33448983 24430862 18145209 13998608 11214754 9230364 7760772 6671093 5846261
10280 5846261 5236928 4770662 4362084 3990707 3656828 3376893 3137539 2933255 2748391
$$ packed form
10345A0706904j182133r68466q34063p25086o48476n63061m45388l61269l24062
10336D654900k72387k21779j92982j82970j78473j69848j79356j60160j35247
10327B961698j41992j22016q6674q7396p0223l5384l7632k3842m040J6629K0020
10316B389148K3351M1656N2832N2420N0555O6497O7026R1536J31269J98314K88142
10305C452746L91732N40686P29262R70721J354680J915547K784002M206618O338011
10296B2684005Q988563J1176869J1177085P441597N85767o597227j0817792j1189884
10288C3448983r018121o285653m146601k783854j984390j469592j089679q24832
10280E846261o09333m66266m08578l71377l33879k79935k39354k04284j84864
$$ plain form
10271 2748391 2589320 2453441 2345609 2225617 2125768 2060014 1970383 1865362 1776817 1709340
10261 1709340 1635367 1562154 1516574 1481143 1432885 1393415 1366422 1371331 1364290 1335506 1317261 1302444
10249 1302444 1305445 1297485 1277299 1261129 1240455 1198904 1165073 1137108 1103272 1100240 1086510 1079305
10237 1079305 1054559 1030709 1014961 986794 968409 959654 967210 951110 939482 927169 910181 901606
10225 901606 891946 879617 864668 828587 809411 814969 814851 799230 789073 780349 778227 771363 774372
10212 774372 777634 769309 762437 759600 758832 756812 746758 743578 731987 724191 710264 701630 706822 705940
10198 705940 699922 685956 663600 656961 649545 640893 629189 614292 609363 618794 624885 623701 610842
10185 610842 602714 602157 604746 605392 596749 588540 587913 608712 611556 613043 626591 617901 614634 609871
$$ packed form
10271B748391j59071j35879j07832j19992r9849o5754q9631j05021q8545o7477
10261A709340p3973p3213m5580l5431m8258l9470k6993M909p041k8784j8245j4817
10249A302444L001p960k0186j6170k0674m1551l3831k7965l3836l032j3730p205
10237A079305k4746k3850j5748k8167j8385q755P556j6100j1628j2313j6988q575
10225I01606r660j2329j4949l6081j9176N558j18j5621j0157q724k122o864L009
10212G74372L262q325o872k837p68k020j0054l180j1591p796j3927q634N192q82
10198G05940o018j3966k2356o639p416q652j1704j4897m929R431O091j184j2859
10185F10842q128n57K589O46q643q209o27K0799K844J487J3548q690l267m763
$$ plain form
10171 609871 607923 611571 625838 622404 593589 566089 557227 561599 554724 566647 581722 593932 593012
10158 593012 594735 604881 625622 638490 643394 641960 663412 669560 662057 660973 659934 661736 648558
10145 648558 642975 651229 658724 664967 696300 737445 777203 835290 909809 988781 1063568 1097162
10133 1097162 1090551 1051255 994501 924221 868235 819245 773022 731174 696033 673430 657140
10122 657140 630600 610988 585964 582279 578048 560320 552945 556066 566995 562051 561722 559898 562745
10109 562745 563679 569656 585125 589423 584560 584623 594543 615589 640342 656617 655430 651119 652458 652829
10095 652829 656245 661917 664963 665371 668515 680248 687555 680603 680261 680642 674044 675263 683725 685663 690241
10080 690241 698505 723019 754214 800184 863352 936792 1030075 1152256 1304671 1460739 1578201
$$ packed form
10171F09871j948L648J4267l434k8815k7500q862M372o875J1923J5075J2210r20
10158E93012J723J0146K0741J2868M904j434K1452O148p503j084j039J802j3178
10145F48558n583Q254P495O243L1333M1145L9758N8087P4519P8972P4787L3594
10133A097162o611l9296n6754p0280n5986m8990m6223m1848l5141k2603j6290
10122F57140k6540j9612k5024l685m231j7728p375L121J0929m944l29j824K847
10109E62745R34N977J5469M298m863O3R920K1046K4753J6275j187m311J339L71
10095F52829L416N672L046M08L144J1733P307o952l42L81o598J219Q462J938M578
10080F90241Q264K4514L1195M5970O3168P3440R3283J22181J52415J56068J17462
$$ plain form
10069 1578201 1672788 1696321 1646331 1557391 1429444 1283243 1152373 1052604 983077 943515 921938
10058 921938 900191 861032 808203 762693 720500 687735 674711 653453 622467 607420 599078 588327
10046 588327 572180 557088 542761 529268 532975 527944 519285 517934 511325 500182 514035 527673
10034 527673 518077 512195 518504 520272 521558 530838 533495 536283 550859 552704 556320 554519 557446 591236
10020 591236 636581 675372 709479 728123 721501 688381 666248 695004 720980 738438 774989 811949
10008 811949 837110 847854 872835 913515 962089 978010 970747 920908 851376 789848 719804 667775
9996 667775 625419 572365 534185 525590 525876 511327 488695 486883 485528 481719 468682 466584 458097
9983 458097 466825 474816 477417 467254 458508 462106 451502 446850 446680 435665 432072 436706 437897 439938
$$ packed form
10069A578201R4587K3533m9990q8940j27947j46201j30870r9769o9527l9562k1577
10058I21938k1747l9159n2829m5510m2193l2765j3024k1258l0986j5047q342j0751
10046E88327j6147j5092j4327j3493L707n031q659j351o609j1143J3853J3638
10034E27673r596n882O309J768J286R280K657K788J4576J845L616j801K927L3790
10020E91236M5345L8791L4107J8644o622l3120k2133K8756K5976J7458L6551L6960
10008H11949K5161J0744K4981M0680M8574J5921p263m9839o9532o1528p0044n2029
9996F67775m2356n3054l8180q595K86j4549k2632j812j355l809j3037k098q487
9983D58097Q728P991K601j0163q746L598j0604m652j70j1015l593M634J191K041
$$ plain form
9969 439938 434536 414196 418303 437869 451838 456260 453505 467222 474919 473688 475942 479467 497357
9956 497357 515572 537120 571577 624697 682164 747493 806998 833968 823220 797663 791395 785654
9944 785654 783690 824153 872464 925579 963882 960603 915984 834049 742296 666757 609228 574275
9932 574275 539862 514313 496668 495844 491429 470921 459345 462979 456046 458978 448342 447980 446122
9919 446122 449296 448048 445735 456340 467040 441226 427361 430926 443772 449168 456314 457004 450269
9906 450269 455173 460198 446640 434020 432204 435040 429233 422660 416135 431818 432903 434551 438675 440098
9892 440098 452315 452496 452599 458142 460106 457549 440141 431912 441828 448637 469039 486117 503173 545639
9878 545639 577668 604070 630076 642337 662097 669154 660230 616020 561716 522009 499218 487422
$$ packed form
9969D39938n402k0340M107J9566J3969M422k755J3717P697j231K254L525J7890
9956D97357J8215K1548L4457N3120N7467O5329N9505K6970j0748k5557o268n741
9944G85654j964M0463M8311N3115L8303l279m4619q1935r1753p5539n7529l4953
9932E74275l4413k5549j7645q24m415k0508j1576L634o933K932j0636l62j858
9919D46122L174j248k313J0605J0700k5814j3865L565J2846N396P146O90o735
9906D50269M904N025j3558j2620j816K836n807o573o525J5683J085J648M124J423
9892D40098J2217J81J03N543J964k557j7408q229R916O809K0402J7078J7056M2466
9878E45639L2029K6402K6006J2261J9760P057q924m4210n4304l9707k2791j1796
$$ plain form
9866 487422 482001 472661 466813 463437 452211 475844 495388 504819 493311 476457 463295 455701 441087
9853 441087 440032 446371 444379 449580 446205 437344 427989 423953 409003 414018 409073 411919 416107 418463
9839 418463 433089 431980 429191 425815 420766 417822 421246 416670 432782 433078 437119 434557 438346 431611
9825 431611 433159 437332 434560 429845 432061 439990 439330 444171 450532 455256 460858 461714 461019 471668 467788
9810 467788 472470 474771 481427 495003 501936 499015 489958 496395 506907 518215 518992 513452 523731 511216
9796 511216 515936 524821 514459 498137 485320 472802 459470 456980 458678 447596 443623 451632 456816
9783 456816 442043 447093 470288 474594 476520 470067 460196 459492 465396 460514 453735 449277 452371 457697
9769 457697 469430 479140 472375 465744 472189 480301 477675 476301 488419 494731 518906 535697 546611
$$ packed form
9866D87422n421r340n848l376j1226K3633J9544R431j1508j6854j3162p594j4614
9853D41087j055O339j992N201l375q861r355m036j4950N015m945K846M188K356
9839D18463J4626j109k789l376n049k944L424m576J6112K96M041k562L789o735
9825D31611J548M173k772m715K216P929o60M841O361M724N602Q56o95J0649l880
9810D67788M682K301O656J3576O933k921r057O437J0512J1308P77n540J0279j2515
9796E11216M720Q885j0362j6322j2817j2518j3332k490J698j1082l973Q009N184
9783D56816j4773N050K3195M306J926o453r871p04N904m882o779m458L094N326
9769D57697J1733R710o765o631O445Q112k626j374J2118O312K4175J6791J0914
$$ plain form
9756 546611 544708 532841 512635 486865 489298 489122 480755 476372 478201 492051 507927 543211 595217
9743 595217 661317 719735 771815 804003 793579 753406 686703 625012 598933 566696 537397 528847
9731 528847 536135 544170 534994 528642 555597 591907 615342 657412 705874 739391 743616 731223 696537
9718 696537 642699 605271 594756 585507 573650 572342 575380 589634 622783 660535 724679 809386
9706 809386 893233 991410 1055258 1050398 971129 869715 779289 740757 723740 697528 666155 646984
9694 646984 637857 641512 661561 677723 694782 714108 734815 786220 858098 967271 1124568 1252033
9682 1252033 1226096 1096706 943189 840414 802855 797491 790790 783422 764321 724332 677841
9671 677841 645763 639898 635495 634373 627583 622020 621198 637122 651708 663207 671613 659903 653341
$$ packed form
9756E46611j903j1867k0206k5770K433j76q367m383J829J3850J5876L5284N2006
9743E95217O6100N8418N2080L2188j0424m0173o6703o1691k6079l2237k9299q550
9731E28847P288Q035r176o352K6955L6310K3435M2070M8462L3517M225j2393l4686
9718F96537n3838l7428j0515r249j1857j308L038J4254L3149L7752O4144Q4707
9706H09386Q3847R8177O3848m860p9269j01414r0426l8532j7017k6212l1373j9171
9694F46984r127L655K0049J6162J7059J9326K0707N1405P1878J09173J57297J27465
9682A252033k5937j29390j53517j02775l7559n364o701p368j9101l9989m6491
9671F77841l2078n865m403j122o790n563q22J5924J4586J1499Q406j1710o562
$$ plain form
9658 653341 645455 626884 613909 592515 595685 600740 600603 607203 613310 618326 613536 601781 604186 610164
9644 610164 619448 630597 627832 627395 625535 623394 627571 624182 618501 611048 614772 622902 621926 616479 607056
9629 607056 607296 607513 595132 590206 598196 605873 613644 616946 622311 624939 623425 629527 630016 616933 615236
9614 615236 607719 596619 615249 625508 632257 651750 645313 638962 642576 654047 655780 646938 650304
9601 650304 645097 649771 656190 654607 644673 640123 635238 640508 646613 641285 631858 631867 649973 658407 641160
9586 641160 654646 665822 655462 652592 654636 658205 672911 679123 692944 709450 711038 709337 702695
9573 702695 689444 687925 700694 705996 698281 699333 702595 698520 683579 675482 682955 691442 695931 707832
9559 707832 716441 714284 711150 703299 691803 702930 711170 709208 700963 699767 720282 732263 743744
$$ packed form
9658F53341p886j8571j2975k1394L170N055j37O600O107N016m790j1755K405N978
9644F10164R284J1149k765m37j860k141M177l389n681p453L724Q130r76n447r423
9629F07056K40K17j2381m926P990P677P771L302N365K628j514O102M89j3083j697
9614F15236p517j1100J8630J0259O749J9493o437o351L614J1471J733q842L366
9601F50304n207M674O419j583r934m550m885N270O105n328r427RJ8106Q434j7247
9586F41160J3486J1176j0360k870K044L569J4706O212J3821J6506J588j701o642
9573G02695j3251j519J2769N302p715J052L262m075j4941q097P473Q487M489J1901
9559G07832Q609k157l134p851j1496J1127Q240j962q245j196K0515J1981J1481
$$ plain form
9546 743744 743700 746446 751082 748169 750779 754646 761116 765953 765243 759647 757155 760087 753025 747886 766882
9531 766882 800597 826991 845626 853662 880725 904437 899401 882249 871039 858598 846729 850470
9519 850470 863188 890479 902629 901926 897712 899016 886755 874465 874313 861383 853341 860432 877432
9506 877432 910510 936542 951118 965447 945722 933145 935561 951009 966459 977047 991355 994945
9494 994945 975011 939542 913391 905659 919504 908695 907892 907781 906488 908983 913743 913634 916892 913304
9480 913304 905307 898528 911472 931029 929068 930145 939000 954968 967264 977751 1012897 1041132 1039805
9467 1039805 1023989 1009878 996362 982732 985140 990118 990947 1000863 997814 1004565 1004072 1000703 996275 1003529
9453 1003529 1028059 1033256 1026239 1025583 1045370 1053736 1058834 1072465 1070239 1070248 1079173 1088002 1089072 1083972
$$ packed form
9546G43744m4K746M636k913K610L867O470M837p10n596k492K932p062n139J8996
9531G66882L3715K6394J8635Q036K7063K3712n036j7152j1210j2441j1869L741
9519H50470J2718K7291J2150p03m214J304j2261j2290j52j2930q042P091J7000
9506H77432L3078K6032J4576J4329j9725j2577K416J5448J5450J0588J4308L590
9494I94945j9934l5469k6151p732J3845j0809q03j11j293K495M760j09L258l588
9480I13304p997o779J2944J9557j961J077Q855J5968J2296J0487L5146K8235j327
9467A039805j5816j4111j3516j3630K408M978Q29R916l049O751m93l369m428P254
9453A003529K4530N197p017o56J9787Q366N098J3631k226RQ925Q829J070n100
$$ plain form
9439 1083972 1087656 1084492 1081975 1094550 1092126 1106145 1131019 1133809 1136018 1151039 1164171 1161174 1182296
9426 1182296 1189851 1200565 1202173 1195579 1199483 1197036 1186431 1186363 1191632 1202039 1203017 1209416 1227782 1248197
9412 1248197 1260586 1266249 1271148 1273761 1283182 1298003 1303380 1304076 1315387 1320740 1322778 1327938 1325612 1336803
9398 1336803 1341677 1346933 1348896 1362249 1374967 1374979 1369507 1392875 1406521 1411500 1424971 1433065 1442139
9385 1442139 1440157 1447763 1455480 1466673 1470771 1469841 1482098 1507300 1531262 1537296 1541931 1541711 1549307 1551247
9371 1551247 1556585 1565267 1584707 1600282 1621949 1628772 1636198 1648747 1668705 1688443 1701542 1698337
9359 1698337 1699509 1706905 1721930 1728869 1743260 1769264 1792231 1794598 1813033 1834211 1832819 1828583 1845311
9346 1845311 1868052 1889528 1909546 1903969 1913710 1940881 1946327 1939426 1962048 1986102 1998090 2016977
$$ packed form
9439A083972L684l164k517J2575k424J4019K4874K790K209J5021J3132k997K1122
9426A182296P555J0714J608o594L904k447j0605o8N269J0407R78O399J8366K0415
9412A248197J2389N663M899K613R421J4821N377O96J1311N353K038N160k326J1191
9398A336803M874N256J963J3353J2718J2n472K3368J3646M979J3471Q094R074
9385A442139j982P606P717J1193M098r30J2257K5202K3962O034M635k20P596J940
9371A551247N338Q682J9440J5575K1667O823P426J2549J9958J9738J3099l205
9359A698337J172P396J5025O939J4391K6004K2967K367J8435K1178j392m236J6728
9346A845311K2741K1476K0018n577R741K7171N446o901K2622K4054J1988J8887
$$ plain form
9334 2016977 2040063 2056010 2062910 2073147 2078799 2095291 2117596 2137059 2151317 2180671 2192299 2196663
9322 2196663 2202954 2224406 2250553 2269868 2291325 2305933 2320912 2341080 2369706 2396478 2412960 2434672
9310 2434672 2460052 2476954 2492284 2508422 2539398 2553847 2563452 2591802 2620148 2641092 2647574 2671665
9298 2671665 2696833 2736649 2762071 2783874 2807389 2833921 2869919 2884371 2917216 2942036 2962001
9287 2962001 2982831 3006624 3037879 3054261 3081296 3120772 3153122 3186242 3203068 3227860 3265377
9276 3265377 3290325 3324545 3353689 3377097 3424401 3466681 3502063 3535907 3568567 3595571 3611491
9265 3611491 3626700 3656752 3704536 3751846 3792095 3829538 3871915 3922912 3957259 3993535 4036978
9254 4036978 4089786 4130504 4180459 4224468 4271561 4311090 4355001 4395179 4434185 4483207 4540080
$$ packed form
9334B016977K3086J5947O900J0237N652J6492K2305J9463J4258K9354J1628M364
9322B196663O291K1452K6147J9315K1457J4608J4979K0168K8626K6772J6482K1712
9310B434672K5380J6902J5330J6138L0976J4449R605K8350K8346K0944O482K4091
9298B671665K5168L9816K5422K1803K3515K6532L5998J4452L2845K4820J9965
9287B962001K0830K3793L1255J6382K7035L9476L2350L3120J6826K4792L7517
9276C265377K4948L4220K9144K3408M7304M2280L5382L3844L2660K7004J5920
9265C611491J5209L0052M7784M7310M0249L7443M2377N0997L4347L6276M3443
9254D036978N2808M0718M9955M4009M7093L9529M3911M0178L9006M9022N6873
$$ plain form
9243 4540080 4583258 4623068 4679085 4723566 4769399 4825246 4885630 4940716 5005311 5064751 5132988
9232 5132988 5180003 5216980 5273911 5339410 5393361 5448344 5513351 5564538 5634160 5699583 5768641
9221 5768641 5842891 5911428 5977603 6049487 6107227 6183100 6265393 6345568 6420579 6500675 6578730
9210 6578730 6656174 6731899 6812602 6892785 6974216 7050524 7130877 7218898 7286648 7369294 7462914
9199 7462914 7553259 7646199 7741535 7831797 7938327 8050262 8152035 8255813 8354317 8437766 8533577
9188 8533577 8652183 8766594 8856164 8955809 9055336 9157059 9263990 9382094 9490116 9597032
9178 9597032 9707694 9827718 9945571 10053869 10175432 10291967 10413336 10527405 10647159 10770592
9168 10770592 10895426 11010615 11122795 11254706 11374437 11485318 11586135 11707728 11837297
$$ packed form
9243D540080M3178L9810N6017M4481M5833N5847O0384N5086O4595N9440O8237
9232E132988M7015L6977N6931O5499N3951N4983O5007N1187O9622O5423O9058
9221E768641P4250O8537O6175P1884N7740P5873Q2293Q0175P5011Q0096P8055
9210F578730P7444P5725Q0703Q0183Q1431P6308Q0353Q8021O7750Q2646R3620
9199G462914R0345R2940R5336R0262J06530J11935J01773J03778R8504Q3449R5811
9188H533577J18606J14411Q9570R9645R9527J01723J06931J18104J08022J06916
9178I597032J10662J20024J17853J08298J21563J16535J21369J14069J19754J23433
9168A0770592J24834J15189J12180J31911J19731J10881J00817J21593J29569
$$ plain form
9159 11837297 11967616 12088963 12218811 12335089 12455318 12583431 12698275 12795436 12904275 13027726
9149 13027726 13138831 13244552 13350352 13448386 13543336 13644354 13747086 13853783 13946853 14028437
9139 14028437 14118122 14206623 14285691 14367731 14459180 14555970 14624133 14688876 14753633 14813142 14862490
9128 14862490 14918323 14956333 14991112 15017511 15055736 15097812 15141008 15169016 15187232 15211687 15230009
9117 15230009 15233597 15224439 15226778 15216733 15190092 15166747 15152865 15134857 15114378 15078371 15047157 15008036
9105 15008036 14950355 14879265 14820108 14777129 14703605 14623897 14549931 14477195 14396277 14320920 14254361
9094 14254361 14174275 14089271 14001635 13909542 13818174 13721286 13628882 13517246 13417117 13319542 13207226
9083 13207226 13097701 12981400 12865531 12755406 12629580 12512721 12405334 12287187 12168273
$$ packed form
9159A1837297J30319J21347J29848J16278J20229J28113J14844R7161J08839J23451
9149A3027726J11105J05721J05800R8034R4950J01018J02732J06697R3070Q1584
9139A4028437Q9685Q8501P9068Q2040R1449R6790O8163O4743O4757N9509M9348
9128A4862490N5833L8010L4779K6399L8225M2076M3196K8008J8216K4455J8322
9117A5230009L588r158K339j0045k6641k3345j3882j8008k0479l6007l1214l9121
9105A5008036n7681p1090n9157m2979p3524p9708p3966p2736q0918p5357o6559
9094A4254361q0086q5004q7636r2093r1368r6888r2404j11636j00129r7575j12316
9083A3207226j09525j16301j15869j10125j25826j16859j07387j18147j18914
$$ plain form
9074 12168273 12048752 11918690 11795685 11684679 11573437 11473061 11347371 11214526 11087459
9065 11087459 10965894 10845334 10739816 10629607 10517351 10395114 10271608 10147921 10019621
9056 10019621 9905363 9798418 9686252 9581249 9466402 9358806 9250166 9132518 9043164 8944119
9046 8944119 8844904 8737111 8635269 8519288 8421037 8341675 8245669 8141851 8043627 7957081 7879004
9035 7879004 7790241 7687756 7590734 7504506 7419547 7329479 7242089 7150745 7065292 6975209 6892310
9024 6892310 6818041 6739980 6640774 6556538 6483722 6406859 6333345 6268833 6194624 6128817 6077908
9013 6077908 6020752 5955021 5884985 5810227 5743136 5675438 5613875 5538496 5482416 5419147 5348491
9002 5348491 5284280 5222738 5147383 5081868 5046209 5006200 4938085 4870031 4828055 4781651 4730928
$$ packed form
9074A2168273j19521j30062j23005j11006j11242j00376j25690j32845j27067
9065A1087459j21565j20560j05518j10209j12256j22237j23506j23687j28300
9056A0019621j14258j06945j12166j05003j14847j07596j08640j17648q9354r9045
9046H944119r9215j07793j01842j15981r8251p9362r6006j03818r8224q6546p8077
9035G879004q8763j02485r7022q6228q4959r0068q7390r1344q5453r0083q2899
9024F892310p4269p8061r9206q4236p2816p6863p3514o4512p4209o5807n0909
9013F077908n7156o5731p0036p4758o7091o7698o1563p5379n6080o3269p0656
9002E348491o4211o1542p5355o5515l5659m0009o8115o8054m1976m6404n0723
$$ plain form
8991 4730928 4684457 4640297 4593281 4545954 4503332 4448623 4394672 4354654 4312351 4278911 4235557
8980 4235557 4181732 4140792 4100858 4057260 4002030 3951384 3919270 3889502 3843134 3816177 3790213
8969 3790213 3749042 3700490 3663947 3647299 3622417 3586501 3552653 3529294 3498261 3467729 3441093
8958 3441093 3395607 3343852 3313316 3284940 3252445 3227817 3192180 3157739 3116242 3088713 3064693
8947 3064693 3038704 3011523 2986755 2955323 2917723 2896355 2880057 2856131 2820877 2808468 2795944
8936 2795944 2773496 2737152 2700077 2680913 2648252 2625924 2626838 2618716 2605332 2582057 2550910 2533991
8924 2533991 2518144 2502236 2496520 2482138 2462480 2434191 2415444 2386358 2353955 2326867 2325631 2315804
8912 2315804 2297425 2268589 2244201 2229619 2212482 2192823 2180222 2165058 2154888 2137687 2130173 2121308
$$ packed form
8991D730928m6471m4160m7016m7327m2622n4709n3951m0018m2303l3440m3354
8980D235557n3825m0940l9934m3598n5230n0646l2114k9768m6368k6957k5964
8969C790213m1171m8552l6543j6648k4882l5916l3848k3359l1033l0532k6636
8958C441093m5486n1755l0536k8376l2495k4628l5637l4441m1497k7529k4020
8947C064693k5989k7181k4768l1432l7600k1368j6298k3926l5254j2409j2524
8936B795944k2448l6344l7075j9164l2661k2328R14q122j3384k3275l1147j6919
8924B533991j5847j5908n716j4382j9658k8289j8747k9086l2403k7088j236r827
8912B315804j8379k8836k4388j4582j7137j9659j2601j5164j0170j7201p514q865
$$ plain form
8900 2121308 2100808 2074384 2062712 2066966 2062851 2034213 1998861 1978047 1961949 1953671 1961321 1950270
8888 1950270 1943318 1940746 1915999 1902065 1900432 1885193 1866830 1866984 1860092 1843928 1837127 1845421 1833480
8875 1833480 1812431 1800729 1775452 1769312 1758184 1753903 1728609 1712394 1707982 1712718 1719383 1719599 1694981
8862 1694981 1687469 1673786 1655483 1638072 1636826 1645382 1639942 1623266 1598524 1590548 1582825 1570216 1557923
8849 1557923 1560104 1544581 1529007 1529505 1538424 1551477 1547812 1524328 1504129 1493024 1501421 1499908 1484601
8836 1484601 1472749 1469142 1459652 1450402 1436549 1424334 1422297 1414442 1402430 1394400 1389470 1378900 1375737
8823 1375737 1374684 1367004 1361686 1358501 1358116 1346453 1329598 1327550 1325733 1333593 1329526 1323899 1314372 1323997
8809 1323997 1339336 1356910 1390574 1404710 1392345 1378075 1354201 1337949 1336660 1323060 1324634 1304162
$$ packed form
8900B121308k0500k6424j1672M254m115k8638l5352k0814j6098q278P650j1051
8888A950270o952k572k4747j3934j633j5239j8363J54o892j6164o801Q294j1941
8875A833480k1049j1702k5277o140j1128m281k5294j6215m412M736O665K16k4618
8862A694981p512j3683j8303j7411j246Q556n440j6676k4742p976p723j2609j2293
8849A557923K181j5523j5574M98Q919J3053l665k3484k0199j1105Q397j513j5307
8836A484601j1852l607r490r250j3853j2215k037p855j2012q030m930j0570l163
8823A375737j053p680n318l185l85j1663j6855k048j817P860m067n627r527R625
8809A323997J5339J7574L3664J4136j2365j4270k3874j6252j289j3600J574k0472
$$ plain form
8797 1304162 1282978 1264750 1260686 1263171 1249996 1237878 1221165 1223208 1215518 1210756 1202866 1205058 1225631
8784 1225631 1245450 1267396 1269503 1242911 1231611 1231155 1222167 1200318 1187801 1188841 1204748 1207032 1219688
8771 1219688 1245324 1275196 1315327 1357885 1381095 1416271 1420866 1403131 1364900 1328275 1307910 1299697
8759 1299697 1318145 1343403 1345036 1330571 1289709 1259415 1219742 1185417 1149868 1129805 1121550 1096855
8747 1096855 1086709 1075246 1078976 1091960 1097531 1101991 1098835 1109812 1113017 1108788 1111581 1097230 1079071
8734 1079071 1046767 1032587 1038077 1042369 1043688 1050389 1052475 1058954 1081011 1099393 1135576 1152885 1141463
8721 1141463 1121667 1097161 1084068 1095796 1108962 1112338 1121323 1135310 1146559 1129091 1090982 1056396
8709 1056396 1023648 994880 981988 987216 979884 995945 1014622 1029169 1026876 1013732 988881 953118
$$ packed form
8797A304162k1184j8228m064K485j3175j2118j6713K043p690m762p890K192K0573
8784A225631J9819K1946K107k6592j1300m56q988k1849j2517J040J5907K284J2656
8771A219688K5636K9872M0131M2558K3210L5176M595j7735l8231l6625k0365q213
8759A299697J8448K5258J633j4465m0862l0294l9673l4325l5549k0063q255k4695
8747A096855j0146j1463L730J2984N571M460l156J0977L205m229K793j4351j8159
8734A079071l2304j4180N490M292J319O701K086O479K2057J8382L6183J7309j1422
8721A141463j9796k4506j3093J1728J3166L376Q985J3987J1249j7468l8109l4586
8709A056396l2748k8768j2892N228p332J6061J8677J4547k293j3144k4851l5763
$$ plain form
8697 953118 944164 937286 933013 927243 933132 923562 917686 912830 904690 908839 914621 923910 942244 956277
8683 956277 949825 942801 933573 911714 898989 917341 921935 923280 920113 912494 912781 930146 950112
8670 950112 947665 934066 926645 916350 909065 914180 924787 952413 978527 1015511 1030009 1013357
8658 1013357 987960 957353 919194 905002 883921 880165 868020 861986 868446 862424 868920 874178 879082
8645 879082 885562 885826 897953 908589 927778 950839 950893 943677 929085 909850 903958 907083 909839 909265
8631 909265 909208 909372 901219 896924 891793 886906 888302 893103 911794 927544 938815 941671 930266 922659
8617 922659 912139 901156 906143 902503 893008 888856 875892 871539 877569 870427 871744 874207 881475 890530
8603 890530 912432 918199 897680 871151 858214 865977 868568 868946 875043 875745 877957 879961 886685 895172
$$ packed form
8697I53118q954o878m273n770N889r570n876m856q140M149N782R289J8334J4033
8683I56277o452p024r228k1859j2725J8352M594J345l167p619K87J7365J9966
8670I50112k447j3599p421j0295p285N115J0607K7626K6114L6984J4498j6652
8658A013357k5397l0607l8159j4192k1081l756j2145o034O460o022O496N258M904
8645H79082O480K64J2127J0636J9189K3061N4p216j4592j9235n892L125K756n74
8631I09265n7J64q153m295n131m887J396M801J8691J5750J1271K856j1405p607
8617I22659j0520j0983M987l640r495m152j2964m353O030p142J317K463P268R055
8603H90530K1902N767k0519k6529j2937P763K591L78O097P02K212K004O724Q487
$$ plain form
8589 895172 906593 921456 922324 926053 915076 907966 926997 929700 933107 922736 929265 944182 945406
8576 945406 945785 951616 955475 968093 964216 956735 968821 991978 1011570 1017174 1029908 1057745 1080608
8563 1080608 1114398 1173988 1255834 1364235 1537884 1808655 2192817 2683026 3183012 3495152
8553 3495152 3417096 3029098 2505819 2039911 1714188 1498409 1356229 1250462 1182261 1144716
8543 1144716 1116639 1096786 1082864 1073611 1064903 1060043 1052633 1036671 1028148 1030705 1023310 1018326 1032301
8530 1032301 1048214 1058638 1059058 1073211 1099862 1129101 1162673 1187184 1231090 1314502 1433385 1607446
8518 1607446 1890974 2304880 2806394 3258076 3498658 3380071 2949061 2424265 1976139 1678288
8508 1678288 1468344 1328711 1249132 1199868 1162853 1125458 1106995 1102093 1104079 1106888 1112167 1099235
$$ packed form
8589H95172J1421J4863Q68L729j0977p110J9031K703L407j0371O529J4917J224
8576I45406L79N831L859J2618l877p481J2086K3157J9592N604J2734K7837K2863
8563A080608L3790N9590Q1846J08401J73649K70771L84162M90209M99986L12140
8553C495152p8056l87998n23279m65908l25723k15779j42180j05767o8201l7545
8543A144716k8077j9853j3922r253q708m860p410j5962q523K557p395m984J3975
8530A032301J5913J0424M20J4153K6651K9239L3572K4511M3906Q3412J18883J74061
8518A607446K83528M13906N01514M51682K40582j18587m31010n24796m48126k97851
8508A678288k09944j39633p9579m9264l7015l7395j8463m902J986K809N279j2932
$$ plain form
8496 1099235 1069667 1054941 1034894 1013207 991133 1001255 1014402 1000188 986870 980503 966885 964504
8484 964504 988765 994346 1008102 1023903 1040086 1045580 1057737 1077842 1104726 1149939 1193544 1215892
8472 1215892 1234835 1244787 1222859 1169761 1124047 1079023 1025647 1010438 985440 964134 965851 973188
8460 973188 974477 975813 989216 1009584 1027056 1043944 1052425 1043192 1031204 1019945 1006807 993333
8448 993333 990272 978451 958987 973434 989323 1001714 1013722 1018379 1023304 1036746 1044421 1048027 1053211
8435 1053211 1067587 1092356 1108215 1149770 1203582 1243242 1257082 1255975 1234350 1200442 1161608 1126710
8423 1126710 1082613 1072058 1084698 1100297 1132525 1155026 1158639 1152966 1173885 1211310 1245717 1280192
8411 1280192 1284830 1246426 1188066 1142389 1103129 1072570 1045423 1030663 1022111 1009267 1013405 1031866
$$ packed form
8496A099235k9568j4726k0047k1687k2074J0122J3147j4214j3318o367j3618k381
8484I64504K4261N581J3756J5801J6183N494J2157K0105K6884M5213M3605K2348
8472A215892J8943R952k1928n3098m5714m5024n3376j5209k4998k1306J717P337
8460I73188J289J336J3403K0368J7472J6888Q481r233j1988j1259j3138j3474
8448I93333l061j1821j9464J4447J5889J2391J2008M657M925J3442P675L606N184
8435A053211J4376K4769J5859M1555N3812L9660J3840j107k1625l3908l8834l4898
8423A126710m4097j0555J2640J5599L2228K2501L613n673K0919L7425L4407L4475
8411A280192M638l8404n8360m5677l9260l0559k7147j4760q552j2844M138J8461
$$ plain form
8399 1031866 1047657 1052360 1055691 1051951 1049963 1049110 1051757 1051685 1051309 1063943 1072951 1066679 1056195 1065854
8385 1065854 1081756 1103629 1135987 1159322 1195641 1253262 1298173 1347417 1399527 1425361 1457768
8374 1457768 1501017 1523204 1508461 1466571 1401371 1328857 1280024 1232120 1206523 1208197 1198290 1197081
8362 1197081 1218361 1247667 1292896 1319479 1348635 1382107 1409857 1426298 1450570 1478431 1528024
8351 1528024 1584187 1653526 1751200 1879148 2033627 2199460 2360481 2434607 2437803 2369502 2238694
8340 2238694 2101147 1985729 1921661 1885345 1855222 1842526 1846999 1849627 1829189 1797953 1773500
8329 1773500 1747111 1758420 1819691 1935464 2096049 2324091 2633672 3073094 3668379 4364801
8319 4364801 5036417 5430951 5397967 4972432 4390438 3832275 3391534 3084659 2901939 2832293
$$ packed form
8399A031866J5791M703L331l740j988q53K647p2l76J2634R008o272j0484R659
8385A065854J5902K1873L2358K3335L6319N7621M4911M9244N2110K5834L2407
8374A457768M3249K2187j4743m1890o5200p2514m8833m7904k5597J674r907j209
8362A197081K1280K9306M5229K6583K9156L3472K7750J6441K4272K7861M9593
8351A528024N6163O9339R7674J27948J54479J65833J61021P4126L196o8301j30808
8340B238694j37547j15418o4068l6316l0123j2696M473K628k0438l1236k4453
8329A773500k6389J1309O1271J15773J60585K28042L09581M39422N95285O96422
8319D364801O71616L94534l2984m25535n81994n58163m40741l06875j82720o9646
$$ plain form
8309 2832293 2846648 2915022 3017223 3088914 3093206 3027366 2905035 2775625 2647420 2539440 2436551
8298 2436551 2341205 2287079 2255107 2264392 2288090 2319394 2354262 2414817 2539904 2718580 2926463
8287 2926463 3151809 3379438 3670167 4093033 4696128 5424502 6106397 6491246 6537500 6410367
8277 6410367 6317383 6320257 6259109 6001765 5501282 4859453 4230387 3707111 3296761 2988297
8267 2988297 2754524 2572172 2428649 2336347 2281383 2263059 2281236 2298458 2296834 2288506 2275573
8256 2275573 2252206 2224393 2201682 2203788 2220494 2248858 2308621 2390831 2483623 2554490 2532135 2465975
8244 2465975 2414510 2387921 2413210 2525425 2719565 3009819 3416061 3935335 4518960 5045046
8234 5045046 5337958 5275458 4902861 4378990 3850901 3424176 3140812 2940832 2814021 2728040
$$ packed form
8309B832293J4355O8374J02201P1691M292o5840j22331j29410j28205j07980j02889
8298B436551r5346n4126l1972R285K3698L1304L4868O0555J25087J78676K07883
8287B926463K25346K27629K90729M22866O03095P28374O81895L84849M6254j27133
8277F410367r2984K874o1148k57344n00483o41829o29066n23276m10350l08464
8267B988297k33773j82352j43523r2302n4964j8324J8177J7222j624q328j2933
8256B275573k3367k7813k2711K106J6706K8364N9763Q2210R2792P0867k2355o6160
8244B465975n1465k6589K5289J12215J94140K90254M06242N19274N83625N26086
8234E045046K92912o2500l72597n23871n28089m26725k83364j99980j26811q5981
$$ plain form
8224 2728040 2672407 2643878 2622084 2628392 2626138 2611334 2625039 2650595 2682753 2713744 2742302 2786865
8212 2786865 2826454 2870030 2929365 2975821 3022957 3088370 3150612 3221515 3306501 3450812 3620424
8201 3620424 3777215 3902192 3993180 4063331 4122981 4208486 4359911 4577200 4818919 5066898
8191 5066898 5297877 5529029 5794439 6101286 6462800 6865905 7315996 7812356 8357701 8997747
8181 8997747 9813191 10823584 12047609 13469216 15030490 16687855 18543726 20822934
8173 20822934 23754445 27472311 31973958 37373897 44146488 53251137 66280955 85920893
8165 85920893 116539565 164385666 236160148 332441191 433850016 498066996 490268902
8158 490268902 415632817 313125566 221781704 156948545 115038436 88017470 70024846
$$ packed form
8224B728040n5633k8529k1794O308k254j4804J3705K5556L2158L0991K8558M4563
8212B786865L9589M3576N9335M6456M7136O5413O2242P0903Q4986J44311J69612
8201C620424J56791J24977R0988P0151N9650Q5505J51425K17289K41719K47979
8191E066898K30979K31152K65410L06847L61514M03105M50091M96360N45345O40046
8181H997747Q15444J010393J224025J421607J561274J657365J855871K279208
8173B0822934K931511L717866M501647N399939O772591R104649J3029818J9639938
8165H5920893L0618672M7846101P1774482R6281043J01408825O4216980p798094
8158D90268902p4636085j02507251r1343862o4833159m1910109k7020966j7992624
$$ plain form
8151 70024846 57696953 49118656 43041999 38664545 35484505 33179285 31371065 29773216
8143 29773216 28362044 27250031 26448778 25870956 25415662 25027841 24775276 24866322 25521127
8134 25521127 26855119 28845610 31565239 35139625 39834770 46152935 55005838 68012036
8126 68012036 87896167 118954027 167317210 239166080 333570700 429498054 485280241
8119 485280241 469580327 391525060 290928703 204287145 143914732 105071972 79923233
8112 79923233 63032755 51339585 43053955 37021353 32550707 29167037 26496516 24195641
8104 24195641 22022698 19965818 18072533 16334001 14687085 13170333 11842497 10704717
8096 10704717 9729247 8903791 8205491 7617507 7084140 6576669 6104604 5665332 5295043
$$ packed form
8151G0024846j2327893q578297o076657m377454l180040k305220j808220j597849
8143B9773216j411172j112013q01253n77822m55294l87821k52565R1046O54805
8134B5521127J333992J990491K719629L574386M695145O318165Q852903J3006198
8126F8012036J9884131L1057860M8363183P1848870R4404620R5927354N5782187
8119D85280241j5699914p8055267j00596357q6641558o0372413l8842760k5148739
8112G9923233j6890478j1693170q285630o032602m470646l383670k670521k300875
8104B4195641k172943k056880j893285j738532j646916j516752j327836j137780
8096A0704717r75470q25456o98300n87984n33367n07471m72065m39272l70289
$$ plain form
8087 5295043 4993229 4734341 4500752 4302646 4111283 3920074 3712566 3480399 3262269 3054599
8077 3054599 2864436 2709394 2599105 2498619 2390136 2281286 2174608 2083735 2010170 1921235
8067 1921235 1835590 1755728 1683987 1633805 1586855 1524470 1474815 1430536 1395719 1361269 1344083
8056 1344083 1313103 1275393 1238788 1201665 1155195 1120247 1085016 1050357 1020072 1006759 1020187
8045 1020187 1031073 1023727 1010617 993760 982549 975407 979277 994184 1008381 1012253 994328 935267
8033 935267 865312 800243 733527 657637 581163 510148 467615 443107 425079 411888 408611 411230
8021 411230 410665 411291 408662 400176 373198 354957 337287 326591 308807 299210 281685 258055 258459
8008 258459 271728 291363 298906 290993 306033 348263 371361 384898 405777 417755 437477 463801
$$ packed form
8087E295043l01814k58888k33589j98106j91363j91209k07508k32167k18130k07670
8077C054599j90163j55042j10289j00486j08483j08850j06678r0873p3565q8935
8067A921235q5645p9862p1741n0182m6950o2385m9655m4279l4817l4450j7186
8056A344083l0980l7710l6605l7123m6470l4948l5231l4659l0285j3313J3428
8045A020187J0886p346j3110j6857j1211p142L870J4907J4197L872j7925n9061
8033I35267o9955o5069o6716p5890p6474p1015m2533k4508j8028j3191l277K619
8021D11230n65O26k629q486k6978j8241j7670j0696j7784r597j7525k3630M04
8008B58459J3269J9635P543p913J5040M2230K3098J3537K0879J1978J9722K6324
$$ plain form
7996 463801 478050 482320 455780 417603 381365 336252 283618 227336 188028 154879 141670 146986
7984 146986 142909 132552 129566 136300 149584 148239 145524 135641 131529 125686 127048 133303 133143 117393
7970 117393 88311 63508 49413 38064 29443 21174 9516 4902 5869 31680 59905 82903 98331
7957 98331 126565 149338 152471 145548 139930 129190 121766 114904 89380 65660 53863 43246 33931
7944 33931 27095 22579 15191 26870 42230 56446 73209 79770 73382 74208 81333 99274 110113
7931 110113 107619 87866 65053 40144 25532 3835 -21419 -25264 -24410 -17987 -9905 21394 59883
7918 59883 87568 103269 112547 107651 114072 103188 102948 109293 90792 80911 78377 84480 84694 66003
7904 66003 61175 57630 53086 59460 62688 61167 53434 22730 6386 21273 49095 63377 74675
$$ packed form
7996D63801J4249M270k6540l8177l6238m5113n2634n6282l9308l3149j3209N316
7984A46986m077j0357k986O734J3284j345k715r883m112n843J362O255j60j5750
7970A17393k9082k4803j4095j1349q621q269j1658m614R67K5811K8225K2998J5428
7957I8331K8234K2773L133o923n618j0740p424o862k5524k3720j1797j0617r315
7944C3931o836m516p388J1679J5360J4216J6763O561o388Q26P125J7941J0839
7931A10113k494j9753k2813k4909j4612k1697k5254l845Q54O423Q082L1299L8489
7918E9883K7685J5701R278m896O421j0884k40O345j8501r881k534O103K14j8691
7904F6003m828l545m544O374L228j521p733l0704j6344J4887K7822J4282J1298
$$ plain form
7891 74675 67942 76732 81670 83504 80218 85084 91230 86340 74941 71508 73488 73665 82275 92700
7877 92700 100605 109385 126504 140173 151765 144912 141370 145977 142181 138115 130518 141823 140861 132563
7863 132563 139714 129871 119867 109139 116016 130735 133460 119690 111077 100784 79714 69948 65309
7850 65309 56318 42724 41319 27537 3861 -13447 -3867 10376 8797 16006 20173 13742 3813
7837 3813 12291 17144 11982 12743 29555 33637 44638 49727 64229 75660 60127 51865 58057 68113
7823 68113 76352 87634 96836 118369 130694 136363 121272 99297 85839 64960 34008 31983 35954
7810 35954 26193 29284 22022 15644 7828 6826 602 6740 2483 -1941 1773 13670 20775 24394
7796 24394 10268 198 1793 14137 21809 36613 33264 32449 44029 48221 57415 54383 66308
$$ packed form
7891G4675o733Q790M938J834l286M866O146m890j1399l433J980J77Q610J0425
7877I2700P905Q780J7119J3669J1592o853l542M607l796m066p597J1305r62q298
7863A32563P151r843j0004j0728O877J4719K725j3770q613j0293k1070r766m639
7850F5309q991j3594j405j3782k3676j7308R580J4243j579P209M167o431r929
7837C813Q478M853n162P61J6812M082J1001N089J4502J1431j5533q262O192J0056
7823F8113Q239J1282R202K1533J2325N669j5091k1975j3458k0879l0952k025L971
7810C5954r761L091p262o378p816j002o224O138m257m424L714J1897P105L619
7796B4394j4126j0070J595J2344P672J4804l349q15J1580M192R194l032J1925
$$ plain form
7783 66308 75766 75333 78159 71890 67859 70451 87791 99012 107905 124370 125457 143912 175793 217324
7769 217324 258747 316454 415683 541941 696035 948225 1325567 1827276 2336019 2614369
7759 2614369 2507605 2104234 1593152 1137220 815472 613877 475693 376772 300090 248033
7749 248033 225302 212772 197125 175030 155672 152964 146773 133464 132443 134733 130501 128198 112269
7736 112269 123832 122061 140869 175498 191439 205407 222008 257229 316680 399698 519168 707691
7724 707691 979484 1380199 1861513 2317513 2536237 2380575 1945891 1437186 1017299 723275
7714 723275 529830 400730 317925 256066 209410 177148 156946 141396 110734 90307 78201
7703 78201 66757 57931 48670 46558 45810 40955 31640 37142 36160 17937 19233 38012 35505 31961
$$ packed form
7783F6308R458m33K826o269m031K592J7340J1221Q893J6465J087J8455L1881M1531
7769B17324M1423N7707R9229J26258J54094K52190L77342N01709N08743K78350
7759B614369j06764m03371n11082m55932l21748k01595j38184r8921p6682n2057
7749B48033k2731j2530j5647k2095j9358k708o191j3309j021K290m232k303j5929
7736A12269J1563j771J8808L4629J5941J3968J6601L5221N9451Q3018J19470J88523
7724G07691K71793M00715M81314M56000K18724j55662m34684n08705m19887k94024
7714G23275j93445j29100q2805o1859m6656l2262k0202j5550l0662k0427j2106
7703G8201j1444q826r261k112p48m855r315N502r82j8223J296J8779k507l544
$$ plain form
7689 31961 23323 32214 33454 29676 23981 21659 4380 -6337 -5545 6221 4413 -16334 -30068 -33412
7675 -33412 -22140 -23213 -20808 -9873 -9149 -6948 1712 4601 13729 8456 2375 763 6681 4765
7661 4765 -3347 -19630 -26655 -23810 -17148 -16732 -24863 -18921 -14554 -9628 -5859 -22669 -27194 -24881 -20586
7646 -20586 -13296 -9506 -4451 275 -7575 -14470 -14272 -18511 -24073 -16715 -10599 -11674 -9970 -2625 -4151
7631 -4151 2217 6075 -7354 -9009 -10567 -10005 -20397 -17130 -12754 4236 11619 2389 12437 -4343
7617 -4343 -27806 -39412 -27778 -1047 7154 -7664 -22737 -14355 -11175 -26964 -35188 -12453 -7175
7604 -7175 -6803 -11640 -13270 -7336 -4293 -5900 -9551 -6257 4470 11920 26150 26554 23491 16310 20705
7589 20705 6432 -8742 10503 18128 12277 -466 -8874 -7255 -8866 -15627 -11849 -10030 -9830 -12822
$$ packed form
7689C1961q638Q891J240l778n695k322j7279j0717P92J1766j808k0747j3734l344
7675c3412J1272j073K405J0935P24K201Q660K889R128n273o081j612N918j916
7661D765q112j6283p025K845O662M16q131N942M367M926L769j6810m525K313M295
7646b0586P290L790N055M726p850o895J98m239n562P358O116j075J704P345j526
7631d151O368L858j3429j655j558N62j0392L267M376J6990P383r230J0048j6780
7617d343k3463j1606J1634K6731Q201j4818j5073Q382L180j5789q224K2735N278
7604g175L72m837j630N934L043j607l651L294J0727P450J4230M04l063p181M395
7589B0705j4273j5174J9245P625n851j2743q408J619j611o761L778J819K00k992
$$ plain form
7575 -12822 -5654 3640 -6990 -7331 -7103 -1005 -2682 -7355 -2886 11704 16733 9471 -1581 -15075
7561 -15075 -14845 -3913 827 -6603 -1909 -12942 -21314 -15881 -17876 -30356 -28050 -247 16260 9609
7547 9609 -3712 -11903 -18894 -24317 -26499 -12280 -8228 -2169 8458 351 -5023 -10215 -14187 -12570
7533 -12570 -12769 -6495 -18157 -27166 -16241 -11577 -16026 -15244 -25048 -17892 -14719 -10759 -14307 583
7519 583 12225 7069 5179 -3767 -6872 -10437 -1718 7875 -2426 -11864 -13245 -19710 -20985 -17157 -19967
7504 -19967 -16373 -11626 -17187 -10915 -14529 -21421 -22937 -4282 -2255 -5329 -12349 -3614 4482 -2618
7490 -2618 -16456 -18045 -8748 89 2196 625 -7913 -28632 -33923 -31949 -33718 -30882 -23233 -23483 -28583
7475 -28583 -23404 -23613 -25403 -22247 -8245 -1086 4438 -3307 -4495 -7453 -24513 -39146 -18165 -16374
$$ packed form
7575a2822P168R294j0630l41K28O098j677m673M469J4590N029p262j1052j3494
7561a5075K30J0932M740p430M694j1033q372N433j995j2480K306K7803J6507o651
7547I609j3321q191o991n423k182J4219M052O059J0627q107n374n192l972J617
7533a2570j99O274j1662r009J0925M664m449P82r804P156L173L960l548J4890
7519E83J1642n156j890q946l105l565Q719R593j0301r438j381o465j275L828k810
7504a9967L594M747n561O272l614o892j516J8655K027l074p020Q735Q096p100
7490b618j3838j589R297Q837K107j571q538k0719n291J974j769K836P649k50n100
7475b8583N179k09j790L156J4002P159N524p745j188k958j7060j4633K0981J791
$$ plain form
7461 -16374 -22657 -15922 -5651 -6777 -17260 -24849 -7327 983 -1538 -13411 -24682 -21315 -12144
7448 -12144 -7750 4010 10135 -5115 -16942 -11301 -12462 -16737 -12529 -6305 5803 8463 -10421
7435 -10421 -8273 5957 11865 10586 3159 7121 9187 1167 -6563 -16458 -10165 9963 8899 2842
7421 2842 377 6983 9893 12730 2751 -10090 -19491 -8269 -9343 -20965 -17613 1934 1906 11524
7407 11524 15631 5015 -1286 6380 -2490 -11055 -1724 -10712 -25199 -39018 -36106 -32013 -13975 -13069
7393 -13069 -16356 -6018 -11855 -26116 -25657 -21549 -13333 -1627 -1572 -3452 7520 13277 9082 -5148
7379 -5148 -10940 -13424 -11630 -14688 126 5767 6491 5585 14235 16680 14707 8009 3225 2440 -5056
7364 -5056 -4417 -6586 -7182 -1346 981 2443 -2462 -5955 3331 9801 19589 10412 -6600 -18209 -19132
$$ packed form
7461a6374o283O735J0271j126j0483p589J7522Q310k521j1873j1271L367R171
7448a2144M394J1760O125j5250j1827N641j161m275M208O224J2108K660j8884
7435a0421K148J4230N908j279p427L962K066q020p730r895O293K0128j064o057
7421B842k465O606K910K837r979j2841r401J1222j074j1622L352J9547k8R618
7407A1524M107j0616o301P666q870q565R331q988j4487j3819K912M093J8038R06
7393a3069l287J0338n837j4261M59M108Q216J1706N5j880J0972N757m195j4230
7379e148n792k484J794l058J4814N641P24r06Q650K445j973o698m784p85p496
7364e056O39k169n96N836K327J462m905l493R286O470R788r177j7012j1609r23
$$ plain form
7349 -19132 -18589 -12800 -8091 -12513 5387 23658 21377 5969 2077 -3147 -7661 -4609 1661 4605
7335 4605 9000 3828 -96 2538 -1077 -6727 -12709 -9703 -7646 -15258 -27053 -26108 -20052 -13081 -15784
7320 -15784 -21956 -28601 -21095 -20971 -18619 -5353 -2460 -1246 -3137 -18248 -28485 -22975 -19145 -15957
7306 -15957 -24425 -19606 -8281 -5169 -10327 -9677 -10468 -8952 -8084 4091 10600 -12225 -14998 -13789 1576
7291 1576 4816 214 -1408 -1573 8422 8714 9208 6486 -10621 -6925 -7409 -22807 -24430 -17269 -13128
7276 -13128 -17983 -13711 380 -3240 -14843 -2688 -8662 -24846 -13177 -5244 -7219 -4445 -10324
7263 -10324 -10049 -10194 -16558 -10315 -6498 -14015 -9966 -3328 -3659 -3520 -50 5640 -1313 -6963 -14900 -13897
7247 -13897 -6292 -16019 -8758 1376 -2372 -14977 -21643 -13194 -12919 -509 9741 -5575 -8962 -5247
$$ packed form
7349a9132N43N789M709m422J7900J8271k281j5408l892n224m514L052O270K944
7335D605M395n172l924K634l615n650n982L006K057p612j1795R45O056O971k703
7320a5784o172o645P506J24K352J3266K893J214j891j5111j0237N510L830L188
7306a5957q468M819J1325L112n158O50p91J516Q68J2175O509k2825k773J209J5365
7291A576L240m602j622j65R995K92M94k722j7107L696m84j5398j623P161M141
7276a3128m855M272J4091l620j1603J2155n974j6184J1669P933j975K774n879
7263a0324K75j45o364O243L817p517M049O638l31J39L470N690o953n650p937J003
7247a3897P605r727P261J0134l748j2605o666Q449K75J2410J0250j5316l387L715
$$ plain form
7233 -5247 9713 19045 18248 22125 18888 13516 12829 6303 310 3826 2586 -14587 -25024 -23693 -35275
7218 -35275 -45381 -38160 -24876 -27926 -16622 -19931 -18355 -21353 -44301 -39581 -30704 -23791 -11402
7205 -11402 -10775 -17272 -11145 -13018 -21062 -20208 -11959 -9078 -10815 -7980 -6545 -8458 -9799 -5031 1014
7190 1014 -1926 -9544 695 -4164 -11090 -7931 -11220 -1657 15344 25023 16642 -9021 -12642 -18680
7176 -18680 -27146 -23916 -11616 -13518 -13805 -16306 -25894 -27337 -26243 -33832 -12250 -5012 -1368 -13482
7162 -13482 -14239 5530 17629 19152 13857 20513 22588 5953 1672 12345 11288 -468 -6199 -3659
7148 -3659 -17075 -9020 1678 -5637 -4601 -3229 -7263 -9756 1978 97 -10637 -25568 -20670 -22394
7134 -22394 -23954 -31914 -18225 -15213 -9609 -6446 -4926 -8912 80 -4578 1227 -3367 -13328 -12718 -3227
$$ packed form
7233e247J4960R332p97L877l237n372o87o526n993L516j240j7173j0437J331j1582
7218c5275j0106P221J3284l050J1304l309J576k998k2948M720Q877O913J2389
7205a1402O27o497O127j873q044Q54Q249K881j737K835J435j913j341M768O045
7190A014k940p618J0239m859o926L159l289R563J7001R679q381k5663l621o038
7176a8680q466L230J2300j902k87k501r588j443J094p589K1582P238L644j2114
7162a3482p57J9769J2099J523n295O656K075j6635m281J0673j057j1756n731K540
7148c659j3416Q055J0698p315J036J372m034k493J1734j881j0734j4931M898j724
7134b2394j560p960J3689L012N604L163J520l986Q992m658N805m594r961O10R491
$$ plain form
7119 -3227 -418 4532 2434 516 1372 -7432 -22352 -33150 -20519 -5718 -9804 -843 -9633 -21955
7105 -21955 -12353 -3755 1674 6943 5735 1837 -110 7349 5056 -9268 -11464 -10641 -8325 -18406
7091 -18406 -7271 -2868 3070 -6298 -15488 -14220 -24793 -28454 -9706 -2974 -6859 -4568 -11588 -11259
7077 -11259 -5091 -7919 -19373 -37702 -32666 -11761 -10758 -9941 -24023 -38034 -27757 -20911 -15812
7064 -15812 -4484 1669 -8801 -10262 -10811 -6661 2682 2180 -1500 -8249 -2384 -4694 -7848 -914 14654
7049 14654 13272 6081 17919 6719 6204 10930 9885 -3751 -6838 -7820 -17633 -30186 -30665 -27071
7035 -27071 -20700 -21784 -35179 -34553 -22089 -1656 2267 3292 -12782 -15892 -1779 -8630 -2570 2177
7021 2177 -6707 -2414 6306 12015 3046 11787 14202 7037 -6191 -9976 -20114 -12775 -2505 -4744
$$ packed form
7119c227K809M950k098j918Q56q804j4920j0798J2631J4801m086Q961q790j2322
7105b1955R602Q598N429N269j208l898j947P459k293j4324k196Q23K316j0081
7091a8406J1135M403N938r368r190J268j0573l661J8748O732l885K291p020L29
7077a1259O168k828j1454j8329N036K0905J003Q17j4082j4011J0277O846N099
7064a5812J1328O153j0470j461n49M150R343n02l680o749N865k310l154O934J5568
7049A4654j382p191J1838j1200n15M726j045j3636l087r82r813j2553m79L594
7035b7071O371j084j3395O26J2464K0433L923J025j6074l110J4113o851O060M747
7021B177q884M293Q720N709q969Q741K415p165j3228l785j0138P339J0270k239
$$ plain form
7007 -4744 -6451 -10932 -7830 -5782 6004 9403 24467 5421 -8476 -19705 -10760 -6640 -16976
6994 -16976 -16556 1607 2371 -13790 -12393 -896 4714 -4529 -10377 -11810 -11401 -10034 -5393 -2516 -2193
6979 -2193 -3640 -2558 -12109 -9621 4693 2908 -4254 -13682 -7417 -6019 -1223 14856 25511 13024
6965 13024 18310 9257 6377 3470 16820 12832 -2475 -8026 -7391 -8436 -2761 -20264 -23453 -15988
6951 -15988 -22230 2210 8161 -9012 -8714 -11549 -6257 519 -12227 -20483 -20255 -8879 -10378 3661
6937 3661 7740 -1656 -9833 -10864 -13892 -14865 -6876 -5430 -737 12066 18761 20210 25408 17930 1322
6922 1322 -2855 -10055 -15812 -10165 -10063 -9202 -3007 3718 6462 8920 1872 -14931 -27984 -15590 -12093
6907 -12093 -27280 -31428 -34042 -27862 -16205 -12177 -17600 -33981 -37133 -32286 -28284 -22384 -16292 -16269
$$ packed form
7007d744j707m481L102K048J1786L399J5064j9046j3897j1229Q945M120j0336
6994a6976M20J8163P64j6161J397J1497N610r243n848j433M09J367M641K877L23
6979b193j447J082r551K488J4314j785p162r428O265J398M796J6079J0655j2487
6965A3024N286r053k880k907J3350l988j5307n551O35j045N675j7503l189P465
6951a5988o242K4440N951j7173K98k835N292O776j2746q256K28J1376j499J4039
6937C661M079r396q177j031l028r73P989J446M693J2803O695J449N198p478j6608
6922A322m177p200n757N647J02Q61O195O725K744K458p048j6803j3053J2394L497
6907a2093j5187m148k614O180J1657M028n423j6381l152M847M002N900O092K3
$$ plain form
6893 -16269 -20598 -14399 5419 16395 10728 4260 6488 4118 -2396 -1860 -4423 -916 878 12706
6879 12706 10914 7496 8954 -311 2444 -9683 -5015 10891 6492 6131 17499 7466 -4854 -1590
6865 -1590 -8983 -13013 -24864 -31307 -19800 -3423 2767 -5062 -4669 4900 21332 20199 7505 7280
6851 7280 17981 28418 38390 30673 22639 34147 16820 -379 -11797 -15329 -6549 -2217 5035
6838 5035 -1397 -5461 4934 4564 6192 13572 8488 2898 6299 7120 72 -4872 2676 20020 15645
6823 15645 5862 2546 -14044 -26525 -29509 -6287 -8261 -12383 -15475 -15921 -17431 -17199 -9207 3101
6809 3101 284 -1157 11938 13303 23184 9887 -6502 764 -8065 -2195 7795 19893 34658 39794
6795 39794 24357 16336 17939 18135 708 -9778 -8074 -9021 -16291 -11375 -3315 -7742 -11456 -6408
$$ packed form
6893a6269m329O199J9818J0976n667o468K228k370o514N36k563L507J794J1828
6879A2706j792l418J458r265K755j2127M668J5906m399l61J1368j0033j2320L264
6865a590p393m030j1851o443J1507J6377O190p829L93R569J6432j133j2694k25
6851G280J0701J0437R972p717q034J1508j7327j7199j1418l532Q780M332P252
6838E035o432m064J0395l70J628P380n084n590L401Q21p048m944P548J7344m375
6823A5645r783l316j6590j2481k984K3222j974m122l092m46j510K32P992J2308
6809C101k817j441J3095J365R881j3297j6389P266q829N870R990J2098J4765N136
6795C9794j5437q021J603J96j7427j0486J704r47p270M916Q060m427l714N048
$$ plain form
6781 -6408 -1868 4216 -8087 -5927 12118 15123 12930 4550 -9783 -17279 -12087 -12251 -7280 -6318 -7548
6766 -7548 9358 12663 2437 5706 7247 -7568 -15334 -10903 6876 6750 3600 5244 3728 6050
6752 6050 14259 10759 -621 -234 2020 -2251 -8975 1771 10254 16007 13834 11677 9447 8630 -5216
6737 -5216 -8335 7986 13362 4633 221 -2108 503 -673 -4304 -1227 6045 8290 -2827 -5350
6723 -5350 6007 2986 7805 19310 20056 9723 2619 -5519 -1914 -1316 -1301 3522 -1574 -6622 -13255
6708 -13255 -10987 -12100 -3389 2478 -3152 -1064 -8447 -17179 -5660 7508 11490 12254 15765 9686
6694 9686 -2090 -12561 -5218 877 -1375 7132 25921 21819 4178 4178 9040 -2299 -8553 -25599
6680 -25599 -18236 -4679 -5382 -16917 -16303 -7335 14972 6196 -5086 -11664 -11459 -14035 -10684 -869
$$ packed form
6781f408M540O084j2303K160J8045L005k193q380j4333p496N192j64M971R62j230
6766g548J6906L305j0226L269J541j4815p766M431J7779j26l150J644j516K322
6752F050Q209l500j1380L87K254m271o724J0746Q483N753k173k157k230q17j3846
6737e216l119J6321N376q729m412k329K611j176l631L077P272K245j1117k523
6723e350J1357l021M819J1505P46j0333p104q138L605N98J5M823n096n048o633
6708a3255K268j113Q711N867n630K088p383q732J1519J3168L982P64L511o079
6694I686j1776j0471P343O095k252Q507J8789m102j7641%M862j1339o254j7046
6680b5599P363J3557p03j1535O14Q968K2307q776j1282o578K05k576L351R815
$$ plain form
6666 -869 140 -794 11192 13590 18233 14257 8184 -1776 2636 1237 -4388 6877 3733 1584 5063
6651 5063 944 -6266 -18811 -23105 -12514 -18117 -22029 -19214 -10110 2013 -9061 -8259 -6511 -13509
6637 -13509 -20834 -13819 -18080 -12409 -5474 -10926 -8524 10649 18139 8167 6280 9019 4516 5044 -1928
6622 -1928 -2573 -2998 -480 -21583 -39235 -31212 -9419 -169 -7511 -928 38 6754 5839 -4974 -20223
6607 -20223 -24145 -7802 2604 2415 -5556 8782 11719 8474 9940 13290 18741 8156 -707 12039
6593 12039 19923 22227 21454 25097 25803 14431 -9987 -13111 -5515 3425 3072 -5067 -13854 -9057 -8781
6578 -8781 -15950 -21695 -27953 -22183 7536 19915 11861 5513 8914 10954 792 8747 12370 528
6564 528 -12256 -10956 -13883 -7852 1135 15836 32124 27524 19292 13185 15948 16153 12490 3984 -9883
$$ packed form
6666h69J009r34J1986K398M643l976o073r960M412j399n625J1265l144k149L479
6651E063m119p210j2545m294J0591n603l912K815R104J2123j1074Q02J748o998
6637a3509p325P015m261N671O935n452K402J9173P490r972j887K739m503N28o972
6622a928o45m25K518k1103j7652Q023K1793R250p342O583R66O716r15j0813j5249
6607b0223l922J6343J0406j89p971J4338K937l245J466L350N451j0585q863J2746
6593A2039P884K304p73L643P06j1372k4418l124P596Q940l53q139q787M797K76
6578h781p169n745o258N770K9719J2379q054o348L401K040j0162P955L623j1842
6564E28j2784J300k927O031Q987J4701J6288m600q232o107K763K05l663q506j3867
$$ plain form
6549 -9883 -4754 -2588 -9514 -28922 -35931 -20325 -12914 -288 5611 9882 -3568 -6770 -9132 -12976
6535 -12976 -10768 -11104 -6107 -2915 -12740 -14688 -15031 -16632 -19555 -12645 -12240 -5575 -6571 -7580 -21464
6520 -21464 -28090 -17911 -8200 -2421 1021 3041 7820 4107 -1620 -10474 -9929 -14982 -15906 -10879 -17495
6505 -17495 -25909 -15733 404 458 6502 -7344 -19296 -23070 -18197 -23043 -16947 -19434 -14327 532
6491 532 7374 3760 -3571 -3050 -2966 -2990 -8409 3456 14976 8538 1671 9643 23085 18697 22627 10367
6475 10367 3195 6981 14982 14207 20041 18960 -2067 -19311 -23272 -16602 -4167 5802 -224 -1113
6461 -1113 5935 14637 6668 -776 -742 -4167 -2856 -1346 -6224 -6227 -10339 -10436 -17425 -24737 -9011 -4304
6445 -4304 1702 17608 14639 -3883 -10861 -11249 -5476 -283 2197 10871 7803 4686 -6942 -8072
$$ packed form
6549i883N129K166o926j9408p009J5606P411J2626N899M271j3450l202k362l844
6535a2976K208l36M997L192r825j948l43j601k923O910M05O665r96j009j3884
6520b1464o626J0179R711N779L442K020M779l713n727q854N45n053r24N027o616
6505a7495q414J0176J6137N4O044j3846j1952l774M873m846O096k487N107J4859
6491E32O842l614p331N21Q4k4n419J1865J1520o438o867P972J3442m388L930j2260
6475A0367p172L786Q001p75N834j081k1027j7244l961O670J2435R969o026q89
6461a113P048Q702p969p444L4l425J311J510m878lm112r7o989p312J5726M707
6445d304O006J5906k969j8522o978l88N773N193K480Q674l068l117j1628j130
$$ plain form
6431 -8072 -7990 -3889 1723 -155 -8001 -18224 -17324 -10044 -17873 -16633 -2028 -7421 -11729 -13505 -22495
6416 -22495 -34142 -28656 -16927 -5810 -5859 2996 -878 -6605 -15292 -17220 -17661 -12817 -9755 2309
6402 2309 -5079 -17618 -766 20802 26227 27224 33209 29847 21171 13039 15308 13080 9934 18495
6388 18495 19103 15886 16632 2738 -15211 -11055 -6684 -520 -12717 -17096 -18676 -4832 13184 11806
6374 11806 1905 -6847 -4252 7096 -231 -1564 6842 8223 9870 15117 18910 15221 10313 1675
6360 1675 3302 -3665 -13571 -15460 -9936 -11351 -4399 -4344 -17210 -19915 -3067 3500 -7572 3907
6346 3907 22113 14160 1343 -5610 -13211 -11944 -19247 -10534 2936 8712 -2972 -2694 8196 13035
6332 13035 19214 24182 25849 7219 -7702 -5022 1924 8459 18004 20150 13263 319 -9769 -3750
$$ packed form
6431h072Q2M101N612j878p846j0223R00P280p829J240J4605n393m308j776q990
6416b2495j1647N486J1729J1117m9Q855l874n727q687j928m41M844L062J2064
6402B309p388j2539J6852K1568N425R97N985l362q676q132K269k228l146Q561
6388A8495O08l217P46j3894j7949M156M371O164j2197m379j580J3844J8016j378
6374A1806r901q752K595J1348p327j333Q406J381J647N247L793l689m908q638
6360A675J627o967r906j889N524j415O952N5j2866k705J6848O567j1072J1479
6346C907J8206p953j2817o953p601J267p303Q713J3470N776j1684K78J0890M839
6332A3035O179M968J667j8630j4921K680O946O535R545K146o887j2944j0088O019
$$ plain form
6318 -3750 -678 -20980 -20092 -4302 -2901 -2090 1445 566 244 -5119 -2818 -3910 -7827 -11299 -4202
6303 -4202 -6930 -2698 -2707 -7665 -6876 3148 15087 4128 -7593 -20974 -27080 -7000 -751 1916
6289 1916 -801 250 -7287 -15652 -3437 10694 3233 -13620 -1330 4496 4828 -2431 -15152 -22426
6275 -22426 -9511 2663 -5981 -17744 -13193 -11054 -7820 -1978 5128 11345 15424 15213 11922 14009
6261 14009 13675 7128 -6508 -11786 12844 7874 -96 -8425 -827 15315 12687 7427 15661 19748
6247 19748 31924 24254 15487 13678 22426 6842 1637 6736 6333 3628 14181 22445 8659 -3656
6233 -3656 -9177 -5738 -13724 -14035 -624 -14634 -23268 -7296 2190 6601 19141 16327 15860 25506
6219 25506 13948 2859 1370 4477 -13319 -23483 -26818 -12482 1411 -3114 6257 7728 3240
$$ packed form
6318c750L072k0302Q88J5790J401Q11L535q79l22n363K301j092l917l472P097
6303d202k728M232rm958P89J0024J1939j0959j1721j3381o106K0080O249K667
6289A916k717J051p537q365J2215J4131p461j6853J2290N826L32p259j2721p274
6275b2426J2915J2174q644j1763M551K139L234N842P106O217M079k11l291K087
6261A4009l34o547j3636n278K4630m970p970q329P598J6142k628n260Q234M087
6247A9748J2176p670q767j809Q748j5584n205N099m03k705J0553Q264j3786j2315
6233c656n521L439p986l11J3411j4010q634J5972R486M411J2540k814m67R646
6219B5506j1558j1089j489L107j7796j0164l335J4336J3893m525R371J471m488
$$ plain form
6206 3240 3666 5417 7276 14564 17075 20743 9791 1168 2819 13367 8868 11124 13840 -8043
6192 -8043 -25675 -29632 -10583 84 7314 7271 16951 12706 4864 -4369 -12773 -3547 -10403 -19494 -16873
6177 -16873 -11218 -11922 -9917 -6861 -8407 -13408 -24252 -24727 -19629 -8114 5773 11379 12524 8214
6163 8214 4261 -2018 2462 6518 18953 3031 -2887 -8547 -9166 -14648 -8054 -1568 8221 13536 6896
6148 6896 7910 2871 -1999 -5746 -7419 3051 -4153 -7253 -4003 -9991 1115 10853 5819 7524
6134 7524 566 2436 348 -5775 -7134 -20087 -21216 -7788 -5219 -10376 -10351 9312 6091 2760 2909
6119 2909 3828 -668 -2448 -13641 -24458 -26877 -19594 -13397 1041 -6185 -8999 -3822 2071 9027
6105 9027 9138 -2475 -7232 3454 13541 5549 -35 -5139 -7081 -5976 -13598 -18998 -5132 9662
$$ packed form
6206C240M26J751J859P288K511L668j0952q623J651J0548m499K256K716k1883
6192h043j7632l957J9049J0667P230m3R680m245p842r233q404R226o856r091K621
6177a6873N655p04K005L056j546n001j0844m75N098J1515J3887N606J145m310
6163H214l953o279M480M056J2435j5922n918n660o19n482O594O486R789N315o640
6148F896J014n039m870l747j673J0470p204l100L250n988J1106R738n034J705
6134G524o958J870k088o123j359j2953j129J3428K569n157K5J9663l221l331J49
6119B909R19m496j780j1193j0817k419P283O197J4438p226k814N177N893O956
6105I027J11j1613m757J0686J0087p992n584n104j942J105p622n400J3866J4794
$$ plain form
6091 9662 10517 8526 7435 3733 5336 1777 -13801 -10570 9844 10655 -1499 716 7669 19136
6077 19136 19914 6174 6567 -2713 -26344 -27315 -17637 3428 12438 14400 14959 10719 15839 11976 6104
6062 6104 -10965 -16711 -22095 -25975 -33286 -25270 -13333 -4216 396 -2968 -1409 13950 11309 12275
6048 12275 12222 10929 23230 33069 21118 3487 0 6241 -3615 -10267 -11388 -10690 -10180 -9623 -2898
6033 -2898 -524 -8444 -10496 -8615 -1462 5578 7823 2389 1031 -9265 -8269 -3479 3242 13033 12138
6018 12138 12699 10252 2833 -3693 8800 10863 9473 8210 3013 -3501 1028 -2355 -411 -7317 -14656
6003 -14656 -20644 -18271 -16173 -18642 -14405 -10242 -11329 -2726 995 4438 20450 13623 8479 15641
5989 15641 25679 13117 19629 22164 16759 10336 4490 -10056 -5221 1082 16943 23206 21647 10475
$$ packed form
6091I662Q55j991j091l702J603l559j5578L231K0414Q11j2154K215O953J1467
6077A9136P78j3740L93r280k3631r71R678K1065R010J962N59m240N120l863n872
6062F104j7069n746n384l880p311Q016J1937R117M612l364J559J5359k641R66
6048A2275n3j293J2301R839j1951j7631l487O241r856o652j121O98N10N57O725
6033b898K374p920k052J881P153P040K245n434j358j0296R96M790O721R791q95
6018A2138N61k447p419o526J2493K063j390j263n197o514M529l383J944o906p339
6003a4656n988K373K098k469M237M163j087Q603L721L443J6012o827n144P162
5989A5641J0038j2562O512K535n405o423n846j4546M835O303J5861O263j559j1172
$$ plain form
5975 10475 8136 -4320 -205 20791 17360 631 320 5930 11799 3582 -8998 -427 6406 488
5961 488 -1527 13966 21285 22020 10204 14753 -2740 -1853 10432 -7710 -28594 -18241 -8176 1793
5947 1793 9282 8404 -2695 -9316 -18769 -22968 -13858 -10361 -11673 1101 9389 7259 3034 12484 15803
5932 15803 15967 18404 6185 -4632 -7958 -11909 -1580 14775 35470 37734 33018 36501 7649
5919 7649 -16381 -8099 -7679 -5019 3055 14658 22884 10821 -3904 -17428 -19666 -22858 -33510 -30423
5905 -30423 -30156 -22141 -18944 -17479 -18061 -19012 -22044 -20480 -6232 9018 17538 18041 -2823 -18011 -16129
5890 -16129 -7275 373 18287 11404 532 8193 8914 3443 -4292 -15597 -15268 -4605 -3832 -6951
5876 -6951 -12208 -12866 -10637 -9493 -4979 -17553 -22826 -16496 -13893 -7575 3367 5117 2450 1478 -1280
$$ packed form
5975A0475k339j2456M115K0996l431j6729l11N610N869q217j2580Q571O833n918
5961D88k015J5493P319P35j1816M549j7493Q87J2285j8142k0884J0353J0065R969
5947A793P489q78j1099o621r453m199R110L497j312J2774Q288k130m225R450L319
5932A5803J64K437j2219j0817l326l951J0329J6355K0695K264m716L483k8852
5919G649k4030Q282M20K660Q074J1603Q226j2063j4725j3524k238l192j0652L087
5905c0423K67Q015L197J465n82r51l032J564J4248J5250Q520N03k0864j5188J882
5890a6129Q854P648J7914o883j0872P661P21n471p735j1305L29J0663P73l119
5876f951n257o58K229J144M514j2574n273O330K603O318J0942J750k667r72k758
$$ plain form
5861 -1280 -10778 -15013 3777 7073 -13452 -25291 -14303 -4577 -11015 8284 26555 37351 38807
5848 38807 34221 38026 20103 5005 -4538 -8037 -3580 -1488 -1777 712 7954 9889 673 -18123
5834 -18123 -18541 -9811 -12581 -6405 7179 7877 3828 151 12988 12653 11599 19063 34792 37361 16012
5819 16012 6630 3324 4802 -2825 -21528 -19206 -13844 -5949 5354 -473 3603 -72 -24477 -27955
5805 -27955 -38167 -16852 -10300 -12220 -6558 -8847 1649 9486 4740 1832 -1891 1250 10534 -2191
5791 -2191 -20584 -35810 -28654 -21441 -25204 -25107 -22572 -21214 -9869 4710 5479 -9012 -9927 -4036 -7625
5776 -7625 -22068 -29319 -22962 -25831 -28941 -27973 -4062 12530 4870 -15665 -15849 -18545 -30891 -24618
5762 -24618 -17875 -18188 -7454 -15854 -20835 -4505 -5990 -19868 -17352 5888 13048 1782 -12018
$$ packed form
5861a280r498m235J8790L296k0525j1839J0988R726o438J9299J8271J0796J456
5848C8807m586L805j7923j5098r543l499M457K092k89K489P242J935r216j8796
5834a8123m18Q730k770O176J3584O98m049l677J2837l35j054P464J5729K569k1349
5819A6012r382l306J478p627j8703K322N362P895J1303n827M076l675k4405l478
5805b7955j0212K1315O552j920N662k289J0496P837m746k908l723L141R284j2725
5791b191j8393j5226P156P213l763R7K535J358J1345J4579P69j4491r15N891l589
5776g625j4443p251O357k869l110R68K3911J6592p660k0535j84k696j2346O273
5762b4618O743l13J0734q400m981J6330j485j3878K516K3240P160j1266j3800
$$ plain form
5749 -12018 -6082 -9335 -12986 -11197 -11959 -642 -3000 -5160 6331 19813 22121 23038 10407 9914
5735 9914 8784 9394 1283 -13718 -6586 9406 14995 6403 4047 5345 -7259 -16279 -13372 -8911
5721 -8911 -10664 -9168 -5297 3140 10874 8630 -6359 -13043 -731 2660 -8861 -12519 -3806 -3545
5707 -3545 -800 259 -9009 -2403 6144 13690 14362 14059 12079 -6524 -20085 -13378 -2325 -9529 495
5692 495 16818 14357 10292 13547 7397 -1484 -10204 -7862 4726 22384 26439 8009 -1048 -939
5678 -939 -1987 -9961 -29875 -23598 -30768 -16205 1865 8307 2920 -379 -6161 -9690 -4567 6703
5664 6703 600 -9158 2623 1722 -4270 -8050 -1586 -682 -11427 -18001 -8026 -8629 -1428 -842 9661
5649 9661 12111 1961 5853 13525 19039 16068 3829 -14226 -16773 -20973 -21916 -10273 -6323 -2619
$$ packed form
5749a2018N936l253l651J789p62J1317k358k160J1491J3482K308R17j2631m93
5735I914j130O10q111j5001P132J5992N589q592k356J298j2604r020K907M461
5721h911j753J496L871Q437P734k244j4989o684J2312L391j1521l658Q713K61
5707c545K745J059r268O606Q547P546O72l03j980j8603j3561O707J1053p204J0024
5692D95J6323k461m065L255o150q881q720K342J2588J7658M055j8430r057J09
5678i39j048p974j9914O277p170J4563J8070O442n387l299n782l529N123J1270
5664F703o103r758J1781r01n992l780O464R04j0745o574R975o03P201N86J0503
5649I661K450j0150L892P672N514k971j2239j8055k547m200r43J1643L950L704
$$ plain form
5635 -2619 -15481 -17290 -22573 -20553 -31127 -32573 -20384 -6487 -259 -8570 -10007 -6464 -12765 -10067
5621 -10067 -13397 -7716 -146 9658 171 6048 2067 1807 1458 4404 8349 13228 13974 10255 2050
5606 2050 -13903 -2036 3695 7102 5110 -7873 4955 6704 7915 12378 16539 8058 -6623 -4116
5592 -4116 8423 12089 3323 -1678 -11065 -14868 -21611 -27060 -17721 -8023 -738 19610 27526 18319
5578 18319 3822 14940 21104 16444 17997 8787 12907 4756 7979 14401 7836 991 4826 1723
5564 1723 -1566 -7340 2964 8464 -2245 3359 5923 1039 20033 18623 8391 -7694 -14794 -16712
5550 -16712 -11769 -8352 -12115 -16697 -19911 -14544 -9579 -1826 -7499 -13690 -13407 -12765 -7833 -10575 -7545
5535 -7545 -2093 21332 35259 35491 24136 19977 7838 -10218 -25984 -27888 -22626 -16020 -8197 6083
$$ packed form
5635b619j2862j809n283K020j0574j446J2189J3897O228q311j437L543o301K698
5621a0067l330N681P570R804r487N877l981k60l49K946L945M879P46l719q205
5606B050j5953J1867N731L407j992j2983J2828J749J211M463M161q481j4681K507
5592d116J2539L666q766n001r387l803o743n449R339R698P285K0348P916r207
5578A8319j4497J1118O164m660J553r210M120q151L223O422o565o845L835l103
5564A723l289n774J0304N500j0709N604K564m884J8994j410j0232j6085p100j918
5550a6712M943L417l763m582l214N367M965P753n673o191K83O42M932k742L030
5535g545N452K3425J3927K32j1355m159j2139j8056j5766j904N262O606P823J4280
$$ plain form
5521 6083 3620 239 2217 6708 20721 32217 23686 19249 11843 9223 8960 -702 -10568 -7192 -6525
5506 -6525 6267 7058 3416 6842 4948 2426 13553 13470 22361 6880 -5998 -11916 -16152 -8028 4750
5491 4750 1114 -3777 -9051 -11538 -5666 -1704 4696 8419 2035 -555 -4424 -9171 101 15557 13765
5476 13765 7401 2941 -1877 -11491 -643 4459 -878 493 7797 3154 -917 -3415 -13644 -15507
5462 -15507 -3990 5671 8020 4786 787 1335 4386 6581 -5852 -22216 -18872 -4606 -9117 -6352
5448 -6352 -3619 13883 11250 8103 12843 18924 22137 9909 -4049 -3743 -294 -373 7199 15079 8261
5433 8261 13087 20334 14728 19357 27336 13520 8992 17461 30800 19912 8701 -3122 3360 12665
5419 12665 12478 14680 2810 -10085 -22863 -18196 -6050 10760 23566 20715 8700 4770 86
$$ packed form
5521F083k463l381J978M491J4013J1496q531m437p406k620k63r662r866L376O67
5506f525J2792P91l642L426j894k522J1127q3Q891j5481j2878n918m236Q124J2778
5491D750l636m891n274k487N872L962O400L723o384k590l869m747R272J5456j792
5476A3765o364m460m818r614J0848N102n337J371P304m643m071k498j0229j863
5462a5507J1517R661K349l234l999N48L051K195j2433j6364L344J4266m511K765
5448f352K733J7502k633l147M740O081L213j2228j3958L06L449p9P572P880o818
5433H261M826P247n606M629P979j3816m528Q469J3339j0888j1211j1823O482R305
5419A2665j87K202j1870j2895j2778M667J2146J6810J2806k851j2015l930m684
$$ plain form
5406 86 1582 -8939 -2801 4252 -7345 -13500 -9919 -5194 2094 5039 11050 13966 10859 -7606 -4188
5391 -4188 1676 10692 13097 16681 15807 17959 15365 6567 -842 -6957 -9290 -8539 -4237 6773 4310
5376 4310 -6804 -11781 490 10143 12885 12665 -10205 -22677 -18051 1426 7961 10827 9372 5613
5362 5613 13288 24367 24353 11375 8243 5100 -6916 -19955 -21493 -22299 -26859 -17487 -3457 16127
5348 16127 11497 -2419 -8142 -8737 -12552 3983 24568 19756 17015 9168 -4053 336 10464 20794
5334 20794 17577 17895 8483 12219 14447 13948 -5511 -27051 -25052 -18918 -30689 -37479 -28777 -15546
5320 -15546 -10319 -11059 -19740 -34519 -31961 -18015 -23847 -33753 -35135 -37039 -28592 -26319 -18938 -24262
5306 -24262 -19791 -17392 -18576 -16519 -21576 -12083 5054 -2062 5820 18491 8242 -7380 -11921 -10894
$$ packed form
5406H6J496j0521O138P053j1597o155L581M725P288K945O011K916l107j8465L418
5391d188N864R016K405L584q74K152k594q798p409o115k333P51M302J1010k463
5376D310j1114m977J2271R653K742k20k2870j2472M626J9477O535K866j455l759
5362E613P675J1079j4j2978l132l143j2016j3039j538q06m560R372J4030J9584
5348A6127m630j3916n723n95l815J6535K0585m812k741p847j3221M389J0128J0330
5334B0794l217L18r412L736K228m99j9459k1540J999O134j1771o790Q702J3231
5320a5546N227p40q681j4779K558J3946n832r906j382j904Q447K273P381n324
5306b4262M471K399j184K057n057R493J7137p116P882J2671j0249j5622m541J027
$$ plain form
5292 -10894 -5941 -9273 -7037 -21943 -20985 -17036 -1308 -6237 -2292 -2038 -3233 -12517 -10797 987
5278 987 3399 6993 -755 -10409 -16972 -18056 -20479 -5915 4226 -5069 -19647 -15628 -3204 3808
5264 3808 -4691 1132 8285 9709 -7549 -13312 -6030 17 6179 16007 23481 28402 29050 11840 13771
5249 13771 19869 8877 1918 892 13786 11073 4438 5394 3340 2538 -33 -11670 -20535 -2935
5235 -2935 4806 4662 -823 -3994 -10542 -11764 -11316 -804 -9408 -13011 7780 12997 19848 6554 4796
5220 4796 11434 4865 -2974 -5877 -20110 -20664 -13155 -14878 -9268 -9721 -13381 -12832 -10640 -21234 -7851
5205 -7851 5386 4973 -554 -7018 -1856 9823 12692 5755 918 -3964 -3856 -10136 -10014 4567 14513
5190 14513 -1139 -10848 -371 11000 19960 18751 2929 1337 717 6074 13061 13895 2436 -17057
$$ packed form
5292a0894M953l332K236j4906R58L949J5728m929L945K54j195r284J720J1784
5278I87K412L594p748r654o563j084k423J4564J0141r295j4578M019J2424P012
5264C808q499N823P153J424j7258n763P282O047O162R828P474M921O48j7210J931
5249A3771O098j0992o959j026J2894k713o635R56k054q02k571j1637q865J7600
5235b935P741j44n485l171o548j222M48J0512q604l603K0791N217O851j3294j758
5220D796O638o569p839k903j4233n54P509j723N610m53l660N49K192j0594J3383
5205g851J3237m13n527o464N162J1679K869o937m837m882J08o280J22J4581R946
5190A4513j5652r709J0477J1371Q960j209j5822j592o20N357O987Q34j1459j9493
$$ plain form
5176 -17057 -31480 -35042 -27055 -11297 -11133 -13731 -4592 7706 22168 19874 10577 3153 -1734 -8584
5162 -8584 -2004 1026 -6919 -4414 4383 15458 28148 33192 35910 24725 8178 7712 9953 -1212
5148 -1212 -2387 -4530 -1769 -11257 -5796 -7830 -11287 -14068 -18898 -26084 -26034 -6484 -454 8541 -2327
5133 -2327 -11970 -2325 3033 3966 3148 8425 1809 -8470 7194 9825 9482 4682 -9352 -7587 -452
5118 -452 8898 13796 7665 -4602 -16463 -16746 -8991 -9048 -8317 -14741 -7223 -4004 -7878 9751 14600
5103 14600 9781 17647 21311 9751 -8569 -13895 -13085 -16222 -17493 -12310 -13386 -19620 -16208 -2308
5089 -2308 -4754 -14096 -7599 -2351 -8963 -15698 -20339 -12495 -485 6202 -5516 -12371 -16784 -23872
5075 -23872 -21116 -8702 2808 2288 -12691 -202 4642 1116 13599 21376 21179 27799 10079 -5027
$$ packed form
5176a7057j4423l562P987J5758J64k598R139J2298J4462k294r297p424m887o850
5162h584O580L030p945K505Q797J1075J2690N044K718j1185j6547m66K241j1165
5148a212j175k143K761r488N461k034l457k781m830p186N0J9550O030Q995j0868
5133b327r643R645N358R33q18N277o616j0279J5664K631l43m800j4034J765P135
5118d52R350M898o131j2267j1861k83P755n7P31o424P518L219l874J7629M849
5103A4600m819P866L664j1560j8320n326Q10l137j271N183j076o234L412J3900
5089b308k446r342O497N248o612o735m641P844J2010O687j1718o855m413p088
5075b3872K756J2414J1510n20j4979J2489M844l526J2483P777j97O620j7720j5106
$$ plain form
5061 -5027 -18904 -17711 -13307 -1611 -7288 -2081 -5194 -4120 7117 24168 24705 7740 8221 16481
5047 16481 10061 1462 6370 -13466 -15957 -18216 -10496 -1660 9731 14979 -3286 -12359 -17354 -12614
5033 -12614 3268 21357 27556 18632 8849 2204 -5539 -9555 -5721 6274 6660 9669 9717 13386 16212
5018 16212 11125 -6041 -29588 -29945 -23792 -13559 -7694 -2274 -4493 -3056 -13356 -10097 6600 24727
5004 24727 25513 21383 19569 22090 17933 7743 15034 1035 -6262 -12681 -27069 -27652 -15824 -8105
4990 -8105 6012 17353 16307 13008 10056 -12715 -21622 -27005 -23155 -20423 -13235 972 -1754 -11071
4976 -11071 -14949 -25684 -24926 -17894 -9644 -8945 -8222 -21750 -22890 -10235 -6322 -9320 -1430 20909
4962 20909 26321 32169 49267 37141 30733 14079 -593 -1609 1654 5792 10597 19913 4733
$$ packed form
5061e027j3877J193M404J1696n677N207l113J074J1237J7051N37j6965M81Q260
5047A6481o420q599M908j9836k491k259P720Q836J1391N248j8265r073m995M740
5033a2614J5882J8089O199q924r783o645p743m016L834J1995L86L009M8L669K826
5018A6212n087j7166k3547l57O153J0233N865N420k219J437j0300L259J6697J8127
5004B4727P86m130j814K521m157j0190P291j3999p297o419j4388n83J1828P719
4990h105J4117J1341j046l299k952k2771q907n383L850K732P188J4207k726r317
4976a1071l878j0735P58P032Q250O99P23j3528j140J2655L913k998P890K2339
4962B0909N412N848J7098j2126o408j6654j4672j016L263M138M805R316j5180
$$ plain form
4949 4733 4686 -3268 -9119 -141 -7443 -9542 -10070 -9394 -13445 -20218 -11650 3885 1170 -1706 -3684 3980
4933 3980 932 7227 14285 22737 17226 5357 -3135 12488 19986 13755 3932 -985 -1095 12301
4919 12301 22741 12508 13546 20526 14837 2847 -658 1560 9272 16006 22304 19770 11636 4158
4905 4158 -2945 844 14520 24096 20264 18477 10959 18093 22081 26681 27877 25103 3987 -86
4891 -86 2808 5233 4428 -4268 -3441 2773 17392 25059 15959 21995 14109 -9738 -11931 -4260 9358
4876 9358 12678 1676 -3649 -1968 -2192 -14697 -15265 -8662 -4996 -9422 -18430 -12777 -7344 6358 17664
4861 17664 35438 23517 7441 6983 3813 6864 8773 4979 13831 13660 3 -11260 -14006 -9289
4847 -9289 -4592 -3482 -5168 8335 31066 27396 23445 28436 25396 15178 3130 2669 16312 26718
$$ packed form
4949D733m7p954n851Q978p302k099n28O76m051o773Q568J5535k715k876j978P664
4933C980l048O295P058Q452n511j1869q492J5623P498o231r823m917j10J3396
4919A2301J0440j0233J038O980n689j1990l505K218P712O734O298k534q134p478
4905D158p103L789J3676R576l832j787p518P134L988M600J196k774k1116m073
4891h6K894K425q05q696Q27O214J4619P667r100O036p886k3847k193P671J3618
4876I358L320j1002n325J681k24j2505n68O603L666m426r008N653N433J3702J1306
4861A7664J7774j1921j6076m58l170L051J909l794Q852j71j3657j1263k746M717
4847i289M697J110j686J3503K2731l670l951M991l040j0218j2048m61J3643J0406
$$ plain form
4833 26718 15446 11526 10837 6817 1435 5508 10190 9350 -557 1838 2895 -7864 -13085 -11564 -10147
4818 -10147 -20102 -5907 -3990 -645 3009 5068 -3694 -12115 -7778 12973 25187 20840 14093 12852
4804 12852 3614 1314 17015 8591 -12389 -12690 -14808 -7674 -283 -752 1406 2319 11065 -12151 -21061
4789 -21061 -9428 -3715 -4499 -6115 -2180 -4531 -5487 -1339 -8186 -1329 12507 676 -3751 -8502
4775 -8502 -7151 -3101 -15155 -17413 -10662 -4421 -4232 -5161 -6909 4122 6696 16709 26419 17685 6195
4760 6195 -11336 -12147 -3619 -9212 -5405 -11338 479 -2591 -7582 -13803 -24385 -35158 -22879 -6759
4746 -6759 -4419 -6409 -7548 1432 7893 7953 6789 15749 26164 25323 20143 11880 12438 5902 1268 -2031
4730 -2031 -3226 91 3417 -4562 -7575 -2556 9178 18612 9774 -9814 -12470 -9602 -9557 3773 8383
$$ packed form
4833B6718j1272l920o89m020n382M073M682q40r907K395J057j0759n221J521J417
4818a0147r955J4195J917L345L654K059q762q421M337K0751J2214m347o747j241
4804A2852r238k300J5701q424k0980l01k118P134P391m69K158R13Q746k3216q910
4789b1061J1633N713p84j616L935k351r56M148o847O857J3836j1831m427m751
4775h502J351M050j2054k258O751O241J89r29j748J1031K574J0013R710q734j1490
4760F195j7531q11Q528n593L807n933J1817l070m991o221j0582j0773J2279J6120
4746f759K340j990j139Q980O461O0j164Q960J0415q41n180q263N58o536m634l299
4730b031j195L317L326p979l013N019J1734R434q838j9588k656K868M5J3330M610
$$ plain form
4715 8383 6242 -916 10437 25498 26238 21041 16997 17912 17473 4895 -8501 -3054 -5009 -5801 -963
4700 -963 -6726 -19419 -16948 -1060 5806 21214 16878 12695 13736 24391 24754 20516 13284 8172
4686 8172 10467 13578 8627 -2439 -7184 2127 15999 28641 35808 17896 4893 -1434 -11190 645
4672 645 9902 7338 -6683 673 7415 9914 2080 -9333 -9738 -5962 1975 3674 473 -51 3679
4657 3679 7875 -2981 933 13878 16310 5075 -6595 -9851 10446 15666 10475 14529 14987 7658
4643 7658 -482 2618 9427 13065 9598 2886 5088 5017 12725 15634 7808 8020 4008 -9889 -18637
4628 -18637 -7174 5386 15619 15042 8928 5922 -3279 -453 -7428 884 17481 15151 20478 25612
4614 25612 37278 29031 16809 22771 24207 21606 16970 13541 2965 12979 17208 21305 29161 29750
$$ packed form
4715H383k141p158J1353J5061P40n197m044R15m39j2578j3396N447j955p92M838
4700i63n763j2693K471J5888O866J5408m336m183J041J0655L63m238p232n112
4686H172K295L111m951j1066m745R311J3872J2642P167j7912j3003o327r756J1835
4672F45R257k564j4021P356O742K499p834j1413m05L776P937J699l201n24L730
4657C679M196j0856L914J2945K432j1235j1670l256K0297N220n191M054M58p329
4643G658q140L100O809L638l467o712K202p1P708K909p826K12m012j3897q748
4628a8637J1463J2560J0233n77o114l006r201K826o975Q312J6597k330N327N134
4614B5612J1666q247j2222N962J436k601m636l429j0576J0014M229M097P856N89
$$ plain form
4600 29750 29242 21009 13671 7923 8204 14738 10475 -4936 -8884 -3105 2449 9734 4102 -1635 -4771
4585 -4771 -4048 9116 5475 8215 22398 23596 23739 12393 18202 33814 40661 34762 16837 -167
4571 -167 -10766 -8000 5660 3115 -6315 256 7003 8586 14544 14165 27057 28119 17695 5097
4557 5097 6090 21432 26970 22866 11130 -772 -5303 -1370 7028 7754 1043 -12434 -21237 -21557 -17868
4542 -17868 -7011 -3028 1591 -3934 6338 10693 12069 5548 -12063 -28863 -18453 7283 4283
4529 4283 -2539 -7787 -11657 -3123 -486 -5524 4555 16886 15386 3820 9515 11108 792 3558
4515 3558 13525 25067 22428 18749 7943 -10950 -14377 -13366 -5894 6116 -2648 -7414 -713 2395
4501 2395 -3024 -7187 1176 3049 8455 -2860 -5190 -3294 16926 20368 9785 13228 5004 -2232
$$ packed form
4600B9750n08q233p338n748K81O534m263j5411l948N779N554P285n632n737l136
4585d771P23J3164l641K740J4183J198J43j1346N809J5612O847n899j7925j7004
4571a67j0599K766J3660k545r430O571O747J583N958l79J2892J062j0424j2598
4557E097R93J5342N538m104j1736j1902m531L933Q398P26o711j3477q803l20L689
4542a7868J0857L983M619n525J0272M355J376o521j7611j6800J0410K5736l000
4529D283o822n248l870Q534K637n038J0079J2331j500j1566N695J593j0316K766
4515C558R967J1542k639l679j0806j8893l427J011P472J2010q764m766O701L108
4501B395n419m163Q363J873N406j1315k330J896K0220L442j0583L443q224p236
$$ plain form
4487 -2232 -1372 5859 9474 26076 24077 14381 5081 -4169 5322 3597 697 -7303 -10515 3342 13079
4472 13079 8792 1902 15389 12141 4385 3609 15782 18387 7056 1702 10075 6232 -3979 -251
4458 -251 3553 8329 3681 14188 6119 8369 13595 -5106 -6290 -9471 -10968 -11694 -15794 -10406 1348
4443 1348 4945 248 176 -1865 -175 4103 5555 -3322 -1327 3815 11132 19556 7511 7025 5005
4428 5005 4083 4610 2572 -2126 731 8654 12914 11070 9767 17623 23482 18479 18537 8546 -6308 -3688
4412 -3688 -5509 -27010 -24488 -21349 -16005 -15544 -21009 -15736 -8744 -15853 -21551 -23246 -32114 -35226 -16251
4397 -16251 -6889 -7888 -12971 -9505 -3871 -3685 2143 3022 7103 11775 9102 4846 -5119 -12314 -2470
4382 -2470 478 -4591 647 9547 11713 -3755 -15199 -19867 -20430 -14575 -8575 -6681 -5560 228 5733
$$ packed form
4487b232Q60P231L615J6602j999r696r300r250R491j725k900q000l212J3857R737
4472A3079m287o890J3487l248p756p76J2173K605j1331n354Q373l843j0211L728
4458b51L804M776m648J0507q069K250N226j8701j184l181j497p26m100N388J1754
4443A348L597m697p2k041J690M278J452q877J995N142P317Q424j2045m86k020
4428E005r22N27k038m698K857P923M260j844j303P856N859n003N8r991j4854K620
4412c688j821k1501K522L139N344M61n465N273O992p109n698j695q868l112J8975
4397a6251R362r99n083L466N634J86N828Q79M081M672k673m256r965p195R844
4382b470K948n069N238Q900K166j5468j1444m668n63N855O000J894J121N788N505
$$ plain form
4367 5733 2878 1738 -1653 5265 -1280 -12296 -19646 -15364 -926 12190 14253 10706 8391 3338
4353 3338 14428 16011 6502 4856 14553 20572 23818 8024 7188 17851 20174 18644 11490 3467
4339 3467 5921 2087 9345 12096 11479 7527 1341 7941 8487 8381 7100 -10786 -29742 -16779 -3330
4324 -3330 -3772 -1308 -10105 -10879 -244 2478 -13418 -2697 -4230 -5926 -3472 -3687 -18190 -23492 -35348
4309 -35348 -41453 -26522 -6854 -6451 -4900 -17265 -11139 -4255 -6489 -3787 -13588 -13596 -10241 -7754 -5178
4294 -5178 -13684 -16334 -5154 157 -4554 -8570 -4038 4316 11550 20171 29279 36688 23973 8764
4280 8764 1499 -4857 -3093 1627 -5774 -4656 -5697 -5849 -1492 -1462 2702 3618 7657 -2736 -8315 -5569
4264 -5569 1649 3914 4725 -944 -2969 -6669 -10362 4810 9005 -3588 -1161 13715 8069 7777 14583
$$ packed form
4367E733k855j140l391O918o545j1016p350M282J4438J3116K063l547k315n053
4353C338J1090J583r509j646R697O019L246j5794q36J0663K323j530p154q023
4339C467K454l834P258K751o17l952o186O600N46j06j281j7886j8956J2963J3449
4324c330m42K464q797p74J0635K722j5896J0721j533j696K454k15j4503n302j1856
4309c5348o105J4931J9668M03J551j2365O126O884k234K702r801qL355K487K576
4294e178q506k650J1180N311m711m016M532Q354P234Q621R108P409j2715j5209
4280H764p265o356J764M720p401J118j041j52M357L0M164R16M039j0393n579K746
4264e569P218K265Q11n669k025l700l693J5172M195j2593K427J4876n646k92O806
$$ plain form
4249 14583 7993 -695 14379 17457 11940 913 2819 5001 11728 24076 26158 22895 22858 8451
4235 8451 9166 -3844 -6527 -111 -2451 -2906 5550 11975 3141 -4002 2101 24042 22355 11464 12715
4220 12715 15913 -1099 -21186 -39185 -31113 -16151 -5197 -416 -13662 -26093 -19051 -25494 -15476
4207 -15476 -12991 695 4493 3402 -4960 -3419 -5443 7555 16682 19694 14091 13239 11312 16825
4193 16825 -2122 -12498 -4691 -3591 -4154 2094 -8668 -21744 -27118 -8382 6902 -1017 -6527
4180 -6527 -14135 -10334 5651 5638 -1426 3747 -4575 -6733 -7636 13610 27896 23042 21176 17015 19272
4165 19272 14507 1291 1866 -3384 -1331 17524 25334 29317 14700 1843 -7904 6658 30492
4152 30492 28087 27694 17499 100 -15934 -27001 -27210 -16291 674 73 -8200 4300 11090 8303
$$ packed form
4249A4583o590q688J5074L078n517j1027J906K182O727J2348K082l263l7j4407
4235H451P15j3010k683O416k340m55Q456O425q834p143O103K1941j687j0891J251
4220A2715L198j7012k0087j7999Q072J4962J0954M781j3246j2431P042o443J0018
4207a5476K485J3686L798j091q362J541k024J2998R127L012n603q52j927N513
4193A6825j8947j0376P807J100n63O248j0762j3076n374J8736J5284p919n510
4180f527p608L801J5985j3p064N173q322k158r03K1246J4286m854j866m161K257
4165A9272m765j3216N75n250K053J8855P810L983j4617j2857r747J4562K3834
4152C0492k405l93j0195j7399j6034j1067k09J0919J6965o01q273J2500O790k787
$$ plain form
4138 8303 5746 725 -3360 -11312 -8791 -20110 -26784 -19469 -15924 -3183 -173 -6706 -14001 -22212
4124 -22212 -29537 -23793 -13861 -8868 -917 -4261 -1325 -5134 -5397 3924 10055 3296 -5365 -7280 -17071
4109 -17071 -17134 -17898 -1842 10604 -4677 -2124 -15215 -21363 -21041 -13951 -3345 -6239 -9850 -4826
4095 -4826 -15330 -9596 -2438 -9619 -4674 -2276 -6028 -9649 -5723 -5457 -1217 -104 5869 12855 3556
4080 3556 -12720 -1674 5750 11547 5027 10537 11529 13126 15723 15620 19525 20348 21621 11367 -2809
4065 -2809 4794 12217 7287 848 -2516 6898 12049 19196 16623 16515 7695 -6210 2102 5568 8249
4050 8249 -3755 -6441 -10657 -11098 3905 19028 26977 25041 18179 12583 10591 13572 7771 -3129
4036 -3129 1226 -6416 -15782 -14564 -3620 -2051 2541 24092 23425 19121 12724 5437 14976 19832 22335
$$ packed form
4138H303k557n021m085p952K521j1319o674P315L545J2741L010o533p295q211
4124b2212p325N744R932M993P951l344K936l809k63R321O131o759q661j915r791
4109a7071o3p64J6056J2446j5281K553j3091o148L22P090J0606k894l611N024
4095d826j0504N734P158p181M945K398l752l621L926K66M240J113N973O986r299
4080C556j6276J1046P424N797o520N510R92J597K597j03L905Q23J273j0254j4176
4065b809P603P423m930o439l364R414N151P147k573j08q820j3905Q312L466K681
4050H249j2004k686m216m41J5003J5123P949j936o862n596j992K981n801j0900
4036c129M355p642r366J218J0944J569M592K1551o67m304o397p287R539M856K503
$$ plain form
4021 22335 20767 18180 17684 21976 27156 14675 20753 1152 -4856 -2771 -1878 3697 4302 -3727 -1697
4006 -1697 8010 14296 20544 6614 -6808 -48 -2926 8031 17090 12954 -1218 -5072 -3125 -10768
3992 -10768 -4961 1838 806 -8508 -14836 -13877 -14685 -15356 -7830 7478 15625 12604 6045 -2549 -2827
3977 -2827 -773 7502 17051 20581 21559 17947 9527 16685 4060 9422 15728 17860 15927 16014 22170
3962 22170 28405 15988 1393 -8358 -16863 -14626 -8627 1174 8549 16110 19986 16183 12292 11802
3948 11802 3111 5632 13751 18272 14279 7666 2547 5259 -240 -15488 -21588 -7260 9988 5829
3934 5829 -5442 -3513 -7891 -8715 -8752 -12723 -11210 201 16448 21082 12150 5643 -4171 -6744 -11980
3919 -11980 -16917 -8697 -6364 -6529 -2627 297 291 -5640 -8605 -9948 -17117 -25865 -24310 -12081 -13548
$$ packed form
4021B2335j568k587m96M292N180j2481O078j9601o008K085Q93N575O05q029K030
4006a697R707O286O248j3930j3422O760k878J0957R059m136j4172l854J947p643
3992a0768N807O799j032r314o328R59q08o71P526J5308Q147l021o559q594k78
3977b827K054Q275R549L530R78l612q420P158j2625N362O306K132j933Q7O156
3962B2170O235j2417j4595r751q505K237N999R801P375P561L876l803l891m90
3948A1802q691K521Q119M521l993o613n119K712n499j5248o100J4328J7248m159
3934E829j1271J929m378q24l7l971J513J1411J6247M634q932o507r814k573n236
3919a1980m937Q220K333j65L902K924on931k965j343p169q748J555J2229j467
$$ plain form
3904 -13548 -9005 71 7327 8891 22258 31433 23974 21067 37659 34678 28374 21908 18390 16992
3890 16992 20626 21278 13122 14922 -1628 -5591 -1092 -12663 -19499 -19705 -3613 17878 29684 28920
3876 28920 20525 25899 26047 11735 1951 -6258 -9578 -4381 -7731 -14248 -24447 -27094 -22933 -22069 -25489
3861 -25489 -17233 -12730 -6988 -10578 -219 1205 -1710 7085 2883 -859 -5407 -3026 -244 8667
3847 8667 7569 -6693 -9761 -5770 -5053 -4281 -6028 -225 -13558 -29622 -25734 -19355 -3647 13212
3833 13212 12553 1221 -3682 -865 5226 -8077 -9342 -8433 -9679 -3358 3825 16275 16919 -3496
3819 -3496 -7204 236 -8386 -25663 -20318 -21056 -8084 14377 19681 -1817 -2534 4706 5172 14624 11491
3804 11491 -3528 -11497 -17924 -5502 -9819 -6240 9352 12030 104 -8743 -6835 -4543 1878 9526
$$ packed form
3904a3548M543R076P256J564J3367R175p459k907J6592k981o304o466l518j398
3890A6992L634O52q156J800j6550l963M499j1571o836k06J6092K1491J1806p64
3876B8920q395N374J48j4312r784q209l320N197l350o517j0199k647M161Q64l420
3861b5489Q256M503N742l590J0359J424k915Q795m202l742m548K381K782Q911
3847H667j098j4262l068L991P17P72j747N803j3333j6064L888O379J5708J6859
3833A3212o59j1332m903K817O091j3303j265R09j246O321P183J2450O44k0415
3819c496l708P440q622j7277N345p38J2972K2461N304k1498p17P240M66R452l133
3804A1491j5019p969o427J2422m317L579J5592K678j1926q847J908K292O421P648
$$ plain form
3790 9526 2072 -11846 -11344 -345 1896 2122 5616 -208 628 4960 9572 -5850 -12602 -14445 -20965
3775 -20965 -12981 -11769 -10826 960 10622 14352 7349 3570 12559 8728 3856 -2849 5995 -8166
3761 -8166 -16163 -8340 -14463 -20658 -24922 -31429 -31773 -18092 -8750 -1111 8208 17026 13751 6277 481
3746 481 12499 5954 -6509 -9888 -14176 -941 1929 -809 635 7671 2182 400 5748 3487
3732 3487 986 445 5793 12878 12105 4621 5150 9098 3507 -2581 -2187 4703 9928 16726 9732 -3046
3716 -3046 -10894 -13471 7621 626 -5485 -4953 -1336 -8458 -17758 -16709 -1709 4041 11789 12342 5796
3701 5796 5435 11904 21021 23181 27760 18702 4761 739 -6010 -11627 -16074 -6122 -3839 969 15921
3686 15921 17049 23211 16385 1268 -5272 -16410 -5559 -2479 -14701 -16522 -17445 -21522 -23219 -15700
$$ packed form
3790I526p454j3918N02J0999K241K26L494n824Q36M332M612j5422o752j843o520
3775b0965P984J212R43J1786R662L730p003l779Q989l831m872o705Q844j4161
3761h166p997P823o123o195m264o507l44J3681R342P639R319Q818l275p474n796
3746D81J2018o545j2463l379m288J3235K870k738J444P036n489j782N348k261
3732C487k501n41N348P085p73p484N29L948n591o088L94O890N225O798o994j2778
3716c046p848k577K1092o995o111N32L617p122r300J049J5000N750P748N53o546
3701E796l61O469R117K160M579r058j3941m022o749n617m447R952K283M808J4952
3686A5921J128O162o826j5117o540j1138J0851L080j2222j821r23m077j697P519
$$ plain form
3672 -15700 -15262 -29395 -41494 -37719 -22045 -9716 -5232 -9397 -3114 2924 9536 16096 9332 6192
3658 6192 -2618 -5816 -15077 -19439 -12815 -17010 -26096 -30551 -19728 2832 5392 6218 14396 21300 17650
3643 17650 3668 -3097 6795 -2753 5424 3876 -2864 -8523 2083 4205 -7052 -12793 -3586 -6747
3629 -6747 -18986 -12609 -15945 -17240 -6635 10179 6567 -9383 -16181 -15255 -3072 -2591 651 -7477
3615 -7477 -16072 -27504 -31155 -13961 -8442 -9639 1531 9091 9249 12072 10680 -4808 -5645 3496
3601 3496 43 868 -3127 -6236 -6087 -3699 1836 -1794 -9024 -24036 -22227 -11635 -8980 -11848 3844
3586 3844 1607 -965 -3221 -13304 -21441 -14902 -10328 -16686 -6743 -767 -4380 369 3393 9171 16400
3571 16400 14275 5665 -5226 3548 1042 -1078 3145 -2581 12467 7738 11306 31463 34936 17949
$$ packed form
3672a5700M38j4133j2099L775J5674J2329M484m165O283O038O612O560o764l140
3658F192q810l198r261m362O624m195r086m455J0823K2560K560Q26Q178O904l650
3643A7650j3982o765R892r548Q177j548o740n659J0606K122j1257n741R207l161
3629f747j2239O377l336j295J0605J6814l612j5950o798R26J2183M81L242q128
3615g477q595j1432l651J7194N519j197J1170P560J58K823j392j5488q37R141
3601C496l453Q25l995l109J49K388N535l630p230j5012J809J0592K655k868J5692
3586C844k237k572k256j0083q137O539M574o358R943N976l613M749L024N778P229
3571A6400k125q610j0891Q774k506k120M223n726J5048m729L568K0157L473j6987
$$ plain form
3557 17949 -3070 -2231 17413 27713 27807 27796 24347 12743 9209 6596 457 6156 -1493 -13909 -26946
3542 -26946 -31081 -15121 1221 5588 9605 6724 -12817 -13843 -15002 -17192 -17981 -18634 -5719 7054
3528 7054 -3945 -7562 -3139 -4051 -2199 -6170 -11004 -7052 -1676 5672 18040 12031 14479 9289 -1921
3513 -1921 -6232 -8424 -17134 -13754 -6887 -332 5134 7949 12076 13437 9135 -1739 -9098 1101
3499 1101 -4388 -7045 -5500 -14198 -20970 -13811 -13865 -26614 -25008 -11711 12150 21256 15051 756
3485 756 -11103 -23410 -37798 -25718 -17221 -18183 -12435 -20319 -27277 -13766 -3589 -2203 -8436 -12797
3471 -12797 -15882 4312 12395 10860 12731 2600 14967 8224 4187 1584 10714 27394 23960 21702
3457 21702 22379 20466 17680 10112 11574 21032 23000 14579 11127 -514 -2484 -17208 -19789 -14002
$$ packed form
3557A7949k1019Q39J9644J0300R4j1l449j1604l534k613o139N699p649j2416j3037
3542b6946m135J5960J6342M367M017k881j9541j026j159k190p89o53J2915J2773
3528G054j0999l617M423r12J852l971m834L952N376P348J2368o009K448n190j1210
3513a921m311k192q710L380O867O555N466K815M127J361m302j0874p359J0199
3499A101n489k657J545q698o772P159n4j2749J606J3297K3861R106o205j4295
3485G56j1859j2307j4388J2080Q497r62N748p884o958J3511J0177J386o233m361
3471a2797l085K0194Q083j535J871j0131J2367o743m037k603R130J6680l434k258
3457B1702O77j913k786p568J462R458J968q421l452j1641j970j4724k581N787
$$ plain form
3443 -14002 -11455 -1224 -2472 -10899 -14276 -12767 -16425 -19727 -4325 3158 14956 21132 15187 -6640
3429 -6640 -10596 -14553 -18662 -9081 -7678 2773 -12674 -10693 -12942 -26585 -21649 -8320 5557 -964
3415 -964 -17998 -11408 -5162 -5590 -11363 4683 23742 31063 19488 10614 24542 29955 27531 21323
3401 21323 13920 7876 9306 14097 -8325 -19503 -19519 -6627 12285 2421 -10429 -31825 -29336 -28084
3387 -28084 -21198 -3425 2452 197 5381 10257 1856 -5836 -2080 3959 10160 10970 18662 15481 16279
3372 16279 11615 8879 22623 31064 24591 13651 6183 13252 16323 4440 -12448 -21822 -24754 -6489
3358 -6489 -4572 -78 11528 21493 9997 9933 26802 24326 22890 15855 8906 1046 -8203 -12495 -9492
3343 -9492 -12197 -6705 -11366 -7046 -662 10321 -1941 -5411 -6516 -6794 -19411 -4866 7913 -2807
$$ packed form
3443a4002K547J0231j248q427l377J509l658l302J5402P483J1798O176n945k1827
3429f640l956l957m109R581J403J0451j5447J981k249j3643M936J3329J3877o521
3415i64j7034O590O246m28n773J6046J9059P321j1575q874J3928N413k424o208
3401B1323p403o044J430M791k2422j1178j6J2892J8912r864j2850k1396K489J252
3387b8084O886J7773N877k255N184M876q401p692L756O039O201Q10P692l181P98
3372A6279m664k736J3744Q441o473j0940p468P069L071j1883j6888r374k932J8265
3358f489J917M494J1606R965j1496o4J6869k476j436p035o949p860r249m292L003
3343i492k705N492m661M320O384J0983j2262l470j105k78j2617J4545J2779j0720
$$ plain form
3329 -2807 -6173 -14127 -9472 -655 -453 -4197 -4023 -9463 -9693 4422 4424 6438 12380 13060 15931 20074
3313 20074 1803 -17853 -21647 -11693 -2853 4372 -10966 -11885 3343 845 -17525 -12538 -7638 -14018
3299 -14018 -24128 -30966 -20442 -7607 1629 -3391 2733 -6364 -3324 -9120 -24004 -28960 -33722 -41418
3285 -41418 -31876 -31740 -39660 -44374 -39008 -20795 -18488 -5019 -5258 -15369 -17792 -27835 -16925 -406
3271 -406 2839 -7120 -9700 6738 4997 -10741 -34149 -34707 -7612 1907 11299 7037 2880 5731
3257 5731 4862 9699 -1525 2141 -10312 -22491 -19071 327 8149 9527 13379 16521 6150 8325
3243 8325 15130 8718 15363 26032 27424 11814 9624 13521 10452 7148 33 -5963 -2201 3492
3229 3492 9349 16403 15574 2417 1048 -14509 -25431 -26877 -22602 -18026 -18904 -9238 -2779 -1650 9220
$$ packed form
3329b807l366p954M655Q817K02l744J74n440k30J4115KK014N942O80K871M143
3313B0074j8271j9656l794R954Q840P225j5338r19J5228k498j8370M987M900o380
3299a4018j0110o838J0524J2835R236n020O124r097L040n796j4884m956m762p696
3285d1418R542J36p920m714N366J8213K307J3469k39j0111k423j0043J0910J6519
3271d06L245r959k580J6438j741j5738k3408n58K7095R519R392m262m157K851
3257E731q69M837j1224L666j2453j2179L420J9398P822J378L852L142j0371K175
3243H325O805o412O645J0669J392j5610k190L897l069l304p115n996L762N693
3229C492N857P054q29j3157j369j5557j0922j446M275M576q78R666O459J129J0870
$$ plain form
3214 9220 12690 22442 6510 -6136 -9371 -12002 -29677 -19473 -14592 -10343 5798 16211 10272
3201 10272 1098 -4521 -6111 -59 3747 12589 13626 -1979 2560 -8990 -4153 -4373 -14075 -16459
3187 -16459 -8513 10822 19205 5863 4907 10194 13300 20613 18738 19517 22039 24002 11532 11285 20486
3172 20486 17532 10297 18783 18662 15053 5004 -4752 6003 951 -18846 -27351 -16086 4057 5351
3158 5351 1614 3373 -7881 -2343 771 10506 10637 697 -21051 -25273 -18907 -2573 13528 21292
3144 21292 18500 11741 10597 10616 10992 3332 -1676 5011 -2407 6825 23829 26352 21586 22515 11719
3129 11719 4765 -4239 -13461 -12985 -10995 -4987 -12393 -10754 -8318 -1882 -9293 -5492 -2791 2104 -444
3114 -444 -15894 -7491 7141 1001 878 11292 546 -6211 -12885 -13575 -11174 -12914 -28710 -25710
$$ packed form
3214I220L470R752j5932j2646l235k631j7675J0204M881M249J6141J0413n939
3201A0272r174n619j590O052L806Q842J037j5605M539j1550M837k20r702k384
3187a6459P946J9335Q383j3342r56N287L106P313j875P79K522J963j2470k47R201
3172B0486k954p235Q486j21l609j0049r756J0755n052j9797q505J1265K0143J294
3158E351l737J759j1254N538L114R735J31r940k1748m222O366J6334J6101P764
3144B1292k792o759j144J9L76p660n008O687p418R232J7004K523m766R29j0796
3129A1719o954r004r222M76J990O008p406J639K436O436p411L801K701M895k548
3114d44j5450Q403J4632o140j23J0414j0746o757o674o90K401j740j5796L000
$$ plain form
3100 -25710 -10347 -16470 -6749 7011 7852 -6979 -22689 -7714 1796 -5334 3268 -2557 -10470 -9832
3086 -9832 -1904 2969 -4626 -8395 11199 20797 15627 2342 -6763 15586 32255 16350 15793 7609
3072 7609 -5788 -5337 -84 3090 -733 13088 15740 12181 1607 -15623 -14600 15480 21262 8080
3058 8080 18879 22302 19704 26992 31444 36105 30760 33862 38941 21918 -3495 -12800 -7954 1239
3044 1239 4395 13496 12540 13739 9030 5649 3562 4406 -1447 -2929 10436 29400 33330 15165 2360
3029 2360 1736 6033 6032 1895 7889 9322 -1150 -649 6475 5286 394 2640 1916 -3869 -10080 1921
3013 1921 14602 14574 19035 24202 26533 31748 22618 8444 5034 11953 18244 21983 4287 -10162
2999 -10162 8357 4261 5186 4267 6777 -397 1204 -19920 -15393 -5553 5401 4260 4784 787 -3601
$$ packed form
3100b5710J5363o123R721J3760Q41j4831j5710J4975R510p130Q602n825p913O38
3086i832P928M873p595l769J9594R598n170j3285r105K2349J6669j5905n57q184
3072G609j3397M51N253L174l823J3821K652l559j0574j7230J023L0080N782j3182
3058H080J0799L423k598P288M452M661n345L102N079j7023k5413r305M846R193
3044A239L156R101r56J199m709l381k087Q44n853j482J3365J8964L930j8165j2805
3029B360o24M297jm137N994J433j0472N01P124j189m892K246p24n785o211J2001
3013A921J2681k8M461N167K331N215r130j4174l410O919O291L739j7696j4449
2999a0162J8519m096R25r19K510p174J601k1124M527R840J0954j141N24l997m388
$$ plain form
2984 -3601 -2726 -5575 816 -2928 9910 20598 20255 -624 -3543 8113 5173 -2402 -15050 -10426
2970 -10426 -4039 -4057 -8825 -12910 -13768 -14697 -5952 -1306 -2587 8162 17710 18415 8677 -2473 945
2955 945 10323 5370 3231 8303 13819 17963 9761 8699 20345 29394 26163 11532 1166 -8567
2941 -8567 -11838 -2231 2974 -9682 -20902 -16510 -14427 -12524 -8248 -9924 -6209 -10747 -9284 -3198
2927 -3198 7475 15507 9683 -4579 -2666 6390 455 4193 4931 6876 12145 7421 -10935 -13366
2913 -13366 -10865 -14885 -15663 -17963 -22602 -16492 -10032 -8909 5405 5349 -1881 10304 15125 15578 11533
2898 11533 2696 -3654 18495 29756 37854 34679 22061 23347 34337 30278 22986 25765 17954 10885
2884 10885 18422 22830 21085 22559 25602 23658 20807 16544 10553 14084 25103 18817 23691 11641
$$ packed form
2984c601Q75k849O391l744J2838J0688l43k0879k919J1656k940p575j2648M624
2970a0426O387j8m768m085q58r29Q745M646j281J0749R548P05r738j1150L418
2955I45R378m953k139N072N516M144q202j062J1646R049l231j4631j0366r733
2941h567l271R607N205j2656j1220M392K083J903M276j676L715m538J463O086
2927c198J0673Q032n824j4262J913R056n935L738P38J945N269m724j8356k431
2913a3366K501m020p78k300m639O110O460J123J4314n6p230J2185M821M53m045
2898A1533q837o350K2149J1261Q098l175j2618J286J0990m059p292K779p811p069
2884A0885P537M408j745J474L043j944k851m263n991L531J1019o286M874j2050
$$ plain form
2870 11641 3374 2609 12842 23300 5135 -10493 699 8297 -895 -13183 -9813 6003 5076
2857 5076 4309 1647 3826 736 4459 8510 9760 -3137 -5604 -10319 12105 14949 4859 873
2843 873 -5398 -19657 -41478 -35292 -21312 7492 19669 -1586 -4166 5599 1970 -896 2529 152
2829 152 8967 2022 -2484 -6785 5039 -133 9688 11317 8883 9993 18172 27267 16918 1425
2815 1425 -4330 1396 15807 24023 28854 15669 1349 900 6624 20432 10832 -10603 -11682 -10290
2801 -10290 -14555 -11177 -12518 -2944 2574 493 -12550 -8800 -13407 -16235 -5793 -9364 -22610 -9881
2787 -9881 -3808 -9395 2853 -3961 -4560 -12190 -14446 6047 1890 -1034 -4716 401 -15677 -15801 2373
2772 2373 17377 18839 8745 2012 3801 1562 5637 -299 -10836 -19411 -11418 -12693 -9477 -625
$$ packed form
2870A1641q267p65J0233J0458j8165j5628J1192P598r192j2288L370J5816r27
2857E076p67k662K179l090L723M051J250j2897k467m715K2424K844j0090l986
2843H73o271j4259k1821O186J3980K8804J2177k1255k580R765l629k866L425k377
2829A52Q815o945m506m301J1824n172R821J629k434J110Q179R095j0349j5493
2815A425n755N726J4411Q216M831j3185j4320m49N724J3808r600k1435j079J392
2801a0290m265L378j341R574N518k081j3043L750m607k828J0442l571j3246J2729
2787i881O073n587J2248o814n99p630k256K0493m157k924l682N117j6078j24J8174
2772B373J5004J462j0094o733J789k239M075n936j0537q575P993j275L216Q852
$$ plain form
2758 -625 1822 1756 2143 5848 4481 7237 8567 10554 32279 31603 21139 22841 -3647 -3997 1840 34
2742 34 -3319 -6344 -2383 8034 -1769 -1656 -3062 -7979 -8298 -264 -1387 10085 18345 10268 -22068
2727 -22068 -21466 -2049 19014 18829 9672 1670 -289 1970 -2515 -5885 877 -7111 -14477 -20391 -24623
2712 -24623 -20278 -13709 -2282 1431 -1148 -3901 -4348 -6915 -7961 -795 -9928 -8984 -1465 -1343 -1524
2697 -1524 1321 12057 6460 -4452 -3436 -4287 8522 19067 13507 29771 36854 27420 16554 9715
2683 9715 8999 10075 3322 -3935 -1107 3307 1612 1586 1053 3667 -3930 -561 8876 -530 -8072 -12788
2667 -12788 -12518 -8542 -6633 -3321 5620 1469 4814 12863 17254 7237 -3129 5742 16220 15440
2653 15440 9327 -4939 -10952 -14777 -17470 -6469 -413 10424 10437 -3839 -5284 -2655 -9110 -8080
$$ packed form
2758f25K447o6L87L705j367K756J330J987K1725o76j0464J702k6488l50N837j806
2742C4l353l025L961J0417r803J13j406m917l19Q034j123J1472Q260q077l2336
2727b2068O02J9417K1063j85r157q002j959K259m485l370O762p988p366n914m232
2712b4623M345O569J1427L713k579k753m47k567j046P166r133R44P519J22j81
2697a524K845J0736n597j0912J016q51J2809J0545n560J6264P083r434j0866o839
2683I715p16J076o753p257K828M414j695k6n33K614p597L369R437r406p542m716
2667a2788K70L976J909L312Q941m151L345Q049M391j0017j0366Q871J0478p80
2653A5440o113j4266o013l825k693J1001O056J0837J3j4276j445K629o455J030
$$ plain form
2639 -8080 1882 -860 -9517 -7446 4621 2148 -14584 -12331 5859 9652 11489 5924 -6265 -7003
2625 -7003 -3197 -1562 -6489 -9258 -4098 4597 10772 15718 19566 16020 2142 -2284 5288 10221 8655
2610 8655 20880 24085 19805 7508 -3398 -16169 -25981 -24181 -18971 -16650 -26106 -28039 -18865 -2969
2596 -2969 -2199 -10493 4886 15711 14445 5220 -16277 -8994 -6237 -21661 -17442 -12685 -12887 -10678
2582 -10678 -3353 8783 13509 697 1990 10576 10578 10784 19916 22191 16829 15746 18462 27906 21605
2567 21605 11301 10664 7689 -7175 -10984 6908 992 -4176 -3919 2358 -1592 -10013 -12987 -7612
2553 -7612 -3448 -4993 -2537 6521 19548 12979 14903 17702 20656 12960 839 -6958 -8972 10816
2539 10816 14590 13110 8709 4786 8510 422 -8188 -8245 -4571 -2093 17070 35410 19180 11750
$$ packed form
2639h080R962k742q657K071J2067k473j6732K253J8190L793J837n565j2189p38
2625g003L806J635m927k769N160Q695O175M946L848l546j3878m426P572M933j566
2610H655J2225L205m280j2297j0906j2771r812J800N210K321r456j933R174J5896
2596b969P70q294J5379J0825j266r225k1497P283K757j5424M219M757k02K209
2582a0678P325J2136M726j2812J293Q586KK06R132K275n362j083K716R444o301
2567B1605j0304o37k975j4864l809J7892n916n168K57O277l950q421k974N375
2553g612M164j545K456R058J3027o569J924K799K954p696j2121p797k014J9788
2539A0816L774j480m401l923L724q088q610n7L674K478J9163J8340j6230p430
$$ plain form
2525 11750 9320 -11710 -21320 -21733 -8739 10088 35 -7558 3624 -2407 -218 -3878 -9479 -3427
2511 -3427 -2122 -5042 7192 6102 13126 10729 -622 -6057 -3293 -2146 5831 15854 21884 20405
2497 20405 29214 34816 18169 4863 24066 27058 7590 -773 2919 7090 9148 -2438 -9249
2484 -9249 -5849 -1719 -6365 -2723 -1475 -259 12800 11496 3623 -7693 -6960 -4203 -7461 -15938 -16428
2469 -16428 1980 18332 13062 11430 17638 9978 -6592 -7686 8239 15795 -11923 -18748 -5052
2456 -5052 1172 13202 8569 2093 8418 -660 1797 21721 25821 11197 5293 -7479 -11265 -43
2442 -43 13149 7366 13931 11076 -3079 -16951 -22972 -16104 -10896 -3297 -2638 -14376 -22979 -15502 -14124
2427 -14124 -7212 -8153 -11387 -1693 2335 -7058 -12583 -4541 7718 10094 9022 8032 6143 9121 6458
$$ packed form
2525A1750k430k1030r610m13J2994J8827j0053p593J1182o031K189l660n601O052
2511c427J305k920J2234j090P024k397j1351n435K764J147P977J0023O030j479
2497B0405Q809N602j6647j3306J9203K992j9468q363L692M171K058j1586o811
2484i249L400M130m646L642J248J216J3059j304p873j1316P33K757l258q477m90
2469a6428J8408J6352n270j632O208p660j6570j094J5925P556k7718o825J3696
2456e052O224J2030m633o476O325r078K457J9924M100j4624n904j2772l786J1222
2442d3J3192n783O565k855j4155j3872o021O868N208P599O59j1738q603P477J378
2427a4124O912r41l234R694M028r393n525Q042J2259K376j072r90j889K978k663
$$ plain form
2412 6458 -5253 -7091 3566 15892 13107 5906 3779 8021 4053 -2951 -7356 -357 3234 -11051
2398 -11051 -8310 -279 -8738 -13505 -18492 -858 13972 12767 3629 -8962 -5764 -1909 254 4538
2384 4538 4022 -840 2620 8581 18424 20870 14165 20518 22725 8103 6388 13724 17635 5423 -8228
2369 -8228 -22844 -32680 -25503 -22621 -26554 -31350 -12239 5280 10830 15948 18547 5207 -13746 -18436
2355 -18436 475 -4853 596 16672 25077 25563 23168 17025 15008 15423 13032 13953 3063 9025 5596
2340 5596 4870 -740 -3036 -8989 -16932 -16266 -10681 1496 6628 16855 27686 27314 11115 7876 13747
2325 13747 4120 -12805 -2356 -3021 -5087 485 -6439 -8264 -6728 -14757 -20257 -14640 -6917 -5364
2311 -5364 3832 3411 -7870 -12678 -17994 -10781 -2980 6252 -787 -14025 -14716 -8848 -10884 -11837 -1810
$$ packed form
2412F458j1711j838J0657J2326k785p201k127M242l968p004m405O999L591j4285
2398a1051K741Q031q459m767m987J7634J4830j205r138j2591L198L855K163M284
2384D538n16m862L460N961R843K446o705O353K207j4622j715P336L911j2212j3651
2369h228j4616r836P177K882l933m796J9111J7519N550N118K599j3340j8953m690
2355a8436J8911n328N449J6076Q405M86k395o143k017M15k391R21j0890N962l429
2340E596p26n610k296n953p943O66N585J2177N132J0227J0831l72j6199l239N871
2325A3747r627j6925J0449o65k066N572o924j825J536q029n500N617P723J553
2311e364R196m21j1281m808n316P213P801R232p039j3238o91N868k036r53J0027
$$ plain form
2296 -1810 -7714 -574 6015 4642 8372 3625 374 -2898 248 9009 19492 20310 14105 24187 10344
2281 10344 5332 -10817 -26789 -30928 -15197 -4380 5792 9830 18218 10458 2853 -2896 -19061
2268 -19061 -14159 -203 3712 5948 15811 28016 22057 6237 -2699 1779 3526 9393 8585 -6175
2254 -6175 -17604 -251 -175 -14160 -7505 -10944 -16881 3198 9862 8510 3821 11582 7011 -15178
2240 -15178 -32915 -36950 -20690 -18735 -22883 -9261 -16761 -13080 -22282 -31798 -12261 1466 -2767
2227 -2767 -11649 -24370 -24567 -17440 -23764 -1823 -3953 -11622 -6268 -13085 -10230 -17650 -21455 -12949 -17605
2212 -17605 -16921 -8137 -11038 297 -1861 -1898 4797 7412 10045 -6102 398 7453 -2755 6270 16581
2197 16581 29599 23817 20863 28548 14585 -9496 -3125 -4182 2129 -7828 -18637 -20954 -6945
$$ packed form
2296a810n904P140O589j373L730m747l251l272L146Q761J0483Q18o205J0082j3843
2281A0344n012j6149j5972m139J5731J0817J0172M038Q388p760p605n749j6165
2268a9061M902J3956L915K236R863J2205n959j5820q936M478J747N867q08j4760
2254f175j1429J7353P6j3985O655l439n937K0079O664j352m689P761m571k2189
2240a5178j7737m035J6260J955m148J3622p500L681r202r516J9537J3727m233
2227b767q882j2721j97P127o324K1941k130p669N354o817K855p420l805Q506m656
2212a7605O84Q784k901J1335k158l7O695K615K633j6147O500P055j0208R025J0311
2197A6581J3018n782k954P685j3963k4081O371j057O311r957j0809k317J4009
$$ plain form
2184 -6945 2296 8359 3560 -9600 -1951 9163 3479 -2524 1033 1698 -1568 -9103 -9678 -8880 -10737
2169 -10737 -8062 -4430 3295 2472 681 5631 -668 11751 17320 7730 2509 -6878 -8092 -15164 -31711
2154 -31711 -38179 -25761 -12254 -14598 -13169 -12802 -7976 -5222 -3588 2822 10652 9733 10971 16778 -876
2139 -876 2205 5037 -12450 -9803 8097 12934 17154 16736 8838 3056 3162 17212 29854 23773 10355
2124 10355 6528 1210 6745 3901 -14168 -18664 -12500 -8849 -4944 4298 2496 9653 21246 26478
2110 26478 15855 4388 8618 12537 10668 15375 8897 14524 20530 23740 25796 23122 12700 17408
2096 17408 16704 11926 1531 -4460 -6285 -8755 3325 -5131 -22318 -19105 -8692 -5553 8755 4190
2082 4190 20084 29636 33721 30214 22188 3666 -4409 403 16963 17950 1977 -3395 -1568 -6475
$$ packed form
2184f945R241O063m799j3160P649J1114n684o003L557O65l266p535n75P98j857
2169a0737K675L632P725q23j791M950o299J2419N569r590n221r387j214p072j6547
2154c1711o468J2418J3507k344J429L67M826K754J634O410P830r19J238N807j7654
2139h76L081K832j7487K647J7900M837M220m18p898n782J06J4050J2642o081j3418
2124A0355l827n318N535k844j8069m496O164L651L905R242j802P157J1593N232
2110B6478j0623j1467M230L919j869M707o478N627O006L210K056k674j0422M708
2096A7408p04m778j0395n991j825k470J2080q456j7187L213J0413L139J4308m565
2082D190J5894R552M085l507q026j8522q075M812J6560R87j5973n372J827m907
$$ plain form
2068 -6475 1466 2666 8067 8553 -1609 2075 7642 12617 8622 11672 14147 14609 -6250 -11104 -16166
2053 -16166 -8976 2781 6732 115 4421 9502 14288 2596 457 8372 -2441 -3160 -7209 -13850
2039 -13850 1456 5217 1839 1879 -6294 -6567 -4655 6745 7487 1284 -8965 -24481 -14865 -8793 -9073
2024 -9073 -16876 -20973 -22713 -10756 -4787 -3456 -5540 -14190 -5474 8205 3384 3586 -5699 -8644 8457
2009 8457 14521 5761 4398 -3186 151 8764 9087 17853 11808 14999 15211 11163 21746 32005 34902
1994 34902 27682 25999 23404 15645 18377 7056 -10435 -3676 5683 1892 1665 8345 11658 -8921
1980 -8921 -30304 -21726 -4865 -706 1707 -1032 -6585 -7876 -13 1076 -11824 -21168 -27756 -26196
1966 -26196 -16285 -19886 -20563 1462 10318 10678 5042 7228 310 -6950 -17192 -14414 -5350 12311
$$ packed form
2068f475P941J200N401M86j0162L684N567M975l995L050K475M62k0859m854n062
2053a6166P190J1757L951o617M306N081M786j1692k139P915j0813p19m049o641
2039a3850J5306L761l378M0q173k73J912J1400P42o203j0249j5516R616O072k80
2024i073p803m097j740J1957N969J331k084q650Q716J3679m821K02r285k945J7101
2009H457O064q760j363p584L337Q613L23Q766o045L191K12m048J0583J0259K897
1994C4902p220j683k595p759K732j1321j7491O759R359l791k27O680L313k0579
1980h921k1383Q578J6861M159K413k739n553j291P863J089j2900r344o588J560
1966b6196R911l601o77K2025Q856L60n636K186o918p260j0242K778R064J7661
$$ plain form
1952 12311 32102 33149 14311 -11229 -26783 -27613 -12672 -13589 -11049 -8281 -10606 -6191 -2754 -8
1938 -8 10730 7020 2324 -2760 -12 8749 5794 9068 5764 3313 -11615 -24066 -25435 -20058 -7799
1923 -7799 1556 7989 -2736 -15337 -12363 -1914 4565 8216 -1985 -8512 1991 -4133 -5203 4062
1909 4062 -45 731 7826 14695 15427 5387 -2099 -11721 -6862 -230 -16333 -10067 -646 6850 6700
1894 6700 -1945 -4962 -7834 -11468 3123 16461 12223 4053 2183 5984 5443 -3748 -12789 -17870 -1814
1879 -1814 17164 12851 13787 15495 7282 -9538 -5878 6823 1900 -418 -9440 -23436 -26556 -23413
1865 -23413 -4360 8756 8791 10779 12457 14559 16342 10309 3264 797 1838 1624 8030 7755 7540
1850 7540 4405 7876 6845 7540 3248 5739 10965 6673 2366 6761 7326 -2990 576 -2863 -10131
$$ packed form
1952A2311J9791J047j8838k5540j5554q30J4941r17K540K768k325M415L437K746
1938hJ0738l710m696n084K748Q761k955L274l304k451j4928j2451j369N377J2259
1923g799R355O433j0725j2601K974J0449O479L651j0201o527J0503o124j070R265
1909D062m107P76P095O869P32j0040p486r622M859O632j6103O266R421P496j50
1894F700q645l017k872l634J4591J3338m238q170j870L801n41r191r041n081J6056
1879a814J8978m313R36J708q213j6820L660J2701m923k318r022j3996l120L143
1865b3413J9053J3116L5J988J678K102J783o033p045k467J041k14O406k75k15
1850G540l135L471j031O95m292K491N226m292m307M395N65j0316L566l439p268
$$ plain form
1835 -10131 -13764 -16327 -22057 -10380 -12827 -20061 -22347 -18988 -17649 -9340 -8519 2244 2138 1359 15646
1820 15646 26790 19870 9352 2605 16234 10520 -4019 -6799 6004 20535 5105 662 884
1807 884 -5883 5832 13286 551 -15529 -7707 4179 -166 -11813 -11864 -3629 693 -3468 -2858 -2950
1792 -2950 817 9167 22877 27713 14751 3750 6112 -96 -15202 -10234 12688 9867 6819 13137
1778 13137 16329 8227 983 -6293 -7783 1236 14292 9660 15296 17282 14803 16152 18189 11107
1764 11107 2534 -10758 -20297 -19311 -10607 -3273 1154 3553 5109 -1219 -617 6845 -465 1883 6470
1749 6470 9254 15933 17597 10840 9607 9517 -6703 4852 21032 10740 -3523 -11424 -5161 649
1735 649 -1926 -22816 -17971 -15199 -31899 -50302 -56378 -48274 -30189 -14964 -15291 -12285 -2076 13060
$$ packed form
1835a0131l633k563n730J1677k447p234k286L359J339Q309Q21J0763j06p79J4287
1820A5646J1144o920j0518o747J3629n714j4539k780J2803J4531j5430m443K22
1807H84o767J1715P454j2735j6080P822J1886m345j1647n1Q235M322m161O10r2
1792b950L767Q350J3710M836j2962j1001K362o208j5106M968K2922k821l048O318
1778A3137L192q102p244p276j490R019J3056m632N636J986k479J349K037p082
1764A1107q573j3292r539R86Q704P334M427K399J556o328O02P462p310K348M587
1749F470K784O679J664o757j233r0j6220J1555J6180j0292j4263p901O263N810
1735F49k575k0890M845K772j6700j8403o076Q104J8085J5225l27L006J0209J5136
$$ plain form
1721 13060 13274 9853 8107 -9629 -11151 -12048 -23778 -13380 -5379 -2989 -7154 -5285 -3172 -3475 2258
1706 2258 3744 -10463 -5659 9677 1786 3302 1846 9493 7146 3325 830 9116 24453 20320
1692 20320 3911 -4252 -11633 -3069 -682 8549 15674 25115 31737 23495 20961 15458 6326 -109
1678 -109 -7728 -13764 -32084 -49552 -46084 -35456 -19045 -10973 -14031 -25319 -30873 -18104 6592
1665 6592 3567 -7992 -20035 -8185 -7607 -16159 -14255 -8919 -33637 -33466 -13519 -9663 -7274 -20772
1651 -20772 -22102 -13855 -6703 1695 -2055 17 -85 -5522 -14708 -17000 -13101 -17203 -21151 -17290 -5845
1636 -5845 3557 22955 31398 13295 -2899 -3837 -617 4131 4324 -5412 -13693 -608 1937 11384
1622 11384 10966 14923 -1800 -11269 -3809 -1829 -7495 -12613 -18217 -4973 4081 -122 -1430 -3249
$$ packed form
1721A3060K14l421j746j7736j522q97j1730J0398Q001K390m165J869K113l03N733
1706B258J486j4207M804J5336p891J516j456P647k347l821k495Q286J5337m133
1692B0320j6409q163p381Q564K387R231P125R441O622q242k534n503r132o435
1678a09p619o036j8320j7468L468J0628J6411Q072l058j1288n554J2769K4696
1665F592l025j1559j2043J1850N78q552J904N336k4718J71J9947L856K389j3498
1651b0772j330Q247P152Q398l750K072j02n437r186k292L899m102l948L861J1445
1636e845R402J9398Q443j8103j6194r38L220M748J93r736q281J3085K545R447
1622A1384m18L957j6723r469P460J980n666n118n604J3244R054m203j308j819
$$ [...]
##END NTUPLES=NMR SPECTRUM
##END=
