##TITLE=Analysis number a0161583
Compound Code ac 30454
Book Reference a0161583
Project Code qc-fl
Chemist Name jom
##JCAMPDX= 6.0         $$ Bruker NMR JCAMP-DX V2.0
##DATA TYPE= NMR SPECTRUM
##DATA CLASS= NTUPLES
##ORIGIN= Bruker BioSpin GmbH
##OWNER= nmr
$$ XWIN-NMR		Version 3.5
$$ Tue Apr 10 09:30:27 2007 GMT Daylight Time (UT+1h)  MAYBRIDGE\nmr@NMR_250MHZ
##.OBSERVE FREQUENCY= 250.131544655141
##.OBSERVE NUCLEUS= ^1H
##.ACQUISITION MODE= SIMULTANEOUS (DQD)
##.ACQUISITION SCHEME= undefined
##.AVERAGES= 16
##.DIGITISER RES= 18
##SPECTROMETER/DATA SYSTEM= dpx250
##.PULSE SEQUENCE= zg30
##.SOLVENT NAME= DMSO
##.SHIFT REFERENCE= (INTERNAL, DMSO, 0, 16.522)
##AUDIT TRAIL= $$ (NUMBER, WHEN, WHO, WHERE, WHAT)
$$ ##TITLE= Audit trail, XWIN-NMR		Version 3.5
$$ ##JCAMPDX= 5.01
$$ ##ORIGIN= Bruker BioSpin GmbH
$$ ##OWNER= nmr
$$ C:\u/data/dgb/nmr/ADRS/690/pdata/1/auditp.txt
$$ ##AUDIT TRAIL=  $$ (NUMBER, WHEN, WHO, WHERE, WHAT)
(   1,<2007-04-10 09:30:06.63 +100>,<MAYBRIDGE\nmr>,<NMR_250MHZ>,
      <created by zg, POWCHK disabled, PULCHK disabled
       configuration hash MD5:
       49 4B E0 1D 92 C2 6B 37 9F E6 65 BC 52 41 86 1D
       data hash MD5: 64K
       85 D3 45 31 20 6F 6E 67 0D E5 21 2D 99 E5 CC 3D>)
(   2,<2007-04-10 09:30:18.92 +100>,<MAYBRIDGE\nmr>,<NMR_250MHZ>,
      <Start of raw data processing
       ef LB = 0.3 FT_mod = 6 PKNL = 1 SI = 32K 
       data hash MD5: 32K
       27 E8 5E 3B 70 D6 E8 F4 8F 9F 43 81 5F 66 99 25>)
(   3,<2007-04-10 09:30:20.54 +100>,<MAYBRIDGE\nmr>,<NMR_250MHZ>,
      <apk 
       data hash MD5: 32K
       C8 77 CB 4E 40 0D C8 30 82 F4 4F 85 83 0C E2 48>)
(   4,<2007-04-10 09:30:21.24 +100>,<MAYBRIDGE\nmr>,<NMR_250MHZ>,
      <abs ABSG = 5 
       data hash MD5: 32K
       98 6C C1 2F 03 42 06 75 98 BC 7D BA 29 EE 7D E6>)
$$ ##END=
$$ 
$$ hash MD5
$$ 88 3F 28 D1 B8 8A FC 56 FF 53 FE EA 9D 57 18 47
##$RELAX= 
##$RELAX= 
##$RELAX= 
##$RELAX= 
##$RELAX= 
##$RELAX= 
##$RELAX= 
$$ Bruker specific parameters
$$ --------------------------
##$DU= <C:\u>
##$EXPNO= 690
##$NAME= <ADRS>
##$PROCNO= 1
##$TYPE= <nmr>
##$USER= <dgb>
##$AMP= (0..31)
100 100 100 100 100 100 100 100 100 100 100 100 100 100 100 100 100 100 
100 100 100 100 100 100 100 100 100 100 100 100 100 100 
##$AQSEQ= 0
##$AQ_mod= 3
##$AUNM= <au_zg>
##$AUTOPOS= <6 >
##$BF1= 250.13
##$BF2= 250.13
##$BF3= 250.13
##$BF4= 250.13
##$BF5= 500.13
##$BF6= 500.13
##$BF7= 500.13
##$BF8= 500.13
##$BYTORDA= 1
##$CFDGTYP= 0
##$CFRGTYP= 5
##$CHEMSTR= <none>
##$CNST= (0..31)
1 1 145 1 1 1 1 1 1 1 1 1 1 1 1 1 1 1 1 1 1 1 1 1 1 1 1 1 1 1 1 1 
##$CPDPRG= <>
##$CPDPRG1= <>
##$CPDPRG2= <>
##$CPDPRG3= <>
##$CPDPRG4= <mlev>
##$CPDPRG5= <mlev>
##$CPDPRG6= <mlev>
##$CPDPRG7= <mlev>
##$CPDPRG8= <mlev>
##$CPDPRGB= <>
##$CPDPRGT= <>
##$D= (0..31)
0 1 0 0 0 0 0 0 0 0.06 0 0 0 0 0 0 0.0002 0 0 0 0 0 0 0 0 0 0 0 0 0 0 
0 
##$DATE= 1176193805
##$DBL= (0..7)
120 120 120 120 120 120 120 120 
##$DBP= (0..7)
150 150 150 150 150 150 150 150 
##$DBP07= 0
##$DBPNAM0= <>
##$DBPNAM1= <>
$$ [...]
##$SUBNAM7= <"">
##$SUBNAM8= <"">
##$SUBNAM9= <"">
##$SW= 20.6930455092707
##$SWIBOX= (0..15)
0 0 3 0 0 0 0 0 0 0 0 0 0 0 0 0 
##$SW_h= 5175.983436853
##$TD= 65536
##$TD0= 1
##$TE= 683.16
##$TE2= 300
##$TE3= 300
##$TEG= 300
##$TL= (0..7)
0 120 120 120 120 120 120 120 
##$TP= (0..7)
150 150 150 150 150 150 150 150 
##$TP07= 0
##$TPNAME0= <>
##$TPNAME1= <>
##$TPNAME2= <>
##$TPNAME3= <>
##$TPNAME4= <>
##$TPNAME5= <>
##$TPNAME6= <>
##$TPNAME7= <>
##$TPOAL= (0..7)
0.5 0.5 0.5 0.5 0.5 0.5 0.5 0.5 
##$TPOFFS= (0..7)
0 0 0 0 0 0 0 0 
##$TUNHIN= 0
##$TUNHOUT= 0
##$TUNXOUT= 0
##$USERA1= <user>
##$USERA2= <user>
##$USERA3= <user>
##$USERA4= <user>
##$USERA5= <user>
##$V9= 5
##$VALIST= <valist>
##$VCLIST= <CCCCCCCCCCCCCCC>
##$VD= 0
##$VDLIST= <DDDDDDDDDDDDDDD>
##$VPLIST= <PPPPPPPPPPPPPPP>
##$VTLIST= <TTTTTTTTTTTTTTT>
##$WBST= 1024
##$WBSW= 4
##$XGAIN= (0..3)
0 0 0 0 
##$XL= 0
##$YL= 0
##$YMAX_a= 262456
##$YMIN_a= -384974
##$ZGOPTNS= <>
##$ZL1= 120
##$ZL2= 120
##$ZL3= 120
##$ZL4= 120
##$ABSF1= 16.522
##$ABSF2= -4.171173
##$ABSG= 5
##$ABSL= 3
##$ALPHA= 0
##$AQORDER= 0
##$ASSFAC= 0
##$ASSFACI= 0
##$ASSFACX= 0
##$ASSWID= 0
##$AUNMP= <proc_1d>
##$AZFE= 0.1
##$AZFW= 0.1
##$BCFW= 0
##$BC_mod= 0
##$BYTORDP= 0
##$COROFFS= 0
##$CY= 12.5
##$DATMOD= 1
##$DC= 0
##$DFILT= <>
##$DTYPP= 0
##$F1P= 14.0000005364418
##$F2P= -0.99999901652339
##$FCOR= 0.5
##$FTSIZE= 32768
##$FT_mod= 6
##$GAMMA= 0
##$GB= 0
##$INTBC= 1
##$INTSCL= 1
##$ISEN= 128
##$LB= 0.3
##$LEV0= 0
##$LPBIN= 0
##$MAXI= 10000
##$MC2= 0
##$MEAN= 0
##$ME_mod= 0
##$MI= 0
##$NCOEF= 0
##$NC_proc= -5
##$NLEV= 6
##$NOISF1= 0
##$NOISF2= 0
##$NSP= 0
##$NTH_PI= 0
##$NZP= 0
##$OFFSET= 16.522
##$PC= 1
##$PHC0= 224.1171
##$PHC1= -4.19494
##$PH_mod= 1
##$PKNL= yes
##$PPARMOD= 0
##$PSCAL= 4
##$PSIGN= 0
##$REVERSE= no
##$SF= 250.13
##$SI= 32768
##$SIGF1= 0
##$SIGF2= 0
##$SINO= 400
##$SIOLD= 32768
##$SREGLST= <1H.DMSO>
##$SSB= 0
##$STSI= 32768
##$STSR= 0
##$SW_p= 5175.98343685301
##$SYMM= 0
##$S_DEV= 0
##$TDeff= 65536
##$TDoff= 0
##$TI= <Analysis number 999999
Compound Code 99
Book Reference 9
Project Code 9>
##$TILT= no
##$TM1= 0
##$TM2= 0
##$TOPLEV= 0
##$USERP1= <user>
##$USERP2= <user>
##$USERP3= <user>
##$USERP4= <user>
##$USERP5= <user>
##$WDW= 1
##$XDIM= 32768
##$YMAX_p= 511161833
##$YMIN_p= -493198
$$ End of Bruker specific parameters
$$ ---------------------------------
##NTUPLES= NMR SPECTRUM
##VAR_NAME=  FREQUENCY,     SPECTRUM/REAL,   SPECTRUM/IMAG
##SYMBOL=    X,             R,               I
##VAR_TYPE=  INDEPENDENT,   DEPENDENT,       DEPENDENT
##VAR_FORM=  AFFN,          ASDF,            ASDF
##VAR_DIM=   32768,         32768,           32768
##UNITS=     HZ,            ARBITRARY UNITS, ARBITRARY UNITS
##FACTOR=    0.157963299565203, 1,           1
##FIRST=     4132.6476996994, 0,             0
##LAST=      -1043.33573715361, 0,           0
##MIN=       -1043.33573715361, -493198,     0
##MAX=       4132.6476996994, 511161833,     0
$$ Real data points
##PAGE= N=1
##DATA TABLE= (X++(R..R)), XYDATA
$$ [...]
$$ plain form
22527 -146915 -196437 -130550 -186762 -184840 -31295 -48540 -116404 -43710 -41331 -59185 -96611 -227656
22515 -227656 -321057 -257320 -128825 -91791 -111630 -177625 -187795 -158685 -185662 -213749 -130244
22504 -130244 -44199 -61959 17957 25492 -14570 -110299 -199451 -140842 -99096 -102669 -151158 -75054
22492 -75054 24385 -58383 -206269 -102301 -57743 -185001 -287210 -285025 -309063 -259045 -177056
22481 -177056 -68921 22030 7386 -95614 -181591 -159377 -115356 -79264 -205769 -289469 -312365
22470 -312365 -198574 -58908 47817 -9970 -56371 -39243 -78337 -127481 -162245 -151866 -139773
22459 -139773 -101637 -89230 -26320 -27718 -29794 -17073 -69424 -108990 -107256 -142905 -170757 7900
22447 7900 32315 -62339 -95633 -36152 5630 -25971 -33169 -67994 -100677 -151164 -197454 -102965
$$ packed form
22527a46915m9522O5887n6212J922J53545j7245o7864P2694K379j7854l7426j31045
22515b27656r3401O3737J28495L7034j9839o5995j0170K9110k6977k8087Q3505
22504a30244Q6045j7760P9916P535m0062r5729q9152N8609M1746l573m8489P6104
22492g5054R9439q2768j47886J03968M4558j27258j02209K185k4038N0018Q1989
22481a77056J08135R0951j4644j03000q5977K2214M4021L6092j26505q3700k2896
22470c12365J13791J39666J06725n7787m6401J7128l9094m9144l4764J0379J2093
22459a39773L8136J2407O2910j398k076J2721n2351l9566J734l5649k7852J78657
22447G900K4415r4654l3294N9481M1782l1601p198l4825l2683n0487m6290R4489
$$ plain form
22435 -102965 -78473 -107529 -162645 -67593 -83445 -28456 63095 65692 -67936 -195266 -251604
22424 -251604 -162885 -164205 -110616 -210556 -263621 -228187 -75975 -37417 -62548 -92638 -110755
22413 -110755 26207 99338 51890 1118 -55198 -137622 -141194 -203859 -208077 -169215 -206347 -193050
22401 -193050 -139782 -56292 -116451 -117221 -119442 -224164 -296538 -306938 -220022 -182725 -59727 63434
22389 63434 60204 95691 -35681 -122827 -84648 -88672 -138741 -165698 -174455 -89558 -125904 -126150
22377 -126150 -85886 -103436 -150814 -124670 -100884 -127650 -101627 -47823 -57993 -103519 -133026
22366 -133026 -177804 -126411 -138605 -180418 -201086 -90439 19952 -8781 -106940 -143635 -259305
22355 -259305 -297170 -173364 -78543 -1736 -2086 -3103 -43884 -116420 -172918 -105081 -95105 -113320
$$ packed form
22435a02965K4492k9056n5116R5052j5852N4989R1551K597j33628j27330n6338
22424b51604Q8719j320N3589r9940n3065L5434J52212L8558k5131l0090j8117
22413a10755J36962P3131m7448n0772n6316q2424l572o2665m218L8862l7132J3297
22401a93050N3268Q3490o0159p70k221j04722p2374j0400Q6916L7297J22998J23161
22389F3434l230L5487j31372q7146L8179m024n0069k6957q757Q4897l6346k46
22377a26150M0264j7550m7378K6144K3786k6766K6023N3804j0170m5526k9507
22366a33026m4778N1393j2194m1813k0668J10647J10391k8733r8159l6695j15670
22355b59305l7865J23806R4821P6807l50j017m0781p2536n6498O7837R976j8215
$$ plain form
22343 -113320 -160999 -165808 -42323 31283 -41910 -92268 -86965 -80141 -45662 -16750 -29122 -37863
22331 -37863 -90605 -190807 -276419 -231789 -289631 -348544 -243666 -88636 -60366 -105601 -224826
22320 -224826 -212183 -159171 -86519 -9502 -20423 -131200 -26945 3890 28503 50420 -30297
22309 -30297 -98597 -141255 -212623 -297832 -303674 -213490 -71814 27966 -21982 -129368 -111872
22298 -111872 -31395 -29005 -113144 -155219 -185901 -178373 -105418 18893 96770 53335 -27959 -42991
22286 -42991 37616 160317 162465 151992 196777 104314 59469 88653 137209 168806 -18577
22275 -18577 -135203 -84349 -143556 -139163 -93990 -91769 -207057 -176681 -133279 -109627 -119112 -162017
22263 -162017 -209163 -282834 -300370 -195086 -155841 -178783 -106350 -77671 -61208 -146398 -272705
$$ packed form
22343a13320m7679m809J23485P3606p3193n0358N303O824L4479K8912j2372q741
22331c7863n2742j00202q5612M4630n7842n8913J04878J55030K8270m5235j19225
22320b24826J2643N3012P2652P7017j0921j10777J04255L0835K4613K1917q0717
22309c0297o8300m2658p1368q5209n842R0184J41676R9780m9948j07386J7496
22298a11872Q0477K390q4139m2075l0682P528P2955J24311P7877m3435q1294j5032
22286d2991Q0607J22701K148j0473M4785r2463m4845K9184M8556L1597j87383
22275a8577j16626N0854n9207M393M5173K221j15288L0376M3402K3652r485m2905
22263a62017m7146p3671j7536J05284L9245k2942P2433K8679J6463q5190j26307
$$ plain form
22252 -272705 -217165 -60482 -88409 -117480 -70823 42131 155837 132982 44541 -80549 -127873
22241 -127873 -125138 -154358 -124173 -114451 -40750 -25966 -109515 -78355 -141624 -104102 -11031 -39376
22229 -39376 -29493 5958 55541 17937 -11783 -89468 -31904 23894 42856 28713 -36312 -44794
22217 -44794 -5783 12851 -81821 -185807 -154549 -117577 -188028 -156722 -153670 -44996 35533
22206 35533 -16527 50432 21977 -48639 -115861 -211646 -186145 -145233 -122392 -53648 3915 -59202
22194 -59202 -225201 -328788 -240916 -142032 -157256 -149567 -163223 -147484 -125131 -105480 -191585
22183 -191585 -294556 -262751 -167820 -56626 -71541 -142185 -226532 -236548 -274923 -310479 -261493
22172 -261493 -252221 -297660 -244915 -230550 -260417 -299206 -357164 -417228 -392853 -401963 -347351 -249497
$$ packed form
22252b72705N5540J56683k7927k9071M6657J12954J13706k2855q8441j25090m7324
22241a27873K735k9220L0185R722P3701J4784q3549L1160o3269L7522R3071k8345
22229c9376R883L5451M9583l7604k9720p7685N7564N5798J8962j4143o5025q482
22217d4794L9011J8634r4672j03986L1258L6972p0451L1306L052J08674Q0529
22206C5533n2060O6959k8455p0616o7222r5785K5501M0912K2841O8744N7563o3117
22194e9202j65999j03587Q7872R8884j5224P689j3656J5739K2353J9651q6105
22183a91585j02971L1805R4931J11194j4915p0644q4347j0016l8375l5556M8986
22172b61493R272m5439N2745J4365k9867l8789n7958o0064K4375r110N4612R7854
$$ plain form
22160 -249497 -223196 -171650 -161976 -53822 -12861 -6971 -82442 -108879 -144820 -220048 -258039 -174434
22148 -174434 -189962 -147533 -259385 -375229 -291501 -198854 -265411 -305726 -302837 -293742 -314241
22137 -314241 -236070 -306659 -285110 -289861 -240374 -280240 -220374 -133185 -150501 -185488 -260050 -309796
22125 -309796 -322575 -315050 -258400 -292005 -228177 -248500 -272979 -151985 -130713 -156091 -254532
22114 -254532 -286817 -224987 -124997 -113263 -162004 -102226 -78782 15213 40407 8815 -63704
22103 -63704 -80360 -81596 -151866 -169763 -101756 -75810 -28398 -7437 -46910 -46308 -177980 -225508
22091 -225508 -280958 -217905 -42215 112281 82926 17979 -43570 -234570 -317731 -343792 -194938
22080 -194938 -108735 -148301 -186222 -221520 -277203 -226399 -152843 -98345 -85726 -47232 -16048
$$ packed form
22160b49497K6301N1546R674J08154M0961N890p5471k6437l5941p5228l7991Q3605
22148a74434j5528M2429j11852j15844Q3728R2647o6557m0315K889R095k0499
22137c14241P8171p0589K1549m751M9487l9866N9866Q7189j7316l4987p4562m9746
22125c09796j2779P525N6650l3605O3828k0323k4479J20994K1272k5378r8441
22114b54532l2285O1830R9990J1734m8741N9778K3444R3995K5194l1592p2519
22103f3704j6656j236p0270j7897O8007K5946M7412K0961l9473O02j31672m7528
22091b25508n5450O3053J75690J54496k9355o4947o1549j91000q3161k6061J48854
22080a94938Q6203l9566l7921l5298n5683N0804P3556N4498J2619L8494L1184
$$ plain form
22069 -16048 8779 -135463 -201268 -215265 -151023 -56501 2452 25524 -59465 -85401 -20836
22058 -20836 12748 77108 -2679 -15544 -72846 -64800 80502 48551 -36296 -157325 -204191
22047 -204191 -181075 -185081 -51704 -53248 -112148 -29307 50628 106135 -25555 -67667 46734
22036 46734 87086 -37152 -97338 -117437 -63886 -105228 -158126 -109722 -13926 39216 -37448
22025 -37448 -108811 -92868 -51420 -62590 -113300 -174270 -143246 -138510 -94119 -71498 -52385 13426
22013 13426 -10487 -22914 10390 16713 7141 8271 -47179 -144512 -203927 -267732 -254199 -166436
22001 -166436 -212629 -240424 -216257 -157303 -104371 -79994 -78601 -183412 -234503 -154787 -131834
21990 -131834 -141575 -99922 -46821 -27190 -31445 -44869 -157620 -211660 -178674 -77190 -50641
$$ packed form
22069a6048K4827j44242o5805j3997O4242R4522N8953K3072q4989k5936O4565
22058b0836L3584O4360p9787j2865n7302Q046J45302l1951q4847j21029m6866
22047b04191K3116m006J33377j544n8900Q2841P9935N5507j31690m2112J14401
22036D6734M0352j24238o0186k0099N3551m1342n2898M8404R5796N3142p6664
22025c7448p1363J5943M1448j1170n0710o0970L1024M736M4391K2621J9113O5811
22013A3426k3913j2427L3304O323r572J130n5450r7333n9415o3805J3533Q7763
22001a66436m6193k7795K4167N8954N2932K4377J393j04811n1091P9716K2953
21990a31834r741M1653N3101J9631m255j3424j12751n4040L2986J01484K6549
$$ plain form
21979 -50641 -152887 -103805 -72051 -45212 -67892 -42235 30495 93523 25339 36230 75575
21968 75575 11949 46276 93435 186401 43593 -18939 -92188 -220218 -249584 -307592 -254765
21957 -254765 -165981 -74601 -88487 -230298 -266019 -199606 -134857 -190950 -195785 -155434 -96624
21946 -96624 -2277 -126870 -272994 -237263 -122274 -232109 -254140 -181701 -104449 -20911 -18614
21935 -18614 -48969 -48161 -128542 -261543 -252017 -212066 -43592 -39223 -3042 61029 -60627 -159442
21923 -159442 -120772 -48010 -111370 -87876 -43367 -141120 -237137 -318667 -363794 -322233 -236960
21912 -236960 -161872 -144228 -137911 -144802 -94048 -70099 1300 -18523 -48812 -143440 -246040 -254425
21900 -254425 -202600 -93440 6053 -35376 -98429 -165614 -136838 -94679 -208947 -223482 -87190
$$ packed form
21979e0641j02246M9082L1754K6839k2680K5657P2730O3028o8184J0891L9345
21968G5575o3626L4327M7159R2966j42808o2532p3249j28030k9366n8008N2827
21957b54765Q8784R1380j3886j41811l5721O6413O4749n6093m835M0351N8810
21946i6624R4347j24593j46124L5731J14989j09835k2031P2439P7252Q3538K297
21935a8614l0355Q08q0381j33001R526L9951J68474M369L6181O4071j21656r8815
21923a59442L8670P2762o3360K3494M4509r7753r6017q1530m5127M1561Q5273
21912b36960P5088J7644O317o891N0754K3949P1399j9823l0289r4628j02600q385
21900b54425N1825J09160R9493m1429o3053o7185K8776M2159j14268j4535J36292
$$ plain form
21889 -87190 -128517 -257718 -244983 -160345 -117633 -119643 -234254 -248411 -203042 -232786 -282660
21878 -282660 -361595 -252408 -227526 -236294 -193139 -285380 -253185 -183650 -173769 -174128 -69830 -79649
21866 -79649 -167007 -144059 -46107 28402 48604 -83709 -89264 -51327 -79202 -102184 -124062 -156171
21854 -156171 -123161 -100101 -114376 -87480 -79325 -54212 -83907 -117101 -144378 -180390 -108122 -25590
21842 -25590 -148708 -183423 -160335 -229083 -161391 -101996 -61602 58132 78250 42641 -11316
21831 -11316 -24195 -72745 -219414 -211995 -75836 -105939 -138542 -147186 -82997 -119125 -242081
21820 -242081 -263501 -242766 -232815 -193574 -128199 -86222 -124733 -109824 -77208 -133516 -74242 -56790
21808 -56790 -104182 -95632 26636 147139 76217 -50530 -50842 -38068 -104318 -29848 -31592 -106243
$$ packed form
21889h7190m1327j29201J2735Q4638M2712k010j14611j4157M5369k9744m9874
21878b82660p8935J09187K4882q768M3155r2241L2195O9535R881l59J04298r819
21866g9649q7358K2948R7952P4509K0202j32313n555L7937k7875k2982k1878l2109
21854a56171L3010K3060j4275K6896Q155K5113k9695l3194k7277l6012P2268Q2532
21842b5590j23118l4715K3088o8748O7692N9395M0394J19734K0118l5609n3957
21831a1316j2879m8550j46669P419J36159l0103l2603q644O4189l6128j22956
21820b42081k1420K0735R951L9241O5375M1977l8511J4909L2616n6308N9274J7452
21808e6790m7392Q550J22268J20503p0922j26747l12J2774o6250P4470j744p4651
$$ plain form
21796 -106243 -173708 -144196 -133536 -88081 -69194 -66113 -84413 -100593 -81692 -26391 -66506 -47710
21784 -47710 439 18898 59022 49316 -5884 -82249 -54087 -57707 -125529 -78381 -77334 -77809 7309
21771 7309 57308 114959 187548 114924 -72809 -236635 -356524 -217862 -93722 -123838 -25874
21760 -25874 47378 -99808 -350617 -364768 -312396 -221775 -200855 -151408 -36404 82965 134921
21749 134921 148299 135852 120111 83737 -23871 -64554 -120916 -108267 -120943 -273295 -361299
21738 -361299 -271055 -222103 -127810 20308 86912 207247 205978 130096 61191 29703 22893
21727 22893 46678 46437 -82311 -238414 -243600 -199520 -184841 -165123 -63488 11818 -74484 -120704
21715 -120704 -85881 -134433 -188228 -150236 -100372 -103984 -211255 -284385 -248955 -165960 -170029 -200366
$$ packed form
21796a06243o7465K9512J0660M5455J8887L081j8300j6180J8901N5301m0115J8796
21784d7710M8149J8459M0124r706n5200p6365K8162l620o7822M7148J047m75Q5118
21771G309M9999N7651P2589p2624j87733j63826j19889J38662J24140l0116R7964
21760b5874P3252j47186k50809j4151N2372R0621K0920M9447J15004J19369N1956
21749A34921J3378j2447j5741l6374j07608m0683n6362J2649j2676j52352q8004
21738c61299R0244M8952R4293J48118O6604J20335j269p5882o8905l1488o810
21727B2893K3785k41j28748j56103n186M4080J4679J9718J01635P5306q6302m6220
21715a20704L4823m8552n3795L7992M9864l612j07271p3130L5430Q2995m069l0337
$$ plain form
21703 -200366 -293234 -328639 -303342 -123964 -21212 -54271 -156201 -204772 -108110 -114346 -154326
21692 -154326 -201551 -149882 -112048 -72213 -141334 -263959 -193353 -152616 -143813 15199 -19704
21681 -19704 -71671 -61546 -106275 -130212 -174891 -173742 -124248 -126712 -169363 -215284 -220603 -140986
21669 -140986 -101636 -28879 -63917 -48716 -51422 -48971 9421 18627 -73442 -20567 -54807 -131633
21657 -131633 -214093 -192346 -110200 -209726 -208237 -197928 -185777 -82365 -80803 -129707 -131056 -116034
21645 -116034 -180909 -274219 -312186 -314634 -305529 -300305 -315899 -247086 -155886 -140716 -132497 -88567
21633 -88567 -65561 -124884 -60813 -89192 -66803 -65941 -146929 -158125 -136895 -99092 -127345 -201568
21621 -201568 -117099 -130710 -159545 -194725 -216647 -104846 61546 98210 34925 -43014 43206
$$ packed form
21703b00366r2868l5405K5297J79378J02752l3059j01930m8571R6662o236l9980
21692a54326m7225N1669L7834L9835o9121j22625P0606M0737Q803J59012l4903
21681a9704n1967J0125m4729k3937m4679J149M9494k464m2651m5921n319P9617
21669a40986L9350P2757l5038J5201k706K451N8392R206r2069N2875l4240p6826
21657a31633q2460K1747Q2146r9526J489J0309J2151J03412J562m8904j349J5022
21645a16034o4875r3310l7967k448R105N224j5594O8813R1200J5170Q219M3930
21633h8567K3006n9323O4071k8379K2389Q62q0988j1196K1230L7803k8253p4223
21621b01568Q4469j3611k8835l5180k1922J11801J66392L6664o3285p7939Q6220
$$ plain form
21610 43206 722 -55622 29261 37698 103631 134908 7808 -52561 -87590 -94225 -82769 -58078
21598 -58078 -34040 -59535 -53146 -59352 -34199 50155 113619 -14332 66631 28315 -9003 5402
21586 5402 17508 -71380 -198420 -251777 -191786 -183011 -173292 -203688 -247592 -270837 -233991 -192280
21574 -192280 -113764 -33999 -167367 -180907 -55081 -61177 -134889 -175922 -155831 -219197 -247471
21563 -247471 -298089 -227775 -216547 -116628 -105149 -124476 -94402 -133439 -171171 -295522 -349768
21552 -349768 -289960 -132661 -99147 -62557 -94831 47822 157332 93920 -30881 -128329 -158980
21541 -158980 -221159 -257488 -198802 -124412 -77979 -54540 -112937 -196977 -273098 -289090 -264001
21530 -264001 -228547 -213936 -227543 -242814 -304281 -235399 -98446 -118816 -163481 -194559 -153240
$$ packed form
21610D3206m2484n6344Q4883Q437O5933L1277j27100o0369l5029o635J1456K4691
21598e8078K4038k5495O389o206K5153Q4354O3464j27951Q0963l8316l7318J4405
21586E402J2106q8888j27040n3357N9991Q775R719l0396m3904k3245L6846M1711
21574a92280P8516P9765j33368j3540J25826o096p3712m1033K0091o3366k8274
21563b47471n0618P0314J1228R9919J1479j9327L0074l9037l7732j24351n4246
21552c49768N9808J57299L3514L6590l2274J42653J09510o3412j24801r7448l0651
21541a58980o2179l6329N8686P4390M6433K3439n8397q4040p6121j5992K5089
21530b64001L5454J4611j3607j5271o1467O8882J36953k0370m4665l1078M1319
$$ plain form
21519 -153240 -129801 -204362 -97784 -43743 -40925 -39255 1010 -12885 -77471 -28375 -47163 -85396
21507 -85396 -42428 -18361 -37708 -26606 -91460 -98837 -193862 -255106 -240013 -188525 -248149 -205124
21495 -205124 -175766 -129354 -128740 -187722 -116041 -58236 -56639 -175794 -253562 -252859 -197043 -109436
21483 -109436 -57263 -60714 -140254 -212246 -215761 -232645 -216458 -130329 -2332 -17385 -141717
21472 -141717 -144485 -110907 -115260 -120034 -150284 -195351 -298051 -253084 -205543 -259313 -350673 -316780
21460 -316780 -334340 -212782 -151359 -57146 -8815 3950 -90323 -106320 -112042 -113856 -92230 -7801
21448 -7801 32946 55510 60149 655 -37652 -143283 -234571 -243796 -204270 -109476 -63001 -90793
21436 -90793 -63145 -64681 -101891 -113211 -9154 59855 39365 11462 -74714 -115794 -134234 -104187
$$ packed form
21519a53240K3439p4561J06578N4041K818J670M0265j3895o4586M9096j8788l8233
21507h5396M2968K4067j9347J1102o4854p377r5025o1244J5093N1488n9624M3025
21495b05124K9358M6412O14n8982P1681N7805J597j19155p7768P03N5816Q7607
21483a09436N2173l451p9540p1992l515j6884J6187Q6129J27997j5053j24332
21472a41717k768L3578m353m774l0250m5067j02700M4967M7541n3770r1360L3893
21460c16780j7560J21558O1423R4213M8331J2765r4273j5997n722j814K1626Q4429
21448g801M0747K2564M639n9494l8307j05631r1288r225L9526R4794M6475k7792
21436i0793K7648j536l7210j1320J04057O9009k0490k7903q6176m1080j8440L0047
$$ plain form
21424 -104187 -153231 -192214 -166028 -195367 -224866 -91226 -74032 -102092 -18041 28601 -29057
21413 -29057 -78761 -126159 -47171 -14039 -36584 9314 -13657 -25103 -70336 4859 -20359 -107215
21401 -107215 1209 37787 -114000 -186120 -43359 -83653 -211798 -179899 -218593 -157690 -56238
21390 -56238 44002 18021 -64664 -101330 -139518 -120929 -140692 -294708 -450803 -447396 -330592
21379 -330592 -143718 -137910 -174182 -14837 123981 49227 -23441 -148155 -109957 -117747 -136747
21368 -136747 -174586 -54404 2083 -12155 61962 89058 -12347 -104707 -126080 -239997 -218051
21357 -218051 -139960 -81819 -129102 -36881 17236 -23652 -23244 -15709 -164026 -179798 -257546 -226906
21345 -226906 -103664 -24608 23873 -40755 -163644 -247323 -296371 -313856 -302402 -296928 -248673
$$ packed form
21424a04187m9044l8983K6186k9339k9499J33640J7194k8060Q4051M6642n7658
21413b9057m9704m7398P8988L3132k2545M5898k2971j1446m5233P5195k5218q6856
21401a07215J08424L6578j51787p2120J42761m0294j28145L1899l8694O0903J01452
21390e6238J00240k5981q2685l6666l8188J8589j9763j54016j56095L407J16804
21379c30592J86874N808l6272J59345J38818p4754p2668j24714L8198p790j9000
21368a36747l7839J20182N6487j4238P4117K7096j01405r2360k1373j13917K1946
21357b18051P8091N8141m7283R2221N4117m0888M08P535j48317j5772p7748L0640
21345b26906J23242P9056M8481o4628j22889q3679m9048j7485J1454N474M8255
$$ plain form
21334 -248673 -158854 -103804 -143897 -168519 -179239 -168504 -209005 -197979 -197826 -150294 -69068 62496
21322 62496 9084 -41121 -41087 -184831 -328871 -306818 -157437 -60644 -98482 -52462 59127
21311 59127 51284 16515 -109722 -268555 -346225 -374441 -328530 -217890 -253205 -325057 -374685
21300 -374685 -301141 -237779 -207879 -196336 -127004 -112694 -117509 -65806 -95741 10333 67965
21289 67965 62252 -20925 -79415 -176155 -91014 -24709 -21553 -99912 -130463 48862 44766 -69500
21277 -69500 -121218 -109935 -39858 -126107 -247701 -134862 -178257 -206027 -148211 -154882 -273344
21266 -273344 -233262 -129785 -106666 -37187 -5698 -17392 -36484 -112909 -55260 -32466 -5513
21255 -5513 -20780 -123657 -195710 -203315 -145843 -126112 -169621 -116824 -129661 -138288 -37033 54706
$$ packed form
21334b48673Q9819N5050m0093k4622j0720J0735m0501J1026J53M7532Q1226J31564
21322F2496n3412n0205L4j43744j44040K2053J49381R6793l7838M6020J11589
21311E9127p843l4769j26237j58833p7670k8216M5911J10640l5315p1852m9628
21300c74685P3544O3362K9900J1543O9332J4310m815N1703k9935J06074N7632
21289F7965n713q3177n8490r6740Q5141O6305L156p8359l0551J79325m096j14266
21277f9500n1718J1283P0077q6249j21594J12839m3395k7770N7816o671j18462
21266b73344M0082J03477K3119O9479L1489j1694j9092p6425N7649K2794K6953
21255e513j5267j02877p2053p605N7472J9731m3509N2797j2837q627J01255R1739
$$ plain form
21243 54706 -62442 -182704 -214992 -250668 -198741 -154696 -153363 -49903 -16401 8616 -39130
21232 -39130 -51419 -165841 -118073 -116329 -131856 -7039 -34625 -114270 -190925 -142600 -97363
21221 -97363 -138978 -225923 -332438 -299570 -232087 -119610 -94497 -25605 -101387 -91961 -82877 -164100
21209 -164100 -89556 -65476 -148252 -156530 -128130 -67674 -122074 -111073 -109476 -81253 -68243 -64904
21197 -64904 -102078 -56132 90942 53438 6514 -132303 -232830 -271019 -253902 -168531 -87363
21186 -87363 -83166 -46898 -111683 -189066 -172053 -112835 -60381 -97798 -144159 -275965 -371237 -242333
21174 -242333 -261407 -278079 -191178 -228987 -193726 -250680 -327555 -340485 -253679 -186611 -184577 -233298
21162 -233298 -219658 -210390 -176684 -151474 -136435 -59722 -8184 15240 -41856 -139871 -223377 -315499
$$ packed form
21243E4706j17148j20262l2288l5676N1927M4045J333J03460L3502K5017m7746
21232c9130j2289j14422M7768J744j5527J24817k7586p9645p6655M8325M5237
21221i7363m1615q6945j06515L2868O7483J12477K5113O8892p5782R426R084q1223
21209a64100P4544K4080q2776q278K8400O0456n4400J1001J597K8223J3010L339
21197f4904l7174M5946J47074l7504m6924j38817j00527l8189J7117Q5371Q1168
21186h7363M197L6268o4785p7383J7013N9218N2454l7417m6361j31806r5272J28904
21174b42333j9074j6672Q6901l7809L5261n6954p6875j2930Q6806O7068K034m8721
21162b33298J3640R268L3706K5210J5039P6713N1538K3424n7096r8015q3506r2122
$$ plain form
21150 -315499 -199866 -153795 -161229 -216540 -218725 -135080 -177281 -162671 -54166 -74606 -67954 -62403
21138 -62403 -74632 -18145 -79497 -194322 -172438 -118310 -154863 -243189 -293485 -292768 -267800 -126112
21126 -126112 -92426 -178676 -237503 -262806 -185873 -218733 -238456 -90864 -70924 -89349 -25022
21115 -25022 17470 110972 77823 85170 13668 -75215 -101511 -99386 -100235 -34618 -8759 -104431
21103 -104431 -165655 -127414 -89808 -117482 -98300 -143044 -201911 -212539 -168371 -125618 16156
21092 16156 -15387 -21922 -93628 -132756 -68269 -69009 -75514 -59425 -115440 -156472 -84775 -90839 12237
21079 12237 43767 -171708 -235828 -235167 -219176 -219828 -168335 -272446 -283239 -162417 -58629 -74062
21067 -74062 -188832 -265768 -288203 -303307 -210516 -267609 -218395 -261511 -197198 -124733 -142520
$$ packed form
21150c15499J15633M6071p434n5311k185Q3645m2201J4610J08505k0440O652N551
21138f2403j2229N6487o1352j14825K1884N4128l6553q8326n0296P17K4968J41688
21126a26112L3686q6250n8827k5303P6933l2860j9723J47592J9940j8425O4327
21115b5022M2492R3502l3149P347p1502q8883k6296K125q49O5617K5859r5672
21103a04431o1224L8241L7606k7674J9182m4744n8867j0628M4168M2753J41774
21092A6156l1543o535p1706l9128O4487p40o505J6089n6015m1032P1697o064J03076
21079A2237L1530k15475o4120O61J5991o52N1493j04111j0793J20822J03788j5433
21067g4062j14770p6936k2435j5104R2791n7093M9214m3116O4313P2465j7787
$$ plain form
21056 -142520 -173809 -180368 -170944 -124666 -71219 1004 -9500 -103872 -185520 -224555 -228020 -162782
21044 -162782 -210660 -225692 -262982 -252204 -205079 -210825 -244265 -256810 -208905 -281094 -168903
21033 -168903 -101026 -99485 -175627 -244237 -255961 -192504 -104382 -54187 -45889 -80481 -67490 -131328
21021 -131328 -157142 -99559 -105250 -54083 -45629 36894 40588 -104049 -170891 -106455 -99061 -125136
21009 -125136 -155738 -154434 -237840 -243115 -157686 -134382 -198335 -155104 -89331 -77330 -42394 45462
20997 45462 -32601 -108901 -132559 -109000 -54110 -127492 -270075 -152410 -63552 -97966 -122718
20986 -122718 -79860 -62267 53802 14480 -56926 -145177 -225763 -134079 -125646 -172431 -152282
20975 -152282 -175169 -174065 -91225 40113 -65140 -136652 -156384 -94351 -70119 43925 141302
$$ packed form
21056a42520l1289o559R424M6278N3447P2223j0504r4372q1648l9035l465O5238
21044a62782m7878j5032l7290J0778M7125n746l3440j2545M7905p2189J12191
21033a68903O7877J541p6142o8610j1724O3457Q8122N0195Q298l4592J2991o3838
21021a31328k5814N7583n691N1167Q454Q2523L694j44637o6842O4436P394k6075
21009a25136l0602J304q3406n275Q5429K3304o3953M3231O5773J2001L4936Q7856
20997D5462p8063p6300k3658K3559N4890p3382j42583J17665Q8858l4414k4752
20986a22718M2858J7593J16069l9322p1406q8251q0586R1684Q433m6785K0149
20975a52282k2887J104Q2840J31338j05253p1512j9732O2033K4232J14044R7377
$$ plain form
20964 141302 44712 -53218 -79697 -91581 -159986 -209094 -167131 -158293 -171704 -157358 -197486 -151321
20952 -151321 -127794 -138732 -162090 -128581 -116042 -218941 -268127 -263934 -160925 -135922 -200181
20941 -200181 -228552 -298777 -290957 -229588 -176845 -279202 -212737 -167506 -76596 16283 10999 -109585
20929 -109585 -115779 -60902 -31112 -144564 -265232 -213067 -241563 -270613 -228147 -71875 22193
20918 22193 -4686 -78755 -92053 -120447 -97890 47995 -496 -154615 -147057 -129996 -152634
20907 -152634 -83700 -103606 -222293 -273154 -276885 -271554 -203346 -198836 -223920 -319566 -197268 -96625
20895 -96625 -79130 -113563 -256698 -210711 -158970 -148146 -140735 -58168 43838 -22880 -128423
20884 -128423 -167383 -187961 -112665 -160941 -163227 -121613 -55172 -4367 -82036 -141119 -194884 -282813
$$ packed form
20964A41302r6590r7930k6479j1884o8405m9108M1963Q838j3411J4346m0128M6165
20952a51321K3527j0938k3358L3509J2539j02899m9186M193J03009K5003o4259
20941b00181k8371p0225P820O1369N2743j02357O6465M5231R0910R2879n284j20584
20929a09585o194N4877K9790j13452j20668N2165k8496k9050M2466J56272R4068
20918B2193k6879p4069j3298k8394K2557J45885m8491j54119P558J7061k2638
20907a52634O8934j9906j18687n0861l731N331O8208M510k5084r5646J22298J00643
20895i6625J7495l4433j43135M5987N1741J0824P411Q2567J02006o6718j05543
20884a28423l8960k0578P5296m8276k286M1614O6441N0805p7669n9083n3765q7929
$$ plain form
20872 -282813 -243291 -120611 -43501 893 -35258 -43705 -95958 -147912 -120285 -68130 68887
20861 68887 73255 -39476 -113366 -7397 -67101 -206036 -176161 -197470 -199923 -112685 -81458
20850 -81458 -137026 -79221 -11011 -33278 -23213 -15129 -82391 -138366 -131125 -99340 -67978 -130713
20838 -130713 -281551 -345161 -290222 -354755 -464381 -260561 -167978 -124102 -94848 -133907 -143565
20827 -143565 -175510 -117383 -74637 -6229 -52819 -102737 -110505 -180505 -245451 -225433 -169742 -186103
20815 -186103 -258122 -309787 -281429 -292805 -174157 -148481 -167512 -160185 -81715 -151577 -108978
20804 -108978 -104811 -96240 -2829 10619 -36872 -121703 -177728 -263536 -252093 -236970 -191046 -234745
20792 -234745 -189519 -186045 -171577 -89791 60479 115221 -423 -62581 -30057 -199492 -262388
$$ packed form
20872b82813L9522J22680P7110M4394l6151q447n2253n1954K7627N2155J37017
20861F8887M368j12731p3890J05969n9704j38935K9875k1309k453Q7238L1227
20850h1458n5568N7805O8210k2267J0065Q084o7262n5975P241L1785L1362o2735
20838a30713j50838o3610N4939o4533j09626K03820R2583M3876K9254l9059r658
20827a43565l1945N8127M2746O8408m6590m9918p768p0000o4946K0018N5691j6361
20815a86103p2019n1665K8358j1376J18648K5676j9031P327P8470o9862M2599
20804a08978M167Q571R3411J3448m7491q4831n6025q5808J1443J5123M5924m3699
20792b34745M5226L474J4468Q1786J50270N4742j15644o2158L2524j69435o2896
$$ plain form
20781 -262388 -102842 -74410 -86299 -77280 -113754 -149673 -116811 -39210 -115020 -106630 24067
20770 24067 102259 24712 -24160 -76030 -117121 -99039 -93144 -84482 -89512 -115993 -136422 -124554
20758 -124554 -122375 -86878 -106259 -61133 -95774 -102773 -170454 -250151 -319157 -268478 -77598 25680
20746 25680 61843 34541 23911 -49148 -39275 -29811 19899 10341 -32635 -93095 -60835 -12183
20734 -12183 77253 106092 82360 -24315 -46981 -7065 -72722 -153223 -151313 -88428 -69184 11169
20722 11169 71367 141572 32443 -68508 -57302 -80803 -102372 -72071 -133904 -190571 -138011
20711 -138011 -116325 -81039 -116888 -202701 -220551 -250941 -307518 -292190 -209159 -198234 -235788
20700 -235788 -131512 -131646 -115559 -121347 -111804 -117900 -138081 -219314 -97445 -52453 -106376 -200250
$$ packed form
20781b62388J59546K8432j1889R019l6474l5919L2862P7601p5810Q390J30697
20770B4067P8192p7547m8872n1870m1091J8082N895Q662n030k6481k0429J1868
20758a24554K179L5497j9381M5126l4641o999o7681p9697o9006N0679J90880J03278
20746B5680L6163k7302j0630p3059R873R464M9710r558m2976o0460L2260M8652
20734a2183Q9436K8839k3732j06675k2666L9916o5657q0501J910O2885J9244Q0353
20722A1169O0198P0205j09129j00951J1206k3501k1569L0301o1833n6667N2560
20711a38011K1686L5286l5849q5813j7850l0390n6577J5328Q3031J0925l7554
20700b35788J04276j34J6087n788R543o096k0181q1233J21869M4992n3923r3874
$$ plain form
20688 -200250 -225074 -115194 -99554 -217118 -224497 -217148 -239047 -276485 -222927 -112111 -84719
20677 -84719 -95159 -161979 -206508 -166244 -172024 -170557 21632 93476 113915 71595 15807 -43789
20665 -43789 -131465 -161289 -135178 -173911 -175733 -87103 -33091 -19887 10009 29268 8521 18953
20653 18953 -106562 -44286 -5985 94490 17036 -26105 -150652 -149149 23953 62427 -93727
20642 -93727 -142016 -83064 -62700 -70851 19366 75887 42836 -5109 -70262 -71055 15831 48376
20630 48376 45907 -8783 -15695 80983 181052 112446 55820 54607 10710 28703 13265 42497
20618 42497 151660 61543 11532 7024 -95289 -128452 -133264 -126337 17835 75856 176566
20607 176566 227819 181325 108077 -1662 -2066 86362 24877 -1086 49454 87001 76113 78744
$$ packed form
20688b00250k4824J09880J5640j17564p379P349k1899l7438N3558J10816K7392
20677h4719j0440o6820m4529M0264n780J467J92189P1844K0439m2320n5788n9596
20665d3789q7676k9824K6111l8733j822Q8630N4012J3204K9896J9259k0747J0432
20653A8953j25515O2276L8301J00475p7454m3141j24547J503J73102L8474j56154
20642i3727m8289N8952K0364q151R0217N6521l3051m7945o5153p93Q6886L2545
20630D8376k469n4690o912R6678J00069o8606n6626j213m3897J7993j5438K9232
20618D2497J09163r0117n0011m508j02313l3163m812O927J44172N8021J00710
20607A76566N1253m6494p3248j09739m04Q8428o1485k5963N0540L7547j0888K631
$$ plain form
20595 78744 126605 146847 186139 47616 -28326 -8562 -27975 -74403 103182 166674 72505
20584 72505 -23213 -60621 -36462 -37721 -134540 -94680 -6381 -8376 -67241 -168162 -184218 -116718
20572 -116718 -35938 -57465 -72733 24196 128118 152249 118417 2110 -93953 -85311 -69687
20561 -69687 -146897 -229801 -272880 -215566 -180170 -181091 -49977 -80856 -145225 -141325 -116190 -44764
20549 -44764 -109590 -171990 -104568 5635 -12804 -66821 36995 64521 14580 -94761 -58693
20538 -58693 29107 -25975 -33873 4282 -42965 -112420 -79801 -59566 6152 74831 98277 -16639
20526 -16639 6520 69829 91029 97492 -30724 -135567 -128325 -65655 -21781 34500 14290 54969
20514 54969 109540 63714 -34705 -49632 -9491 -11552 -140334 -196330 -191749 -267716 -253030 -103572
$$ packed form
20595G8744M7861K0242L9292j38523p5942J9764j9413m6428J77585O3492r4169
20584G2505r5718l7408K4159j259r6819L9860Q8299j995n8865j00921j6056O7500
20572a16718Q0780k1527j5268R6929J03922K4131l3832j16307r6063Q642J5624
20561f9687p7210q2904m3079N7314L5396r21J31114l0879o4369L900K5135P1426
20549d4764o4826o2400O7422J10203j8439n4017J03816K7526m9941j09341L6068
20538e8693Q7800n5082p898L8155m7247o9455L2619K0235O5718O8679K3446j14916
20526a6639K3159O3309K1200O463j28216j04843P242O2670M3874N6281k0210M0679
20514E4969N4571m5826r8419j4927M0141k061j28782n5996M581p5967J4686J49458
$$ plain form
20502 -103572 -3748 28457 56107 97297 21065 -10850 -57891 -55999 -77949 23408 -67594
20491 -67594 -136009 -666 -32869 -142336 -168720 -153666 -188980 -178331 -280045 -301226 -254038
20480 -254038 -264747 -269305 -233278 -256907 -290796 -232992 -208712 -185737 -214069 -108832 -54738
20469 -54738 17207 16574 -112476 -255755 -191177 -61618 32597 43912 16795 30350 76936
20458 76936 48398 29532 28550 34813 3775 -87538 -168555 -94089 -46074 -7318 -26117 -16254
20446 -16254 -88005 -67755 -106183 -178467 -262035 -282219 -289687 -175010 -115892 -12005 -19476 -62580
20434 -62580 -132801 -58355 -12021 41576 45540 16822 7809 22558 38852 -7123 14112 71841
20422 71841 24078 -90951 -208407 -176385 -85204 -82135 -80626 -95058 -77075 -23572 -87127 -113569
$$ packed form
20502a03572R9824L2205K7650M1190p6232l1915m7041J892k1950J01357r1002
20491f7594o8415J35343l2203j09467k6384J5054l5314J0649j01714k1181M7188
20480b54038j0709m558L6027k3629l3889N7804K4280K2975k8332J05237N4094
20469e4738P1945o33j29050j43279O4578J29559R4215J1315k7117J3555M6586
20458G6936k8538j8866r82O263l1038r1313q1017P4466M8015L8756j8799R863
20446a6254p1751K0250l8428p2284q3568k0184p468J14677N9118J03887p471m3104
20434f2580p0221P4446M6334N3597L964k8718r013J4749J6294m5975K1235N7729
20422G1841m7763j15029j17456L2022R1181L069J509j4432J7983N3503o3555k6442
$$ plain form
20410 -113569 -128465 -209301 -156506 -109444 -20496 -18210 -80956 -46499 38142 -15263 -115637
20399 -115637 -165042 -185961 -265751 -279018 -155629 -366 -108150 -122509 17739 -58560 -313980
20388 -313980 -275897 -206456 -230343 -181387 -165748 -123279 -158542 -229420 -172244 -102615 9279
20377 9279 13412 -25503 -42241 15252 62850 42823 -49349 -24115 122367 43052 -29082 65727
20365 65727 67423 97626 38110 -14336 -81920 -152765 -67325 17547 -51259 -72857 -68888 -151943
20353 -151943 -128375 -77816 37496 55638 -54894 -182376 -231905 -165733 -118193 -100244 -105553
20342 -105553 -184278 -205963 -187100 -95150 19017 -12871 -69040 -124846 -140966 -119944 -112770
20331 -112770 -80599 -84650 7778 30029 -47290 -132880 -167811 -127012 -79811 -151107 -154163 -144510
$$ packed form
20410a13569j4896q0836N2795M7062Q8948K286o2746L4457Q4641n3405j00374
20399a15637m9405k0919p9790j3267J23389J55263j07784j4359J40248p6299k55420
20388c13980L8083O9441k3887M8956J5639M2469l5263p0878N7176O9629J11894
20377I279M133l8915j6738N7493M7598k0027r2172K5234J46482p9315p2134R4809
20365F5727J696L0203n9516n2446o7584p0845Q5440Q4872o8806k1598L969q3055
20353a51943K3568N0559J15312J8142j10532j27482m9529O6172M7540J7949n309
20342a05553p8725k1685J8863R1950J14167l1888n6169n5806j6120K1022P174
20331a12770L2171m051R2428K2251p7319q5590l4931M0799M7201p1296l056R653
$$ plain form
20319 -144510 -177299 -151876 -116001 -72205 -35111 -36544 31004 57252 -57082 -142049 -117404
20308 -117404 -71974 -141222 -18436 -2848 -73223 -87101 -41415 -50010 1531 13125 10350 -82025
20296 -82025 -24723 -69762 -18342 -79187 -13891 55600 70204 -24494 -53845 -3870 -36571 84671
20284 84671 106808 33718 -70173 -67805 -50165 42255 74109 52487 -11747 -89993 -85652 -4845
20272 -4845 56612 -40618 -178527 -186701 -111734 -144314 -105302 -123823 -119050 -61458 -3960 -6595
20260 -6595 -19270 -32341 -31654 -14383 -22409 -25713 91391 18369 -47142 -187242 -117340 -48188
20248 -48188 37629 28753 -4992 -61906 -58936 -53271 -115252 -48389 32784 18176 -113416 -170656
20236 -170656 -155795 -107307 6975 119611 93731 -1997 101592 127029 68330 29662 147947
$$ packed form
20319a44510l2789K5423L5875M3796L7094j433O7548K6248j14334q4967K4645
20308a17404M5430o9248J22786J5588p0375j3878M5686q595N1541J1594k775r2375
20296h2025N7302m5039N1420o0845O5296O9491J4604r4698k9351M9975l2701J21242
20284H4671K2137p3090j03891K368J7640R2420L1854k1622o4234p8246M341Q0807
20272d845O1457r7230j37909q174P4967l2580L9012j8521M773N7592N7498k635
20260f595j2675j3071O87J7271q026l304J17104p3022o5511j40100O9902O9152
20248d8188Q5817q876l3745n6914K970N665o1981O6863Q1173j4608j31592n7240
20236a70656J4861M8488J14282J12636k5880r5728J03589K5437n8699l8668J18285
$$ plain form
20225 147947 183873 197828 130328 71091 95605 113953 99569 46008 -51042 11031 52964
20214 52964 171757 332239 469678 621694 818240 883289 678191 394594 279741 192881
20204 192881 61428 12357 35436 17887 -88031 -183808 -307362 -255897 -148167 -130117 -146018
20193 -146018 -102056 -30802 -99821 -138272 -94078 -89174 -95397 2275 76156 127689 126153 87411
20181 87411 -12589 -87500 -234487 -233407 -40426 32422 -75101 -114994 -69933 -104994 -94881
20170 -94881 -153989 -108237 -8626 -85355 -99985 -82508 -49617 2525 8147 -61800 -123619 -156450
20158 -156450 -155361 -165426 -243695 -270513 -155801 -63732 -154412 -141793 -233644 -252717 -264718
20147 -264718 -151364 -37727 34120 25756 -11783 71921 125487 61656 -49278 -94111 15536
$$ packed form
20225A47947L5926J3955o7500n9237K4514J8348j4384n3561r7050O2073M1933
20214E2964J18793J60482J37439J52016J96546O5049k05098k83597j14853q6860
20204A92881j31453m9071K3079j7549j05918r5777j23554N1465J07730J8050j5901
20193a46018M3962P1254o9019l8451M4194M904o223R7672P3881N1533j536l8742
20181H7411j00000p4911j46987J080J92981P2848j07523l9893M5061l5061J0113
20170i4881n9108M5752R9611p6729j4630J7477L2891N2142N622o9947o1819l2831
20158a56450J089j0065p8269k6818J14712R2069r0680J2619r1851j9073j2001
20147b64718J13354J13637P1847q364l7539Q3704N3566o3831j10934m4833J09647
$$ plain form
20136 15536 26424 14425 20275 60169 45902 10015 -14981 -107013 -216734 -261446 -257894 -78813
20124 -78813 -66933 -133590 -32734 40828 31375 -25004 -74931 -41025 14328 -155 43717 38058
20112 38058 57954 -40021 -126110 -148828 -166258 -52010 41762 86523 78314 1002 -33351 107510
20100 107510 156014 32233 -109936 -141131 34296 131243 184639 138035 192066 315552 430257
20089 430257 321911 332580 359747 348952 260568 224982 173135 175249 129744 106575 33226
20078 33226 -52320 13415 2400 -15356 111317 172557 81804 -38804 -74705 -41167 -35189
20067 -35189 -90550 -116287 -145688 -199387 -89622 -58292 -102572 -45118 136342 83967 2530
20056 2530 -36637 -88845 -71053 -63327 -69031 -23208 51627 34939 53047 -8957 -86475 99058
$$ packed form
20136A5536J0888j1999N850L9894j4267l5887k4996r2032j09721m4712L552J79081
20124g8813J1880o6657J00856P3562r453n6379m9927L3906N5353j4483M3872n659
20112C8058J9896r7975q6089k2718j7430J14248R3772M4761q209p7312l4353J40861
20100A07510M8504j23781j42169l1195J75427R6947N3396m6604N4031J23486J14705
20089D30257j08346J0669K7167j0795q8384l5586n1847K114m5505k3169p3349
20078C3226q5546O5735j1015j7756J26673O1240r0753j20608l5901L3538N978
20067c5189n5361k5737k9401n3699J09765L1330m4280N7454J81460n2375q1437
20056B530l9167n2208J7792P726n704M5823P4835j6688J8108o2004p7518J85533
$$ plain form
20044 99058 103983 -60435 -168545 -147540 -58890 -35179 -25157 -53168 -72824 33681 24532
20033 24532 8386 6142 -15184 -102445 -46749 53855 177254 128077 -24677 -89563 -157667
20022 -157667 -187732 -142539 -82279 -83370 -121495 -18060 68724 -33483 -113080 -103974 -164920
20011 -164920 -238401 -182940 -57218 -8252 19830 -1558 -53472 -97604 -130339 -83087 20278
20000 20278 19691 60115 84630 13723 58315 36062 39539 -14434 -5258 17548 82822 -9810
19988 -9810 -40461 123018 94666 31600 58698 69518 -17861 -42658 44419 35094 -106223 -186747
19976 -186747 -123038 -50998 145154 219184 110073 -26096 -37073 -8854 -68530 -118314 -131071
19965 -131071 -111134 -47030 -88381 -133739 -106676 -66646 1194 -28943 -36917 -18801 37263 96646
$$ packed form
20044I9058M925j64418j08110K1005Q8650K3711J0022k8011j9656J06505r149
20033B4532j6146k244k1326q7261N5696J00604J23399m9177j52754o4886o8104
20022a57667l0065M5193O0260j091l8125J03435Q6784j02207p9597R106o0946
20011a64920p3481N5461J25722M8966K8082k1388n1914m4132l2735M7252J03365
20000B0278n87M0424K4515p0907M4592k2253L477n3973R176K2806O5274r2632
19988i810l0651J63479k8352o3066K7098J0820q7379k4797Q7077r325j41317q0524
19976a86747O3709P2040J96152P4030j09111j36169j0977K8219n9676m9784j2757
19965a31071J9937O4104m1351m5358K7063M0030O7840l0137p974J8116N6064N9383
$$ plain form
19953 96646 57796 -113899 -139899 -113138 -63862 -78015 -242755 -100801 1541 -111335 -53045
19942 -53045 6019 27834 -12734 -119310 -83288 -32645 -69067 -161042 -236569 -241347 -165491 -96756
19930 -96756 -12873 45868 102686 130381 109419 36505 -1641 -82026 -189829 -181356 -164911 -203535
19918 -203535 -136207 -63267 -159055 -152598 -138062 -46609 54545 102574 84828 86652 -13100 -15256
19906 -15256 3845 101609 93456 -3926 -2144 -7340 -162880 -210080 -107228 39689 -6721 -148633
19894 -148633 -146152 -178506 -206963 -214329 -180461 -40470 69269 127226 48594 -1508 76279
19883 76279 85501 125455 126883 141487 123222 75126 92825 129029 108677 91427 85642 57271
19871 57271 -10282 32805 98578 172936 182050 56514 3359 67718 202536 278059 315386
$$ packed form
19953I6646l8850j71695k6000K6761M9276j4153j64740J41954J02342j12876N8290
19942e3045N9064K1815m0568j06576L6022N0643l6422r1975p5527m778P5856O8735
19930i6756Q3883N8741N6818K7695k0962p2914l8146q0385j07803Q473J6445l8624
19918b03535O7328P2940r5788O457J4536R1453J01154M8029j7746J824r9752k156
19906a5256J9101R7764q153r7382J782n196j55540m7200J02852J46917m6410j41912
19894a48633K481l2354k8457p366L3868J39991J09739N7957p8632n0102P7787
19883G6279R222L9954J428J4604j8265m8096J7699L6204k0352j7250n785k8371
19871E7271o7553M3087O5773P4358R114j25536n3155O4359J34818P5523L7327
$$ plain form
19860 315386 331557 315781 356366 371575 404916 463227 424877 327185 141554 116382 130348
19849 130348 86397 57720 100146 143456 187699 138318 93121 167783 283302 219765 174358
19838 174358 209498 240515 148447 115523 98927 -3491 50265 25096 -19822 -90184 -72069
19827 -72069 -4743 41860 4449 -73836 -14426 -19448 -81182 -78000 -49832 -77543 -77470 -125877 -152626
19814 -152626 -158934 -124591 -205838 -217181 -121388 -38715 -35054 -85264 -87018 -101475 -81301 -20046
19802 -20046 16337 123410 273748 341237 257987 164395 127911 225124 283163 132164 42483
19791 42483 13109 -53724 -130613 -146691 -143219 -114121 8283 62720 58071 60891 195883 250213
19779 250213 222247 98480 27690 102888 35892 -48504 -23293 -1222 -3459 24834 6415
$$ packed form
19860C15386J6171j5776M0585J5209L3341N8311l8350r7692j85631k5172J3966
19849A30348m3951k8677M2426M3310M4243m9381m5197P4662J15519o3537m5407
19838A74358L5140L1017r2068l2924j6596j02418N3756k5169m4918p0362J8115
19827g2069O7326M6603l7411p8285N9410n022o1734L182K8168k7711P3m8407k6749
19814a52626o308L4343q1247j1343R5793Q2673L661n0210j754j4457K0174O1255
19802b0046L6383J07073J50338O7489q3250r3592l6484R7213N8039j50999q9681
19791D2483k9374o6833p6889j6078L472K9098J22404N4437m649K820J34992N4330
19779B50213k7966j23767p0790P5198o6996q4396K5211K2071k237K8293j8419
$$ plain form
19768 6415 -23506 12639 -61285 -101554 -77302 -55726 -37007 -73035 12727 132897 209703 169447
19756 169447 -23581 -54923 -74273 -37910 71280 148918 165695 104759 127551 118097 148272
19745 148272 170093 129813 179701 310740 379423 279749 166254 102773 -10872 -24935 18588
19734 18588 20122 16123 25363 108253 60233 -56777 -11126 36130 32180 9895 27106 121736
19722 121736 119791 65502 98926 190572 222704 84402 -2005 13256 113124 29870 -29296
19711 -29296 -79883 7894 118203 94358 60737 75807 17614 96153 91915 56610 88344 116862
19699 116862 145860 139865 52055 -47878 -55021 -10059 62390 94635 190856 175132 104645 114452
19687 114452 158175 124399 79706 28875 53723 -5711 -28599 90277 46326 -29984 -37601
$$ packed form
19768F415k9921L6145p3924m0269K4252K1576J8719l6028Q5762J20170P6806m0256
19756A69447j93028l1342j9350L6363J09190P7638J6777o0936K2792r454L0175
19745A48272K1821m0280M9888J31039O8683r9674j13495o3481j13645j4063M3523
19734A8588J534l999R240Q2890m8020j17010M5651M7256l950k2285J7211R4630
19722A21736j945n4289L3424R1646L2132j38302q6407J5261R9868q3254n9166
19711b9296n0587Q7777J10309k3845l3621J5070n8193P8539m238l5305L1734K8518
19699A16862K8998n995q7810r9933p143M4962P2449L2245R6221j5724p0487R807
19687A14452M3723l3776m4693n0831K4848n9434k2888J18876m3951p6310p617
$$ plain form
19676 -37601 -92194 -70841 37574 82917 21868 15345 49712 68243 45540 43847 120526 50638
19664 50638 13559 -63908 -114236 -130137 -192236 -149183 -60872 -22424 14773 -1151 -3833 37282
19652 37282 189145 239924 186366 149150 117411 208569 280372 277017 359266 422688 309163
19641 309163 215911 258681 266383 335942 343322 348411 375584 396874 339597 357504 368371 420254
19629 420254 341828 388661 344591 350615 341465 392034 522291 595247 607329 654363 793349
19618 793349 847817 966140 982342 972525 990516 1125530 1208810 1146855 1171322 1148993 1095216
19607 1095216 1014616 929189 906969 819422 687469 634606 642299 502377 470661 526210 475567
19596 475567 486167 560030 529427 409469 350982 298082 335721 500011 512619 394190 306779
$$ packed form
19676c7601n4593K1353J08415M5343o1049o523L4367J8531k2703j693P6679o9888
19664E0638l7079p7467n0328j5901o2099M3053Q8311L8448L7197j5924k682M1115
19652C7282J51863N0779n3558l7216l1739R1158P1803l355Q2249O3422j13525
19641C09163r3252M2770P702O9559P380N089K7173K1290n7277J7907J0867N1883
19629D20254p8426M6833m4070O024r150N0569J30257P2956J2082M7034J38986
19618G93349N4468J18323J6202r817J7991J35014Q3280o1955K4467k2329n3777
19607A095216q0600q5427k2220q7547j31953n2863P693j39922l1716N5549n0643
19596D75567J0600P3863l0603j19958n8487n2900L7639J64290J2608j18429q7411
$$ plain form
19585 306779 234303 312127 292804 284387 295368 287773 341669 278083 223620 193423 213109 267714
19573 267714 254933 192973 175051 174721 260348 313922 163316 226549 281518 241771 265486 300491
19561 300491 325780 319696 272042 168184 124945 141490 129938 181582 199260 138304 141347 140927
19549 140927 195514 299799 323218 185258 94181 41379 121485 182063 164622 177852 243658
19538 243658 265449 190029 156375 223353 267558 220056 162714 153960 139803 260199 320649
19527 320649 309756 304696 310100 356813 412791 476699 426068 309766 256126 233274 291085 339512
19515 339512 484276 571533 429836 394351 484526 562147 594086 690247 742362 753773 775302
19504 775302 897445 973044 935527 1046950 1044479 920193 854742 794340 800978 802577 806007 819816
$$ packed form
19585C06779p2476P7824j9323q417J0981p595N3896o3586n4463l0197J9686N4605
19573B67714j2781o1960j7922l30Q5627N3574j50606O3233N4969l9747K3715L5005
19561C00491K5289o084m7654j03858m3239J6545j1552N1644J7678o0956L043m20
19549A40927N4587J04285K3419j37960r1077n2802Q0106O0578j7441J3230O5806
19538B43658K1791p5420l3654O6978M4205m7502n7342q754j4157J20396O0450
19527C20649j0893n060N404M6713N5978O3908n0631j16302n3640k2852N7811M8427
19515C39512J44764Q7257j41697l5485R0175P7621L1939R6161N2115J1411K1529
19504G75302J22143P5599l7517J11423k471j24286o5451o0402O638J599L430J3809
$$ plain form
19492 819816 817190 751766 699035 673743 661593 628351 565356 541119 525927 434238 451571 462344
19480 462344 434458 456997 441210 412737 311281 283509 329126 178321 183666 234526 233583 323796
19468 323796 311057 292573 272760 326046 341595 388377 375074 333550 241615 246021 221186 323321
19456 323321 364516 400694 408620 383199 264500 226990 255958 267937 320970 351191 381954
19445 381954 506850 490248 551443 583738 641265 678007 792623 923791 1107271 1438255
19435 1438255 1649570 1794938 1731952 1717511 1816223 1803094 1823293 1897184 1857198 1681968 1511023
19424 1511023 1280493 998718 824893 636737 642013 772412 761457 539312 472977 530602
19414 530602 515778 488448 459955 471455 514851 456730 450685 554035 649250 549820 504976
$$ packed form
19492H19816k626o5424n2731k5292j2150l3242o2995k4237j5192r1689J7333J0773
19480D62344k7886K2539j5787k8473j01456k7772M5617j50805N345N0860r43R0213
19468C23796j2739j8484j9813N3286J5549M6782j3303m1524r1935M406k4835J02135
19456C23321M1195L6178P926k5421j18699l7510K8968J1979N3033L0221L0763
19445C81954J24896j6602O1195L2295N7527L6742J14616J31168J83480L30984
19435A438255K11315J45368o2986j4441R8712j3129K0199P3891l9986j75230j70945
19424A511023k30530k81775j73825j88156N276J30399j0955k22145o6335N7625
19414E30602j4824k7330k8493J1500M3396n8121o045J03350R5215r9430m4844
$$ plain form
19403 504976 492405 557010 574595 605187 655232 665284 629057 649526 656814 654777 555356 557978
19391 557978 595955 794080 890515 923821 952514 1092104 1303554 1363252 1370948 1384970 1406325
19380 1406325 1526833 1802113 2066609 2199941 2478227 2613638 2649051 2608972 2640437 2826669
19370 2826669 2975811 2992312 2853838 2656887 2411766 2268791 2073367 1938336 1873815 1722924
19360 1722924 1547558 1396734 1344463 1196116 1060627 952889 1002212 886160 786163 723891
19350 723891 719968 708190 705867 760347 816327 821329 831124 801849 744086 649174 616069 710996
19338 710996 630835 494618 405707 327079 372585 549615 464849 524446 587203 504600 449349
19327 449349 438355 401177 424963 447185 384997 323227 308078 278733 343734 348321 282300 259371
$$ packed form
19403E04976j2571O4605J7585L0592N0045J0052l6227K0469P288k037r9421K622
19391E57978L7977J98125R6435L3306K8693J39590K11450N9698P696J4022K1355
19380A406325J20508K75280K64496J33332K78286J35411L5413m0079L1465J86232
19370B826669J49142J6501j38474j96951k45121j42975j95424j35031o4521j50891
19360A722924j75366j50824n2271j48347j35489j07738M9323j16052r9997o2272
19350G23891l923j1778k323N4480N5980N002R795k9275n7763r4912l3105R4927
19338G10996q0161j36217q8911p8628M5506J77030q4766N9597O2757q2603n5251
19327D49349j0994l7178K3786K2222o2188o1770j5149k9345O5001M587o6021k2929
$$ plain form
19315 259371 210834 240304 274354 295981 306730 336146 318529 336519 409260 473730 453829
19304 453829 362216 361447 393727 337725 211550 91608 115114 205791 224054 227901 299414 318874
19292 318874 270930 162529 68354 37586 35545 89577 57288 145338 236371 281807 268091
19281 268091 266204 295403 286185 242287 235771 210090 213880 185782 207392 188508 186483 242300
19269 242300 251511 326154 331373 273682 299343 190544 146746 232227 361902 298150 276338
19258 276338 256142 338708 479577 462559 470220 497932 381713 265447 170414 162821 64037
19247 64037 62487 87113 89449 165257 185323 207983 147423 251769 384677 427451 358045 286510
19235 286510 256799 143227 111586 228052 210597 173824 215381 322060 397421 373784 296163
$$ packed form
19315B59371m8537K9470L4050K1627J0749K9416j7617J7990P2741O4470j9901
19304D53829r1613p69L2280n6002j26175j19942K3506R0677J8263L847P1513J9460
19292C18874m7944j08401r4175l0768k041N4032l2289Q8050R1033M5436j3716
19281B68091j887K9199r218m3898o516k5681L790k8098K1610j8884k025N5817
19269B42300R211P4643N219n7691K5661j08799m3798Q5481J29675o3752k1812
19258B76338k0196Q2566J40869j7018P661K7712j16219j16266r5033p593r8784
19247F4037j550K4626K336P5808K0066K2660o0560J04346J32908M2774o9406p1535
19235B86510k9711j13572l1641J16466j7455l6773M1557J06679P5361k3637p7621
$$ plain form
19224 296163 285416 335844 335232 269206 186288 262625 283682 343171 379999 326585 204368 192992
19212 192992 320547 200796 114707 150746 295048 264068 164329 187580 123731 24652 52846
19201 52846 105085 93209 54642 -31412 -86990 -54438 680 -37269 -13981 35857 45646 228437
19189 228437 217858 228878 227273 218858 173379 208796 173549 191169 273503 392131 338286 246301
19177 246301 236188 232876 274789 211844 227305 208146 86228 71212 113675 120000 43425 19110
19165 19110 40437 68188 106507 75879 243358 298279 319635 318036 254750 147934 135497
19154 135497 129630 79355 101643 46600 90469 145905 115186 113006 148429 125813 27341 40862
19142 40862 107867 119414 52938 9483 85762 143093 132295 160018 92318 63799 15323 50151
$$ packed form
19224B96163j0747N0428o12o6026q2918P6337K1057N9489L6828n3414j22217j1376
19212A92992J27555j19751q6089L6039J44302l0980r9739K3251o3849r9079K8194
19201E2846N2239j1876l8567q6054n5578L2552N5118l7949K3288M9838R789J82791
19189B28437j0579J1020j605q415m5479L5417l5247J7620Q2334J18628n3845r1985
19177B46301j0113l312M1913o2945J5461j9159j21918j5016M2463O325p6575k4315
19165A9110K1327K7751L8319l0628J67479N4921K1356j599o3286j06816j2437
19154A35497n867n0275K2288n5043M3869N5436l0719k180L5423k2616r8472J3521
19142D0862O7005J1547o6476m3455P6279N7331j0798K7723o7700k8519m8476L4828
$$ plain form
19130 50151 165945 178294 209650 375701 467398 409463 374891 365307 276139 231794 301348
19119 301348 262996 230282 248998 166216 246419 292783 306309 414933 429468 350401 361528
19108 361528 348929 352793 355555 380888 482289 642982 667054 625020 664431 660802 564926 646085
19096 646085 563613 495990 410906 349123 253430 231302 233783 131778 179936 289211 239229
19085 239229 269167 291705 258673 243822 208394 146579 113747 96698 89823 167058 180404 201179
19073 201179 216263 247562 228349 240856 286159 384846 368387 183252 147466 147754 70828 165110
19061 165110 184083 365366 529435 511017 519873 500423 503356 435191 416869 439227 397853
19050 397853 431098 367652 339912 307213 280695 311865 261660 310361 313213 167349 95693
$$ packed form
19130E0151J15794J2349L1356J66051R1697n7935l4572r584q9168m4345O9554
19119C01348l8352l2714J8716q2782Q0203M6364J3526J08624J4535p9067J1127
19108C61528j2599L864K762K5333J01401J60693K4072m2034L9411l629r5876Q1159
19096F46085q2472o7623q5084o1783r5693k2128K481j02005M8158J09275m9982
19085B39229K9938K2538l3032j4851l5428o1815l2832j7049o875P7235J3346K0775
19073B01179J5084L1299j9213J2507M5303R8687j6459j85135l5786K88p6926R4282
19061A65110J8973J81283J64069j8418Q856j9450K933o8165j8322K2358m1374
19050C97853L3245o3446k7740l2699k6518L1170n0205M8701K852j45864p1656
$$ plain form
19039 95693 144802 173227 155141 133592 129483 126828 22991 32627 173119 197912 152987 170590
19027 170590 244106 291118 263873 289128 384364 508696 380167 320900 364355 298045 249512
19016 249512 290917 367758 341621 291604 337944 390606 439012 403514 363773 324821 365191
19005 365191 408224 385114 401317 440419 431300 434970 314405 303046 415075 547870 747135
18994 747135 843459 865738 748431 637514 504541 293678 298976 308354 356139 348160 388145
18983 388145 487553 516525 497308 559135 516755 577739 782566 816874 683085 723132 766540
18972 766540 807543 776202 707604 562506 634773 715686 528411 486761 524499 438767 373361
18961 373361 325228 423412 418245 369151 505575 573028 470974 541209 633195 574932 668311
$$ packed form
19039I5693M9109K8425j8086k1549m109k655j03837R636J40492K4793m4925J7603
19027A70590P3516M7012k7245K5255R5236J24332j28529n9267M3455o6310m8533
19016B49512M1405P6841k6137n0017M6340N2662M8406l5498l9741l8952M0370
19005C65191M3033k3110J6203L9102r119L670j20565j1359J12029J32795J99265
18994G47135R6324K2279j17307j10917j32973k10863N298R378M7785p979L9985
18983C88145R9408K8972j9217O1827m2380O0984K04827L4308j33789M0047M3408
18972G66540M1003l1341o8598j45098P2267Q0913j87275m1650L7738q5732o5406
18961C73361m8133R8184n167m9094J36424O7453j02054P0235R1986n8263R3379
$$ plain form
18950 668311 766058 752528 738138 722163 641229 545346 518814 610366 624479 636458 603691
18939 603691 527024 537810 573917 638995 758369 945372 907016 933819 871439 983897 1046736
18928 1046736 1061159 1213864 1285981 1327626 1411544 1530736 1687242 1845862 2149318 2634944
18918 2634944 3177368 3765819 4518711 5375151 6021069 6223793 6246321 6193055 6272786 6480313
18908 6480313 6729902 6678962 6237234 5463247 4682051 4107294 3769735 3404384 3173043 3083927
18898 3083927 3053728 2951894 3021062 2966839 2927254 3009378 3109392 3354951 3659478 3862693
18888 3862693 4105024 4314237 4633441 5105856 5500322 5568633 5529097 5594202 5689291 5993473
18878 5993473 6279629 6545475 6612867 6738326 6985544 7448597 7856913 8382805 8984821 9779820
$$ packed form
18950F68311R7747j3530j4390j5975q0934r5883k6532R1552J4113J1979l2767
18939F03691p6667J0786L6107O5078J19374J87003l8356K6803o2380J12458O2839
18928A046736J4423J52705P2117M1645Q3918J19192J56506J58620L03456M85626
18918B634944N42424N88451P52892Q56440O45918K02724K2528n3266P9731K07527
18908F480313K49589n0940m41728p73987p81196n74757l37559l65351k31341q9116
18898C083927l0199j01834O9168n4223l9585Q2124J00014K45559L04527K03215
18888C862693K42331K09213L19204M72415L94466O8311l9536O5105R5089L04182
18878E993473K86156K65846O7392J25459K47218M63053M08316N25892O02016P94999
$$ plain form
18868 9779820 10822519 11891863 13252020 15035119 17090703 19440355 22224165 25555334
18860 25555334 29732228 35303329 42844368 53057191 67184993 86810098 114606413
18853 114606413 153115021 203076484 259087549 305330291 321320408 307768087 289329189
18846 289329189 285773477 300315074 321076677 325258885 294946390 239393762 182930875
18839 182930875 138484195 106518529 83782630 67117196 54894479 45674096 38564235
18832 38564235 33066149 28749921 25206391 22031713 19327501 17020356 15028824 13308097
18824 13308097 11918868 10853519 9983048 9217200 8605490 8195288 7863825 7568294 7246910
18815 7246910 7082170 6990572 6653581 6291378 5893294 5650782 5529250 5650596 5498009 5069231
$$ packed form
18868I779820J042699J069344J360157J783099K055584K349652K783810L331169
18860B5555334M176894N571101P541039J0212823J4127802J9625105K7796315
18853A14606413L8508608M9961463N6011065M6242742J5990117j3552321j8438898
18846B89329189l555712J4541597K0761603M182208l0312495n5552628n6462887
18839A82930875m4446680l1965666k2735899j6665434j2222717r220383p109861
18832C8564235n498086m316228l543530l174678k704212k307145j991532j720727
18824A3308097j389229j065349q70471p65848o11710m10202l31463k95531l21384
18815G246910j64740r1598l36991l62203l98084k42512j21532J21346j52587m28778
$$ plain form
18805 5069231 4467553 3932672 3649087 3438376 3201766 2948041 2770936 2553472 2297624
18796 2297624 2120408 2017473 2102487 2032500 1876985 1865913 1841096 1741873 1711790 1681735 1698870
18785 1698870 1551523 1430807 1338303 1401677 1389816 1268941 1191446 1114377 1136426 1208198 1178937
18774 1178937 1017375 894278 934357 869911 873497 902741 805447 742660 688594 784993 857456
18763 857456 804754 774950 656424 665024 645488 702526 771983 763304 720496 635336 705064 906641
18751 906641 904977 815650 744765 719144 713203 774393 871246 923690 921319 886444 837560 777347
18739 777347 838271 871053 1032947 1109669 1240200 1192354 1100894 1051454 1091658 1006456 999061
18728 999061 974412 946170 886272 845849 845255 859252 835603 836461 824044 761271 750039 749030
$$ packed form
18805E069231o01678n34881k83585k10711k36610k53725j77105k17464k55848
18796B297624j77216j02935Q5014o9987j55515j1072k4817r9223l0083l0055J7135
18785A698870j47347j20716r2504O3374j1861j20875p7495p7069K2049P1772k9261
18774A178937j61562j23097M0079o4446L586K9244r7294o2787n4066R6399P2463
18763H57456n2702k9804j18526Q600j9536N7038O9457q679m2808q5160O9728K01577
18751I06641j664q9327p0885k5621n941O1190R6853N2444k371l4875m8884o0213
18739G77347O0924L2782J61894P6722J30531m7846r1460m9440M0204q5202p395
18728I99061k4649k8242n9898m0423n94J3997k3649Q58j2417o2773j1232j009
$$ plain form
18716 749030 740767 630921 462122 524608 582843 485905 502946 467497 464133 437518 443084 452294
18704 452294 452373 388393 436842 562845 544689 542605 520682 469806 536031 583715 473472 512215
18692 512215 562011 611203 642138 664417 677733 604424 675593 703752 702843 711918 705608 814595
18680 814595 773303 670365 560861 480088 442023 446388 487845 560970 602690 516686 473014
18669 473014 446617 567108 635561 530795 473843 475501 483948 578852 638467 562464 579456
18658 579456 593683 704451 821358 907549 1058471 1168765 1197812 1233783 1258238 1307062 1343370
18647 1343370 1473079 1557445 1570357 1549924 1621531 1717497 1726024 1772474 1736754 1722789 1688404
18636 1688404 1602323 1521615 1436081 1374110 1286325 1170646 1055072 1078183 1131053 1109245 1109137
$$ packed form
18716G49030q263j09846j68799O2486N8235r6938J7041l5449l364k6615N566R210
18704D52294P9o3980M8449J26003j8156k084k1923n0876O6225M7684j10243L8743
18692E12215M9796M9192L0935K2279J3316p3309P1169K8159r09R075o310J08987
18680H14595m1292j02938j09504q0773l8065M365M1457P3125M1720q6004m3672
18669D73014k6397J20491O8453j04766n6952J658Q447R4904N9615p6003J6992
18658E79456J4227J10768J16907Q6191J50922J10294K9047L5971K4455M8824L6308
18647A343370J29709Q4366J2912k0433P1607R5966Q527M6450l5720j3965l4385
18636A688404q6081q0708q5534o1971q7785j15679j15574K3111N2870k1808j08
$$ plain form
18625 1109137 1209688 1264174 1249793 1192123 1141583 1036193 978562 959953 1002983 1026211 934204
18614 934204 904911 818667 725378 658649 574675 572851 611779 644161 525296 654050 827115
18603 827115 919707 897009 927893 895564 905779 989687 1119097 1304793 1330824 1254108 1397667
18592 1397667 1581971 1702695 1796485 1857259 1902581 1902686 1887431 1897356 1873612 1785073 1735424
18581 1735424 1740818 1664017 1585474 1531074 1369593 1326364 1334636 1334781 1275098 1176143 1203372 1247156
18569 1247156 1368617 1405067 1293942 1230038 1231974 1185146 1028014 944518 1048721 977897 763457
18558 763457 654677 646931 671159 675222 607351 554848 473882 500165 503268 488979 431185 300897
18546 300897 308800 424739 425220 483641 519707 401293 416821 450932 487149 565352 575211 584230
$$ packed form
18625A109137J00551N4486j4381n7670n0540j05390n7631j8609M3030K3228r2007
18614I34204k9293q6244r3289o6729q3974j824L8928L2382j18865J28754J73065
18603H27115R2592k2698L0884l2329J0215Q3908J29410J85696K6031p6716J43559
18592A397667J84304J20724R3790O0774M5322J05j5255R925k3744q8539m9649
18581A735424N394p6801p8543n4400j61481m3229Q272J45n9683r8955K7229M3784
18569A247156J21461L6450j11125o3904J936m6828j57132q3496J04203p0824k14440
18558G63457j08780p746K4228M063o7871n2503q0966K6283L103j4289n7794j30288
18546C00897P903J15939M81N8421L6066j18414J5528L4111L6217P8203R859R019
$$ plain form
18534 584230 687617 628272 662051 765022 678204 714306 801519 872157 882502 799208 709133
18523 709133 720028 659722 649703 786810 895031 830480 730841 726516 712358 722515 812892
18512 812892 838308 879357 752184 669245 556110 369599 320589 293665 311286 311544 346274
18501 346274 354382 465922 421788 310712 272007 271271 355024 331929 428166 517116 447685 359514
18489 359514 278130 431276 592182 467484 405361 401336 420712 491421 505932 446325 300886
18478 300886 255820 332420 390318 390538 280940 293931 350493 322736 271508 336104 402298 393084
18466 393084 313945 357841 481617 417131 380246 447543 480893 385369 342938 443399 536514
18455 536514 504340 560848 568975 533999 479257 479301 402746 415259 432529 458553 473078 525778
$$ packed form
18534E84230J03387n9345L3779J02971q6818L6102Q7213P0638J0345q3294r0075
18523G09133J0895o0306j0019J37107J08221o4551r9639m325j4158J0157R0377
18512H12892K5416M1049j27173q2939j13135j86511m9010k6924J7621K58L4730
18501C46274Q108J11540m4134j11076l8705p36Q3753k3095R6237Q8950o9431q8171
18489C59514q1384J53146J60906j24698o2123m025J9376P0709J4511n9607j45439
18478C00886m5066P6600N7898K20j09598J2991N6562k7757n1228O4596O6194r214
18466C93084p9139M3896J23776o4486l6885O7297L3350r5524m2431J00461R3115
18455E36514l2174N6508Q127l4976n4742M4p6555J2513J7270K6024J4525N2700
$$ plain form
18443 525778 493464 432273 357586 369915 424582 474441 540639 549040 451961 429957 533792
18432 533792 643659 705690 664046 634276 642791 648559 683403 753138 734534 600893 561970
18421 561970 653768 626205 502544 455592 400655 379622 407864 499705 527775 466378 560987
18410 560987 635609 654277 697292 666005 527511 465809 431309 514241 481589 453088 457547
18399 457547 502218 516770 511764 635230 630034 491406 432325 567583 675273 703557 612021
18388 612021 646222 775551 675418 571722 580248 658218 664001 608370 612243 745781 733226
18377 733226 748562 763513 701331 690619 696668 691233 645552 690500 731501 712815 689246 823058
18365 823058 952257 855885 788950 871433 1027819 1066577 988599 921463 853186 918276 884980
$$ packed form
18443E25778l2314o1191p4687J2329N4667M9859O6198Q401r7079k2004J03835
18432E33792J09867O2031m1644k9770Q515N768L4844O9735j8604j33641l8923
18421E61970R1798k7563j23661m6952n4937k1033K8242R1841K8070o1397R4609
18410E60987P4622J8668M3015l1287j38494o1702l4500Q2932l2652k8501M459
18399D57547M4671J4552n006J23466n196j38628n9081J35258J07690K8284r1536
18388F12021L4201J29329j00133j03696Q526P7970N783n5631L873J33538j2555
18377G33226J5336J4951o2182j0712O049n435m5681M4948M1001j8686k3569J33812
18365H23058J29199r6372o6935Q2483J56386L8758p7978o7136o8277O5090l3296
$$ plain form
18354 884980 853018 934587 897068 959591 937892 957682 932695 918159 1002862 959638 983363
18343 983363 1012665 937884 984580 982678 898437 824697 814312 794467 843837 851274 869582 995628
18331 995628 1004604 976732 1029177 1082764 1061421 968752 900236 904174 924251 951688 1001485 888803
18319 888803 916325 933531 904362 1114331 1142443 1155318 1169093 1181400 1176954 1097406 1024266
18308 1024266 1035410 1120572 1109416 1203224 1205465 1173026 1114364 1191234 1208422 1216057 1204544 1176183
18296 1176183 1132316 1182865 1215370 1183597 1294533 1369497 1415625 1359399 1301663 1389254 1385374
18285 1385374 1396467 1282853 1223213 1288621 1327108 1414999 1425878 1444863 1458627 1492774 1527525
18274 1527525 1495806 1599799 1745405 1679686 1697173 1625674 1591754 1691279 1664675 1644475 1752591
$$ packed form
18354H84980l1962Q1569l7519O2523k1699J9790k4987j4536Q4703m3224K3725
18343I83363K9302p4781M6696j902q4241p3740j0385j9845M9370P437J8308J26046
18331I95628Q976k7872N2445N3587k1343r2669o8516L938K0077K7437M9797j12682
18319H88803K7522J7206k9169K09969K8112J2875J3775J2307m446p9548p3140
18308A024266J1144Q5162j1156R3808K241l2439n8662P6870J7188P635j1513k8361
18296A176183m3867N0549L2505l1773J10936P4964M6128n6226n7736Q7591l880
18285A385374J1093j13614n9640O5408L8487Q7891J0879J8985J3764L4147L4751
18274A527525l1719J03993J45606o5719J7487p1499l3920R9525k6604k0200J08116
$$ plain form
18263 1752591 1844350 1850742 2106805 2376268 2584928 2732410 2862215 2813819 2783619 2857362
18253 2857362 2921069 2988145 3090904 3104179 2972156 2749652 2608311 2416940 2391623 2393210
18243 2393210 2233016 2041351 2063895 2073881 2087825 1947654 1778700 1699677 1777909 1908292
18233 1908292 2031562 2044653 2054431 2053289 1981790 1966069 1974430 2035587 2068382 2051271 1926513
18222 1926513 2045597 2208140 2186990 2258173 2460092 2857581 3183682 3290117 3334697 3444787
18212 3444787 3428761 3429806 3521023 3562511 3432134 3297969 3333528 3645636 3918676 3976785 3931409
18201 3931409 3724832 3724254 3772248 3905648 3801333 3552633 3449571 3329778 3314734 3451265
18191 3451265 3758935 4047506 4241050 4548165 4867484 5030491 5253588 5407109 5489456 5534757
$$ packed form
18263A752591R1759O392K56063K69463K08660J47482J29805m8396l0200P3743
18253B857362O3707O7076J02759J3275j32023k22504j41341j91371k5317J587
18243B393210j60194j91665K2544R986J3944j40171j68954p9023P8232J30383
18233A908292J23270J3091R778j142p1499j5721Q361O1157L2795j7111j24758
18222A926513J19084J62543k1150P1183K01919L97489L26101J06435M4580J10090
18212C444787j6026J045R1217M1488j30377j34165L5559L12108K73040N8109m5376
18201C931409k06577n78M7994J33400j04315k48700j03062j19793j5044J36531
18191C451265L07670K88571J93544L07115L19319J63007K23097J53521Q2347M5301
$$ plain form
18181 5534757 5502154 5469816 5364231 5257278 5115807 4903847 4657917 4489734 4210006 3935411
18171 3935411 3768916 3659482 3438849 3299303 3312756 3429139 3458122 3452971 3442395 3431288
18161 3431288 3412495 3373571 3364920 3309783 3295734 3367103 3379034 3377079 3369102 3449083 3541222 3653171
18149 3653171 3752613 3943762 4190802 4490951 4783436 5035323 5243165 5535588 5960360 6570320
18139 6570320 7089718 7712902 8538193 9584546 10623250 11750627 12801901 13571278 14612110
18130 14612110 15952593 17564704 19432266 21524449 24139667 28003771 34179588 44091140
18122 44091140 59356081 80283099 102726026 113078366 105876541 99053874 105325107
18115 105325107 126419792 158204283 184175430 176383221 141001430 111419593 98067675
$$ packed form
18181E534757l2603l2338j05585j06953j41471k11960k45930j68183k79728k74595
18171C935411j66495j09434k20633j39546J3453J16383K8983n151j0576j1107
18161C431288j8793l8924q651n5137j4049P1369J1931j955p977P9981R2139J11949
18149C653171R9442J91149K47040L00149K92485K51887K07842K92423M24772O09960
18139F570320N19398O23184Q25291J046353J038704J127377J051274P69377J040832
18130A4612110J340483J612111J867562K092183K615218L864104O175817R911552
18122D4091140J5264941K0927018K2442927J0352340p201825o822667O271233
18115A05325107K1094685L1784491K5971147p792209l5381791k9581837j3351918
$$ plain form
18108 98067675 97525336 102941412 102273384 85744718 63314111 46129335 34792176 27265046
18100 27265046 22312785 18999776 16594626 14919724 13684518 12560250 11513817 10844339
18092 10844339 10460790 10201524 9959240 9583796 9337099 9264747 9382651 9517399 9654155
18083 9654155 9662601 9654653 9825456 10121438 10468888 11052508 11811110 12728624 13836141 15298320
18073 15298320 17565097 20926675 26015886 33808321 45663527 63084625 86258684 110352969
18065 110352969 120852864 113948213 109288369 119618644 146853648 185943373 215995476
18058 215995476 203027171 159651663 126082090 112879076 115530004 125474010 125821687
18051 125821687 103156297 73819426 52729213 39899999 31976336 27080450 24104805
$$ packed form
18108I8067675n42339N416076o68028j6528666k2430607j7184776j1337159p527130
18100B7265046m952261l313009k405150j674902j235206j124268j046433o69478
18092A0844339l83549k59266k42284l75444k46697p2352J17904J34748J36756
18083I654155Q446p948J70803K95982L47450N83620P58602R17514J107517J462179
18073A5298320K266777L361578N089211P792435J1855206J7421098K3174059K4094285
18065A10352969J0499895o904651m659844J0330275K7235004L9089725L0052103
18058B15995476j2968305m3375508l3569573j3203014K650928R944006L47677
18051A25821687k2665390k9336871k1090213j2829214p923663m895886k975645
$$ plain form
18044 24104805 21813137 19190204 16678315 14872721 13728205 13236509 13158143 12523638 10979795
18035 10979795 9381131 8116120 7130892 6334149 5602239 5037270 4671694 4274924 4033348
18026 4033348 3887256 3531619 3143078 2866337 2649968 2370867 2117096 1978268 1823644
18017 1823644 1826585 1917213 1842757 1727181 1697302 1617452 1560155 1504281 1427986 1312118 1273440
18006 1273440 1364338 1378510 1282674 1213205 1115054 982211 1127694 1147177 1062274 1028886 973781
17995 973781 895585 852669 911513 920523 994356 944612 1020814 1077347 1005973 999287 969390 1010129
17983 1010129 996880 901493 745510 742422 837210 914129 929890 853274 766211 787515 765124
17972 765124 720947 756142 703580 730652 770295 739305 725478 798687 783769 765496 681623
$$ packed form
18044B4104805k291668k622933k511889j805594j144516m91696p8366o34505j543843
18035A0979795j598664j265011r85228p96743p31910n64969l65576l96770k41576
18026D033348j46092l55637l88541k76741k16369k79101k53771j38828j54624
18017A823644K941R0628p4456j15576k9879p9850n7297n5874p6295j15868l8678
18006A273440R0898J4172r5836o9469r8151j32843J45483J9483q4903l3388n5105
17995I73781p8196m2916N8844R010P3833m9744P6202N6533p1374o686k9897M0739
17983A010129j3249r5387j55983l088R4788P6919J5761p6616q7063K1304k2391
17972G65124m4177L5195n2562K7072L9643l0990j3827P3209j4918j8273q3873
$$ plain form
17961 681623 552688 530235 485458 525751 710749 740210 693175 633371 601885 587114 509318
17950 509318 459817 403098 307362 317763 452739 521405 487787 580135 628667 694880 680136
17939 680136 661443 617413 548047 566774 514925 533811 546521 450187 539053 648516 680510
17928 680510 681255 814274 798254 705688 642489 511332 525500 462263 512975 579640 678911
17917 678911 629380 539603 558054 550217 455922 576601 560322 508038 545060 527670 545110
17906 545110 582283 659139 651360 732454 849622 867486 913258 987237 1069410 1137754 1130929 1167436
17894 1167436 1352483 1614037 1775148 1868967 1765068 1604069 1500831 1423457 1308052 1283132
17884 1283132 1259522 1258796 1342094 1561773 1690965 1885676 1922147 1795472 1723924 1854621 1822221
$$ packed form
17961F81623j28935k2453m4777M0293J84998K9461m7035n9804l1486j4771p7796
17950E09318m9501n6719r5736J0401J34976O8666l3618R2348M8532O6213j4744
17939F80136j8693m4030o9366J8727n1849J8886J2710r6334Q8866J09463L1994
17928F80510P45J33019j6020r2566o3199j31157J4168o3237N0712O6665R9271
17917F78911m9531q9777J8451p837r4295J20679j6279n2284L7022j7390J7440
17906E45110L7173P6856p779Q1094J17168J7864M5772P3979Q2173O8344o825L6507
17894A167436J85047K61554J61111R3819j03899j60999j03238p7374j15405k4920
17884A283132k3610p26Q3298K19679J29192J94711L6471j26675p1548J30697l2400
$$ plain form
17873 1822221 1742349 1504543 1288311 1149766 1076908 925781 903132 877282 959945 1041305
17863 1041305 1277486 1405366 1486431 1320323 1053358 791958 751153 645154 467634 429260
17853 429260 536520 575079 622883 692747 721491 675749 591863 501814 628222 715566 633417
17842 633417 722492 941560 1011752 1180210 1283893 1458361 1552313 1528267 1373306 1229051
17832 1229051 1157369 1057519 889036 819238 940658 1122241 1467375 1745744 1753765 1702908
17822 1702908 1610663 1478035 1571226 1661554 1675895 1734556 1674144 1605358 1639841 1752796 1801008
17811 1801008 1820693 1916860 2120803 2160663 2180333 2060406 1900167 1737404 1644051 1638801 1705104
17800 1705104 1710731 1654182 1576686 1555340 1556845 1501565 1354233 1106280 883323 749153 609552
$$ packed form
17873A822221p9872k37806k16232j38545p2858j51127k2649k5850Q2663Q1360
17863A041305K36181J27880Q1065j66108k66965k61400m0805j05999j77520l8374
17853D29260J07260L8559M7804O9864K8744m5742q3886r0049J26408Q7344q2149
17842F33417Q9075K19068P0192J68458J03683J74468R3952k4046j54961j44255
17832A229051p1682r9850j68483o9798J21420J81583L45134K78369Q021n0857
17822A702908r2245j32628R3191R0328J4341N8661o0412o8786L4483J12955M8212
17811A801008J9685R6167K03943L9860J9670j19927j60239j62763r3353n250O6303
17800A705104N627n6549p7496k1346J505n5280j47332k47953k22957j34170j39601
$$ plain form
17789 609552 670417 629229 525614 411454 385431 266726 138870 76964 -31714 127051
17779 127051 346285 292210 223521 240874 286428 310570 224521 189820 260310 392565 494679
17768 494679 531282 547117 579787 459156 331297 397786 354192 252875 190703 213930 355696
17757 355696 357354 490012 482710 550790 462910 271774 108681 99985 170619 282963 403619
17746 403619 413412 400839 397137 385976 345937 415962 490918 487692 398179 505206 588759 583687
17734 583687 457351 499370 613503 580377 562330 437368 353727 428595 400743 391258 465249
17723 465249 462151 437194 450939 450495 395146 351444 363431 442179 505887 597355 617639 651530
17711 651530 584512 499438 487807 345998 276455 278597 306141 389279 438391 532892 673985
$$ packed form
17789F09552O0865m1188j03615j14160k6023j18705j27856o1906j08678J58765
17779A27051K19234n4075o8689J7353M5554K4142q6049l4701P0490J32255J02114
17768D94679L6603J5835L2670j20631j27859O6489m3594j01317o2172K3227J41766
17757C55696J658J32658p302O8080q7880j91136j63093q696P0634J12344J20656
17746D03619R793j2573l702j1161m0039P0025P4956l226q9513J07027Q3553n072
17734E83687j26336M2019J14133l3126j8047j24962q3641P4868k7852r485P3991
17723D65249l098k4957J3745m44n5349m3702J1987P8748O3708R1468K0284L3891
17711F51530o7018q5074j1631j41809o9543K142K7544Q3138M9112R4501J41093
$$ plain form
17700 673985 728763 726661 681927 682485 625621 577498 537095 389098 211008 205986 166706 152562
17688 152562 172146 180608 198186 386395 334041 211599 263533 286382 305291 328797 297910
17677 297910 307090 319661 325987 391792 427471 414351 472965 476217 473907 448265 479453 406151
17665 406151 262708 332716 451235 545590 521282 383202 394561 386616 497212 481505 396005
17654 396005 361442 428135 355900 307883 362050 388087 399889 445511 419276 345129 294233
17643 294233 289611 375538 445091 480844 470155 423616 481359 511452 528406 465985 417864 398119
17631 398119 413265 461144 539266 501022 434714 524776 682553 626690 610764 637864 604228
17620 604228 547353 479031 487326 369570 403025 501158 544293 616220 738615 902830 883945
$$ packed form
17700F73985N4778k102m4734N58n6864m8123m0403j47997j78090n022l9280j4144
17688A52562J9584Q462J7578J88209n2354j22442N1934K2849J8909K3506l0887
17677B97910R180J2571O326O5805L5679j3120N8614L252k310k5642L1188p3302
17665D06151j43443P0008J18519R4355k4308j38080J1359p945J10596j5707q5500
17654C96005l4563O6693p2235m8017N4167K6037J1802M5622k6235p4147n0896
17643B94233m622Q5927O9553L5753j0689m6539N7743L0093J6954o2421m8121j9745
17631C98119J5146M7879P8122l8244o6308R0062J57777n5863j5926K7100l3636
17620F04228n6875o8322Q295j17756L3455R8133M3135P1927J22395J64215j8885
$$ plain form
17609 883945 832538 812753 902429 924731 844858 814421 953562 1064719 1014428 1035107 1062443
17598 1062443 1021993 974088 958507 935607 882389 829414 829930 785667 740023 586602 483442
17587 483442 484285 500704 528666 520369 492402 396565 422942 519724 590105 591354 604749 546822
17575 546822 628623 675701 742267 737211 776957 821825 887484 959257 901944 889820 972528 917438
17563 917438 893358 976149 1014959 1007413 1008951 1014592 1145088 1253018 1099004 1091522 1206005
17552 1206005 1265966 1206380 1198177 1303516 1497656 1545437 1517383 1468219 1427097 1373375 1485978
17541 1485978 1638119 1675089 1701839 1563758 1589510 1670343 1819367 2036278 2296321 2573021
17531 2573021 2771096 2819540 2573490 2319127 2102944 1946619 1808869 1817016 2005611 2217038
$$ packed form
17609H83945n1407j9785Q9676K2302p9873l0437J39141J11157n0291K0679K7336
17598A062443m0450m7905j5581k2900n3218n2975N16m4263m5644j53421j03160
17587D83442Q43J6419K7962q297k7967r5837K6377R6782P0381J249J3395n7927
17575E46822Q1801M7078O6566n056L9746M4868O5659P1773n7313j2124Q2708n5090
17563I17438k4080Q2791L8810p546J538N641J30496J07930j54014p482J14483
17552A206005N9961n9586q203J05339J94140M7781k8054m9164m1122n3722J12603
17541A485978J52141L6970K6750j38081K5752Q0833J49024K16911K60043K76700
17531B573021J98075M8444k46050k54363k16183j56325j37750Q147J88595K11427
$$ plain form
17521 2217038 2439428 2888903 3506651 4029669 4377284 4454539 4386651 4096032 3701650 3481963
17511 3481963 3533707 3454454 3068800 2637312 2418989 2296585 2013296 1601409 1345773 1176757
17501 1176757 1003067 980514 996952 972449 1000665 1018539 963940 950489 890231 914476 854312
17490 854312 889962 890136 893455 964445 963053 968493 949728 1019524 1135983 1140359 1178316 1332760
17478 1332760 1668787 1957541 2164799 2302242 2292658 2247355 2145519 1916517 1753179 1737283
17468 1737283 1808512 1851473 1927153 2025039 2096534 2397537 2737028 2778224 2817440 2621873 2226755
17457 2226755 2016150 1831948 1717150 1595501 1431902 1501765 1538985 1487420 1384816 1275439
17447 1275439 1224918 1297233 1529356 1714506 1711247 1703457 1696082 1754053 1728624 1600377 1661999
$$ packed form
17521B217038K22390M49475O17748N23018L47615P7255o7888k90619l94382k19687
17511C481963N1744p9253l85654m31488k18323j22404k83289m11887k55636j69016
17501A176757j73690k2553J6438k4503K8216J7874n4599j3451o0258K4245o0164
17490H54312L5650J74L319P0990j392N440j8765O9796J16459M376L7957J54444
17478A332760L36027K88754K07258J37443r584m5303j01836k29002j63338j5896
17468A737283P1229M2961P5680R7886P1495L01003L39491M1196L9216j95567l95118
17457B226755k10605j84202j14798j21649j63599O9863L7220n1565j02604j09377
17447A275439n0521P2315K32123J85150l259p790p375N7971k5429j28247O1622
$$ plain form
17436 1661999 1718916 1669258 1624511 1561357 1641688 1707919 1696311 1716505 1793989 1888906 1871786
17425 1871786 1855388 1832720 1704336 1802697 1923782 1965834 2050920 2258667 2499122 2873623
17415 2873623 3114225 3082729 2958463 2849934 2815960 2829046 2977843 3141561 3372513 3724094
17405 3724094 4133125 4675556 5438246 6130035 6379312 6237958 6212920 6496112 7014706 7783944
17395 7783944 8682216 9897224 11512497 13931332 17437441 22459649 30262101 42898250
17387 42898250 63666189 96480564 141669618 183521613 178302698 129324128 87566593
17380 87566593 64175720 52719371 48441726 49446334 56027635 70478602 97187902
17373 97187902 141181029 202499859 260029964 253501163 180471223 114815992 76029576
$$ packed form
17436A661999N6917m9658m4747o3154Q0331O6231j1608K0194P7484R4917j7120
17425A871786j6398k2668j28384R8361J21085M2052Q5086K07747K40455L74501
17415B873623K40602l1496j24266j08529l3974J3086J48797J63718K30952L51581
17405C724094M09031N42431P62690O91789K49277j41354k5038K83192N18594P69238
17395G783944Q98272J215008J615273K418835L506109N022208P802452J2636149
17387D2898250K0767939L2814375M5189054M1851995n218915m8978570m1757535
17380H7566593k3390873j1456349m277645J004608O581301J4450967K6709300
17373I7187902M3993127O1318830N7530105o528801p3029940o5655231l8786416
$$ plain form
17366 76029576 54013882 40813629 31805688 25395637 20883081 17734636 15397123 13554440
17358 13554440 12225636 11362257 10686550 10243197 9968119 9931823 9871418 9678932 9507485
17349 9507485 9629702 9991981 10089048 9843872 9733948 9842554 10193347 10840372 11703227 12813764
17339 12813764 14029444 15266635 17122509 19724806 23560250 29552603 39145927 53751182
17331 53751182 73324469 91012405 89521830 72040416 58608501 53330698 53919449 59300126
17323 59300126 69847062 87361451 116315339 164244341 240049743 348074904 465482505
17316 465482505 511161833 461679840 380571402 307360430 269630858 271584519 304948772
17309 304948772 349454234 356733195 299183766 232056476 195417708 188240901 199181896
$$ packed form
17366G6029576k2015694j3200253r007941o410051m512556l148445k337513j842683
17358A3554440j328804q63379o75707m43353k75078l6296o0405j92486j71447
17349I507485J22217L62279R7067k45176j09924J08606L50793O47025Q62855J110537
17339A2813764J215680J237191J855874K602297L835444N992353R593324J4605255
17331E3751182J9573287J7687936j490575j7481414j3431915n277803N88751N380677
17323E9300126J0546936J7514389K8953888M7929002P5805402J08025161J17407601
17316D65482505M5679328m9481993q1108438p3210972l7729572J953661L3364253
17309C04948772M4505462P278961n7549429o7127290l6638768p176807J0940995
$$ plain form
17302 199181896 208046263 189272774 151291501 122364551 109593791 108947111 113275189
17295 113275189 109788143 91109684 68615632 52023955 41158414 33831404 28903318
17288 28903318 25641511 23457400 21489272 19334571 17148862 15162892 13692396 12578026
17280 12578026 11507552 10343121 9257875 8150714 7197713 6527743 5997199 5389850 4906469
17271 4906469 4316676 3767868 3455382 3334108 3216465 2981763 2848916 2714055 2657921 2523297
17261 2523297 2283122 2164768 2036129 1987595 1905347 1872398 1788058 1671075 1524974 1400555
17251 1400555 1367284 1309059 1238970 1337598 1238954 1072863 1070313 996437 901537 995922 945327
17240 945327 922336 1034330 981371 846659 780613 720811 634724 524104 556585 595881 618158
$$ packed form
17302A99181896Q864367j8773489l7981273k8926950j2770760o46680M328078
17295A13275189l487046j8678459k2494052j6591677j0865541p327010m928086
17288B8903318l261807k184111j968128k154701k185709j985970j470496j114370
17280A2578026j070474j164431j085246j107161r53001o69970n30544o07349m83381
17271D906469n89793n48808l12486j21274j17643k34702j32847j34861n6134j34624
17261B523297k40175j18354j28639m8534q2248l2949q4340j16983j46101j24419
17251A400555l3271n8225p0089R8628r8644j66091k550p3876r4900R4385n0595
17240I45327k2991J11994n2959j34712o6046n9802q6087j10620L2481L9296K2277
$$ plain form
17229 618158 569799 610304 683949 702292 637921 551853 518944 583256 541553 398054 369062
17218 369062 365887 361471 413314 502880 505208 504228 469745 407039 352450 338832 299233 321321
17206 321321 306343 259258 266777 331933 420669 296674 303979 291088 197621 276993 305099 343243
17194 343243 452506 569598 638707 725199 815931 794559 693904 654159 589566 578359 638348
17183 638348 644971 691349 741460 766772 728883 601285 466917 510652 528504 453079 382136
17172 382136 390713 457065 494817 476054 479911 392511 214733 262296 242496 177392 217759 305327
17160 305327 311230 231592 190173 314457 226187 228390 254726 166065 67582 4850 96967 123731
17148 123731 16770 -58071 26312 94062 142741 169809 177830 191215 103791 87332 137090
$$ packed form
17229F18158m8359M0505P3645J8343o4371q6068l2909O4312m1703j43499k8992
17218C69062l175m416N1843Q9566K328r80l4483o2706n4589j3618l9599K2088
17206C21321j4978m7085P519O5156Q8736j23995P305j2891r3467P9372K8106L8144
17194C43243J09263J17092O9109Q6492R0732k1372j00655l9745o4593j1207N9989
17183F38348O623M6378N0111K5312l7889j27598j34368M3735J7852p5425p0943
17172C82136Q577O6352L7752j8763L857q7400j77778M7563j9800o5104M0367Q7568
17160C05327N903p9638m1419J24284q8270K203K6336q8661r8483o2732R2117K6764
17148A23731j06961p4841Q4383O7750M8679K7068Q021J3385q7424j6459M9758
$$ plain form
17137 137090 172839 183038 14441 -67121 -65649 -91280 -96193 22072 74394 -1495 81606
17126 81606 107654 103878 30820 -116803 -46864 189422 209690 252495 255311 128125 102591
17115 102591 51727 31787 107132 153648 161627 87106 61623 34433 -11749 -86797 -96556 -105289
17103 -105289 -96589 -85817 -91403 -78242 -50168 -41952 -102734 -113046 -53974 -11314 -40461 -34223
17091 -34223 -115452 -121752 -91750 -5726 -64919 -138325 -47547 -7754 112325 59216 -4738 -6563
17079 -6563 4485 94133 91757 167390 138704 119448 75377 56943 121404 73014 48291 -73618
17067 -73618 -141039 -229746 -227758 -188338 -124948 -72310 -75736 8939 19793 -32831 -6729 26771
17055 26771 49030 101905 50798 -34151 -100031 -16442 -44012 -83044 -161312 -170698 -160168 -111071
$$ packed form
17137A37090L5749J0199j68597q1562J472k5631m913J18265N2322p5889Q3101
17126H1606K6048l776p3058j47623O9939K36286K0268M2805K816j27186k5534
17115A02591n0864j9940P5345M6516P979p4521k5483k7190m6182p5048r759q733
17103a05289Q700J0772n586J3161K8074Q216o0782j0312N9072M2660k9147O238
17091c4223q1229o300L0002Q6024n9193p3406R0778L9793J20079n3109o3954j825
17079f563J1048Q9648k376P5633k8686j9256m4071j8434O4461m8390k4723j21909
17067g3618o7421q8707J988L9420O3390N2638l426Q4675J0854n2624K6102L3500
17055B6771K2259N2875n1107q4949o5880Q3589k7570l9032p8268r386J0530M9097
$$ plain form
17043 -111071 -129839 -124170 -91385 -30854 1947 22806 62339 31043 7658 -4032 -32602 -323
17031 -323 -4052 -3197 -3091 17683 62938 116167 113962 49318 -123571 -103062 -41551 -35522 -21152
17018 -21152 40253 54941 -35362 -16969 153306 117984 60394 -81087 -110322 -160727 -164043
17007 -164043 -209257 -154755 -98360 -104406 -88364 27285 4330 -16804 123396 147597 23087
16996 23087 -60587 -108628 -33218 61866 35232 -78429 -146759 -162858 -128530 -25359 -53684
16985 -53684 15351 68458 32648 58638 -27260 -30946 112579 94546 173767 263159 327404 388673
16973 388673 418592 323191 359698 408253 462546 475309 554600 423129 356041 473156 569401
16962 569401 665134 651197 587309 588551 637524 594494 537788 563212 530174 519983 412261
$$ packed form
17043a11071j8768N669L2785O0531L2801K0859L9533l1296k3385j1690k8570L2279
17031c23l729Q55J06K0774M5255N3229k205o4644j72889K0509O1511O029J4370
17018b1152O1405J4688r0303J8393J70275l5322n7590j41481k9235n0405l316
17007a64043m5214N4502N6395o046J6042J15649k2955k1134J40200K4201j24510
16996B3087q3674m8041P5410R5084k6634j13661o8330j6099L4328J03171k8325
16985e3684O9035N3107l5810K5990q5898l686J43525j8033P9221Q9392O4245O1269
16973C88673K9919r5401L6507M8555N4293J2763P9291j31471o7088J17115R6245
16962E69401R5733j3937o3888J242M8973m3030n6706K5424l3038j0191j07722
$$ plain form
16951 412261 422241 402505 314712 302679 246723 182257 226914 177669 159921 283916 278888 248100
16939 248100 185352 181038 172291 189646 355426 445821 291633 237105 217591 142652 201327
16928 201327 255357 361970 335360 371317 502045 460111 383074 371176 543662 563585 540124
16917 540124 477420 432315 484070 520516 640160 643682 646188 625041 602484 590259 676214 581547
16905 581547 444616 358598 274196 359321 370062 339585 296629 198074 147824 233055 323747
16894 323747 357761 324636 400480 436685 384839 501514 628867 704104 851326 903129 847854
16883 847854 722323 595296 508096 383508 342801 200746 230452 365784 567614 659083
16873 659083 824686 868331 855365 765906 583163 384641 288922 265297 316703 375895 300750
$$ packed form
16951D12261R980j9736q7793j2033n5956o4466M4657m9245j7748J23995n028l0788
16939B48100o2748m314q747J7355J65780R0395j54188n4528j9514p4939N8675
16928B01327N4030J06613k6610L5957J30728m1934p7037j1898J72486J9923k3461
16917E40124o2704m5105N1755L6446J19644L522K506k1147k2557j2225Q5955r4667
16905E81547j36931q6018q4402Q5125J0741l0477m2956r8555n0250Q5231R0692
16894C23747L4014l3125P5844L6205n1846J16675J27353P5237J47222N1803n5275
16883H47854j25531j27027q7200j24588m0707j42055K9706J35332K01830R1469
16873F59083J65603M3645j2966q9459j82743j98522r5719k3625N1406N9192p5145
$$ plain form
16862 300750 262737 204416 148135 126021 131700 69379 53627 70275 -45643 -21987 118938
16851 118938 158554 137982 209140 196947 123110 74748 98703 131810 130457 132258 134624 270227
16839 270227 354407 292885 189093 220946 284830 361616 485020 506535 590337 820701 972560
16828 972560 834854 760917 624046 615974 581777 513052 362256 342024 412069 648261 913347
16817 913347 1137136 1243400 1207278 1164584 1217218 1204059 1183112 1093542 1157607 1098362 993560
16806 993560 991058 897677 800813 869340 1025902 1168084 1326779 1265153 1053093 884197 792150
16795 792150 783266 719247 633016 571668 347323 288945 269247 192279 201108 205065 148625 113815
16783 113815 95666 15580 72929 14719 -77114 -42543 -18747 5578 -31030 13327 -123463
$$ packed form
16862C00750l8013n8321n6281k2114N679o2321j5752J6648j15918K3656J40925
16851A18938L9616k0572P1158j2193p3837m8362K3955L3107j353J801K366J35603
16839B70227Q4180o1522j03792L1853O3884P6786J23404K1515Q3802K30364J51859
16828I72560j37706p3937j36871q072l4197o8725j50796k0232P0045K36192K65086
16817I13347K23789J06264l6122m2694N2634j3159k0947q9570O4065n9245j04802
16806I93560k502r3381r6864O8527J56562J42182J58695o1626k12060j68896r2047
16795G92150q884o4019q6231o1348k24345n8378j9698p6968Q829L957n6440l4810
16783A13815j8149q0086N7349n8210r1833L4571K3796K4325l6608M4357j36790
$$ plain form
16772 -123463 -198378 -73386 -145870 -122433 -21721 -3433 -34548 -12858 -128214 -90890 -24434
16761 -24434 -73076 -160900 -149046 -138133 -183967 -156490 -173293 -172512 -160255 -181316 -152416 -197245
16749 -197245 -145261 -169539 -207626 -223915 -222056 -122748 -168237 -171519 -169959 -185745 -77436 -56056
16737 -56056 -144843 -97921 -29875 -190143 -179283 -94404 -93715 -145589 -121299 -96358 -102596 -77010
16725 -77010 -47940 -56688 -175177 -235526 -232185 -313263 -270018 -162113 -109351 -141766 -182547 -142935
16713 -142935 -246216 -218794 -96287 -48534 -205335 -225054 -185125 -137438 -165300 -81579 -125008
16702 -125008 -257766 -208122 -12239 54066 -73786 -143942 -222819 -195772 -182922 -65898 -50899
16691 -50899 -51658 -194565 -148092 -63396 -114384 -200450 -225768 -208110 -204148 -177133 -93997 -122690
$$ packed form
16772a23463p4915J24992p2484K3437J00712J8288l1115K1690j15356L7324O6456
16761b4434m8642q7824J1854J0913m5834K7477j6803P81J2257k1061K8900m4829
16749a97245N1984k4278l8087j6289J859R9308m5489l282J560j5786J08309K1380
16737e6056q8787M6922O8046j60268J0860Q4879O89n1874K4290K4941o238K5586
16725g7010K9070q748j18489o0349L341q1078M3245J07905N2762l2415m0781L9612
16713a42935j03281K7422J22507M7753j56801j9719L9929M7687k7862Q3721m3429
16702a25008j32758M9644J95883O6305j27852p0156p8877K7047J2850J17024J4999
16691e0899p59j42907M6473Q4696n0988q6066k5318J7658L962K7015Q3136k8693
$$ plain form
16679 -122690 -218381 -164832 -211751 -269647 -280847 -158997 -139048 -125312 -24052 -51375 -91317
16668 -91317 -128039 -141023 -146161 -55584 -14499 -202657 -363450 -288889 -159928 -70878 -93259
16657 -93259 -72087 -41706 3265 20838 4001 -45097 15728 77391 110093 378971 435131
16646 435131 340786 158576 89853 -6486 -106068 -97237 -113636 -170075 -243449 -229188 -168798
16635 -168798 -111126 -74736 -93917 -179623 -209247 -189350 -192919 -139320 -115725 -88842 -54872 -76354
16623 -76354 -101492 -120078 -127828 -208167 -292218 -316562 -251378 -180769 -78133 -112727 -132434 -122810
16611 -122810 -189919 -225301 -162261 -166344 -67582 36634 119982 -6621 -113441 -159853 -150119
16600 -150119 -125667 -70702 -153875 -163052 -119056 -171760 -201657 -220400 -149159 -173689 -128783 -75700
$$ packed form
16679a22690r5691N3549m6919n7896j1200J21850J9949J3736J01260k7323l9942
16668i1317l6722j2984n138R0577M1085j88158j60793P4561J28961Q9050k2381
16657i3259K1172L0381M4971J7573j6837m9098O0825O1663L2702K68878N6160
16646D35131r4345j82210o8723r6339r9582Q831j6399n6439p3374J4261O0390
16635a68798N7672L6390j9181q5706k9624J9897l569N3599K3595K6883L3970k1482
16623g6354k5138j8586p750q0339q4051k4344O5184P0609J02636l4594j9707R624
16611a22810o7109l5382O3040m083R8762J04216Q3348j26603j06820m6412R734
16600a50119K4452N4965q3173r177M3996n2704k9897j8743P1241k4530M4906N3083
$$ plain form
16588 -75700 -77668 -99323 -121511 -91431 -75674 -177854 -276709 -205481 -146666 -176046 -123138 9112
16576 9112 74125 95592 128651 -6605 -54235 -107069 -81347 12008 25405 -63808 -113923 -94753
16564 -94753 -58555 -13457 -78589 -289580 -272049 -212846 -219003 -276077 -294462 -240941 -175197 -227595
16552 -227595 -158365 -201398 -229646 -181464 -144506 -111143 -67368 -63854 -136380 -206835 -127331 -149253
16540 -149253 -197554 -272551 -259865 -257944 -202772 -127295 -184426 -243576 -217559 -166634 -118283 -237374
16528 -237374 -200142 -93119 -42913 -41785 -181378 -241940 -138348 -75916 -92027 -38783 -55607
16517 -55607 -76991 -45542 -54883 -66057 23366 28642 4982 -169208 -250390 -337907 -310831 -231955
16505 -231955 -237524 -150408 -13837 -65068 -119321 -36680 -55354 -108343 7482 148669 126739
$$ packed form
16588g5700j968k1655k2188L0080J5757j02180r8855P1228N8815k9380N2908J32250
16576I112O5013K1467L3059j35256m7630n2834K5722R3355J3397q9213n0115J9170
16564i4753L6198M5098o5132k10991J7531N9203o157n7074j8385N3521O5744n2398
16552b27595O9230m3033k8248M8182L6958L3363M3775L514p2526p0455P9504k1922
16540a49253m8301p4997J2686J921N5172P5477n7131n9150K6017N0925M8351j19091
16528b37374L7232J07023N0206J128j39593o0562J03592O2432j6111N3244j6824
16517e5607k1384L1449r341j1174Q9423N276k3660j74190q1182q7517K7076P8876
16505b31955n569Q7116J36571n1231n4253Q2641j8674n2989J15825J41187k1930
$$ plain form
16494 126739 166636 97309 18394 -43353 -96040 -110276 -189324 -211098 -159312 -81723 -91353 -137661
16482 -137661 -5002 46399 54394 -8102 -44592 -57172 27844 165198 18997 -167619 -214249
16471 -214249 -117000 -202478 -260630 -179552 -103867 -138052 -125151 -90370 -53093 -56136 -72962 -143311
16459 -143311 -228166 -157438 -143806 -154369 -228909 -170643 -75438 -59544 -92879 -198313 -198502 -204422
16447 -204422 -238853 -171161 -158612 -132362 -200250 -163749 -127003 -250140 -226503 -173701 -186195
16436 -186195 -167587 -173636 -234153 -276513 -219797 -205410 -228827 -235292 -188607 -225807 -229270 -226565
16424 -226565 -228038 -216340 -238166 -176645 -139111 -150246 -146648 -179147 -158433 -129157 -37947 -84193
16412 -84193 -112311 -154287 -122524 -42619 -55080 -187055 -221859 -131679 72001 84055 10039
$$ packed form
16494A26739L9897o9327p8915o1747n2687j4236p9048k1774N1786P7589r630m6308
16482a37661J32659N1401P995o2496l6490j2580Q5016J37354j46201j86616m6630
16471b14249R7249q5478n8152Q1078P5685l4185J2901L4781L7277l043j6826p0349
16459a43311q4855P0728J3632j0563p4540N8266R5205J5894l3335j05434j89n920
16447b04422l4431O7692J2549K6250o7888L6501L6746j23137K3637N2802j2494
16436a86195J8608o049o0517m2360N6716J4387k3417o465M6685l7200l463K705
16424b26565j473J1698k1826O1521L7534j1135L598l2499K0714K9276R1210m6246
16412h4193k8118m1976L1763P9905j2461j31975l4804R0180K03680J2054p4016
$$ plain form
16401 10039 -63866 -66539 -78605 -136815 -138080 -31206 17838 -7323 -51467 -129323 -145101 -122950
16389 -122950 -130133 -169046 -106804 -147303 -192860 -112231 -76993 -41426 -26394 -63814 -194640
16378 -194640 -321099 -243057 -83212 -58648 -27980 49143 85341 -5524 -139524 -226414 -173401
16367 -173401 -68824 -74073 -68650 -104913 -125755 -170817 -119913 -119131 -58742 -41045 -61608 -71045
16355 -71045 -66080 -1546 -43115 -182436 -162693 -140490 -170513 -180116 -265901 -227829 -230819 -199296
16343 -199296 -194066 -151441 -167165 -179770 -268986 -327296 -252895 -236818 -178235 -220571 -244548 -199668
16331 -199668 -164150 -205217 -236653 -245088 -244503 -170913 -95884 -39267 -28128 3271 22781 -52551
16319 -52551 -79973 -75421 -204870 -257999 -128642 -66578 -133683 -88752 -171512 -155286 -115351
$$ packed form
16401A0039p3905k673j2066n8210j265J06874M9044k5161m4144p7856j5778K2151
16389a22950p183l8913O2242m0499m5557Q0629L5238L5567J5032l7420j30826
16378a94640j26459P8042J59845K4564L0668P7123L6198r0865j34000q6890N3013
16367a73401J04577n249N423l6263k0842m5062N0904P82O0389J7697k0563r437
16355g1045M965O4534m1569j39321J9743K2203l0023r603q5785L8072k990L1523
16343a99296N230M2625j5724j2605q9216n8310P4401J6077N8583m2336k3977M4880
16331a99668L5518m1067l1436q435N85P3590P5029N6617J1139L1399J9510p5332
16319e2551k7422M552j29449n3129J29357O2064o7105M4931q2760J6226L9935
$$ plain form
16308 -115351 -153715 -199344 -83250 -4260 -46582 67095 76147 47405 90209 97698 15622
16297 15622 -155998 -201869 -204140 -272329 -194016 -45685 -29397 -50972 42 90154 97907 67931
16285 67931 115149 149818 49813 -47432 -45249 -123061 -218879 -225965 -166561 -239787 -234048 -241760
16273 -241760 -249975 -166575 -237229 -115743 -75734 -42054 -71994 -129988 -109849 -94297 -32598
16262 -32598 -20646 -69894 -39327 84394 72504 77100 202193 217700 250784 161742 143775
16251 143775 146408 133191 79918 103012 78935 -2341 -74073 -93777 -146892 -135825 -41060 -58084
16239 -58084 -112178 -72544 -189605 -257061 -208682 -173981 -269565 -248279 -86102 37114 51251
16228 51251 -112116 -79033 -4578 2871 -36442 -79715 97131 257758 297113 296777 330753 248827
$$ packed form
16308a15351l8364m5629J16094P8990m2322J13677R052k8742M2804P489q2076
16297A5622j71620m5871k271o8189P8313J48331J6288k1575N1014R0112P753k9976
16285F7931M7218L4669j00005r7245K183p7812r5818p086N9404p3226N739p712
16273b41760q215Q3400p0654J21486M0009L3680k9940n7994K0139J5552O1699
16262c2598J1952m9248L0567J23721j1890M596J25093J5507L3084q9042j7967
16251A43775K633j3217n3273K3094k4077q1276p1732j9704n3115J1067R4765j7024
16239e8084n4094L9634j17061o7456M8379L4701r5584K1286J62177J23216J4137
16228E1251j63367L3083P4455P449l9313m3273J76846J60627L9355l36L3976q1926
$$ plain form
16216 248827 106473 -7216 -35002 17147 -73401 -217338 -237808 -247995 -204940 -90009 -10900
16205 -10900 -54882 -74634 -57984 -34229 -67871 -79355 -189934 -282232 -279501 -193402 -197713 -80100
16193 -80100 36691 -60 -38223 -25745 -47240 -76241 -201814 -231527 -187435 -142278 -108784
16182 -108784 -66055 60827 -50590 -169807 -175694 -112390 -113677 -179602 -193436 -212829 -255075
16171 -255075 -201084 -167564 -156183 -206188 -205756 -173369 -204309 -199493 -39431 -16640 -11771 -83272
16159 -83272 -105593 -158451 -162230 -67482 6887 32993 -121653 -239406 -261642 -166729 14468
16148 14468 5583 -96387 -204291 -234162 -179465 -193782 -129766 -139301 -169077 -198076 -209791 -103955
16136 -103955 -32357 -56302 -34756 -74801 -176795 -169648 -160191 -122534 -158954 -141436 -182811 -191249
$$ packed form
16216B48827j42354j13689k7786N2149r0548j43937k0470j0187M3055J14931P9109
16205a0900m3982j9752J6650K3755l3642j1484j10579r2298K731Q6099m311J17613
16193h0100J16791l6751l8163J2478k1495k9001j25573k9713M4092M5157L3494
16182a08784M2729J26882j11417j19217n887O3304j287o5925j3834j9393m2246
16171b55075N3991L3520J1381n0005M32L2387l0940M816J60062K2791M869p1501
16159h3272k2321n2858l779R4748P4369K6106j54646j17753k2236R4913J81197
16148A4468q885j01970j07904k9871N4697j4317O4016r535k9776k8999j1715J05836
16136a03955P1598k3945K1546m0045j01994P147R457L7657l6420J7518m1375q438
$$ plain form
16124 -191249 -217278 -275662 -219014 -172725 -136789 -127928 -148656 -113837 -129513 -237877 -273420
16113 -273420 -288587 -365743 -309156 -213565 -206424 -221597 -221361 -181867 7465 -83584 -123706 -121196
16101 -121196 -166905 -127881 -69158 -122394 -120901 -90317 -60434 -4471 22760 -83640 -120094
16090 -120094 -260160 -272655 -104879 -96237 -92567 -156007 -141380 -7965 -98466 -221828 -230572
16079 -230572 -193524 -215952 -265446 -228490 -165873 -179913 -124198 -71620 3063 62111 18808
16068 18808 -26988 -98288 -79160 -55008 -96667 -108153 -152321 -221552 -195328 -167173 -17172
16057 -17172 119363 99958 966 -100103 -165562 -122503 -65426 12650 71514 89065 46688
16046 46688 -57981 -17684 7132 -44324 -112307 -116862 -12373 27875 12062 66451 88143
$$ packed form
16124a91249k6029n8384N6648M6289L5936Q861k0728L4819j5676j08364l5543
16113b73420j5167p7156N6587R5591P141j5173K36L9494J89332r1049m0122K510
16101a21196m5709L9024N8723n3236J493L0584K9883N5963K7231j06400l6454
16090a20094j40066j2495J67776Q642L670o3440J4627J33415r0501j23362q744
16079b30572L7048k2428m9494L6956O2617j4040N5715N2578P4683N9048m3303
16068A8808m5796p1300J9128K4152m1659j1486m4168o9231K6224K8155J50001
16057a7172J36535j9405r8992j01069o5459M3059N7077P8076N8864J7551m2377
16046D6688j04669M0297K4816n1456o7983m555J04489M0248j5813N4389K1692
$$ plain form
16035 88143 53673 64266 87430 54664 -73356 -38071 24018 82725 97471 62933 68098 95737
16023 95737 82787 122181 158629 75549 21955 -72665 -38158 -12024 -35157 -72184 -79955 -98827
16011 -98827 -148054 -192084 -216843 -111712 -15047 -16433 69145 139579 53064 -118050 -221718
16000 -221718 -122849 22466 223522 243704 123987 -30073 -64481 -2426 -9737 -75805 -134763
15989 -134763 -140539 -43682 -50169 -174676 -123119 -69964 19201 27725 -101863 -140187 -112780 -137871
15977 -137871 -135517 -143036 -149882 -275050 -211710 -151081 -98033 -167013 -198420 -235343 -199290 -68204
15965 -68204 15033 -108533 -116012 -32501 3072 68329 21546 -8381 -78360 -128601 -257803
15954 -257803 -279260 -219091 -191129 -95185 46677 27502 -28392 -34002 -123015 -132129 -183644 -107932
$$ packed form
16035H8143l4470J0593K3164l2766j28020L5285O2089N8707J4746l4538N165K7639
16023I5737j2950L9394L6448q3080n3594r4620L4507K6134k3133l7027p771j8872
16011i8827m9227m4030k4759J05131R6665j386Q5578P0434q6515j71114j03668
16000b21718R8869J45315K01056K0182j19717j54060l4408O2055p311o6068n8958
15989a34763n776R6857o487j24507N1557N3155Q9165Q524j29588l8324K7407k5091
15977a37871K354p519o846j25168O3340O0629N3048o8980l1407l6923L6053J31086
15965f8204Q3237j23566p479Q3511L5573O5257m6783k9927o9979n0241j29202
15954b57803k1457O0169K7962R5944J41862j9175n5894n610q9013r114n1515P5712
$$ plain form
15942 -107932 -104412 -68640 -108840 -92550 -72251 -2720 14306 49399 165133 180701 132670
15931 132670 87319 3808 -26843 7315 -46353 -63773 -78569 -50109 -17988 -19537 158092
15920 158092 165349 -6905 -29737 -67198 -83966 -97679 -94276 -110376 -87879 -37214 55083 -24498
15908 -24498 -107670 -126237 -44933 85174 125093 89419 32795 6184 -99634 -235072 -283302
15897 -283302 -244925 -203053 -212335 -216715 -36817 6020 86858 55874 12144 -22855 -34266 1120
15885 1120 -123841 -195184 -164684 -82222 -65115 -30243 -71043 -113631 -83411 -15815 48470 26217
15873 26217 -78151 -76526 -103116 -206613 -214099 -61044 -58890 -99316 -141142 -128083 -95001 -47877
15861 -47877 -47633 24234 92302 153754 171666 -13187 -55883 3804 -9809 -46337 73305 105610
$$ packed form
15942a07932L520L5772m0200J6290K0299O9531J7026L5093J15734J5568m8031
15931A32670m5351q3511l0651L4158n3668j7420j4796K8460L2121j549J77629
15920A58092P257j72254k2832l7461j6768j3713L403j6100K2497N0665R2297p9581
15908b4498q3172j8567Q1304J30107L9919l5674n6624k6611j05818j35438m8230
15897b83302L8377M1872r282m380J79898M2837Q0838l0984m3730l4999j1411L5386
15885A120j24961p1343L0500Q2462J7107L4872m0800m2588L0220O7596O4285k2253
15873B6217j04368J625k6590j03497p486J53055K154m0426m1826J3059L3082M7124
15861d7877K44P1867O8068O1452J7912j84853m2696N9687j3613l6528J19642L2305
$$ plain form
15849 105610 14306 -105327 -102147 -93934 -46061 53855 167567 154293 158419 118639 70741 140617
15837 140617 222587 169245 43974 -27657 60299 59880 67796 -22168 -31264 -30660 -6646 32688
15825 32688 92332 142986 167905 147418 168725 318499 581458 832563 1123871 1093868 857374
15814 857374 648939 564534 410533 264821 185629 294286 380090 436482 335907 169032
15804 169032 173632 207583 150517 48100 -120592 -146528 -206159 -183356 -95470 20847 22679
15793 22679 -102602 -78824 72544 123546 -5294 -24997 -65007 -62172 4378 -94665 -35116
15782 -35116 32839 56940 62865 -91137 -136031 -226400 -217645 -77029 -94246 -33431 -23042 -65495
15770 -65495 -73178 -13243 -31396 -55843 -59960 -135946 -162150 -118632 -80717 -98657 -102706 1102
$$ packed form
15849A05610r1304j19633L180Q213M7873R9916J13712j3274M126l9780m7898O9876
15837A40617Q1970n3342j25271p1631Q7956m19P916q9964r096O04K4014L9334
15825C2688N9644N0654K4919k0487K1307J49774K62959K51105K91308l0003k36494
15814H57374k08435q4405j54001j45712p9192J08657Q5804N6392j00575j66875
15804A69032M600L3951n7066j02417j68692k5936n9631K2803Q7886J16317J832
15793B2679j25281K3778J51368N1002j28840j9703m0010K835O6550r9043N9549
15782c5116O7955K4101N925j54002m4894r0369Q755J40616j7217O0815J0389m2453
15770f5495p683N9935j8153k4447m117p5986k6204M3518L7915j7940m049J03808
$$ plain form
15758 1102 118171 28847 -64392 -66518 31652 58155 98634 80482 45693 -71085 -116554 -141305
15746 -141305 5120 31421 -24379 -118597 -111405 -162582 -182151 -83674 -4432 93602 137172
15735 137172 59887 12482 -4672 -31418 3138 -15924 37100 66048 111957 56436 108190
15724 108190 56067 -59598 -70723 -15261 11490 14856 -48552 -64818 -48262 -36715 40857
15713 40857 78545 42372 44245 84796 34258 -150302 -169535 -161314 -141153 -143289 -126260 -117320
15701 -117320 -140900 -152074 -129676 -434 162978 155230 114609 124882 90099 29694 -38775
15690 -38775 -83516 -102438 -127039 -94971 -73911 -25925 -5009 -19102 47532 127112 100299 45097
15678 45097 73142 12131 -68976 -73367 51128 105586 168978 199567 185493 32707 -9619
$$ packed form
15758A102J17069q9324r3239k126R8170K6503M0479j8152l4789j16778m5469k4751
15746a41305J46425K6301n5800r4218P192n1177j9569R8477P9242R8034M3570
15735A37172p7285m7405j7154k6746L4556j9062N3024K8948M5909n5521N1754
15724A08190n2123j15665j1125N5462K6751L366o3408j6266J6556J1547P7572
15713D0857L7688l6173J873M0551n0538j84560j9233Q221K0161k136J7029Q940
15701a17320k3580j1174K2398J29242J63412p748m0621J0273l4783o0405o8469
15690c8775m4741j8922k4601L2068K1060M7986K0916j4093O6634P9580k6813n5202
15678D5097K8045o1011q1107m391J24495N4458O3392L0589j4074j52786m2326
$$ plain form
15667 -9619 10929 -8312 -41400 48229 35813 73684 128040 72496 48126 -84615 -59768 51207
15655 51207 15516 -14754 -22452 46970 76042 62577 104434 47103 -123619 -51599 42005 55331
15643 55331 -12396 -80712 -90661 -102233 -12519 20091 -9346 21964 115418 101160 72204 5147
15631 5147 69602 72511 -30937 -105673 -62782 -24412 7586 15282 -11299 96179 72413 46150
15619 46150 -16687 -74021 -4514 17638 -10755 38112 84876 31961 -1223 8109 -6464 -23851
15607 -23851 13337 80066 154953 128968 119927 126593 97631 35145 93769 139267 75806 64042
15595 64042 61567 60373 50586 -23090 -61254 -82119 -131133 -22254 27722 -55324 -57818 -52149
15583 -52149 -884 -22823 55782 108037 133403 170838 113590 123604 14279 -41725 -44057 13674
$$ packed form
15667i619K0548j9241l3088Q9629j2416L7871N4356n5544k4370j32741K4847J10975
15655E1207l5691l0270p698O9422K9072j3465M1857n7331j70722P2020R3604J3326
15643E5331o7727o8316r949j1572Q9714L2610k9437L1310R3454j4258k8956o7057
15631E147O4455K909j03448p4736M2891L8370L1998P696k6581J07478k3766k6263
15619D6150o2837n7334O9507K2152k8393M8867M6764n2915l3184R332j4573j7387
15607b3851L7188O6729P4887k5985r041O666k8962o2486N8624M5498o3461j1764
15595F4042k475j194r787p3676l8164k0865m9014J08879M9976q3046k494N669
15583e2149N1265k1939P8605N2255K5366L7435n7248J0014j09325n6004k332N7731
$$ plain form
15571 13674 141367 187071 162697 12769 -102069 -107357 -118010 -103330 -65911 -46790 -122222
15560 -122222 -114527 -45824 -15768 -96556 -74839 58071 102745 104519 47859 47676 99163 117189
15548 117189 184075 168894 112427 64752 33367 -913 11238 -20892 -51801 47373 17714
15537 17714 -1333 25935 20591 20869 31579 -43113 34617 82623 94294 50383 28400 37100
15525 37100 168069 176780 148876 238540 289322 272572 150858 140182 170815 206987 202643 318369
15513 318369 539123 758913 944425 1035789 1033613 918589 902841 863919 876834 893355 1075792
15502 1075792 1285381 1426848 1690645 1963312 2177473 2320199 2194064 2000502 1844694
15493 1844694 1786238 1668176 1421307 1263330 1141279 967560 811933 766553 596139 441475
$$ packed form
15571A3674J27693M5704k4374j49928j14838n288j0653J4680L7419J9121p5432
15560a22222P695O8703L0056q0788K1717J32910M4674J774n6660j83N1487J8026
15548A17189O6886j5181n6467m7675l1385l4280J2151l2130l0909R9174k9659
15537A7714j9047K7268n344K78J0710p4692P7730M8006J1671m3911k1983Q700
15525C7100J30969Q711k7904Q9664N0782j6750j21714j0676L0633L6172m344J15726
15513C18369K20754K19790J85512R1364k176j15024j5748l8922J2915J6521J82437
15502A075792K09589J41467K63797K72667K14161J42726j26135j93562j55808
15493A844694n8456j18062k46869j57977j22051j73719j55627m5380j70414j54664
$$ plain form
15483 441475 355079 374464 456187 523305 473330 415329 422376 472620 421023 488895 338159
15472 338159 180757 67557 -52884 -49034 -23086 15841 21211 109533 137559 174773 164701
15461 164701 204515 130940 139980 177326 84241 113366 194134 149381 121228 171539 112474 22761
15449 22761 -17685 10527 -53353 -75709 -32406 -18893 32777 66880 117706 93796 31820 -63875
15437 -63875 -133026 -166968 -112345 -18297 116784 77517 91103 -7456 -34405 -35737 58068 71464
15425 71464 168247 83117 72591 149909 207349 208856 113774 82333 144188 94881 -38976 127628
15413 127628 216581 195599 147832 200548 202530 95983 10824 -76182 -25027 181917 271243
15402 271243 256304 340772 449139 513707 503138 575357 588435 581692 546930 548232 519868 426850
$$ packed form
15483D41475q6396J9385Q1723O7118m9975n8001P047N0244n1597O7872j50736
15472C38159j57402j13200j20441L850K5948L8927N370Q8322K8026L7214j0072
15461A64701L9814p3575R040L7346r3085K9125Q0768m4753k8153N0311n9065q9713
15449B2761m0446K8212o3880k2356M3303J3513N1670L4103N0826k3910o1976r5695
15437f3875o9151l3942N4623R4048J35081l9267J3586r8559k6949j332R3805J3396
15425G1464R6783q5130j0526P7318N7440J507r5082l1441O1855m9307j33857J66604
15413A27628Q8953k0982m7767N2716J982j06547q5159q7006N1155K06944Q9326
15402B71243j4939Q4468J08367O4568j0569P2219J3078o743l4762J302k8364r3018
$$ plain form
15390 426850 341998 339623 372198 468721 548954 557465 660979 774747 993372 1107561 940629
15379 940629 659227 467426 293423 248494 172576 120434 57055 110458 73235 33662 85494
15368 85494 193579 230789 222499 269693 255272 164540 162231 130049 -27442 -101039 -57616 -28737
15356 -28737 -14845 -48442 -96689 -3063 -41310 51650 134006 78068 36523 26989 84598 55781
15344 55781 -13799 -84356 33671 167128 168646 152151 83630 51533 7418 -21933 -44032
15333 -44032 -14191 125675 152340 35945 20076 48053 85412 20492 21098 100408 109653 111901
15321 111901 41319 115966 206617 127666 10017 -56698 6477 -108622 -92638 -96785 -40224
15310 -40224 5964 70424 72979 -12034 -75460 24967 -11697 -105469 -61831 -136624 -88819 28981
$$ packed form
15390D26850q4852k375L2575R6523Q0233Q511J03514J13768K18625J14189j66932
15379I40629k81402j91801j74003m4929p5918n2142o3379N3403l7223l9573N1832
15368H5494J08085L7210q290M7194j4421r0732k309l2182j57491p3597M3423K8879
15356b8737J3892l3597m8247R3626l8247R2960Q2356n5938m1545r534N7609k8817
15344E5781o9580p0557J18027J33457J518j6495o8521l2097m4115k9351k2099
15333d4032K9841J39866K6665j16395j5869K7977L7359o4920O06P9310R245K248
15321A11901p0582P4647R0651p8951j17649o6715O3175j15099J5984m147N6561
15310d0224M6188O4460K555q5013o3426J00427l6664r3772M3638p4793M7805J17800
$$ plain form
15298 28981 51180 73829 133082 197427 179770 97730 60541 134734 162234 181742 284016
15287 284016 279906 282591 254509 117293 125468 178816 174291 102096 29991 30574 141126 156847
15275 156847 221534 374619 273086 133534 184199 111169 133823 113627 5115 -94769 -29139
15264 -29139 -679 46385 99471 131331 94855 -146989 -158027 -152865 -65966 10766 -6647 -113133
15252 -113133 -87604 -124315 -47318 95176 14818 -31456 -64140 23421 139237 167693 131980
15241 131980 96000 88367 59178 73584 108353 99582 176562 136239 145056 100442 73034 92712
15229 92712 96053 155944 184625 234514 256241 206376 103374 97767 51945 36010 53712 63151
15217 63151 145758 156555 169627 160812 182054 95907 110306 183199 236871 227761 214823 166226
$$ packed form
15298B8981K2199K2649N9253O4345j7657q2040l7189P4193K7500J9508J02274
15287B84016m110K685k8082j37216Q175N3348m525p2195p2105N83J10552J5721
15275A56847O4687J53085j01533j39552N0665p3030K2654k0196j08512r9884O5630
15264b9139K8460M7064N3086L1860l6476k41844j1038N162Q6899P6732j7413j06486
15252a13133K5529l6711P6997J42494q0358m6274l2684Q7561J15816K8456l5713
15241A31980l5980p633k9189J4406L4769q771P6980m0323Q817m4614k7408J9678
15229I2712L341N9891K8681M9889K1727m9865j03002n607m5822j5935J7702R439
15217F3151Q2607J0797J3072q815K1242q6147J4399P2893N3672r110j2938m8597
$$ plain form
15205 166226 141464 139835 199198 196531 61322 -85909 -33270 72703 91954 99019 129885
15194 129885 96264 117167 48932 90349 132363 278658 336552 239003 268541 353386 422793
15183 422793 286256 191218 99610 73712 88923 47348 77452 209849 331698 297501 211461
15172 211461 226509 140104 55105 193969 198720 93471 -8430 1999 142107 103509 114328
15161 114328 145369 76202 1005 -11178 41624 124722 101513 40216 92227 114624 81577
15150 81577 66098 141288 173550 178859 106762 69193 1789 -40124 -101004 -31049 80345 53312
15138 53312 121567 290265 286372 251625 280758 290896 204941 234620 310304 310001 295619 229947
15126 229947 227206 241981 227465 277994 272699 289034 303415 128060 84204 135892 199639 187171
$$ packed form
15205A66226k4762j629N9363k667j35209j47231N2639J05973J9251P065L0866
15194A29885l3621K0903o8235M1417M2014J46295N7894r7549K9538Q4845O9407
15183D22793j36537r5038r1608k5898J5211m1575L0104J32397J21849l4197q6040
15172B11461J5048q6405q4999J38864M751j05249j01901J0429J40108l8598J0819
15161A14328L1041o9167p5197j2183N2802Q3098k3209o1297N2011K2397l3047
15150H1577j5479P5190L2262N309p2097l7569o7404m1913o0880O9955J11394k7033
15138E3312O8255J68698l893l4747K9133J0138q5955K9679P5684l03j4382o5672
15126B29947k741J4775j4516N0529n295J6335J4381j75355m3856N1688O3747j2468
$$ plain form
15114 187171 231147 301331 292463 331321 210566 235229 276741 322548 316182 172236 168845 284020
15102 284020 269177 224796 359107 448408 485341 393927 316224 195889 150988 185989 212160
15091 212160 86445 182289 248329 355857 340261 330465 344456 385075 369350 449617 321130
15080 321130 274099 254933 271325 340624 312948 298145 371781 401505 294529 283151 386856
15069 386856 459078 452755 423472 325402 377700 537021 596177 541614 600386 527059 466687
15058 466687 431260 481817 523013 437395 376863 374625 415514 488325 582927 540325 482406 472792
15046 472792 390687 422848 460424 494385 480939 447602 452990 464591 616564 616622 604061 582504
15034 582504 468844 530627 643930 856014 847412 771781 719946 687726 749981 833060 795544
$$ packed form
15114A87171M3976P0184q868L8858j20755K4663M1512M5807o366j43946l391J15175
15102B84020j4843m4381J34311Q9301L6933r1414p7703j20335m4901L5001K6171
15091B12160j25715R5844O6040J07528j5596r796J3991M0619j5725Q0267j28487
15080C21130m7031j9166J6392O9299k7676j4803P3636K9724j06976j1378J03705
15069C86856P2222o323k9283r8070N2298J59321N9156n4563N8772p3327o0372
15058D66687l5427N0557M1196q5618o0532k238M0889P2811R4602m2602n7919r614
15046D72792q2105L2161L7576L3961j3446l3337N388J1601J51973N8j2561k1557
15034E82504j13660O1783J13303K12084q602p5631n1835l2220O2255Q3079l7516
$$ plain form
15023 795544 877750 1036136 1119420 1126751 1111898 1079081 1148740 1237814 1129890 1174707 1240562
15012 1240562 1321558 1289999 1302937 1331121 1349692 1241987 1274555 1331046 1224938 1090419 1066989
15001 1066989 1089179 1124399 1133635 1117889 988172 918404 950328 890630 813300 835490 801413
14990 801413 838398 749649 738589 857990 977284 978287 948832 1008456 1049662 956453 899480
14979 899480 869985 909571 962796 1029187 1112550 1190473 1190031 1222142 1295201 1331202 1283485 1177510
14967 1177510 1245269 1311194 1183463 1219200 1307574 1323078 1326275 1326707 1219037 1105313 1152286
14956 1152286 1136257 1178422 1109793 1035514 1053755 1034772 976147 856937 848699 864134 919009
14945 919009 823322 666221 633147 643897 578291 584429 665207 677759 691096 685440 689421 768286
$$ packed form
15023G95544Q2206J58386Q3284P331j4853l2817O9659Q9074j07924M4817O5855
15012A240562Q0996l1559J2938K8184J8571j07705L2568N6491j06108j34519k3430
15001A066989K2190L5220R236j5746j29717o9768L1924n9698p7330K2190l4077
14990H01413L6985q8749j1060J19401J19294J003k9455N9624M1206r3209n6973
14979H99480k9495L9586N3225O6391Q3363P7923m42L2111P3059L6001m7717j05975
14967A177510O7759O5925j27731L5737Q8374J5504L197M32j07670j13724M6973
14956A152286j6029M2165o8629p4279J8241j8983n8625j19210q238J5435N4875
14945I19009r5687j57101l3074J0750o5606O138Q0778J2552J3337n656L981P8865
$$ plain form
14933 768286 627825 519242 537169 640200 583962 452359 541597 554810 582246 569183 548397
14922 548397 494063 488041 490213 465102 495476 459991 473310 498219 381856 347529 397668 406860
14910 406860 395369 354430 318063 338689 339776 340029 410729 499363 557962 500299 433807 517157
14898 517157 521205 471843 428008 386857 348501 345155 444271 574007 595396 628278 660271 611737
14886 611737 522803 547512 518600 442181 574415 620671 526926 431083 407990 373104 357654
14875 357654 487812 544526 601153 506299 380203 361068 335102 334195 299368 371996 399601
14864 399601 456588 443481 375847 396752 338194 406315 405679 287833 344852 485977 571082
14853 571082 581295 591634 628070 668656 618773 526546 451154 508456 538281 463992 454090 409275
$$ packed form
14933G68286j40461j08583J7927J03031n6238j31603Q9238J3213K7436j3063k0786
14922E48397n4334o022K172k5111L0374l5485J3319K4909j16363l4327N0139R192
14910D06860j1491m0939l6367K0626J087K53P0700Q8634N8599n7663o6492Q3350
14898E17157M048m9362m3835m1151l8356l346R9116J29736K1389L2882L1993m8534
14886F11737q8934K4709k8912p6419J32234M6256r3745r5843k3093l4886j5450
14875C57654J30158N6714N6627r4854j26096j9135k5966r07l4827P2628K7605
14864C99601N6987j3107o7634K0905n8558O8121o36j17846N7019J41125Q5105
14853E71082J0213J0339L6436M0586m9883r2227p5392N7302K9825p4289r902m4815
$$ plain form
14841 409275 428286 516861 608585 659783 608931 629104 624944 648651 591742 490936 442736
14830 442736 503729 498404 289987 353478 455361 522486 535370 544516 506724 482536 503256
14819 503256 489707 567218 637848 554195 453528 459400 454004 466049 353521 408918 479291
14808 479291 454827 443348 485221 580696 556342 451135 560278 602202 649972 697045 632727
14797 632727 564602 505384 519045 558403 491336 460939 491398 470250 496264 523545 551082
14786 551082 536290 439799 396948 424657 508774 628582 598738 584280 553195 517620 523621
14775 523621 501503 433366 383724 350394 358777 392497 406840 390459 408286 494320 596143
14764 596143 630855 732557 783192 799160 778862 787281 669992 611859 683458 688771 735093
$$ packed form
14841D09275J9011Q8575R1724N1198n0852K0173m160K3707n6909j00806m8200
14830D42736O0993n325k08417O3491J01883O7125J2884R146l7792k4188K0720
14819E03256j3549P7511P0630q3653j00667N872n396J2045j12528N5397P0373
14808D79291k4464j1479M1873R5475k4354j05207J09143M1924M7770M7073o4318
14797F32727o8125n9218J3661L9358o7067l0397L0459k1148K6014K7281K7537
14786E51082j4792r6491m2851K7709Q4117J19808k9844j4458l1085l5575O001
14775E23621k2118o8137m9642l3330Q383L3720J4343j6381J7827Q6034J01823
14764E96143L4712J01702N0635J5968k0298Q419j17289n8133P1599N313M6322
$$ plain form
14753 735093 782152 600392 526026 636732 737543 716761 723880 660265 623048 513307 431996
14742 431996 447769 451663 527353 485948 437814 495498 644962 626302 542974 524767 520379 524081
14730 524081 601111 632984 674017 684397 669023 703037 775295 672058 685496 769999 811741
14719 811741 707656 692991 756671 849214 882729 900684 727832 789075 806870 752225 728798
14708 728798 697152 690741 730841 815202 838171 864376 857824 748998 764448 796326 791088 801291
14696 801291 863083 841725 779357 780047 854817 847831 827402 856233 908527 927099 909100 942297
14684 942297 893952 809944 793231 783763 794943 863215 851617 977192 970479 902852 828070 647077
14672 647077 640497 721288 820006 789120 810383 816195 824258 887181 845751 808398 806336 804833
$$ packed form
14753G35093M7059j81760p4366J10706J00811k0782P119o3615l7217j09741q1311
14742D31996J5773L894P5690m1405m8134N7684J49464j8660q3328j8207m388L702
14730E24081P7030L1873M1033J0380j5374L4014P2258j03237J3438Q4503M1742
14719H11741j04085j4665O3680R2543L3515J7955j72852O1243J7795n4645k3427
14708G28798l1646o411M0100Q4361K2969K6205o552j08826J5450L1878n238J0203
14696H01291O1792k1358o2368O90P4770o986k0429K8831N2294J8572j7999L3197
14684I42297m8345q4008j6713r468J1180O8272j1598J25575o713o7627p4782j80993
14672F47077o580Q0791R8718l0886K1263N812Q063O2923m1430l7353k062j503
$$ plain form
14660 804833 742627 797653 887456 974102 912943 939186 1054847 1124721 1142363 984034 892201
14649 892201 894952 927166 1010060 1042303 1075002 1098755 1042542 1025311 1088927 1112876 1174028 1091047
14637 1091047 1030677 991722 1081896 1089209 1090463 989118 1037314 1025802 1121225 1130917 1221152 1190348
14625 1190348 1185252 1385406 1390583 1270949 1345731 1279203 1175869 1161765 1188350 1159443 1225445
14614 1225445 1258383 1287735 1306882 1264935 1268804 1278433 1216368 1308950 1397860 1240703 1157260
14603 1157260 1152385 1150607 1248187 1204989 1052100 997122 1060007 1170688 1175494 1127678 1090309
14592 1090309 1038122 1022967 1085395 1124120 1258440 1290420 1326150 1320732 1341583 1288893 1261275
14581 1261275 1402768 1349548 1211799 1334106 1424987 1237568 1184491 1256012 1242042 1254714
$$ packed form
14660H04833o2206N5026Q9803Q6646o1159K6243J15661O9874J7642j58329r1833
14649H92201K751L2214Q2894L2243L2699K3753n6213j7231O3616K3949O1152q2981
14637A091047o0370l8955R0174P313J254j01345M8196j1512R5423R692R0235l0804
14625A190348n096K00154N177j19634P4782o6528j03334j4104K6585k8907O6002
14614A225445L2938K9352J9147m1947L869R629o2065R2582Q8910j57157q3443
14603A157260m875j778R7580m3198j52889n4978O2885J10681M806m7816l7369
14592A090309n2187j5155O2428L8725J34320L1980L5730n418K0851n2690k7618
14581A261275J41493n3220j37749J22307R0881j87419n3077P1521j3970J2672
$$ plain form
14571 1254714 1304869 1413823 1427735 1477393 1438663 1422504 1411969 1416345 1464010 1409574 1428083
14560 1428083 1393449 1418459 1471180 1506434 1553068 1545543 1530758 1520240 1483649 1435399 1468014
14549 1468014 1407875 1413605 1394007 1388101 1493532 1583495 1596522 1598978 1572782 1581544 1726420 1744483
14537 1744483 1641419 1589776 1553471 1547165 1616214 1682768 1651671 1558523 1554128 1594170 1654554
14526 1654554 1744802 1803003 1733527 1771585 1822208 1785613 1741981 1662301 1656721 1622954 1535054
14515 1535054 1565807 1615479 1606638 1625227 1667826 1650943 1711376 1855883 1929398 1836481 1843617
14504 1843617 1819873 1908685 1844617 1732736 1789747 1944376 2030317 1998106 2027893 1926527 1846644
14493 1846644 1826545 1824569 1894048 2003565 2055789 2134644 2098189 2026031 2113604 2129336 2071651
$$ packed form
14571A254714N0155J08954J3912M9658l8730j6159j0535M376M7665n4436J8509
14560A428083l4634K5010N2721L5254M6634p525j4785j0518l6591m8250L2615
14549A468014o0139N730j9598n906J05431Q9963J3027K456k6196Q762J44876J8063
14537A744483j03064n1643l6305o306O9049O6554l1097r3148m395M0042O0384
14526A654554R0248N8201o9476L8058N0623l6595m3632p9680n580l3767q7900
14515A535054L0753M9672q841J8589M2599j6883O0433J44507P3515r2917P136
14504A843617k3744Q8812o4068j11881N7011J54629Q5941l2211K9787j01366p9883
14493A846644k0099j976O9479J09517N2224P8855l6455p2158Q7573J5732n7685
$$ plain form
14482 2071651 2075180 2134994 2257750 2261144 2350140 2388450 2385696 2338895 2347415 2485519 2530957 2446888
14470 2446888 2404284 2374209 2319533 2324466 2386289 2366885 2412642 2402078 2425182 2395819 2470425
14459 2470425 2429037 2363274 2474242 2603463 2632969 2585945 2498912 2523849 2632732 2553817 2595840
14448 2595840 2602193 2617446 2590009 2577569 2568834 2633228 2725915 2908666 2891020 2850004 2932924
14437 2932924 2972274 2964216 2906892 2932173 3012072 3038489 2982491 2914056 2987661 3025617 3044484
14426 3044484 3152209 3267037 3278902 3251498 3193038 3160905 3199632 3194913 3215413 3249113 3276687
14415 3276687 3347262 3285025 3357257 3334464 3394579 3421517 3464156 3326511 3384652 3390937 3424768
14404 3424768 3504261 3555967 3554416 3611014 3718591 3747175 3706627 3805144 3857026 3896042 3907717
$$ packed form
14482B071651L529N9814J22756L394Q8996L8310k754m6801Q520J38104M5438q4069
14470B446888m2604l0075n4676M933O1823j9404M5757j0564K3104k9363P4606
14459B470425m1388o5763J10968J29221K9506m7024q7033K4937J08883p8915M2023
14448B595840O353J5253k7437j2440q735O4394R2687J82751j7646m1016Q2920
14437B932924L9350q058n7324K5281P9899K6417n5998o8435P3605L7956J8867
14426C044484J07725J14828J1865k7404n8460l2133L8727m719K0500L3700K7574
14415C276687P0575o2237P2232k2793O0115K6938M2639j37645N8141O285L3831
14404C424768P9493N1706j551N6598J07577K8584m0548R8517N1882L9016J1675
$$ plain form
14393 3907717 3798303 3729732 3792989 3863277 3962389 3998562 4017753 4072802 4180584 4259869 4319484
14382 4319484 4312738 4309058 4319040 4303984 4347144 4345243 4438338 4445333 4560766 4555496 4666856 4760905
14370 4760905 4655512 4542215 4602596 4789618 4923547 5066732 5111422 5006200 4919696 5056525
14360 5056525 5185488 5232538 5216502 5273713 5336216 5376328 5529690 5687098 5755690 5860114
14350 5860114 5813799 5781364 5782259 5683364 5751591 5948965 6048480 6125187 6161652 6225107 6271092
14339 6271092 6397028 6438493 6493809 6587663 6561173 6508567 6719726 6895544 7038271 7009084
14329 7009084 7016081 7101729 7104612 7147627 7264223 7395687 7481774 7490813 7482351 7519016 7677183
14318 7677183 7810071 7898136 7926012 8049990 8215018 8363315 8444331 8455825 8567346 8605894
$$ packed form
14393C907717j09414o8571O3257P0288R9112L6173J9191N5049J07782P9285N9615
14382D319484o746l680R982j5056M3160j901R3095O995J15433n270J11360R4049
14370D760905j05393j13297O0381J87022J33929J43185M4690j05222q6504J36829
14360E056525J28963M7050j6036N7211O2503M0112J53362J57408O8592J04424
14350E860114m6315l2435Q95r8895O8227J97374R9515P6707L6465O3455M5985
14339F271092J25936M1465N5316R3854k6490n2606K11159J75818J42727k9187
14329G009084O997Q5648K883M3015J16596J31464Q6087R039q462L6665J58167
14318G677183J32888Q8065K7876J23978J65028J48297Q1016J1494J11521L8548
$$ plain form
14308 8605894 8663911 8828109 8955588 9073798 9252688 9310297 9353077 9469056 9662205 9848955
14298 9848955 9919896 10051230 10152732 10239979 10428504 10477551 10531456 10685947 10889018 11055924
14288 11055924 11181720 11292453 11431489 11671684 11850589 11958960 12083279 12213602 12335915
14279 12335915 12430657 12503048 12743396 12928448 13062950 13317155 13481525 13682194 13919077 14264853
14269 14264853 14591114 14775133 14978689 15071438 15314824 15618147 15889089 16145679 16332769
14260 16332769 16569530 16747804 16927653 17220587 17531743 17785991 17997679 18297408 18658930
14251 18658930 18983737 19181760 19516732 19884969 20264153 20637658 21007822 21367483 21667056
14242 21667056 22043863 22469466 22810452 23068645 23484835 23949317 24386414 24855507 25208234
$$ packed form
14308H605894N8017J64198J27479J18210J78890N7609M2780J15979J93149J86750
14298I848955P0941J31334J01502Q7247J88525M9047N3905J54491K03071J66906
14288A1055924J25796J10733J39036K40195J78905J08371J24319J30323J22313
14279A2335915R4742P2391K40348J85052J34502K54205J64370K00669K36883L45776
14269A4264853L26261J84019K03556R2749K43386L03323K70942K56590J87090
14260A6332769K36761J78274J79849K92934L11156K54248K11688K99729L61522
14251A8658930L24807J98023L34972L68237L79184L73505L70164L59661K99573
14242B1667056L76807M25603L40986K58193M16190M64482M37097M69093L52727
$$ plain form
14233 25208234 25587702 26137560 26682293 27131522 27621129 28148025 28718612 29183918 29713561
14224 29713561 30269187 30787837 31356222 31954787 32580361 33216916 33825260 34540852 35174819
14215 35174819 35782980 36427562 37094496 37708978 38416621 39170523 39837772 40602846 41392821
14206 41392821 42052426 42762616 43510315 44355986 45273709 46116036 46848876 47717312 48626103
14197 48626103 49562125 50518553 51334274 52160052 53078726 53974865 54863211 55702298 56542889
14188 56542889 57413387 58268179 59079842 59973582 60799104 61584248 62307103 63059637 63803295
14179 63803295 64592219 65334433 66009798 66632101 67274508 67874701 68448959 68961223 69389771
14170 69389771 69778202 70215020 70591995 70890906 71204884 71284325 71413747 71593332 71697056
$$ packed form
14233B5208234L79468N49858N44733M49229M89607N26896N70587M65306N29643
14224B9713561N55626N18650N68385N98565O25574O36555O08344P15592O33967
14215C5174819O08161O44582O66934O14482P07643P53902O67249P65074P89975
14206D1392821O59605P10190P47699Q45671R17723Q42327P32840Q68436R08791
14197D8626103R36022R56428Q15721Q25778R18674Q96139Q88346Q39087Q40591
14188E6542889Q70498Q54792Q11663Q93740Q25522P85144P22855P52534P43658
14179F3803295P88924P42214O75365O22303O42407O00193N74258N12264M28548
14170F9389771L88431M36818L76975K98911L13978P9441J29422J79585J03724
$$ plain form
14161 71697056 71678666 71630784 71555619 71322136 71101840 70753845 70308823 69935302 69513171 69006621
14151 69006621 68598611 68061206 67492772 66900412 66217480 65554977 64925257 64152967 63321080
14142 63321080 62466290 61665307 60873179 60036231 59136848 58284989 57492167 56536188 55584259
14133 55584259 54635906 53643795 52767416 51881187 51034039 50228467 49385532 48549878 47727397
14124 47727397 46844872 45860498 45002313 44225469 43369997 42547158 41720344 41007578 40230553
14115 40230553 39462108 38641382 37853681 37137698 36451524 35745508 35001073 34391917 33922987
14106 33922987 33209133 32415378 31820471 31228610 30504098 29898015 29347490 28753720 28244447
14097 28244447 27749134 27285240 26784757 26217189 25738496 25250362 24841070 24282047 23763928
$$ packed form
14161G1697056j8390m7882p5165k33483k20296l47995m45022l73521m22131n06550
14151F9006621m08010n37405n68434n92360o82932o62503o29720p72290q31887
14142F3321080q54790q00983p92128q36948q99383q51859p92822r55979r51929
14133E5584259r48353r92111q76379q86229q47148q05572q42935q35654q22481
14124D7727397q82525r84374q58185p76844q55472q22839q26814p12766p77025
14115D0230553p68445q20726p87701p15983o86174p06016p44435o09156m68930
14106C3922987p13854p93755n94907n91861p24512o06083n50525n93770n09273
14097B8244447m95313m63894n00483n67568m78693m88134m09292n59023n18119
$$ plain form
14088 23763928 23383305 22979352 22555216 22061141 21619117 21332485 20895352 20469210 20142234
14079 20142234 19882773 19581845 19355353 18918333 18490139 18184084 17918224 17651941 17424579
14070 17424579 17107854 16723199 16409281 16146646 15948877 15864026 15640489 15223053 14938532
14061 14938532 14694115 14441426 14180005 13955061 13801085 13520507 13261638 13055462 12954303
14052 12954303 12750789 12456378 12270715 12073568 11822160 11688440 11501858 11334364 11205206
14043 11205206 10968722 10811629 10646349 10487392 10435290 10384466 10084824 9827612 9758841 9675861
14033 9675861 9591266 9473096 9363922 9352386 9213308 9009900 8857126 8655436 8453702 8248843
14023 8248843 8087333 8076408 8143450 8160310 8025034 7821175 7623572 7415403 7367628 7414557
$$ packed form
14088B3763928l80623m03953m24136m94075m42024k86632m37133m26142l26976
14079B0142234k59461l00928k26492m37020m28194l06055k65860k66283k27362
14070A7424579l16725l84655l13918k62635j97769q4851k23537m17436k84521
14061A4938532k44417k52689k61421k24944j53976k80578k58869k06176j01159
14052A2954303k03514k94411j85663j97147k51408j33720j86582j67494j29158
14043A1205206k36484j57093j65280j58957n2102n0824k99642k57212o8771q2980
14033I675861q4595j18170j09174j1536j39078k03408j52774k01690k01734k04859
14023H248843j61510j0925O7042J6860j35276k03859j97603k08169m7775M6929
$$ plain form
14013 7414557 7353701 7318682 7104082 6904046 6793846 6777050 6764274 6639207 6604990 6504979
14003 6504979 6415047 6323332 6299088 6301183 6220450 6198366 6085098 5929394 5867518 5803816 5693821
13992 5693821 5715564 5689329 5539752 5406464 5366277 5281575 5238801 5184714 5112312 5009447 4962091
13981 4962091 4950772 4934424 4893203 4918616 4855926 4788704 4726773 4511396 4424258 4430807 4384362
13970 4384362 4357315 4369169 4272090 4240882 4151882 4047658 4017100 3882913 3886346 4017227 4018085
13959 4018085 3995857 3983409 3912455 3842184 3620913 3549393 3543547 3680076 3663704 3639010 3487113
13948 3487113 3434110 3390235 3383341 3393203 3379596 3257556 3143571 3051317 3079239 3070251 2946236
13937 2946236 3007475 3169527 3145373 3117172 3049240 3027661 2975491 2937947 2959818 2931849 2835621
$$ packed form
14013G414557o0856l5019k14600k00036j10200j6796j2776j25067l4217j00011
14003F504979q9932r1715k4244K095q0733k2084j13268j55704o1876o3702j09995
13992E693821K1743k6235j49577j33288m0187q4702m2774n4087p2402j02865m7356
13981D962091j1319j6348m1221K5413o2690o7222o1931k15377q7138O549m6445
13970D384362k7047J1854r7079l1208q9000j04224l0558j34187L433J30881Q58
13959D018085k2228j2448p0954p0271k21271p1520n846J36529j6372k4694j51897
13948C487113n3003m3875o894R862j3607j22040j13985r2254K7922q988j24015
13937B946236O1239J62052k4154k8201o7932k1579n2170l7544K1871k7969r6228
$$ plain form
13926 2835621 2848118 2899054 2836138 2683267 2744901 2745948 2672971 2727075 2704166 2721881 2658719
13915 2658719 2675049 2739653 2732637 2652922 2641546 2686227 2657195 2655965 2599464 2606885 2592095 2536178
13903 2536178 2393788 2345983 2420618 2459561 2381843 2380007 2362948 2418159 2315877 2191883 2097669
13892 2097669 2188189 2224914 2228873 2111977 2037267 1983734 2028863 2078240 2108884 2067085 2063455
13881 2063455 1975685 1929265 1851779 1736863 1824569 1945858 1876601 1854550 1947346 1953909 1905870
13870 1905870 1824345 1752671 1630143 1598308 1515463 1621238 1654047 1748802 1697277 1647981 1600305
13859 1600305 1642429 1654636 1757755 1681868 1679549 1641373 1590840 1572816 1643569 1657451 1539000
13848 1539000 1545378 1604145 1574463 1505697 1468114 1515474 1502339 1459682 1455253 1504698 1503063 1390744
$$ packed form
13926B835621J2497N0936o2916j52871O1634J047p2977N4104k2909J7715o3162
13915B658719J6330O4604p016p9715j1376M4681k9032j230n6501P421j4790n5917
13903B536178j42390m7805P4635L8943p7718j836j7059N5211j02282j23994r4214
13892B097669R0520L6725L959j16896p4710n3533M5129M9377L0644m1799l630
13881B063455q7770m6420p7486j14916Q7706J21289o9257k2051R2796O563m8039
13870A905870q1525p1674j22528l1835q2845J05775L2809R4755n1525m9296m7676
13859A600305M2124J2207J03119p5887k319l8176n0533j8024P0753J3882j18451
13848A539000O378N8767k9682o8766l7583M7360j3135m2657m429M9445j635j12319
$$ plain form
13836 1390744 1363977 1290097 1325818 1379551 1333457 1386608 1428595 1433836 1301169 1230183 1295889
13825 1295889 1286827 1355477 1341194 1342150 1280162 1257466 1347911 1305601 1294421 1360086 1407215 1332561
13813 1332561 1317012 1275744 1313072 1250964 1098079 1221722 1266585 1248843 1230594 1151975 1125965
13802 1125965 1249020 1323616 1217341 1116533 1073250 1170749 1140219 1023894 997098 1084319
13792 1084319 1199723 1321355 1342343 1246537 1192454 1061887 938986 946027 1003294 1031589 1099113
13781 1099113 1083449 1016009 948809 971737 974486 903045 856221 925851 812823 670021 572590
13770 572590 655739 693066 751691 832872 820787 767069 745841 818939 892950 904762 866309
13759 866309 923613 908304 904285 823890 707395 653229 776805 794743 755722 727277 585376
$$ packed form
13836A390744k6767p3880L5721N3733m6094N3151M1987N241j32667p0986O5706
13825A295889r062O8650j4283R56o1988k2696R0445m2310j1180O5665M7129p4654
13813A332561j5549m1268L7328o2108j52885J23643M4863j7742j8249p8619k6010
13802A125965J23055P4596j06275j00808m3283R7499l0530j16325k6796Q7221
13792A084319J15404J21632K0988r5806n4083j30567j22901P041N7267K8295O7524
13781A099113j5664o7440o7200K2928K749p1441m6824O9630j13028j42802r7431
13770E72590Q3149L7327N8625Q1181j2085n3718k1228P3098P4011J1812l8453
13759H66309N7304j5309m019q0395j16495n4166J23576J7938l9021k8445j41901
$$ plain form
13748 585376 527376 579492 666971 611534 568716 673717 783084 795299 732655 750262 836608
13737 836608 849825 833554 871701 919732 948984 964351 891969 722048 617372 626587 644578
13726 644578 669583 578400 538587 563060 544742 589651 548809 543040 542437 576960 555223 511759
13714 511759 562246 612349 679774 641562 598452 625526 644707 655965 573554 535651 572869
13703 572869 588101 593952 595771 629180 648247 755298 819702 817653 751295 673727 644481 634980
13691 634980 626676 578857 487691 527247 614188 679932 617446 518061 375085 386119 427776
13680 427776 486551 456095 508721 543916 517502 587538 588077 619799 492297 330230 333925 431993
13668 431993 490281 532194 566027 625684 691445 657239 678812 760772 810962 885551 836401
$$ packed form
13748E85376n8000N2116Q7479n5437m2818J05001J09367J2215o2644J7607Q6346
13737H36608J3217j6271L8147M8031K9252J5367p2382j69921j04676R215J7991
13726F44578K5005r1183l9813K4473j8318M4909m0842n769o03L4523k1737m3464
13714E11759N0487N0103O7425l8212m3110K7074J9181J1258q2411l7903L7218
13703E72869J5232N851J819L3409J9067J07051O4404k049o6358p7568k9246r501
13691F34980q304m7819r1166L9556Q6941O5744o2486r9385j42976J1034M1657
13680D27776N8775l0456N2626L5195k6414P0036N39L1722j27502j62067L695R8068
13668D31993N8288M1913L3833N9657O5761l4206K1573Q1960N0190P4589m9150
$$ plain form
13657 836401 682871 612341 616476 633879 625254 552903 488639 446717 364463 479412 501758
13646 501758 451000 328819 289529 276629 246013 372352 417848 394286 289506 373202 448474
13635 448474 438523 351458 369035 311117 377958 434320 493598 506201 419409 522292 564618
13624 564618 535375 481596 373336 380717 473720 365061 268619 312362 322729 381502 382125 325382
13612 325382 309814 318696 352065 383660 410032 502121 498535 400459 392012 299464 175896 187500
13600 187500 182689 174947 247477 291897 278488 312675 295086 227415 238336 242307 266109 264152
13588 264152 181676 179798 160409 268002 332763 434899 422183 345176 329654 329027 416496 274609
13576 274609 252801 222857 148802 139144 321037 355478 341800 348291 373750 337135 353261 324241
$$ packed form
13657H36401j53530p0530M135J7403q625p2351o4264m1922q2254J14949K2346
13646E01758n0758j22181l9290j2900l0616J26339M5496k3562j04780Q3696P5272
13635D48474r951q7065J7577n7918O6841N6362N9278J2603q6792J02883M2326
13624E64618k9243n3779j08260P381R3003j08659r6442M3743J0367N8773O23n6743
13612C25382j5568Q882L3369L1595K6372R2089l586r8076q447r2548j23568J1604
13600A87500m811p742P2530M4420j3409L4187j7589o7671J0921L971K3802j957
13588B64152q2476j878j9389J07593O4761J02136j2716p7007j5522o27Q7469j41887
13576B74609k1808k9944p4055r658J81893L4441j3678O491K5459l6615J6126k9020
$$ plain form
13564 324241 341402 370207 279686 269995 258931 243569 153743 203094 278898 250531 240471 165526
13552 165526 127284 241123 228474 199116 204893 139789 152208 131202 165295 133986 105460
13541 105460 122526 156558 206761 140820 138198 77895 24615 150673 187112 208497 355476
13530 355476 309122 263272 305306 213314 102947 29218 133118 179770 95560 51356 199441
13519 199441 227871 258616 246817 234628 257068 105844 80638 31213 -15815 23943 129028
13508 129028 216425 167170 163033 120013 183240 211615 164193 148271 159012 187326 143388 222018
13496 222018 218418 255609 252142 158728 95476 172481 260122 202475 205294 175358 189249 164261
13484 164261 162935 166270 266672 408958 412845 332902 238224 160963 77277 126814 228490
$$ packed form
13564C24241J7161K8805r0521r691j1064j5362q9826M9351P5804k8367j0060p4945
13552A65526l8242J13839j2649k9358N777o5104J2419k1006L4093l1309k8526
13541A05460J7066L4032N0203o5941k622o0303n3280J26058L6439K1385J46979
13530C55476m6354m5850M2034r1992j10367p3729J03900M6652q4210m4204J48085
13519A99441K8430L0745j1799j2189K2440j51224k5206m9425m7028L9758J05085
13508A29028Q7397m9255m137m3020O3227K8375m7422j5922J0741K8314m3938P8630
13496B22018l600L7191l467r3414o3252P7005Q7641n7647K819k9936J3891k4988
13484A64261j326L335J00402J42286L887p9943r4678p7261q3686M9537J01676
$$ plain form
13473 228490 347998 268126 137857 163114 315893 397939 313171 245790 250841 332748 347267
13462 347267 244725 235311 208980 145158 161927 161742 208177 267407 148528 108960 236093
13451 236093 240662 219994 103244 91810 204370 198372 76075 56184 63188 53711 167241
13440 167241 217238 243933 166169 70144 50107 75913 163634 146488 96650 28004 28173 40516
13428 40516 2074 -50830 33311 33604 93441 185091 194315 207001 255495 237225 237550 224491 182633
13415 182633 205345 288052 170200 86261 171092 150683 185725 279362 202350 119441 216918
13404 216918 217737 112657 192200 161539 115078 123211 187132 179919 132409 143708 123135 92263
13392 92263 157730 135844 8349 -21119 -35256 139132 249399 215763 187203 246974 284195
$$ packed form
13473B28490J19508p9872j30269K5257J52779Q2046q4768o7381N051Q1907J4519
13462C47267j02542r414k6331o3822J6769j85M6435N9230j18879l9568J27133
13451B36093M569k0668j16750j1434J12560n998j22297j9891P004r477J13530
13440A67241M9997K6695p7764r6025k0037K5806Q7721j7146m9838o8646J69J2343
13428D0516l8442n2904Q4141K93N9837R1650R224J2686M8494j8270L25j3059m1858
13415A82633K2712Q2707j17852q3939Q4831k0409L5042R3637p7012q2909R7477
13404B16918Q19j05080P9543l0661m6461Q133O3921p213m7510J1299k0573l0872
13392I2263O5467k1886j27495k9468j4137J74388J10267l3636k8560N9771L7221
$$ plain form
13381 284195 172556 97153 111933 42554 7037 -41248 -66285 21058 10847 -8460 52457
13370 52457 63535 73952 124249 159083 85369 -40303 -36963 -18154 56832 39127 -11235 -36299
13358 -36299 15168 -2271 77563 121090 32602 -61962 -78549 -55897 -17282 50303 53054 138371
13346 138371 186883 269877 257883 200626 271847 288030 317173 255757 143103 26212 71780
13335 71780 123172 99802 123034 138661 198774 318285 222461 110855 72775 75545 81183 134132
13323 134132 55973 91797 112760 94405 77020 61147 63434 219523 224285 154621 119612 125757
13311 125757 156414 183505 280311 345074 256487 148404 83652 39721 -96520 -92893 26100
13300 26100 40811 -54523 -66666 38317 7453 34763 83663 85946 -19305 16244 77305
$$ packed form
13381B84195j11639p5403J4780o9379l5517m8285k5037Q7343j0211j9307O0917
13370E2457J1078J0417N0297L4834p3714j25672L340J8809P4986j7705n0362k5064
13358c6299N1467j7439P9834M3527q8488r4564j6587K2652L8615O7585K751Q5317
13346A38371M8512Q2994j1994n7257P1221J6183K9143o1416j12654j16891M5568
13335G1780N1392k3370K3232J5627O0113J19511r5824j11606l8080K770N638N2949
13323A34132p8159L5824K0963j8355j7385j5873K287J56089M762o9664l5009O145
13311A25757L0657K7091R6806O4763q8587j08083o4752m3931j36241L627J18993
13300B6100J4711r5334j2143J04983l0864K7310M8900K283j05251L5549O1061
$$ plain form
13289 77305 169784 134865 78261 36847 -5774 83060 131693 103217 56291 39701 48465 75674
13277 75674 33247 26617 119355 57334 54830 -40647 -134910 -39178 -33104 -118739 64186 171848
13265 171848 133285 8270 -13872 -692 -113409 -117568 -59744 66664 40365 63352 123790
13254 123790 164139 176328 212042 343740 351341 278231 256684 189279 136668 155454 197165
13243 197165 245737 172837 108349 140927 141858 136969 138565 126543 54284 7266 95100 217978
13231 217978 222301 148943 124886 87013 106257 185115 159126 151940 237110 295531 274190 108924
13219 108924 26103 48146 31091 49432 67335 140887 123099 35946 -78210 -113441 -35049
13208 -35049 -8031 14063 52956 54132 105367 683 -25082 24324 -48075 -72846 -3230 12892
$$ packed form
13289G7305R2479l4919n6604m1414m2621Q8834M8633k8476m6926j6590Q764K7209
13277G5674m2427o630R2738o2021k504r5477r4263R5732O074q5635J82925J07662
13265A71848l8563j25015k2142J3180j12717m159N7824J26408k6299K2987O0438
13254A23790M0349J2189L5714J31698P601p3110k1547o7405n2611J8786M1711
13243A97165M8572p2900o4488L2578R31m889J596j2022p2259m7018Q7834J22878
13231B17978M323p3358k4057l7873J9244P8858k5989p186Q5170N8421k1341j65266
13219A08924q2821K2043j7055J8341J7903P3552j7788q7153j14156l5231P8392
13208c5049K7018K2094L8893J176N1235j04684k5765M9406p2399k4771O9616J6122
$$ plain form
13196 12892 -73050 -60563 35840 69159 221454 184708 152767 156076 130876 117764 96763 89154
13184 89154 146306 194464 110893 135507 129108 215159 250439 215645 238369 188594 214139 347014
13172 347014 370507 234516 98697 219274 357740 302430 164315 119423 144527 155651
13162 155651 92045 92212 210327 270537 181729 106462 135750 241606 261698 254814 237827 200290
13150 200290 268161 304690 256081 237198 258596 210479 126488 211651 211721 202959 236252 223459
13138 223459 275559 218778 249558 195168 103744 18934 76863 24092 44328 84761 176010
13127 176010 152257 193883 324990 317210 161521 220537 255605 228060 178293 137946 128377
13116 128377 135628 255222 300209 241543 243513 274543 162441 155127 199851 88729 155468
$$ packed form
13196A2892q5942J2487R6403L3319J52295l6746l1941L309k5200j3112k1001p609
13184H9154N7152M8158q3571K4614o399Q6051L5280l4794K2724m9775K5545J32875
13172C47014K3493j35991j35819J20577J38466n5310j38115m4892K5104J1124
13162A55651o3606J67J18115O0210q8808p5267K9288J05856K0092o884j6987l7537
13150B00290O7871L6529m8609j8883K1398m8117q3991Q5163P0q762L3293j2793
13138B23459N2100n6781L0780n4390r1424q4810N7929n2771K0236M0433R1249
13127A76010k3753M1626J31107p780j55689N9016L5068k7545m9767m0347r569
13116A28377P251J19594M4987n8666J970L1030j12102p314M4724j11122O6739
$$ plain form
13105 155468 184882 137310 73749 121710 193933 261771 240733 137040 106965 125216 148778
13094 148778 92860 138240 149424 112375 105483 256006 283752 286185 225952 329508 337534 347140
13082 347140 320726 170730 23112 -123036 -53543 -89031 -84555 75007 17292 -19851 -52713
13071 -52713 13904 22032 18299 78269 80316 13315 56305 57631 6571 47330 61383 109195
13059 109195 129711 132604 162367 196365 233173 253350 213971 99985 45782 84782 155599
13048 155599 105071 211147 313839 299051 265752 288260 301670 221120 184648 150119 217582
13037 217582 217669 155887 61394 49216 33072 -13613 -66392 -97604 -11065 5467 27061 24860
13025 24860 89741 250813 290003 266458 250611 240413 155725 165414 114159 107436 185679 154527
$$ packed form
13105A55468K9414m7572o3561M7961P2223O7838k1038j03693l0075J8251K3562
13094A48778n5918M5380J1184l7049o892J50523K7746K433o0233J03556Q026R606
13082C47140k6414j49996j47618j46148O9493l5488M476J59562n7715l7143l2862
13071e2713O6617Q128l733N9970K047o7001M2990J326n1060M0759J4053M7812
13059A09195K0516K893K9763L3998L6808K0177l9379j13986n4203L9000P0817
13048A55599n0528J06076J02692j4788l3299K2508J3410q0550l6472l4529O7463
13037B17582Q7o1782r4493j2178j6144m6685n2779l1212Q6539J6532K1594k201
13025B4860O4881J61072L9190k3545j5847j0198q4688R689n1255o723P8243l1152
$$ plain form
13013 154527 79880 122970 40926 46079 201621 265199 228285 169555 114506 86859 17766
13002 17766 107592 186056 134513 136852 60987 81225 31507 -16734 -104080 -91400 -96928 -25308
12990 -25308 104191 180765 84719 76992 152840 73946 22571 -16055 -78058 -30245 -56246 -52529
12978 -52529 29393 120580 108317 70209 55298 6925 2702 65404 77431 106099 146828 212618
12966 212618 213192 101241 18003 67827 28282 59418 31144 -36266 88006 137770 137383 81384
12954 81384 -1417 -80291 -36385 -2036 -28622 -66701 -40019 79775 183941 144651 73233
12943 73233 86823 16078 -20467 9123 119062 218419 98893 67750 130664 197651 266350
12932 266350 200056 161575 143537 154614 236179 188271 100766 97928 90210 15695 -93559 -25137
$$ packed form
13013A54527p4647M3090q2044N153J55542O3578l6914n8730n5049k7647o9093
13002A7766Q9826P8464n1543K339p5865K0238m9718m8241q7346J2680n528P1620
12990b5308J29499P6574r6046p727P5848p8894n1375l8626o2003M7813k6001L717
12978e2529Q1922R1187j2263l8108j4911m8373m223O2702J2027K8668M0729O5790
12966B12618N74j11951q3238M9824l9545L1136k8274o7410J24272M9764l87n5999
12954H1384q2801p8874M3906L4349k6586l8079K6682J19794J04166l9290p1418
12943G3233J3590p0745l6545K9590J09939R9357j19526l1143O2914O6987O8699
12932B66350o6294l8481j8038J1077Q1565m7908q7505k838p718p4515j09254O8422
$$ plain form
12920 -25137 10647 27646 146790 223636 159254 106792 124854 80553 99592 150484 132399
12909 132399 116475 69293 72205 8306 49342 148527 125546 39772 25171 34599 -16414 -11556
12897 -11556 26253 57191 59231 53295 101478 168767 172528 118680 97891 254626 331701 334888
12885 334888 245684 215784 207031 228789 298022 207825 136128 152753 160591 128095 84858 80464
12873 80464 -7213 -121628 -31195 70187 42581 112831 137235 89280 95400 148423 189324
12862 189324 178903 159458 175692 203646 238246 212453 211773 232910 224506 223490 297125 261129
12850 261129 259724 282545 222867 113083 151819 135555 125217 87960 124998 142863 185187
12839 185187 232197 296987 266180 197230 190157 172540 191726 167512 100426 199094 240383 234900
$$ packed form
12920b5137L5784J6999J19144P6846o4382n2462J8062m4301J9039N0892j8085
12909A32399j5924m7182K912o3899M1036R9185k2981q5774j4601R428n1013M858
12897a1556L7809L0938K040n936M8183O7289L761n3848k0789J56735P7075L187
12885C34888q9204k9900q753K1758O9233r0197p1697J6625P838l2496m3237m394
12873H0464q7677j14415R0433J01382k7606P0250K4404m7955O120N3023M0901
12862A89324j0421j9445J6234K7954L4600k5793o80K1137q404j016P3635l5996
12850B61129j405K2821n9678j09784L8736j6264j0338l7257L7038J7865M2324
12839A85187M7010O4790l0807o8950p073j7617J9186k4214o7086R8668M1289n483
$$ plain form
12827 234900 227922 244650 188827 193977 252053 145495 184127 285200 381408 394744 327485
12816 327485 346523 240419 158515 174681 185311 260582 275047 232954 189860 252894 360244
12805 360244 405032 449770 336516 311505 369632 282214 230102 248095 296583 381577 388607
12794 388607 397358 398720 277839 252151 289737 340950 329454 302060 230642 164277 200920 269264
12782 269264 297033 385675 378152 311871 333304 370650 314965 255265 338899 307372 225436 296299
12770 296299 301558 306971 244065 189771 228805 345747 419940 326178 232132 111654 42654
12759 42654 89727 101810 103324 174031 173813 144507 143531 112476 142111 84907 59435 170429
12747 170429 275539 263406 355392 451628 439619 416345 408025 418001 290591 204859 309521
$$ packed form
12827B34900o978J6728n5823N150N8076j06558L8632J01073R6208J3336o7259
12816C27485J9038j06104q1904J6166J0630P5271J4465m2093m3094O3034J07350
12805C60244M4788M4738j13254k5011N8127q7418n2112J7993M8488Q4994P030
12794C88607Q751J362j20881k5688L7586N1213j1496k7394p1418o6365L6643O8344
12782B69264K7769Q8642p523o6281K1433L7346n5685n9700Q3634l1527q1936P0863
12770B96299N259N413o2906n4294L9034J16942P4193r3762r4046j20478o9000
12759D2654M7073J2083J514P0707k18k9306r76l1055K9635n7204k5472J10994
12747A70429J05110j2133R1986R6236j2009k3274q320R976j27410q5732J04662
$$ plain form
12736 309521 269215 156405 150023 285810 339152 318585 365170 353440 371609 437336 514380
12725 514380 469594 457291 424581 342215 276750 239414 256176 277630 303016 310264 298717 309013
12713 309013 342711 335679 370766 408512 487282 367295 317957 336745 363217 327524 259267
12702 259267 237669 323750 320894 269657 423359 544764 530839 499748 415062 346362 389491
12691 389491 270425 213118 262451 209198 264123 319221 357804 419692 380797 287015 241787
12680 241787 93263 77134 124544 213004 220066 148728 121669 76552 87401 153865 136541
12669 136541 147801 182568 252345 307816 252066 193077 162414 168660 204984 110942 213276
12658 213276 319723 273814 230811 244705 384804 381943 403573 430886 383650 377741 358396
$$ packed form
12736C09521m0306j12810o382J35787N3342k0567M6585j1730J8169O5727P7044
12725E14380m4786j2303l2710q2366o5465l7336J6762K1454K5386P248j1547J0296
12713C09013L3698p032L5087L7746P8770j19987m9338J8788K6472l5693o8257
12702B59267k1598Q6081k856n1237J53702J21405j3925l1091q4686o8700M3129
12691C89491j19066n7307M9333n3253N4925N5098L8583O1888l8895r3782m5228
12680B41787j48524j6129M7410Q8460P062p1338k7059m5117J0849O6464j7324
12669A36541J1260L4767O9777N5471n5750n8989l0663O246L6324r4042J02334
12658B13276J06447m5909m3003J3894J40099k861K1630K7313m7236n909j9345
$$ plain form
12647 358396 303432 242992 323704 318759 235771 154124 197991 270526 317807 303273 149824
12636 149824 192311 234055 284067 169516 162358 228607 359457 385741 312309 196507 245022
12625 245022 277232 259480 217842 222294 184288 143286 108285 140735 232814 327882 321431 326369
12613 326369 451178 452724 306151 277804 336502 380317 354820 355611 386285 426045 379065 412908
12601 412908 445416 423232 335483 298947 371104 371278 292928 215030 239249 245347 279203 321304
12589 321304 484784 503301 442123 438433 417271 463594 384876 321943 257559 284927 312202
12578 312202 432536 364676 269208 286309 260426 293327 230230 255087 263810 257937 388162
12567 388162 372630 335494 287146 343073 396933 412345 431410 431984 431521 367913 275640 288594
$$ packed form
12647C58396n4964o0440Q0712m945q2988q1647M3867P2535M7281j4534j53449
12636A49824M2487M1744N0012j14551p158O6249J30850K6284p3432j15802M8515
12625B45022L2210j7752m1638M452l8006m1002l5001L2450R2079R5068o451M938
12613C26369J24809J546j46573k8347N8698M3815k5497P91L0674L9760m6980L3843
12601D12908L2508k2184q7749l6536P2157J74p8350p7898K4219O098L3856M2101
12589C21304J63480J8517o1178l690k1162M6323p8718o2933o4384K7368K7275
12578C12202J20334o7860r5468J7101k5883L2901o3097K4857Q723n873J30225
12567C88162j5532l7136m8348N5927N3860J5412J9065N74m63o3608r2273J2954
$$ plain form
12555 288594 403369 445107 447885 444491 317260 208015 243720 238126 304042 375363 335818
12544 335818 335309 364671 305196 396463 484501 523713 474722 417362 353891 458404 575758
12533 575758 612637 494282 315267 235150 257721 354883 360185 433208 400489 376541 397998
12522 397998 434182 420165 455840 499924 585150 566985 437163 411084 391915 355629 469422
12511 469422 517883 467896 406790 419220 392417 452336 540152 521494 381054 245704 228820
12500 228820 270349 304473 325534 355002 387878 360508 367564 395878 342735 299688 316002 269777
12488 269777 266462 368948 424944 422005 382793 315617 419850 503702 479955 388770 327976
12477 327976 321998 373889 393895 331986 442278 414186 356225 430169 288291 205843 331434
$$ packed form
12555B88594J14775M1738K778l394j27231j09245L5705n594O5916P1321l9545
12544C35818n09K9362n9475R1267Q8038L9212m8991n7360o3471J04513J17354
12533E75758L6879j18355j79015q0117K2571R7162N302P3023l2719k3948K1457
12522C97998L6184j4017L5675M4084Q5226j8165j29822k6079j9169l6286J13793
12511D69422M8461m9987o1106J2430k6803N9919Q7816j8658j40440j35350j6884
12500B28820M1529L4124K1061K9468L2876k7370P056K8314n3143m3047J6314m6225
12488B69777l315J02486N5996k939l9212o7176J04233Q3852k3747r1185o0794
12477C27976n978N1891K0006o1909J10292k8092n7961P3944j41878q2448J25591
$$ plain form
12466 331434 405362 452700 532892 601610 598029 590758 508365 484465 585063 555737 537273 554576
12454 554576 483377 508007 631834 706432 789274 754585 718170 782701 762792 688151 726603
12443 726603 602371 473664 500373 469180 495900 582769 611865 542090 527356 489955 492979
12432 492979 632094 707054 681131 729637 727976 748441 802548 735874 669347 609984 670629
12421 670629 672821 769026 870661 914949 909964 921661 968854 1012744 1028528 992017 1111864
12410 1111864 1134409 1056670 1110091 1125708 1008787 922034 998508 1016830 1010170 1019440 960502
12399 960502 966390 1157927 1174566 1263037 1376089 1475528 1517311 1505257 1520360 1584790 1716420
12388 1716420 1683662 1452324 1299891 1251934 1301028 1369553 1588016 1798910 1993183 2246455
$$ packed form
12466C31434P3928M7338Q0192O8718l581p271q2393k3900J00598k9326j8464J7303
12454E54576p1199K4630J23827P4598Q2842l4689l6415O4531j9909p4641L8452
12443G26603j24232j28707K6709l1193K6720Q6869K9096o9775j4734l7401L024
12432D92979J39115P4960k5923M8506j661K0465N4107o6674o6527n9363O0645
12421F70629K192R6205J01635M4288m985J1697M7193M3890J5784l6511J19847
12410A111864K2545p7739N3421J5617j16921q6753P6474J8322o660R270n8938
12399I60502N888J91537J6639Q8471J13052R9439M1783j2054J5103O4430J31630
12388A716420l2758k31338j52433m7957M9094O8525K18463K10894J94273K53272
$$ plain form
12378 2246455 2417775 2340686 2127492 2049794 2247601 2629109 3154662 3933402 5048177 6746119
12368 6746119 7977894 6852508 5166829 4439874 4789675 5450450 5544249 4925214 4204843
12359 4204843 3763516 3447786 3238840 3197309 3563532 4180112 4909936 5055055 4525285 4192511
12349 4192511 4110126 4224171 4518619 4559985 4736835 5307884 6323622 6762813 6277700 5662105
12339 5662105 5202109 4950146 5115144 5635698 6116197 6466966 6988176 7428758 7861637
12330 7861637 8509005 9446595 11540626 14880844 17601938 15706552 11487634 8965714
12322 8965714 8020855 8080794 7966190 7359794 6451261 5563316 5321738 5165214 5098182 5566218
12312 5566218 6147212 6605030 6536583 5745315 4867408 4459046 4391777 4305576 3986802 3842208
$$ packed form
12378B246455J71320p7089k13194p7698J97807L81508N25553P78740J114775J697942
12368F746119J231775j125386j685679p26955L49801O60775R3799o19035p20371
12359D204843m41327l15730k08946m1531L66223O16580P29824J45119n29770l32774
12349D192511q2385J14045K94448M1366J76850N71049J015738M39191m85113o15595
12339E662105m59996k51963J64998N20554M80499L50769N21210M40582M32879
12330G861637O47368R37590K094031L340218K721094j895386m218918k521920
12322H965714r44859N9939j14604o06396r08533q87945k41578j56524o7032M68036
12312E566218N80994M57818o8447p91268q77907m08362o7269q6201l18774j44594
$$ plain form
12302 3842208 4057878 4634033 5086968 4774399 4087113 3438511 3089359 3122194 3374009 3788407
12292 3788407 4238614 4760762 5145658 5211552 4999230 4720610 5286789 6598265 8010309
12283 8010309 7167316 4911403 3608855 2714895 2199512 2004734 1911821 1985054 2146885
12274 2146885 2208979 2004588 1813624 1562682 1257832 1166449 1247259 1197117 1103912 1070931
12264 1070931 1108147 1248414 1354353 1328218 1312889 1249719 1274916 1396880 1393022 1312511 1219955
12253 1219955 1078498 1065546 1110390 1186629 1202814 1143741 1180131 1149173 1053805 1041964 955116
12242 955116 1007949 1052263 991241 936041 898951 851691 864081 878139 787743 735399 848788
12231 848788 902556 859885 838348 949330 1081046 1160985 1160460 1075705 976273 1022149 1097359
$$ packed form
12302C842208K15670N76155M52935l12569o87286o48602l49152L2835K51815M14398
12292C788407M50207N22148L84896O5894k12322k78620N66179J311476J412044
12283H010309q42993k255913j302548q93960n15383j94778r2913P3233J61831
12274B146885O2094k04391j90964k50942l04850r1383Q0810n0142r3205l2981
12264A070931L7216J40267J05939k6135j5329o3170K5197J21964l858q0511r2556
12253A219955j41457j2952M4844P6239J6185n9073L6390l0958r5368j1841q6848
12242I55116N2833M4314o1022n5200l7090m7260J2390J4058r0396n2344J13389
12231H48788N3768m2671k1537J10982J31716P9939n25q4755r9432M5876P5210
$$ plain form
12220 1097359 990158 1033825 1041259 968597 959486 969570 1005720 985694 989586 1043962 1055792 1048649
12208 1048649 1149054 1220063 1237020 1250965 1196425 1165781 1175686 1194494 1226671 1235863 1143489
12197 1143489 1109563 1272682 1218894 1089599 1052720 1060065 1084842 1070023 1026732 1067470 1226652
12186 1226652 1328686 1242955 1188950 1164629 1186160 1167359 1199431 1192526 1092708 1095767 1115341
12175 1115341 1153597 1098080 1074117 1092025 1152680 1206381 1265152 1281667 1120972 999629 957551
12164 957551 903286 1026241 1168349 1274211 1357101 1315570 1373222 1395419 1386204 1237557 1243978
12153 1243978 1219786 1121217 1216494 1277167 1237354 1302932 1363773 1394425 1447511 1543547 1406655
12142 1406655 1284150 1282159 1357493 1460307 1529355 1443022 1446224 1659039 1712570 1773923 1820112
$$ packed form
12220A097359j07201M3667P434p2662r111J0084L6150k0026L892N4376J1830p143
12208A048649J00405P1009J6957J3945n4540l0644R905J8808L2177R192r2374
12197A143489l3926J63119n3788j29295l6879P345K4777j4819m3291M0738J59182
12186A226652J02034q5731n4005k4321K1531j8801L2072o905r9818L059J9574
12175A115341L8256n5517k3963J7908O0655N3701N8771J6515j60695j21343m2078
12164I57551n4265J22955J42108J05862Q2890m1531N7652K2197r215j48647O421
12153A243978k4192r8569R5277O0673l9813O5578O0841L0652N3086R6036j36892
12142A406655j22505j991P5334J02814O9048q6333L202K12815N3531O1353M6189
$$ plain form
12131 1820112 1813024 1905883 1953323 1945102 1928163 1879917 1920334 1962998 2029763 2013591 1955891 1966577
12119 1966577 2046664 1980412 2008319 2165374 2155606 2229655 2234526 2226210 2323355 2419066 2523234
12108 2523234 2615704 2704097 2925474 3066626 3282393 3491409 3640209 3817925 3919247 3982624
12098 3982624 4188235 4288761 4411644 4442752 4400896 4352725 4316103 4165285 4016225 3915687
12088 3915687 3711619 3653099 3547740 3377318 3283294 3228269 3189563 3153528 3104821 3135290 3159198
$$ packed form
12131A820112p088R2859M7440q221j6939m8246M0417M2664O6765j6172n7700J0686
12119A966577Q0087o6252K7907J57055r768P4049M871q316R7145R5711J04168
12108B523234R2470Q8393K21377J41152K15767K09016J48800J77716J01322O3377
12098C982624K05611J00526J22883L1108m1856m8171l6622j50818j49060j00538
12088C915687k04068n8520j05359j70422r4024n5025l8706l6035m8707L0469K3908
$$ [...]
##END NTUPLES=NMR SPECTRUM
##END=
