##TITLE=Analysis number 326991
Compound Code ac 35913
Project Code adrs
Chemist Name frontier sci
##JCAMPDX= 6.0         $$ Bruker NMR JCAMP-DX V2.0
##DATA TYPE= NMR SPECTRUM
##DATA CLASS= NTUPLES
##ORIGIN= Bruker BioSpin GmbH
##OWNER= nmr
$$ XWIN-NMR		Version 3.5
$$ Wed Mar  7 09:30:02 2007 GMT Standard Time (UT+0h)  MAYBRIDGE\nmr@NMR_250MHZ
##.OBSERVE FREQUENCY= 250.131544655141
##.OBSERVE NUCLEUS= ^1H
##.ACQUISITION MODE= SIMULTANEOUS (DQD)
##.ACQUISITION SCHEME= undefined
##.AVERAGES= 16
##.DIGITISER RES= 18
##SPECTROMETER/DATA SYSTEM= dpx250
##.PULSE SEQUENCE= zg30
##.SOLVENT NAME= DMSO
##.SHIFT REFERENCE= (INTERNAL, DMSO, 0, 16.522)
##AUDIT TRAIL= $$ (NUMBER, WHEN, WHO, WHERE, WHAT)
$$ ##TITLE= Audit trail, XWIN-NMR		Version 3.5
$$ ##JCAMPDX= 5.01
$$ ##ORIGIN= Bruker BioSpin GmbH
$$ ##OWNER= nmr
$$ C:\u/data/dgb/nmr/ADRS/410/pdata/1/auditp.txt
$$ ##AUDIT TRAIL=  $$ (NUMBER, WHEN, WHO, WHERE, WHAT)
(   1,<2007-03-07 09:29:43.07 +000>,<MAYBRIDGE\nmr>,<NMR_250MHZ>,
      <created by zg, POWCHK disabled, PULCHK disabled
       configuration hash MD5:
       49 4B E0 1D 92 C2 6B 37 9F E6 65 BC 52 41 86 1D
       data hash MD5: 64K
       29 F5 9E 54 92 BE C0 B9 47 20 95 42 40 4A F5 FC>)
(   2,<2007-03-07 09:29:53.74 +000>,<MAYBRIDGE\nmr>,<NMR_250MHZ>,
      <Start of raw data processing
       ef LB = 0.3 FT_mod = 6 PKNL = 1 SI = 32K 
       data hash MD5: 32K
       50 17 61 A0 9E 4B A7 7D 16 E8 27 76 8C 52 A4 19>)
(   3,<2007-03-07 09:29:55.47 +000>,<MAYBRIDGE\nmr>,<NMR_250MHZ>,
      <apk 
       data hash MD5: 32K
       57 E9 2F EE 87 38 29 7B 11 97 1C D2 31 00 E6 86>)
(   4,<2007-03-07 09:29:56.16 +000>,<MAYBRIDGE\nmr>,<NMR_250MHZ>,
      <abs ABSG = 5 
       data hash MD5: 32K
       48 68 23 A4 F4 2C 15 1D 9D AB BA 55 B5 47 05 79>)
$$ ##END=
$$ 
$$ hash MD5
$$ 9B C7 55 91 6F 4F A5 F9 9E DB B8 07 9D 35 D1 58
##$RELAX= 
##$RELAX= 
##$RELAX= 
##$RELAX= 
##$RELAX= 
##$RELAX= 
##$RELAX= 
$$ Bruker specific parameters
$$ --------------------------
##$DU= <C:\u>
##$EXPNO= 410
##$NAME= <ADRS>
##$PROCNO= 1
##$TYPE= <nmr>
##$USER= <dgb>
##$AMP= (0..31)
100 100 100 100 100 100 100 100 100 100 100 100 100 100 100 100 100 100 
100 100 100 100 100 100 100 100 100 100 100 100 100 100 
##$AQSEQ= 0
##$AQ_mod= 3
##$AUNM= <au_zg>
##$AUTOPOS= <3 >
##$BF1= 250.13
##$BF2= 250.13
##$BF3= 250.13
##$BF4= 250.13
##$BF5= 500.13
##$BF6= 500.13
##$BF7= 500.13
##$BF8= 500.13
##$BYTORDA= 1
##$CFDGTYP= 0
##$CFRGTYP= 5
##$CHEMSTR= <none>
##$CNST= (0..31)
1 1 145 1 1 1 1 1 1 1 1 1 1 1 1 1 1 1 1 1 1 1 1 1 1 1 1 1 1 1 1 1 
##$CPDPRG= <>
##$CPDPRG1= <>
##$CPDPRG2= <>
##$CPDPRG3= <>
##$CPDPRG4= <mlev>
##$CPDPRG5= <mlev>
##$CPDPRG6= <mlev>
##$CPDPRG7= <mlev>
##$CPDPRG8= <mlev>
##$CPDPRGB= <>
##$CPDPRGT= <>
##$D= (0..31)
0 1 0 0 0 0 0 0 0 0.06 0 0 0 0 0 0 0.0002 0 0 0 0 0 0 0 0 0 0 0 0 0 0 
0 
##$DATE= 1173259781
##$DBL= (0..7)
120 120 120 120 120 120 120 120 
##$DBP= (0..7)
150 150 150 150 150 150 150 150 
##$DBP07= 0
##$DBPNAM0= <>
##$DBPNAM1= <>
##$DBPNAM2= <>
$$ [...]
##$SUBNAM7= <"">
##$SUBNAM8= <"">
##$SUBNAM9= <"">
##$SW= 20.6930455092707
##$SWIBOX= (0..15)
0 0 3 0 0 0 0 0 0 0 0 0 0 0 0 0 
##$SW_h= 5175.983436853
##$TD= 65536
##$TD0= 1
##$TE= 295.16
##$TE2= 300
##$TE3= 300
##$TEG= 300
##$TL= (0..7)
0 120 120 120 120 120 120 120 
##$TP= (0..7)
150 150 150 150 150 150 150 150 
##$TP07= 0
##$TPNAME0= <>
##$TPNAME1= <>
##$TPNAME2= <>
##$TPNAME3= <>
##$TPNAME4= <>
##$TPNAME5= <>
##$TPNAME6= <>
##$TPNAME7= <>
##$TPOAL= (0..7)
0.5 0.5 0.5 0.5 0.5 0.5 0.5 0.5 
##$TPOFFS= (0..7)
0 0 0 0 0 0 0 0 
##$TUNHIN= 0
##$TUNHOUT= 0
##$TUNXOUT= 0
##$USERA1= <user>
##$USERA2= <user>
##$USERA3= <user>
##$USERA4= <user>
##$USERA5= <user>
##$V9= 5
##$VALIST= <valist>
##$VCLIST= <CCCCCCCCCCCCCCC>
##$VD= 0
##$VDLIST= <DDDDDDDDDDDDDDD>
##$VPLIST= <PPPPPPPPPPPPPPP>
##$VTLIST= <TTTTTTTTTTTTTTT>
##$WBST= 1024
##$WBSW= 4
##$XGAIN= (0..3)
0 0 0 0 
##$XL= 0
##$YL= 0
##$YMAX_a= 329080
##$YMIN_a= -387525
##$ZGOPTNS= <>
##$ZL1= 120
##$ZL2= 120
##$ZL3= 120
##$ZL4= 120
##$ABSF1= 16.522
##$ABSF2= -4.171173
##$ABSG= 5
##$ABSL= 3
##$ALPHA= 0
##$AQORDER= 0
##$ASSFAC= 0
##$ASSFACI= 0
##$ASSFACX= 0
##$ASSWID= 0
##$AUNMP= <proc_1d>
##$AZFE= 0.1
##$AZFW= 0.1
##$BCFW= 0
##$BC_mod= 0
##$BYTORDP= 0
##$COROFFS= 0
##$CY= 12.5
##$DATMOD= 1
##$DC= 0
##$DFILT= <>
##$DTYPP= 0
##$F1P= 14.0000005364418
##$F2P= -0.99999901652339
##$FCOR= 0.5
##$FTSIZE= 32768
##$FT_mod= 6
##$GAMMA= 0
##$GB= 0
##$INTBC= 1
##$INTSCL= 1
##$ISEN= 128
##$LB= 0.3
##$LEV0= 0
##$LPBIN= 0
##$MAXI= 10000
##$MC2= 0
##$MEAN= 0
##$ME_mod= 0
##$MI= 0
##$NCOEF= 0
##$NC_proc= -5
##$NLEV= 6
##$NOISF1= 0
##$NOISF2= 0
##$NSP= 0
##$NTH_PI= 0
##$NZP= 0
##$OFFSET= 16.522
##$PC= 1
##$PHC0= 218.5873
##$PHC1= 5.440396
##$PH_mod= 1
##$PKNL= yes
##$PPARMOD= 0
##$PSCAL= 4
##$PSIGN= 0
##$REVERSE= no
##$SF= 250.13
##$SI= 32768
##$SIGF1= 0
##$SIGF2= 0
##$SINO= 400
##$SIOLD= 32768
##$SREGLST= <1H.DMSO>
##$SSB= 0
##$STSI= 32768
##$STSR= 0
##$SW_p= 5175.98343685301
##$SYMM= 0
##$S_DEV= 0
##$TDeff= 65536
##$TDoff= 0
##$TI= <Analysis number 999999
Compound Code 99
Book Reference 9
Project Code 9>
##$TILT= no
##$TM1= 0
##$TM2= 0
##$TOPLEV= 0
##$USERP1= <user>
##$USERP2= <user>
##$USERP3= <user>
##$USERP4= <user>
##$USERP5= <user>
##$WDW= 1
##$XDIM= 32768
##$YMAX_p= 321648516
##$YMIN_p= -541787
$$ End of Bruker specific parameters
$$ ---------------------------------
##NTUPLES= NMR SPECTRUM
##VAR_NAME=  FREQUENCY,     SPECTRUM/REAL,   SPECTRUM/IMAG
##SYMBOL=    X,             R,               I
##VAR_TYPE=  INDEPENDENT,   DEPENDENT,       DEPENDENT
##VAR_FORM=  AFFN,          ASDF,            ASDF
##VAR_DIM=   32768,         32768,           32768
##UNITS=     HZ,            ARBITRARY UNITS, ARBITRARY UNITS
##FACTOR=    0.157963299565203, 1,           1
##FIRST=     4132.6476996994, 0,             0
##LAST=      -1043.33573715361, 0,           0
##MIN=       -1043.33573715361, -541787,     0
##MAX=       4132.6476996994, 321648516,     0
$$ Real data points
##PAGE= N=1
##DATA TABLE= (X++(R..R)), XYDATA
$$ [...]
$$ plain form
15910 24966 -91265 -40082 41500 24435 -7161 -43090 -64819 -77707 -72570 62310 109474
15899 109474 68322 108855 135926 15803 -64787 57896 1340 -39389 -56980 -68892 -25575
15888 -25575 -86200 35740 101551 48188 35576 115250 245307 260653 113921 27749 23457
15877 23457 -27576 -84574 -101064 -97535 28248 98920 90987 174062 181228 127467 141925 108533
15865 108533 70904 161609 105509 36271 36307 30482 94549 -8406 -150596 -110830 -95346 -106511
15853 -106511 -110419 -74987 19508 157386 171306 80863 56450 78763 98694 108543 99178 20622
15841 20622 -46181 -107911 -156420 -150509 -58715 -53297 -107045 -206549 -219197 -226089 -68569 44932
15829 44932 100764 156051 176516 119598 -62377 -64470 95299 283097 219939 166303 116395
$$ packed form
15910B4966j16231N1183Q1582j7065l1596l5929k1729j2888N137J34880M7164
15899A09474m1152M0533K7071j20123q0590J22683n6556m0729j7591j1912M3317
15888b5575o0625J21940O5811n3363j2612P9674J30057J5346j46732q6172m292
15877B3457n1033n6998j6490L529J25783P0672p933Q3075P166n3761J4458l3392
15865A08533l7629R0705n6100o9238L6n825O4067j02955j42190L9766J5484j1165
15853a06511l908L5432R4495J37878J3920r0443k4413K2313J9931R849r365p8556
15841B0622o6803o1730m8509N911R1794N418n3748r9504j2648o892J57520J13501
15829D4932N5832N5287K0465n6918j81975k093J59769J87798o3158n3636m9908
$$ plain form
15818 116395 66804 44592 -40220 -26048 39631 76880 -27649 25722 4785 -23191 -80247
15807 -80247 -930 2358 -117409 -266740 -152172 -61619 6355 66842 114009 130552 140631
15796 140631 1240 -8136 124009 103122 -42503 -38555 -59544 -29354 70673 149669 207234
15785 207234 198694 141926 197713 178422 139346 67418 16114 -31044 -70496 -68250 -27038 -78835
15773 -78835 -117391 -159944 -210650 -254771 -354088 -322296 -273080 -214375 -101911 -24249 15466
15762 15466 100804 132429 45006 -21620 -75536 -136491 -126564 -104413 -85734 -9036 -27600 16348
15750 16348 43492 99736 97689 -890 -78188 6195 18980 88299 73963 -27787 23676 136966
15738 136966 101072 127238 101540 80679 23060 -70872 -165012 -156518 12319 20930 42996 30795
$$ packed form
15818A16395m9591k2212q4812J4172O5679L7249j04529N3371k0937k7976n7056
15807h0247P9317L288j19767j49331J14568R0553O7974O0487M7167J6543J0079
15796A40631j39391r376J32145k0887j45625L948k0989L0190J00027P8996N7565
15785B07234q540n6768N5787j9291l9076p1928n1304m7158l9452K246M1212n1797
15773g8835l8556m2553n0706m4121r9317L1792M9216N8705J12464P7662L9715
15762A5466Q5338L1625q7423o6626n3916o0955R927K2151J8679P6698j8564M3948
15750A6348K7144N6244k047r8579p7298Q4383J2785O9319j4336j01750N1463J13290
15738A36966l5894K6166k5698k0861n7619r3932r4140Q494J68837Q611K2066j2201
$$ plain form
15726 30795 -41587 -49650 -827 -10739 44060 96553 141068 84175 73753 107601 104956 -20248
15714 -20248 -35852 -68848 -14415 4990 34645 -88427 -113790 -158663 -255246 -194855 -193306 -190156
15702 -190156 -148787 -59363 -84028 -41076 1999 -70974 -66923 43538 18571 -31759 16597
15691 16597 30725 5038 -113470 -105142 -102049 11713 115163 29084 62104 121008 73069
15680 73069 43704 26699 61113 -69180 -54171 -1808 55014 111453 60934 50529 109415
15669 109415 42806 -3915 -9499 -5733 2067 21783 13790 4375 -18440 -150309 -142068 -122042
15657 -122042 14041 114877 32873 -10891 -1372 76842 130898 108522 147005 128329 36704
15646 36704 49262 191435 146135 61060 49066 60767 50226 57840 76003 17566 -28905 23476
$$ packed form
15726C0795p2382q063M8823r912N4799N2493M4515n6893j0422L3848k645j25204
15714b0248j5604l2996N4433J9405K9655j23072k5363m4873r6583O0391J549L150
15702a90156M1369Q9424k4665M2952M3075p2973M051J10461k4967n0330M8356
15691A6597J4128k5687j18508Q328L093J13762J03450q6079L3020N8904m7939
15680G3069k9365j7005L4414j30293J5009N2363N6822N6439n0519j0405N8886
15669A09415o6609m6721n584L766P800J9716p993r415k2815j31869Q241K0026
15657a22042J36083J00836q2004m3764R519P8214N4056k2376L8483j8676r1625
15646C6704J2558J42173m5300q5075j1994J1701j0541P614J8163n8437m6471N2381
$$ plain form
15634 23476 77629 -43623 -163683 -223155 -228396 -284226 -217596 -179264 -115114 -21993 -18287 -84818
15622 -84818 -116140 -193729 -104700 -11503 79952 46764 42304 84536 28118 65459 191474 92799
15610 92799 33433 124802 118205 95014 103948 -1318 -41214 -85365 -111638 -74029 -68113 -13441
15598 -13441 -26703 -18520 -31901 -18869 -98209 -140762 -120596 -90045 3729 11776 28622 92653
15586 92653 -15914 -88499 -72427 17938 79225 34821 2962 -21691 -110089 -221420 -84097
15575 -84097 47842 -14643 81842 100412 60635 53582 26185 9612 -64667 -35048 -15401 -50739
15563 -50739 -72392 -44061 105479 160543 107010 54373 28342 7875 19779 1021 -13964
15552 -13964 -54996 -120182 -134367 -135062 -62307 -102872 -231085 -245672 -192538 -125005 -19062 129087
$$ packed form
15634B3476N4153j21252j20060n9472n241n5830O6630L8332O4150R3121L706o6531
15622h4818l1322p7589Q9029R3197R1455l3188m460M2232n6418L7341J26015r8675
15610I2799n9366R1369o597k3191Q934j05266l9896m4151k6273L7609N916N4672
15598a3441j3262Q183j3381J3032p9340m2553K0166L0551R3774Q047J6846O4031
15586I2653j08567p2585J6072R0365O1287m4404l1859k4653q8398j11331J37323
15575h4097J31939o2485R6485J8570l9777p053k7397j6573p4279K9619J9647l5338
15563e0739k1653K8331J49540N5064n3533n2637k6031k0467J1904j8758j4985
15552a3964m1032o5186j4185o95P2755m0565j28213j4587N3134O7533J05943J48149
$$ plain form
15540 129087 89063 -10893 48775 96341 200517 147061 149074 75582 -16539 -26049 -27752 -81822
15528 -81822 -109004 84109 42122 7892 -5868 91498 117161 74923 -54464 -88304 -31293
15517 -31293 19794 125154 79866 -47267 -88646 -28633 -20164 -16597 16344 3859 20877 49794
15505 49794 64250 -145 71708 121734 92845 -28929 -34240 27292 -14600 -74246 -155919 -197804
15493 -197804 -21601 38319 -1795 -58063 -121779 -195178 -113814 56955 2025 -19001 -69667
15482 -69667 -177251 -190323 -91202 124226 167971 50894 11878 -66955 -39350 2703 -3317
15471 -3317 79915 134979 -544 -67249 -50274 102995 193969 185920 80084 -73231 -38184
15460 -38184 65192 -36339 -97686 28424 55060 15345 5565 -69789 -118183 -46279 51612
$$ packed form
15540A29087m0024r9956N9668M7566J04176n3456K013p3492r2121r510j703n4070
15528h1822k7182J93113m1987l4230j3760R7366K5663m2238j29387l3840N7011
15517c1293N1087J05360m5288j27133m1379O0013Q469L567L2941j2485J7018K8917
15505D9794J4456o4395P1853N0026k8889j21774n311O1532m1892n9646q1673m1885
15493a97804J76203N9920m0114n6268o3716p3399Q1364J70769n4930k1026n0666
15482f9667j07584j3072R9121K15428M3745j17077l9016p8833K7605M2053o020
15471c317Q3232N5064j35523o6705J6975J53269R0974q049j05836j53315L5047
15460c8184J03376j01531o1347J26110K6636l9715r780p5354m8394P1904R7891
$$ plain form
15449 51612 -28060 -4443 -32636 -110827 -83838 -114504 -128102 -99952 -87213 -75897 45228
15438 45228 60477 101313 206193 95555 -19363 -17920 -9773 27884 201266 253085 258857
15427 258857 98061 -14685 -25476 -44735 -55906 -125511 -197363 -75321 15234 -3304 -34233
15416 -34233 -61592 -154024 -151574 -179422 -250049 -301848 -118734 22930 71734 16808 217
15405 217 -62925 -126546 -61199 -4159 68423 108721 51652 26766 150947 106795 44167 -27314
15393 -27314 53574 55915 -11281 -119392 -158858 -9287 92832 120059 102727 115217 53275
15382 53275 63672 60149 45190 14007 47739 38431 -31956 -132828 -52850 -34537 -213805 -190247
15370 -190247 -259358 -263521 -229332 -128659 -19470 32906 20825 42838 -31005 -33685 4454
$$ packed form
15449E1612p9672K3617k8193p8191K6989l0666j3598K8150J2739J1316J21125
15438D5228J5249M0836J04880j10638j14918J443Q147L7657J73382N1819N772
15427B58857j60796j12746j0791j9259j1171o9605p1852J22042R0555j8538l0929
15416c4233k7359r2432K450k7848p0627n1799J83114J41664M8804n4926j6591
15405B17o3142o3621O5347N7040P2582M0298n7069k4886J24181m4152o2628p1481
15393b7314Q0888K341o7196j08111l9466J49571J02119K7227j7332J2490o1942
15382E3275J0397l523j4959l1183L3732r308p0387j00872P9978J8313j79268K3558
15370a90247o9111m163L4189J00673J09189N2376j2081K2013p3843k680L8139
$$ plain form
15359 4454 41994 -5532 -88425 -151914 -109744 -89988 -10319 -15296 -107909 -89605 -166003 -130430
15347 -130430 -135769 -306674 -263084 -63946 -30251 -142516 -106545 -46453 -17234 1753 31749
15336 31749 -6399 -15756 -68325 -62287 -171447 -347320 -320841 -264044 -164541 -60392 89039
15325 89039 127732 65123 109744 166225 115654 -41227 -122250 -28618 73934 127448 77403
15314 77403 -33528 -19715 85432 40424 -122709 -79589 -11813 56785 174704 149546 14547
15303 14547 -113390 -206146 -271281 -355056 -271985 -246385 -210631 -112287 -97054 -86063 -54663
15292 -54663 -20869 -27022 -85153 -8227 -65018 21906 83629 -14652 -87053 -11692 -71711 -83822
15280 -83822 -89566 -168775 -218620 -128221 -138128 -138531 -151807 -104804 -234504 -221416 -115167 10813
$$ packed form
15359D454L7540m7526q2893o3489M2170J9756P9669m977r2613J8304p6398L5573
15347a30430n339j70905M3590J99138L3695j12265L5971O0092K9219J8987K9996
15336C1749l8148r357n2569O038j09160j75873K6479N6797R9503J04149J49431
15325H9039L8693o2609M4621N6481n0571j56881q1023R3632J02552N3514n0045
15314G7403j10931J3813J05147m5008j63133M3120O7776O8598J17919k5158j34999
15303A4547j27937r2756o5135q3775Q3071K5600L5754R8344J5233J0991L1400
15292e4663L3794o153n8131P6926n6791Q6924O1723r8281p2401P5361o0019j2111
15280h3822n744p9209m9845R0399r907m03j3276M7003j29700J3088J06249J25980
$$ plain form
15268 10813 -5332 -56049 -116191 -144005 -109421 -66948 -6938 -14795 -11656 -88167 -51736 108084
15256 108084 109490 37403 -21202 25195 4695 -121652 -86494 26367 50234 -8629 -73242
15245 -73242 -138544 -83979 24690 -50743 -167581 -262068 -206905 -124636 -8776 73301 133679
15234 133679 40252 -11595 56363 -17164 -44441 -63691 -77811 -94128 -157260 -154549 -59311 -55614
15222 -55614 40585 66777 38345 117626 90005 67434 207085 80774 -9282 -77352 -100309
15211 -100309 10917 35121 -26368 -7350 -27968 30778 -39520 -52688 33719 144754 70038
15200 70038 24879 -48416 -81038 14133 -51923 -90696 -178873 -132815 -62995 -136765 -125670 -150089
15188 -150089 -94040 -89056 -84901 -44080 -111958 -246624 -285094 -255332 -258533 -334778 -377929 -347408
$$ packed form
15268A0813j6145n0717o0142k7814L4584M2473O0010p857L139p6511L6431J59820
15256A08084J406p2087n8605M6397k0500j26347L5158J12861K3867n8863o4613
15245g3242o5302N4565J08669p5433j16838r4487N5163Q2269J15860Q2077O0378
15234A33679r3427n1847O7958p3527k7277j9250j4120j6317o3132K711R5238L697
15222e5614R6199K6192k8432P9281k7621k2571J39651j26311r0056o8070k2957
15211a00309J11226K4204o1489J9018k0618N8746p0298j3168Q6407J11035p4716
15200G0038m5159p3295l2622R5171o6056l8773q8177M6058O9820p3770J1095k4419
15188a50089N6049M984M155M0821o7878j34666l8470K9762l201p6245m3151L0521
$$ plain form
15176 -347408 -239763 -232706 -225616 -166686 -88561 -37487 -10419 10641 -16572 -133321 -241331
15165 -241331 -365654 -308945 -198338 -86767 -119536 -116576 -141239 -130346 -119085 -194725 -126797
15154 -126797 -157675 -121466 17806 71809 -5990 -26230 27191 22935 37962 60947 55603 143879
15142 143879 183658 68268 21534 -21307 -92600 -74872 -59955 -5306 -30641 -73534 -30950
15131 -30950 -62590 -44435 -33339 -23956 -146821 -176939 -191661 -121105 -40019 -17335 -126451
15120 -126451 -88053 31932 55528 -89115 -116012 -30578 81405 -43227 -174476 -203089
15110 -203089 -103236 10158 -74538 -72420 -34290 -55882 -41833 57639 18459 -48319 -120798
15099 -120798 -87513 -80803 -73945 -84708 -68494 35329 98516 -62050 -153993 -102052 -22362
$$ packed form
15176c47408J07645P057P090N8930P8125N1074K7068K1060k7213j16749j08010
15165b41331j24323N6709J10607J11571l2769K960k4663J0893J1261p5640O7928
15154a26797l0878L6209J39272N4003p7799k0240N3421m256J5027K2985n344Q8276
15142A43879L9779j15390m6734m2841p1293J7728J4917N4649k5335m2893M2584
15131c0950l1640J8155J1096R383j22865l0118j4722P0556Q1086K2684j09116
15120a26451L8398J19985K3596j44643k6897Q5434J11983j24632j31249k8613
15110b03089R9853J13394q4696K118L8130k1592J4049R9472l9180o6778p2479
15099a20798L3285O710O858j0763J6214J03823O3187j60566r1943N1941P9690
$$ plain form
15088 -22362 25690 -37969 121856 147996 -11731 -52405 -146315 -64387 37285 63184 -23870
15077 -23870 -80803 -16663 40844 64812 6846 -77367 -161948 -228232 -135730 -129012 -86794 -84899
15065 -84899 -27997 88040 108402 26749 -114453 -212136 -203400 -76892 -64720 -49482 -26019
15054 -26019 29530 87872 106317 31234 18994 88310 48257 -20637 -43304 -86612 -35090 41615
15042 41615 11065 10938 -52695 -188204 -90624 -23924 -30610 -127623 -130901 -109099 -109671 -12841 108787
15029 108787 185277 84541 -34848 -153418 -212781 -114628 -4921 -82816 -33441 -12996 -59572
15018 -59572 -5840 87241 163665 181486 177587 -5511 -5591 41486 -89263 -160738 -171844 -90344
15006 -90344 -48494 37158 -42482 -88153 -151980 -179036 -116878 -131063 -118556 16326 -47684
$$ packed form
15088b2362M8052o3659J59825K6140j59727m0674r3910Q1928J01672K5899q7054
15077b3870n6933O4140N7507K3968n7966q4213q4581o6284R2502O718M2218J895
15065h4899N6902J16037K0362q1653j41202r7683Q736J26508J2172J5238K3463
15054b6019N5549N8342J8445p5083j2240O9316m0053o8894k2667m3308N1522P6705
15042D1615l0550j27o3633j35509R7580O6700o686r7013l278K1802n72R6830J21628
15029A08787P6490j00736j19389j18570n9363R8153J09707p7895M9375K0445m6576
15018e9572N3732R3081P6424J7821l899j83098q0M7077j30749p1475j1106Q1500
15006i0344M1850Q5652p9640m5671o3827k7056O2158j4185J2507J34882o4010
$$ plain form
14995 -47684 -79337 4019 24172 -46998 -37652 -2030 -28243 -132950 -160185 -87961 -104942 -87607
14983 -87607 24806 -81118 -150662 -128690 -118310 -172957 -137555 -74477 -100029 -96096 -173910
14972 -173910 -156480 -166380 -123342 -42911 -72880 -113936 42601 134929 108694 96500 55053
14961 55053 -26454 -179009 -136862 26895 83767 66171 1687 -20764 -28388 39371 -46006
14950 -46006 33027 5222 108546 52802 -8082 -49502 20046 130301 219649 127381 -8426
14939 -8426 38632 106843 153735 107789 50188 39105 -15771 -76829 -154340 -212561 -143670 -2917
14927 -2917 45363 -103425 -168364 -126638 63282 68378 -22413 10216 11034 66876 114190 120137
14915 120137 24966 112079 115820 54517 13657 39159 92924 158180 194843 34947 -24754
$$ packed form
14995d7684l1653Q3356K0153p1170R346L5622k6213j04707k7235P2224j6981J7335
14983h7607J12413j05924o9544K1972J0380n4647L5402O3078k5552L933p7814
14972a73910J7430r900M3038Q0431k9969m1056J56537R2328k6235j2194m1447
14961E5053q1507j52555M2147J63757N6872j7596o4484k2451p624O7759q5377
14950d6006P9033k7805J03324n5744o0884m1420O9548J10255Q9348r2268j35807
14939h426M7058O8211M6892m5946n7601j1083n4876o1058p7511n8221O8891J40753
14927b917M8280j48788o4939M1726J89920N096r0791L2629Q18N5842M7314N947
14915A20137r5171Q7113L741o1303m0860K5502N3765O5256L6663j59896n9701
$$ plain form
14904 -24754 38418 62459 123210 161912 206286 202945 146526 91492 135620 177953 106613 77108
14892 77108 36664 -1382 -59307 -100521 -77484 -128330 -111155 -117847 -128337 -189564 -237707 -171287
14880 -171287 20764 14995 -124896 -104737 -50538 -72090 -225131 -177220 -211693 -235516 -120893
14869 -120893 -135917 -284526 -275083 -78270 -31095 118894 23003 -61671 -108751 47314 121126
14858 121126 153604 167699 23935 -153470 -193110 -197564 -110678 -199705 -85598 6162 3136
14847 3136 -15741 -26526 -16434 -22600 -43703 -88532 -4767 77849 90841 30086 47033 2969
14835 2969 -7725 -54627 -93780 -842 46248 -10402 20096 76397 230366 197311 32975
14824 32975 -178208 -135166 -62788 21270 -14917 -69549 -166563 -118516 -62173 -85089 -53138
$$ packed form
14904b4754O3172K4041O0751L8702M4374l341n6419n5034M4128M2333p1340k9505
14892G7108m0444l8046n7925m1214K3037n0846J7175o692j0490o1227m8143O6420
14880a71287J92051n769j39891K0159N4199k1552j53041M7911l4473k3823J14623
14869a20893j5024j48609R443J96813M7175J49989r5891q4674m7080J56065P3812
14858A21126L2478J4095j43764j77405l9640m454Q6886q9027J14107R1760l026
14847C136j8877j0785J0092o166k1103m4829Q3765Q2616J2992o0755J6947m4064
14835B969j0694m6902l9153R2938M7090n6650L0498N6301J53969l3055j64336
14824C2975k11183M3042P2378Q4058l6187n4632r7014M8047N6343k2916L1951
$$ plain form
14813 -53138 -9523 -12929 15253 14862 -27944 -17977 8044 -48190 -131501 -186308 -278061 -155608
14801 -155608 -108238 -110525 28858 221403 292135 106171 110640 170042 60486 -67460 -49691
14790 -49691 73486 64573 126794 153595 109683 81978 21962 61095 35727 -5694 116764
14779 116764 105891 69997 13785 -78290 -50249 -34634 -134739 -191569 -132616 -51120 -11477
14768 -11477 -5728 19851 -105256 -112040 -52415 -85302 -24151 -30540 -151398 -93945 -175978 -185059
14756 -185059 -123472 -168137 -173474 -146370 -171479 -106726 36560 123804 130115 -732 -186135
14745 -186135 -250498 -154661 -67196 46385 67615 -16955 -28694 -110275 -190451 -99378 -128113
14734 -128113 -99782 -73472 -77484 -66872 -3785 118657 153131 154979 6858 -126691 -116091
$$ packed form
14813e3138M3615l406K8182l91m2806R967K6021n6234q3311n4807r1753J22453
14801a55608M7370k287J39383J92545P0732j85964M469N9402j09556j27946J7769
14790d9691J23177q913O2221K6801m3912k7705o0016L9133k5368m1421J22458
14779A16764j0873l5894n6212r2075K8041J5615j00105n6830N8953Q1496L9643
14768a1477N749K5579j25107o784N9625l2887O1151o389j20858N7453q2033r081
14756a85059O1587m4665n337K7104k5109O4753J43286Q7244O311j30847j85403
14745a86135o4363R5837Q7465J13581K1230q4570j1739q1581q0176R1073k8735
14734a28113K8331K6310m012J0612O3087J22442L4474J848j48121j33549J0600
$$ plain form
14723 -116091 -125487 -135942 -56222 111026 74442 -3570 79191 179141 79094 72129 59198
14712 59198 -34320 -170555 -231938 -132435 -78051 -20539 57600 59155 18905 -20535 -128589
14701 -128589 -59476 4091 -53416 -106771 -122775 -31429 -27231 -125787 -147331 -49589 -15722 -16549
14689 -16549 -11833 -22695 19230 -49889 -71210 -26372 -112036 -272274 -266214 -215678 -179325 -198525
14677 -198525 -242599 -195251 -116437 -16263 -29618 -111092 -101849 12229 -33123 -98028 -119059
14666 -119059 -23843 -43081 -95942 -150423 -99532 -193812 -323848 -237075 -112422 -143779 -168734
14655 -168734 -100107 -9961 68383 30499 -70991 -141916 -290679 -244050 -127024 -12339 3494
14644 3494 -97524 10649 61758 93654 96441 235548 190711 28579 -65134 -48255 -3591
$$ packed form
14723a16091r396j0455P9720J67248l6584p8012Q2761R9950j00047o965j2931
14712E9198r3518j36235o1383R9503N4384N7512P8139J555m0250l9440j08054
14701a28589O9113O3567n7507n3355j6004R1346M198r8556k1544R7742L3867q27
14689a6549M716j0862M1925o9119k1321M4838q5664j60238O060N0536L6353j9200
14677a98525m4074M7348P8814J00174j3355q1474R243J14078m5352o4905k1031
14666a19059R5216j9238n2861n4481N0891r4280j30036Q6773J24653l1357k4955
14655a68734O8627R0146P8344l7884j01490p0925j48763M6629J17026J14685J5833
14644C494j01018J08173N1109L1896K787J39107m4837j62132r3713J6879M4664
$$ plain form
14633 -3591 -64103 68390 187035 200399 167582 115128 20333 -9486 -65815 -79483 -139376
14622 -139376 -175780 -119556 -9048 4565 745 -22842 -150581 -141232 -128457 -146793 -190743
14611 -190743 -236174 -260382 -214098 -122961 -98219 -125779 72545 183361 127015 123810 98309
14600 98309 -19569 -15465 33917 176827 117821 15772 20890 21573 10923 -68678 -144097 -131893
14588 -131893 -96697 -41412 -11785 31054 -74657 -219603 -194573 -101440 30921 -11114 -85247
14577 -85247 -128739 -50641 42055 76598 63010 102321 121821 112503 68437 119173 102823 -60288
14565 -60288 -145751 -184807 -97790 -86564 -178655 -85352 -23437 49171 -26271 -9221 -55866 -70089
14553 -70089 -111559 -61267 -87170 -213092 -304321 -206585 -41811 -114256 -98543 -3314 -22014
$$ packed form
14633c591o0512J32493J18645J3364l2817n2454r4795k9819n6329j3668n9893
14622a39376l6404N6224J10508J3613l820k3587j27739R349J2775j8336m3950
14611a90743m5431k4208M6284R1137K4742k7560J98324J10816n6346l205k5501
14600I8309j17878M104M9382J42910n9006j02049N118O83j0650p9601p5419J2204
14588a31893L5196N5285K9627M2839j05711j44946K5030R3133J32361m2035p4133
14577h5247m3492P8098R2696L4543j3588L9311J9500r318m4066N0736j6350j63111
14565f0288q5463l9056Q7017J1226r2091R3303O1915P2608p5442J7050m6645j4223
14553g0089m1470N0292k5903j25922r1229R7736J64774p2445J5713R5229j8700
$$ plain form
14542 -22014 5280 186602 145913 149629 58136 30555 1282 -100033 -131709 -99266 -83697
14531 -83697 -35937 69909 39166 49729 51709 14137 -46596 -104931 -51279 -80010 -48457 41944
14519 41944 33864 82765 102053 8911 -15825 -4595 92716 156288 156786 3414 -26093 -127757
14507 -127757 -153842 -131704 -110785 -70339 -38747 -3307 -44145 -150318 -80171 -5172 25209
14496 25209 38433 11809 -81491 -172511 -183930 -84334 -40640 93703 264185 239889 86514
14485 86514 11023 -33015 -105947 -5568 99638 175445 84505 78762 63743 30347 48092
14474 48092 36208 -13808 -55745 -113112 -235237 -174543 -85075 -74516 -113917 -52089 -19423
14463 -19423 -109210 -115710 -117672 -220210 -229655 -103524 -45642 -143766 -71377 60167 43377 -86245
$$ packed form
14542b2014K7294J81322m0689L716r1493k7581k9273j01315l1676L2443J5569
14531h3697M7760J05846l0743J0563J980l7572o0733n8335N3652k8731L1553R0401
14519D1944q080M8901J9288r3142k4736J1230R7311O3572M98j53372k9507j01664
14507a27757k6085K2138K0919M0446L1592L5440m0838j06173P0147P4999L0381
14496B5209J3224k6624r3300r1020j1419R9596M3694J34343J70482k4296j53375
14485H6514p5491m4038p2932J00379J05206P5807r0940n743j5019l3396J7745
14474D8092j1884n0016m1937n7367j22125O0694Q9468J0559l9401O1828L2666
14463a9423q9787o500j962j02538r445J26131N7882r8124P2389J31544j6790j29622
$$ plain form
14451 -86245 -133048 -143989 -82470 -191432 -210636 -248505 -288039 -293476 -241879 -160873 -12822
14440 -12822 5492 -6998 -25197 -75076 -75135 14004 152507 236177 272969 148757 26262 15358
14428 15358 40671 -34402 -81441 -52243 55515 91878 10989 -24078 16058 -6575 -50401
14417 -50401 -53339 -83530 -175290 -88893 -50407 -100006 -100265 -129077 -28217 55046 116028 20129
14405 20129 -39297 -119902 -157251 -97450 92484 121540 30611 -1567 -25007 29032 107958
14394 107958 126161 -26294 -242716 -112378 3391 21333 191964 204770 103332 184592
14384 184592 273278 163596 104901 3446 65448 202298 147104 145302 253290 344797 216357
14373 216357 129211 100072 54182 -104967 -141363 -180992 -298906 -267337 -150298 -101462 -21494
$$ packed form
14451h6245m6803j0941O1519j08962j9204l7869l9534n437N1597Q1006J48051
14440a2822J8314j2490j8199m9879n9Q9139J38503Q3670L6792j24212j22495j0904
14428A5358K5313p5073m7039K9198J07758L6363q0889l5067M0136k2633m3826
14417e0401k938l0191r1760Q6397L8486m9599k59k8812J00860Q3263O0982r5899
14405B0129n9426q0605l7349N9801J89934K9056r0929l2178k3440N4039P8926
14394A07958J8203j52455k16422J30338J15769J7942J70631J2806j01438Q1260
14384A84592Q8686j09682n8695j01455O2002J36850n5194j802J07988R1507j28440
14373B16357q7146k9139m5890j59149l6396l9629j17914L1569J17039M8836P9968
$$ plain form
14362 -21494 16614 78181 104153 31200 45379 5666 12645 45444 11098 38828 72288 172195
14350 172195 102400 -95967 -70348 -10645 31789 -104118 -40750 18510 35814 41003 30988
14339 30988 54109 47505 90283 50464 -78121 -103737 -61324 -101606 -146697 -91865 -22514 -81482
14327 -81482 -93009 -29292 -21502 -29690 -62737 52102 104310 89573 7846 -91987 -39192 75807
14315 75807 47886 46376 38207 -1039 105339 126174 78358 -95930 -219893 -274543 -251005
14304 -251005 -190863 -181808 -132275 -98825 2402 29675 14893 23960 140455 178530 255374
14293 255374 168290 68429 -36501 -101040 -86045 -48639 -89575 -135029 -84780 -78337 -84194 -124125
14281 -124125 -103666 -41646 -51034 -23262 -34205 -120463 -198290 -173329 -109475 -117021 -169278 -133068
$$ packed form
14362b1494L8108O1567K5972p2953J4179l9713O979L2799l4346K7730L3460R9907
14350A72195o9795j98367K5619N9703M2434j35907O3368N9260J7304N189j0015
14339C0988K3121o604M2778l9819j28585k5616M2413m0282m5091N4832O9351n8968
14327h1482j1527O3717P790q188l3047J14839N2208j4737q1727r9833N2795J14999
14315G5807k7921j510q169l9246J06378K0835m7816j74288j23963n4650K3538
14304b51005O0142R055M9533L3450J01227K7273j4782R067J16495L8075P6844
14293B55374q7084r9861j04930o4539J4995L7406m0936m5454N0249O443n857l9931
14281a24125K0459O2020r388K7772j0943q6258p7827K4961O3854p546n2257L6210
$$ plain form
14269 -133068 -61817 -61105 -31012 24090 5232 14523 9352 58819 -958 12812 110976 60571
14257 60571 -24576 -131652 -77894 -8020 22550 -62687 -78002 -19266 -42234 3263 105832
14246 105832 154786 208075 200656 216843 206034 126374 5307 -55898 -71823 -7778 42660
14235 42660 11356 -52670 -69757 -28058 -138190 -200318 -198213 -145133 -128672 -87116 -43606 -16298
14223 -16298 53487 48217 36095 -55570 124963 213203 167213 130085 44178 -38937 -109980 -239778
14211 -239778 -231914 -189124 -251481 -95433 -38836 1225 55217 16185 -30723 -9561 26517
14200 26517 68923 61059 -46709 -91075 -72678 -50715 -34783 14610 -78194 -85891 -78254 -117102
14188 -117102 -119088 -55179 177318 256590 220448 63368 -83965 36794 117193 44586 -2079
$$ packed form
14269a33068P1251P12L0093N5102j8858R291n171M9467n9777J3770R8164n0405
14257F0571q5147j07076N3758O9874L0570q5237j5315N8736k2968M5497J02569
14246A05832M8954N3289p419J6187j0809p9660j21067o1205j5925O4045N0438
14235D2660l1304o4026j7087M1699j10132o2128K105N3080J6461M1556M3510K7308
14223a6298O9785n270j2122r1665J80533Q8240m5990l7128q5907q3115p1043j29798
14211b39778P864M2790o2357J56048N6597M0061N3992l9032m6908K1162L6078
14200B6517M2406p864j07768m4366J8397K1963J5932M9393r2804p697P637l8848
14188a17102j986O3909K32497P9272l6142j57080j47333J20759Q0399p2607m6665
$$ plain form
14177 -2079 9611 -22854 -61201 -94611 -75567 -151765 -128501 -46210 62235 192444 124278
14166 124278 47625 23142 47846 138654 82040 50858 97760 39705 76909 6031 -49785
14155 -49785 -46781 -89646 -89301 -62645 -136950 -110803 -134358 -221850 -175299 -201617 -63422 -5340
14143 -5340 -14999 73037 154811 127732 65193 -51005 -32834 -12239 5161 57624 39417 38756
14131 38756 2409 40634 78535 87223 76982 -38667 -147656 -156862 -77657 61893 92711
14120 92711 -76838 -137794 -255836 -315016 -465449 -447855 -411128 -423657 -366153 -214997 -85575
14109 -85575 -74419 52666 68965 132660 17202 -65172 -23280 -4154 -8546 57259 50165 105673
14097 105673 98791 28578 -395 -23269 68753 13283 -116988 -189095 -168284 -83711 -100565
$$ packed form
14177b079J1690l2465l8347l3410J9044p6198K3264Q2291J08445J30209o8166
14166A24278p6653k4483K4704R0808n6614l1182M6902n8055L7204p0878n5816
14155d9785L004m2865L45K6656p4305K6147k3555q7492M6551k6318J38195N8082
14143e340r659Q8036Q1774k7079o2539j16198J8171K0595J7400N2463j8207o61
14131C8756l6347L8225L7901Q688j0241j15649j08989r206P9205J39550L0818
14120I2711j69549o0956j18042n9180j50433J7594L6727j2529N7504J51156J29422
14109h5575J1156J27085J6299O3695j15458q2374M1892J9126m392O5805p094N5508
14097A05673o882p0213k8973k2874R2022n5470j30271p2107K0811Q4573j6854
$$ plain form
14086 -100565 -9998 15068 -140800 -48935 -21025 81383 161209 234233 108623 17224 68286
14075 68286 -11591 -27529 33324 -66121 -209841 -69489 119974 189156 135739 30475 31557
14064 31557 -39212 -171220 -177452 -121355 -88874 -81925 -50373 -474 73510 124973 46820 -10046
14052 -10046 -64368 -67260 -92698 -42184 -34981 -61712 40412 130501 23365 69913 154306 61485
14040 61485 -100695 -223214 -295434 -188358 -206924 -157333 -66788 -54345 -138799 -101018 -21338
14029 -21338 61095 153498 200889 256779 227280 180114 223211 297578 243210 190581 32472
14018 32472 22641 151540 169729 71347 -6262 -102790 -141332 -139825 -81182 -109585 -154674 -60998
14006 -60998 93424 83739 88782 84018 33177 -39042 -24307 28516 -21972 -9268 -72411 -214970
$$ packed form
14086a00565R0567K5066j55868R1865K7910J02408P9826P3024j25610r1399N1062
14075F8286p9877j5938O0853r9445j43720J40352J89463O9182n3417j05264J082
14064C1557p0769j32008o232N6097L2481O949L1552M9899P3984N1463p8153n6866
14052a0046n4322k892k5438N0514P203k6731J02124R0089j07136M6548Q4393r2821
14040F1485j62180j22519p2220J07076j8566M9591R0545J2443q4454L7781P9680
14029b1338Q2433R2403M7391N5890k9499m7166M3097P4367n4368n2629j58109
14018C2472r831J28899J8189r8382p7609r6528l8542J507N8643k8403m5089R3676
14006f0998J54422r685N043m764n0841p2219J4735N2823n0488J2704o3143j42559
$$ plain form
13994 -214970 -327921 -233796 -168451 -110125 -99046 5054 78575 249043 268032 134003 50182
13983 50182 -71647 -82902 22518 101181 84386 65358 56049 9564 -8225 80399 99831
13972 99831 -5512 -18356 -33373 -78832 -217910 -276331 -277360 -255778 -136959 -34932 75869
13961 75869 113931 169768 121782 82875 16207 1034 81757 195601 -65252 -73032 57680
13950 57680 140361 179561 132546 108299 83710 51003 37132 -5814 64724 58650 -51506 -155834
13938 -155834 -72440 46679 163867 147836 37335 111183 127486 111862 47303 -9201 24634
13927 24634 113979 134490 89414 131314 140180 26721 37386 -494 -24882 -69723 -88974 -64238
13915 -64238 -16367 -44999 -150963 -3031 123402 122540 200439 175789 122980 202974 200980 117506
$$ packed form
13994b14970j12951R4125O5345N8326J1079J04100P3521J70468J8989j34029q3821
13983E0182j21829j1255J05420P8663j6795j9028r309m6485j7789Q8624J9432
13972I9831j05343j2844j5017m5459j39078n8421j029K1582J18819J02027J10801
13961G5869L8062N5837m7986l8907o6668j5173Q0723J13844k60853p780J30712
13950E7680Q2681L9200m7015k4247k4589l2707j3871m2946P0538o074j10156j04328
13938a55834Q3394J19119J17188j6031j10501P3848J6303j5624o4559n6504L3835
13927B4634Q9345K0511m5076M1900Q866j13459J0665l7880k4388m4841j9251K4736
13915f4238M7871k8632j05964J47932J26433q62P7899k4650n2809P9994j994q3474
$$ plain form
13903 117506 -2703 -1067 58131 5887 38697 47352 106304 43963 6306 22132 25839 93839
13891 93839 135880 30101 25113 -45255 -70769 -62152 39698 -7097 -15285 41042 123559 173763
13879 173763 136937 18981 -18038 25303 17184 38087 52132 51535 80351 24062 -56265 -72414
13867 -72414 -46890 -57736 36630 85629 -32297 -42206 -105476 -75643 -40293 37685 -91102
13856 -91102 -198176 -137602 -242649 -114942 -10164 -66833 -197630 -179954 -101019 -97853 -51023
13845 -51023 -6570 -49192 -24761 81722 90415 138331 168389 208516 111903 -15251 -84824
13834 -84824 -20150 91992 158767 107463 68772 127482 220701 276395 246836 99446 67571
13823 67571 111649 118324 107926 67031 -70451 -70040 -73984 -61224 -23578 -89767 -172056 -173140
$$ packed form
13903A17506j20209J636N9198n2244L2810Q655N8952o2341l7657J5826L707O8000
13891I3839M2041j05779m988p0368k5514Q617J01850m6795q188N6327Q2517N0204
13879A73763l6826j17956l7019M3341q119K0903J4045n97K8816n6289q0327j6149
13867g2414K5524j0846R4366M8999j17926r909o3270K9833L5350P7978j28787
13856i1102j07074O0574j05047J27707J04778n6669j30797J7676P8935L166M6830
13845e1023M4453m2622K4431J06483Q693M7916L0058M0127r6613j27154o9573
13834h4824O4674J12142O6775n1304l8691N8710R3219N5694k9559j47390l1875
13823F7571M4078O675j0398m0895j37482M11l944J2760L7646o6189q2289j084
$$ plain form
13811 -173140 -96989 6653 13552 -3067 -22186 42409 114208 97661 95135 189919 230257 202814
13799 202814 183905 151514 1728 -53701 35585 66234 37802 -41145 -54208 -160313 -88377
13788 -88377 -47906 -40404 -101684 -77813 59966 210945 110009 17694 88269 167219 168792
13777 168792 96331 5974 1285 -10348 8301 -14832 76217 53192 30362 18931 -98489
13766 -98489 -87011 -1989 70638 50644 -43173 -61194 -16283 62441 43789 -1488 -9826 38549
13754 38549 59267 -11663 86535 80969 -72564 -44450 84272 217661 185233 14538 7644
13743 7644 -54214 -67461 -18389 30265 175613 178938 195192 222156 181798 153001 127864 100530
13731 100530 129317 103557 -31159 -96823 -57747 -78673 -43729 33677 100175 185778 129934
$$ packed form
13811a73140P6151J03642O899j6619j9119O4595P1799j6547k526R4784M0338k7443
13799B02814j8909l2391j49786n5429Q9286L0649k8432p8947j3063j06105P1936
13788h8377M0471P502o1280K3871J37779J50979j00936r2315P0575P8950J573
13777A68792p2461r0357m689j1633J8649k3133R1049k3025k2830j1431j17420
13766i8489J1478Q5022P2627j9994r3817j8021M4911P8724j8652m5277q338M8375
13754C8549K0718p0930R8198n566j53533K8114J28722J33389l2428j70695o894
13743G644o1858j3247M9072M8654J45348L325J6254K6964m0358k8797k5137k7334
13731A00530K8787k5760j34716o5664L9076k0926L4944P7406O6498Q5603n5844
$$ plain form
13720 129934 130697 283183 277360 137166 64621 -16949 16377 149216 67474 46567 -43083
13709 -43083 8400 69178 89204 29318 -62943 -2377 53861 14493 -8599 -123929 -120687 -154148
13697 -154148 -110052 8002 13165 -177113 -238812 -319067 -219254 -171660 -154401 -113158 -106901
13686 -106901 -137558 -140854 -95150 -30786 -17489 71151 117495 135496 42170 -46518 -47254 28135
13674 28135 95523 74982 23618 -6633 32632 -69091 -70579 22281 18153 -78648 -17459 22344
13662 22344 -58634 -66706 -30269 -71504 -16607 112984 204122 295432 166504 37716 89497
13651 89497 101283 90286 94148 16974 42585 117904 120635 104847 63254 78672 125663 59560
13639 59560 -103873 -154388 -113348 -33040 123208 131634 67962 -27056 -98635 -97625 -87767 -142369
$$ packed form
13720A29934P63J52486n823j40194p2545q1570L3326J32839q1742k0907q9650
13709d3083N1483O0778K0026n9886r2261O0566N6238l9368k3092j15330L242l3461
13697a54148M4096J18054N163j90278o1699q0255R9813M7594J7259M1243O257
13686a06901l0657l296M5704O4364J3297Q8640M6344J8001r3326q8688p36P5389
13674B8135O7388k0541n1364l0251L9265j01723j488R2860m128r6801O1189L9803
13662B2344q0978q072L6437m1235N4897J29591R1138R1310j28928j28788N1781
13651H9497J1786j0997L862p7174K5611P5319K731j5788m1593J5418M6991o6103
13639E9560j63433n0515M1040Q0308J56248Q426o3672r5018p1579J010R858n4602
$$ plain form
13627 -142369 -141794 -12540 203991 237790 45278 -1392 -1578 9860 -4529 1414 76367 47017
13615 47017 -36204 -63612 -108590 -163758 -175925 -189778 -131811 23780 234904 123702 2479
13604 2479 -49853 -63630 -34820 -37357 -22099 -38068 19053 -88270 -176714 -17419 23907 -42732
13592 -42732 -37527 6285 9615 49073 34442 59942 16887 25972 15860 -43645 60443 86235
13580 86235 -52252 48162 158549 95056 106294 250498 217248 65574 -57987 19185
13570 19185 -10183 44036 165989 184256 197535 271895 166418 40249 -27035 -100498 -119470
13559 -119470 -76258 -25193 -35592 -29310 38543 81169 160892 214743 237286 141249 163063 176918
13547 176918 160998 153268 59040 -6215 -13347 73872 178311 179091 28170 -135216 -55228 -51094
$$ packed form
13627a42369N75J29254K16531L3799j92512m6670j86J1438j4389N943P4953k9350
13615D7017q3221k7408m4978n5168j2167j3853N7967J55591K11124j11202j21223
13604B479n2332j3777K8810k537J5258j5969N7121j07323q8444J59295M1326o6639
13592d2732N205M3812L330L9458j4631K5500m3055R085j0112n9505J04088K5792
13580H6235j38487J00414J10387o3493J1238J44204l3250j51674j23561P7172
13570A9185k9368N4219J21953J8267J3279P4360j05477j26169o7284p3463j8972
13559a19470M3212N1065j0399O282O7853M2626P9723N3851K2543r6037K1814J3855
13547A76918j5920p730r4228o5255p132Q7219J04439P80j50921j63386P9988M134
$$ plain form
13535 -51094 126552 137627 26001 40989 53925 37309 149769 94480 10653 71333 4381
13524 4381 -119284 -196608 -172698 -116185 -115125 -101901 -88509 -127165 -141991 -148964 -8383 40635
13512 40635 52020 -36743 -19927 46987 29263 2003 -26359 91192 143747 100127 -32929
13501 -32929 -74099 -21013 7874 -103724 -26371 56966 -65037 -27950 82617 43794 68919
13490 68919 39117 107483 77787 121764 65980 -77467 -30324 37925 -27542 -117834 -135146
13479 -135146 -14189 85735 -3375 -121559 -188954 -156325 -17218 -866 50713 46884 164548
13468 164548 284953 165432 46456 -40043 -41716 21754 32527 6735 72831 50763 -129968
13457 -129968 -134398 22193 153938 178110 92740 76859 91122 62690 -9544 -59024 -38099
$$ packed form
13535e1094J77646J1075j11626J4988J2936j6616J12460n5289q3827O0680o6952
13524D381j23665p7324K3910N6513J060J3224J3392l8656j4826o973J40581M9018
13512D0635J1385q8763J6816O6914j7724k7260k8362J17551N2555m3620j33056
13501c2929m1170N3086K8887j11598P7353Q3337j22003L7087J10567l8823K5125
13490F8919k9802O8366k9696M3977n5784j43447M7143O8249o5467r0292j7312
13479a35146J20957R9924q9110j18184o7395L2629J39107J6352N1579l829J17664
13468A64548J20405j19521j18976q6499j673O3470J0773k5792O6096k2068j80731
13457a29968m430J56591J31745K4172q5370j5881J4263k8432p2234m9480K0925
$$ plain form
13446 -38099 -41154 -46583 -65022 -80380 -99878 -16366 57241 75801 194116 188266 113132 8817
13434 8817 -19299 -62154 -137325 -95954 -85630 -161201 -150188 -133066 9639 64835 65459 112184
13422 112184 135356 174100 167904 159974 138395 230741 267263 268350 180620 104784 55972 4557
13410 4557 -4522 38122 762 70351 -13995 -87341 -54013 -10802 -29985 36055 166265 225986
13398 225986 268132 106407 11869 115764 148505 149767 134047 78784 -59229 20494 74288
13387 74288 -5793 -77099 -189067 -86412 -75377 -18780 86937 108946 140421 179193 161256
13376 161256 97854 48234 14647 -43696 -113499 -58711 49023 103229 126811 158058 50293
13365 50293 39993 80798 -49646 -153717 -174711 24800 -4812 -124427 -43239 33480 54124
$$ packed form
13446c8099l055n429j8439j5358j9498Q3512P3607J8560J18315n850p5134j04315
13434H817k8116m2855p5171M1371J0324p5571J1013J7122J42705N5196O24M6725
13422A12184K3172L8744o196p930k1579R2346L6522J087q7730p5836m8812n1415
13410D557r079M2644l7360O9589q4346p3346L3328M3211j9183O6040J30210N9721
13398B25986M2146j61725r4538J03895L2741J262j5720n5263j38013P9723N3794
13387G4288q0081p1306j11968J02655J1035N6597J05717K2009L1475L8772j7937
13376A61256o3402m9620l3587n8343o9803N4788J07734N4206K3582L1247j07765
13365E0293j0300M0805j30444j04071k0994J99511k9612j19615Q1188P6719K0644
$$ plain form
13354 54124 127747 -21254 -97505 -56727 -67135 -42797 145480 288066 316614 130856 -81155
13343 -81155 -120325 -33772 32100 143866 245867 196119 127653 141603 187724 170330 108603
13332 108603 -9063 99918 124113 12835 -37 135342 183027 220463 222543 88213 -65127
13321 -65127 -98819 -130689 -181269 -153451 -39469 106619 130507 96217 41397 -39351 -87504
13310 -87504 -37514 20718 89302 110856 99751 166902 136972 70147 49119 99623 225683
13299 225683 161060 18565 25474 32925 85170 83670 136262 117240 89205 51069 68054 204395
13287 204395 216268 177609 120038 51825 80686 72379 87586 33844 86687 177139 154687 263192
13275 263192 245491 118802 -7014 27109 -530 -36905 -37404 -5273 94979 208514 215493
$$ packed form
13354E4124P3623j49001p6251M0778j0408K4338J88277J42586K8548j85758k12011
13343h1155l9170Q6553O5872J11766J02001m9748o8466J3950M6121j7394o1727
13332A08603j17666J08981K4195j11278j2872J35379M7685L7436K080j34330j53340
13321f5127l3692l1870n0580K7818J13982J46088K3888l4290n4820q0748m8153
13310h7504M9990N8232O8584K1554j1105O7151k9930o6825k1028N0504J26060
13299B25683o4623j42495O909P451N2245j500N2592j9022k8035l8136J6985J36341
13287B04395J1873l8659n7571o8213K8861q307J5207n3742N2843R0452k2452J08505
13275B63192j7701j26689j25816L4123k7639l6375m99L2131J00252J13535O979
$$ plain form
13264 215493 269551 287702 384102 404510 198440 71364 28892 58181 -70714 -70799 144900
13253 144900 202324 90840 115653 73767 -95611 -190632 -138621 -433 54949 143215 219924
13242 219924 175354 108745 127068 64141 56088 -62816 8837 115423 5656 -183290 -72125
13231 -72125 73675 137778 186095 170181 136679 108245 47716 36164 858 83729 81073 45453
13219 45453 43333 53887 48028 123522 206339 129319 53222 -56525 -156170 15941 94778 16578
13207 16578 815 5762 36482 33573 23044 38056 -15132 4110 20480 32770 157259 145138
13195 145138 18171 131187 216008 146541 179048 99084 48567 -31466 -125535 -172375 -73227
13184 -73227 -122365 -160303 -38052 96577 146209 206242 211214 187511 231777 291529 361440
$$ packed form
13264B15493N4058J8151R6400K0408k06070j27076m2472K9289j28895q5K15699
13253A44900N7424j11484K4813m1886j69378r5021N2011J38188N5382Q8266P6709
13242B19924m4570o6609J8323o2927q053j18904P1653J06586j09767j88946J11165
13231g2125J45800O4103M8317j5914l3502k8434o0529j1552l5306Q2871k656l5620
13219D5453k120J0554n859P5494Q2817p7020p6097j09747r9645J72111P8837p8200
13207A6578j5763M947L0720k909j0529J5012n3188J9242J6370J2290J24489j2121
13195A45138j26967J13016Q4821o9467L2507p9964n0517q0033r4069m6840R9148
13184g3227m9138l7938J22251J34629M9632O0033M972k3703M4266N9752O9911
$$ plain form
13173 361440 372739 379210 223717 155096 96196 118943 303847 206583 153906 125517 254297
13162 254297 235941 112307 -4862 126097 265807 301139 342154 410595 475862 364980
13152 364980 264548 196875 245058 213488 236152 200549 128976 155472 144937 192735 380879
13141 380879 362734 223701 181251 183021 118744 75993 211266 213209 218573 250243 221491 212551
13129 212551 245058 277087 231182 198230 165838 41291 -53423 -30906 26778 67546 25728
13118 25728 85254 187351 188640 261706 274197 104206 -10461 17585 89018 129364 157155
13107 157155 257717 383097 272389 199259 86471 53545 195393 259671 225076 125501
13097 125501 103785 161817 293521 215314 202503 275620 215346 262038 266078 337657 381663
$$ packed form
13173C61440J1299O471j55493o8621n8900K2747J84904r7264n2677k8389J28780
13162B54297j8356j23634j17169J30959J39710L5332M1015O8441O5267j10882
13152C64980j00432o7673M8183l1570K2664l5603p1573K6496j0535M7798J88144
13141C80879j8145j39033m2450J770o4277m2751J35273J943N364L1670k8752q940
13129B12551L2507L2029m5905l2952l2392j24547r4714K2517N7684M0768m1818
13118B5728N9526J02097J289P3066J2491j69991j14667K8046P1433M0346K7791
13107A57155J00562J25380j10708p3130j12788l2926J41848O4278l4595r9575
13097A25501k1716N8032J31704p8207j2811P3117o0274M6692M040P1579M4006
$$ plain form
13086 381663 275742 153203 186589 345938 296811 236953 230661 372106 397975 345215 356976
13075 356976 309509 326822 253534 131582 55048 190358 263897 327703 282543 289890 315858
13064 315858 317989 381005 446947 375337 280221 142358 152127 126759 99134 208467 244381
13053 244381 209225 176521 225964 179549 111983 73110 268109 304793 319190 341079 334864
13042 334864 220121 192430 209632 230258 235264 226415 139487 105236 152448 184354 280565 289480
13030 289480 299752 392211 410404 379850 240310 103377 162024 146575 101068 83748 144073
13019 144073 175414 115194 124584 125638 162724 197718 257131 298692 282056 217349 198528 182328
13007 182328 143574 190390 226370 176567 246600 288961 219542 89748 146607 266805 341629
$$ packed form
13086C81663j05921j22539L3386J59349m9127n9858o292J41445K5869n2760J1761
13075C56976m7467J7313p3288j21952p6534J35310P3539O3806m5160P347K5968
13064C15858K131O3016O5942p1610r5116j37863R769k5368k7625J09333L5914
13053B44381l5156l2704M9443m6415o7566l8873J94999L6684J4397K1889o215
13042C34864j14743k7691J7202K0626N006q849q6928l4251M7212L1906R6211Q915
13030B89480J0272R2459J8193l0554j39540j36933N8647j5449m5507j7320O0325
13019A44073L1341o0220R390J054L7086L4994N9413M1561j6636o4707j8821j6200
13007A82328l8754M6816L5980m9803P0033M2361o9419j29794N6859J20198P4824
$$ plain form
12996 341629 530324 565794 466738 379076 293712 335531 351581 285217 263382 218102 237523
12985 237523 159335 100115 98385 99964 83561 146495 196923 172791 206059 224962 203595 129357
12973 129357 126390 119647 59094 84696 141109 102882 95615 194850 275976 244499 312738 363595
12961 363595 320407 295390 220811 226726 324343 379987 239975 250120 305236 313308 239397 335953
12949 335953 309531 218063 184331 289710 304422 212491 194634 271844 276611 208619 355786
12938 355786 417578 498235 549601 484563 401555 285518 312924 259124 267593 215525 173216
12927 173216 293581 333460 332272 267714 229607 254340 373905 514987 492995 349354 314538
12916 314538 343663 352608 338788 318858 265973 363453 524598 640460 574819 414521 315043
$$ packed form
12996C41629J88695L5470r9056q7662q5364M1819J6050o6364k1835m5280J9421
12985B37523p8188n9220j730J579j6403O2934N0428k4132L3268J8903k1367p4238
12973A29357k967o743o0553K5602N6413l8227p267R9235Q1126l1477O8239N0857
12961C63595m3188k5017p4579N915R7617N5644j40012J0145N5116Q072p3911R6556
12949C35953k6422r1468l3732J05379J4712r1931j7857P7210M767o7992J47167
12938C55786O1792Q0657N1366o5038q3008j16037K7406n3800Q469n2068m2309
12927A73216J20365L9879j188o4558l8107K4733J19565J41082k1992j43641l4816
12916C14538K9125Q945j3820j9930n2885R7480J61145J15862o5641j60298r9478
$$ plain form
12905 315043 273056 353312 210969 24532 56525 240753 278704 333967 300860 253059 295153
12894 295153 316538 260443 279172 329721 300738 276244 290629 384897 352474 416118 456306
12883 456306 408156 356850 381766 323659 311288 320346 378250 419099 467270 411157 256908
12872 256908 293347 300554 280451 221277 173560 135481 39973 220664 264729 276797 284086 247772
12860 247772 213591 297584 441917 474558 406409 389463 320905 340581 307987 273291 360110
12849 360110 416426 519196 561941 523998 505103 576494 644282 561223 480142 455367 361386
12838 361386 262453 316970 466352 620746 592875 519909 459563 412498 448059 356950 325700
12827 325700 428347 349041 319977 395660 456034 538480 524895 540721 479417 481238 548359
$$ packed form
12905C15043m1987Q0256j42343j86437L1993J84228L7951N5263l3107m7801M2094
12894B95153K1385n6095J8729N0549k8983k4494J4385R4268l2423O3644M0188
12883D56306m8150n1306K4916n8107j2371R058N7904M0849M8171n6113j54249
12872B56908L6439P207k0103n9174m7717l8079r5508J80691M4065J2068P289l6314
12860B47772l4181Q3993J44333L2641o8149j6946o8558J9676l2594l4696Q6819
12849C60110N6316J02770M2745l7943j8895P1391O7788q3059q1081k4775r3981
12838C61386r8933N4517J49382J54394k7871p2966o0346m7065L5561r1109l1250
12827C25700J02647p9306k9064P5683O0374Q2446j3585J5826o1304J821O7121
$$ plain form
12816 548359 452399 509906 542477 541829 661801 658650 657467 573235 472633 386730 426240 523233
12804 523233 439788 377686 321182 305105 363502 419534 409436 397686 257909 249954 384986
12793 384986 471654 685576 738158 715924 598563 536805 403155 326958 366372 348679 395322
12782 395322 557643 546568 393114 429580 613603 570817 390971 350925 329689 307763 425404
12771 425404 392511 484833 461036 410568 372887 335138 296171 296239 393822 428021 352568 300337
12759 300337 311667 328890 415753 521254 455671 373240 525924 653208 669410 589064 549309
12748 549309 464711 377115 370593 503518 520335 550014 619350 525813 385977 400098 440089
12737 440089 375788 404897 445515 550025 508639 457170 455748 561136 649996 656945 519539
$$ packed form
12816E48359r5960N7507L2571o48J19972l151j183q4232j00602q5903L9510R6993
12804E23233q3445o2102n6504j6077N8397N6032j0098j1750j39777p955J35032
12793C84986Q6668K13922N2582k2234j17361o1758j33650p6197L9414j7693M6643
12782C95322J62321j1075j53454L6466J84023m2786j79846m0046k1236k1926J17641
12771D25404l2893R2322k3797n0468l7681l7749l8967O8R7583L4199p5453n2231
12759C00337J1330J7223Q6863J05501o5583q2431J52684J27284J6202q0346l9755
12748E49309q4598q7596o522J32925J6817K9679O9336r3537j39836J4121L9991
12737D40089o4301K9109M0618J04510m1386n1469j422J05388Q8860O949j37406
$$ plain form
12726 519539 563446 764087 589761 506416 493024 632143 660785 595988 557446 516071 453785
12715 453785 497312 652895 732221 724435 550315 493418 625746 682559 621474 643994 603368
12704 603368 502615 437336 459159 490485 420965 339333 451301 450807 508597 459567 341493
12693 341493 336297 414475 488426 550403 457612 531421 655138 658198 710711 617440 535047 521511
12681 521511 571946 566822 540077 510002 594336 585302 514964 551635 596530 714095 674697 622329
12669 622329 535002 618373 655202 581534 495957 549356 519950 460015 580832 625498 537044
12658 537044 573126 583714 587779 455848 504151 501246 613315 631864 449926 449039 558075
12647 558075 711049 771471 600135 538427 594756 576693 571111 704787 869378 884854 832032
$$ packed form
12726E19539M3907K00641j74326q3345j3392J39119K8642o4797l8542m1375o2286
12715D53785M3527J55583P9326p786j74120n6897J32328N6813o1085K2520m0626
12704F03368j00753o5279K1823L1326o9520q1632J11968m94N7790m9030j18074
12693C41493n196P8178P3951O1977r2791P3809J23717L060N2513r3271q2393j3536
12681E21511N0435n124k6745l0075Q4334r034p0338L6671M4895J17565l9398n2368
12669F22329q7327Q3371L6829p3668q5577N3399k9406n9935J20817M4666q8454
12658E37044L6082J0588M065j31931M8303k905J12069J8549j81938q87J09036
12647E58075J52974O0422j71336o1708N6329j8063n582J33676J64591J5476n2822
$$ plain form
12636 832032 759595 740865 762564 704148 729985 734055 587773 747887 891203 938495 878388
12625 878388 793913 712006 627645 657737 747449 768217 795643 807689 717350 548338 571666
12614 571666 544201 642915 763709 777363 710541 664578 673388 832793 951635 799315 853706
12603 853706 874430 981312 1051039 1070115 1082836 1036700 994768 998678 971316 882533 960232
12592 960232 971298 918731 912326 929247 899710 933319 894797 894923 901617 871759 813471 928905
12580 928905 941464 919659 897601 971913 975158 892925 883103 968931 1004371 1005687 934246 971845
12568 971845 965525 959372 744355 723868 850153 934215 951671 1034703 1056400 1051856 1078050 1044084
12556 1044084 1098015 1101561 1033645 1015111 872784 753853 854581 922949 944300 958672 978762
$$ packed form
12636H32032p2437j8730K1699n8416K5837M070j46282J60114J43316M7292o0107
12625H78388q4475q1907q4361L0092Q9712K0768K7426J2046r0339j69012K3328
12614E71666k7465R8714J20794J3654o6822m5963Q810J59405J18842j52320N4391
12603H53706K0724J06882O9727J9076J2721m6136m1932L910k7362q8783P7699
12592I60232J1066n2567o405J6921k9537L3609l8522J26O694k9858n8288J15434
12580I28905J2559k1805k2058P4312L245q2233r822Q5828L5440J316p1441L7599
12568I71845o320o153k15017k0487J26285Q4062J7456Q3032K1697m544K6194l3966
12556A044084N3931L546o7916j8534j42327j18931J00728O8368K1351J4372K0090
$$ plain form
12545 978762 959288 928094 927634 874375 981875 1035788 954551 923726 1041712 1061335 1027811
12534 1027811 1039741 966997 1074917 1196528 1136273 1077583 1249921 1298375 1232823 1060353
12524 1060353 1018013 1110963 1227552 1212180 1125988 1090807 1095765 1124076 1171236 1061527 1003516
12513 1003516 967950 1139408 1326007 1256192 1253549 1246724 1181229 1030633 1032340 1158648 1104823
12502 1104823 1060653 1015091 974206 965999 1051055 1109076 1069218 1174303 1276498 1187901 1110517
12491 1110517 1150102 1122661 1182133 1287508 1229583 1331532 1347525 1181876 1164346 1179378 1258796
12480 1258796 1248923 1381795 1400382 1399287 1420552 1515821 1530575 1453657 1359046 1471440 1548700
12469 1548700 1528948 1368347 1212002 1179081 1299117 1385777 1442691 1378938 1326133 1330949 1306838
$$ packed form
12545I78762j9474l1194m60n3259J07500N3913q1237l0825J17986J9623l3524
12534A027811J1930p2744J07920J21611o0255n8690J72338M8454o5552j72470
12524A060353m2340R2950J16589j5372q6192l5181M958K8311M7160j09709n8011
12513A003516l5566J71458J86599o9815k643o825o5495j50596J707J26308n3825
12502A104823m4170m5562m0885q207Q5056N8021l9858J05085J02195q8597p7384
12491A110517L9585k7441N9472J05375n7925J01949J5993j65649j7530J5032P9418
12480A258796r873J32872J8587j095K1265R5269J4754p6918r4611J12394P7260
12469A548700j9752j60601j56345l2921J20036Q6660N6914o3753n2805M816k4111
$$ plain form
12458 1306838 1385546 1415032 1457278 1409286 1385559 1431859 1451268 1431004 1372815 1414018 1426716
12447 1426716 1408374 1527809 1577192 1676139 1671178 1594539 1556542 1381715 1268645 1330260 1469233
12436 1469233 1621455 1681869 1651021 1738192 1740918 1647150 1580781 1523536 1510985 1521457 1539346
12425 1539346 1512534 1608247 1639768 1650776 1726656 1695926 1660690 1551420 1535457 1571214 1668414
12414 1668414 1788055 1733930 1666779 1640968 1458398 1510600 1631929 1645643 1819898 1971701
12404 1971701 1955327 1942343 1796153 1588338 1535210 1707495 1829974 1700255 1650045 1702651
12394 1702651 1691422 1568962 1567476 1672867 1826638 1960360 2061421 2034974 1920935 1821686
12384 1821686 1738431 1918262 1970346 1859354 1753167 1746816 1794609 1910808 1987249 1982599 2001645
$$ packed form
12458A306838P8708K9486M2246m7992k3727M6300J9409k0264n8189M1203J2698
12447A426716j8342J19435M9383R8947m961p6639l7997j74827j13070O1615J38973
12436A469233J52222O0414l0848Q7171K726r3768o6369n7245j2551J0472J7889
12425A539346k6812R5713L1521J1008P5880l0730l5236j09270j5963L5757R7200
12414A668414J19641n4125o7151k5811j82570N2202J21329J3714J74255J51803
12404A971701j6374j2984j46190k07815n3128J72285J22479j29719n0210N2606
12394A702651j1229j22460j486J05391J53771J33722J01061k6447j14039r9249
12384A821686q3255J79831N2084j10992j06187o351M7793J16199P6441m650J9046
$$ plain form
12373 2001645 1975019 2027170 1975649 1988731 1963143 1943337 2006153 2257791 2291083 2170081 2121221
12362 2121221 2041627 1965545 2035615 2222039 2284280 2248054 2181729 2120377 2124898 2246684 2227180
12351 2227180 2208552 2290771 2330107 2350406 2319933 2328243 2364295 2350094 2332949 2403111 2384933
12340 2384933 2410240 2485421 2575941 2495825 2399455 2293592 2248900 2286991 2415776 2554331 2669682
12329 2669682 2613505 2536878 2481702 2569407 2593935 2559148 2585436 2703740 2653505 2616916 2550169
12318 2550169 2622347 2694718 2691307 2701924 2661653 2707898 2680875 2630715 2666732 2845800 2935355
12307 2935355 2862721 2841169 2884594 2969779 2979793 2991049 3001088 2978710 2948726 3005023 3048418
12296 3048418 3068188 3084876 3054720 3140627 3108050 3125799 3105370 3209848 3222113 3209970 3153911
$$ packed form
12373B001645k6626N2151n1521J3082k5588j9806O2816K51638L3292j21002m8860
12362B121221p9594p6082P0070J86424O2241l6226o6325o1352M521J21786j9504
12351B227180j8628Q2219L9336K0299l0473Q310L6052j4201j7145P0162j8178
12340B384933K5307P5181R0520q0116r6370j05863m4692L8091J28785J38555J15351
12329B669682n6177p6627n5176Q7705K4528l4787K6288J18304n0235l6589o6747
12318B550169P2178P2371l411J0617m0271M6245k7023n0160L6017J79068Q9555
12307B935355p2634k1552M3425Q5185J0014J1256J0039k2378k9984N6297M3395
12296C048418J9770J6688l0156Q5907l2577J7749k0429J04478J2265j2143n6059
$$ plain form
12285 3153911 3211069 3204093 3237699 3186404 3143461 3195402 3293321 3291013 3267758 3304185 3319388 3305650
12273 3305650 3291629 3215225 3290365 3476499 3570179 3681863 3646138 3566499 3614592 3731006 3825995
12262 3825995 3767859 3752288 3770775 3783565 3786966 3827433 3901257 3887072 3820918 3970142 4040004
12251 4040004 3993181 3968936 3973007 3901455 4016008 4093477 4085640 4089140 4081486 4136785 4261627 4271564
12239 4271564 4241491 4213438 4246255 4401485 4370422 4347198 4407117 4427238 4470457 4411885 4316747
12228 4316747 4338480 4442363 4492153 4548653 4645758 4713734 4840789 4865186 4903761 4916993 4831904
12217 4831904 4854232 4838988 4845272 5009377 5105476 5075850 5055390 5064542 5117828 5158666 5300017
12206 5300017 5324652 5259700 5193530 5297058 5385228 5414846 5428940 5455103 5480845 5540640 5623227
$$ packed form
12285C153911N7158o976L3606n1295m2943N1941R7919k308k3255L6427J5203j3738
12273C305650j4021p6404P5140J86134R3680J11684l5725p9639M8093J16414R4989
12262C825995n8136j5571J8487J2790L401M0467P3824j4185o6154J49224O9862
12251D040004m6823k4245M071p1552J14553P7469p837L500p654N5299J24842R937
12239D271564l0073k8053L2817J55230l1063k3224N9919K0121M3219n8572r5138
12228D316747K1733J03883M9790N6500R7105O7976J27055K4397L8575J3232q5089
12217D831904K2328j5244O284J64105R6099k9626k0460R152N3286M0838J41351
12206E300017K4635o4952o6170J03528Q8170K9618J4094K6163K5742N9795Q2587
$$ plain form
12195 5623227 5663045 5679480 5732767 5895083 5913981 5951648 5966172 5904415 5884400 6010777 6047445
12184 6047445 6187845 6285065 6447645 6397062 6437762 6482587 6509094 6583566 6487052 6472539 6517568
12173 6517568 6538711 6652966 6750965 6850294 6960179 6943911 7034175 7024334 6976595 7078169 7239836
12162 7239836 7280905 7390884 7450582 7483143 7399352 7437779 7476815 7512431 7563487 7568615 7681064
12151 7681064 7704957 7720798 7755999 7736225 7894975 7960216 8072533 8224169 8318533 8330810 8460771
12140 8460771 8585838 8567203 8516214 8491894 8659915 8779264 8854847 8747538 8681496 8768826
12130 8768826 8737391 8833528 9034394 9245805 9354520 9379668 9558959 9667182 9786473 9839982
12120 9839982 9844651 9855223 9913043 9992182 9990785 10086604 10243516 10319360 10365156 10400285 10411998
$$ packed form
12195E623227L9818J6435N3287J62316J8898L7667J4524o1757k0015J26377L6668
12184F047445J40400R7220J62580n0583M0700M4825K6507P4472r6514j4513M5029
12173F517568K1143J14255R7999R9329J09885j6268R0264r841m7739J01574J61667
12162G239836M1069J09979N9698L2561q3791L8427L9036L5616N1056N128J12449
12151G681064K3893J5841L5201j9774J58750O5241J12317J51636R4364J2277J29961
12140H460771J25067j8635n0989k4320J68021J19349P5583j07309o6042Q7330
12130H768826l1435R6137K00866K11411J08715K5148J79291J08223J19291N3509
12120I839982M669J0572N7820P9139j397R5819J56912P5844M5796L5129J1713
$$ plain form
12109 10411998 10453947 10599879 10657075 10746982 10814211 10848771 10999144 11256665 11336633 11388628
12099 11388628 11536771 11585498 11724512 11756320 11771497 11834778 11950046 11951186 12008589 12124583
12089 12124583 12243677 12341253 12584744 12746820 12854208 12870609 12986034 13021020 13106147 13097015
12079 13097015 13203722 13259871 13368317 13452640 13465842 13573494 13649966 13721454 13823259 13975662
12069 13975662 14121569 14271531 14378346 14466371 14496932 14662962 14836024 14825218 14911493 14988132
12059 14988132 15134674 15297151 15443126 15434919 15377635 15441042 15629693 15688437 15639949 15680265
12049 15680265 15939503 16099092 16263470 16479820 16592137 16514191 16413429 16597386 16730296
12040 16730296 16659226 16737235 16865930 17011662 17199094 17239390 17182316 17284402 17381756 17402621
$$ packed form
12109A0411998M1949J45932N7196Q9907O7229L4560J50373K57521P9968N1995
12099A1388628J48143M8727J39014L1808J5177O3281J15268J140N7403J15994
12089A2124583J19094R7576K43491J62076J07388J6401J15425L4986Q5127r132
12079A3097015J06707N6149J08446Q4323J3202J07652P6472P1488J01805J52403
12069A3975662J45907J49962J06815Q8025L0561J66030J73062j0806Q6275P6639
12059A4988132J46542J62477J45975q207n7284O3407J88651N8744m8488M0316
12049A5680265K59238J59589J64378K16350J12317p7946j00762J83957J32910
12040A6730296p1070P8009J28695J45732J87432M0296n7074J02086R7354K0865
$$ plain form
12030 17402621 17489324 17611972 17651173 17812235 17969741 18072662 18162570 18300685 18271588 18353735
12020 18353735 18528531 18516576 18553958 18599365 18618184 18693238 18717850 18794440 18773097 18670551 18661318
12009 18661318 18757367 18942426 19106035 19040095 18938468 18987468 19135794 19230668 19252836 19205448
11999 19205448 19218190 19278172 19246234 19268281 19235567 19212980 19249527 19353446 19501365 19588412 19565695
11988 19565695 19552730 19471928 19412640 19490852 19502434 19411725 19466120 19551492 19649492 19679527 19592891
11977 19592891 19456029 19403388 19396470 19430664 19302295 19084265 18935671 18894623 18905798 18850405
11967 18850405 18880769 19019990 19062055 18891041 18778112 18732069 18704631 18668961 18541483 18380683
11957 18380683 18372300 18361663 18343550 18198299 18049887 17970135 17865882 17707830 17677619 17704605
$$ packed form
12030A7402621Q6703J22648L9201J61062J57506J02921Q9908J38115k9097Q2147
12020A8353735J74796j1955L7382M5407J8819P5054K4612P6590k1343j02546r233
12009A8661318R6049J85059J63609o5940j01627M9000J48326R4874K2168m7388
11999A9205448J2742N9982l1938K2047l2714k2587L6547J03919J47919Q7047k2717
11988A9565695j2965q0802n9288P8212J1582r0709N4395Q5372R8000L0035q6636
11977A9592891j36862n2641o918L4194j28369k18030j48594m1048J1175n5393
11967A8850405L0364J39221M2065j71014j12929m6043k7438l5670j27478j60800
11957A8380683q383j0637j8113j45251j48412p9752j04253j58052l0211K6986
$$ plain form
11947 17704605 17792915 17732849 17759046 17743008 17750517 17677200 17480842 17392115 17203746 16978286 16809005
11936 16809005 16890472 16882990 16775192 16692190 16488458 16293431 16290827 16252627 16037876 15872417
11926 15872417 15845550 15767162 15604431 15565839 15444106 15327437 15296095 15299457 15139436 14984370
11916 14984370 14965183 14890693 14888839 14836398 14717097 14580389 14508605 14337501 14230096 14105475
11906 14105475 13983796 13849042 13678836 13544603 13485976 13456768 13276527 13222554 13127248 13084673
11896 13084673 13055107 13025874 12854853 12728210 12673751 12525303 12521492 12416552 12344509 12351610 12196502
11885 12196502 12011533 11974920 11923490 11753667 11604579 11460922 11338077 11315028 11322602 11293132
11875 11293132 11192932 11176306 11057096 10989572 10997041 10934939 10782652 10622569 10476914 10436831
$$ packed form
11947A7704605Q8310o0066K6197j6038P509p3317j96358q8727j88369k25460j69281
11936A6809005Q1467p482j07798q3002k03732j95027k604l8200k14751j65459
11926A5872417k6867p8388j62731l8592j21733j16669l1342L362j60021j55066
11916A4984370j9187p4490j854n2441j19301j36708p1784j71104j07405j24621
11906A4105475j21679j34754j70206j34233n8627k9208j80241n3973r5306m2575
11896A3084673k9566k9233j71021j26643n4459j48448l811j04940p2043P101j55108
11885A2196502j84969l6613n1430j69823j49088j43657j22845k3049P574k9470
11875A1293132j00200j6626j19210o7524P469o2102j52287j60083j45655m0083
$$ plain form
11865 10436831 10356257 10290808 10115431 10020504 10021276 9926314 9844473 9699840 9655479 9681441 9603134
11854 9603134 9420541 9234025 9191490 9237964 9258170 9143532 9073178 8999481 8909625 8753886
11844 8753886 8657810 8658156 8682240 8736568 8673722 8543560 8386731 8339280 8288315 8187978 8078303
11833 8078303 8045106 7974657 7894596 7907756 7956334 7903667 7821613 7678208 7567454 7524035 7525756
11822 7525756 7445826 7396754 7463079 7413072 7225181 7178815 7336148 7327899 7117276 6990421 6915026
11811 6915026 6743777 6694790 6754633 6769281 6786368 6794843 6656092 6536015 6498489 6428129 6426257
11800 6426257 6470889 6491443 6361488 6167667 6106094 6181331 6063062 5964351 5911120 5910010 5880161
11789 5880161 5784161 5629513 5576482 5705681 5745050 5636764 5550266 5558086 5582016 5399386 5274976
$$ packed form
11865A0436831q0574o5449j75377r4927P72r4962q1841j44633m4361K5962p8307
11854I603134j82593j86516m2535M6474K0206j14638p0354p3697q9856j55739
11844H753886r6076L46K4084N4328o2846j30162j56829m7451n0965j00337j09675
11833H078303l3197p0449q0061J3160M8578n2667q2054j43405j10754m3419J721
11822G525756p9930m9072O6325n0007j87891m6366J57333q249k10623j26855p5395
11811F915026j71249m8987N9843J4648J7087Q475j38751j20077l7526p0360j872
11800F426257M4632K0554j29955j93821o1573P5237j18269r8711n3231j110k9849
11789E880161r6000j54648n3031J29199L9369j08286q6498P820K3930j82630j24410
$$ plain form
11778 5274976 5303486 5266280 5116416 5028269 5138489 5178902 5177803 5181491 5150616 5179875 4974816
11767 4974816 4815516 4731930 4684193 4719422 4807738 4877028 4856050 4813477 4815835 4724831 4663172
11756 4663172 4595149 4623422 4519805 4464286 4575014 4464612 4446700 4386949 4311834 4403822 4448141
11745 4448141 4416102 4358130 4379859 4243118 4186714 4262504 4293461 4129579 4105515 4035901 4002050
11734 4002050 4028112 4036620 4029351 3824857 3716035 3797466 3998319 3910301 3860601 3774493 3691238
11723 3691238 3801739 3883118 3823554 3831317 3777035 3788189 3722343 3667921 3648932 3585801 3724604
11712 3724604 3698156 3540745 3357921 3199183 3231704 3266421 3210962 3254185 3289813 3324590 3347673
11701 3347673 3267568 3281557 3271214 3127072 3073164 3089953 3016614 2943050 2919928 2890185 2878765
$$ packed form
11778E274976K8510l7206j49864q8147J10220M0413j099L688l0875K9259k05059
11767D974816j59300q3586m7737L5229Q8316O9290k0978m2573K358r1004o1659
11756D663172o8023K8273j03617n5519J10728j10402j7912n9751p5115R1988M4319
11745D448141l2039n7972K1729j36741n6404P5790L0957j63882k4064o9614l3851
11734D002050K6062Q508p269k04494j08822Q1431K00853q8018m9700q6108q3255
11723C691238J10501Q1379n9564P763n4282J1154o5846n4422j8989o3131J38803
11712C724604k6448j57411j82824j58738L2521L4717n5459M3223L5628L4777K3083
11701C347673q0105J3989j0343j44142n3908J6789p3339p3564k3122k9743j1420
$$ plain form
11690 2878765 2813549 2714808 2807739 2867598 2905499 2949060 2973998 2878138 2804166 2835286 2855686
11679 2855686 2943274 2896599 2738126 2617841 2631653 2644009 2656336 2656479 2610700 2612100 2662364
11668 2662364 2753617 2726952 2722543 2659461 2676677 2707407 2747545 2648342 2658387 2605423 2490277
11657 2490277 2453901 2416991 2458360 2447321 2509962 2416087 2408125 2380068 2243882 2217621 2212290
11646 2212290 2207762 2255589 2232715 2133928 2180822 2200098 2114395 2045516 2126504 2219580 2133993
11635 2133993 2139882 2069516 2147013 2185898 2114284 2151790 2120687 2022947 1996641 1971703 1899328
11624 1899328 1957789 2022663 2002287 1941673 1965057 1977021 1978218 2019915 2048424 2073090 2017772
11613 2017772 1913793 1874880 1906168 1863623 1761589 1762320 1866257 1836695 1831018 1793946 1747843
$$ packed form
11690B878765o5216r8741R2931N9859L7901M3561K4938r5860p3972L1120K0400
11679B855686Q7588m6675j58473j20285J3812J2356J2327J43m5779J400N0264
11668B662364R1253k6665m409o3082J7216L0730M0138r9203J0045n2964j15146
11657B490277l6376l6910M1369j1039O2641r3875p962k8057j36186k6261n331
11646B212290m528M7827k2874r8787M6894J9276q5703o8879Q0988R3076q5587
11635B133993N889p0366P7497L8885p1614L7506l1103r7740k6306k4938p2375
11624A899328N8461O4874k0376o0614K3384J1964J197M1697K8509K4666n5318
11613B017772j03979l8913L1288m2545j02034P31J03937k9562n677l7072m6103
$$ plain form
11602 1747843 1734795 1771187 1751787 1705381 1710694 1689426 1734149 1813515 1751496 1672271 1781489
11591 1781489 1845988 1802329 1754332 1694667 1561360 1652657 1748130 1682516 1571785 1603611 1654401
11580 1654401 1732129 1773254 1691994 1579924 1585244 1540713 1472678 1471067 1544582 1546118 1459443 1429708
11568 1429708 1441066 1421157 1461015 1465789 1468357 1390458 1370469 1384870 1341261 1275913 1358723 1389333
11556 1389333 1429803 1415468 1541509 1584319 1473042 1340304 1288866 1226216 1209822 1215412 1295319
11545 1295319 1487238 1564083 1424989 1425745 1365982 1329124 1352274 1247195 1120188 1009925 916298
11534 916298 953294 1123839 1268013 1155103 1116148 1198750 1210429 1112718 1206351 1297158 1173052
11523 1173052 1100218 1112270 1125220 1072598 1060937 1140640 1093751 1197846 1243943 1132170 1250101
$$ packed form
11602A747843j3048L6392j9400m6406N313k1268M4723P9366o2019p9225J09218
11591A781489O4499m3659m7997n9665j33307R1297R5473o5614j10731L1826N0790
11580A654401P7728M1125q1260j12070N320m4531o8035j611P3515J536q6675k9735
11568A429708J1358j9909L9858M774K568p7899j9989J4401m3609o5348Q2810L0610
11556A389333M0470j4335J26041M2810j11277j32738n1438o2650j6394N590P9907
11545A295319J91919P6845j39094P56n9763l6858K3150j05079j27007j10263r3627
11534I16298L6996J70545J44174j12910l8955Q2602J1679r7711R3633R0807j24106
11523A173052p2834J2052J2950n2622j1661P9703m6889J04095M6097j11773J17931
$$ plain form
11512 1250101 1331796 1256617 1271124 1269330 1298864 1177780 1020917 983767 1147339 1255332 1331669
11501 1331669 1360542 1372733 1278889 1163130 1140326 1101312 1054084 1179377 1239546 1219254 1134432
11490 1134432 1201509 1218515 1242312 1353734 1271236 1160180 1188810 1260591 1186869 1018919 991800
11479 991800 1135567 1128313 1169521 1080491 1031787 1070081 1015489 1047603 1075595 1006688 1026822
11468 1026822 1006615 994760 1011971 979881 971077 957277 995759 990957 992707 1054028 1036308 1056829
11456 1056829 853851 720110 754575 712523 739165 761861 827345 814266 864422 853888 776865
11445 776865 816706 747808 688813 676989 662571 766184 837021 941335 922400 902863 816608
11434 816608 767024 772801 712651 712603 712594 819708 756965 688285 721627 776135 749851 679239 717892
$$ packed form
11512A250101Q1695p5179J4507j794K9534j21084j56863l7150J63572J07993P6337
11501A331669K8873J2191r3844j15759k2804l9014m7228J25293O0169k0292q4822
11490A134432O7077J7006K3797J11422q2498j11056K8630P1781p3722j67950k7119
11479I91800J43767p254M1208q9030m8704L8294n4592L2114K7992o8907K0134
11468A026822k0207j1855J7211l2090q804j3800L8482m802J750O1321j7720K0521
11456A056829k02978j33741L4465m2052K6642K2696O5484j3079N0156j0534p7023
11445G76865L9841o8898n8995j1824j4418J03613P0837J04314j8935j9537q6255
11434H16608m9584N777o0150m8rJ07114o2743o8680L3342N4508k6284p0612L8653
$$ plain form
11421 717892 666608 725237 712540 613647 633854 704761 657307 708039 801857 899244 868785
11410 868785 808156 787772 777243 709584 694768 677087 720703 770010 751677 745259 771278 652932
11398 652932 627015 570473 682159 718574 753133 850400 877489 739408 648587 653302 764026
11387 764026 802975 736830 624159 627855 571198 629957 688515 829865 764311 615944 550539
11376 550539 613005 691747 732656 685813 611168 648443 692390 604266 497644 511566 536197
11365 536197 677884 701272 525867 513446 628561 521217 393941 437337 462570 591460
11355 591460 738389 613561 629605 574327 561882 593441 701716 717172 648727 643975 690529
11344 690529 693320 611714 524646 537966 512313 515888 493342 522311 461350 475375 619249 732774
$$ packed form
11421G17892n1284N8629j2697r8893K0207P0907m7454N0732R3818R7387l0459
11410H68785o0629k0384j0529o7659j4816j7681M3616M9307j8333o418K6019j18346
11398F52932k5917n6542J11686L6415L4559R7267K7089j38081r0821M715J10724
11387G64026L8949o6145j12671L696n6657N8759N8558J41350o5554j48367o5405
11376E50539O2466P8742M0909m6843p4645L7275M3947q8124j06622J3922K4631
11365E36197J41687K3388j75405j2421J15115j07344j27276M3396K5233J28890
11355E91460J46929j24828J6044n5278j2445L1559J08275J5456o8445m752M6554
11344F90529K791q1606q7068J3320k5653L575k2546K8969o0961J4025J43874J13525
$$ plain form
11332 732774 810147 645073 600274 586989 594893 541156 570933 570050 547812 619294 544679 518832
11320 518832 448746 453350 415159 526585 511644 498189 451302 441748 347201 365399 417979 455696
11308 455696 547096 566524 543756 489874 452591 506078 516838 460391 493224 463554 435101
11297 435101 344885 262664 362888 578978 565332 465738 328204 269591 425589 534946
11287 534946 507688 475200 363912 331683 337793 146214 190108 386301 471490 519981 462426
11276 462426 378955 326136 347124 254292 215489 273044 163256 183733 216887 233708 284891
11265 284891 280380 289014 233499 287153 406651 388901 426387 451570 489103 480659 499386 391722
11253 391722 371086 347336 368207 393035 404865 535219 518348 495601 462834 500762 455971
$$ packed form
11332G32774P7373j65074m4799j3285P904n3737K9777q83k2238P1482p4615k5847
11320E18832p0086M604l8191J11426j4941j3455m6887r554r4547J8198N2580L7717
11308D55696R1400J9428k2768n3882l7283N3487J0760n6447L2833k9670k8453
11297D35101r0216q2221J00224K16090j3646r9594j37534n8613J55998J09357
11287E34946k7258l2488j11288l2229O110j91579M3894J96193Q5189M8491n7555
11276D62426q3471n2819K0988r2832l8803N7555j09788K0477L3154J6821N1183
11265B84891m511Q634n5515N3654J19498j7750L7486K5183L7533q444J8727j07664
11253C91722k0636k3750K0871K4828J1830J30354j6871k2747l2767L7928m4791
$$ plain form
11242 455971 340090 315381 397497 445066 466227 408129 252077 220751 181980 113786 233244
11231 233244 255104 256217 217563 179693 220697 349627 301125 310975 363108 427375 315595
11220 315595 325100 374170 447122 365885 290224 102753 66039 145170 275515 301910 192275
11209 192275 177361 121018 125547 212444 238549 277656 274071 219325 212725 217534 290852 295304
11197 295304 371906 357777 260342 91077 12550 102111 79663 102287 130095 211136 263770
11186 263770 228619 296451 415988 367770 232956 243300 130736 59719 146930 69152 36795
11175 36795 174798 191262 244744 347178 274649 133529 225351 409738 608955 457325
11165 457325 328852 247175 299203 393842 344844 308897 226905 188507 150375 179742 262459
$$ packed form
11242D55971j15881k4709Q2116M7569K1161n8098j56052l1326l8771o8194J19458
11231B33244K1860J113l8654l7870M1004J28930m8502R850N2133O4267j11780
11220C15595R505M9070P2952q1237p5661j87471l6714P9131J30345K6395j09635
11209A92275j4914n6343M529Q6897K6105L9107l585n4746o600M809P3318M452
11197B95304P6602j4129r7435j69265p8527Q9561k2448K2624K7808Q1041N2634
11186B63770l5151O7832J19537m8218j34814J0344j12564p1017Q7211p7778l2357
11175C6795J38003J6464N3482J02434p2529j41120R1822J84387J99217j51630
11165D57325j28473q1677N2028R4639m8998l5947q1992l8398l8132K9367Q2717
$$ plain form
11154 262459 239594 198525 243229 270750 345855 274448 146878 218234 238978 230023 177983
11143 177983 181208 378107 415630 411110 329158 288705 268456 171204 183300 245509 297139 310083
11131 310083 258449 277668 297661 348101 328723 275000 283917 334648 393426 420611 384854 259822
11119 259822 178556 155824 57279 77435 109457 149958 204536 151981 44572 -17447 3952
11108 3952 124672 168754 121260 115539 131839 172209 185739 194351 187199 136083 92950 114902
11096 114902 117297 58551 36099 130350 72743 113983 273582 381196 311912 188365 82030
11085 82030 78369 192250 301677 379075 325210 103815 16428 45160 15008 13242 -21646
11074 -21646 -59185 -38404 110918 164303 96697 57406 6396 10384 128528 139330 79677
$$ packed form
11154B62459k2865m1069M4704K7521P5105p1407j27570P1356K0744q955n2040
11143A77983L225J96899L7523m520q1952m0453k0249r7252J2096O2209N1630J2944
11131C10083n1634J9219J9993N0440j9378n3723Q917N0731N8778K7185l5757j25032
11119B59822q1266k2732r8545K0156L2022M0501N4578n2555j07409o2019K1399
11108C952J20720M4082m7494n721J6300M0370J3530Q612p152n1116m3133K1952
11096A14902K395n8746k2452R4251n7607M1240J59599J07614o9284j23547j06335
11085H2030l661J13881J09427P7398n3865k21395q7387K8732l0152j766l4888
11074b1646l7539K0781J49322N3385o7606l9291n1010L988J18144J0802n9653
$$ plain form
11063 79677 27072 120320 133415 156390 162526 297747 288151 164014 100605 215533 255055
11052 255055 255022 195177 271796 318197 280850 406350 504809 619629 659716 768157 837240
11041 837240 750625 622541 557765 511419 676058 945648 1079621 1162686 1295549 1430572
11031 1430572 1423319 1219796 985455 930308 970219 971931 1001328 1224245 1554483 1717651 1844866
11020 1844866 1828431 1784752 1547189 1210077 1130396 1110271 1059741 1143376 1254500 1194053 1180243
11009 1180243 1192459 1266385 1281820 1080823 892959 860930 749197 623868 650978 645012 701215
10998 701215 791520 849451 812596 703402 605627 377897 220869 144404 252954 376980
10988 376980 415568 352076 182012 52635 109675 77725 38041 -5831 3652 -70787 -14891
$$ packed form
11063G9677n2605R3248J3095K2975O136J35221r596j24137o3409J14928L9522
11052B55055l3n9845P6619M6401l7347J25500R8459J14820M0087J08441O9083
11041H37240q6615j28084o4776m6346J64639K69590J33973Q3065J32863J35023
11031A430572p253k03523k34341n5147L9911J712K9397K22917L30238J63168J27215
11020A844866j6435m3679k37563l37112p9681k0125n0530Q3635J11124o0447j3810
11009A180243J2216P3926J5435k00997j87864l2029j11733j25329K7110n966N6203
10998G01215R0305N7931l6855j09194r7775k27730j57028p6465J08550J24026
10988C76980L8588o3492j70064j29377N7040l1950l9684m3872R483p4439N5896
$$ plain form
10977 -14891 100726 172842 123224 64932 107897 180910 131722 12671 -20219 76056 124620
10966 124620 130677 112792 86053 139961 161889 87667 37996 72010 26926 -53682 -116492 42993
10954 42993 38281 -120904 -228108 -203192 -118642 -66960 71112 161830 187376 26633 -63291
10943 -63291 3940 -8934 -89076 -61563 28717 42381 156488 208748 194782 164161 124783
10932 124783 79349 -118295 -179081 -174441 -132245 -185875 -194229 -143168 9147 42974 -3750
10921 -3750 81093 71213 102063 69915 -49625 -15113 59464 63527 -3188 -44922 -110351 -82331
10909 -82331 -49205 75831 230299 163471 4999 -48910 -27195 101448 79300 -28220 -65541
10898 -65541 -64356 -96120 -52405 118089 122450 114794 60351 67863 119761 52438 -19963 73730
$$ packed form
10977a4891J15617P2116m9618n8292M2965P3013m9188j19051l2890R6275M8564
10966A24620O057j7885k6739N3908K1928p4222m9671L4014m5084q0608o2810J59485
10954D2993m712j59185j07204K4916Q4550N1682J38072R0718K5546j60743q9924
10943f3291O7231j2874q0142K7513R0280J3664J14107N2260j3966l0621l9378
10932A24783m5434j97644o0786M640M2196n3630q354N1061J52315L3827m6724
10921c750Q4843r880L0850l2148j19540L4512P4577M063o6715m1734o5429K8020
10909h2331L3126J25036J54468o6828j58472n3909K1715J28643k2148j07520l7321
10898f5541J185l1764M3715J70494M361p656n4443P512N1898o7323p2401R3693
$$ plain form
10886 73730 146176 125591 127778 204140 260159 141057 79812 124747 57861 -101260 -13480
10875 -13480 137901 75575 19232 -87960 -87360 -46808 103263 155683 49208 -104894 -139654
10864 -139654 -122318 -70685 -58686 -27648 43548 83732 150318 124852 219034 195913 189308 109530
10852 109530 105565 112601 103534 162824 160371 63014 -28357 136978 221512 153978 252855 290551
10840 290551 246780 144067 -38919 3039 75334 147122 185537 257802 110044 -30672 -12449
10829 -12449 10407 -119979 -122556 -59781 69216 45067 -14002 -63234 -67317 -152202 -69895 -64196
10817 -64196 -100600 -258809 -369611 -279139 -206450 -169220 -126940 -65886 -51218 -63910 -57797
10806 -57797 -43631 -68037 -145462 -117482 -110610 -134690 -101622 -162141 -118372 -179694 -216105 -124423
$$ packed form
10886G3730P2446k0585K187P6362N6019j19102o1245M4935o6886j59121Q7780
10875a3480J51381o2326n6343j07192O00M0552J50071N2420j06475j54102l4760
10864a39654J7336N1633J1999L1038P1196M0184O6586k5466R4182k3121o605p9778
10852A09530l965P036r067N9290k453r7357r1371J65335Q4534o7534R8877L7696
10840B90551m3771j02713j82986M1958P2295P1788L8415P2265j47758j40716J8223
10829a2449K2856j30386k577O2775J28997k4149n9069m9232m083q4885Q2307N699
10817f4196l6404j58209j10802R0472P2689L7230M2280O1054J4668j2692O113
10806e7797J4166k4406p7425K7980O872k4080L3068o0519M3769o1322l6411R1682
$$ plain form
10794 -124423 12404 -20421 -131272 -214878 -137223 -143225 -156973 -200187 -154249 -128822 -46813
10783 -46813 -92858 -160638 -126045 -132208 -79492 -83241 -160499 -65933 46850 70587 37785 -26470
10771 -26470 -32332 22678 -73233 -83744 -25454 -27029 -128897 -170658 -183433 -252906 -254653 -191434
10759 -191434 -183943 -200665 -127170 -108887 -276664 -348144 -218239 -282355 -417241 -394654 -316408
10748 -316408 -287259 -211091 -207943 -209215 -133950 -178132 -104701 2730 101228 54416 -73994
10737 -73994 -37753 -34009 -131172 -120388 -49282 2154 -14119 92134 126387 50647 -187769
10726 -187769 -256262 -242682 -247436 -228641 -208674 -184601 -167592 -77315 -5609 44741 -13295 -4199
10714 -4199 -52779 -68610 -80511 -175641 -258481 -227399 -151920 -118923 -135245 -148023 -233465 -257594
$$ packed form
10794a24423J36827l2825j10851q3606P7655o002j3748m3214M5938K5427Q2009
10783d6813m6045o7780L4593o163N2716l749p7258R4566J12783K3737l2802o4255
10771b6470n862N5010r5911j0511N8290j575j01868m1761j2775o9473j747O3219
10759a91434P491j6722P3495J8283j67777p1480J29905o4116j34886K2587P8246
10748c16408K9149P6168L148j272P5265m4182P3431J07431R8498m6812j28410
10737g3994L6241L744r7163J0784P1106N1436j6273J06253L4253p5740k38416
10726a87769o8493J3580m754J8795J9967K4073J7009R0277P1706N0350n8036R096
10714d199m8580j5831j1901r5130q2840L1082P5479L2997j6322j2778q5442k4129
$$ plain form
10702 -257594 -210133 -274136 -259946 -208987 -95759 -274165 -427845 -370206 -326340 -367473 -403778
10691 -403778 -394898 -331420 -199231 -150259 -200647 -211940 -284826 -300035 -229621 -247895 -174082
10680 -174082 -181128 -205279 -226395 -229479 -165120 -143680 -214361 -243499 -168132 -77357 -58025 -86157
10668 -86157 -122946 -103361 -68942 54080 90047 43065 56186 118017 165758 121900 146055
10657 146055 146916 170565 180614 164251 241090 264370 250081 347010 366355 410715 362356 494441
10645 494441 707885 773991 807041 1041093 1350167 1574132 1698991 1859415 2083052 2354595
10635 2354595 2698465 3058709 3488864 4105253 4733126 5226421 5731613 6293337 6977243
10626 6977243 7884530 9027451 10657708 12903494 15841879 20014522 25906817 33822703
$$ packed form
10702b57594M7461o4003J4190N0959J13228j78406j53680N7639M3866m1133l6305
10691d03778Q880O3478J32189M8972n0388j1293p2886j5209P0414j8274P3813
10680a74082p046k4151k1116l084O4359K1440p0681k9138P5367R0775J9332k8132
10668h6157l6789J9585L4419J23022L5967m6982J3121O1831M7741m3858K4155
10657A46055Q61K3649J0049j6363P6839K3280j4289R6929J9345M4360m8359J32085
10645D94441K13444O6106L3050K34052L09074K23965J24859J60424K23637K71543
10635B354595L43870L60244M30155O16389O27873M93295N05192N61724O83906
10626F977243R07287J142921J630257K245786K938385M172643N892295P915886
$$ plain form
10618 33822703 44240860 57480886 73072876 88250378 98765579 102077370 99127765
10611 99127765 93695292 89543303 89168891 93882250 104710100 122949050 149147364 180947720
10603 180947720 210705278 227401509 224815051 207533316 186365707 169946841 162149284
10596 162149284 163986631 176406931 200124972 234579886 275015499 309299958 321648516
10589 321648516 305456926 269732757 230430836 198775313 178122733 168518344 169046447
10582 169046447 179007360 196868357 218100281 233701783 233507788 214446903 183910461
10575 183910461 152909138 128444034 112018793 102464344 98850861 99921784 104206954
10568 104206954 109418685 111444096 106806724 95334556 79840642 64360607 51329895
$$ packed form
10618C3822703J0418157J3240026J5591990J5177502J0515201L311791k949605
10611I9127765n432473m151989l74412M713359J0827850J8238950K6198314L1800356
10603A80947720K9757558J6696231k586458j7281735k1167609j6418866p797557
10596A62149284J837347J2420300K3718041L4454914M0435613L4284459J2348558
10589C21648516j6191590l5724169l9301921l1655523k0652580r604389N28103
10582A69046447R960913J7860997K1231924J5601502j93995j9060885l0536442
10575A83910461l1001323k4465104j6425241r554449l613483J070923M285170
10568A04206954N211731K025411m637372j1472168j5493914j5480035j3030712
$$ plain form
10561 51329895 41223877 33752737 28190187 23973207 20699218 18337630 16489944 14797168
10553 14797168 13491878 12334714 11307885 10301963 9489958 8764696 8141667 7667152 7132505
10544 7132505 6774150 6549993 6208180 5842964 5475767 5205621 4946939 4805944 4525811
10535 4525811 4388448 4229606 4026386 3741106 3530374 3421035 3350272 3293236 3123731 3007490
10525 3007490 2894666 2820926 2814689 2765051 2649123 2615340 2652408 2552817 2483627 2423274 2459236
10514 2459236 2385843 2173177 2221664 2217279 1909689 1874097 1939107 1927483 1916767 1870012 1902970
10503 1902970 1934549 1996490 1998303 1947558 1870215 1821510 1752359 1753093 1759028 1768686 1728632 1643371
10491 1643371 1581027 1516925 1654824 1576892 1503917 1431497 1424464 1415389 1569211 1615970 1658147
$$ packed form
10561E1329895j0106018p471140n562550m216980l273989k361588j847686j692776
10553A4797168j305290j157164j026829j005922q12005p25262o23029m74515n34647
10544G132505l58355k24157l41813l65216l67197k70146k58682j40995k80133
10535D525811j37363j58842k03220k85280k10732j09339p0763n7036j69505j16241
10525C007490j12824p3740o237m9638j15928l3783L7068r9591o9190o0353L5962
10514B459236p3393k12666M8487m385l07590l5592O5010j1624j0716m6755L2958
10503A902970L1579O1941J813n0745p7343m8705o9151P34N935R658m0054q5261
10491A643371o2344o4102J37899p7932p2975p2420p033r075J53822M6759M2177
$$ plain form
10480 1658147 1649711 1517741 1585502 1639133 1509985 1325311 1254935 1180202 1230000 1194556 1095755
10469 1095755 1114775 1248939 1419589 1476741 1468525 1333790 1210801 1115174 942079 886466
10459 886466 767470 850490 1044322 1090691 1118936 1126752 1039317 1041200 970556 928561 875660
10448 875660 988009 1027530 930637 1020984 1024618 1017132 1046087 939425 727831 785055 896400
10437 896400 930090 667959 477122 439131 607254 692967 606476 592306 714225 677268 655683
10426 655683 761083 783987 825600 760204 741943 668133 626093 668581 630724 534688 515272
10415 515272 574266 653932 571561 598498 654611 597259 499232 517187 595438 700068 695807
10404 695807 600789 529752 463652 419367 511289 525450 610148 662700 439245 356298 415552
$$ packed form
10480A658147q436j31970O7761N3631j29148j84674p0376p4733M9798l5444r8801
10469A095755J9020J34164J70650N7152q216j34735j22989r5627j73095n5613
10459H86466j18996Q3020J93832M6369K8245P816q7435J883p0644m1995n2901
10448H75660J12349L9521r6893R0347L634p486K8955j06662k11594N7224J11345
10437H96400L3690k62131j90837l7991J68123Q5713q6491j4170J21919l6957k1585
10426F55683J05400K2904M1613o5396j8261p3810m2040M2488l7857r6036j9416
10415E15272N8994P9666q2371K6937N6113n7352r8027J7955P8251J04630m261
10404F95807r5018p1037o6100m4285R1922J4161Q4698N2552k23455q2947N9254
$$ plain form
10393 415552 449774 446585 529934 564553 479790 294769 328531 440035 527860 566916 620075
10382 620075 572318 468490 521441 465227 401619 376102 396438 406968 391048 363059 385010
10371 385010 426968 533953 399116 408093 368823 367046 398098 432727 392053 436354 404896
10360 404896 430637 501189 421330 377812 496016 542656 447133 394794 469718 359710 362016
10349 362016 344093 410038 445320 527297 482008 417257 399559 460581 619795 616304 560536
10338 560536 548161 500358 456139 401645 327635 294291 303480 252936 74874 68830 168746 221143
10326 221143 253635 193566 236513 325827 338937 167294 140901 147395 128811 276492 379945
10315 379945 260700 110669 154163 171127 133761 121575 159327 195886 221538 255651 333818
$$ packed form
10393D15552L4222l189Q3349L4619q4763j85021L3762J11504Q7825L9056N3159
10382F20075m7757j03828N2951n6214o3608k5517K0336J0530j5920k7989K1951
10371C85010M1958J06985j34837Q977l9270j777L1052L4629m0674M4301l1458
10360D04896K5741P0552p9859m3518J18204M6640r5523n2339P4924j10008K306
10349C62016j7923O5945L5282Q1977m5289o4751j7698O1022J59214l491n5768
10338E60536j2375m7803m4219n4494p4010l3344R189n0544j78062o044R9916N2397
10326B21143L2492o0069M2947Q9314J3110j71643k6393O494j8584J47681J03453
10315C79945j19245j50031M3494J6964l7366j2186L7752L6559K5652L4113P8167
$$ plain form
10304 333818 364956 407366 504708 425739 279613 150681 76804 111820 100714 108226 137770
10293 137770 138996 177040 155957 184467 283949 268975 239763 233834 197938 220603 216769 230310
10281 230310 224444 231197 238050 234864 282321 254200 307515 316039 238666 289914 266499 233067
10269 233067 118618 83082 192376 244748 222225 243380 366505 405244 342587 303009 342160
10258 342160 382661 459145 419391 322715 295784 201749 209889 204770 225639 238516 204363 175614
10246 175614 140791 52310 146380 38633 403 122144 200628 170173 121623 -33175 -102111
10235 -102111 -71460 -66177 57928 126232 194856 88604 12117 64329 132929 86852 134157
10224 134157 268335 215219 308274 386616 369215 365137 313244 294309 373663 395719 289414
$$ packed form
10304C33818L1138M2410R7342p8969j46126j28932p3877L5016j1106P512K9544
10293A37770J226L8044k1083K8510R9482j4974k9212n929l5896K2665l834J3541
10281B30310n866O753O853l186M7457k8121N3315Q524p7373N1248k3415l3432
10269B33067j14449l5536J09294N2372k2523K1155J23125L8739o2657l9578L9151
10258C42160M0501P6484l9754r6676k6931r4035Q140n119K0869J2877l4153k8749
10246A75614l4823q8481R4070j07747l8230J21741P8484l0455m8550j54798o8936
10235a02111L0651N283J24105O8304O8624j06252p6487N2212O8600m6077M7305
10224A34157J34178n3116R3055P8342j7401m078n1893j8935P9354K2056j06305
$$ plain form
10213 289414 110928 96796 157248 163284 242480 260528 238349 176170 95997 146105 195933
10202 195933 148594 253345 292424 372098 348758 281543 275055 166442 102093 70782 61601
10191 61601 -16234 28665 69425 61692 233659 354783 385072 518881 504437 413796 462016
10180 462016 592498 632265 663261 748267 866861 868043 847235 810926 732382 778463 825419
10169 825419 929763 1079210 1230398 1348953 1470427 1426045 1235534 1156788 1017737 896223
10159 896223 1009482 1059005 1151331 1399465 1600083 1859351 1919174 1700155 1515731 1357192
10149 1357192 1287474 1179290 1157739 1280480 1250174 1224047 1151617 1214606 1302304 1292726 1139408
10138 1139408 939405 731913 605301 519465 472608 540283 580378 494182 562916 527463 546653
$$ packed form
10213B89414j78486j4132O0452O036P9196J8048k2179o2179q0173N0108M9828
10202A95933m7339J04751L9079P9674k3340o7215o488j08613o4349l1311r181
10191F1601p7835M4899M0760p733J71967J21124L0289J33809j4444r0641M8220
10180D62016J30482L9767L0996Q5006J18594J182k0808l6309p8544M6081M6956
10169H25419J04344J49447J51188J18555J21474m4382j90511p8746j39051j21514
10159H96223J13259M9523R2326K48134K00618K59268N9823k19019j84424j58539
10149A357192o9718j08184k1551J22741l0306k6127p2430O2989Q7698r578j53318
10138A139408k00003k07492j26612q5836m6857O7675M0095q6196O8734l5453J9190
$$ plain form
10127 546653 458582 373058 358886 354635 259351 211786 296055 286764 249488 374759 428205 375301
10115 375301 301805 180891 174734 150469 251728 189234 120888 144404 124966 149846 185499
10104 185499 85729 58480 23817 -38628 -125314 -3974 234390 289173 261010 231770 185666
10093 185666 142955 246715 205951 123106 98162 35841 13078 54229 139459 151960 117441
10082 117441 56821 2942 37524 9390 -55444 38495 20101 152826 156037 200231 183838
10071 183838 169482 49791 -35787 -43975 -26947 58528 -88128 -123268 -47938 11002 51185
10060 51185 -8089 -26919 -5637 191357 309348 243091 133362 180877 161578 118594 108432
10049 108432 115834 177064 139539 102601 16321 14055 -9775 -161052 -154027 -62557 -24866 94451
$$ packed form
10127E46653q8071q5524j4172m251r5284m7565Q4269r291l7276J25271N3446n2904
10115C75301p3496j20914o157k4265J01259o2494o8346K3516j9438K4880L5653
10104A85499r9770k7249l4663o2445q6686J21340K38364N4783k8163k9240m6104
10093A85666m2711J03760m0764q2845k4944o2321k2763M1151Q5230J2501l4519
10082A17441o0620n3879L4582k8134o4834R3939j8394J32725L211M4194j6393
10071A83838j4356j19691q5578q188J7028Q5475j46656l5140P5330N8940M0183
10060E1185n9274j8830K1282J96994J17991o6257j09729M7515j9299m2984j0162
10049A08432P402O1230l7525l6938q6280k266k3830j51277P025R1470L7691J19317
$$ plain form
10037 94451 105187 49611 20314 20799 -55598 -100763 -71879 -29125 118801 186108 73432 -5507
10025 -5507 -34831 -52758 -65375 -12988 144912 129022 56944 22235 35893 32982 -28660 -139146
10013 -139146 -142228 -43574 -12531 8261 58669 175895 178399 144387 16491 -50824 -11522
10002 -11522 59311 148824 139742 22389 -10999 58924 64491 221453 179785 115660 204362 290834
9990 290834 309457 280539 247285 323449 453579 396644 369125 319477 240921 205534 226062
9979 226062 182158 121975 124995 115241 -42178 -70822 -59686 140022 296929 164531 -55898
9968 -55898 49004 84053 120457 180774 75644 148458 170491 34721 -3948 12911 2393
9957 2393 -28583 -34362 -90981 -93374 -38411 56787 129460 64464 85340 38329 -69912 -31945
$$ packed form
10037I4451J0736n5576k9297M85p6397m5165K8884M2754J47926O7307j12676p8939
10025e507k9324j7927j2617N2387J57900j5890p2078l4709J3658k911o1642j10486
10013a39146l082R8654L1043K0792N0408J17226K504l4012j27896o7315L9302
10002a1522P0833Q9513r082j17353l3388O9923N567J56962m1668o4125Q8702Q6472
9990B90834J8623k8918l3254P6164J30130n6935k7519m9648p8556l5387K0528
9979B26062m3904o0183L020r754j57419k8644J1136J99708J56907j32398k20429
9968e5898J04902L5049L6404O0317j05130P2814K2033j35770l8669J6859j0518
9957B393l0976n779n6619k393N4963R5198P2673o4996K0876m7011j08241L7967
$$ plain form
9945 -31945 -50616 -49235 -46208 19879 69256 -13615 -16468 75 18406 15242 113463 143086 120226
9932 120226 150358 363858 657554 844235 741117 482294 283486 304273 330372 164384
9922 164384 13935 5579 -47802 -50868 -33937 93095 92252 96294 201823 227065 95108 -7641
9910 -7641 -50059 -34609 -16776 -80915 115061 141480 126364 127769 138839 161316 107244 124195
9898 124195 200972 263087 275948 289844 263111 127671 163387 94908 115708 219009 175079
9887 175079 107089 125831 157546 147356 122777 192355 168238 94792 50618 -42361 -115536 -107388
9875 -107388 -193616 -169685 -120784 -76515 -72901 -5591 154481 112726 100459 84811 102674 289093
9863 289093 328003 144507 -69366 -31761 5797 69185 133286 49069 20402 82017 -6056
$$ packed form
9945c1945j8671J381L027O6087M9377q2871k853J6543J8331l164R8221K9623k2860
9932A20226L0132K13500K93696J86681j03118k58823j98808K0787K6099j65988
9922A64384j50449q356n3381l066J6931J27032q43M042J05529K5242j31957j02749
9910g641m2418J5450J7833o4139J95976K6419j5116J405J1070K2477n4072J6951
9898A24195P6777O2115J2861J3896k6733j35440L5716o8479K0800J03301m3930
9887A75079o7990J8742L1715j0190k4579O9578k4117p3446m4174r2979p3175Q148
9875a07388q6228K3931M8901M4269L614O7310J60072m1755j2267j5648J7863J86419
9863B89093L8910j83496k13873L7605L7558O3388O4101q4217k8667O1615q8073
$$ plain form
9852 -6056 -100989 -87783 -38378 -37468 -32688 -45150 -145007 -52009 20781 -19620 -4947 6450 -25418
9839 -25418 -20297 -27961 -114939 -151470 -114283 -132347 -191552 -133416 -155867 -113797 -126473 -123121
9827 -123121 -12457 32189 -13540 -19060 72535 148157 92454 11339 -65193 -85624 -42853 -30273
9815 -30273 98740 144885 82880 48070 183191 204356 20945 -35242 -95142 -28970 105249
9804 105249 34761 -157959 -181013 -146172 -131575 -98919 -158059 -128154 -32471 16562 4522
9793 4522 -33903 -87170 -94159 -53872 138274 147175 20435 -27121 27405 47036 44507 58932
9781 58932 -33762 -78421 -40565 -53411 19132 190100 190391 119276 188847 68360 -50217 -91009
9769 -91009 -80758 48011 128994 78900 107325 114345 11245 -137582 -213695 -126681 -34649
$$ packed form
9852f056r4933J3206M9405R10M780j2462r9857R2998P2790m0401J4673J1397l1868
9839b5418N121p664q6978l6531L7187j8064n9205N8136k2451M2070j2676L352
9827a23121J10664M4646m5729n520R1595P5622n5703q1115p6532k0431M2771J2580
9815c0273J29013M6145o2005l4810J35121K1165j83411n6187n9900O6172J34219
9804A05249p0488j92720k3054L4841J4597L2656n9140K9905R5683M9033j2040
9793D522l8425n3267o989M0287J92146Q901j26740m7556N4526J9631k529J4425
9781E8932r2694m4659L7856j2846P2543J70968K91p1115O9571j20487j18577m0792
9769i1009J0251J28769Q0983n0094K8425P020j03100j48827p6113Q7014R2032
$$ plain form
9758 -34649 -32556 -125108 -247029 -65862 60479 61024 -35572 -116 36671 68216 44458 58786
9746 58786 121211 31770 71315 14458 -50106 -91007 -60408 43469 132895 213357 101807
9735 101807 66815 152602 158221 98318 97922 30410 73283 93779 -29160 -64812 -126892 -120161
9723 -120161 -137685 -39396 203501 247239 122247 -26244 -106163 -163209 -218977 -196904 72990
9712 72990 177209 149424 95469 45387 18048 14102 -2117 -11930 -12112 -10116 -37300 -14444 -48743
9699 -48743 -69077 43613 113997 123827 127689 141521 161222 53863 -36391 -31858 71217 228527
9687 228527 204558 144804 137717 67470 47856 125279 23954 -149430 -77563 33696 -6046
9676 -6046 -22621 -66535 -80169 -13964 -45201 -93228 -34541 -56193 -80758 -13277 -72978 -92758
$$ packed form
9758c4649K093r2552j21921J81167J26341N45r6596L5456L6787L1545k3758J4328
9746E8786O2425q9441L9545n6857o4564m0901L0599J03877Q9426Q0462j11550
9735A01807l4992Q5787N619n9903l96o7512M2873K0496j22939l5652o2080O731
9723a20161j7524R8289K42897M3738j24992j48491p9919n7046n5768K2073K69894
9712G2990J04219k7785n3955n0082k7339l946j6219r813j82J996k7184K2856l4299
9699d8743k0334J12690P0384R830L862J3832J9701j07359r0254M533J03075J57310
9687B28527k3969n9754p087p0247j9614P7423j01325j73384P1867J11259l9742
9676f046j6575m3914j3634O6205l1237m8027N8687k1652k4565O7481n9701j9780
$$ plain form
9664 -92758 -140280 -122197 -64956 35112 29917 40419 76075 159846 421042 722811 1006999
9653 1006999 1536039 2197980 2145941 1705484 1188241 662610 359845 203101 123267 202701
9643 202701 210005 195541 89248 8885 -130224 -130847 21482 65864 -32709 19558 43700 51335
9631 51335 8714 -37409 -53025 -97329 -122704 -66026 -87536 -22601 121889 24866 -107551
9620 -107551 -77432 -4946 -18041 -11894 -199375 -319416 -216903 -99905 -131560 -50754 -19445
9609 -19445 105687 109401 48747 45449 -46890 -171705 -193578 -121071 -27964 41502 33170 109358
9597 109358 42664 14210 76424 163810 201587 246309 152458 58519 -13508 -60195 22045 88549
9585 88549 -5442 44019 86429 76066 103484 117200 152269 89024 -28221 -30356 -26780 -12490
$$ packed form
9664i2758m7522J8083N7241J00068n195J0502L5656Q3771K61196L01769K84188
9653A006999N29040O61941n2039m40457n17243n25631l02765j56744p9834P9434
9643B02701P304j4464j06293q0363j39109o23J52329M4382r8573N2267K4142P635
9631E1335m2621m6123j5616m4304k5375N6678k1510O4935J44490r7023j32417
9620a07551L0119P2486j3095O147j87481j20041J02513J16998l1655Q0806L1309
9609a9445J25132L714o0654l298r2339j24815k1873P2507R3107O9466q332P6188
9597A09358o6694k8454O2214Q7386L7777M4722r3851r3939p2027m6687Q2240O6504
9585H8549r3991M9461M2410j0363K7418J3716L5069o3245j17245k135L576J4290
$$ plain form
9573 -12490 -47991 -111165 -101200 -2290 107450 161174 157372 188121 196329 210036 308003 294756
9561 294756 73164 -44168 -101670 -50767 20893 56073 43194 56285 96866 150631 138233
9550 138233 -85164 -209474 -148340 7614 37705 -408 38683 78211 76203 76494 156358 140239
9538 140239 147870 90723 35169 70462 29352 8891 -74462 -58076 107274 63540 97524 136951
9526 136951 140638 128006 165669 73322 110239 82128 -10276 55997 3123 -66657 -117121 -46437
9514 -46437 35681 -9409 -63516 -58286 -28794 -72966 -80450 -121476 -271869 -340623 -232875 -122299
9502 -122299 -35551 31517 28047 -94633 -211211 -82840 -3210 -135550 -126418 -78577 -225971
9491 -225971 -298162 -195227 -70776 -4507 -35499 -47936 -67359 -40673 -107096 -79622 -8824
$$ packed form
9573a2490l5501o3174R965R8910J09740N3724l802L0749Q208J3707R7967j3247
9561B94756k21592j17332n7502N0903P1660L5180j2879J3091M0581N3765j2398
9550A38233k23397j24310O1134J55954L0091l8113L9091L9528k008K91P9864j6119
9538A40239P631n7147n5554L5293m1110k0461q3353J6386J65350m3734L3984L9427
9526A36951L687j2632L7663r2347L6917k8111r2404O6273n2874o9780n0464P0684
9514d6437Q2118m5090n4107N230K9492m4172p484m1026j50393o8754J07748J10576
9502a22299Q6748O7068l470j22680j16578J28371P9630j32340R132M7841j47394
9491b25971p2191J02935J24451O6269l0992j2437j9423K6686o6423K7474P0798
$$ plain form
9480 -8824 -59400 -100500 -90320 81560 89636 9982 19223 -79942 -97047 -88844 -117834 -76798
9468 -76798 20799 -4066 -101802 -84216 -60818 -19644 -104823 -104138 -78595 -87511 -13181 -25501
9456 -25501 -50243 -43743 -102484 -40689 45627 62838 72127 15497 72266 139089 141991 165038
9444 165038 132212 31485 -47037 -38474 -79682 -64654 -15653 97886 61949 135840 188935
9433 188935 133869 165787 273094 167422 86797 103430 105818 72173 71477 4813 -162481 -211790
9421 -211790 -119356 -116133 -139800 -156423 -250385 -283500 -165970 -79357 92286 88917 -10326 -50175
9409 -50175 -19210 20324 -6274 -48305 22644 116033 12919 -45726 131263 221215 107681
9398 107681 -21587 -86626 -50427 -37103 -47303 -162477 -239828 -349636 -282857 -188701 -78786
$$ packed form
9480h824n0576m1100J0180J71880Q076p9654R241r9165j7105Q203k8990M1036
9468g6798R7597k4865r7736J7586K3398M1174q5179O85K5543q916P4330j2320
9456b5501k4742O500n8741O1795Q6316J7211R289n6630N6769O6823K902K3047
9444A65038l2826j00727p8522Q563m1208J5028M9001J13539l5937P3891N3095
9433A88935n5066L1918J07307j05672q0625J6633K388l3645o96o6664j67294m9309
9421b11790R2434L223k3667j6623r3962l3115J17530Q6613J71643l369r9243l9849
9409e0175L0965L9534k6598m2031P0949R3389j03114n8645J76989Q9952j13534
9398A07681j29268o5039L6199J3324j0200j15174p7351j09808O6779R4156J09915
$$ plain form
9387 -78786 -25438 -65579 -18558 18884 114617 10336 58423 77023 -8215 -109292 -81304
9376 -81304 -69447 13431 85363 129011 143367 13001 -5117 104948 76064 117215 147163
9365 147163 122834 35563 45583 77565 163114 125225 128674 189238 127226 20663 -22414 -39784
9353 -39784 -43562 -24116 -137164 -255843 -313283 -367003 -286759 -232419 -194315 -143267 -106255 -63128
9341 -63128 -125681 -79887 -31096 -44980 -103525 -61276 -111243 -99649 -49312 -20480 -22183 84561
9329 84561 6154 -135819 -155565 -68553 -35170 -2729 41964 12218 -9513 23379 -20317 -122745
9317 -122745 -130935 -94710 -88056 19922 72061 -19513 -55540 52967 58226 1886 77346 46936
9305 46936 46691 -28744 -99069 -61502 -20252 -47577 18153 23280 23983 -17725 -28747 -65343 -89
$$ packed form
9387g8786N3348m0141M7021L7442R5733j04281M8087J8600q5238j01077K7988
9376h1304J1857Q2878P1932M3648J4356j30366j8118J10065k8884M1151K9948
9365A47163k4329q7271J0020L1982Q5549l7889L449O0564o2012j06563m3077j7370
9353c9784l778J9446j13048j18679n7440n3720Q0244N4340L8104N1048L7012M3127
9341f3128o2553M5794M8791j3884n8545M2249m9967J1594N0337K8832j703J06744
9329H4561p8407j41973j9746Q7012L3383L2441M4693k9746k1731L2892m3696j02428
9317a22745q190L6225O654J07978N2139r1574l6027J08507N259n6340P5460l0410
9305D6936k45p5435p0325L7567M1250k7325O5730N127P03m1708j1022l6596O5254
$$ plain form
9292 -89 58244 54453 57435 -69466 -124064 -113649 -28130 9402 89975 68682 55311 133372 109571
9279 109571 20162 -125850 -199850 -374737 -416074 -283508 -179825 -82737 -4658 116982 154165
9268 154165 138460 162195 79038 159241 132178 84774 29034 4939 -3979 72245 79358 134455
9256 134455 166384 154426 32343 -31398 78163 181784 277343 197697 85203 38566 73488
9245 73488 46369 -44103 -79906 21735 31826 -36214 -119004 -38619 -18773 -12436 115947 125177
9233 125177 -73174 -210830 -107643 33659 -14353 -105763 -52941 8464 54155 65067 35048
9222 35048 -106359 -183206 -118850 -42354 73032 93038 29317 45998 -48775 -115241 -172772
9211 -172772 -130007 -52938 -2026 -1059 -157793 -148018 -40577 -63064 -89687 -63434 -101982 -27511
$$ packed form
9292h9N8333l791K982j26901n4598J0415Q5519L7532Q0573k1293j3371P8061k3801
9279A09571q9409j46012p4000j74887m1337J32566J03683R7088P8079J21640L7183
9268A54165j5705K3735q3157Q0203k7063m7404n5740k4095q918P6224P113N5097
9256A34455L1929j1958j22083o3741J09561J03621R5559p9646j12494m6637L4922
9245G3488k7119r0472l5803J01641J0091o8040q2790Q0385J9846O337J28383R230
9233A25177j98351j37656J03187J41302m8012r1410N2822O1405M5691J0912l0019
9222C5048j41407p6847O4356P6496J15386K0006o3721J6681r4773o6466n7531
9211a72772M2765P7069N0912R67j56734R775J07441k2487k6623K6253l8548P4471
$$ plain form
9199 -27511 -28245 -59185 -28550 89524 204000 129088 61896 28960 -223 40058 9985 -6717
9187 -6717 34424 888 56188 121039 37799 -121194 -159822 -182140 -37741 85494 102007
9176 102007 102621 109786 118229 21141 -40077 34543 57210 -54666 9886 124100 79525 31331
9164 31331 79750 204842 85506 -26768 -73867 -95530 -32 116189 148483 -21567 -121070
9153 -121070 -4388 31251 -34404 20633 125370 97784 73591 135763 16884 -155554 -55755
9142 -55755 58612 101182 53920 63203 195292 169705 239296 147556 18647 -28739 40291
9131 40291 63720 6577 45103 66972 182516 109876 -24393 -155577 -139697 -46521 -93910
9120 -93910 -173096 -195279 -16828 -9507 -96644 -44672 -8107 -94694 -77061 33646 34274 48377
$$ packed form
9199b7511p34l0940L0635J18074J14476p4912o7192l2936k9183M0281l0073j6702
9187f717M1141l3536N5300O4851q3240j58993l8628k2318J44399J23235J6513
9176A02007O14P165Q443r7088o1218P4620K2667j11876O4552J14214m4575m8194
9164C1331M8419J25092j19336j12274m7099k1663R5498J16221L2294j70050r9503
9153a21070J16682L5639o5655N5037J04737k7586k4193O2172j18879j72438R9799
9142e5755J14367M2570m7262R283J32089k5587O9591r1740j28909m7386O9030
9131D0291K3429n7143L8526K1869J15544p2640j34269j31184J5880R3176m7389
9120i3910p9186k2183J78451P321q7137N1972L6565q6587J7633J10707O28J4103
$$ plain form
9108 48377 30316 -32485 -8249 25563 -9050 -19670 15648 -51227 -123859 -118403 -80499 -130206
9096 -130206 -132031 -53649 20522 69540 11749 -250079 -214119 -119160 -102316 32173 2781
9085 2781 9361 9366 -32107 85026 107049 -79000 -207177 -267844 -118221 -98398 -52016 68053
9073 68053 144507 45769 9943 109611 177767 145814 140197 152576 136308 93531 49563 -16030
9061 -16030 -675 43334 115000 78389 49613 5376 4328 19496 -36253 -17355 -109707 -172165
9049 -172165 -174381 -295439 -104180 139593 257258 177009 77044 97519 -2114 -9121 28962
9038 28962 109846 63779 66265 -58900 -86956 -28195 89601 43312 -17225 -17186 -142764 -175195
9026 -175195 -110704 -53500 -19671 8803 27851 -14010 -36492 25931 1387 -62921 18886 15980
$$ packed form
9108D8377j8061o2801K4236L3812l4613j0620L5318o6875p2632N456L7904m9707
9096a30206j825P8382P4171M9018n7791k61828L5960R4959J6844J34489k9392
9085B781O580Nm1473J17133K2023j86049j28177o0667J49623J9823M6382J20069
9073F8053P6454r8738l5826R9668O8156l1953n617J2379j6268m2777m3968o5593
9061a6030J5355M4009P1666l6611k8776m4237j048J5168n5749J8898r2352o2458
9049a72165k216j21058J91259K43773J17665q0249r9965K0475r9633p007L8083
9038B8962Q0884m6067K486j25165k8056N8761J17796m6289o0537L9j25578l2431
9026a75195O4491N7204L3829K8474J9048m1861k2482O2423k4544o4308Q1807k906
$$ plain form
9014 15980 -82745 -116499 -73492 69261 116205 59682 21357 -148221 -203066 -138884 -88927
9003 -88927 -116963 -106355 -108717 -139458 -203477 -192136 -117700 -139003 -149488 -168093 -47337 83389
8991 83389 59470 15127 142305 125297 61391 35233 90705 138358 204230 228371 113439
8980 113439 -15826 -78132 -74286 6039 11943 -74792 -60606 123796 133171 110379 126232 -16010
8968 -16010 -54994 -59192 70662 162110 124213 56328 -23906 -30734 -67758 -68628 2436 -12348
8956 -12348 -49958 -62656 -95535 -16156 -29876 -16286 -13986 -2862 116633 117494 125820 -24111
8944 -24111 5835 34438 12867 -43218 -68173 -79766 66050 126187 132107 221597 206309 180618
8932 180618 158485 28712 -10917 -83507 -29895 43708 -52828 -162174 -80597 -23086 42947
$$ packed form
9014A5980r8725l3754M3007J42753M6944n6523l8325j69578n4845O4182M9957
9003h8927k8036J0608k362l0741o4019J1341P4436k1303j0485j8605J20756J30726
8991H3389k3919m4343J27178j7008o3906k6158N5472M7653O5872K4141j14932
8980A13439j29265o2306L846Q0325N904q6735J4186J84402R375k2792J5853j42242
8968a6010l8984m198J29854R1448l7897o7885q0234o828l7024q70P1064j4784
8956a2348l7610j2698l2879P9379j3720J3590K300J1124J19495Q61Q326j49931
8944b4111K9946K8603k1571n6085k4955j1593J45816O0137N920Q9490j5288k5691
8932A80618k2133j29773l9629p2590N3612P3603r6536j09346Q1577N7511O6033
$$ plain form
8921 42947 137525 87440 2115 -53027 -26167 -3385 117872 18058 -8362 36571 242299
8910 242299 229609 150124 24917 -56200 18710 151299 156771 208216 229491 273331 278450 178362
8898 178362 -12967 -106192 -30188 57516 122366 117856 177748 125672 37277 10374 -4369 -34366
8886 -34366 -42179 109449 236106 210399 138395 97723 102881 137915 183904 166996 121160 122546
8874 122546 168382 241318 300779 254088 303888 257294 179352 203014 167229 31420 58631
8863 58631 133469 1160 27543 237106 323890 184707 13723 25814 149577 228965 123728
8852 123728 60127 65048 33436 -91875 -42740 5978 -38455 -52350 -38194 -86277 -135076 -107810
8840 -107810 -66631 140638 204926 196995 177388 170636 325166 417495 528709 512875 383388
$$ packed form
8921D2947R4578n0085q5325n5142K6860K2782J21257r9814k6420M4933K05728
8910B42299j2690p9485j25207q1117P4910J32589N472N1445K1275M3840N119j00088
8898A78362j91329r3225P6004Q7704O4850m510N9892n2076q8395k6903j4743k9997
8886c4366p813J51628J26657k5707p2004m0672N158L5034M5989j6908m5836J386
8874A22546M5836P2936N9461m6691M9800m6594p7942K3662l5785j35809K7211
8863E8631P4838j32309K6383K09563Q6784j39183j70984J2091J23763P9388j05237
8852A23728o3601M921l1612j25311M9135M8718m4433j3895J4156m8083m8799K7266
8840a07810M1179K07269O4288p931j9607o752J54530R2329J11214j5834j29487
$$ plain form
8829 383388 327887 381205 225239 185754 214656 176948 216243 200172 137231 91655 54683
8818 54683 -14415 96044 113857 69950 116825 224996 263325 244725 254491 241582 173064 78468
8806 78468 48845 -5671 -25044 -29012 84497 168681 173006 168924 235143 116781 4413 -72509
8794 -72509 -65596 -131841 -108568 37422 193253 284753 257716 242097 273762 305651 319269 315088
8782 315088 154952 80774 77996 140356 200349 114827 62460 44629 33870 123210 197174 217549
8770 217549 242185 244147 199866 137259 142639 113801 208781 322634 378318 257371 66504
8759 66504 40117 143945 185683 109891 79619 84031 112418 121216 114633 69968 100140 169735
8747 169735 265023 310946 346329 266936 115372 95192 184245 183178 197850 224923 237599 298092
$$ packed form
8829C83388n5501N3318j55966l9485K8902l7708L9295j6071o2941m5576l6972
8818E4683o9098J10459J7813m3907M6875J08171L8329j8600R766j2909o8518r4596
8806G8468k9623n4516j9373l968J13509Q4184M325m082O6219j18362j12368p6922
8794g2509O913o6245K3273J45990J55831R1500k7037j5619L1665L1889J3618m181
8782C15088j60136p4178k778O2360N9993q5522n2367j7831j0759Q9340P3964K0375
8770B17549K4636J962m4281o2607N380k8838R4980J13853N5684j20947j90867
8759F6504k6387J03828M1738p5792l0272M412K8387Q798o583m4665L0172O9595
8747A69735R5288M5923L5383p9393j51564k0180Q9053j067J4672K7073J2676O0493
$$ plain form
8735 298092 452538 359511 229530 47311 -76404 -77289 45761 77806 131437 232942 171397
8724 171397 138035 73877 99072 1475 -10424 88520 200258 252181 283447 368635 244866
8713 244866 116784 26525 -10267 -48767 120549 164528 147519 68390 41697 75057 136374
8702 136374 206109 217797 100794 18157 76218 151073 224000 197662 144334 164238 159639 196828
8690 196828 208318 232247 280288 309391 255156 55285 -4206 78457 129463 112271 63376
8679 63376 91751 100886 85594 200692 214450 284616 264300 310318 429513 293263 106650
8668 106650 38815 57321 120242 185459 303218 313856 414281 455521 401972 300758 182823
8657 182823 216432 371868 476379 550226 526705 353829 296805 335201 434649 444332 468031
$$ packed form
8735B98092J54446r3027j29981j82219j23715q85J23050L2045N3631J01505o1545
8724A71397l3362o4158K5195r7597j1899R8944J11738N1923L1266Q5188j23769
8713B44866j28082r0259l6792l8500J69316M3979j7009p9129k6693L3360O1317
8702A36374O9735J1688j17003q2637N8061P4855P2927k6338n3328J9904m599L7189
8690A96828J1490K3929M8041K9103n4235j99871n9491Q2663N1006j7192m8895
8679F3376K8375R135j5292J15098J3758P0166k0316M6018J19195j36250j86613
8668A06650o7835J8506O2921O5217J17759J0638J00425M1240n3549j01214j17935
8657A82823L3609J55436J04511P3847k3521j72876n7024L8396R9448R683K3699
$$ plain form
8646 468031 451341 418826 387035 308609 329558 305556 382516 409268 301164 242371 278363
8635 278363 359378 240659 294616 311022 283175 272374 308258 305893 344580 373980 274436 295101
8623 295101 359187 377990 461890 410534 356066 301384 261659 240548 236241 258412 287209 392626
8611 392626 383759 381702 301577 453357 437469 267257 266290 331234 392430 460231 521775 559309
8599 559309 508217 314783 319571 508798 559203 571915 664705 678365 735425 740012 835730 935597
8587 935597 867738 833134 947146 907155 922443 1108679 1146002 1154857 1143091 1196803 1262532
8576 1262532 1290789 1407033 1438767 1445696 1365074 1400537 1397459 1334794 1266824 1019585 825297
8565 825297 802457 913051 977867 947577 883852 775824 808664 760371 566539 431611 428357
$$ packed form
8646D68031j6690l2515l1791p8426K0949k4002P6960K6752j08104n8793L5992
8635B78363Q1015j18719N3957J6406k7847j0801L5884k365L8687K9400r9544K0665
8623B95101O4086J8803Q3900n1356n4468n4682l9725k1111m307K2171K8797J05417
8611C92626q867k057q0125J51780j5888j70212r67O4944O1196O7801O1544L7534
8599E59309n1092j93434M788J89227N0405J2712R2790J3660N7060M587R5718R9867
8587I35597o7859l4604J14012l9991J5288J86236L7323Q855j1766N3712O5729
8576A262532K8257J16244L1734O929q0622L5463l078o2665o7970k47239j94288
8565H25297k2840J10594O4816l0290o3725j08028L2840m8293j93832j34928l254
$$ plain form
8554 428357 414145 523148 618795 560889 615593 604826 603167 642142 676358 656553 590931 570016
8542 570016 595653 539666 591865 586580 513627 396379 314192 299193 402274 539013 378566
8531 378566 392399 351155 243445 199660 152798 187562 74078 -11293 114373 229825 341135
8520 341135 479589 511582 515749 446157 446676 374885 394750 280725 203002 199499 264781 390056
8508 390056 464232 352093 359715 432322 333823 299516 276675 424120 389881 242039 217930
8497 217930 319913 298979 377244 462326 389666 340447 322019 200129 250481 258998 346429
8486 346429 383658 286276 245884 310019 378290 371964 438744 370458 348355 287428 267036 287164
8474 287164 298173 247592 219577 131568 92254 14485 -30110 50116 122454 691 -154963
$$ packed form
8554D28357j4212J09003R5647n7906N4704j0767j659L8975L4216j9805o5622k0915
8542E70016K5637n5987N2199n285p2953j17248q2187j4999J03081J36739j60447
8531C78566J3833m1244j07710m3785m6862L4764j13484q5371J25666J15452J11310
8520C41135J38454L1993M167o9592N19p1791J9865j14025p7723l503O5282J25275
8508C90056P4176j12139P622P2607r8499l4307k2841J47445l4239j47842k4109
8497B17930J01983k0934P8265Q5082p2660m9219j8428j21890N0352Q517Q7431
8486C46429L7229r7382m0392O4135O8271o326O6780o8286k2103o0927k0392K0128
8474B87164J1009n0581k8015q8009l9314p7769m4595Q0226P2338j21763j55654
$$ plain form
8463 -154963 -121593 -98871 -15941 34756 122667 31667 5825 249135 409394 437996 209234
8452 209234 125708 59404 -31600 -34239 -17364 -71848 -72846 34421 119765 61879 117735 185376
8440 185376 139341 177710 211401 310509 261892 196707 169457 23028 72657 130212 182759
8429 182759 288454 326965 147373 105449 153083 127075 28911 -39053 1575 -78698 -190051
8418 -190051 -129482 -77618 47501 208248 160634 116600 78366 -35968 -39261 -17814 -20559
8407 -20559 -49649 -102550 -141067 -72245 29828 49176 -1782 67692 80994 28134 99678 81720
8395 81720 155548 201120 174053 48104 14881 -29262 -9074 95382 237572 231800 170707
8384 170707 29933 -55319 -80002 -128424 -92410 9604 105535 155693 46713 138220 262711
$$ packed form
8463a54963L3370K2722Q2930N0697Q7911r1000k5842K43310J60259K8602k28762
8452B09234q3526o6304r1004k639J6875n4484r98J07267Q5344n7886N5856O7641
8440A85376m6035L8369L3691R9108m8617o5185k7250j46429M9629N7555N2547
8429A82759J05695L8511j79592m1924M7634k6008r8164o7964M0628q0273j11353
8418a90051O0569N1864J25119J60747m7614m4034l8234j14334l293K1447k745
8407b0559k9090n2901l8517O8822J02073J9348n0958O9474J3302n2860P1544j7958
8395H1720P3828M5572k7067j25949l3223m4143K0188J04456J42190n772o1093
8384A70707j40774q5252k4683m8422L6014J02014R5931N0158j08980R1507J24491
$$ plain form
8373 262711 73261 82833 122416 71237 22069 52676 -5788 -1436 24958 66309 209073 248938
8361 248938 165881 169969 98902 15914 15960 92975 147128 164984 110843 315455 484092 415553
8349 415553 364519 225536 24023 -69305 30902 71376 51955 44611 1884 -23202 -21857
8338 -21857 33379 57289 78647 64177 6100 26591 -40398 -37951 57651 -18511 -14720 -29121
8326 -29121 -9920 91649 -12027 -85131 -5558 38249 102279 29874 18370 100649 178304
8315 178304 72585 66253 48439 38494 56310 -20247 -46747 28133 182315 388867 400101
8304 400101 226167 109728 139670 186305 177061 86360 76787 135643 69743 -20029 23071 78651
8292 78651 321400 645039 974955 1479684 2042064 2142449 1688141 1152373 705882 548411
$$ packed form
8373B62711j89450R572L9583n1179m9168L0607n8464M352K6394M1351J42764L9865
8361B48938q3057M088p1067q2988M6P7015N4153J7856n4141K04612J68637o8539
8349D15553n1034j38983k01513r3328J00207M0474j9421p344m2727k5086J345
8338b1857N5236K3910K1358j4470n8077K0491o6989K447R5602p6162L791j4401
8326b9121J9201J01569j03676p3104P9573M3807O4030p2405j1504Q2279P7655
8315A78304j05719o332j7814r945J7816p6557k6500P4880J54182K06552J1234
8304D00101j73934j16439K9942M6635r244r0701r573N8856o5900q9772M3100N5580
8292G8651K42749L23639L29916N04729N62380J00385m54308n35768m46491j57471
$$ plain form
8282 548411 647804 554416 511548 453396 405374 275048 126008 85282 79336 180748 185207
8271 185207 162273 105593 17783 -88421 11304 83289 115980 131231 54841 -39702 -67635
8260 -67635 -46536 120722 309321 287066 165499 244348 448099 575367 765919 1219111
8250 1219111 1822763 2130890 1972008 1508275 1004019 670707 374881 292673 165314 143070
8240 143070 96668 56224 47807 129164 226853 196218 76335 25927 46227 88102 166999 163722
8228 163722 67937 34284 71335 22803 -82938 -155933 -179219 -76934 -73840 741 28911
8217 28911 -85078 -260516 -253799 -190696 -59852 -167219 -198918 -167680 -165050 -189171 9603
8206 9603 43576 108257 149101 199446 235178 185022 61258 -106019 -66642 43113 106372
$$ packed form
8282E48411R9393r3388m2868n8152m8022j30326j49040m0726n946J01412M459
8271A85207k2934n6680q7810j06204R9725P1985L2691J5251p6390r4543k7933
8260f7635K1099J67258J88599k2255j21567P8849K03751J27268J90552M53192
8250A219111O03652L08127j58882m63733n04256l33312k95826q2208j27359k2244
8240A43070m6402m0444q417Q1357R7689l0635j19883n0408K0300M1875P8897l277
8228A63722r5785l3653L7051m8532j05741p2995k3286J02285L094P4581K8170
8217B8911j13989j75438O717O3103J30844j07367l1699L1238K630k4121J98774
8206I603L3973O4681M0844N0345L5732n0156j23764j67277L9377J09755O3259
$$ plain form
8195 106372 38875 -50567 -31267 60696 106303 -34208 -87159 -90824 -57511 -72110 -103991 -154980
8183 -154980 -120404 -108208 -35728 77518 144878 48270 -13422 56544 131161 150271 54711
8172 54711 -25349 97512 83834 12845 21936 -74116 -38072 28429 19420 63661 53577 157963
8160 157963 184776 177677 152661 151865 103629 18228 -112434 -94158 -20921 54551 124528 149893
8148 149893 147153 210640 173407 20859 -19556 119662 231901 202439 60644 -79131 -124620
8137 -124620 -57826 -57343 2746 25950 -13985 20607 84882 119238 79004 38828 -54742 -74203
8125 -74203 -46120 -118550 -84061 -138284 -88143 -105533 -156429 -150393 -139045 -174071 -267096 -257988
8113 -257988 -152306 41131 87430 101190 160314 101576 36300 58284 40712 -35840 -8624
$$ packed form
8195A06372o7497q9442J9300R1963M5607j40511n2951l665L3313j4599l1881n0989
8183a54980L4576J2196P2480J13246O7360r6608o1692O9966P4617J9110r5560
8172E4711q0060J22861j3678p0989R091r6052L6044O6501r009M4241j0084J04386
8160A57963K6813p099k5016p96m8236q5401j30662J8276P3237P5472O9977K5365
8148A49893k740O3487l7233j52548m0415J39218J12239k9462j41795j39775m5489
8137a24620O6794M83O0089K3204l9935L4592O4275L4356m0234m0176r3570j9461
8125g4203K8083p2430L4489n4223N0141j7390n0896O036J1348l5026r3025R108
8113b57988J05682J93437M6299J3760N9124n8738o5276K1984j7572p6552K7216
$$ plain form
8102 -8624 -1367 -97425 -20829 -17674 47359 76905 84898 100203 193703 73870 -36615 -41413
8090 -41413 -20222 -27355 42925 18131 93138 142544 152700 181701 140799 77718 106334 106451
8078 106451 82087 90564 99680 190934 123806 99274 56776 129658 208929 121100 46375 71645
8066 71645 161938 97803 90910 178564 152192 219096 213863 205412 158419 39109 26181 114724
8054 114724 199627 261944 307824 324681 266664 288331 309177 69671 -49716 -4126 -2646
8043 -2646 -29195 22598 113818 287457 261001 27425 11442 142511 220051 266757 257542 264189
8031 264189 315534 206442 259544 251293 147210 169243 361725 302682 295106 391159 500345
8020 500345 561311 484535 456938 334928 208654 239788 380243 423464 411683 345628 332199
$$ packed form
8102h624P257r6058P6596L155O5033K9546P993J5305R3500j19833j10485m798
8090d1413K1191p133P0280k4794P5007M9406J0156K9001m0902o3081K8616J17
8078A06451k4364Q477R116R1254o7128k4532m2498P2882P9271q7829p4725K5270
8066G1645R0293o4135o893Q7654k6372O6904n233q451m6993j19310j2928Q8543
8054A14724Q4903O2317M5880J6857n8017K1667K0846k39506j19387M5590J480
8043b646k6549N1793R1220J73639k6456k33576j5983J31069P7540M6706r215O647
8031B64189N1345j09092N3102q251j04083K2033J92482n9043p576R6053J09186
8020E00345O0966p6776k7597j22010j26274L1134J40455M3221j1781o6055j3429
$$ plain form
8009 332199 350332 331773 434112 476121 483726 413201 390857 414062 530734 508328 473288
7998 473288 428015 427510 300781 336308 514312 607153 725946 675774 628183 662005 525966
7987 525966 555333 653785 758323 695282 638517 608651 521745 476274 431342 444820 517930
7976 517930 503254 530624 658583 641917 496312 342374 327535 571092 546777 412168 396278
7965 396278 392773 307287 223645 202536 198035 277553 434159 431295 363291 401007 553265 569986
7953 569986 438729 386042 431914 504216 592698 657997 647310 611887 591575 592503 629420 576622
7941 576622 493340 586590 562045 512659 498618 494578 532037 451099 439273 569216 581878 533717
7929 533717 541595 488936 437260 314240 251328 253414 237089 194456 326642 411747 422522 267797
$$ packed form
8009C32199J8133j8559J02339M2009P605p0525k2344K3205J16672k2406l5040
7998D73288m5273n05j26729L5527J78004R2841J18793n0172m7591L3822j36039
7987E25966K9367R8452J04538o3041n6765k9866q6906m5471m4932J3478P3110
7976E17930j4676K7370J27959j6666j45605j53938j4839K43557k4315j34609j5890
7965C96278l505q5486q3642k1109m501P9518J56606k864o8004L7716J52258J6721
7953E69986j31257n2687M5872P2302Q8482O5299j0687l5423k0312R28L6917n2798
7941E76622q3282R3250k4545m9386j4041m040L7459q0938j1826J29943J2662m8161
7929E33717P878n2659n1676j23020o2912K086j6325m2633J32186Q5105J0775j54725
$$ plain form
7917 267797 272681 317431 248038 295956 283220 197990 10120 -172930 -163057 14728 57007
7906 57007 30745 -11247 -72113 14878 125642 111362 123665 159705 189704 292791 310113
7895 310113 323301 276073 258231 209555 276873 245702 298942 343199 284121 253829 248848 263918
7883 263918 294481 251536 310407 220782 240237 187871 116171 165149 157636 71582 61975 -82703
7871 -82703 -86841 -43153 -9334 104230 132370 248829 312286 222232 9471 -8839 -21168
7860 -21168 -25275 37807 92283 173203 216708 198034 249843 219959 162645 185844 171632 205008
7848 205008 206509 194085 173290 251365 324404 160057 90517 128890 131201 248321 361648
7837 361648 348482 381111 266319 159187 -15794 -3517 111661 127559 -2316 -18596 -15263
$$ packed form
7917B67797M884M4750o9393M7918j2736q5230j87870j83050R873J77785M2279
7906E7007k6262m1992o0866Q6991J10764j4280J2303L6040K9999J03087J7322
7895C10113J3188m7228j7842m8676O7318l1171N3240M4257n9078l0292m981J5070
7883B63918L0563m2945N8871q9625J9455n2366p1700M8978p513q6054r607j44678
7871h2703m138M3688L3819J13564K8140J16459O3457r0054k12761j8310j2329
7860b1168m107O3082N4476Q0920M3505j8674N1809k9884n7314K3199j4212L3376
7848B05008J501j2424k0795P8075P3039j64347o9540L8373K311J17120J13327
7837C61648j3166L2629j14792j07132j74981J2277J15178J5898j29875j6280L333
$$ plain form
7826 -15263 -6264 40690 105764 122792 57277 26461 94626 129925 65916 115783 140141 126671
7814 126671 70447 31127 -57424 -117351 -91539 -51244 -86687 701 101598 127446 106828
7803 106828 36938 -1923 100662 106671 77651 116813 52149 114211 95513 56957 -16460 98021
7791 98021 194256 99443 -73078 -158732 -153682 -137801 -177214 -171081 -26377 -16084 -18740 -2687
7779 -2687 -82507 -18503 -7492 -11730 -38030 -60072 -99945 -100405 -27829 -27421 -17002 -105515 -90140
7766 -90140 -117358 -90835 36520 25833 44565 57090 -11660 -2535 17699 -38617 -107481 -162093
7754 -162093 -112962 -56368 -21516 42534 54275 -18219 10827 105217 158257 183863 133394 82578
7742 82578 81146 -95372 -105499 -77913 -72050 -70642 -126008 -107899 -121989 -69434 95897 237303
$$ packed form
7826a5263Q999M6954O5074J7028o5515l0816O8165L5299o4009M9867K4358j3470
7814A26671n6224l9320q8551n9927K5812M0295l5443Q7388J00897K5848k0618
7803A06828o9890l8861J02585O009k9020L9162o4664O2062j8698l8556p3417J14481
7791I8021R6235r4813j72521q5654N050J5881l9413O133J44704J0293k656J6053
7779b687p9820O4004J1011m238k6300k2042l9873m60P2576M08J0419q8513J5375
7766i0140k7218K6523J27355j0687J8732J2525o8750R125K0234n6316o8864n4612
7754a62093M9131N6594L4852O4050J1741p2494K9046R4390N3040K5606n0469n0816
7742H2578j432j76518j0127K7586N863J408n5366J8109j4090N2555J65331J41406
$$ plain form
7730 237303 294372 323122 209809 167050 106294 -19639 -75028 -96339 -99151 -95590 -32516 28538
7718 28538 -28734 -35854 60529 4869 -79553 -59976 29481 36250 -58847 -33721 26788 33246
7706 33246 47295 119467 110479 64515 73702 46795 59963 65992 -3181 9068 95372 82023
7694 82023 74887 -27112 17908 92622 48230 83461 79005 -66673 -80895 -31745 34722 70022
7682 70022 40084 -17219 -164447 -273178 -142905 -70948 -28641 -188120 -296711 -181561 -13457
7671 -13457 133362 244594 149115 71044 -54239 -133402 -189723 -18962 16477 -42315 -49563
7660 -49563 -78557 -107390 -173866 -192071 -128864 -105613 -121801 -111689 32971 118096 119147 158745
7648 158745 58619 -73886 -134922 -139835 -151442 -41862 126252 110402 12520 17724 -55931
$$ packed form
7730B37303N7069K8750j13313m2759o0756j25933n5389k1311k812L561O3074O1054
7718B8538n7272p120R6383n5660q4422J9577Q9457O769r5097K5126O0509O458
7706C3246J4049P2172q988m5964R187k6907J3168O029o9173J2249Q6304j3349
7694H2023p136j01999M5020P4714m4392L5231m456j45678j4222M9150O6467L5300
7682G0022k9938n7303j47228j08731J30273P1957M2307j59479j08591J15150J68104
7671a3457J46819J11232r5479p8071j25283p9163n6321J70761L5439n8792p248
7660d9563k8994k8833o6476j8205O3207K3251j6188J0112J44660Q5125J051L9598
7648A58745j00126j32505o1036m913j1607J09580J68114j5850r7882N204p3655
$$ plain form
7637 -55931 -123149 -128549 -136037 -266575 -332804 -288865 -199633 -222127 -120927 -11186 -7057 3195
7625 3195 -17530 -11041 23441 -15405 64278 126103 108319 7853 12112 38271 -46128 -97209
7613 -97209 -118403 -87507 -74443 -231285 -264190 -224914 -148569 -171536 -156838 -158777 -168136 -270640
7601 -270640 -252434 -273948 -278229 -117040 -96087 -8304 34004 54655 -77435 -186841 -86160
7590 -86160 -28765 -101218 -23246 118413 174058 96114 13036 -68682 -69314 4762 41140 78027
7578 78027 54305 73808 -54915 -203167 -160361 -70724 1959 150874 93467 -7621 -53109
7567 -53109 -50176 -54140 -8787 18367 16129 -42374 33048 98669 13499 -65662 -136775 -105943
7555 -105943 -41781 -181254 -225689 -210100 -213728 -146222 -141839 -227303 -231238 -208095 -133732 -139548
$$ packed form
7637e5931o7218n400p488j30538o6229M3939Q9232k2494J01200J09741M129J0252
7625C195k0725O489L4482l8846P9683O1825j7784j00466M259K6159q4399n1081
7613i7209k1194L0896J3064j56842l2905L9276P6345k2967J4698j939r359j02504
7601b70640J8206k1514m281J61189K0953Q7783M2308K0651j32090j09406J00681
7590h6160N7395p2453P7972J41659N5645p7944q3078q1718o32P4076L6378L6887
7578G8027k3722J9503j28723j48252M2806Q9637P2683J48915n7407j01088m5488
7567e3109K933l964M5353K7154k238n8503P5422O5621q5170p9161p1113L0832
7555a05943O4162j39473m4435J5589l628O7506M383q5464l935K3143P4363n816
$$ plain form
7543 -139548 -76586 -13585 -20831 -48853 -49936 -130991 -174421 -76690 42793 84868 170530 194743
7531 194743 39463 6762 -48419 -22108 -66045 -30933 -4816 19252 -15174 -168906 -237887
7520 -237887 -178013 -123307 -150019 -217093 -160139 -52443 -31038 -91438 -187201 -228928 -311510
7509 -311510 -274939 -315670 -239744 -154307 -164028 -141351 -84124 -130046 -211080 -121037 -23387 26922
7497 26922 -16233 8702 37934 40716 169202 282117 160294 20806 -36543 -47271 -103492
7486 -103492 -148003 -243277 -218130 -235290 -67251 45999 -36893 7948 67508 131080 107081
7475 107081 -65297 -126324 -40579 -10722 -95946 -111304 -44997 -47256 -127301 -127543 -141901 -65898
7463 -65898 -67570 -4036 -14374 -47508 63248 10341 -106570 -259853 -227657 -228380 -279749 -152900
$$ packed form
7543a39548O2962O3001p246k8022j083q1055m3430R7731J19483M2075Q5662K4213
7531A94743j55280l2701n5181K6311m3937L5112K6117K4068l4426j53732o8981
7520b37887N9874N4706k6712o7074N6954J07696K1405o0400r5763m1727q2582
7509c11510L6571m0731P5926Q5437r721K2677N7227m5922q1034R0043R7650N0309
7497B6922m3155K4935K9232K782J28486J12915j21823j39488n7349j0728n6221
7486a03492m4511r5274K5147j7160J68039J13250q2892M4841N9560O3572k3999
7475A07081j72378o1027Q5745K9857q5224j5358O6307k259q0045k42j4358P6003
7463f5898j672O3534j0338l3134J10756n2907j16911j53283L2196p23n1369J26849
$$ plain form
7451 -152900 -83189 -271353 -384093 -336632 -172209 -151391 -308864 -276466 -174265 -124248 -147433
7440 -147433 -227004 -296477 -237743 -25180 170528 219826 47872 -40673 -38797 -84320 -28755
7429 -28755 -156444 -243840 -255767 -256997 -183716 -60186 41305 57162 59775 55919 72353 50075
7417 50075 35630 46437 -51328 -112110 -213192 -202382 -203549 -164059 -238498 -183021 -64602 -35938
7405 -35938 -85519 -49755 -25725 -118142 -206349 -276282 -321703 -188862 -55323 -47031 -177424
7394 -177424 -127274 -108292 -76673 -147973 -192158 -155714 -126479 -158911 -55227 19424 79176
7383 79176 46631 -72658 -93544 -64242 -26507 -11015 63165 99010 19846 -58154 -61740 -89280
7371 -89280 -95785 -81361 -20800 -23278 -20335 49050 59355 -28222 -88654 -196170 -186047 -215287
$$ packed form
7451a52900O9711j88164j12740M7461J64423K0818j57473L2398J02201N0017k3185
7440a47433p9571o9473N8734K12563J95708M9298j71954q8545J876m5523N5565
7429b8755j27689q7396j1927j230P3281J23530J01491J5857K613l856J6434k2278
7417E0075j4445J0807r7765o0782j01082J0810j167L9490p4439N5477J18419K8664
7405c5938m9581L5764K4030r2417q8207o9933m5421J32841J33539Q292j30393
7394a77424N0150J8982L1619p1300m4185L6444K9235l2432J03684P4651N9752
7383G9176l2545j19289k0886K9302L7735J5492P4180L5845p9164p8000l586k7540
7371h9280o505J4424O0561k478K943O9385J0305q7577o0432j07516J0123k9240
$$ plain form
7359 -215287 -133883 -6101 52552 91179 97377 86166 23622 30818 46488 33339 94015 224869
7347 224869 248533 108503 111850 150289 168681 123599 131277 181420 118445 128691 32860 24642
7335 24642 71348 171402 45481 -141382 -102650 -36216 -32478 -119681 -97465 -76879 -124310
7324 -124310 -145619 -130300 -120356 -8085 -72993 -181414 -197570 -107235 -41519 11198 28902
7313 28902 -17504 -47975 -7003 74371 15408 27354 39972 79449 124823 85445 24569 -16410
7301 -16410 -101727 -44257 15914 -22944 -52635 -24745 -85333 -105357 41804 129234 259176
7290 259176 216226 153722 52438 -14759 32546 29674 -78406 -108405 -95166 -91576 -140215 1280
7278 1280 74090 128823 71396 -99948 -122951 -202651 -97560 17660 116078 41386 -85941
$$ packed form
7359b15287Q1404J27782N8653L8627O198j1211o2544P196J5670j3149O0676J30854
7347B24869K3664j40030L347L8439J8392m5082P678N0143o2975J0246r5831q218
7335B4642M6706J00054j25921j86863L8732O6434L738q7203K2216K0586m7431
7324a24310k1309J5319R944J12271o4908j08421j6156R0335O5716N2717J7704
7313B8902m6406l0471M0972Q1374n8963J1946J2618L9477M5374l9378o0876m0979
7301a6410q5317N7470O0171l8858k9691K7890o0588k0024J47161Q7430J29942
7290B59176m2950o2504j01284o7197M7305k872j08080k9999J3239L590m8639J41495
7278A280P2810N4733n7427j71344k3003p9700J05091J15220R8418p4692j27327
$$ plain form
7267 -85941 -217274 -201368 -74843 -160143 -131449 -101972 -151620 -98853 -88088 -184575 -218531
7256 -218531 -159368 50892 31154 12621 -7713 -8217 -6935 -65809 -138364 -160792 -99053 -21637
7244 -21637 -90040 -134086 -174631 -189885 -177059 -107782 -56195 27492 54775 40654 -66931 -112180
7232 -112180 -119524 -224597 -283168 -279961 -357131 -286829 -100044 -129188 -78496 -62782 -82720 -63614
7220 -63614 26046 -38580 -69447 -134277 -118116 3705 1127 -14953 -111390 -120243 -54451 30212
7208 30212 33484 24756 23152 -112361 -245554 -298308 -320387 -313806 -311602 -249558 -250564 -129750
7196 -129750 -12965 -44600 -51091 -35202 5798 68549 68392 42496 -17432 27401 -18234 -127412
7184 -127412 -188984 -147579 -183428 -230757 -111453 32152 109840 158905 146039 205017 183099
$$ packed form
7267h5941j31333J5906J26525q5300K8694K9477m9648N2767J0765r6487l3956
7256b18531N9163K10260j9738j8533k0334n04J282n8874p2555k2428O1739P7416
7244b1637o8403m4046m0545j5254J2826O9277N1587Q3687K7283j4121j07585m5249
7232a12180p344j05073n8571L207p7170P0302J86785k9144N0692J5714j9938J9106
7220f3614Q9660o4626l0867o4830J6161J21821k578j6080r6437q853O5792Q4663
7208C0212L272q728j604j35513j33193n2754k2079O581K204O2044j006J20814
7196a29750J16785l1635o491J5889M1000O2751j57k5896n9928M4833m5635j09178
7184a27412o1572M1405l5849m7329J19304J43605P7688M9065j2866N8978k1918
$$ plain form
7173 183099 64536 -20937 -10404 -37608 -19304 46071 147609 143010 -18688 -39136 84063
7162 84063 108068 85498 -27143 -81318 -47343 -13383 101396 98737 55262 88637 59732 -4555
7150 -4555 -162957 -132755 20864 18468 -54125 -63839 -167761 -286920 -282911 -218796 -166866 -121177
7138 -121177 -133643 -143841 -145046 -177629 -270529 -199515 -165096 -35853 57694 13690 -29927 -51861
7126 -51861 -74530 -50610 -40772 -79572 -20526 13844 30188 -40370 -24564 -5564 18739 2840
7114 2840 -38004 -5989 22470 67501 -32824 -183515 -163250 -35247 93909 85866 108144
7103 108144 206416 68618 76715 53853 -10986 -92025 -141017 -95387 -76411 26951 -39322
7092 -39322 -11901 -59971 -157661 -135639 -216725 -260606 -273282 -138645 -118238 -189659 -191635 -162170
$$ packed form
7173A83099j18563q5473J0533k7204J8304O5375J01538m599j61698k0448J23199
7162H4063K4005k2570j12641n4175L3975L3960J14779k659m3475L3375k8905o4287
7150d555j58402L0202J53619k396p2593r714j03922j19159M009O4115N1930M5689
7138a21177j2466j0198j205l2583r2900P1014L4419J29243R3547m4004m3617k1934
7126e1861k2669K3920R838l8800N9046L4370J6344p0558J5806J9000K4303j5899
7114B840m0844L2015K8459M5031j00325j50691K0265J28003J29156q043K2278
7103A08144R8272j37798Q097k2862o4839q1039m8992M5630J8976J03362o6273
7092c9322K7421m8070r7690K2022q1086m3881j2676J34637K0407p1421j976K9465
$$ plain form
7080 -162170 -113821 -151332 -176813 -99479 -109089 -118329 -151318 -278681 -140416 11256 -31660
7069 -31660 -57399 -90232 -15071 2255 45192 43248 -101133 -190036 -93766 -127236 -126774 -168632
7057 -168632 -205550 -130538 -75610 8068 74692 149690 162967 78627 -64541 -169401 -229538
7046 -229538 -150212 -78404 -221518 -203276 -93399 -24105 -12846 -8491 11584 -126736 -68795
7035 -68795 -74366 -208078 -120606 -93075 -102807 -87496 13954 100724 164345 69996 37333 102907
7023 102907 153234 76080 -14725 -84422 -80021 -204409 -173282 -271515 -197696 -59469 38744
7012 38744 164676 84052 -55573 -40364 -23624 -122709 -168555 -152169 -163722 -156659 -57940 -49426
7000 -49426 21570 185718 186439 167950 44769 -42109 -17010 47281 93687 172225 204600 166672
$$ packed form
7080a62170M8349l7511k5481P7334r610r240l2989j27363J38265J51672m2916
7069c1660k5739l2833P5161J7326M2937j944j44381q8903R6270l3470M62m1858
7057a68632l6918P5012N4928Q3678O6624P4998J3277q4340j43168j04860o0137
7046b29538P9326P1808j43114J8242J09877O9294J1259M355K0075j38320N7941
7035f8795n571j33712Q7472K7531r732J5311J01450Q6770O3621r4349l2663O5574
7023A02907N0327p7154r0805o9697M401j24388L1127r8233P3819J38227R8213
7012C8744J25932q0624j39625J5209J6740r9085m5846J6386j1553P063R8719Q514
7000d9426P0996J64148P21j8489j23181q6878K5099O4291M6406P8538L2375l7928
$$ plain form
6988 166672 98191 -35334 -83580 28581 35691 -21399 -59303 -48890 -46373 158403 200982
6977 200982 157155 70877 135045 108502 61613 47031 44608 10850 65795 -57008 -166200
6966 -166200 -151755 -191504 -44420 92681 44025 -37246 -140964 -197536 -189133 -79800 -145638
6955 -145638 -198012 -252258 -297054 -313018 -351872 -286502 -104559 -18826 29336 -58388 -108896
6944 -108896 -128882 -192857 -244670 -181278 -97673 -231536 -180431 -64256 18138 123934 91326
6933 91326 29183 23457 -32727 -99311 -100097 -134132 -242109 -278602 -211910 -169657 -227096 -240530
6921 -240530 -160347 -128355 -73481 -158246 -191906 -220536 -230373 -106668 -176161 -239895 -250407 -272510
6909 -272510 -373393 -154498 1325 7148 61532 39504 -5519 -70227 -22103 -4904 -154446
$$ packed form
6988A66672o8481j33525m8246J12161P110n7090l7904J0413K517K04776M2579
6977B00982m3827q6278O4168k6543m6889j4582k423l3758N4945j22803j09192
6966a66200J4445l9749J47084J37101m8656q1271j03718n6572Q403J09333o5838
6955a45638n2374n4246m4796j5964l8854O5370J81943Q5733M8162q7724n0508
6944a08896j9986o3975n1813O3392Q3605j33863N1105J16175Q2394J05796l2608
6933I1326o2143n726n6184o6584p86l4035j07977l6493O6692M2253n7439j3434
6921b40530Q0183L1992N4874q4765l3660k8630r837J23705o9493o3734j0512k2103
6909b72510j00883K18895J55823N823N4384k2028m5023o4708M8124J7199j49542
$$ plain form
6898 -154446 -135618 -65894 28810 -47305 -75750 35366 77543 13396 -57483 -72316 -120235
6887 -120235 -203359 -198786 -37091 69608 -20365 -76100 -41887 -153057 -83334 -92615 -186499
6876 -186499 -208992 -126568 -80336 -171630 -166772 -238681 -245912 -187344 -305636 -273800 -104296 -15578
6864 -15578 -7363 -33332 -59664 -92978 -116524 -176300 -141464 -38101 -6760 -58409 -193889 -188751
6852 -188751 -19505 34213 -23864 3907 16884 -101449 -101831 -178227 -298109 -216367 -111757
6841 -111757 -71909 -88766 -177451 -160689 -152011 -162141 -128347 -34507 -31101 -18144 -14072 51725
6829 51725 -28876 -63997 -111112 -125109 -113940 46033 53655 -19566 -139695 -114935 -17404 -99464
6817 -99464 -145261 -115672 -89869 -39235 29072 36742 39311 -20513 -139755 -78206 32612 -23754
$$ packed form
6898a54446J8828O9724R4704p6115k8445J11116M2177o4147p0879j4833m7919
6887a20235q3124M573J61695J06699q9973n5735L4213j11170O9723r281r3884
6876a86499k2493Q2424M6232r1294M858p1909p231N8568j18292L1836J69504Q8718
6864a5578Q215k5969k6332l3314k3546n9776L4836J03363L1341n1649j35480N138
6852a88751J69246N3718n8077K7771J2977j18333l82p6396j19882Q1742J04610
6841a11757L9848j6857q8685J6762Q678j0130L3794R3840L406J2957M072O5797
6829E1725q0601l5121m7115j3997J1169J59973P622p3221j20129K4760R7531q2060
6817i9464m5797K9589K5803N0634O8307P670K569n9824j19242O1549J10818n6366
$$ plain form
6805 -23754 29217 -14595 -187071 -194646 -113932 -12138 -117211 -188945 -127291 -56535 -127946
6794 -127946 -200286 -216441 -203759 -191380 -283309 -198783 -106609 -36769 -53324 -47937 85556 126734
6782 126734 -722 -180980 -151838 -131974 -114882 -24278 53219 169996 209225 113501 -86820
6771 -86820 -104689 -206740 -229538 -360163 -400528 -213149 -99699 -189621 -109368 -91846 -41473
6760 -41473 -104058 -156323 -131878 -160645 -107776 -53791 -42375 31849 114908 4871 -77935 -129566
6748 -129566 -181581 -102997 -66728 -169554 -222322 -235829 -255877 -173298 -102061 -161933 -271450
6737 -271450 -323512 -345245 -159561 -179849 -129065 -117454 -144963 -123309 -153326 -169009 -171274 -235298
6725 -235298 -163189 -155312 -177425 -106982 -71961 -40364 -96030 -50621 57360 100420 51105 -60645
$$ packed form
6805b3754N2971m3812j72476p575Q0714J01794j05073p1734O1654P0756p1411
6794a27946p2340j6155J2682J2379r1929Q4526R2174O9840j6555N387J33493M1178
6782A26734j27456j80258K9142J9864J7092R0604P7497J16777L9229r5724k00321
6771h6820j7869j02051k2798j30625m0365J87379J13450q9922Q0253J7522N0373
6760d1473o2585n2265K4445k8767N2869N3985J1416P4224Q3059j10037q2806n1631
6748a29566n2015P8584L6269j02826n2768j3507k0048Q2579P1237n9872j09517
6737b71450n2062k1733J85684k0288N0784J1611k7509K1654l0017j5683k265o4024
6725b35298P2109P877k2113P0443L5021L1597n5666M5409J07981M3060m9315j11750
$$ plain form
6713 -60645 -94680 -122960 -31203 -84061 11753 83853 37558 -51416 -35223 -61347 -108407 -115588
6701 -115588 -88655 10922 77625 134978 148588 261422 142682 13746 -58353 -30340 -55486
6690 -55486 -133508 -139051 -50550 -17878 61581 116056 152273 130991 65907 51371 159023 281076
6678 281076 94121 23982 46183 33562 -92355 -67832 132647 125142 193096 99786 38742
6667 38742 -2362 116688 184044 165584 209834 95589 54171 15126 -62605 -90469 -11950
6656 -11950 -101145 -108673 6408 -50741 -136355 -59462 20018 79719 101677 87463 85818 121536
6644 121536 178348 202813 107634 34039 -50656 -123903 -130167 -54379 -5431 -14318 17484 -56396
6632 -56396 -108488 -130322 -171168 -31559 79241 111842 54782 -51191 -142698 -170894 -36700
$$ packed form
6713f0645l4035k8280R1757n2858R5814P2100m6295q8974J6193k6124m7060p181
6701a15588K6933R9577O6703N7353J3610J12834j18740j28936p2099K8013k5146
6690e5486p8022n543Q8501L2672P9459N4475L6217k1282o5084j4536J07652J22053
6678B81076j86955p0139K2201j2621j25917K4523K00479p505O7954r3310o1044
6667C8742m1104J19050O7356j8460M4250j14245m1418l9045p7731k7864P8519
6656a1950q9195p528J15081n7149q5614P6893P9480N9701K1958j4214j645L5718
6644A21536N6812K4465r5179p3595q4695p3247o264P5788M8948q887L1802p3880
6632e6396n2092k1834m0846J39609J10800L2601n7060j05973r1507k8196J34194
$$ plain form
6621 -36700 66727 151649 97771 50303 111966 36052 39553 67183 11325 -17656 -7686 35124
6609 35124 -74553 -74555 -64250 50535 100670 170193 280199 285515 247342 152934 96116 -21350
6597 -21350 -71872 -91917 -90791 -111325 -59010 -81357 -98198 -103673 -14657 -179861 -224762 -190816
6585 -190816 -112561 -36047 -103640 -40806 -44434 -87419 -20384 67927 52821 94369 -27553 -119587
6573 -119587 -244857 -289233 -301812 -299414 -172980 -119473 -38490 -1285 108364 193250 96783
6562 96783 -56997 -39193 -70105 -130932 -100624 13012 145152 22754 -50741 74915 -21349
6551 -21349 -59702 23739 85071 29723 -99435 -60390 -49579 -108246 -57630 -31110 32835 102290
6539 102290 31215 34502 35771 36088 -43293 -6916 -7365 42487 74052 -37630 -105731 -141317 -236114
$$ packed form
6621c6700J03427Q4922n3878m7468O1663p5914L501K7630n5858k8981R970M2810
6609C5124j09677kJ0305J14785N0135O9523J10006N316l8173r4408n6818j17466
6597b1350n0522k0045J126k0534N2315k2347j6841n475Q9016j65204m4901L3946
6585a90816P8255P6514o7593O2834l628m2985O7035Q8311j5106M1548j21922r2034
6573a19587j25270m4376j2579K398J26434N3507Q0983L7205J09649Q4886r6467
6562I6783j53780J7804l0912o0827L0308J13636J32140j22398p3495J25656r6264
6551b1349l8353Q3441O1332n5348j29158L9045J0811n8667N0616K6520O3945O9455
6539A02290p1075L287J269L17p9381L6377m49M9852L1565j11682o8101l5586r4797
$$ plain form
6526 -236114 -213194 -150062 -151577 -100055 12711 28321 -2233 2160 42453 50965 -9973 -46395
6514 -46395 -110694 -118636 -59041 9140 19144 44183 24740 8508 116008 77511 6015 23619
6502 23619 -23546 -58921 -91676 -26326 -37161 52485 109611 95620 89574 86903 184694 134012
6490 134012 106642 66440 -4682 15054 24807 -2001 -43644 -62642 47733 50778 42423 -12128
6478 -12128 2098 91060 64675 -88080 -159137 -188860 -170548 -108824 5110 41218 56835
6467 56835 -7366 -61301 -61032 -133192 -136317 -147660 -67805 -103265 -45787 -43171 -95764 -141728 -134793
6454 -134793 -17323 7195 -100502 -114326 -6347 -53898 -121587 -166976 -134469 -80051 -38256
6443 -38256 -138181 -129867 -102458 -130840 -193070 -224865 -145629 -50451 -14724 34099 95597 -14158
$$ packed form
6526b36114K2920O3132j515N1522J12766J5610l0554M393M0293Q512o0938l6422
6514d6395o4299p942N9595O8181J0004K5039j9443j6232J07500l8497p1496J7604
6502B3619m7165l5375l2755O5350j0835Q9646N7126j3991o046k671R7791n0682
6490A34012k7370m0202p1122J9736R753k6808m1643j8998J10375L045q355n4551
6478a2128J4226Q8962k6385j52755p1057k9723J8312O1724J13934L6108J5617
6467E6835o4201n3935K69p2160l125j1343P9855l5460N7478K616n2593m5964O935
6454a34793J17470K4518j07697j3824J07979m7551o7689m5389L2507N4418M1795
6443c8256r9925Q314K7409k8382o2230l1795P9236R5178L5727M8823O1498j09755
$$ plain form
6431 -14158 -133595 -91805 -89457 -70139 41557 85272 3049 -92011 -173559 -247917 -256114 -97592
6419 -97592 1287 -74469 -192319 -190246 -92775 -13083 -23988 -22809 -106317 -100832 -47127 -71337
6407 -71337 -42123 -306 -100358 -25110 48608 14805 -27408 72983 87601 29352 67735
6396 67735 61687 16402 57551 80843 25443 -32325 -118817 -37524 -68341 -59275 -21012 -32687
6384 -32687 5972 -114173 -279246 -288092 -198335 -29362 381 -20976 65315 37622 5957
6373 5957 62276 -43991 -133519 -151699 -156978 -247140 -258804 -214042 -151978 -133113 -127957 -128611 -100727
6360 -100727 27832 53131 -53418 -221948 -215696 9707 -1211 -21528 -4855 -38319 -5150
6349 -5150 -1380 -9266 -32515 -68033 -2283 67459 78860 119769 191544 304722 291368 306710
$$ packed form
6431a4158j19437M1790K348J9318J11696M3715q2223r5060q1548p4358q197J58522
6419i7592R8879p5756j17850K073R7471P9692j0905J179q3508N485N3705k4210
6407g1337K9214M1817j00052P5248P3718l3803m2213J00391J4618n8249L8383
6396F7735o048m5285M1149K3292n5400n7768q6492Q1293l0817R066L8263j1675
6384c2687L8659j20145j65073q846Q9757J68973K9743k1357Q6291k7693l1665
6373E957N6319j06267q9528j8180n279r0162j1664M4762O2064J8865N156o54K7884
6360a00727J28559K5299j06549j68530O252K25403j0918k0317J6673l3464L3169
6349e150L770p886k3249l5518O5750O9742J1401M0909P1775J13178j3354J5342
$$ plain form
6337 306710 92945 -36538 -64613 -132209 -115727 -93791 -98845 -123948 -50952 -145 -84160
6326 -84160 -127191 -26144 81993 107787 142628 147288 176891 191373 195363 145418 45898 17188
6314 17188 -14777 -167914 -179518 -101911 -17097 73592 159203 64768 -20227 80840 141828
6303 141828 24849 -39415 -58428 -38243 -36455 -35137 -231530 -329129 -181807 -142286 -166473
6292 -166473 -149054 -99566 -179182 -92820 -106498 -193713 12574 111828 3518 -31462 -106674
6281 -106674 -108522 -54480 -18259 34561 -639 -11167 -117244 -226891 -211550 -209970 -105730
6270 -105730 150366 178371 -9750 -100505 -73590 -17099 8718 -30860 -54924 -40541 76649
6259 76649 -47091 -212308 -251455 -340975 -280852 -149136 6551 84603 199199 210886 76079
$$ packed form
6337C06710k13765j29483k8075o7596J6482K1936n054k5103P2996N0807q4015
6326h4160m3031J01047J08137K5794L4841M660K9603J4482L990m9945r9520k8710
6314A7188l1965j53137j1604P7607Q4814R0689Q5611r4435q4995J01067O0988
6303A41828j16979o4264j9013K0185J788J318j96393r7599J47322L9521k4187
6292a66473J7419M9488p9616Q6362j3678q7215K06287R9254j08310l4980p5212
6281a06674j848N4042L6221N2820l5200j0528j06077j09647J5341J580J04240
6270a05730K56096K8005j88121r0755K6915N6491K5817l9578k4064J4383J17190
6259G6649j23740j65217l9147q9520O0123J31716J55687P8052J14596J1687j34807
$$ plain form
6248 76079 -68897 -106465 -130747 -22987 -19295 -18263 -29895 -65596 -57307 -119650 -110660 -50813
6236 -50813 -62007 -40695 -67467 -110633 -26241 -42419 30475 50413 166183 194433 51296
6225 51296 -15337 32299 4341 -46299 -170526 -148258 -24859 32526 55563 107849 176306
6214 176306 188010 98484 -81467 -140918 -111657 -28012 55387 99989 -16015 -104091 -82934
6203 -82934 -13515 -29737 -87392 -9611 11823 87605 58835 103930 94710 -34937 -203085 -275740
6191 -275740 -186874 -161685 23782 214247 112015 -118912 -215614 -220775 -157624 -136022 -91797
6180 -91797 -217276 -319338 -310037 -263277 -206226 -184775 -237899 -163333 -128070 -109192 -245607
6169 -245607 -321914 -226902 -84622 6458 23180 21018 18322 74855 28235 -157381 -123001 -211573
$$ packed form
6248G6079j44976l7568k4282J07760L692J032j1632l5701Q289o2343Q990N9847
6236e0813j1194K1312k6772m3166Q4392j6178P2894J9938J15770K8250j43137
6225E1296o6633M7636k7958n0640j24227K2268J23399N7385K3037N2286O8457
6214A76306J1704q9526j79951n9451K9261Q3645Q3399M4602j16004q8076K1157
6203h2934O9419j6222n7655P7781K1434P5782k8770M5095r220j29647j68148p2655
6191b75740Q8866K5189J85467J90465j02232k30927r6702n161O3151K1602M4225
6180i1797j25479j02062R301M6760N7051K1451n3124P4566L5263J8878j36415
6169b45607p6307R5012J42280R1080J6722k162k696N6533m6620j85616L4380q8572
$$ plain form
6157 -211573 -224877 -183422 -123446 -234874 -194010 -77426 -36022 -94725 -129006 -81701 -68734
6146 -68734 -43023 117435 147615 20834 151750 276447 272020 173196 122481 11322 -70889
6135 -70889 -90284 -120556 -152442 -221903 -249255 -252377 -118195 -65178 -45637 17766 -14153 -35850
6123 -35850 -11865 37655 -48357 -117746 -108675 -137433 -192789 -254387 -89957 3219 -69938 -187394
6111 -187394 -12537 73410 -29401 -43234 4928 -128256 -44882 57138 -9745 -44671 -153532
6100 -153532 -242228 -217036 -109895 -115610 -119006 -185857 -127680 17687 39896 -67892 -108174
6089 -108174 -142239 -78973 -4994 19628 -19084 100172 91243 26930 95964 170507 160740 58370
6077 58370 10984 1983 -101168 -17093 18421 -10312 -130334 -158198 -102102 -5591 29709 -29089
$$ packed form
6157b11573j3304M1455N9976j11428M0864J16584M1404n8703l4281M7305J2967
6146f8734K5711J60458L0180j26781J30916J24697m427r8824n0715j11159q2211
6135g0889j9395l0272l1886o9461k7352l122J34182N3017J9541O3403l1919k1697
6123c5850K3985M9520q6012o9389R071k8758n5356o1598J64430R3176p3157j17456
6111a87394J74857Q5947j02811j3833M8162j33184Q3374J02020o6883l4926j08861
6100a53532q8696K5192J07141n715l396o6851N8177J45367K2209j07788m0282
6089a08174l4065O3266P3979K4622l8712J19256q929o4313O9034P4543r767j02370
6077E8370m7386r001j03151Q4075L5514k8733j20022k7864N6096R6511L5300n8798
$$ plain form
6065 -29089 -99810 -157914 -238708 -160406 -200792 -146600 -61577 16278 53130 91098 44392 -132906
6053 -132906 -123698 65420 136795 65876 80249 183726 108753 35251 31123 83759 104688 63471
6041 63471 94942 117743 77328 34918 21149 64130 30549 -3205 -47421 10310 20151 -35517
6029 -35517 -59698 -123134 -59792 -18964 79841 116744 70396 92535 49326 -85522 -210273
6018 -210273 -170550 -79975 -57368 -50293 -47859 -55558 -10548 63001 127270 44700 18293 24737
6006 24737 76936 105250 122666 54304 -49787 -108816 -118305 -135068 -159595 -92786 80107 54975
5994 54975 -18319 -38423 37801 98192 98165 106856 408 -35544 -101603 21917 78009 -8305
5982 -8305 -12174 86452 208885 273347 297241 163184 92078 40449 55376 -39747 -64141 -106610
$$ packed form
6065b9089p0721n8104q0794P8302m0386N4192Q5023P7855L6852L7968m6706j77298
6053a32906R208J89118P1375p0919J4373J03477p4973p3502m128N2636K0929m1217
6041F3471L1471K2801m0415m2410j3769M2981l3581l3754m4216N7731R841n5668
6029c5517k4181o3436O3342M0828R8805L6903m6348K2139m3209j34848j24751
6018b10273L9723R0575K2607P075K434p699M5010P3549O4269q2570k6407O444
6006B4737N2199K8314J7416o8362j04091n9029r489j6763k4527O6809J72893k5132
5994E4975p3294k0104P6224O0391k7Q691j06448l5952o6059J23520N6092q6314
5982h305l869R8626J22433O4462K3894j34057p1106n1629J4927r5123k4394m2469
$$ plain form
5970 -106610 -117795 -130286 -202036 -173775 -88020 -7456 -3965 -12581 -17300 41771 73307 -41521
5958 -41521 -103516 -164261 -121035 -102962 -10870 -5798 -3262 -39799 -101997 -2435 15256 25823
5946 25823 66635 107681 -7624 -142445 -162504 -154817 -129399 -114482 -88107 -154048 -82923 -145891
5934 -145891 -309152 -282946 -166023 -128779 -56536 -4887 -24575 -149281 -119038 73260 134690
5923 134690 67872 2268 -27707 -48447 7250 53 -76321 -68880 -23391 -59592 -55768 9242
5911 9242 -36649 13533 7638 209 59945 83765 102550 23992 69180 136255 32341 -19492
5899 -19492 -68157 -81253 -40596 -113867 -191914 -100191 -128405 -7668 69148 143637 270960
5888 270960 217515 138675 120229 80537 29142 16624 129788 17120 -89689 -164459 -202011
$$ packed form
5970a06610j1185j2491p1750K8261Q5755Q0564L491q616m719N9071L1536j14828
5958d1521o1995o0745M3226J8073R2092N072K536l6537o2198R9562J7691J0567
5946B5823M0812M1046j15305j34821k0059P687K5418J4917K6375o5941P1125o2968
5934a45891j63261K6206J16923L7244P2243N1649j9688j24706L0243J92298O1430
5923A34690o6818o5604k9975k0740N5697p197p6374P441M5489l6201L824O5010
5911I242m5891N0182n895p429N9736K3820J8785p8558M5188O7075j03914n1833
5899a9492m8665j3096M0657p3271p8047R1723k8214J20737P6816P4489J27323
5888B70960n3445p8840j8446l9692n1395j2518J13164j12668j06809p4770l7552
$$ plain form
5877 -202011 -198451 -226060 -73461 -11072 -26100 -36548 44740 113052 142340 91423 62563 90225
5865 90225 80604 -21174 35744 105470 -44720 50602 111365 27366 -171179 -203060 -89512
5854 -89512 -43409 -32911 36685 23892 -38707 95 86723 176436 131613 37565 -35149 -4858
5842 -4858 97002 123018 102401 112011 -7086 -85345 -168787 -110865 41145 -20135 -6367 150711
5830 150711 180377 91158 24267 -25401 26223 -173 58609 27095 -98604 -84663 -169364
5819 -169364 -162051 39854 81770 29025 -60385 -68842 -10112 -69076 -123949 -181545 -258994 -217300
5807 -217300 -97202 -7426 -68750 -7227 88192 -45399 -103888 -156799 -272618 -125644 -32228
5796 -32228 -33565 -141876 -201509 -217274 -63552 7051 -113071 -72211 -101569 -42111 -60875
$$ packed form
5877b02011L560k7609J52599O2389j5028j0448Q1288O8312K9288n0917k8860K7662
5865I0225r621j01778N6918O9726j50190R5322O0763q3999j98545l1881J13548
5854h9512M6103J0498O9596j2793o2599L8802Q6628Q9713m4823r4048p2714L0291
5842d858J01860K6016k0617R610j19097p8259q3442N7922J52010o1280J3768J57078
5830A50711K9666q9219o6891m9668N1624k6396N8782l1514j25699J3941q4701
5819a69364P313K01905M1916n2745q9410q457N8730n8964n4873n7596p7449M1694
5807b17300J20098Q9776o1324O1523R5419j33591n8489n2911j15819J46974R3416
5796c2228j337j08311n9633j5765J53722P0603j20122M0860k9358N9458j8764
$$ plain form
5785 -60875 30325 -34786 -118477 120398 109589 31169 49425 37494 -39701 -66919 -106456 -28925
5773 -28925 -88083 -72083 -128986 -193103 -152744 -30998 27066 -44852 -137478 -192578 -223783 -244088
5761 -244088 -94993 15929 -66216 -51643 50540 16609 -54692 -3507 59992 -61775 -224896
5750 -224896 -209456 -206649 -204469 -239226 -152608 -138182 -73297 -3004 12462 -13956 33823 -6990
5738 -6990 -47781 49301 195527 151703 -3745 -40119 102416 142763 50525 3858 -84207
5727 -84207 -83536 84067 107036 24818 -43296 -48434 -59973 50786 59930 91546 157595 41740
5715 41740 -42936 -286038 -266760 -25473 32717 104435 210086 179476 155898 212995 276400
5704 276400 228556 142930 214480 241956 159715 -10664 -91820 -141490 -259793 -168236 -121049
$$ packed form
5785f0875R1200o5111q3691K38875j0809p8420J8256j1931p7195k7218l9537P7531
5773b8925n9158J6000n6903o4117M0359J21746N8064p1918r2626n5100l1205k0305
5761b44088J49095J10922q2145J4573J02183l3931p1301N1185O3499j21767j63121
5750b24896J5440K807K180l4757Q6618J4426O4885P0293J5466k6418M7779m0813
5738f990m0791R7082J46226m3824j55448l6374J42535M0347r2238m6667q8065
5727h4207O71J67603K2969q2218o8114n138j1539J10759R144L1616O6049j15855
5715D1740q4676k43102J9278K41287N8190P1718J05651l0610k3578N7097O3405
5704B76400m7844q5626P1550K7476q2241j70379q1156m9670j18303R1557M7187
$$ plain form
5693 -121049 -39609 -31484 111860 182333 53158 -43058 -51617 -138660 -66814 -39481 -186954
5682 -186954 -191052 -123422 -93124 -163835 -155330 -131026 -96186 -31468 12524 -101521 -154225 -187513
5670 -187513 -139341 -136155 -96293 -39409 25841 -47432 -54720 7917 82049 51980 26765 18491
5658 18491 66672 65688 68054 -51123 -149061 -54543 62462 21226 24856 38437 -120393 -205456
5646 -205456 -128688 -65619 -111825 -194110 -172775 -102204 -60804 59273 113539 97897 161776
5635 161776 99478 28622 35798 -11146 -138511 34694 51184 -34005 -132264 -133348 -45641 21875
5623 21875 -138182 -127753 -144978 -110928 -60684 -88527 -67301 27783 -60603 -14222 85324 13702
5611 13702 -92966 -85247 -47626 -7308 -70213 -164880 -145381 10344 91899 82845 -30346 -105298
$$ packed form
5693a21049Q1440Q125J43344P0473j29175r6216q559q7043P1846K7333j47473
5682a86954m098O7630L0298p0711Q505K4304L4840O4718M3992j14045n2704l3288
5670a87513M8172L186L9862N6884O5250p3273p288O2637P4132l0069k5215q274
5658A8491M8181r84K366j19177r7938R4518J17005m1236L630J3581j58830q5063
5646b05456P6768O3069m6206q2285K1335P0571M1400J20077N4266j5642O3879
5635A61776o2298p0856P176m6944j27365J73205J6490q5189r8259j084Q7707O7516
5623B1875j60057J0429j7225L4050N0244k7843K1226R5084q8386M6381R9546p1622
5611A3702j06668P719L7621M0318o2905r4667J9499J55725Q1555r054j13191p4952
$$ plain form
5599 -105298 -74143 -107508 -88040 -188899 -94664 -13803 -39055 -68258 33619 -41108 -174742
5588 -174742 -91770 -122654 -199427 -214394 -167045 -95281 -76606 -231122 -212538 -130147 -185438
5577 -185438 -208908 -156726 -65487 -56282 -48345 -19131 -51658 -104758 -12918 87622 84706 15742
5565 15742 -22942 -18284 34275 -6581 -22492 -68342 105973 191129 198578 203664 173666 103861
5553 103861 39087 -60890 -147167 -143965 -99497 -39296 66923 70565 44952 -31883 -103409 -117483
5541 -117483 -147393 -97804 -43619 -111281 -115571 -79516 -107734 -107456 -42207 27506 65053 -10076
5529 -10076 -14417 5668 51411 12771 201 -51163 -78841 -40679 -94110 -184943 -190257 -225305
5517 -225305 -129066 -113901 -20828 36373 -25125 -28784 84703 72821 11596 -69307 -16041 30187
$$ packed form
5599a05298L1155l3365J9468j00859R4235Q0861k5252k9203J01877p4727j33634
5588a74742Q2972l0884p6773j4967M7349P1764J8675j54516J8584Q2391n5291
5577a85438k3470N2182R1239R205P937K9214l2527n3100R1840J00540k916o8964
5565A5742l8684M658N2559m0856j5911m5850J74315Q5156P449N086k9998o9805
5553A03861o4774r9977q6277L202M4468O0201J06219L642k5613p6835p1526j4074
5541a17483k9910M9589N4185o7662m290L6055k8218K78O5249O9713L7547p5129
5529a0076m341K0085M5743l8640j2570n1364k7678L8162n3431r0833n314l5048
5517b25305R6239J5165R3073N7201o1498l659J13487j1882o1225q0903N3266M6228
$$ plain form
5505 30187 -52885 -170564 -144546 -83283 -26793 -38451 -73113 -5981 63850 43307 -76380
5494 -76380 -18240 -46756 -197641 -217305 -104556 -121221 -143828 -41452 -32505 -35566 138478
5483 138478 143157 -24378 -150867 -178430 -40981 -25623 -96635 -81746 1221 29426 -19828
5472 -19828 -42602 -205732 -260468 -191279 -202553 -263124 -290700 -240995 -142479 -126938 -156121 -50089
5460 -50089 -118727 -107814 -41501 -47830 -13768 -57305 -166835 -215328 -177116 -212352 -83852 -1837
5448 -1837 98571 137244 145516 23912 -138889 -150457 -185501 -197200 -70403 4497 2233 -79053
5436 -79053 -26852 118068 105754 101009 66809 1766 -107057 -93322 -86159 -170848 -163430 -173145
5424 -173145 -255613 -247851 -182808 -151897 -222713 -238332 -175776 -138637 -154601 -159310 -129009 -112544
$$ packed form
5505C0187q3072j17679K6018O1263N6490j1658l4662O7132O9831k0543j19687
5494g6380N8140k8516j50885j9664J12749j6665k2607J02376Q947l061J74044
5483A38478M679j67535j26489k7563J37449J5358p1012J4889Q2967K8205m9254
5472a9828k2774j63130n4736O9189j1274o0571k7576M9705R8516J5541k9183J06032
5460e0089o8638J0913O6313o329L4062m3537j09530m8493L8212l5236J28500Q2015
5448a837J00408L8673Q272j21604j62801j1568l5044j1699J26797P4900k264q1286
5436g9053N2201J44920j2314m745l4200o5043j08823J3735P163q4689P418r715
5424a73145q2468P762O5043L0911p0816j5619O2556L7139j5964m709L0301J6465
$$ plain form
5412 -112544 -87189 -76772 -14625 30620 121879 130397 99220 28978 84677 43625 123932 45465
5400 45465 -64975 -98901 -68483 -58176 -105580 -78647 -170769 -227032 -126784 -19614 -95785
5389 -95785 -172832 -109704 -95651 -87295 -67896 -104772 -73796 -105835 -44051 -43914 -33404 5873
5377 5873 -89614 -62188 180285 151563 48871 13359 20938 -11296 -86032 -197028 -48986
5366 -48986 76909 -27936 1268 -103280 -103730 -92149 -94195 -61673 -66665 -86099 -49293 49821
5354 49821 28032 68211 118641 63953 -73832 -243822 -201646 -89914 -128442 -41834 -33948
5343 -33948 -49632 -55072 -70977 36173 -58213 -62062 -147070 -233271 -236482 -140687 -92842 -49771
5331 -49771 -139049 -79045 -91866 -140553 -192339 -197068 -118927 -89715 -164253 -252546 -233322 -175815
$$ packed form
5412a12544K5355J0417O2147M5245R1259Q518l1177p0242N5699m1052Q0307p8467
5400D5465j10440l3926L0418J0307m7404K6933r2122n6263J00248J07170p6171
5389i5785p7047O3128J4053Q356J9399l6876L0976l2039O1784J37J0510L9277
5377E873r5487K7426K42473k8722j02692l5512P579l2234p4736j10996J48042
5366d8986J25895j04845K9204j04548m50J1581k046L2522m992j9434L6806R9114
5354D9821k1789M0179N0430n4688j37785j69990M2176J11732l8528Q6608P886
5343c3948j5684n440j5905J07150r4386l849q5008q6201l211R5795M7845M3071
5331d9771q9278O0004j2821m8687n1786m729P8141K9212p4538q8293J9224N7507
$$ plain form
5319 -175815 -225067 -325162 -237952 -109827 -63105 -128702 -166966 -186405 -207102 -259227 -173596
5308 -173596 -72614 62630 99803 -2130 -289 -47276 -64149 -63157 4312 82893 39955 -71330
5296 -71330 -240911 -157053 -162372 -182035 -247385 -253756 -215280 -172256 -120300 -94532 492 -5716
5284 -5716 -110418 -16295 48439 40013 -49407 -106629 -174490 -150848 -145627 -128605 -28600 -33996
5272 -33996 48738 20805 21079 71438 -26097 37835 153566 175429 174725 213846 260672 115314
5260 115314 93494 178240 130274 -98001 -224411 -242267 -213855 -134253 -50272 49755 935
5249 935 -50016 -87279 -94579 -155922 -42047 -40745 -78506 -184271 -112552 -81856 -6178 -3728
5237 -3728 -110747 -133887 -79828 -58101 -27467 -58543 -53523 -16123 24033 -12314 -32764 7679
$$ packed form
5319a75815m9252j00095Q7210J28125M6722o5597l8264j9439k0697n2125Q5631
5308a73596J00982J35244L7173j01933J841m6987j6873R92O7469P8581m2938j11285
5296g1330j69581Q3858n319j9663o5350o371L8476M3024N1956K5768R5024o208
5284e716j04702R4123O4734q426q9420n7222o7861K3642N221J7022J00005n396
5272c3996Q2734k7933K74N0359r7535O3932J15731K1863p04L9121M6826j45358
5260A15314k1820Q4746m7966k28275j26410j7856K8412P9602Q3981J00027m8820
5249I35n0951l7263p300o1343J13875J302l7761j05765P1719L0696P5678K450
5237c728j07019k3140N4059K1727L0634l1076N020L7400M0156l6347k0450M0443
$$ plain form
5225 7679 66812 210447 245286 150240 82859 194612 266732 203858 212389 110487 11438 -75949
5213 -75949 -26343 -13506 -127024 -208770 -160671 -121417 -260129 -277017 -130459 -138574 -74098
5202 -74098 -142863 -283833 -233658 -78101 -51045 -2782 26429 89133 43174 16003 127389
5191 127389 139346 10471 -40798 -140110 -72877 6192 104792 221408 185794 81481 570
5180 570 -69628 -40607 50123 -29199 -52381 -72235 -110459 27146 124832 183944 233142 260457
5168 260457 170076 5800 -408 25150 -19891 12547 32805 105362 43971 125549 194089 150024
5156 150024 13426 67408 203626 250400 98313 2036 20796 112027 76944 49308 -11915
5145 -11915 -40656 146970 223602 127767 113559 48270 -26863 -78583 -9862 44641 -28183 -109357
$$ packed form
5225G679N9133J43635L4839r5046o7381J11753P2120o2874Q531j01902r9049q7387
5213g5949M9606J2837j13518q1746M8099L9254j38712j6888J46558q115O4476
5202g4098o8765j40970N0175J55557K7056M8263K9211O2704m5959k7171J11386
5191A27389J1957j28875n1269r9312O7233P9069R8600J16616l5614j04313q0911
5180E70p0198K9021R0730p9322k3182j9854l8224J37605R7686N9112M9198K7315
5168B60457r0381j64276o208K5558m5041L2438K0258P2557o1391Q1578O8540m4065
5156A50024j36598N3982J36218M6774j52087r6277J8760R1231l5083k7636o1223
5145a1915k8741J87626P6632r5835j4208o5289p5133n1720O8721N4503p2824q1174
$$ plain form
5133 -109357 -209104 -143723 -53149 -71196 -6556 266022 250393 -27425 -76742 -28222 -24012
$$ packed form
5133a09357r9747O5381R0574j8047O4640K72578j5629k77818m9317M8520M210
$$ [...]
##END NTUPLES=NMR SPECTRUM
##END=
