##TITLE=Analysis number 327599
Compound Code ac 35956
Project Code adrs
Chemist Name gavinr
##JCAMPDX= 6.0         $$ Bruker NMR JCAMP-DX V2.0
##DATA TYPE= NMR SPECTRUM
##DATA CLASS= NTUPLES
##ORIGIN= Bruker BioSpin GmbH
##OWNER= nmr
$$ XWIN-NMR		Version 3.5
$$ Tue Mar 27 15:26:24 2007 GMT Daylight Time (UT+1h)  MAYBRIDGE\nmr@NMR_250MHZ
##.OBSERVE FREQUENCY= 250.131544655141
##.OBSERVE NUCLEUS= ^1H
##.ACQUISITION MODE= SIMULTANEOUS (DQD)
##.ACQUISITION SCHEME= undefined
##.AVERAGES= 16
##.DIGITISER RES= 18
##SPECTROMETER/DATA SYSTEM= dpx250
##.PULSE SEQUENCE= zg30
##.SOLVENT NAME= DMSO
##.SHIFT REFERENCE= (INTERNAL, DMSO, 0, 16.522)
##AUDIT TRAIL= $$ (NUMBER, WHEN, WHO, WHERE, WHAT)
$$ ##TITLE= Audit trail, XWIN-NMR		Version 3.5
$$ ##JCAMPDX= 5.01
$$ ##ORIGIN= Bruker BioSpin GmbH
$$ ##OWNER= nmr
$$ C:\u/data/dgb/nmr/ADRS/2280/pdata/1/auditp.txt
$$ ##AUDIT TRAIL=  $$ (NUMBER, WHEN, WHO, WHERE, WHAT)
(   1,<2007-03-27 15:26:02.02 +100>,<MAYBRIDGE\nmr>,<NMR_250MHZ>,
      <created by zg, POWCHK disabled, PULCHK disabled
       configuration hash MD5:
       49 4B E0 1D 92 C2 6B 37 9F E6 65 BC 52 41 86 1D
       data hash MD5: 64K
       3C 05 54 3F 67 02 F3 E1 45 D5 C1 AF 02 A5 9A D3>)
(   2,<2007-03-27 15:26:14.61 +100>,<MAYBRIDGE\nmr>,<NMR_250MHZ>,
      <Start of raw data processing
       ef LB = 0.3 FT_mod = 6 PKNL = 1 SI = 32K 
       data hash MD5: 32K
       7E 82 EE E3 83 52 2B 18 56 54 EF E8 AA 66 24 DE>)
(   3,<2007-03-27 15:26:16.74 +100>,<MAYBRIDGE\nmr>,<NMR_250MHZ>,
      <apk 
       data hash MD5: 32K
       17 77 D4 03 EE 52 26 82 C4 1D 74 5F A5 9B 0D 8A>)
(   4,<2007-03-27 15:26:17.47 +100>,<MAYBRIDGE\nmr>,<NMR_250MHZ>,
      <abs ABSG = 5 
       data hash MD5: 32K
       B3 0D 3C 4F 35 27 31 18 9B 42 4E 80 9B 11 79 7C>)
$$ ##END=
$$ 
$$ hash MD5
$$ 34 6B 96 C9 16 62 98 F8 F3 AC 8C D7 90 13 56 24
##$RELAX= 
##$RELAX= 
##$RELAX= 
##$RELAX= 
##$RELAX= 
##$RELAX= 
##$RELAX= 
$$ Bruker specific parameters
$$ --------------------------
##$DU= <C:\u>
##$EXPNO= 2280
##$NAME= <ADRS>
##$PROCNO= 1
##$TYPE= <nmr>
##$USER= <dgb>
##$AMP= (0..31)
100 100 100 100 100 100 100 100 100 100 100 100 100 100 100 100 100 100 
100 100 100 100 100 100 100 100 100 100 100 100 100 100 
##$AQSEQ= 0
##$AQ_mod= 3
##$AUNM= <au_zg>
##$AUTOPOS= <49 >
##$BF1= 250.13
##$BF2= 250.13
##$BF3= 250.13
##$BF4= 250.13
##$BF5= 500.13
##$BF6= 500.13
##$BF7= 500.13
##$BF8= 500.13
##$BYTORDA= 1
##$CFDGTYP= 0
##$CFRGTYP= 5
##$CHEMSTR= <none>
##$CNST= (0..31)
1 1 145 1 1 1 1 1 1 1 1 1 1 1 1 1 1 1 1 1 1 1 1 1 1 1 1 1 1 1 1 1 
##$CPDPRG= <>
##$CPDPRG1= <>
##$CPDPRG2= <>
##$CPDPRG3= <>
##$CPDPRG4= <mlev>
##$CPDPRG5= <mlev>
##$CPDPRG6= <mlev>
##$CPDPRG7= <mlev>
##$CPDPRG8= <mlev>
##$CPDPRGB= <>
##$CPDPRGT= <>
##$D= (0..31)
0 1 0 0 0 0 0 0 0 0.06 0 0 0 0 0 0 0.0002 0 0 0 0 0 0 0 0 0 0 0 0 0 0 
0 
##$DATE= 1175005560
##$DBL= (0..7)
120 120 120 120 120 120 120 120 
##$DBP= (0..7)
150 150 150 150 150 150 150 150 
##$DBP07= 0
##$DBPNAM0= <>
##$DBPNAM1= <>
##$DBPNAM2= <>
##$DBPNAM3= <>
$$ [...]
##$SUBNAM7= <"">
##$SUBNAM8= <"">
##$SUBNAM9= <"">
##$SW= 20.6930455092707
##$SWIBOX= (0..15)
0 0 3 0 0 0 0 0 0 0 0 0 0 0 0 0 
##$SW_h= 5175.983436853
##$TD= 65536
##$TD0= 1
##$TE= 683.16
##$TE2= 300
##$TE3= 300
##$TEG= 300
##$TL= (0..7)
0 120 120 120 120 120 120 120 
##$TP= (0..7)
150 150 150 150 150 150 150 150 
##$TP07= 0
##$TPNAME0= <>
##$TPNAME1= <>
##$TPNAME2= <>
##$TPNAME3= <>
##$TPNAME4= <>
##$TPNAME5= <>
##$TPNAME6= <>
##$TPNAME7= <>
##$TPOAL= (0..7)
0.5 0.5 0.5 0.5 0.5 0.5 0.5 0.5 
##$TPOFFS= (0..7)
0 0 0 0 0 0 0 0 
##$TUNHIN= 0
##$TUNHOUT= 0
##$TUNXOUT= 0
##$USERA1= <user>
##$USERA2= <user>
##$USERA3= <user>
##$USERA4= <user>
##$USERA5= <user>
##$V9= 5
##$VALIST= <valist>
##$VCLIST= <CCCCCCCCCCCCCCC>
##$VD= 0
##$VDLIST= <DDDDDDDDDDDDDDD>
##$VPLIST= <PPPPPPPPPPPPPPP>
##$VTLIST= <TTTTTTTTTTTTTTT>
##$WBST= 1024
##$WBSW= 4
##$XGAIN= (0..3)
0 0 0 0 
##$XL= 0
##$YL= 0
##$YMAX_a= 330255
##$YMIN_a= -379596
##$ZGOPTNS= <>
##$ZL1= 120
##$ZL2= 120
##$ZL3= 120
##$ZL4= 120
##$ABSF1= 16.522
##$ABSF2= -4.171173
##$ABSG= 5
##$ABSL= 3
##$ALPHA= 0
##$AQORDER= 0
##$ASSFAC= 0
##$ASSFACI= 0
##$ASSFACX= 0
##$ASSWID= 0
##$AUNMP= <proc_1d>
##$AZFE= 0.1
##$AZFW= 0.1
##$BCFW= 0
##$BC_mod= 0
##$BYTORDP= 0
##$COROFFS= 0
##$CY= 12.5
##$DATMOD= 1
##$DC= 0
##$DFILT= <>
##$DTYPP= 0
##$F1P= 14.0000005364418
##$F2P= -0.99999901652339
##$FCOR= 0.5
##$FTSIZE= 32768
##$FT_mod= 6
##$GAMMA= 0
##$GB= 0
##$INTBC= 1
##$INTSCL= 1
##$ISEN= 128
##$LB= 0.3
##$LEV0= 0
##$LPBIN= 0
##$MAXI= 10000
##$MC2= 0
##$MEAN= 0
##$ME_mod= 0
##$MI= 0
##$NCOEF= 0
##$NC_proc= -3
##$NLEV= 6
##$NOISF1= 0
##$NOISF2= 0
##$NSP= 0
##$NTH_PI= 0
##$NZP= 0
##$OFFSET= 16.522
##$PC= 1
##$PHC0= 217.3151
##$PHC1= 7.207025
##$PH_mod= 1
##$PKNL= yes
##$PPARMOD= 0
##$PSCAL= 4
##$PSIGN= 0
##$REVERSE= no
##$SF= 250.13
##$SI= 32768
##$SIGF1= 0
##$SIGF2= 0
##$SINO= 400
##$SIOLD= 32768
##$SREGLST= <1H.DMSO>
##$SSB= 0
##$STSI= 32768
##$STSR= 0
##$SW_p= 5175.98343685301
##$SYMM= 0
##$S_DEV= 0
##$TDeff= 65536
##$TDoff= 0
##$TI= <Analysis number 999999
Compound Code 99
Book Reference 9
Project Code 9>
##$TILT= no
##$TM1= 0
##$TM2= 0
##$TOPLEV= 0
##$USERP1= <user>
##$USERP2= <user>
##$USERP3= <user>
##$USERP4= <user>
##$USERP5= <user>
##$WDW= 1
##$XDIM= 32768
##$YMAX_p= 442462317
##$YMIN_p= -127981
$$ End of Bruker specific parameters
$$ ---------------------------------
##NTUPLES= NMR SPECTRUM
##VAR_NAME=  FREQUENCY,     SPECTRUM/REAL,   SPECTRUM/IMAG
##SYMBOL=    X,             R,               I
##VAR_TYPE=  INDEPENDENT,   DEPENDENT,       DEPENDENT
##VAR_FORM=  AFFN,          ASDF,            ASDF
##VAR_DIM=   32768,         32768,           32768
##UNITS=     HZ,            ARBITRARY UNITS, ARBITRARY UNITS
##FACTOR=    0.157963299565203, 1,           1
##FIRST=     4132.6476996994, 0,             0
##LAST=      -1043.33573715361, 0,           0
##MIN=       -1043.33573715361, -127981,     0
##MAX=       4132.6476996994, 442462317,     0
$$ Real data points
##PAGE= N=1
##DATA TABLE= (X++(R..R)), XYDATA
$$ [...]
##PAGE= N=2
##DATA TABLE= (X++(I..I)), XYDATA
24566F79182k012k347J553j5368P611J1533P88k596q200l21Q255N14N990N277
$$ 679182 677170 674823 676376 661008 668619 680152 680940 678344 670144 669823 678078 678592 684582 689859
24552F89859r310r830m382J6497M033m025Q105l957L645J5201k732o04q484l826
$$ 689859 680549 670719 666337 682834 686867 682842 690947 686990 690635 705836 703104 702500 694016 690190
24538F90190L886j0786j1518n108j047J9617K266j7830m594j1847Q228M232k380
$$ 690190 694076 683290 671772 666664 665617 685234 687500 669670 665076 653229 661457 665689 663309
24525F63309R72o558n634O464O444O870R393L898n958L068R150l44j4306r812
$$ 663309 664281 657723 652089 658553 664997 671867 681260 685158 679200 682268 691418 691074 676768 666956
24511F66956j1116k967J5515l155M408l159o695K1058J3489q578L10l013K851
$$ 666956 655840 652873 668388 665233 669641 666482 659787 680845 694334 685756 686066 683053 685904
24498F85904K492M826k854K670J36j953j3881M595k991l854q256K060p463j3172
$$ 685904 688396 693222 690368 693038 693174 691221 677340 681935 678944 675090 666834 668894 661431 648259
24484F48259J8968J2700P626M385N373o227K333j0354o741k049J0431m670m923
$$ 648259 667227 679927 687553 691938 697311 691084 693417 683063 676322 674273 684704 680034 675111
24471F75111L340J1985K686j3354J914r778p576p819P164J0074P353j912l508
$$ 675111 678451 690436 693122 679768 681682 671904 664328 656509 663673 673747 681100 679188 675680
24458F75680r2J0265O783m508J026k440L034r487j6494J1046O114j0493N176j65
$$ 675680 675588 685853 692636 688128 689154 686714 689748 680261 663767 674813 680927 670434 675610 675445
24444F75445j2139Q423o109o967J2969K650J2901K36o198J072k500J295j0984
$$ 675445 663306 671729 665620 658653 671622 674272 687173 687409 681211 682283 679783 681078 670094
24431F70094K986O718p961j7930P283R451L588L530K4090j231l10j3807q787m646
$$ 670094 673080 679798 671837 653907 661190 670641 674229 677759 701849 700618 700308 686501 677714 673068
24417F73068K878P098J4644K67j268r405j8039n062L755l010R760N089k053k18
$$ 673068 675946 683044 697688 697955 696687 687282 669243 664181 667936 664926 674686 679775 677722 677504
24403F77504J1112m783R819O242k510K790j543J439j1738j0316m85L529n651j816
$$ 677504 688616 683833 693652 699894 697384 700174 698631 700070 688332 678016 677531 681060 675409 673593
24389F73593R238j144L152K842L484j1859j1711N129N071k444j547j0518R09P041
$$ 673593 682831 681687 684839 687681 691165 679306 667595 672724 677795 675351 673804 663286 664195 671236
24375F71236R052J5268l201k897J1479N563q256J0382L593j1509j2207j4094o457
$$ 671236 680288 695556 692355 689458 700937 706500 698244 708626 712219 700710 688503 674409 667952
24362F67952M402L648P603J2163J054j1134J1191k789j0772P246p726K831R179
$$ 667952 672354 676002 683605 695768 696822 685688 696879 694090 683318 690564 682838 685669 694848
24349F94848m288Q114L462l801L665l123p249l636L254L173j0273m417J63p791
$$ 694848 690560 698674 702136 698335 702000 698877 691628 687992 691246 694419 684146 679729 679892 672101
24335F72101J0704L333J03N084K23O572Q754N21p193j506o44o519m746J6186o784
$$ 672101 682805 686138 686241 691325 691548 698120 706874 707395 700202 698696 698052 691533 686787 702973 696189
24320F96189j2730O255K911n665j3027j5040J0184J0104r46J3411J0485M330j333
$$ 696189 683459 689714 692625 686960 673933 658893 669077 679181 678235 691646 702131 706461 705128
24307G05128o818l997N268q731m716j050N481K729J952O040K72p037J0880J031
$$ 705128 698310 694313 699581 690850 686134 685084 690565 693294 695246 701286 701558 694521 705401 706432
24293G06432l298j310Q19j3338R02O005K675o639K264J3474P990j2315J811Q314
$$ 706432 703134 701824 702643 689305 690207 696212 698887 692248 694512 707986 715976 703661 705472 713786
24279G13786k120J1457J3487j1124r305j4575j2518K74K961J2691k63K089j2089
$$ 713786 711666 723123 736610 725486 716181 701606 689088 689362 692323 705014 704751 706840 694751
24266F94751o083m496l433O713l957K404J1569P051r239n801L964j536j738J225
$$ 694751 688668 684172 680739 687452 683495 685899 697468 704519 695280 689479 693443 691907 690169 691394
24252F91394j0255n036O573O079k398q6J6581J0457J269j0106o393j0707j3862
$$ 691394 681139 676103 682676 688755 686357 686271 702852 713309 714578 704472 698079 687372 673510
24239F73510k855R793Q154L677j848j668j2567J240j83O856J7524O654l764m201
$$ 673510 670655 680448 688602 692279 690431 688763 676196 677436 677253 684109 701633 708287 704523 700322
24225G00322R563J1927J76o126j2976k0606P039O685L871L821K982J878j3806
$$ 700322 709885 721812 721988 715862 702886 682280 689319 696004 699875 703696 706678 708556 694750
24212F94750m495K329O888N091N085J0609m678j4179R468J824j60J2745P592P197
$$ 694750 690255 692584 699472 704563 709648 720257 715579 701400 710868 712692 712532 725277 732869 740066
24198G40066l991j5040j3435n353J87O991n198J995N771M510K355L083k615j903
$$ 740066 736075 721035 707600 702247 702434 709425 704227 706222 711993 716503 718858 721941 719326 717423
24184G17423M514j971M327J517j2085o69L041j8130j5972M521J4397J0485p678
$$ 717423 721937 719966 724293 725810 713725 713056 716097 697967 681995 686516 700913 711398 703720
24171G03720p847P61J267l773j848P919L189m345P725n781p004K77K15J9453K284
$$ 703720 695873 696634 697901 694128 692280 700199 703388 699043 706768 700987 693983 694260 694475 713928 716212
24156G16212k543n052O037p345k1559J227J6472J1235Q900P310p728o593o865
$$ 716212 713669 708617 714654 707309 685750 686977 703449 714684 723584 730894 723166 716573 709708
24143G09708o551J3634k322j1988L533n040j2112k985J2562o151M776J0826J6123
$$ 709708 703157 716791 714469 702481 706014 700974 688862 685877 698439 692288 697064 707890 724013
24130G24013N221O080o564p038j4222p30k739M116M907j4781o243J0853j443n320
$$ 724013 729234 735314 728750 721712 707490 706760 704021 708137 713044 698263 692020 702873 701430 696110
24116F96110N007J1956J152o424P194J2842l313M405p872J590o705k864k946J835
$$ 696110 701117 713073 714225 707801 714995 727837 724524 728929 721057 722647 715942 713078 710132 711967
24102G11967L149M613k291Q296L897l64J1977J0956o854l098m020j1337j1441
$$ 711967 715116 719729 717438 725734 729631 729267 741244 752200 745346 742248 738228 726891 715450
24089G15450L443J1266p587n306q447j2571L480R147J7809K810j6380P776J1811
$$ 715450 718893 730159 722572 717266 708819 696248 699728 708875 726684 729494 713114 720890 732701
24076G32701P882J01K701j7208r830L513M88o581m445m260L653J3336o237n117
$$ 732701 740583 740684 743385 726177 716347 719860 720348 713767 709322 705062 708715 722051 715814 710697
24062G10697n269K0758Q445j2854L198r392o098Q376J1781J8597P401p622r143
$$ 710697 705428 726186 734631 721777 724975 715583 709485 717861 729642 748239 755640 748018 738875
24049G38875j0918j900k76J8k563L657L575M9r787lJ1078j072P32l829M664P102
$$ 738875 727957 726057 725781 725799 723236 726893 730468 730517 720730 720727 731805 730733 731465 727636 732300 739402
24033G39402J842J916L07o122j3903j018M105K842m602j0390J310J671J5810l09
$$ 739402 741244 743160 743467 737345 723442 722424 726529 729371 724769 714379 715689 717360 733170 732861
24019G32861J778k972m512J61J1198L323k32n154L546n967o202j0157j4905J3250
$$ 732861 734639 731667 727155 727316 738514 741837 741605 736451 739997 734030 727828 717671 702766 716016
24005G16016J2000n038R991N237j3839Q45J7662M873l812r727N148J977n72n913
$$ 716016 728016 722978 732969 738206 724367 725212 742874 747747 743935 734208 739356 741333 740761 734848
23991G34848M384m900p085q453o527J243l228R846J8165J0826k671j0723p042
$$ 734848 739232 734332 727247 718794 712267 713510 710282 720128 738293 749119 746448 735725 728683
23978G28683J3528J461m72j3648j173J7320M91r863r325J6341R371n009j3200
$$ 728683 742211 743672 743200 729552 728379 745699 746190 736327 727002 743343 752714 747705 734505
23965G34505r687K06N305J6123K0450j2056l292j0248M352R349N794l997q864
$$ 734505 724818 725024 730329 746452 766902 754846 751554 741306 745658 755007 760801 756804 747940
23952G47940q493K181k291m443q41j398k219o502J1582k24J829J2133r494j2607
$$ 747940 739447 741628 739337 734894 734053 732655 730436 723934 735516 735292 737121 749254 739760 727153
23938G27153r131K5237J1615P949l887j2680r103k3619l117J2776J8944J829M242
$$ 727153 718022 743259 754874 762823 758936 746256 737153 713534 710417 723193 742137 743966 748208
23925G48208r4q1o733q873o089K084N155J630N666O831o00R233p542m862j793
$$ 748208 748114 748033 741300 732427 726338 728422 733577 735207 740873 747704 747104 756337 748795 743933 742140
23910G42140J353o340K277J8359J0353J0937K635n993j0308j3030j1814n725K2192
$$ 742140 743493 737153 739430 757789 768142 779079 781714 775721 765413 752383 740569 734844 757036
23897G57036p59m633j545r04j0187m952P057N527k652m735Q749o442j977R66L844
$$ 757036 756277 751644 750099 749195 739008 734056 741113 746640 743988 739253 748002 741560 739583 740549 744393
23882G44393m483P80K205q560j0231N38R342j603N739l637Q516R119j3047n330
$$ 744393 739910 740690 742895 734335 724104 724642 733984 732381 738120 734483 742999 752118 739071 733741
23868G33741M670k60R84p572o361N476J1253J0280r74j3831P23K871k861R061
$$ 733741 738411 738151 739135 731563 725202 730678 741931 752211 751237 737406 738129 741000 738139 747200
23854G47200O342j1734O570l434J812O442P056K521m870l687j8618N67R710J4349
$$ 747200 753542 741808 748378 744944 746756 753198 760254 762775 757905 754218 735600 736167 745877 760226
23840G60226l244k416K26l618Q712K925p281M009L096r193m034m419O606J1005
$$ 760226 756982 754566 754792 751174 759886 762811 755530 759539 762635 753442 749408 744989 751595 762600
23826G62600k404l311m110j775q892K170J0950L134O971k333j5439P682M224K38
$$ 762600 760196 756885 752775 751000 742108 744278 755228 758362 765333 763000 747561 755243 759467 759705
23812G59705R820M04n195m745l043L884l275m190P938J689K253K59l35m862o299
$$ 759705 769525 769929 764734 759989 756946 760830 757555 753365 761303 762992 765245 765504 765169 760307 754008
23797G54008j2154q192K2831J8689j366j1009k317n623q071Q061J0897o891o959
$$ 754008 741854 733662 756493 775182 773816 762807 760490 754867 746796 754857 765754 758863 751904
23784G51904k4N906R063K982k987L743l231l976l869j796n705j2997O043N411
$$ 751904 751880 757786 766849 769831 766844 770587 767356 763380 759511 757715 752010 739013 745056 750467
23770G50467j5455o415R775J4018J107j1930m803R013Q809k654p799K061J8278
$$ 750467 735012 728597 738372 752390 753497 741567 736764 745777 754586 751932 744133 746194 764472
23757G64472R169p143j280p866K751k346j643n01j231J1143n961r984j7083L125
$$ 764472 773641 766498 765218 757352 760103 757757 756114 755613 754382 765525 759564 749580 732497 735622
23743G35622L586j780j184P765J0990p88j874J4269q027o544K983J616J720R116
$$ 735622 739208 737428 736244 744009 754999 754211 752337 766606 758579 752035 755018 756634 758354 767470
23729G67470k190Q275O921K089m898k602k070o242j683J018K137r01p029r814
$$ 767470 765280 773555 780476 782565 777667 775065 772995 766753 765070 766088 768225 767324 760295 750481
23715G50481j927Q306k624k655P293N894m068K317L579o34J8296M068q388J1482
$$ 750481 748554 756860 754236 751581 758874 764768 760700 763017 766596 765962 784258 788326 779938 791420
23701G91420J0789j4345o893m723L78q981n987j2145l824J9062J0280N379Q070
$$ 791420 802209 787864 780971 776248 776626 767645 761658 749513 745689 764751 775031 780410 788480
23688G88480j0730k278J093j5660o276R136P387l553q290N76l509Q340l887J018
$$ 788480 777750 775472 776565 760905 754629 763765 771152 767599 759309 759885 756376 764716 760829 761847
23674G61847k703J1478O516Q908j669o269n439l799m39M163N541J0797M026o078
$$ 761847 759144 770622 777138 786046 784377 778108 772669 768870 768431 772594 778135 788932 792958 786880
23660G86880k865N545N070m289o947j3768m967J6696J6925M17l733j5186K05J5483
$$ 786880 784015 789560 794630 790341 783394 769626 764659 781355 798280 798697 794964 779778 779983 795466
23646G95466R767j2018p434o14o411k287R529n808q034l797K433L708k080j4763
$$ 795466 805233 793215 785781 785167 778756 776469 785998 780190 772156 768359 770792 774500 772420 757657
23632G57657l761R138K2853m822J054J3489K226j1443j2376K10R196j0452o956
$$ 757657 753896 763034 785887 781065 782119 795608 797834 786391 774015 774225 783421 772969 766013
23619G66013N960o9R363L832M10O543K455j0487k836O466J1685M238j1645m542
$$ 766013 771973 771904 781267 785099 785509 792052 794507 784020 781184 787650 799335 803573 791928 787386
23605G87386j487K591q9m021k685L931k097O82n827r447M765n974j6881K669k747
$$ 787386 785899 788490 788401 784380 781695 785626 783529 784211 778384 768937 773702 767728 750847 753516 750769
23590G50769M66Q006O896J0307J287j089J3692j817j139J4425O385k792j4586
$$ 750769 751235 759241 766137 776444 777731 776642 790334 788517 787378 801803 808188 805396 790810
23577G90810j6641j6925P503J8277P451j700k74m66M493J3886m604J149o84p640
$$ 790810 774169 757244 764747 783024 790475 788775 788501 788035 792528 806414 801810 802959 802275 794635
23563G94635m14J0094P47n633J0079r925J26L467J201j7125l887J1880n206j1509
$$ 794635 794221 804315 805062 799429 809508 799583 799709 803176 804377 787252 783365 795245 790039 778530
23549G78530P165J1247j6001j145J0854J340p67n013O617P990P316k988j848p728
$$ 778530 785695 796942 780941 779796 790650 791990 791223 786210 792827 800817 808133 805145 803297 795569
23535G95569j0520M114J0886j1P310M342l878m729p837o737k227N19R257J112
$$ 795569 785049 789163 800049 800038 807348 811690 807812 803083 795246 788509 786282 786801 796058 797170
23521G97170M737O867l21j2779j0835l741M063O143M221J0163q281j2237O924
$$ 797170 801907 808774 808453 795674 784839 781098 785161 791304 795525 805688 797407 785170 792094
23508G92094R221O117j84r828N15j095M614J4271O467K790j6802j0269l813L533
$$ 792094 801315 807432 807248 797420 797935 796840 801454 815725 822192 824982 808180 797911 794098 797631
23494G97631J3162k532j4172n859K2967N153j0957l539j796l6O746Q395j2993
$$ 797631 810793 808261 794089 788230 811197 816350 805393 801854 800058 800022 806768 815163 802170
23481H02170O84n940m704N356p427Q295M087Q320P332j0810Q960j0473l208J970
$$ 802170 802854 796914 792210 797566 790139 798434 802521 810841 818173 807363 816323 805850 802642 804612
23467H04612R109q625j6571J0143k719O197O123q127L480J3232q713N755n700
$$ 804612 813721 805096 788525 798668 795949 802146 808269 800142 803622 816854 808141 813896 808196
23454H08196j5276j1899m994J0574J2657R947P476j613K932m826N833l944j1402
$$ 808196 792920 781021 776027 786601 799258 809205 816681 815068 818000 813174 819007 815063 803661
23441H03661K377Q576L249J3772J6560L027p52j6034l100j3858j5125J1457p37
$$ 803661 806038 814614 817863 831635 848195 851222 850470 834436 831336 817478 802353 813810 813073
23428H13073Q599M132j1276L826K8971j972j7646m508r366q88J723n18l608l933
$$ 813073 821672 825804 814528 818354 847325 845353 827707 823199 813833 812945 814668 814150 810542 806609
23414H06609J1730L964Q04j3087N72M383K921J3531j012p462m592N8j2116N671
$$ 806609 818339 822303 823107 810020 810592 814975 817896 831427 830415 822953 818361 818419 806303 811974
23400H11974J538n185j274K057K854Q830R699j241j9005j677K080K838m865L199
$$ 811974 813512 808327 807053 809110 811964 820794 830493 829252 810247 808570 810650 813488 808623 811822
23386H11822o516J976R213R974P602M591J674K547l091l46k358p218n087k557
$$ 811822 805306 807282 816495 826469 834071 838662 840336 842883 839792 839446 837088 829870 824783 822226
23372H22226l22L601N73l147p027M990J113l429j4764j0429P986J1649N290J973
$$ 822226 821904 825505 826078 822931 815904 820894 822007 818578 803814 793385 801371 813020 818310 820283
23358H20283J4134j241n605k445n197L364J2788L229j1812l059J278q85j081n664
$$ 820283 834417 833176 827571 825126 819929 823293 836081 839310 827498 824439 825717 824832 823751 818087
23344H18087l258M692J0184K0335Q235j5406j5578j1478P254k668q57K851o060
$$ 818087 814829 819521 829705 850040 858275 842869 827291 815813 823067 820399 819542 822393 816333
23331H16333Q512J1985P444r791r173n911J870M402R33J7853K001j0325K388N51
$$ 816333 824845 836830 844274 834483 825310 819399 821269 825671 826604 844457 846458 836133 838521 839072
23317H39072j445K309m747P806K0577L865j6662m593j0130k943j335O593J5160
$$ 839072 837627 839936 835189 842995 863572 867437 850775 846182 836052 833109 831774 838367 853527
23304H53527Q845P251j3852j9975N45R306p900j968j2548J98Q82n259J2378R498
$$ 853527 862372 869623 855771 835796 836341 845647 837747 835779 823231 823429 824311 819052 831430 840928
23290H40928M771Q289M975o926p692j63J3414j187J892o979j1622j0234J723O576
$$ 840928 845699 853988 858963 852037 844345 844182 857596 856409 858301 851322 839700 829466 831189 837765
23276H37765J8766o265p408l165l688N625j1408O637K6627L634j5104j7195r788
$$ 837765 856531 850266 842858 839693 836005 841630 830222 836859 863486 867120 852016 834821 825033
23263H25033m031r346J0029J0982o207M699K4360J9511J280q285k5854R74J1268
$$ 825033 821002 811656 821685 832667 826460 831159 855519 875030 876310 868025 842171 843145 854413
23250H54413O509K180q375j6884r761m333J1669L885n7J1455R553j770j2599l805
$$ 854413 860922 863102 854727 837843 828082 823749 835418 839303 839246 850701 860254 858484 845885 842080
23236H42080J1078J113o413m074L10J2960j770M747K516K362m857j2633j5602
$$ 842080 853158 854271 847858 843784 844094 857054 855284 860031 862547 864909 860052 847419 831817
23223H31817q12J6678P109p940L90L86j3091K480R508N077p414p094J832J993
$$ 831817 831005 847683 854792 846852 847242 847628 834537 837017 846525 851602 844188 837094 838926 840919
23209H40919J0995J2214L696k597J812J470q620j4374p083J2092P427K768P895
$$ 840919 851914 864128 867824 865227 867039 868509 859889 845515 838432 850524 857951 860719 868614
23196H68614J0840L515j1339j1990q404J0267N519o257j4422n082q205J1232N310
$$ 868614 879454 882969 871630 859640 851236 861503 867022 860765 846343 841261 833056 844288 849598
23183H49598N411j230N532l136O756J2341J9811p477k0748r972o066L273J0051
$$ 849598 855009 853779 859311 856175 862931 875272 895083 887606 866858 856886 850820 854093 864144
23170H64144q909n940L718O689k503j5302J017N633Q327J1768N74m897J4390l303
$$ 864144 855235 849295 853013 859702 857199 841897 842914 848547 856874 868642 869216 864319 878709 875406
23156H75406p9Q855r112o429l129J838K604L389j0603j2334J5147N489k438p937
$$ 875406 875327 884182 875070 868641 865512 867350 869954 873343 862740 850406 865553 871042 868604 860667
23142H60667q875J3139L163N58j5273j1545K643m248N41R030N8k867P760L490
$$ 860667 851792 864931 868094 868652 853379 841834 844477 840229 840770 849800 849858 846991 854751 858241
23128H58241L434j474Q817L130o1O761l921j0691o354J858P732J0092J739q263
$$ 858241 861675 860201 869018 872148 872087 878848 874927 864236 857882 859740 867472 877564 879303 871040
23114H71040O280J0338M323o256j2122J0828R920L779r754j3495o893j732j581
$$ 871040 877320 887658 891981 885725 873603 884431 894351 898130 888376 874881 867988 866256 864675
23101H64675O249R177j260j5086M554q009r813n95K2463Q717j5276m133J2049
$$ 864675 870924 880101 878841 863755 868309 860300 850487 849892 872355 881072 865796 861663 873712
23088H73712k144j4681j566J0716o41o928O155P73J801P214J3056J0350L630l29
$$ 873712 871568 856887 855321 866037 865396 858468 864623 865396 867197 874411 887467 897817 901447 901118
23074I01118J2048r613j7929j1139p623K742P932l012m987k200l34p714L452L313
$$ 901118 913166 903553 885624 874485 866862 869604 877536 874524 869537 867337 867003 859289 862741 866054
23060H66054k325J2445K860m277M566p386P843j38Q20K266J0285P486j4033p827
$$ 866054 863729 876174 879034 874757 879323 871937 879780 879642 880462 882728 893013 900499 886466 878639
23046H78639J127J3769K192j5696r658J041J2220m729j476L968J475j5323M289
$$ 878639 879766 893535 895727 880031 870373 871414 883634 878905 877429 881397 882872 867549 871838
23033H71838j195L168R014J416J0482p106n205L52m704j1659J045M653J1481J5675
$$ 871838 870643 873811 882825 884241 894723 887617 882412 882764 878060 866401 867446 872099 883580 899255
23019H99255O214o420j1395k430J6550p821n154M367r841q357K379J5089J0804
$$ 899255 905469 899049 887654 885224 901774 893953 888799 893166 883325 874968 877347 892436 903240
23006I03240m74l846o154q114K732L795l238L089p373j751K054J729N11Q027R07
$$ 903240 902766 898920 892766 884652 887384 891179 887941 891030 883657 881906 883960 885689 886200 894227 895134
22991H95134l33n253Q047O98J367k587J546n548j754j812J7733M007R1m855L263
$$ 895134 894801 889548 897595 898293 899660 897073 898619 893071 891317 889505 907238 911245 911336 906481 909744
22976I09744M894j4201j7156M939J0448R79k718n624J567n871j3175J684P181
$$ 909744 914638 900437 883281 888220 898668 899647 896929 891305 892872 887001 873826 875510 882691
22963H82691L109Q588Q928j886k060j1819P46M496P958k62J9947Q061j2603j7431
$$ 882691 885800 894388 903316 901430 899370 887551 888297 892793 900751 900489 920436 928497 915894 898463
22949H98463q763M177O889o935m844o565R554O897l666N272J636N679K532j177
$$ 898463 889700 893877 900766 893831 888987 882422 891976 898873 895207 900479 902115 907794 910326 909149
22935I09149j157K257O523Q656K126l192o991j1831j3706K026M885m368p25J2378
$$ 909149 907992 910249 916772 925428 927554 924362 917371 905540 891834 893860 898745 894377 893652 906030
22921I06030M613r067p689m818J6514J2788j3371j2656J313J2021m46m406R157
$$ 906030 910643 901576 893887 889069 905583 918371 905000 892344 893657 905678 905232 900826 909983
22908I09983M42p96N42n508m641J4129p091n76L689J4054r376Q582P064P507n361
$$ 909983 910425 909629 910171 904663 900022 914151 907060 906484 910173 924227 914851 923433 930497 938004 932643
22893I32643j4530L496m387K039M708O117j391j4140m434J449j187J779J1203
$$ 932643 918113 921609 917222 919261 923969 930086 928695 914555 910121 911570 910383 912162 923365
22880I23365J2118j258q679q170J7459r315j1241k812O586K122l376l737O502
$$ 923365 935483 934225 925546 917376 934835 925520 914279 911467 918053 920175 916799 913062 919564
22867I19564Q97q124l428J4589J2206m472j8960J913J7175R07o681n414Q076q113
$$ 919564 920461 912337 908909 923498 935704 931232 912272 914185 931360 932267 925586 920172 928248 920135
22853I20135j2453J5405J2168j962j6458p658J6187R099j476K385N735j0555o515
$$ 920135 907682 923087 935255 933293 916835 909177 925364 934463 932987 935372 941107 930552 924037
22840I24037J8719M0l26M81J88n930j0919J2587M259J2876j2004n891l783j1210
$$ 924037 942756 942796 942470 942951 943139 937209 926290 938877 943136 956012 944008 938117 934334 923124
22826I23124k862Q63J184j760O432j775j64J1086O603J202K200K247N807r28o661
$$ 923124 920262 921125 922309 920549 926981 925206 925042 936128 942731 943933 946133 948380 954187 953259 946598
22811I46598j0882M10n331K496r297j4901m944K507n438J1223J6507K724J759
$$ 946598 935716 936126 930795 933291 923994 909093 904149 906656 901218 912441 928948 931672 933431
22798I33431p600K186J931L473k145r877l637l39J0378Q862N243n98j1249L2M17
$$ 933431 925831 928017 929948 933421 931276 921399 917762 917423 927801 936663 941906 941308 930059 930091 930508
22783I30508j440J330M619J4648l944q613J3931J1101P057p170k7685j1571M180
$$ 930508 929068 930398 935017 949665 945721 937108 951039 962140 969197 962027 934342 922771 926951
22770I26951Q849l46M398J2970n551j6736l437M144n093P6j203n142P519J5763
$$ 926951 935800 935454 939852 952822 947271 930535 927098 931242 926149 926225 925022 919880 927399 943162
22756I43162J2869J5444m747j7931l054o884j0096n05K0068P891l192j0256j4130
$$ 943162 956031 971475 966728 948797 945743 938859 928763 928258 948326 956217 953025 942769 928639
22743I28639J3492J0494q660J182K272P64j467N196K243n438m654P479O103o961
$$ 928639 942131 952625 943965 945147 947419 948183 946716 951912 954155 948717 944063 951542 957645 950684
22729I50684j433j8678m509O940Q038O646m2p860N167O655O801J999P79K876K169
$$ 950684 949251 930573 926064 933004 941042 947688 947646 939786 944953 951608 958409 960408 961187 964063 966232
22714I66232K286n020j1023m381J839J2755L771L246m071k222j1980q200m425
$$ 966232 968518 963498 952475 948094 949933 962688 966459 969705 965634 963412 951432 943232 938807
22701I38807P829k071J0184K259k423j3450k452J2212P789Q222p053l928Q737
$$ 938807 946636 944565 954749 957008 954585 941135 938683 950895 958684 966906 959853 955925 964662
22688I64662r832k0161K132L184N36J1456Q624p584K2781J0810j0604q726P789
$$ 964662 954830 934669 936801 939985 940521 951977 960601 953017 975798 986608 976004 967278 975067
22675I75067Q29k1670q088K632J3282R56p44K72l790q077J1179O798J351j3999
$$ 975067 975896 954226 946138 948770 962052 963008 962264 962536 958746 950669 961848 968646 969997 955998
22661I55998K46J5103k448p334P211K207J0978M187j3483m450K650o307k44O523
$$ 955998 956244 971347 968899 961565 968776 970983 981961 986148 972665 968215 970865 964558 964314 970837
22647I70837M702k35L845P131K322p890m312j948j698j625m587J0033J1889m251
$$ 970837 975539 975304 979149 986280 988602 980712 976400 974452 972754 971129 966542 976575 988464 984213
22633I84213l650n973j3759l684j329m073J1563J4069L378m10P476j100k533J3868
$$ 984213 980563 974590 960831 957147 955818 951745 963308 977377 980755 980345 987821 986721 984188 998056
22619I98056m164o743j0015n168j141N684L01k60p821J4907J218n146K964J0247
$$ 998056 993892 987149 977134 971966 970825 976509 976810 976550 968729 983636 984854 979708 982672 992919
22605I92919J1550j5284l156j803j2430l220k986N474j260m343l597l935J9026
$$ 992919 1004469 989185 986029 984226 971796 968576 965590 971064 969804 965461 961864 957929 976955
22592I76955J8769m663o594J2972k699K985J0040M346o790m154M26J372j0406
$$ 976955 995724 991061 984467 997439 994740 997725 1007765 1012111 1005321 1001167 1001593 1002965 992559
22579I92559P439O072J3178l231n311l664o685k083L960O211N546q810j6322M200
$$ 992559 999998 1006070 1019248 1016017 1010706 1007042 1000357 998274 1002234 1008445 1013991 1005181 988859 993059
22565I93059n143J2864p561q464j847k982J646j2590O450J4423O629k11r113j3257
$$ 993059 987916 1000780 993219 984755 982908 979926 981572 968982 975432 989855 996484 996273 987160 973903
22551I73903j547J2335K547k0399j021N919Q755L25q190P985N664N957J6565M532
$$ 973903 972356 984691 987238 966839 965818 971737 980492 980817 972627 980612 986276 992233 1008798 1013330
22537A013330n241n431n533r399r704R050J4219r62J547J2j0542P83J880p33r577
$$ 1013330 1008089 1002658 997125 987726 978022 987072 1001291 1000329 1001876 1001888 991346 992129 994009 993276 983699
22522I83699J5664Q541q889N265N241m375P880K3529r316j8044J420M214q9j3448
$$ 983699 999363 1007904 999015 1004280 1009521 1005146 1013026 1036555 1027239 1009195 1010615 1014829 1014740 1001292
22508A001292o282j954L999J027j1047j0217M213j928J4276R061n606K372n413
$$ 1001292 995010 993056 997055 998082 987035 976818 981031 979103 993379 1002440 996834 999206 993793
22495I93793O632k110J0890Q696j291m339l22L826r669j124N435l69N728j878
$$ 993793 1000425 998315 1009205 1017901 1016610 1012271 1011949 1015775 1006106 1004982 1010417 1010048 1015776 1013898
22481A013898j0480j2474R929K3851N16j699Q611O481n402r752q223J11J232n733
$$ 1013898 1003418 990944 1000873 1024724 1025240 1023541 1032152 1038633 1033231 1023479 1015256 1015367 1016599 1010866
22467A010866J1584J4216q204j0872k18N821q810o741J4832J6023O187j0890j3985
$$ 1010866 1022450 1036666 1028462 1017590 1017372 1023193 1014383 1007642 1022474 1038497 1044684 1033794 1019809
22454A019809m770J8713J0987j1218j0742j992O708J6133j593j2519j1329k707
$$ 1019809 1015039 1033752 1044739 1033521 1022779 1020787 1027495 1043628 1042035 1029516 1018187 1015480
22442A015480J0186o443r45m360J972K111l201K058J820L158j005n107m06M690
$$ 1015480 1025666 1019223 1018278 1013918 1015890 1018001 1014800 1016858 1018678 1021836 1020831 1015724 1015318 1020008
22428A020008K614q957K920k072k229J870n713R313J1374J7313M697j0683m959
$$ 1020008 1022622 1013665 1016585 1014513 1012284 1014154 1008441 1017754 1029128 1046441 1051138 1040455 1035496
22415A035496L461n300k407J0965O087j2177q194M013J399m310Q253P09o493j0743
$$ 1035496 1038957 1033657 1031250 1042215 1048302 1036125 1027931 1031944 1033343 1029033 1037286 1037995 1031502 1020759
22401A020759K566o450L715R654J51j63P369o47n696j3924o142r538p52J2292
$$ 1020759 1023325 1016875 1020590 1030244 1030395 1030232 1037601 1036954 1031258 1017334 1011192 1001654 1000902 1013194
22387A013194J1594J3153K928j534Q448p412o025q723k151R294J2907Q634J455
$$ 1013194 1024788 1037941 1040869 1039335 1047783 1040371 1034346 1025623 1023472 1032766 1045673 1054307 1055762
22374A055762o11R949p269j7207o291r659q953N268n835N626J2893J2526Q166
$$ 1055762 1055151 1065100 1057831 1040624 1034333 1024674 1015721 1020989 1015154 1020780 1033673 1046199 1054365
22361A054365J1931j0633l808l023Q017R543K133j5462L107P388m44j1932q641
$$ 1054365 1066296 1055663 1051855 1048832 1056849 1066392 1068525 1053063 1056170 1063558 1063114 1051182 1042541
22348A042541k997M024R133P260l620P142Q651R648N58j9064j2810k95P939j1757
$$ 1042541 1039544 1043568 1052701 1059961 1056341 1063483 1072134 1081782 1082340 1063276 1050466 1050171 1058110 1046353
22334A046353l878k964n862L935L983L07J9054L515o531j2191k538L548J1950
$$ 1046353 1042475 1039511 1033649 1037584 1041567 1041874 1060928 1064443 1057912 1045721 1043183 1046731 1058681
22321A058681K204l044m246R282N87k0450l529K923J9661M631M202l485J867J2002
$$ 1058681 1060885 1057841 1053595 1062877 1063464 1043014 1039485 1042408 1062069 1066700 1070902 1067417 1069284 1081286
22307A081286j3956N336k521m588j0064J409m490M894M602j0457k427k08R076
$$ 1081286 1067330 1072666 1070145 1065557 1055493 1056902 1052412 1057306 1061908 1051451 1049024 1048816 1057892
22294A057892M972l518j0490R384k569o170N881K407j2129J4026R216j2896k185
$$ 1057892 1062864 1059346 1048856 1058240 1055671 1049501 1055382 1057789 1045660 1059686 1068902 1056006 1053821
22281A053821n213L874M210P333J401p2L623j2401o720O967Q283j68q774j372
$$ 1053821 1048608 1052482 1056692 1064025 1065426 1065354 1068977 1056576 1049856 1056823 1065106 1064938 1056164 1054792
22267A054792J2459O903l157p108n835p386R643J0247P705O965q075J18q90r257
$$ 1054792 1067251 1074154 1070997 1063889 1058054 1050668 1060311 1070558 1078263 1085228 1077153 1077271 1076381 1067124
22253A067124l876K870Q361M514K988J2396P254n003j1400j5205L203J5028J4497
$$ 1067124 1063248 1066118 1074479 1078993 1081981 1094377 1101631 1096628 1085228 1070023 1073226 1088254 1102751
22240A102751o078n907P16M79k135l449o321r724j543k159k601L272R037J1703
$$ 1102751 1096673 1090766 1091482 1091961 1089826 1086377 1080056 1070332 1068789 1066630 1064029 1067301 1076338 1088041
22226A088041m663j9578m384M327N627O788j762J732K494K964L981p056q512L858
$$ 1088041 1083378 1063800 1059416 1063743 1069370 1076158 1074396 1076128 1078622 1081586 1085567 1078511 1069999 1073857
22212A073857N060r78k819N440J1113J3593J3463j2967M422r75j0011K079O535
$$ 1073857 1078917 1077939 1075120 1080560 1091673 1105266 1118729 1105762 1110184 1109209 1099198 1101277 1107812
22199A107812o98m866J569O554p101m529k43j1966j1152R39J2495Q964M89K3107
$$ 1107812 1107114 1102248 1103817 1110371 1103270 1098741 1098498 1086532 1075380 1076319 1088814 1097778 1098267 1121374
22185A121374J4752R22k2873j5990O604J4088P285o206q283p882N743N021j1767
$$ 1121374 1136126 1137048 1114175 1098185 1104789 1118877 1126162 1119956 1111673 1103791 1109534 1114555 1102788
22172A102788q987l160M649Q647p203p786J045j0095n002J900K591J2441P461
$$ 1102788 1093801 1090641 1095290 1103937 1096734 1088948 1089993 1079898 1074896 1076796 1079387 1091828 1099289
22159A099289M393J1985j6268j1301J297P805J2977J112o113M902K209M185m749
$$ 1099289 1103682 1115667 1099399 1088098 1089395 1097200 1110177 1111289 1105176 1110078 1112287 1116472 1111723
22146A111723m600J467k267N705r911M119R986O463M04M780r275r350q632j0433
$$ 1111723 1107123 1108590 1106323 1112028 1102117 1106236 1116222 1122685 1123089 1127869 1118594 1109244 1100612 1090179
22132A090179O253P71n696R722m3M499R424J5369r955p456K829n403m63J088P20
$$ 1090179 1096432 1097203 1091507 1101229 1101186 1105685 1115109 1130478 1120523 1113067 1115896 1110493 1110030 1111118 1111838
22117A111838j0213Q47J5775q892k671J3042m64Q223j1622l950P101J4186Q395
$$ 1111838 1101625 1102472 1118247 1109355 1106684 1119726 1119262 1127485 1115863 1111913 1119014 1133200 1141595
22104A141595N741M623m751p377o375j7917J342m952n483R077Q165k2997K827
$$ 1141595 1147336 1151959 1147208 1139831 1133456 1115539 1116881 1111929 1106446 1115523 1123688 1100691 1103518
22091A103518K6531J5247o737p278k098j697N228o086P76L710j540K397q174K364
$$ 1103518 1130049 1145296 1138559 1131281 1129183 1127486 1132714 1126628 1127404 1131114 1129574 1131971 1123797 1126161
22077A126161q57J4859R16j7594p219P524M644J5021O818m117M478P464l915q498
$$ 1126161 1125304 1140163 1141079 1123485 1116266 1123790 1128434 1143455 1150273 1146156 1150634 1158098 1154183 1145685
22063A145685L455m391m929O161n003J504M424j5621q090O16M099L217n638J8278
$$ 1145685 1149140 1144749 1139820 1145981 1140978 1142482 1146906 1131285 1123195 1123811 1127910 1131127 1125489 1143767
22049A143767K0555p169p065j2406K90K417O813P739L173L587j2443j8190J2802
$$ 1143767 1164322 1157153 1150088 1137682 1137972 1140389 1147202 1154941 1158114 1161701 1149258 1131068 1143870
22036A143870O897r817M525J0116J1615M486M847k23j1375Q507M978K12j81j1766
$$ 1143870 1150767 1140950 1145475 1155591 1167206 1171692 1176539 1176316 1164941 1173448 1178426 1178638 1178457 1166691
22022A166691P607n268r170n795J1186M90j1356J1061M751m154j5492o746j7581
$$ 1166691 1174298 1169030 1159860 1154065 1165251 1165741 1154385 1165446 1170197 1166043 1150551 1143805 1126224
22009A126224p306J7873J2126O250Q34R764J205L248J1827J162j0844r321p099
$$ 1126224 1118918 1136791 1148917 1155167 1156001 1165765 1166970 1170218 1182045 1183207 1172363 1163042 1155943
21996A155943M568N801j024r77j0445j875ko690P51J4058K653k519L434P16J749
$$ 1155943 1160511 1166312 1165288 1164311 1153866 1151991 1151989 1145299 1146050 1160108 1162761 1160242 1163676 1164392 1166141
21981A166141M380J131k1072Q28M766N603L965O335O955k293N992k230p731K729
$$ 1166141 1170521 1171652 1150580 1151408 1156174 1161777 1165742 1172077 1179032 1176739 1182731 1180501 1172770 1175499
21967A175499Q886p64J1107l694p298j006k048k681O603P949n053o399M286J317
$$ 1175499 1184385 1183621 1194728 1191034 1183736 1182730 1180682 1178001 1184604 1192553 1187500 1181101 1185387 1186704
21953A186704j1275J802R275r9o320j1692O58J004K408J4964L914j0201M641L491
$$ 1186704 1175429 1177231 1186506 1186407 1180087 1168395 1169053 1170057 1172465 1187429 1191343 1181142 1185783 1189274
21939A189274N486r022r660R006l119n19Q142j5802J895R796J30k863k835j0146
$$ 1189274 1194760 1185738 1176078 1185084 1181965 1181446 1189588 1173786 1175681 1185477 1185607 1182744 1179909 1169763
21925A169763k938L466Q332J4674M675p518M704p240p343P225Q560m064k2687
$$ 1169763 1166825 1170291 1178623 1193297 1197972 1190454 1195158 1187918 1180575 1187800 1196360 1192296 1169609
21912A169609r842J1882J0296O655K232l256M047N370M36r319M278J5302L740
$$ 1169609 1159767 1171649 1181945 1188600 1190832 1187576 1191623 1196993 1197429 1188110 1192388 1207690 1211430
21899A211430k039k747j1021k622l95P115L911q881J1402P570P804k96n927J6314
$$ 1211430 1209391 1206644 1195623 1193001 1192606 1199721 1203632 1194751 1206153 1213723 1221527 1221231 1215304 1231618
21885A231618J1324j575n390j9922j137j20o623J2611J834l027O219p327K322
$$ 1231618 1242942 1241367 1235977 1216055 1214918 1214798 1208175 1220786 1222620 1219593 1225812 1218485 1220807
21872A220807q100k530O591l860r285n302J0534Q001m286j610J892O538j0493
$$ 1220807 1212707 1210177 1216768 1212908 1203623 1198321 1208855 1216856 1212570 1210960 1212852 1219390 1208897
21859A208897O791P015M657O539j2988j9339r18K3327J2940N232k757q814r176
$$ 1208897 1215688 1222703 1227360 1233899 1220911 1201572 1200654 1223981 1236921 1242153 1239396 1230582 1221406
21846A221406k091J2434K42j759K086n821K502J4763j0476j646M318J2143N904
$$ 1221406 1219315 1231749 1231991 1230232 1232318 1226497 1228999 1243762 1233286 1231640 1235958 1248101 1254005
21833A254005l597j3035n839P210m456M750j709j6097l793J1217L44N965n822
$$ 1254005 1250408 1237373 1231534 1238744 1234288 1239038 1237329 1221232 1217439 1228656 1229000 1234965 1229143
21820A229143J4206O11j4095k47J6537M597j1747n079O649k105n982j1080j04
$$ 1229143 1243349 1243960 1229865 1229618 1246155 1250752 1239005 1233926 1240575 1238470 1232488 1221408 1221304
21807A221304J0677P367K668M788L861N481j0056m937L686K12j6016J5J5894r33
$$ 1221304 1231981 1239348 1242016 1246804 1250665 1256146 1246090 1241153 1244839 1245051 1229035 1229050 1244944 1244011
21793A244011j52O506M286o974j2324k482j0458q723R971J0494J1003K269K426
$$ 1244011 1243859 1250365 1254651 1247677 1235353 1232871 1222413 1213690 1223661 1234155 1245158 1247427 1249853
21780A249853m175j027o46J2354J370K44j0196J036L269j2794MJ366J7253P221
$$ 1249853 1245678 1244651 1244005 1256359 1257729 1257973 1247777 1248813 1252082 1239288 1239292 1240658 1257911 1265132
21766A265132J2186L945q000J849L000R169n692l459Q982m409j1224J958l579
$$ 1265132 1277318 1281263 1273263 1275112 1278112 1287281 1281589 1278130 1287112 1282703 1271479 1273437 1269858
21753A269858m881p031k671j705L047P869j7092n80L188O172K96L486l683M902
$$ 1269858 1264977 1257946 1255275 1253570 1256617 1264486 1247394 1246814 1250002 1256174 1256470 1259956 1256273 1261175
21739A261175N409Q18q42j2578K895O773P234m561n432P836j9088J684R197J2261
$$ 1261175 1266584 1267402 1266560 1253982 1256877 1263650 1270884 1266323 1260891 1268727 1249639 1251323 1260520 1272781
21725A272781M238k523K292k295M970q631j1166M154J203j237K036P680J217Q524
$$ 1272781 1277019 1274496 1276788 1274493 1279463 1270832 1259666 1263820 1265023 1263786 1265822 1273502 1274719 1283243
21711A283243N131Q598j660m11r387q80K642J718R026P878k998p797j96p962P569
$$ 1283243 1288374 1296972 1295312 1294901 1285514 1284634 1287276 1288994 1298020 1305898 1302900 1295103 1294907 1286945 1294514
21696A294514N124N189j932O724O27L936l797j6824k528J3868j5041q726o546
$$ 1294514 1299638 1304827 1302895 1309619 1310246 1314182 1310385 1293561 1291033 1304901 1289860 1281134 1274588
21683A274588J6241P147M445J629m552P587J5324P607j1624k3409J94N966J932
$$ 1274588 1290829 1297976 1302421 1304050 1299498 1307085 1322409 1330016 1318392 1294983 1295177 1301143 1303075
21670A303075K74J063m847J2555o64j2702n30J2563Q317O12k027J881J0150l941
$$ 1303075 1303349 1304412 1299565 1312120 1311456 1298754 1298224 1310787 1319104 1319716 1317689 1319570 1329720 1325779
21656A325779r473l752J4485j0068j0411l427O430Q370j9L003o647j2232n668
$$ 1325779 1316306 1312554 1327039 1316971 1306560 1303133 1309563 1317933 1317914 1320917 1314270 1302038 1296370
21643A296370J1269J6975J0528O181J1847L763j1206R10N936k1179j0458p580
$$ 1296370 1307639 1324614 1335142 1341323 1353170 1356933 1345727 1346637 1352573 1331394 1320936 1313356
21631A313356j876N10J2405j191J3206J7436m297o464J626J2061n233j2646j2367
$$ 1313356 1311480 1311990 1324395 1323204 1336410 1353846 1349549 1343085 1344711 1356772 1351539 1338893 1326526
21618A326526p8P233r391k564J8222j4533n87J7983m30Q746J749o977K447l507
$$ 1326526 1326448 1333681 1324290 1321726 1339948 1325415 1324828 1342811 1342381 1351127 1352876 1345899 1348346 1344839
21604A344839m07J2218m171q516n056o676l188M862O399n91m114n078O651O853
$$ 1344839 1344432 1356650 1352479 1343963 1338907 1332231 1329043 1333905 1340304 1339713 1335599 1330521 1337172 1344025
21590A344025J435O53m474j4420N050J3037p885N144l60J0509J2735j7353l593
$$ 1344025 1345460 1346113 1341639 1327219 1332269 1345306 1337421 1342565 1342205 1352714 1365449 1348096 1344503
21577A344503Q375M997l078l868n499N41R992m162L592J3456O938k086r717Q594
$$ 1344503 1352878 1357875 1354797 1350929 1345430 1345971 1355963 1351801 1355393 1368849 1375787 1373701 1363984 1372578
21563A372578J400O530k0310l932p978P592P618J68j0323m803q746R662J1293
$$ 1372578 1373978 1380508 1360198 1356266 1348288 1355880 1363498 1363666 1353343 1348540 1339794 1349456 1360749
21550A360749p273N777O707J2548N765n105r594j760p284J123J3908O27Q339K294
$$ 1360749 1353476 1359253 1365960 1378508 1384273 1379168 1369574 1367814 1360530 1361653 1375561 1376188 1384527 1386821
21536A386821l412p452L816K289n889n714J917Q272N844m652j5024j0185M938
$$ 1386821 1383409 1375957 1379773 1382062 1376173 1370459 1372376 1380648 1386492 1381840 1366816 1356631 1361569
21523A361569J825K741K0039M534M089k690R708K786j2597p387p173J1094M662
$$ 1361569 1363394 1366135 1386174 1390708 1394797 1392107 1401815 1404601 1392004 1384617 1377444 1388538 1393200
21510A393200J087J3486L245j0225q198m916J106Q72K229L466n853q20M187J3560
$$ 1393200 1394287 1407773 1411018 1400793 1392595 1387679 1388785 1389657 1391886 1395352 1389499 1388679 1392866 1406426
21496A406426k652R912L192l081j0723o548P107j0930L548L567k745j1842r196
$$ 1406426 1403774 1413686 1416878 1413797 1403074 1396526 1403633 1392703 1396251 1399818 1397073 1385231 1376035
21483A376035q2L201M852O612J459p139R879M501r28j3216l707J0952K997N280
$$ 1376035 1375953 1379154 1384006 1390618 1392077 1384938 1394817 1399318 1398390 1385174 1381467 1392419 1395416 1400696
21469A400696l908o986M851N60M745J4387o586l116P185o815R764m468N253j444
$$ 1400696 1396788 1389802 1394653 1395213 1399958 1414345 1407759 1404643 1411828 1405013 1414777 1410309 1415562 1414118
21455A414118n050M663l222L321J0165K329j2916N400j0944N91K455j5854J1785
$$ 1414118 1409068 1413731 1410509 1413830 1423995 1426324 1413408 1418808 1407864 1408455 1410910 1395056 1406841
21442A406841O865J5855j889o659J1980L059J778L59J1106l278q449k0179M282
$$ 1406841 1413706 1429561 1427672 1421013 1432993 1436052 1437830 1438189 1449295 1446017 1437568 1417389 1421671
21429A421671P509N358j0130k058J7181K216j3848o810O173Q942l100q320L159
$$ 1421671 1429180 1434538 1424408 1422350 1439531 1441747 1427899 1421089 1427262 1436204 1433104 1424784 1427943
21416A427943L400k321J931J0209M221L095J1040J4098L412L410j0569j4595j1600
$$ 1427943 1431343 1429022 1430953 1441162 1445383 1448478 1459518 1473616 1477028 1480438 1469869 1455274 1443674
21403A443674j3784J1450O987N917P813M112J775q67j6793r544J0078K447J837
$$ 1443674 1429890 1441340 1448327 1454244 1462057 1466169 1467944 1467077 1450284 1440740 1450818 1453265 1455102
21390A455102P893N369J9073R351r494o543J864M713o776j399j3352L713l676
$$ 1455102 1462995 1468364 1487437 1496788 1487294 1480751 1482615 1487328 1480552 1479153 1465801 1469514 1465838
21377A465838P24k141K487R683O765J0912R101j6232j9323j4497j4042Q024J3145
$$ 1465838 1466562 1464421 1466908 1476591 1483356 1494268 1503369 1487137 1467814 1453317 1439275 1447299 1460444
21364A460444R977l468O393l961M300j756n900N326J0652j451m588p452M15J6284
$$ 1460444 1470421 1466953 1473346 1469385 1473685 1471929 1466029 1471355 1482007 1480556 1475968 1468516 1468931 1485215
21350A485215J4044L504N741j527j9308j111k022j1426O23K751J895j598m886
$$ 1485215 1499259 1502763 1508504 1506977 1487669 1486558 1484536 1473110 1473733 1476484 1478379 1476781 1471895
21337A471895J2826L274J8403P839L347j0500j4425r644K808L661J0182Q977N44
$$ 1471895 1484721 1487995 1506398 1514237 1517584 1507084 1492659 1483015 1485823 1489484 1499666 1508643 1509187
21324A509187j473J981j0615K64J1268R925K132l716O695n803j2543J0099J501
$$ 1509187 1507714 1509695 1499080 1499344 1510612 1520537 1522669 1518953 1525648 1519845 1507302 1517401 1518902
21311A518902K805P845N862j4833j2078j3680M093J5873O449j4597m071N450Q28
$$ 1518902 1521707 1529552 1535414 1520581 1508503 1494823 1498916 1514789 1521238 1506641 1502570 1508020 1508848
21298A508848R261M569m002L099K876p10l009r277Q4M461J236M458J157Q566N410
$$ 1508848 1518109 1522678 1518676 1521775 1524651 1523941 1520932 1511655 1511739 1516200 1517436 1521894 1523051 1531617 1537027
21283A537027k905j0508L229P512j1015l692K7563k155l804j2058m65r792q353
$$ 1537027 1534122 1523614 1526843 1534355 1523340 1519648 1547211 1545056 1541252 1529194 1528729 1518937 1510584
21270A510584L937K5982J1481j2718q269l717J981J7379q096K396J1317j0694
$$ 1510584 1514521 1540503 1551984 1539266 1530997 1527280 1529261 1546640 1538544 1540940 1552257 1541563
21258A541563p903n780n92L395J0053l821l126o286K934Q275m418L892J5180N271
$$ 1541563 1533660 1527880 1527288 1530683 1540736 1536915 1533789 1527503 1530437 1538712 1534294 1538186 1553366 1558637
21244A558637o199K37m323j2745l236M971Q778P421k96R60N53o391j0888L57N519
$$ 1558637 1552438 1552675 1548352 1535607 1532371 1537342 1546120 1553541 1553245 1554205 1554758 1548367 1537479 1537836 1543355
21229A543355P729J9579m919j2176n773j3869p594J3692K2279O387K118n627q653
$$ 1543355 1551084 1570663 1565744 1553568 1547795 1533926 1526332 1540024 1562303 1568690 1570808 1565181 1556528
21216A556528n538P960n207p745L506K3824K0094r794k020j141p451Q697R150
$$ 1556528 1550990 1558950 1553743 1545998 1549504 1573328 1593422 1583628 1581608 1580467 1573016 1581713 1590863
21203A590863k937j505j008j7800p157l79j3117m089L0031J0405k685n389R32
$$ 1590863 1587926 1586421 1585413 1567613 1560456 1560077 1546960 1542871 1572902 1583307 1580622 1575233 1576165
21190A576165o541N075O414p16N244J6164m182O481J8667J3377p199k0370k957
$$ 1576165 1569624 1574699 1581113 1580397 1585641 1601805 1597623 1604104 1622771 1636148 1628949 1608579 1605622
21177A605622r905J322M303m438N485J611P576P612n67k017o935K141J0267m942
$$ 1605622 1595717 1597039 1601342 1596904 1602389 1604000 1611576 1619188 1618621 1616604 1609669 1611810 1622077 1617135
21163A617135j491r39k307J3138M360j3567K05k566k914j767j421R877M45O289
$$ 1617135 1615644 1614705 1612398 1625536 1629896 1616329 1616534 1613968 1611054 1609287 1607866 1617743 1618188 1624477
21149A624477N977Q466o696j6072J1935J4880J900J690p549o148j5566k815M838
$$ 1624477 1630454 1638920 1632224 1616152 1628087 1642967 1644867 1646557 1639008 1632860 1617294 1614479 1619317
21136A619317J275p431p16O167m496J881j076K952O672Q410J44m251m251M977
$$ 1619317 1620592 1613161 1612445 1618612 1614116 1615997 1614921 1617873 1624545 1632955 1633099 1628848 1624597 1629574
21122A629574Q396N196M97j1327m04N327J5183N12j0128O180j051K779k2519K354
$$ 1629574 1637970 1643166 1643663 1632336 1631932 1637259 1652442 1652954 1642826 1649006 1647955 1650734 1628215 1630569
21108A630569Q055Q488J1908J3583O87L493p98M28J3358J798j1211m918q248M423
$$ 1630569 1638624 1647112 1659020 1672603 1673290 1676783 1675985 1676413 1689771 1691569 1680358 1675440 1667192 1671615
21094A671615L711K420n804J2248j912j4360J361p764p515J0282M480L843K914
$$ 1671615 1675326 1677746 1671942 1684190 1682278 1667918 1669279 1661515 1654000 1664282 1668762 1672605 1675519
21081A675519K238R12r100J2132K345r948r263K141P757l81j4166J0653J4648
$$ 1675519 1677757 1678669 1669569 1681701 1684046 1674098 1664835 1666976 1674733 1674352 1660186 1670839 1685487
21068A685487L772O290J306j812P00J1079m399n153J0320q02m628M543Q22J0019
$$ 1685487 1689259 1695549 1696855 1695043 1695743 1706822 1702423 1697270 1707590 1706788 1702160 1706703 1707525 1717544
21054A717544j0859J077J4144J0777j1590j3161k698j6086n273O559J5493J1184
$$ 1717544 1706685 1707762 1721906 1732683 1721093 1707932 1705234 1689148 1683875 1690434 1705927 1717111
21042A717111M967p714m466k771O690J990J962r23J3244j750l507l089M522J5481
$$ 1717111 1722078 1714364 1709898 1707127 1713817 1715807 1717769 1716846 1730090 1728340 1724833 1721744 1726266 1741747
21028A741747P629q542M994R492k214j0883j0873J078L309j7705l140Q184q04
$$ 1741747 1749376 1740834 1745828 1755320 1753106 1742223 1731350 1732428 1735737 1718032 1714892 1723076 1722272
21015A722272j348J1902K6286J1257K45j6988J099K8539j7274j3001j1691l553
$$ 1722272 1720924 1732826 1759112 1770369 1770614 1753626 1754725 1783264 1765990 1752989 1741298 1737745
21003A737745k613j129R38Q284O195L574L208J2526K049j151j306k1148K311J7664
$$ 1737745 1735132 1734003 1734941 1743225 1749420 1752994 1756202 1768728 1770777 1769626 1768320 1747172 1749483 1767147
20989A767147P918L439j0336k544j981j163L894Q012K929J527J0437J948m233
$$ 1767147 1775065 1778504 1768168 1765624 1763643 1762480 1766374 1774386 1777315 1778842 1789279 1791227 1786994
20976A786994k2140K420O173p182P808M565J865m105J436J4105R637j0790q530
$$ 1786994 1764854 1767274 1773447 1766265 1774073 1778638 1780503 1776398 1777834 1791939 1801576 1790786 1782256
20963A782256j798J6731J5850J327r17k102k533m659n749K775n921o927Q403K1102
$$ 1782256 1780458 1797189 1813039 1814366 1813449 1811347 1808814 1804155 1798406 1801181 1795260 1788333 1796736 1817838
20949A817838N565j4558j955M88N247O434J263j338R402J0638M18j1077O823q847
$$ 1817838 1823403 1808845 1806890 1807378 1812625 1819059 1820322 1818984 1828386 1839024 1839442 1828365 1835188 1826341
20935A826341j7970N822J9264O206r931k899J0094J0374k197j8265m868J3205
$$ 1826341 1808371 1814193 1833457 1839663 1829732 1826833 1836927 1847301 1845104 1826839 1821971 1835176
20923A835176Q373J701R530k854r304M680J4197j1180j3246J212M70J483J0566
$$ 1835176 1843549 1845250 1854780 1851926 1842622 1847302 1861499 1850319 1837073 1838285 1838755 1840238 1850804
20910A850804J6445m004k667n856O711N985p257j0213Q980O182O176J806K157
$$ 1850804 1867249 1863245 1860578 1854722 1861433 1867418 1860161 1849948 1858928 1865110 1871286 1873092 1875249
20897A875249j4469L086O705L331P736j1422o641M450o402M889k774n830R943
$$ 1875249 1860780 1863866 1870571 1873902 1881638 1870216 1863575 1868025 1861623 1866512 1863738 1857908 1867851
20884A867851J3704k308j622n600n877K1658J3562n281m042k029J1162R722n841
$$ 1867851 1881555 1879247 1877625 1872025 1866148 1887806 1901368 1896087 1892045 1890016 1901178 1910900 1905059
20871A905059L543L571o738O038J5778P72o422J1031l174j4624M78P389N29P26
$$ 1905059 1908602 1912173 1905435 1911473 1927251 1928023 1921601 1932632 1929458 1914834 1915312 1922701 1923230 1923956
20857A923956J833R41j0126j4850j4976K740N049k549N800J2501J487K0967J4453
$$ 1923956 1925789 1926730 1916604 1901754 1886778 1889518 1894567 1892018 1897818 1910319 1911806 1932773 1947226
20844A947226M27p410o114N7m132P250j352k511J44j294J0255L390n817N445K2733
$$ 1947226 1947653 1940243 1934129 1934186 1930054 1937304 1935952 1933441 1933585 1932291 1942546 1945936 1940119 1945564 1968297
20829A968297M716j1816n193L697P445j5558n080K166K5012R497K179p953q721
$$ 1968297 1973013 1961197 1956004 1959701 1967146 1951588 1946508 1948674 1973686 1983183 1985362 1977409 1968688
20816A968688O572P305l095M164N043n761K423K496j5q63J1291J4911j2192m360
$$ 1968688 1975260 1982565 1979470 1983634 1988677 1982916 1985339 1987835 1987820 1986957 1998248 2013159 2000967 1996607
20802A996607j3351P287Q175P708p248k506l334k408K616M087K596r801R987K0097
$$ 1996607 1983256 1990543 1998718 2006426 1999178 1996672 1993338 1990930 1993546 1997633 2000229 1990428 2000415 2020512
20788B020512J531o84o508J081j186R641P0n525n79k870r74J0347J3061J3474
$$ 2020512 2022043 2021359 2014851 2015932 2014746 2024387 2024457 2018932 2018353 2015483 2014509 2024856 2037917 2051391
20774B051391j143j08p117r620K052j7297o087K936L5P21k701J6173K6935K427
$$ 2051391 2050248 2050140 2043023 2033403 2035455 2018158 2012071 2015007 2015042 2015763 2013062 2029235 2056170 2058597
20760B058597n543p204n342J989J2977j08J2343L576m124p796q005r104J1891
$$ 2058597 2053054 2045850 2040508 2042497 2055474 2055366 2067709 2071285 2067161 2059365 2051360 2042256 2054147
20747B054147Q885o20j5230p802J8520J2620q926k903O05j0826L072R979J7304
$$ 2054147 2063032 2062412 2047182 2039380 2057900 2070520 2061594 2058691 2059296 2048470 2051542 2061521 2078825
20734B078825J2147k449j4022l794L665M929J0538J554M483o265j6683q035J2129
$$ 2078825 2090972 2088523 2074501 2070707 2074372 2079301 2089839 2091393 2095876 2089611 2072928 2064893 2077022
20721B077022J9091J6782K357P56l505o54N192r259P103N915l377q819L160l918
$$ 2077022 2096113 2112895 2115252 2116008 2112503 2111849 2117041 2107782 2114885 2120800 2117423 2108604 2111764 2107846
20707B107846j3490P568R743J1282K640J889j2917j2908J4320M518l812p601R587
$$ 2107846 2094356 2101924 2111667 2122949 2125589 2127478 2114561 2101653 2115973 2120491 2116679 2109078 2118665
20694B118665O122P167n26k933N281o59J1860O787P418K678k0363q849Q568P662
$$ 2118665 2124787 2131954 2131428 2128495 2133776 2133117 2144977 2151764 2159182 2161860 2141497 2132648 2141216 2148878
20680B148878M568p624Q557J4679N64l128N204J4809M339j6470j0349r384n38
$$ 2148878 2153446 2145822 2154379 2169058 2169622 2166494 2171698 2186507 2190846 2174376 2164027 2154643 2154105
20667B154105J0295J6097K903L74N870J2461J212o399K916K447N243o040o39O008
$$ 2154105 2164400 2180497 2183400 2183774 2189644 2202105 2203317 2196918 2199834 2202281 2207524 2201484 2200845 2206853
20653B206853k7p967O93M492J4722J0351P398m210j5403O237n042J423L561l391
$$ 2206853 2206826 2198859 2199552 2204044 2218766 2229117 2236515 2232305 2216902 2223139 2218097 2219520 2223081 2219690
20639B219690P539M538L22j1855N726R769J5359K976r601l538q182o760Q740R989
$$ 2219690 2227229 2231767 2232089 2220234 2225960 2235729 2251088 2254064 2244463 2240925 2232743 2225983 2234723 2244712
20625B244712N190P435n719R090N005J2737P712j3182r441L737M446J5804j2639
$$ 2244712 2249902 2257337 2251618 2260708 2265713 2278450 2286162 2272980 2263539 2267276 2271722 2287526 2274887
20612B274887k677J5971J245j0066p335R364J7517M011P76P186o561m129j820
$$ 2274887 2272210 2288181 2289426 2279360 2272025 2281389 2298906 2302917 2303693 2310879 2304318 2300189 2298369
20599B298369k943N090J3286Q729n787q91M732Q433m384J641N792p829J5806O662
$$ 2298369 2295426 2300516 2313802 2322531 2316744 2315853 2320585 2329018 2324634 2326275 2332067 2324238 2340044 2346706
20585B346706r542j0771j1346m708j430O651M747L754L208J4477R411m29K068
$$ 2346706 2337164 2326393 2315047 2310339 2308909 2315560 2320307 2324061 2327269 2341746 2351157 2350728 2352796
20572B352796r39M890N382J0596k802j9935o942J4160J4582Q24J7919L68o502
$$ 2352796 2351857 2356747 2362129 2372725 2369923 2349988 2343046 2357206 2371788 2372612 2390531 2390899 2384397
20559B384397K718O496p818m387P324J407M034n309J5705J0170RL98r903J0717
$$ 2384397 2387115 2393611 2385793 2381406 2388730 2390137 2394171 2388862 2404567 2414737 2414746 2415144 2405241 2415958
20545B415958m200n608J6175%q971l706J696r131r568J3405N878O430Q64L737
$$ 2415958 2411758 2406150 2422325 2422325 2413354 2409648 2411344 2402213 2392645 2406050 2411928 2418358 2419222 2422959
20531B422959J3868p335n081m970J0991J4805k777o644M262l897R807K925M946
$$ 2422959 2436827 2429492 2424411 2419441 2430432 2445237 2442460 2435816 2440078 2436181 2445988 2448913 2453859
20518B453859O204l113l700m358j940J5197J1362J696p886K017o87J5749K1390
$$ 2453859 2460063 2456950 2453250 2448892 2446952 2462149 2473511 2475207 2467321 2469338 2468651 2484400 2505790
20505B505790m72k72k362J3910M466R776J958n363j1314N352L209l166j3821J
$$ 2505790 2505318 2505046 2502684 2516594 2521060 2530836 2532794 2527431 2516117 2521469 2524678 2521512 2507691 2507692
20491B507692J9756Q192j1711J055J1665J8375m259m989k980k776M363R567J884
$$ 2507692 2527448 2535640 2523929 2524984 2536649 2555024 2550765 2545776 2542796 2540020 2544383 2553950 2555834
20478B555834J0559P66J57q577J484J172K204J3810N267K618j3423Q753J0909
$$ 2555834 2566393 2567159 2567316 2558739 2560223 2561395 2563599 2577409 2582676 2585294 2571871 2580624 2591533
20465B591533P829J5804J2933k218k604o425o292P840P677n354L922Q487P240
$$ 2591533 2599362 2615166 2628099 2625881 2623277 2616852 2610560 2618400 2626077 2620723 2624645 2633132 2640372
20452B640372K442k1539k783k911MO78K846J845N088J7282Q887n819k240L709
$$ 2640372 2642814 2621275 2618492 2615581 2615585 2616263 2619109 2620954 2626042 2643324 2652211 2646392 2644152 2647861
20438B647861M76J1224K685M318Q651K860P994O209n970j2266k758J8747M289
$$ 2647861 2648337 2659561 2662246 2666564 2675215 2678075 2686069 2692278 2686308 2674042 2671284 2690031 2694320
20425B694320l405J28O855r90J488J7535K226l732R010j852Q312J419K131J649
$$ 2694320 2690915 2691043 2697898 2696908 2698396 2715931 2718157 2714425 2723435 2721583 2729895 2731314 2733445 2735094
20411B735094r805M410N263K955P337L081Q525k218j5523L515k810r35J3540J7689
$$ 2735094 2725289 2729699 2734962 2737917 2745254 2748335 2756860 2754642 2739119 2742634 2739824 2738889 2752429 2770118
20397B770118Q290K481o684N179Q624Q940o519n772P716J0265l699K071j360k82
$$ 2770118 2778408 2780889 2774205 2779384 2788008 2796948 2790429 2784657 2792373 2802638 2798939 2801010 2799650 2799368
20383B799368N925Q163J7630j141k677R495L261j2210O983O267L227l794O963
$$ 2799368 2805293 2813456 2831086 2829945 2827268 2836763 2840024 2827814 2834797 2841064 2844291 2840497 2847460
20370B847460m987r003J2013m244K60J4094L204N118J1776P055J784J048J2310
$$ 2847460 2842473 2833470 2845483 2841239 2841499 2855593 2858797 2863915 2875691 2882746 2884530 2885578 2897888
20357B897888J4600k082j0871K197l173L646r992K112J4115J6411J2870J508L32
$$ 2897888 2912488 2910406 2899535 2901732 2898559 2902205 2892213 2894325 2908440 2924851 2937721 2939229 2939561
20344B939561J5738Q99o337M754k28J606J042J1631O718p51N375O277J008J7972
$$ 2939561 2955299 2956198 2949861 2954615 2954387 2955993 2957035 2968666 2975384 2974633 2980008 2986285 2987293 3005265
20330C005265j262n940p08j773k617M949L708P54J4280K0035r043j1309K735P741
$$ 3005265 3004003 2998063 2997355 2995582 2992965 2997914 3001622 3002376 3016656 3036691 3027648 3016339 3019074 3026815
20316C026815K118K1192M248N880O509m410Q840R076M905O674Q37k107n524M481
$$ 3026815 3028933 3050125 3054373 3060253 3066762 3062352 3071192 3080268 3085173 3091847 3092684 3090577 3085053 3089534
20302C089534o63j4930l62J5000M912m681R124J1741J35k940L447J0532J701O747
$$ 3089534 3088871 3073941 3073579 3088579 3093491 3088810 3097934 3109675 3109810 3106870 3110317 3120849 3122550 3129297
20288C129297J4849l086O268L630N121J6587J1724P013N618J0222q089k337J913
$$ 3129297 3144146 3141060 3147328 3150958 3156079 3172666 3184390 3191403 3197021 3207243 3199154 3196817 3198730
20275C198730N273N867l624k844O264N201k288K322N222l465N404J210J2008J8762
$$ 3198730 3204003 3209870 3206246 3203402 3209666 3214867 3212579 3214901 3220123 3216658 3222062 3223272 3235280 3254042
20261C254042q98l908K921Q355J1292N564J3967J4030k763M354k906O566j429
$$ 3254042 3253144 3249236 3252157 3260512 3271804 3277368 3291335 3305365 3302602 3306956 3304050 3310616 3309187
20248C309187Q602J0819j915J3750k024k347J2800N694m510n161n997J1519K6318
$$ 3309187 3317789 3328608 3326693 3340443 3338419 3336072 3348872 3354566 3350056 3344895 3338898 3350417 3376735
20235C376735m766K305Q723P003o026m876K4019O707O266M447N550P188Q518Q186
$$ 3376735 3371969 3374274 3382997 3390000 3383974 3379098 3403117 3409824 3416090 3420537 3426087 3433275 3441793 3449979
20221C449979O570J595j5418k724L577Q547k811J5423J3101K2592N191j248j749
$$ 3449979 3456549 3458144 3442726 3440002 3443579 3452126 3449315 3464738 3477839 3500431 3505622 3504374 3502625
20208C502625O966M14q514m378J458J5580J1863J7708R144Q014R545J1434R987
$$ 3502625 3509591 3510005 3501491 3497113 3498571 3514151 3526014 3543722 3552866 3560880 3570425 3581859 3591846
20195C591846n567n71M927J2241O510M945J0254Q931j773p151L829J0918J5101
$$ 3591846 3586279 3585708 3590635 3602876 3609386 3614331 3624585 3633516 3631743 3624592 3628421 3639339 3654440
20182C654440J8051J6468J603o062J0388J0663q0j6629J0075J0421k916K724N858
$$ 3654440 3672491 3688959 3690562 3684500 3694888 3705551 3705471 3688842 3698917 3709338 3706422 3709146 3715004
20169C715004K151J2533R029q931Q025J0226P955J6070J1347J7196N673L883R197
$$ 3715004 3717155 3729688 3738717 3729786 3737811 3748037 3755992 3772062 3783409 3800605 3806278 3810161 3819358
20156C819358N611j643K2044J2227P337J6026Q109M08o246P250p598J4344J1783
$$ 3819358 3824969 3823326 3845370 3857597 3864934 3880960 3889069 3889477 3883231 3890481 3882883 3897227 3909010
20143C909010J0064N039j931J0873J292m419Q506J8747J4196K814N001J1417J086
$$ 3909010 3919074 3924113 3922182 3933055 3934347 3929928 3938434 3957181 3971377 3974191 3979192 3990609 3991695
20130C991695K190r589L905K3696J8670O352O477J2861J3581Q615J573J3874L772
$$ 3991695 3993885 3984296 3988201 4011897 4030567 4036919 4043396 4056257 4069838 4078453 4080026 4093900 4097672
20117D097672r30R339J6968R401Q901j1569j235L179J9103Q837P305J1165J2666
$$ 4097672 4096742 4106081 4123049 4132450 4141351 4129782 4128547 4131726 4150829 4159666 4166971 4178136 4190802
20104D190802N514M059J4402K2918O742K624P614J0087J0294J7210M763k300j6091
$$ 4190802 4196316 4200375 4214777 4237695 4244437 4247061 4254675 4264762 4275056 4292266 4297029 4294729 4278638
20091D278638Q840J0575O355Q654K1186K3172L992K545J3717J5393N398N321Q588
$$ 4278638 4287478 4298053 4304408 4313062 4334248 4357420 4361412 4363957 4377674 4393067 4398465 4403786 4412374
20078D412374J6443J8435J523N334J7912J4333P19P809J6758J4388J5394l759
$$ 4412374 4428817 4447252 4448775 4454109 4472021 4486354 4487073 4494882 4511640 4526028 4541422 4537663
20066D537663k104J0758k430J2969K3333N362J0626J5004J1017N497L848P793
$$ 4537663 4535559 4546317 4543887 4556856 4580189 4585551 4596177 4611181 4622198 4627695 4631543 4639336
20054D639336J3355J2393J0733k12K1072K3075K9880R507O933J3089J699P715
$$ 4639336 4652691 4665084 4675817 4675605 4696677 4719752 4749632 4759139 4766072 4779161 4780860 4788575
20042D788575J9873J1620n248l388J9636K5202J0400J0463J3139J7477K7187K2289
$$ 4788575 4808448 4820068 4814820 4811432 4831068 4856270 4866670 4877133 4890272 4907749 4934936 4957225
20030D957225J1902l100M509J3560J2600J6500l176O092K1133J7967J5996L7422
$$ 4957225 4969127 4966027 4970536 4984096 4996696 5013196 5010020 5016112 5037245 5055212 5071208 5108630
20018E108630J5707O981J0131J9310J7211J1705J7483J1085J3487J3437J8793
$$ 5108630 5124337 5131318 5141449 5160759 5177970 5189675 5207158 5218243 5231730 5245167 5263960
20007E263960O863L851J7238K0912J7322N347K701J2735J8160J4971J9691K9423
$$ 5263960 5270823 5274674 5291912 5312824 5330146 5335493 5338194 5350929 5369089 5384060 5403751 5433174
19995E433174K5659K1206J34O962K737J5024K4897J6045J2820J1034J7946R326
$$ 5433174 5458833 5480039 5480173 5487135 5489872 5504896 5529793 5545838 5558658 5569692 5587638 5596964
19983E596964K0411J8436J3544K8084J9798L4255K8019K9768J5710r35J9317J7068
$$ 5596964 5617375 5635811 5649355 5677439 5697237 5731492 5759511 5789279 5804989 5804054 5823371 5840439
19971E840439J6185K2476K1487K5093K6612K5643J0120K0482K7866J9251K1101
$$ 5840439 5856624 5879100 5900587 5925680 5952292 5977935 5988055 6008537 6036403 6055654 6076755
19960F076755L0245L0101K1300J9124R492K6626P441J8565K3830L9844J7873J2876
$$ 6076755 6107000 6137101 6158401 6177525 6187017 6213643 6221084 6239649 6263479 6303323 6321196 6334072
19948F334072K0346J6645J8289K7113L7271L2697K0817K3333L0204J7689J6620
$$ 6334072 6354418 6371063 6389352 6416465 6453736 6486433 6507250 6530583 6560787 6578476 6595096
19937F595096L4295K3305K2762K3553K7349K8819L3815L0197L1127K5818K2641
$$ 6595096 6629391 6652696 6675458 6699011 6726360 6755179 6788994 6819191 6850318 6876136 6898777
19926F898777K1954J7953L7856M5546M0800L5784L3279L6784J6696L0687L5974
$$ 6898777 6920731 6938684 6976540 7022086 7062886 7098670 7131949 7168733 7185429 7216116 7252090
19915G252090M1590L1070K9117M4628L3149M5126L4568J6214K8762N1339M2006
$$ 7252090 7293680 7324750 7353867 7398495 7431644 7476770 7511338 7527552 7556314 7607653 7649659
19904G649659N0461L3721L8401N7529L3298M1069M5295N2357N3785L7219L5008
$$ 7649659 7700120 7733841 7772242 7829771 7863069 7904138 7949433 8001790 8055575 8092794 8127802
19893H127802M8176M0419M9948L8350M0488M7382N5075M6523L9564N2775N3935
$$ 8127802 8175978 8216397 8266345 8304695 8345183 8392565 8447640 8494163 8533727 8586502 8640437
19882H640437M7625N0590N6082M8394N1388N1036N1901M5800O7764P1312N7970
$$ 8640437 8688062 8738652 8794734 8843128 8894516 8945552 8997453 9043253 9111017 9182329 9240299
19871I240299N1988N3533O6443O6421N8804N2555M9956Q0341O5385N1015O1081
$$ 9240299 9292287 9345820 9412263 9478684 9537488 9590043 9639999 9720340 9785725 9836740 9897821
19860I897821O8266P2899P2615P0267P2094R1233Q4819O7768O4830O6759Q0737
$$ 9897821 9966087 10038986 10111601 10181868 10253962 10345195 10430014 10497782 10562612 10629371 10710108
19849A0710108Q5148Q1512P9901P5080Q3909Q0665R0901R0634Q0689R0818Q1351
$$ 10710108 10795256 10876768 10956669 11031749 11115658 11196323 11287224 11377858 11458547 11549365 11630716
19838A1630716R1642J02322R2713Q4573J00999J02664R2809R6366J01294Q8710
$$ 11630716 11722358 11824680 11917393 12001966 12102965 12205629 12298438 12394804 12496098 12584808
19828A2584808Q2656Q2472J14159J12516R2325R1346R8565R5660R7006J03767
$$ 12584808 12667464 12749936 12864095 12976611 13068936 13160282 13258847 13354507 13451513 13555280
19818A3555280R9742Q7409Q8032R3689R3549Q5869P3757R2159P7529N9861O8765
$$ 13555280 13655022 13742431 13830463 13924152 14017701 14103570 14177327 14269486 14347015 14406876 14475641
19807A4475641N9386N8268N3147K8146K4831J6999o17j2583k9332k6179o3712
$$ 14475641 14535027 14593295 14646442 14674588 14699419 14716418 14715801 14703218 14673886 14647707 14583995
19796A4583995p1273p1341j16454j48720j59074j76818k03888k36981k75680l09379
$$ 14583995 14512722 14441381 14324927 14176207 14017133 13840315 13636427 13399446 13123766 12814387
19786A2814387l41688l65688l92485m21094m59796m98609n28335n52110n85016
$$ 12814387 12472699 12107011 11714526 11293432 10833636 10335027 9806692 9254582 8669566
19777H669566o16469o48039o53124o71325o80680p00244p19564p08668p04675
$$ 8669566 8053097 7405058 6751934 6080609 5399929 4699685 3980121 3271453 2566778
19768B566778p05176p15972p03136o70021o52821o17712o04879n72192n40501
$$ 2566778 1861602 1145630 442494 -227527 -880348 -1498060 -2102939 -2675131 -3215632
19759c215632n18324m72033m59014m35641l86918l56605l19769k82201k63467
$$ -3215632 -3733956 -4205989 -4665003 -5100644 -5487562 -5844167 -6163936 -6446137 -6709604
19750f709604k40099k09264j78346j60191j47150j25902j01502p1507n4201n6800
$$ -6709604 -6949703 -7158967 -7337313 -7497504 -7644654 -7770556 -7872058 -7943565 -7997766 -8054566
19740h054566l7805k6469j2463N66j79J5408K7041L4773O2497N7670N7667O1637
$$ -8054566 -8092371 -8118840 -8131303 -8130737 -8130916 -8115508 -8088467 -8053694 -7991197 -7933527 -7875860 -7814223
19728g814223P1026P4141P9074N8863P4900P8862Q8295Q1093Q2662Q3352J03323
$$ -7814223 -7743197 -7669056 -7589982 -7531119 -7456219 -7377357 -7289062 -7207969 -7125307 -7041955 -6938632
19717f938632R6945Q0809R2064J04034J00381R7298Q3946P2858Q4464Q9424P5858
$$ -6938632 -6841687 -6760878 -6668814 -6564780 -6464399 -6367101 -6283155 -6210297 -6125833 -6036409 -5960551
19706e960551N8411P3735N7885O0315P1449P7357P9284Q6341P4344O7460O5314
$$ -5960551 -5902140 -5828405 -5770520 -5710205 -5638756 -5561399 -5482115 -5395774 -5321430 -5253970 -5188656
19695e188656P8742Q8679O9727O9970P7802Q5154N9505M4782L9031N0029N2232
$$ -5188656 -5109914 -5021235 -4951508 -4881538 -4803736 -4718582 -4659077 -4614295 -4575264 -4525235 -4473003
19684d473003N6849M8832L9816M4763M8641L9081N2791P2283Q0691R3300Q1170
$$ -4473003 -4416154 -4367322 -4327506 -4282743 -4234102 -4195021 -4142230 -4069947 -3989256 -3895956 -3814786
19673c814786P1594P4906P1923P6875Q2903P0632P5779P1499P2075P1837O3919
$$ -3814786 -3743192 -3668286 -3596363 -3519488 -3436585 -3365953 -3290174 -3218675 -3146600 -3074763 -3010844
19662c010844O3387N7044N6145N9614M8487L8360M0325M6186M6045N8909M0500
$$ -3010844 -2947457 -2890413 -2834268 -2774654 -2726167 -2687807 -2647482 -2601296 -2555251 -2496342 -2455842
19651b455842L8592L3995J6941Q720K7197L6060L1881K6003L5865M0596M9400
$$ -2455842 -2417250 -2383255 -2366314 -2357594 -2330397 -2294337 -2262456 -2236453 -2200588 -2159992 -2110592
19640b110592N4263M6126M4389L5029L0948K1400J3308J1022K9608K6495M353
$$ -2110592 -2056329 -2010203 -1965814 -1930785 -1899837 -1878437 -1865129 -1854107 -1824499 -1798004 -1793651
19629a793651J7634O512J8944J8798K3940M7357L9888M2786N1938L8912M1653
$$ -1793651 -1776017 -1769505 -1750561 -1731763 -1707823 -1660466 -1620578 -1577792 -1525854 -1486942 -1445289
19618a445289N0501L1999M4559M5555M9986N5795N8899L9687K3162M2657M0773
$$ -1445289 -1394788 -1362789 -1318230 -1272675 -1222689 -1166894 -1107995 -1068308 -1045146 -1002489 -961716
19607i61716M0532L7584M6501L6766K4488K9326L5992K6747L7801M6643M0640
$$ -961716 -921184 -883600 -837099 -800333 -775845 -746519 -710527 -683780 -645979 -599336 -558696
19596e58696N0679M0295K2661J1457K1389M3005K8526K4667L3446M1212L8685
$$ -558696 -508017 -467722 -445061 -433604 -412215 -369210 -340684 -316017 -282571 -241359 -202674
19585b02674L2654L3855K5519J9482J7845L8559M0395K7502J8702K2238K7539
$$ -202674 -170020 -136165 -110646 -91164 -73319 -34760 5635 33137 51839 74077 101616
19574A01616L8862K3472L5648L6108K0505J9744M0100M3761L8522K5040J3846
$$ 101616 140478 163950 199598 235706 256211 275955 316055 359816 398338 423378 437224
19563D37224K5520K4339K2468J9444J8913L5151N0670K6411L019K0281L7833L3055
$$ 437224 462744 487083 509551 528995 547908 583059 633729 660140 663159 683440 721273 754328
19551G54328M3417J9297J0164J2056J7940K6847K9099L0316K7304K2506J9478
$$ 754328 797745 817042 827206 839262 857202 884049 913148 943464 970768 993274 1012752
19540A012752R219L4261K5351L0349L8510L2378K9250J0781J9591J8372L3770
$$ 1012752 1021971 1056232 1081583 1111932 1150442 1182820 1212070 1222851 1242442 1260814 1294584
19529A294584L9806K8104M0046J7028J3976K2031J7244J9318L1247L1536Q405
$$ 1294584 1334390 1362494 1402540 1419568 1433544 1455575 1472819 1492137 1523384 1554920 1563325
19518A563325J7508K6831J9097L0309K3640J9385K6868J7563K3238K6421K9619
$$ 1563325 1580833 1607664 1626761 1657070 1680710 1700095 1726963 1744526 1767764 1794185 1823804
19507A823804K6987K1513R326P455L6173N1607L7239J9022J1521R603J7580K1885
$$ 1823804 1850791 1872304 1881630 1889085 1925258 1976865 2014104 2033126 2044647 2054250 2071830 2093715
19495B093715K3856K3440J7827J2234J8778L3069K3462K7792K9045K8692P366
$$ 2093715 2117571 2141011 2158838 2171072 2189850 2222919 2246381 2274173 2303218 2331910 2339276
19484B339276K4552L2439K4212K0488L2776J8715K0413K9025K6427K5246K0686
$$ 2339276 2363828 2396267 2420479 2440967 2473743 2492458 2512871 2541896 2568323 2593569 2614255
19473B614255J3532Q208O654J4945J7394Q361k5503k8379J2621O7475P9821O3673
$$ 2614255 2627787 2635995 2642649 2657594 2674988 2683349 2657846 2629467 2642088 2709563 2789384 2853057
19461B853057O5339O8259L1273K4321J7490J8757L1396K5843L6129L1683J5047
$$ 2853057 2918396 2986655 3017928 3042249 3059739 3078496 3109892 3135735 3171864 3203547 3218594
19450C218594J9549M2074M1763L2355L2115K9993K8433J5621j0617r578K8688
$$ 3218594 3238143 3280217 3321980 3354335 3386450 3416443 3444876 3460497 3449880 3440302 3468990
19439C468990L5163M3114M1199K0121M4283L9615L6821K4113J0253r496j2746
$$ 3468990 3504153 3547267 3588466 3608587 3652870 3692485 3729306 3753419 3763672 3754176 3741430
19428C741430J9697L3659L7631K8901K7357J9379K0133K5556K6161K4169J8651
$$ 3741430 3761127 3794786 3832417 3861318 3888675 3908054 3928187 3953743 3979904 4004073 4022724
19417D022724K8086M1849J5259n356K0413M4541M5368M0224L6656L4336M1288
$$ 4022724 4050810 4092659 4107918 4102562 4122975 4167516 4212884 4253108 4289764 4324100 4365388
19406D365388M2955L5111M2181M1509L8813L8123L5116K8311K9184L0502K3079
$$ 4365388 4408343 4443454 4485635 4527144 4565957 4604080 4639196 4667507 4696691 4727193 4750272
19395D750272J3350L2556L6906M2686N2428L8985M0949L1832L1969M2438M6221
$$ 4750272 4763622 4796178 4833084 4875770 4928198 4967183 5008132 5039964 5071933 5114371 5160592
19384E160592N5638N0493J0775J6746M2875K9913L7589M8338M6601L4934L9578
$$ 5160592 5216230 5266723 5277498 5294244 5337119 5367032 5404621 5452959 5499560 5534494 5574072
19373E574072K6919K9995M9614O4943O4834K8907L4603L9032K7534J8715L1864
$$ 5574072 5600991 5630986 5680600 5745543 5810377 5839284 5873887 5912919 5940453 5959168 5991032
19362E991032L6902L8413M9978L3324J3765p930l710J7249L3782M4943M7390N8101
$$ 5991032 6027934 6066347 6116325 6149649 6163414 6155484 6151774 6169023 6202805 6247748 6295138 6353239
19350F353239M0618N4323N7045N2805N0901M6093M2608O3633O8366O5331O1768
$$ 6353239 6393857 6448180 6505225 6558030 6608931 6655024 6697632 6761265 6829631 6894962 6956730
19339F956730N6857N2569N2536O4515N8535O3022O3077N7292N2895M5889M0995
$$ 6956730 7013587 7066156 7118692 7183207 7241742 7304764 7367841 7425133 7478028 7523917 7564912
19328G564912O6922O0416N9886O7551O7667P0666P1611O8593O4670Q2933P3342
$$ 7564912 7631834 7692250 7752136 7819687 7887354 7958020 8029631 8098224 8162894 8245827 8319169
19317H319169P8931Q4607P2099O7399N4085O2461M5735L9016K6181K7434L2896
$$ 8319169 8398100 8482707 8554806 8622205 8676290 8738751 8784486 8823502 8849683 8877117 8910013
19306H910013L0581K3589N710k6899k6681j3099J3182P2501J50603K03229J91719
$$ 8910013 8940594 8964183 8969893 8942994 8916313 8903214 8916396 8988897 9139500 9342729 9534448
19295I534448J38804J00792J27101J40448J15635P2580L3296n887j0586O5146
$$ 9534448 9673252 9774044 9901145 10041593 10157228 10229808 10263104 10257217 10246631 10311777
19285A0311777J52433J60836J49728J20604P5036O3252M7721N3089N7951O7403
$$ 10311777 10464210 10625046 10774774 10895378 10970414 11033666 11081387 11134476 11192427 11259830
19275A1259830O1901Q2363R7673R6061J03155J01249J03095J08421J16812J25176
$$ 11259830 11321731 11404094 11501767 11597828 11700983 11802232 11905327 12013748 12130560 12255736
19265A2255736J30917J41908J41601J42239J39090J36525J52515J53303J55625
$$ 12255736 12386653 12528561 12670162 12812401 12951491 13088016 13240531 13393834 13549459
19256A3549459J61249J68798J77365J82621J74672J75995J89282J86833K00096
$$ 13549459 13710708 13879506 14056871 14239492 14414164 14590159 14779441 14966274 15166370
19247A5166370J93380K01312K01552J95598K09591K22397K18868K16686K42955
$$ 15166370 15359750 15561062 15762614 15958212 16167803 16390200 16609068 16825754 17068709
19238A7068709K43377K35180K40616K66967K70344K70159K84701K91540L00195
$$ 17068709 17312086 17547266 17787882 18054849 18325193 18595352 18880053 19171593 19471788
19229A9471788L21645L26031L16601L10808L39952L53526L73112L89672L95682
$$ 19471788 19793433 20119464 20436065 20746873 21086825 21440351 21813463 22203135 22598817
19220B2598817M17474M38088M59719N19780N54612N71846N47229L36910J158r5946
$$ 22598817 23016291 23454379 23914098 24433878 24988490 25560336 26107565 26444475 26445633 26349687
19210B6349687J35192L91275N59412O77471O67693N68984M05665M33236O08912
$$ 26349687 26484879 26876154 27435566 28113037 28780730 29349714 29755379 30188615 30797527
19201C0797527P32113Q24410Q82990R54254J021366J069721J079002J088906J052361
$$ 30797527 31529640 32354050 33237040 34191294 35212660 36282381 37361383 38450289 39502650
19192C9502650J010202J044138J154142J287593J451125J606816J753522J869044
$$ 39502650 40512852 41556990 42711132 43998725 45449850 47056666 48810188 50679232
19184E0679232J986334K121264K270816K447837K663240K871213L055240L286905
$$ 50679232 52665566 54786830 57057646 59505483 62168723 65039936 68095176 71382081
19176G1382081L543306L849856M227930M711624N234271N776229O396337P369165
$$ 71382081 74925387 78775243 83003173 87714797 92949068 98725297 105121634 112490799
19168A12490799Q810744J0634717J2897990J5663812J9021029K2608322K4808924
$$ 112490799 121301543 131936260 144834250 160498062 179519091 202127413 226936337
19161B26936337J9827383o888079o8439310j28029139j23751337p6817165l4827609
$$ 226936337 246763720 239875641 171436331 43407192 -80344145 -157161310 -191988919
19154a91988919p903684O816400J2675538J3549962J2501326J1386342J0578076
$$ -191988919 -199892603 -193076203 -180400665 -166850703 -154349377 -142963035 -132384959
19147a32384959R713730Q788947P863126O889766N750955M689996M109388L895550
$$ -132384959 -122671229 -113882282 -106019156 -99129390 -93378435 -88688439 -84579051 -80683501
19139h0683501L738907L515107L289544L105856K942925K784556K669678K559419
$$ -80683501 -76944594 -73429487 -70139943 -67034087 -64091162 -61306606 -58636928 -56077509
19131e6077509K444698K267404J961116J479253Q43618L26606Q5526J25024M05629
$$ -56077509 -53632811 -51365407 -49404291 -47925038 -47081420 -46754814 -46669288 -46544264 -46138635
19122d6138635P59941J002965J114295J146989J171753J181067J141417J089981
$$ -46138635 -45378694 -44375729 -43261434 -42114445 -40942692 -39761625 -38620208 -37530227
19114c7530227J018205Q36633O05369N78803O88648P64134Q08514Q13084O74715
$$ -37530227 -36512022 -35675389 -35070020 -34491217 -33802569 -33038435 -32229921 -31416837 -30742122
19105c0742122L51274N0940O2555K67608M24899N17733N57943N59091N43869N33127
$$ -30742122 -30390848 -30339908 -30277353 -30009745 -29584846 -29067113 -28509170 -27950079 -27406210 -26873083
19095b6873083M98646M64396M44796M13501L89441L72609L75075L58344L50215
$$ -26873083 -26374437 -25910041 -25465245 -25051744 -24662303 -24289694 -23914619 -23556275 -23206060
19086b3206060L27965L10046L15184L21718L07693K80955K74068K77458K71168
$$ -23206060 -22878095 -22568049 -22252865 -21931147 -21623454 -21342499 -21068431 -20790973 -20519805
19077b0519805K71767K78424K49906K53769K44898K23106K12455K13800K09368
$$ -20519805 -20248038 -19969614 -19719708 -19465939 -19221041 -18997935 -18785480 -18571680 -18362312
19068a8362312K18487K21651K13330J95336J99762J93759J93610J88909J69995
$$ -18362312 -18143825 -17922174 -17708844 -17513508 -17313746 -17119987 -16926377 -16737468 -16567473
19059a6567473J76867J81386J77466J82110J56955J57599J61125J67341J38854
$$ -16567473 -16390606 -16209220 -16031754 -15849644 -15692689 -15535090 -15373965 -15206624 -15067770
19050a5067770J46305J51725J26545J43253J49523J43040J17251J30761J34560
$$ -15067770 -14921465 -14769740 -14643195 -14499942 -14350419 -14207379 -14090128 -13959367 -13824807
19041a3824807J42342J40042J44026J33568J21656J29059J49983J56161R0507
$$ -13824807 -13682465 -13542423 -13398397 -13264829 -13143173 -13014114 -12864131 -12707970 -12617463
19032a2617463j393l3946r162J9536P6620J72536K14253J56376J02252N7917L6842
$$ -12617463 -12618856 -12652802 -12661964 -12642428 -12565808 -12393272 -12179019 -12022643 -11920391 -11862474 -11825632
19021a1825632Q3131R8034N5243j8776m9502m3269j891P2468J09911J03310R2687
$$ -11825632 -11742501 -11644467 -11589224 -11608000 -11657502 -11700771 -11702662 -11630194 -11520283 -11416973 -11324286
19010a1324286P9256P9789O7178O1643R4860Q7852O7723P9009Q0111O1043N8451
$$ -11324286 -11245030 -11165241 -11098063 -11036420 -10941560 -10853708 -10785985 -10706976 -10626865 -10565822 -10507371
18999a0507371O6065O2855O1892O1869N9487O1980O0677N8867N2623O4296P3445
$$ -10507371 -10441306 -10378451 -10316559 -10254690 -10195203 -10133223 -10072546 -10013679 -9961056 -9896760 -9823315
18988i823315N0422N7721O5716N6961O6139P2838P5509M3518L7677K9356O4077
$$ -9823315 -9772893 -9715172 -9649456 -9592495 -9526356 -9453518 -9378009 -9334491 -9296814 -9267458 -9203381
18977i203381P2560L6675L1118L9534L9552M1364N6875N8205L5505K7214L3137
$$ -9203381 -9130821 -9094146 -9063028 -9023494 -8983942 -8942578 -8885703 -8827498 -8791993 -8764779 -8731642
18966h731642L8359K7049L1477L4889M6621N2149O4940P4702O6400N8243M0085
$$ -8731642 -8693283 -8666234 -8634757 -8599868 -8553247 -8501098 -8436158 -8361456 -8295056 -8236813 -8196728
18955h196728M7062M2424M0838M0444L4492N4847M9970L6318L1319K8109M3811
$$ -8196728 -8149666 -8107242 -8066404 -8025960 -7991468 -7936621 -7886651 -7850333 -7819014 -7790905 -7747094
18944g747094L4532M1178M4849L5544M7056L2338L4982K3791J4692K8821L0950
$$ -7747094 -7712562 -7671384 -7626535 -7590991 -7543935 -7511597 -7476615 -7452824 -7438132 -7409311 -7378361
18933g378361L1418L3284L6020L4481L9837L3599K3036L6363M1003L6293L6325
$$ -7378361 -7346943 -7313659 -7277639 -7243158 -7203321 -7169722 -7146686 -7110323 -7069320 -7033027 -6996702
18922f996702L1836K7613L0904K7353K5876L7889L2006J3879Q295K8192J4888
$$ -6996702 -6964866 -6937253 -6906349 -6878996 -6853120 -6815231 -6783225 -6769346 -6761051 -6732859 -6717971
18911f717971K7813M4745M7013M1547J9562K7450K3528J2941Q766K7351K9112
$$ -6717971 -6690158 -6645413 -6598400 -6556853 -6537291 -6509841 -6486313 -6473372 -6464606 -6437255 -6408143
18900f408143K1269J9935J7873J2007M320K0585K3768M4728K8934K5172J8889
$$ -6408143 -6386874 -6366939 -6349066 -6337059 -6332739 -6312154 -6288386 -6243658 -6214724 -6189552 -6170663
18889f170663J2180K4494K5606K2945J2424J1920M2561L4153K8487O314K7216
$$ -6170663 -6158483 -6133989 -6108383 -6085438 -6073014 -6061094 -6018533 -5984380 -5955893 -5949579 -5922363
18878e922363L4780J7186J3671J8768K1573K7939K6277J1996J7242J9982J7793
$$ -5922363 -5887583 -5870397 -5856726 -5837958 -5816385 -5788446 -5762169 -5750173 -5732931 -5712949 -5695156
18867e695156R316K3886J4697J1470K7188K6551k081J4325K7125L3285L4596J4270
$$ -5695156 -5685840 -5661954 -5647257 -5635787 -5608599 -5582048 -5584129 -5569804 -5542679 -5509394 -5474798 -5460528
18855e460528j3500k5811l2886k4922j7178o0M1781M6793M7531M7523L4796K5878
$$ -5460528 -5474028 -5499839 -5532725 -5557647 -5574825 -5574885 -5533104 -5486311 -5438780 -5391257 -5356461 -5330583
18843e330583J2287J5369L5149L1924K4025K759N259J8700K2560K0894J5830J2792
$$ -5330583 -5318296 -5302927 -5267778 -5235854 -5211829 -5209070 -5203811 -5185111 -5162551 -5141657 -5125827 -5113035
18831e113035K1139O475Q786P689R257J5651K4731J9843M531J0343L4229K7994
$$ -5113035 -5091896 -5085421 -5076635 -5068946 -5059689 -5044038 -5019307 -4999464 -4994933 -4984590 -4950361 -4922367
18819d922367J6657K5911J2153M199O010J9772K9571P291J3780R650K4001J1022
$$ -4922367 -4905710 -4879799 -4867646 -4863447 -4857437 -4837665 -4808094 -4800803 -4787023 -4777373 -4753372 -4742350
18807d742350J3453K3352J0094k247R898N345J2063J0548J5689J9807L6032K6545
$$ -4742350 -4728897 -4705545 -4695451 -4697698 -4687800 -4682455 -4670392 -4659844 -4644155 -4624348 -4588316 -4561771
18795d561771J2119q523J5001M943J0694K7442J2147J3005J8458N076N757J4970
$$ -4561771 -4549652 -4558175 -4543174 -4538231 -4527537 -4500095 -4487948 -4474943 -4456485 -4451409 -4445652 -4430682
18783d430682J4162J2636Q232J6208J4082J7230J4193K1935L687L784M670J1905
$$ -4430682 -4416520 -4403884 -4395652 -4379444 -4365362 -4348132 -4333939 -4312004 -4308317 -4304533 -4299863 -4287958
18771d287958Q396R157O566J1248K3325J9915J0053R879N232R839R339k632n14
$$ -4287958 -4279562 -4270405 -4263839 -4252591 -4229266 -4209351 -4199298 -4189419 -4184187 -4174348 -4165009 -4167641 -4168155
18758d168155J8935J5200J5836J1454J1319J8761K6629K3387k9R713M117N806
$$ -4168155 -4149220 -4134020 -4118184 -4106730 -4095411 -4076650 -4050021 -4026634 -4026663 -4016950 -4012833 -4007027
18746d007027K1455K0385J5590J8579L02L205R79J1600L1123L2901J1472o701
$$ -4007027 -3985572 -3965187 -3949597 -3931018 -3930716 -3927511 -3926532 -3914932 -3883809 -3850908 -3839436 -3846137
18734c846137k572J2605N315J2489J0134J6046J3228J4228M589K889J005J1370
$$ -3846137 -3848709 -3836104 -3830789 -3818300 -3808166 -3792120 -3778892 -3764664 -3760075 -3757186 -3756181 -3744811
18722c744811o65J2098J2198J0407R137J9718J7235J9109J6155P841J2030J2674
$$ -3744811 -3745476 -3733378 -3721180 -3710773 -3701636 -3681918 -3664683 -3645574 -3629419 -3621578 -3609548 -3596874
18710c596874K413N893J7195L2314J5676J0682j02P531J2032m946P635K6035Q270
$$ -3596874 -3594461 -3588568 -3571373 -3539059 -3523383 -3512701 -3512803 -3505272 -3493240 -3498186 -3490551 -3464516 -3456246
18697c456246J3658J6498K5148J5891P086J1584J0041J0848J9802K0748K5526
$$ -3456246 -3442588 -3426090 -3400942 -3385051 -3377965 -3366381 -3356340 -3345492 -3325690 -3304942 -3279416
18686c279416J9313K7951L0043K3802K1721J7035K328m239l839J5339J2361r839
$$ -3279416 -3260103 -3232152 -3202109 -3178307 -3156586 -3139551 -3137223 -3141462 -3145301 -3129962 -3117601 -3127440
18674c127440m719j3030k7452l8061m2972l0039j6230j6141l6638m0791l1169
$$ -3127440 -3132159 -3145189 -3172641 -3210702 -3253674 -3283713 -3299943 -3316084 -3352722 -3393513 -3424682
18663c424682j4770p528j5621j4005l315k3439j1807K9451J9934J7789J3767J2691
$$ -3424682 -3439452 -3446980 -3462601 -3476606 -3479921 -3503360 -3515167 -3485716 -3465782 -3447993 -3434226 -3421535
18651c421535O903J7407J3557N179K5453J7110P328K3830K7019J9919K1916L2290
$$ -3421535 -3414632 -3397225 -3383668 -3378489 -3353036 -3335926 -3328598 -3304768 -3277749 -3257830 -3235914 -3203624
18639c203624K3161J7971N873N023J4362J7138K9607O831P912J2413J0982J3194
$$ -3203624 -3180463 -3162492 -3156619 -3151596 -3137234 -3120096 -3090489 -3083658 -3075746 -3063333 -3052351 -3039157
18627c039157J739j4142m202q891l1979l0996l130O79q106j929j9095k5227l2681
$$ -3039157 -3037418 -3051560 -3055762 -3064653 -3096632 -3127628 -3130758 -3130079 -3138185 -3140114 -3159209 -3184436 -3217117
18614c217117k7267j6263j8817k5432j5637J920j5195k6307O313J7731P686P520
$$ -3217117 -3244384 -3260647 -3279464 -3304896 -3320533 -3318613 -3333808 -3360115 -3353802 -3336071 -3328385 -3320865
18602c320865K4178K4899K3417J7119N05L496J0429N734K1705K8664K5130L117
$$ -3320865 -3296687 -3271788 -3248371 -3231252 -3230747 -3227251 -3216822 -3211088 -3189383 -3160719 -3135589 -3132472
18590c132472j722P798J0063O045J4274k241M630K0158J0825K902l947J9471O027
$$ -3132472 -3134194 -3126396 -3116333 -3110288 -3096014 -3098255 -3093625 -3073467 -3062642 -3059740 -3063687 -3044216 -3038189
18577c038189N834K5260J6547Q891J4565j313J3503P001J0505J1377O446L824
$$ -3038189 -3032355 -3007095 -2990548 -2981657 -2967092 -2968405 -2954902 -2947901 -2937396 -2926019 -2919573 -2915749
18565b915749j211J069M809M254R654k256N368o56o54J4405R083R889J1077O687
$$ -2915749 -2916960 -2915891 -2911082 -2906828 -2897174 -2899430 -2894062 -2894718 -2895372 -2880967 -2871884 -2861995 -2850918 -2844231
18551b844231J1370N235K201J8078J7130K172K570L057M345J6967L96J8693O230
$$ -2844231 -2832861 -2827626 -2825425 -2807347 -2790217 -2788045 -2785475 -2782418 -2778073 -2761106 -2760710 -2742017 -2735787
18538b735787m914n392M179J6578m009k951n890J1104J7555J8222P775L314J369
$$ -2735787 -2740701 -2746093 -2741914 -2725336 -2729345 -2732296 -2738186 -2727082 -2709527 -2691305 -2683530 -2680216 -2678847
18525b678847o259L477N325j590J1046m270P944J2845J3539J3897j2759j3139
$$ -2678847 -2685106 -2681629 -2676304 -2677894 -2666848 -2671118 -2663174 -2650329 -2636790 -2622893 -2635652 -2648791
18513b648791P754J0270J8679P656O790J0020j345q524L326M900Q200J0581p133
$$ -2648791 -2641037 -2630767 -2612088 -2604432 -2597642 -2587622 -2588967 -2597491 -2594165 -2589265 -2581065 -2570484 -2577617
18500b577617j0288J85O748J4097k56L282M399J651J0934J4918J7667J6450K525
$$ -2577617 -2587905 -2587720 -2580972 -2566875 -2567131 -2563849 -2559450 -2557799 -2546865 -2531947 -2514280 -2497830 -2495305
18487b495305n449K59M243j516M812R236m7L092l121k43L57N691J5953J5928P29
$$ -2495305 -2500754 -2500495 -2496252 -2497768 -2492956 -2483720 -2483767 -2480675 -2483796 -2484039 -2483682 -2477991 -2462038 -2446110 -2445381
18472b445381o977R673j306j0093P608L807J1928J5484l161K683J2865n870j5267
$$ -2445381 -2452358 -2442685 -2443991 -2454084 -2446476 -2442669 -2430741 -2415257 -2418418 -2415735 -2402870 -2408740 -2424007
18459b424007m200J7121J6097O052O328K244J6992P74K601o703P560J0223N896
$$ -2424007 -2428207 -2411086 -2394989 -2388937 -2382609 -2380365 -2363373 -2362599 -2359998 -2366701 -2359141 -2348918 -2343022
18446b343022R260N552j4889r960K602K5177J0308l239k594J2077J6662J0717
$$ -2343022 -2333762 -2328210 -2343099 -2353059 -2350457 -2325280 -2314972 -2318211 -2320805 -2308728 -2292066 -2281349
18434b281349r082o831J642K372P553O528J1376N956k624N449J0216K040L667
$$ -2281349 -2290431 -2297262 -2295620 -2293248 -2285695 -2279167 -2267791 -2261835 -2264459 -2259010 -2248794 -2246754 -2243087
18421b243087O217r772L394J0334l910o063J1015N930j3619L665J1363j463J8022
$$ -2243087 -2236870 -2246642 -2243248 -2232914 -2236824 -2242887 -2231872 -2225942 -2239561 -2235896 -2224533 -2225996 -2207974
18408b207974J1407K546O646l971j2743k485P899J6580L924q621J7247J3323j504
$$ -2207974 -2196567 -2194021 -2187375 -2191346 -2204089 -2206574 -2198675 -2182095 -2178171 -2186792 -2169545 -2156222 -2157726
18395b157726Q901K159l596o962K056J0719L515r406l389N290M189K900l028m302
$$ -2157726 -2148825 -2146666 -2150262 -2157224 -2155168 -2144449 -2140934 -2150340 -2153729 -2148439 -2144250 -2141350 -2144378 -2148680
18381b148680J3942J0056J5822K014r173N215M540K411Q728m047J4941Q056m978
$$ -2148680 -2134738 -2124682 -2108860 -2106846 -2116019 -2110804 -2106264 -2103853 -2095125 -2099172 -2084231 -2076175 -2081153
18368b081153P501n210Q237P062Q196m842J580k526O243j2633O153J0466Q488
$$ -2081153 -2073652 -2078862 -2070625 -2063563 -2055367 -2060209 -2058629 -2061155 -2054912 -2067545 -2061392 -2050926 -2042438
18355b042438l054l706Q926J3508l768Q717J6196J923l655q221r899P244J2653
$$ -2042438 -2045492 -2049198 -2040272 -2026764 -2030532 -2021815 -2005619 -2003696 -2007351 -2015572 -2025471 -2018227 -2005574
18342b005574m07m09o390J1372J0988n919q41Q806k050O774n88J7789k097o879
$$ -2005574 -2005981 -2006390 -2012780 -2001408 -1990420 -1996339 -1997180 -1988374 -1990424 -1983650 -1984238 -1966449 -1968546 -1975425
18328a975425N518J4035L71N691j939p292L804P753J0199n872j7626j3690L489
$$ -1975425 -1969907 -1955872 -1955501 -1949810 -1951749 -1959041 -1955237 -1947484 -1937285 -1943157 -1960783 -1974473 -1970984
18315a970984J6444J5890J4844Q699J3n648K022R349K759Q998L582m550q160j5189
$$ -1970984 -1954540 -1938650 -1923806 -1915107 -1915094 -1920742 -1918720 -1909371 -1906612 -1897614 -1894032 -1898582 -1906742 -1921931
18301a921931J8086J0786K0247K831J0788n88RJ2381j0287k9670N982J2744P342
$$ -1921931 -1903845 -1893059 -1872812 -1869981 -1859193 -1859781 -1859772 -1847391 -1857678 -1887348 -1881366 -1868622 -1861280
18288a861280J0413O029M411l109j2241m734J7877k085k341M745P810J0277O16
$$ -1861280 -1850867 -1844838 -1840427 -1843536 -1855777 -1860511 -1842634 -1844719 -1847060 -1842315 -1834505 -1824228 -1823612
18275a823612r129Q067O095l238N382O034P501O43j582M72m112N134r80Q413J3728
$$ -1823612 -1832741 -1824674 -1818579 -1821817 -1816435 -1810401 -1802900 -1802257 -1803839 -1803367 -1807479 -1802345 -1803325 -1794912 -1781184
18260a781184l883m849q34k937N245J2397N077j80k016l326P758j334J151Q579
$$ -1781184 -1785067 -1789916 -1790750 -1793687 -1788442 -1776045 -1770968 -1771148 -1773164 -1776490 -1768732 -1770066 -1768915 -1760336
18246a760336Q935L753J021q898j7342j884J0071L549J1051O745L992P982p806
$$ -1760336 -1751401 -1747648 -1746627 -1755525 -1772867 -1774751 -1764680 -1761131 -1750080 -1743335 -1739343 -1731361 -1739167
18233a739167M437J3039p485p299k580M290O779Q678P164P453j4224M444K479
$$ -1739167 -1734730 -1721691 -1729176 -1736475 -1739055 -1734765 -1727986 -1719308 -1712144 -1704691 -1718915 -1714471 -1711992
18220a711992L935J2700J1675K645r50j0099J982n506o765k103K130J444N233
$$ -1711992 -1708057 -1695357 -1683682 -1681037 -1681987 -1692086 -1690104 -1695610 -1702375 -1704478 -1702348 -1700904 -1695671
18207a695671O50m642J3064J8602N88l264m752J521K311j844O913P215Q892O814
$$ -1695671 -1695021 -1699663 -1686599 -1667997 -1667409 -1670673 -1675425 -1673904 -1671593 -1673437 -1666524 -1659309 -1650417 -1643603
18193a643603O601J0925j339M133J65j1971m957m790K4362J1511j730K317n350
$$ -1643603 -1637002 -1626077 -1627416 -1623283 -1623118 -1635089 -1640046 -1644836 -1620474 -1608963 -1610693 -1608376 -1613726
18180a613726j0875q612J2053K7747J1923j0494m552J9000P047j513O66N365j4404
$$ -1613726 -1624601 -1633213 -1621160 -1593413 -1581490 -1591984 -1596536 -1577536 -1570489 -1572002 -1571336 -1565971 -1580375
18167a580375j5321J364K011N778k653p515P86L118J4995K367m932J746n371l63
$$ -1580375 -1595696 -1594332 -1592321 -1586543 -1589196 -1596711 -1595925 -1592807 -1577812 -1575445 -1580377 -1578631 -1584002 -1584365
18153a584365K840m022L678M060O77l427P793J1615R201n387J828M312J817m495
$$ -1584365 -1581525 -1585547 -1581869 -1577809 -1577132 -1580559 -1572766 -1561151 -1551950 -1557337 -1555509 -1551197 -1549380 -1553875
18139a553875m536J8712L521m346o258q22p224L635R59J4798K8212j8R10K303
$$ -1553875 -1558411 -1539699 -1536178 -1540524 -1546782 -1547604 -1554828 -1551193 -1550234 -1535436 -1507224 -1507242 -1506332 -1504029
18125a504029J4026o453j5151J185N557R311P16k829l432q475m313r96J1078J2562
$$ -1504029 -1490003 -1496456 -1511607 -1510422 -1504865 -1495554 -1494838 -1497667 -1501099 -1509574 -1513887 -1514883 -1503805 -1491243
18111a491243K763k645N390o347R19J0979O438q123M683J525J0737J560N951l890
$$ -1491243 -1488480 -1491125 -1485735 -1492082 -1491163 -1480184 -1473746 -1481869 -1477186 -1475661 -1464924 -1463364 -1457413 -1461303
18097a461303l101O112m875j3276R595L701j2178N675Q954R775J1267J7604p654
$$ -1461303 -1464404 -1458292 -1463167 -1476443 -1466848 -1463147 -1475325 -1469650 -1460696 -1450921 -1439654 -1422050 -1429704
18084a429704j9202j4042N372P510Q061M10j2296n152J0281J0826O100L992J2676
$$ -1429704 -1448906 -1462948 -1457576 -1450066 -1442005 -1441595 -1453891 -1459043 -1448762 -1437936 -1431836 -1427844 -1415168
18071a415168O493J0431m915m155K615n755K469L42P009N516M746l719L516J3170
$$ -1415168 -1408675 -1398244 -1403159 -1407314 -1404699 -1410454 -1407985 -1407643 -1400634 -1395118 -1390372 -1394091 -1390575 -1377405
18057a377405p645k903Q51m355Q751m908o542P271O49j666N682O709N480m858
$$ -1377405 -1385050 -1387953 -1387102 -1391457 -1382706 -1387614 -1394156 -1386885 -1386236 -1387902 -1382220 -1375511 -1370031 -1374889
18043a374889M429K0150K771L796P424j8835j8393O19M444k624K06R375k991J5530
$$ -1374889 -1370460 -1350310 -1347539 -1343743 -1336319 -1355154 -1373547 -1372928 -1368484 -1371108 -1370902 -1361527 -1364518 -1348988
18029a348988K249k925K2044M063j3807j1164j874j104L860J0674J1965p580q192
$$ -1348988 -1346739 -1349664 -1327620 -1323557 -1337364 -1348528 -1350402 -1351506 -1347646 -1336972 -1325007 -1332587 -1340779
18016a340779j3015J556R034K588m658K818J958M661J2924q54O133K908k48N53
$$ -1340779 -1353794 -1352238 -1343204 -1340616 -1345274 -1342456 -1340498 -1335837 -1322913 -1323767 -1317634 -1314726 -1314974 -1314421
18002a314421n914M808R243O821j3173m982Q343J7890n577r912m343J9169J2953
$$ -1314421 -1320335 -1315527 -1306284 -1299463 -1312636 -1317618 -1309275 -1291385 -1296962 -1306874 -1311217 -1292048 -1279095
17989a279095j7741j172K150l810J1030N020J442j758q154l727l254k577K941
$$ -1279095 -1296836 -1298008 -1295858 -1299668 -1288638 -1283618 -1282176 -1283934 -1292088 -1295815 -1299069 -1301646 -1298705
17976a298705J7433J4060J3151m568j5700J4459R353p476j2305M887L684P620
$$ -1298705 -1281272 -1267212 -1254061 -1258629 -1274329 -1259870 -1250517 -1257993 -1270298 -1265411 -1261727 -1254107
17964a254107N291J0925J4560J250m312n438o539k066r742l023o065q294OJ4474
$$ -1254107 -1248816 -1237891 -1223331 -1222081 -1226393 -1231831 -1238370 -1240436 -1250178 -1253201 -1259266 -1267560 -1267554 -1253080
17950a253080J4746J1028J0611o57l475l927j1482K687Q312O830l654r604m575
$$ -1253080 -1238334 -1227306 -1216695 -1217352 -1220827 -1224754 -1236236 -1233549 -1225237 -1218407 -1222061 -1231665 -1236240
17937a236240j074K847m812M289J1979N017P056K523n547k970J161O304j492j642
$$ -1236240 -1237314 -1234467 -1239279 -1234990 -1223011 -1217994 -1210938 -1208415 -1213962 -1216932 -1215771 -1209467 -1210959 -1212601
17923a212601n548J8720J300P885n574K339O668Q201J284n08J503q638J220J032
$$ -1212601 -1218149 -1199429 -1198129 -1190244 -1195818 -1193479 -1186811 -1178610 -1177326 -1177834 -1176331 -1184969 -1183749 -1182717
17909a182717p674n0J0687P753m141j1389l628j152R410J1399L357N409N446r164
$$ -1182717 -1190391 -1190441 -1179754 -1172001 -1176142 -1187531 -1191159 -1192311 -1182901 -1171502 -1168145 -1162736 -1157290 -1166454
17895a166454K536J0350N289m833l424J2768M457j4991n00M398N062M77k84l246
$$ -1166454 -1163918 -1153568 -1148279 -1153112 -1156536 -1143768 -1139311 -1154302 -1154802 -1150404 -1145342 -1144865 -1145149 -1148395
17881a148395K153N789p766q844J747o224Q032J2035L282k177k761L928K104R179
$$ -1148395 -1146242 -1140453 -1148219 -1157063 -1155316 -1161540 -1153508 -1141473 -1138191 -1140368 -1143129 -1139201 -1137097 -1127918
17867a127918L435j513p112n95j5631J691K3492J1746m760j601p256p157P61O372
$$ -1127918 -1124483 -1125996 -1133108 -1133703 -1149334 -1147643 -1124151 -1112405 -1117165 -1118766 -1126022 -1133179 -1132418 -1126046
17853a126046K0318q40n780j159J5323O36j5335o894R326P206P526M642j0531
$$ -1126046 -1105728 -1106568 -1112348 -1113507 -1098184 -1097548 -1112883 -1119777 -1110451 -1103245 -1095719 -1091077 -1101608
17840a101608j3198P996P358P708m139J760J2134K670M272l492K860j8715P99
$$ -1101608 -1114806 -1106810 -1099452 -1091744 -1095883 -1094123 -1081989 -1079319 -1075047 -1078539 -1075679 -1094394 -1093595
17827a093595J6740O571O53M530j523N379l410j196o77p757j4008j2605K513Q275
$$ -1093595 -1076855 -1070284 -1069631 -1065101 -1066624 -1061245 -1064655 -1065851 -1066528 -1074285 -1088293 -1100898 -1098385 -1090110
17813a090110J772J0596J1005j05j337p149J2292J905p282O154J9290o264q18
$$ -1090110 -1088338 -1077742 -1066737 -1066842 -1068179 -1075328 -1063036 -1061131 -1068413 -1062259 -1042969 -1049233 -1050051
17800a050051L884j2559r879Q259P448n082M809J0826K176J2126R134j3496j6180
$$ -1050051 -1046167 -1058726 -1068605 -1060346 -1052898 -1057980 -1053171 -1042345 -1040169 -1028043 -1018909 -1032405 -1048585
17787a048585R770L402m216l845k432J442q088r55J0123R629K507O508J1233J064
$$ -1048585 -1038815 -1035413 -1039629 -1043474 -1045906 -1044464 -1052552 -1053507 -1043384 -1033755 -1031248 -1024740 -1013507 -1012443
17773a012443k231Q717j0686j3554P373J308o454j323J2227M000P67L252Q612
$$ -1012443 -1014674 -1005957 -1016643 -1030197 -1022824 -1021516 -1027970 -1029293 -1017066 -1013066 -1012299 -1009047 -1000435
17760a000435j0088l639j313n126q725Q424J0754Q621L246m89p215J0778N934
$$ -1000435 -1010523 -1014162 -1015475 -1020601 -1029326 -1020902 -1010148 -1001527 -998281 -998770 -1005985 -995207 -989273
17747i89273k724q193j530O29P223N593n106j5015j379N985L778j304j912J0935
$$ -989273 -991997 -1000190 -1001720 -1001091 -993868 -988275 -993381 -1008396 -1009775 -1003790 -1000012 -1001316 -1003228 -992293
17733i92293O775J1675J0043M02k245j4071l768O455N110N22M587k979j1526q718
$$ -992293 -985518 -973843 -963800 -963398 -965643 -979714 -983482 -977027 -971917 -971395 -966808 -969787 -981313 -990031
17719i90031K5205q16k1837k334M129N90o87J0798P810L452M323j107q673m513
$$ -990031 -964826 -965642 -987479 -989813 -985684 -985094 -985781 -974983 -967173 -963721 -959398 -960505 -969178 -973691
17705i73691J743P498n851j1302P915R312R087O701J596l532L923q504j101r45
$$ -973691 -971948 -964450 -970301 -981603 -973688 -964376 -955289 -948588 -946992 -950524 -946601 -955105 -956206 -957151
17691i57151J425J534L839J1116l858O448J886J2785r088j0413K210J2837J2825
$$ -957151 -955726 -954192 -950353 -939237 -943095 -936647 -934761 -921976 -931064 -941477 -939267 -926430 -913605
17678i13605J573m95p2Q715r817p304m791p506J9227N306m436M825P131k169p390
$$ -913605 -912032 -912527 -912599 -903884 -913701 -921005 -925796 -933302 -914075 -908769 -913205 -908380 -901249 -903418 -910808
17663i10808l62q4P745l997P993J5785j4067j0835J0592J3902N240j1932l000
$$ -910808 -911170 -911254 -903509 -907506 -899513 -883728 -897795 -908630 -898038 -884136 -878896 -890828 -893828
17650h93828o37P58J1706R119L43k451j0611P559l753j9779j4504P385J7962P866
$$ -893828 -894465 -893707 -882001 -872882 -872539 -874990 -885601 -878042 -881795 -901574 -916078 -908693 -890731 -882865
17636h82865K616R30m531j4240m52j996J1795j0449K933L710j4191J351K4348
$$ -882865 -880249 -879319 -883850 -898090 -898542 -900538 -888743 -899192 -896259 -892549 -906740 -905389 -881041
17623h81041J7547p052o589n09J9557J674l492l519K223J1063m534j5551n307
$$ -881041 -863494 -870546 -877135 -877644 -858087 -856413 -859905 -863424 -861201 -850138 -854672 -870223 -875530
17610h75530P211P085m864o774J3487O961K470j1246p804J0849J727r403J743
$$ -875530 -868319 -861234 -866098 -872872 -859385 -852424 -849954 -861200 -869004 -858155 -856428 -865831 -864088
17597h64088L770R044P888k897k529r20J0203J0594O114p322j1559K991m090m550
$$ -864088 -860318 -851274 -843386 -846283 -848812 -849732 -839529 -828935 -822821 -830143 -841702 -838711 -842801 -847351
17583h47351k191J3813m458j256R141R000L418P382p496R047O467j4224j1168
$$ -847351 -849542 -835729 -840187 -841443 -832302 -823302 -819884 -812502 -819998 -810951 -804484 -818708 -829876
17570h29876j2583N851J2223P362j5217p596J912P850J848P60K852L158n846r79
$$ -829876 -842459 -836608 -824385 -817023 -832240 -839836 -837924 -830074 -828226 -827466 -824614 -821456 -827302 -828281
17556h28281Q165J72k4721j896K2262K1795L018p469j615J0504L90j3609J0426
$$ -828281 -820116 -819944 -844665 -846561 -824299 -802504 -799486 -806955 -808570 -798066 -797676 -811285 -800859
17543h00859K040j2079q784N359j603K9544N983j803J7372P79j9100k811Q536
$$ -800859 -798819 -810898 -819682 -814323 -815926 -786382 -780399 -782202 -764830 -764051 -783151 -785962 -777426
17530g77426L388j0474q900o040J2781j0509n975j160K877L756K0141Q612p184
$$ -777426 -774038 -784512 -793412 -799452 -786671 -797180 -803155 -804315 -801438 -797682 -777541 -768929 -776113
17517g76113L279k468l1127N75J7399M371O836N622q386K532j849l139j016L441
$$ -776113 -772834 -775302 -806429 -805854 -788455 -784084 -777248 -771626 -780012 -777480 -779329 -782468 -783484 -780043
17503g80043l668M937K620J3329P726M863j4530K448O354o92j557j2535N081O175
$$ -780043 -783711 -778774 -776154 -762825 -755099 -750236 -764766 -762318 -755964 -756656 -758213 -770748 -765667 -759492
17489g59492o712k796K942J021k603o32J5762L968M260J172J5450J055r155J0200
$$ -759492 -766204 -769000 -766058 -765037 -767640 -768272 -752510 -748542 -744282 -743110 -727660 -726605 -735760 -725560
17475g25560k666j0697M085O923j1227r628r511N740J1063J970o925N541M374
$$ -725560 -728226 -738923 -734838 -727915 -739142 -748770 -758281 -752541 -741478 -739508 -746433 -740892 -736518
17462g36518r640j182p237l140J1652J1009j367l139m857J2907J4133n870M073
$$ -736518 -746158 -747340 -754577 -757717 -746065 -735056 -736423 -739562 -744419 -731512 -717379 -723249 -719176
17449g19176J3305o227o648J248M119M002M03j106L291P342j0897j4094j1231
$$ -719176 -705871 -712098 -718746 -717498 -713379 -709377 -708974 -710080 -706789 -699447 -710344 -724438 -735669
17436g35669j9940n496J5222J5866J5178J4082P34j023o541j4592q720J7121J5156
$$ -735669 -755609 -761105 -745883 -730017 -714839 -700757 -700023 -701046 -707587 -722179 -730899 -713778 -698622
17423f98622k584o779M070K555j276p461m013J1173l844J304k359j49k21K66l24
$$ -698622 -701206 -707985 -703915 -701360 -702636 -710097 -714110 -702937 -706781 -705477 -707836 -707985 -708206 -707940 -708264
17408g08264l39K21j277O8l438J910l318J940J1965Q038l211J0940M120J584o255
$$ -708264 -708603 -708382 -709659 -709591 -713029 -711119 -714437 -712497 -700532 -692494 -695705 -684765 -680645 -679061 -685316
17393f85316n389l550m747L367R940N066P658n27J0794M915j4860j6120o838j603
$$ -685316 -690705 -694255 -699002 -695635 -685695 -680629 -672971 -673498 -662704 -657789 -672649 -688769 -695607 -697210
17379f97210L290K0616J1668L995o760j4995m880m533l099R634J0590N699r363
$$ -697210 -693920 -673304 -661636 -657641 -664401 -679396 -684276 -688809 -691908 -682274 -671684 -665985 -675348
17366f75348q503L539Q067J6266q029m939J2157J495Q506L647j0878j1147q466
$$ -675348 -683851 -680312 -672245 -655979 -664008 -668947 -656790 -655295 -646789 -643142 -654020 -665167 -673633
17353f73633O620Q596N838q233M882J373l348N450K934J2718K886l004M02n986
$$ -673633 -667013 -658417 -652579 -660812 -655930 -654557 -657905 -652455 -649521 -636803 -633917 -636921 -636519 -642505
17339f42505q972J498P314M233J143R48J999j8J1437l004R75O700p860J2236n516
$$ -642505 -651477 -649979 -642665 -638432 -637289 -636341 -634342 -634360 -622923 -625927 -624952 -618252 -626112 -613876 -619392
17324f19392n415j2943l588q50Q393k6092j1313J0607J3111j125j3518n365P037
$$ -619392 -624807 -637750 -641338 -642188 -633795 -659887 -671200 -660593 -647482 -648607 -662125 -667490 -660453
17311f60453J2257K983J2835N578j339M463M292L498l868n474n125j746J1134
$$ -660453 -648196 -645213 -632378 -626800 -628139 -623676 -619384 -615886 -619754 -625228 -630353 -632099 -620965
17298f20965P165o009q193j0974K246J9625Q627k228J0379Q534q441j4901q295
$$ -620965 -613800 -619809 -628002 -638976 -636730 -617105 -608478 -610706 -600327 -591793 -600234 -615135 -623430
17285f23430o72N806O722j330j975L204J1618P318m593n06k257n648N205j597
$$ -623430 -624102 -618296 -611574 -612904 -614879 -611675 -600057 -592739 -597332 -597838 -600095 -605743 -600538 -602135
17271f02135m829O309J994j9400j4050L185J8428P656M605Q356k744q637p042
$$ -602135 -606964 -600655 -598661 -618061 -632111 -628926 -610498 -602842 -598237 -589881 -592625 -601262 -608304
17258f08304N542J1930l194j876L983M478Q883N680K837M261m21j0343j1627J801
$$ -608304 -602762 -590832 -594026 -595902 -591919 -587441 -578558 -572878 -570041 -565780 -566201 -576544 -588171 -586370
17244e86370o539j0735M087N021N190J556O279K612J596p198j4686o131J0091
$$ -586370 -592909 -603644 -599557 -594536 -589346 -587790 -581511 -578899 -577303 -584501 -599187 -605318 -595227
17231e95227J5871P35Q897j830l282k280J040O955m380P337j1906N810k592m202
$$ -595227 -579356 -578621 -569724 -571554 -574836 -577116 -576076 -569121 -573501 -566164 -578070 -572260 -574852 -579054
17217e79054l036L410J283J4961J835l481K923M655K73O899P9M631o150j6291
$$ -579054 -582090 -578680 -577397 -562436 -560601 -564082 -561159 -556504 -556231 -549332 -549253 -544622 -550772 -567063
17203e67063P105R218r711r71J0599K80k365l635j5555p603L486J461R629N283
$$ -567063 -559958 -550740 -560451 -561422 -550823 -550543 -552908 -556543 -572098 -579701 -576215 -574754 -565125 -559842
17189e59842J2526J693n038j5901q40J4395J3164m651k216J471N122K667M755
$$ -559842 -547316 -545623 -550661 -566562 -567402 -553007 -539843 -544494 -546710 -545239 -540117 -537450 -532695
17176e32695L031N841p741J809K1391Q895j1553k256j4418j5481J045P881N116
$$ -532695 -529664 -523823 -531564 -529755 -508364 -499469 -511022 -513278 -527696 -543177 -542132 -534251 -529135
17163e29135l617m454J861K42j1167J684N197P70m78N382M633J2811R994o805
$$ -529135 -532752 -537206 -535345 -535103 -546270 -544586 -539389 -538619 -539097 -533715 -529082 -516271 -506277 -513082
17149e13082p217k671n177M98N549o419k2682o432J5672K1869k8l117J359M730
$$ -513082 -520299 -522970 -528147 -527649 -522100 -528519 -551201 -557633 -541961 -520092 -520120 -523237 -521878 -517148
17135e17148j425l922j207M022l595p444l770J1760k144n168N316J5164n054j843
$$ -517148 -518573 -522495 -523702 -519680 -523275 -530719 -534489 -522729 -524873 -530041 -524725 -509561 -514615 -516458
17121e16458M415L836p545j1425K531R978k183K286M572R779k617P135O043l7
$$ -516458 -512043 -508207 -515752 -527177 -524646 -514668 -516851 -514565 -509993 -500214 -502831 -495696 -489653 -489690
17107d89690q674j979m122r425j1465K568M534J0994o43j674j535P096P971L238
$$ -489690 -498364 -500343 -504465 -513890 -525355 -522787 -518253 -507259 -507902 -509576 -511111 -504015 -496044 -492806
17093d92806L820Q94r063k935r70J4342q858L671M401N944R832J0130m111j1583
$$ -492806 -488986 -488092 -497155 -500090 -501060 -486718 -495576 -491905 -487504 -481560 -471728 -461598 -465709 -477292
17079d77292j2335J104Q894l083n83p328n565L114J1601J4705p396j5502j134
$$ -477292 -489627 -488523 -479629 -482712 -483295 -490623 -496188 -493074 -481473 -466768 -474164 -489666 -490800
17066d90800J3297R258J1075K580r630J053m919Q28P041l129j3388r490m632p906
$$ -490800 -477503 -468245 -457170 -454590 -464220 -463167 -468086 -467258 -460217 -463346 -476734 -486224 -490856 -498762
17052d98762P896O412J1680K3196m399n326q61J0453q391p321P444P860j4212
$$ -498762 -490866 -484454 -472774 -449578 -453977 -459303 -460164 -449711 -458102 -465423 -457979 -450119 -464331
17039d64331j8753J0589O350q899Q023K501N388J4408K74j1936M621L840r172
$$ -464331 -483084 -472495 -466145 -475044 -467021 -464520 -459132 -444724 -444450 -456386 -451765 -447925 -457097
17026d57097O921k359k727m0p056J4009k7q279j0308m299O714J3248l746l40p279
$$ -457097 -450176 -452535 -455262 -455302 -462358 -448349 -448376 -456655 -466963 -471262 -464548 -451300 -455046 -455386 -462665
17011d62665l648r84O39J8428J3192j3270K581J9421k11j426j2093R51L246N272
$$ -462665 -466313 -467297 -466658 -448230 -435038 -448308 -445727 -426306 -426517 -427943 -440036 -439085 -435839 -430567
16997d30567N311n993r727j40j560J364J13j103k269R33l956o915R285J2028m106
$$ -430567 -425256 -431249 -440976 -441116 -442676 -441312 -441199 -442302 -444571 -443638 -447594 -454509 -445224 -433196 -437302
16982d37302N144o031O886O207K926P42L847P258L368O489k208r488l035j231
$$ -437302 -432158 -438189 -431303 -425096 -422170 -421428 -417581 -410323 -406955 -400466 -402674 -412162 -415197 -416428
16968d16428O232p807j0236q631n746J256n776N758J6096R312M079j328L75j0433
$$ -416428 -410196 -418003 -428239 -436870 -442616 -441360 -447136 -441378 -425282 -415970 -411891 -413219 -412844 -423277
16954d23277j0101J1217J3889m617P070J0941k294k326k168P34L391p328j5778
$$ -423277 -433378 -422161 -408272 -412889 -405819 -394878 -397172 -399498 -401666 -400932 -397541 -404869 -420647
16941d20647K492L320p77j632k954J4073L597r627R379L624m114j4322P453J3143
$$ -420647 -418155 -414835 -415612 -417244 -420198 -406125 -402528 -412155 -402776 -399152 -403266 -417588 -410135 -396992
16927c96992p16r116o229j5855M11k140k753l1M934Q748m959J995R589R47m143
$$ -396992 -397708 -406824 -413053 -428908 -428497 -430637 -433390 -433421 -428487 -419739 -424698 -422703 -413114 -412167 -416310
16912d16310k152n227N645J3915N641j8701k922J8166p819j3000r924J0813J8963
$$ -416310 -418462 -423689 -418044 -404129 -398488 -417189 -420111 -401945 -409764 -422764 -432688 -421875 -402912
16899d02912j539l091N346j5321M202P254P247J0681l872j5784O449J7060p37
$$ -402912 -404451 -407542 -402196 -417517 -413315 -406061 -398814 -388133 -392005 -407789 -401340 -384280 -385017
16886c85017N033m62j568J551J0738o809j3336n539Q024N408K3745L448k1046
$$ -385017 -379984 -380446 -382014 -380463 -369725 -376534 -389870 -395409 -387385 -381977 -358232 -354784 -375830
16873c75830k452J3335O393O364m289m385j6209q895L561J0041m444l707J540
$$ -375830 -378282 -364947 -358554 -352190 -356479 -360864 -377073 -385968 -382407 -372366 -376810 -380517 -378977
16860c78977p96J6514J0330n150k938j110n304o158O986J0552K610l41j3009j6477
$$ -378977 -379773 -363259 -352929 -358079 -361017 -362127 -367431 -373589 -366603 -356051 -353441 -353782 -366791 -383268
16846c83268p66J958R637J2166j3757O857K319k907N532k339o371N506J0277M758
$$ -383268 -384034 -382076 -372439 -360273 -374030 -367173 -364854 -367761 -362229 -364568 -370939 -365433 -355156 -350398
16832c50398M769K929l576p552m31J1273o216j519l981m566M752K402J0467r556
$$ -350398 -345629 -342700 -346276 -353828 -354259 -342986 -349202 -350721 -354702 -359268 -354516 -352114 -341647 -351203
16818c51203j7331j3687M754K1683J5802k211j4215o468P682J7829J5983Q4j8901
$$ -351203 -368534 -382221 -377467 -355784 -339982 -342193 -356408 -362876 -355194 -337365 -321382 -321298 -340199
16805c40199j3332O50N427j931m799L542R503J1695k49j0425j7621L381J28P795
$$ -340199 -353531 -352881 -347454 -349385 -354184 -350642 -341139 -329444 -329693 -340118 -357739 -354358 -354230 -346435
16791c46435L329J456O671j5351k314P291J1742L715p259K087n946j2941J5791
$$ -346435 -343106 -341650 -334979 -350330 -352644 -345353 -333611 -329896 -337155 -335068 -341014 -353955 -338164
16778c38164Q59J7476R279o119j2838J601K253j1737j0363O970J4398j25k306
$$ -338164 -337305 -319829 -310550 -316669 -329507 -327906 -325653 -337390 -347753 -340783 -326385 -326510 -328816
16765c28816P274J0374r942r859J23L601q580L382J8601J8615k8251j8559o9J0721
$$ -328816 -321542 -311168 -321110 -330969 -330846 -327245 -335825 -332443 -313842 -295227 -323478 -342037 -342106 -331385
16751c31385L526P572k964j4977R54J5444l075l120j0367n120R356J968k632j3777
$$ -331385 -327859 -320287 -323251 -338228 -337274 -321830 -324905 -328025 -338392 -343512 -334156 -332188 -334820 -348597
16737c48597L933M703J1609J2926N842O668K327P155L089p179p512k727j0238
$$ -348597 -344664 -339961 -328352 -315426 -309584 -302916 -300589 -293434 -290345 -297524 -305036 -307763 -318001
16724c18001l725O965J8891n954j1083n879O941P01K884q858P457J2422r98j1603
$$ -318001 -321726 -314761 -295870 -301824 -312907 -318786 -311845 -311144 -308260 -317118 -309661 -297239 -298237 -309840
16710c09840r333L075J4971J496p21J36q755K868M664m608j0051k84R874M043
$$ -309840 -319173 -316098 -301127 -299631 -300352 -300216 -308971 -306103 -301439 -306047 -316098 -316382 -306508 -302465
16696c02465L943j587j4005L282l398K6J0269J0323J729L496J9070j301J363J6980
$$ -302465 -298522 -300109 -314114 -310832 -314230 -314204 -303935 -293612 -291883 -288387 -269317 -270618 -269255 -252275
16682b52275k012j3174K630p747j1111k68m67m711M432Q287j414q407j0021L247
$$ -252275 -254287 -267461 -264831 -272578 -283689 -283957 -284424 -289135 -284703 -276416 -277830 -286237 -296258 -293011
16668b93011j73R521Q035j4377m244K633m520o020m725J4755J1324J493K181P960
$$ -293011 -293184 -283663 -275628 -290005 -294249 -291616 -296136 -302156 -306881 -292126 -280802 -279309 -277128 -269168
16654b69168J2063L044q58q674P928m480k751j34n189k0803o078J0923L365L930
$$ -269168 -257105 -254061 -254919 -263593 -255665 -260145 -262896 -263030 -268219 -289022 -295100 -284177 -280812 -276882
16640b76882j037J131O294j1644p88J1725P088j2495K763M973N881k584J152J2187
$$ -276882 -277919 -276788 -270494 -282138 -282926 -271201 -264113 -276608 -273845 -268872 -262991 -265575 -264423 -252236
16626b52236k1293r330J3704O702n88L458P2p976k745Q899P008j0045o51J6692
$$ -252236 -273529 -282859 -269155 -262453 -263041 -259583 -259511 -267487 -270232 -261333 -254325 -264370 -265021 -248329
16612b48329M08K153n211J916J5202k682o200J119J774p665K678j256O043K679
$$ -248329 -247921 -245768 -250979 -249063 -233861 -236543 -242743 -241624 -239850 -247515 -244837 -246093 -240050 -237371
16598b37371j624n626l539j131O12k419R18Q651N058k068n217L47l829l896R83
$$ -237371 -238995 -244621 -248160 -249291 -248679 -251098 -250180 -241529 -236471 -238539 -243756 -243409 -247238 -251134 -250151
16583b50151j946K7094R718j2655k4374r559p14J4909J7301r17l771J0540P118
$$ -250151 -252097 -225003 -215285 -227940 -252314 -261873 -262587 -247678 -230377 -231294 -235065 -224525 -217407
16570b17407O554j8649o214O618J0150n573M61p669j2452m992M825M610J497J827
$$ -217407 -210853 -229502 -235716 -229098 -218948 -224521 -224060 -231729 -244181 -249173 -244348 -239738 -238241 -236414
16556b36414O413J511k913r413P005n550P030L875L43m443O50j4805r466Q073
$$ -236414 -230001 -228490 -231403 -240816 -233811 -239361 -232331 -228456 -228113 -232556 -231906 -246711 -256177 -248104
16542b48104o940M084J6083K548N312p010K719Q910R783o375r644o23m155r415
$$ -248104 -255044 -250960 -234877 -232329 -227017 -234027 -231308 -222398 -212615 -218990 -228634 -229257 -233412 -242827
16528b42827K252k543K716L089J1501J0722J647j8531k881J8906J6362J895q063
$$ -242827 -240575 -243118 -240402 -237313 -225812 -215090 -213443 -231974 -234855 -215949 -199587 -197692 -205755
16515b05755j3325L137J121j4056j33M669N963J1973J1109L276M717k10j095M263
$$ -205755 -219080 -215943 -214822 -228878 -229011 -224342 -218379 -206406 -195297 -192021 -187304 -187514 -188609 -184346
16501a84346n022q445k293n945j1877J8757R162K332j305k080o651o046j1784
$$ -184346 -189368 -197813 -200106 -206051 -217928 -199171 -190009 -187677 -188982 -191062 -197713 -203759 -215543
16488b15543R262J4940J6749r013j3809K021J8312P54k771l025k607m618k336
$$ -215543 -206281 -191341 -174592 -183605 -197414 -195393 -177081 -176327 -179098 -182123 -184730 -189348 -191684
16475a91684k682L889n25r103o050J632J2847l073Q747J123K208M598L091o083
$$ -191684 -194366 -190477 -191002 -200105 -206155 -204523 -191676 -194749 -186002 -184879 -182671 -178073 -174982 -181065
16461a81065j5042L36J937J693j751R38J0467N73n000M136Q344J6929K067j6047
$$ -181065 -196107 -195771 -193834 -192141 -193892 -192954 -182487 -181914 -186914 -182778 -174434 -157505 -155438 -171485
16447a71485k366n901q452p378n703L236j247l644O075J1335M644M149J5441r611
$$ -171485 -173851 -179752 -188204 -195582 -201285 -198049 -199296 -202940 -196865 -185530 -180886 -176737 -161296 -170907
16433a70907k3330j80R857Q861n248r019K8J5745R493O618p039k0927L623J4894
$$ -170907 -194237 -194417 -184560 -175699 -180947 -189966 -189938 -174193 -164700 -158082 -165121 -186048 -182425 -167531
16419a67531K700o616J423m787J1548R821p675K60M770n900p244M459J3261j1163
$$ -167531 -164831 -171447 -170024 -174811 -163263 -153442 -161117 -160857 -156087 -161987 -169231 -164772 -151511 -162674
16405a62674q232N827J1385p52q129M719Q567m846q523P549O470j575m423M249
$$ -162674 -170906 -165079 -153694 -154446 -162575 -157856 -149289 -154135 -162658 -155109 -148639 -150214 -154637 -150388
16391a50388O562J755k2426N32q872m003Q010J5678R336l523j061L646p702m605
$$ -150388 -143826 -142071 -164497 -163965 -172837 -176840 -168830 -153152 -143816 -147339 -148400 -144754 -152456 -157061
16377a57061J0207L328j0288R269N224j608M115L735K237j0999n507P607K537
$$ -157061 -146854 -143526 -153814 -144545 -139321 -140929 -136814 -133079 -130842 -141841 -147348 -139741 -137204
16364a37204r730n126q613N12R287Q4j249R370L696r460j5330K745m2O730O296
$$ -137204 -146934 -152060 -160673 -160161 -150874 -150790 -152039 -142669 -138973 -148433 -163763 -161018 -161060 -154330 -148034
16349a48034J0769J2033N385n399j0360o892L752o35L77l43J2364Q16j197M113
$$ -148034 -137265 -125232 -119847 -125246 -135606 -142498 -138746 -139381 -139004 -139347 -126983 -126167 -127364 -123251
16335a23251m39r710k0197j3821J3560N167q983J8520N805Q603k924j4294p305
$$ -123251 -123690 -133400 -153597 -167418 -153858 -148691 -157674 -139154 -133349 -124746 -127670 -141964 -149269
16322a49269O017J5892P883j1916J89k964n594M416R595r215p88O505O226o719
$$ -149269 -143252 -127360 -119477 -131393 -131204 -134168 -139762 -135346 -125751 -134966 -135754 -129249 -123023 -129742
16308a29742O41O927J0785n246p554m198r806P064J2253J1105J980O684l478j5052
$$ -129742 -129101 -122174 -111389 -116635 -124189 -128387 -138193 -131129 -118876 -107771 -105791 -99107 -102585 -117637
16294a17637j6441L58R590P479j418k377l976o492J1075M600K023m698q707n351
$$ -117637 -134078 -133720 -124130 -116651 -118069 -120446 -124422 -130914 -119839 -115239 -113216 -117914 -126621 -131972
16280a31972L567J75l526M35P084J3496k868N02J7740m39m876k65n281n416k976
$$ -131972 -128405 -128230 -131756 -131321 -124237 -110741 -113609 -113107 -95367 -95806 -100682 -100947 -106228 -111644 -114620
16265a14620p294n337l749Q0J0116J0523j138M238O10J2049Q890m959k998K280
$$ -114620 -121914 -127251 -131000 -130920 -120804 -110281 -111419 -107181 -106571 -94522 -85632 -90591 -93589 -91309
16251i1309l198R087l877j2305P473O264l584l280r7j1188n434O855L367J378
$$ -91309 -94507 -85420 -89297 -101602 -94129 -87865 -91449 -94729 -94826 -106014 -111448 -104593 -101226 -99848
16237i9848j709r550J84R754j017o85O02J3094q708j1366l434L220R94J1944N201
$$ -99848 -101557 -111107 -110923 -101169 -102186 -102871 -102269 -89175 -97883 -109249 -112683 -109463 -108469 -96525 -91324
16222i1324p901M177J211p021J728P067J629o640M096O501M819r195M806L006
$$ -91324 -99225 -95048 -93837 -100858 -99130 -92063 -90434 -97074 -92978 -86477 -81658 -90853 -86047 -83041
16208h3041k492r828J851l474r16J8813J4464N091N499o96L569p284j1099m44
$$ -83041 -85533 -95361 -93510 -96984 -97900 -79087 -64623 -59532 -54033 -54729 -51160 -58444 -69543 -69987
16194f9987P452o418j4925j1995M004R743O134J1282L790o96k798m995O884o781
$$ -69987 -62535 -68953 -83878 -95873 -91869 -82126 -75992 -64710 -60920 -61616 -64414 -69409 -62525 -69306
16180f9306r386o255O374R903m963j3307n181p787N804J0432J8850L404R61J700
$$ -69306 -78692 -84947 -78573 -68670 -73633 -86940 -92121 -99908 -94104 -83672 -64822 -61418 -60457 -58757
16166e8757p858l379j0880J1817J4263K101q843j0089M682J348k518n542N444
$$ -58757 -66615 -69994 -80874 -69057 -54794 -52693 -61536 -71625 -66943 -65595 -68113 -73655 -68211
16153f8211q413j7260k923L593J8353R783j608R020J1800j094N69P781j1451k1183
$$ -68211 -76624 -93884 -96807 -93214 -74861 -65078 -66686 -57666 -45866 -46960 -46391 -38610 -50061 -71244
16139g1244J3618J1782Q148k165o654m408q396j599J1383o44o488Q63M64M319
$$ -71244 -57626 -45844 -37696 -39861 -46515 -50923 -59319 -60918 -49535 -50179 -56667 -55804 -55340 -51021
16125e1021J322k594L737m262L963o474p44l442N904P556j2417Q976K2744M622
$$ -51021 -49699 -52293 -48556 -52818 -48855 -55329 -56073 -59515 -53611 -46055 -58472 -49496 -26752 -22130
16111b2130J636J471o733j3692r466R162j226j0900j494O787L850j374K3k2022
$$ -22130 -20494 -19023 -25756 -39448 -48914 -39752 -40978 -51878 -53372 -46585 -42735 -44109 -44086 -66108
16097f6108L606J3581M918M391M088L382M26N622n212J389n514r767l63k222m538
$$ -66108 -62502 -48921 -44003 -39612 -35524 -32142 -31716 -26094 -31306 -29917 -35431 -45198 -45561 -47783 -52321
16082e2321k405M496j993n886R286P313k233J5652N649L447L149p113n067l349
$$ -52321 -54726 -50230 -52223 -58109 -48823 -41510 -43743 -28091 -22442 -18995 -15846 -22959 -28026 -31375
16068c1375N22O738o726j8407q151R02J3336j483M718O87K178J3707P801p7l377
$$ -31375 -30853 -24115 -30841 -49248 -57399 -56497 -43161 -44644 -39926 -39239 -37061 -23354 -15553 -15630 -19007
16053a9007m705r384j0583k271K056J9951N586J985J4991J92j5098m819K049R398
$$ -19007 -23712 -33096 -43679 -45950 -43894 -23943 -18357 -16372 -1381 -1189 -16287 -21106 -19057 -9659
16039i659k335j6416n34R397J0976N284j3919n388n689k708K791J07j628Q525
$$ -9659 -11994 -28410 -28944 -19547 -8571 -3287 -17206 -22594 -28283 -30991 -28200 -28093 -29721 -21196
16025b1196J4544Q003j1646j354N395J1873J0252r879j3197o466P803M311K212
$$ -21196 -6652 1351 -10295 -11649 -6254 5619 15871 5992 -7205 -13671 -5868 -1557 655
16012F55J1559j003L999L821l880r106n359n027J577L098N940m357L52Q752j0677
$$ 655 12214 11211 15210 19031 15151 6045 686 -4341 -2764 334 6274 1917 2269 11021 344
15997C44j7385j1807l336R601j474R582J493j925Q602O552j1744j5660R031J2715
$$ 344 -17041 -28848 -32184 -22583 -24057 -14475 -12982 -14907 -6305 247 -11497 -27157 -18126 -5411
15983e411J0819J633k54J3036K72j0006m11J960J140Q405j928O375m283o112J2399
$$ -5411 5408 7041 6787 19823 20095 10089 9678 11638 12778 21183 19255 25630 21347 15235 27634
15968B7634L387k802o644j2957j4504p802n219O238J5322M631p449R903O572q09
$$ 27634 31021 28219 21575 8618 -5886 -13688 -18907 -12669 2653 7284 -165 9738 16310 15501
15954A5501k565m233m72L962J7312J2556o969o559l349r31J0824n23q785L043
$$ 15501 12936 8703 8231 12193 29505 42061 35092 28533 25184 24253 35077 34554 25769 28812
15940B8812k949o603J3966P294K409K353o875K95L22J669R81j0884l391L17r850
$$ 28812 25863 19260 33226 40520 42929 45282 38407 38702 39024 40693 41674 30790 27399 27716 17866
15925A7866J6848M636r203j2619j033K337k526n113K047P475J3086L759k825M101
$$ 17866 34714 39350 30147 17528 16495 18832 16306 11193 13240 20715 33801 37560 34735 38836
15911C8836o290m039j3820n624J087M918J5070K378M697O752R983l38m17l142
$$ 38836 32546 28507 14687 9063 10150 15068 30138 32516 37213 43965 53948 53610 53193 50051
15897E0051P018j7408n423K86l586o022j1281R666N891m651k09q511J157j467
$$ 50051 57069 39661 34238 34524 30938 24916 13635 23301 29192 24541 24332 15821 16978 15511
15883A5511O570J0627k122k176P751j219q100O532J304J5545P581q81J2440L982
$$ 15511 22081 32708 30586 28410 36161 34942 26842 33374 34678 50223 57804 56923 69363 73345
15869G3345j3873J161J2767L89j4540o034J841K561n393j0516o739Q153j01K000
$$ 73345 59472 60633 73400 73789 59249 53215 55056 57617 52224 41708 34969 43122 43021 45021
15855D5021l111q902N302o23n284R731N099J0855Q624o468o822R62k01l808j500
$$ 45021 41910 33008 38310 37687 32403 42134 47233 58088 66712 60244 53422 54384 54183 50375 48875
15840D8875O417J2884R380j7843L041L038j5422L353K997j2787J0936L497j3207
$$ 48875 55292 68176 77556 59713 62754 65792 50370 53723 56720 43933 54869 58366 45159
15827D5159N911M895j024j10l421l540J1301M656l367O552k499L784K840k369
$$ 45159 51070 55965 54941 54831 51410 47870 59171 63827 60460 67012 64513 68297 71137 68768
15813F8768m861R616l570l385P571R020K511r077q925l475m261R125R803K477
$$ 68768 63907 73523 69953 66568 74139 83159 85670 76593 67668 64193 59932 69057 78860 81337
15799H1337K038n161p283m475q663M998R530M063n808L140J239J5189k92r132
$$ 81337 83375 78214 70931 66456 57793 62791 72321 76384 70576 73716 74955 90144 89852 80720
15785H0720j423J1869J2131m906j567l830j725K551m552j1677k39o362N435J8628
$$ 80720 79297 91166 103297 98391 96824 92994 91269 93820 89268 77591 77352 70990 76425 95053
15771I5053O814o932m934L797o604o41J0867J450j0117L851R09K3355K651j6018
$$ 95053 101867 94935 90001 93798 87194 86553 97420 98870 88753 92604 93513 116868 119519 103501
15757A03501o206q683q786N895J564k525Q247k007L656J4593L160j5162j476l261
$$ 103501 97295 88612 79826 85721 87285 84760 93007 91000 94656 109249 112409 97247 95771 92510
15743I2510L042L137J5195j0815j1842n305q423K2614J1047o097j0355R204J0142
$$ 92510 95552 98689 113884 103069 91227 85922 77499 100113 111160 105063 94708 103912 114054
15730A14054j096q954J688L901q84l207P074q185r91J6555n27Q18J0088O6j2287
$$ 114054 112958 104004 105692 109593 108709 105502 112576 104391 103400 119955 119428 120246 130334 130400 118113
15715A18113P316R697n567K540p909k487k146q508o131J34J1109R602o225o535
$$ 118113 125429 135126 129559 132099 124190 121703 119557 111049 104918 105052 116161 125763 119538 113003
15701A13003m991q546j4825J3316O182n79m839l266J4108J0064l198j6404l194
$$ 113003 108012 99466 84641 97957 104139 103560 98721 95455 109563 119627 116429 100025 96831
15688I6831Q179K824P691j160n664N248J1185J595j4392n899j0186Q810j277r848
$$ 96831 105010 107834 115525 114365 108701 113949 125134 126729 112337 106438 96252 105062 103785 93937
15674I3937R921j278J0606l354p032R520O480k886j519q258O134q57k334J3145
$$ 93937 103858 102580 113186 109832 102800 112320 118800 115914 114395 106137 112271 111414 109080 122225
15660A22225R536R503J207N032J804q049j5486L235R869k861m228k2739j2042
$$ 122225 131761 141264 142471 147503 149307 141258 125772 129007 138876 136015 131787 109048 97006
15647I7006J1359L780o873N743J3708P567m102J61Q071n141N462J014L271l568
$$ 97006 108365 112145 105272 111015 124723 132290 128188 128349 136420 131279 136741 137755 141026 137458
15633A37458r143r72M470j748Q725J8022J0224Q56L29P22M106j7938m285O716
$$ 137458 128315 127343 131813 130065 138790 156812 167036 167892 168221 168943 173049 155111 150826 157542
15619A57542m367n478k924K017N184m333l281M871R61o761m801p07O760J0710
$$ 157542 153175 147697 144773 146790 151974 147641 144360 149231 150192 143431 138630 137923 144683 155393
15605A55393J730O158P968j3629j1085K374j336K558N100R117q130K762P284p67
$$ 155393 157123 163281 171249 157620 146535 148909 147573 150131 155231 164348 156218 158980 166264 165497
15591A65497j6540k264O577o411m026O015P280N343M12K040r906k3156o822N259
$$ 165497 148957 146693 153270 146859 142833 148848 156128 161471 161883 163923 154017 130861 124039 129298
15577A29298J0703m404N024L250L424M423m153N66n735l462l165M907j263k950
$$ 129298 140001 135597 140621 143871 147295 151718 147565 148131 142396 138934 135769 140676 139413 136463
15563A36463O762J0314k056M355J3768O759j7456L392O988J2631N513k552j0466
$$ 136463 143225 153539 151483 155838 169606 176365 158909 162301 169289 181920 187433 184881 174415
15550A74415j1683k657J1015J3658J0286p286o206J5289M129j4543R842L127q090
$$ 174415 162732 160075 171090 184748 195034 187748 181542 196831 200960 186417 196259 199386 191296
15537A91296K411K46j7148p685J569N708j0804q743m928R259O736J267j1610M832
$$ 191296 193707 193953 176805 169120 170689 176397 165593 156850 151922 161181 167917 169184 157574 162406
15523A62406J0197J0222L955m686m171m961j115p742l823J3243Q970L538M898
$$ 162406 172603 182825 186780 182094 177923 172962 171847 164105 160282 173525 182495 186033 190931
15510A90931j499Q907q397j4653K996K1706L264m712m766L904j4230m694q652
$$ 190931 189432 198339 189942 175289 178285 199991 203255 198543 193777 197681 183451 178757 170105
15497A70105N018R333L726N918p266l70J2816J0291j233n177j4480j1790Q407
$$ 170105 175123 184456 188182 194100 186834 186464 199280 209571 208338 203161 188681 176891 185298
15484A85298J144L42r17L090Q356k481q297j638J7933M418q831L807M040Q507
$$ 185298 186442 186784 185867 188957 197313 194832 186535 184897 202830 207248 198417 202224 206264 214771
15470B14771N597O817O030j0466r172m46M865Q133J628l756j2028o494m797N862
$$ 214771 220368 227185 233215 222749 213577 213131 217996 226129 227757 224001 211973 205479 200682 206544
15456B06544Q150m293N139j207k120J624O21j2144m976J9160J3014O423q631L35
$$ 206544 214694 210401 215540 214333 212213 213837 214458 202314 197338 216498 229512 235935 227304 227639
15442B27639L979q407j0400n642j1480J147L847J2793J0370j0357k119N615k728
$$ 227639 231618 223211 212811 207169 195689 196836 200683 213476 223846 213489 211370 216985 214257
15429B14257l20P105K589K998j262M766L880j1017o451O207o315J310P746m199
$$ 214257 213937 221042 223631 226629 225367 230133 234013 222996 216545 222752 216437 217747 225493 221294
15415B21294O487J539o442M938k1195j0598J5712J7506m68j6823K80L344Q928
$$ 221294 227781 229320 222878 227816 206621 196023 211735 229241 228773 211950 212230 215574 224502
15402B24502K3584q081k3159n410J2434Q153J0286J484j5131j4897n34K570J7821
$$ 224502 248086 240005 216846 211436 223870 232023 242309 243793 228662 213765 213231 215801 233622
15389B33622M362j922j3472j897M591j2635n438l215O50J0533K339O584J1735
$$ 233622 237984 236062 222590 220693 225284 212649 207211 203996 204646 215179 217518 224102 235837
15376B35837n523k274R303r958J610R000m157m567J1468n299o281N235N665l628
$$ 235837 230314 228040 237343 227385 228995 237995 233838 229271 240739 235440 229159 234394 240059 236431
15362B36431L701o75K3093O304j6357r703L56M800K1028R345K29o837j3364j3418
$$ 236431 240132 239457 262550 268854 252497 242794 243150 247950 268978 278323 278552 271715 258351 244933
15348B44933J3545J4713j0835j8370j607P506R887l674o158q066j2829J339M956
$$ 244933 258478 273191 262356 243986 242379 249885 259772 256098 249940 241874 229045 230384 235340
15335B35340J3933J6312r54k1619o975J7262P452j4875j4723J3048O04l796J370
$$ 235340 249273 265585 264631 243012 236037 253299 260751 245876 231153 244201 244805 241009 242379
15322B42379m667r35J0091Q94J5412O373j5498o638k544P906J8373J933o662J020
$$ 242379 237712 236777 246868 247762 263174 269547 254049 247411 244867 252773 271146 273079 266417 267437
15308B67437o412J0905N187j964j2618r505O557m339P541j78J856R049m43k1206
$$ 267437 261025 271930 277117 275153 262535 253030 259587 255248 262789 262611 264467 273516 273073 251867
15294B51867o905M076m19M251K152J134K615k973j221J1231J3903m321n320m049
$$ 251867 244962 249038 248619 252870 255022 256156 258771 255798 254577 265808 279711 275390 270070 266021
15280B66021m40l939R502Q025j1649n735m38j285L110N391J460r28n959J409m085
$$ 266021 265581 261642 271144 279169 267520 261785 261347 260062 263172 268563 270023 269095 263136 264545 260460
15265B60460l355L744J2891O338k525n934p678J0603Q551p415m7N250M843j17
$$ 260460 257105 260849 273740 280078 277553 271619 263941 274544 283095 275680 275633 280883 285726 285609
15251B85609L026L259O209r561j8595k242K888k025q522J1114J7151K3708P341
$$ 285609 288635 291894 298103 288542 269947 267705 270593 268568 260046 271160 288311 312019 319360
15238C19360j382K130j972m812j7918j606J4620J834j2941L771N48n403m000o999
$$ 319360 317978 320108 318136 313324 295406 293800 308420 310254 297313 301084 301632 296229 292229 285230
15224B85230p03J409r37J848M390R780J2865N152j0477j500p42P212L834j599
$$ 285230 284527 285936 284999 286847 291237 301017 313882 319034 308557 307057 306315 313527 317361 315762
15210C15762j217n574o270N5R101J7976J359L980m353o38j2755q756J132L91J0945
$$ 315762 314545 308971 302701 302756 311857 329833 331192 335172 330819 330181 317426 308670 309802 310193 321138
15195C21138J4418j35j9229o181J267j850P382L413j369N59m148L356K276J0978
$$ 321138 335556 335421 316192 310011 311278 309428 316810 320223 318854 319413 315265 318621 320897 331875
15181C31875K310j600q459n623k686K63j3742Q074R757J253O416J5049l431j1683
$$ 331875 334185 332585 324126 318503 315817 316080 302338 310412 320169 321422 327838 342887 339456 327773
15167C27773p321N706q307K442K503j165R183m736p334r107Q619J3570J1683j461
$$ 327773 320452 326158 317851 320293 322796 321631 330814 326078 318744 309637 318256 331826 343509 342048
15153C42048Q352o622j3075P716p350k079P032M581M20P290%j1845p594L793J1126
$$ 342048 350400 343778 330703 338419 331069 328990 336022 340603 341023 348313 348313 336468 328874 332667 343793
15138C43793k170K288m727l839l25M581K94L200M509o57r403p34r607N000L33
$$ 343793 341623 343911 339184 335345 335020 339601 339895 343095 347604 346947 337544 336810 327203 332203 332536
15123C32536l86M627J0885J9199J485j2600r609k215j631O679K339L771p963r807
$$ 332536 332150 336777 347662 366861 368346 355746 346137 343922 342291 348970 351309 355080 347117 337310
15109C37310J0099J2138j437j393K766K680J0524N70M551l830j6470n990R76p751
$$ 337310 347409 359547 358110 356717 359483 362163 372687 373257 377808 373978 357508 351518 352494 344743
15095C44743P252N137Q689q115k884J8558N800O440k203q35m819m725n771r341
$$ 344743 351995 357132 365821 357706 354822 373380 379180 385620 383417 382582 377763 373038 367267 357926
15081C57926J4393p878j1636r327O011K2819O596o127j9816m662m070Q120Q445
$$ 357926 372319 364441 352805 343478 349489 372308 378904 372777 352961 348299 344229 352349 360794
15068C60794j1023l740J3029J2528j382o645O694L80j0186J1349J2753j877o298
$$ 360794 349771 346031 359060 371588 370206 363561 370255 370635 360449 371798 384551 382674 376376
15055C76376j5474l711J4418J4565n793r580J0413M015J1222J1028p266m104k998
$$ 376376 360902 357191 371609 386174 380381 370801 381214 385229 396451 407479 400213 396109 393111
15042C93111q259Q217l299o857p36P953K017J923J2820j0632K533k94r453j345
$$ 393111 384852 393069 389770 382913 382177 390130 392147 394070 406890 396258 398791 398497 389044 387699
15028C87699L788j5109r385J4467L958l684P78k800k520P731J2507O936J011K841
$$ 387699 391487 376378 366993 381460 385418 381734 382512 379712 377192 384923 397430 404366 405377 408218
15014D08218l450L556M421N620j3101j6356J1037J5522P952r914L657J5368R33
$$ 408218 404768 408324 412745 418365 405264 388908 399945 415467 423419 413505 417162 432530 433463
15001D33463j2876j0316O939J1722O538p975r874j0487q427k244J7931N728M277
$$ 433463 420587 410271 417210 428932 435470 427495 417621 407134 398707 396463 414394 420122 424399
14988D24399j3227p274J636N36O957M24l21l121J72j616Q050L064j98Q048N99
$$ 424399 411172 403898 405534 406070 413027 413451 413130 410009 410181 408565 416615 419679 419481 427529 428128
14973D28128O70k920j5860L94Q813N762K484n418q795N26J3876O505q471o1K438
$$ 428128 428798 425878 410018 410412 419225 424987 427471 422053 413258 413784 427660 434165 425694 425633 428071
14958D28071o142p44m035J494K149k027o00J4224O100m728j4980M030O394n601
$$ 428071 421929 421185 417150 418644 420793 418766 418166 432390 438490 433762 418782 422812 429206 423605
14944D23605L176J5164K047O119r737j8837j0315J0915O088j853O456j554k477
$$ 423605 426781 441945 443992 450111 440374 421537 411222 422137 428225 426372 432828 431274 428797
14931D28797o398q521M1O819J2557j487l16l549O599M813j1717o6O22k873O735
$$ 428797 422399 413878 413919 420738 433295 431808 431492 427943 434542 439355 427638 427572 428194 425321 432056
14916D32056J3543M145j21l568j9407j440J0500K6614k222l554l1n899n627j0613
$$ 432056 445599 449744 449623 446055 426648 425208 435708 462322 460100 456546 456515 450616 444989 434376
14902D34376P049P377M755J0188N143p481j3492q319j3910N295O662M029P180
$$ 434376 441425 448802 453557 463745 468888 461407 447915 439596 425686 430981 437643 441672 448852
14889D48852J0852n59j309j3210o371Q920q50k803R902m578m487r7p472Q040J2293
$$ 448852 459704 459145 457836 444626 438255 447175 446325 443522 453424 448846 444359 444262 436790 444830 457123
14874D57123Q211O077k377j4382j2425j779J4820J2071M797J3892L40q261L536
$$ 457123 465334 471411 469034 454652 442227 440448 455268 467339 472136 486028 486368 478107 481643
14861D81643q184L121M569L443K542r315P11N602j5931O064J6532j1298k638o286
$$ 481643 473459 476580 481149 484592 487134 477819 478530 484132 468201 474265 490797 479499 476861 470575
14847D70575j1796R401M161J1976O608O696K140k1572o653J504P65O606K617L996
$$ 470575 458779 468180 472341 484317 490925 497621 499761 478189 471536 473040 473805 480411 483028 487024
14833D87024L442p848J1706R083K273p423j508j1924j3746J615Q594J5255j112
$$ 487024 490466 482618 494324 503407 505680 498257 496749 484825 471079 472694 481288 496543 495431
14820D95431q818P23L773L102L750M976j007j1779l024o205o44j494o619L090
$$ 495431 486613 487336 491109 494211 497961 502937 501930 490151 487127 480922 480278 478784 472165 475255
14806D75255p520J1201P916m86o917Q417R449J4850O800n697j0563m852J862L642
$$ 475255 467735 478936 486852 486366 479449 487866 497315 512165 518965 513268 502705 497853 499715 503357
14792E03357j139k515j9288J685O948K05K122l952O702N293O009m171J8663N480
$$ 503357 502218 499703 480415 482100 489048 489253 491375 487423 494125 499418 505427 501256 519919 525399
14778E25399M230k122R657j578r831q88m069m084K597p427p789K653N258K674
$$ 525399 529629 527507 537164 535586 525755 524867 520798 516714 519311 511884 504095 506748 512006 514680
14764E14680Q581L719q795k85j2462O435J4347j3071q707J7315k279L596J091
$$ 514680 523261 526980 518185 517900 505438 511873 526220 513149 504442 521757 519478 523074 524165
14751E24165k3237j2890Q92J4412L610K863m507o357O993R814J4790l491L849
$$ 524165 500928 488038 488930 503342 506952 509815 505308 498951 505944 515758 530548 527057 530906
14738E30906q205j1294Q261L46K539J4766Q756j19K414k856m39o33K166m598n714
$$ 530906 522701 511407 519668 520014 522553 537319 546075 545956 548370 545514 545075 544442 546608 542010 536296
14723E36296o487K0250L627o994Q112M924Q30K066J3717j0402j2959J950K218
$$ 536296 529809 550059 553686 546692 554804 559728 560558 562624 576341 565939 552980 554930 557148
14710E57148L030j1032q593k739j320J0260q527j0265p628J7231K2868K773j3948
$$ 557148 560178 549146 540553 537814 536494 546754 538227 527962 520334 537565 560433 563206 549258
14697E49258p988L178Q776J7937j827r09j0109q576q28Q363k87j1808O63P907
$$ 549258 541270 544448 553224 571161 569334 568425 558316 549740 548912 557275 556988 545180 545843 553750
14683E53750K149O836l097J294k313n932N053n563R953J3983N876Q494J520l524
$$ 553750 555899 562735 559638 560932 558619 552687 557740 552177 562130 576113 581989 590483 592003 588479
14669E88479m472j1707K783K832l045j223j1168p944K265L077O911J1942R313
$$ 588479 584007 572300 575083 577915 574870 573647 562479 554535 556800 559877 566788 578730 588043
14656E88043P099M626p580Q306k992k673j770N232n335j9247J2598P679n646q914
$$ 588043 595142 599768 592188 600494 597502 594829 593059 598291 592956 573709 586307 593986 588340 579426
14642E79426k606P72n825N940P867J1051n655p85O43L219k756M956J0335l72r508
$$ 579426 576820 577592 571767 577707 585574 596625 590970 590185 590828 594047 591291 596247 606582 606210 596702
14627E96702O28J2733J3668O841l0494q449Q534J280j0434J672j879J6046M576
$$ 596702 597330 610063 623731 630572 600078 591629 600163 601443 591009 592681 590802 606848 611424
14614F11424k495j777m589n57L158j05K268K169j3441M739N740R884M984N45j080
$$ 611424 608929 607152 602563 602006 605164 605059 607327 609496 596055 600794 606534 616418 621402 621947 620867
14599F20867o223p753K544J1046O01R437j980l165j21P536k527j8180j5323M718
$$ 620867 614644 606891 609435 620481 621082 630519 628539 625374 625253 632789 630262 612082 596759 601477
14585F01477J835J9771j1338N974J6053J229L569O745q519j3170O135m841n937
$$ 601477 603312 623083 611745 617719 633772 635001 638570 645315 636796 623626 629761 624920 618983
14572F18983J7472N925j2749j0430J970j975O324O54p550L690R167L090J2920
$$ 618983 636455 642380 629631 619201 621171 619196 625520 626174 618624 622314 631481 634571 647491
14559F47491O216n532J280Q011q518l089o611j052m273j015O500r33R727J2966
$$ 647491 653707 648175 649455 657466 648948 645859 639248 638196 633923 632908 639408 638475 648202 661168
14545F61168p281j5881n19N871Q214p59j3345M07O154n140K472J0696j524M904
$$ 661168 653887 638006 637487 643358 651572 650813 637468 637875 644029 638889 641361 652057 650533 655437
14531F55437L954Q28n274l636n491j1589O079J3974L503N18N736j7951o546J3251
$$ 655437 659391 660219 654945 651309 645818 634229 640308 654282 657785 658303 664039 646088 639542 652793
14517F52793J5384P331k181j0563n862O165o165p913p77o183Q853J0175j184N877
$$ 652793 668177 675508 673327 662764 656902 663067 656902 648989 648212 642029 650882 661057 659873 665750
14503F65750j138o752J168l615N600m15o647l516J5240Q496o766J500o659l975
$$ 665750 664612 657860 659028 655413 661013 660598 653951 650435 665675 674171 667405 668905 662246 658271
14489F58271l992N237N707L488o806M011L536n704N416q513M162P786K433r130
$$ 658271 654279 659516 665223 668711 661905 665916 669452 663748 669164 660651 664813 672599 675032 665902
14475F65902l572N769L447Q060K436L085j225n377J5196J0455M498n972q263k016
$$ 665902 662330 668099 671546 679606 682042 685127 683902 678525 693721 704176 708674 702702 694439 692423
14461F92423p987L418R694J0543N420J0762l749O885J8989q358q449j3423o703
$$ 692423 684436 687854 697548 708091 713511 724273 720524 727409 746398 738040 729591 716168 709465
14448G09465J2517j0867j5532n676J425M539J5960l46k123j217K573Q363m40m878
$$ 709465 721982 711115 695583 689907 691332 695871 711831 711485 709362 708145 710718 719081 718641 713763
14434G13763N664L12q513j3205o448R695L047J0646J4779q21j279l109O256L788
$$ 713763 719427 719739 711226 698021 691573 701268 704315 714961 729740 728919 727640 724531 730787 734575
14420G34575k1441m07L855N174K801K059o137j078J463P202P268O801J2413k871
$$ 734575 713134 712727 716582 721756 724557 726616 720479 719401 720864 728066 735334 742135 754548 751677
14406G51677j3373M031k627j3226M00J2154J4420R154n630j139n676r282R532
$$ 751677 738304 742335 739708 726482 726882 739036 753456 762610 756980 755841 750165 740883 750415
14393G50415j1461o508O900K306r687P442J4402j3424j0612M346L738k627l826
$$ 750415 738954 732446 739346 741652 731965 739407 753809 740385 729773 734119 737857 735230 731404
14380G31404N343K2167J1065r160K350O124P016j74n642r564n427Q492O641o569
$$ 731404 736747 758914 769979 760819 763169 769293 776309 776135 770493 760929 755502 763994 770635 764066
14366G64066n586K614Q008P46k756l849K875K480q130j2731J7627J4590k788M662
$$ 764066 758480 761094 769102 769848 767092 763243 766118 768598 760468 747737 765364 779954 777166 781828
14352G81828m691j2747J0907J1116j1323j3740P02J2997J1791K11j4566l553O411
$$ 781828 777137 764390 775297 786413 775090 761350 762052 775049 786840 787051 772485 768932 775343
14339G75343k460m069J672L748M789J594O443N466J784n553p542J1368J5911q465
$$ 775343 772883 768814 770486 774234 779023 780617 787060 792526 794310 788757 781215 792583 808494 800029
14325H00029R79K927j239l646p086l429M64Q524J6053R027j6284j3957m564P410
$$ 800029 801008 803935 802696 799050 791964 788535 788999 797523 813576 822603 806319 792362 787798 795208
14311G95208O959N916L298j4982R223J1868J338q684R386N347J4688R733r313
$$ 795208 802167 808083 811381 796399 805622 817490 818828 810144 819530 824877 839565 849298 839985
14298H39985q792j3572j245j345J214J1877L2j421n959p151q259j1897Q011J6107
$$ 839985 831193 817621 816376 815031 816245 828122 828154 826733 820774 813623 805364 793467 801478 817585
14284H17585J0663J698J0642r07j1623m378Q017O858K196O037L647j1711M98m465
$$ 817585 828248 829946 840588 839681 828058 823680 831697 838555 840751 846788 850435 838724 839222 834757
14270H34757o750l489M659J0821Q367j5291j4117N369Q38r632K45P026L748m283
$$ 834757 828007 824518 829177 839998 848365 833074 818957 824326 825164 815532 815777 822803 826551 822268
14256H22268Q75J5434k495M819J0975l62M154o395l268j411q779k135N34k612
$$ 822268 823143 838577 836082 840901 851876 851514 855668 849273 846005 844594 835815 833680 834214 831602
14242H31602m799M073J4278R766P957j643N065P23k471k043n429j7664n014J3830
$$ 831602 826803 830876 845154 854920 862877 861234 866299 867022 864551 862508 857079 839415 834401 848231
14228H48231J0419l604N12M580P401P816P76M771L667P213l720n17P591n518j2051
$$ 848231 858650 855046 855558 860138 867539 875355 876131 880902 884569 891782 888062 887545 895136 889618 877567
14213H77567q678M99m366Q722O329k226O946J913k349k300n000N100N785J7603
$$ 877567 868889 869388 865022 873744 880073 877847 884793 886706 884357 882057 877057 882157 887942 905545
14199I05545J2691j596j0557j1437q776J3596m872O452J0044k582r85o069R510
$$ 905545 918236 916640 906083 894646 885870 899466 894594 901046 911090 908508 907523 901454 910964
14186I10964N832j775m633j1075m638l396Q038J0116M594j1551r863N345J2063
$$ 910964 916796 915021 910388 899313 894675 891279 899317 909433 914027 902476 892613 897958 910021
14173I10021J4450j3188j9685j231L987J6902Q94K28N413J1704j444J881j1099
$$ 910021 924471 911283 891598 890367 894354 911256 912150 912378 917791 929495 928051 929932 918833
14160I18833q815q898r67J2092J5462L064M605p799N297L308K655j836k085L462
$$ 918833 910018 901120 900153 912245 927707 930771 935376 927577 932874 936182 938837 937001 934916 938378
14146I38378r827J297r162o622J7540j2882m62J6369R140j0501m210L284R940
$$ 938378 928551 929848 920686 914064 931604 918722 918260 934629 943769 933268 929058 932342 942282
14133I42282L706q607n406K0394J6520k1892o286J9311r08k279L765k830N124
$$ 942282 945988 937381 931975 952369 968889 946997 940711 960022 959114 956835 960600 957770 962894
14120I62894n344j6484m730N531K0368J974j5164q031R922J020K394J3894P096
$$ 962894 957550 941066 936336 941867 962235 964209 949045 941014 950936 951956 954350 968244 975340
14107I75340j4707p175M83N240K318M035P955J2888j23K426R626K960J0P565R851
$$ 975340 960633 953458 953941 959181 961499 965534 973489 986377 986254 988680 998306 1001266 1001276 1008841 1018692
14092A018692j8194j8297L950k324J2616J016j6390l604Q371K84M225P968M477
$$ 1018692 1000498 982201 986151 983827 996443 997459 981069 977465 985836 986120 990345 998313 1002790
14079A002790j0184n714j2311o954J1423R483O199k754P723m270m604J59J3055
$$ 1002790 992606 986892 974581 967627 979050 988533 994732 991978 999701 995431 990827 990986 1004041
14066A004041j669K68J3442M467n564L567j529n340L731L151M378N112n840J489
$$ 1004041 1002372 1002640 1016082 1020549 1014985 1018552 1017023 1011683 1015414 1018565 1022943 1028055 1022215 1023704
14052A023704L711M600k188Q859O403j9113J1092K0812k932j0122j966j1680l301
$$ 1023704 1027415 1032015 1029827 1038686 1045089 1025976 1037068 1057880 1054948 1044826 1042860 1031180 1027879
14039A027879J2451j098L742N511J2333o168r757j69p433p562j031N918j850j6300
$$ 1027879 1040330 1039232 1042974 1048485 1060818 1054650 1044893 1044724 1037291 1029729 1028698 1034616 1032766 1016466
14025A016466N17J5803m606p915p11M445J0939Q756M800J0244Q068L117k110O476
$$ 1016466 1016983 1032786 1028180 1020265 1019554 1023999 1034938 1043694 1048494 1058738 1066806 1069923 1067813 1074289
14011A074289j0380o176M159k624L312L806J2175R037m062l730p017K047M17J2775
$$ 1074289 1063909 1057733 1061892 1059268 1062580 1066386 1078561 1087598 1083536 1079806 1072789 1074836 1075253 1088028
13997A088028J5250j0709n758j0077l890R758k127n278N926j634Q36m21Q943J2015
$$ 1088028 1103278 1092569 1086811 1076734 1072844 1082602 1080475 1075197 1081123 1079489 1080325 1079904 1088847 1100862
13983A100862k602l042q26j2453o540J4948m961j22L424L22K632Q970l983q059
$$ 1100862 1098260 1095218 1094392 1081939 1075399 1090347 1085386 1085264 1088688 1089010 1091642 1100612 1096629 1088570
13969A088570q292J5152N401N443N054n50J042N978O832k410L031O564n672J633
$$ 1088570 1080278 1095430 1100831 1106274 1111328 1110778 1111820 1117798 1124630 1122220 1125251 1131815 1126143 1127776
13955A127776q056m431r50J9978r79J719K313o958L385j198j4307n047M825J527
$$ 1127776 1119720 1115289 1114339 1134317 1133338 1135057 1137370 1130412 1133797 1132599 1118292 1113245 1118070 1119597
13941A119597Q004N412M657L014M760n509k647l977k089j088k006N391Q552j691
$$ 1119597 1127601 1133013 1137670 1140684 1145444 1139935 1137288 1133311 1131222 1130134 1128128 1133519 1142071 1140380
13927A140380r932K478l782P345J5103R499k03j1176n710J3083J6391l948j2019
$$ 1140380 1130448 1132926 1129144 1136489 1151592 1161091 1160888 1149712 1144002 1157085 1173476 1169528 1157509
13914A157509N214M624l39M151N38K0282L187p44j1047j412K226j763O34j165
$$ 1157509 1162723 1167347 1167008 1171159 1171697 1191979 1195166 1194422 1183375 1181963 1184189 1182426 1183060 1181895
13900A181895k108j689j1124L429J1387O212p92N389L412K143m382k132J730J2082
$$ 1181895 1179787 1178098 1166974 1170403 1181790 1188002 1187210 1192599 1196011 1198154 1193772 1191640 1193370 1205452
13886A205452M000n154N77j4801j4420Q632M43P296J3155M374J4940m165N913
$$ 1205452 1209452 1204298 1204875 1190074 1175654 1184286 1184729 1192025 1205180 1209554 1224494 1220329 1226242
13873A226242L077j4502O088N163Q688j5761m798J1630J4988N385p3O178j1284
$$ 1226242 1229319 1214817 1220905 1226068 1234756 1218995 1214197 1225827 1240815 1246200 1246127 1252305 1241021
13860A241021r187K513r40m124K459k478L533J31o150R251K7956M216j1226J004
$$ 1241021 1231834 1234347 1233407 1229283 1231742 1229264 1232797 1232928 1226778 1236029 1263985 1268201 1256975 1257979
13846A257979J1215k288j0054R497k004K818k982n842k376K687J0958n163p233
$$ 1257979 1269194 1266906 1256852 1266349 1264345 1267163 1264181 1258339 1255963 1258650 1269608 1264445 1257212
13833A257212k469J5977K1041K416j2849k840q05m375r982P272J5028K135J4501
$$ 1257212 1254743 1270720 1291761 1294177 1281328 1278488 1277683 1273308 1263326 1270598 1285626 1287761 1302262
13820A302262R662j0991j0413o325l491N428O997Q107k853j0370O231J1979N380
$$ 1302262 1311924 1300933 1290520 1284195 1280704 1286132 1293129 1301236 1298383 1288013 1294244 1306223 1311603
13807A311603k104n324K736L656j0752m312m911n09K3729Q385k617r198L661N571
$$ 1311603 1309499 1304175 1306911 1310567 1299815 1295503 1290592 1290083 1313812 1322197 1319580 1310382 1314043 1319614
13793A319614m608J5357J3125p460j7704p173O258J5275L115j114J19K399J2976
$$ 1319614 1315006 1330363 1343488 1336028 1318324 1311151 1317409 1332684 1335799 1334685 1334804 1337203 1350179
13780A350179l141k917J433n827k977q271q963l138K5007J1604J0301K609n230
$$ 1350179 1347038 1344121 1345554 1339727 1336750 1328479 1319516 1316378 1341385 1352989 1363290 1365899 1360669
13767A360669L43R866Q056j579o808J4510L793q200q832P447R096J011j1233l628
$$ 1360669 1361012 1370878 1378934 1377355 1370547 1385057 1388850 1380650 1371818 1379265 1388361 1389372 1378139 1374511
13753A374511J0696L256o576k528n683R826o360J690N918R001J0080J2894K1085
$$ 1374511 1385207 1388463 1381887 1379359 1373676 1383502 1377142 1378832 1384750 1393751 1403831 1416725 1437810
13740A437810M300j535k7609k648Q509M180j0579j0388j910P017R878K255Q78
$$ 1437810 1442110 1440575 1412966 1410318 1418827 1423007 1412428 1402040 1400130 1407147 1417025 1419280 1420158
13727A420158r2K874k134M01q581J0238J6282J4351j1384j1051o771K589J5556
$$ 1420158 1420066 1422940 1420806 1421207 1412626 1422864 1439146 1453497 1442113 1431062 1424291 1426880 1442436
13714A442436J6727K601r027r279Q251J0987m886j0015n990J213J155K0421L921
$$ 1442436 1459163 1461764 1452737 1443458 1451709 1462696 1457810 1447795 1441805 1443018 1444173 1464594 1468515
13701A468515j861k985k739q679Q49J2141J2763q573L944P466r80L047m948N354
$$ 1468515 1466654 1463669 1460930 1452251 1453100 1465241 1478004 1469431 1473375 1480841 1479861 1482908 1477960 1483314
13687A483314J0328r228n131M004O913J82j0372j1867N392L512q880J0800J3808
$$ 1483314 1493642 1484414 1479283 1483287 1490200 1490382 1480010 1468143 1473535 1477047 1468167 1478967 1492775
13674A492775j673J9622J8490O430K643o488q511R588q95j583m54M59R847n699
$$ 1492775 1491102 1510724 1529214 1535644 1538287 1531799 1523288 1532876 1531981 1530398 1529944 1530403 1540250 1534551
13660A534551n321j159l610q203K217J0093l517M503O170n438j066k700J1983
$$ 1534551 1529230 1528071 1524461 1516258 1518475 1528568 1525051 1529554 1535724 1530286 1529220 1526520 1538503
13647A538503J4768n44P023l706m492J3638M791J093q70J2698R699q173n417O311
$$ 1538503 1553271 1552727 1559750 1556044 1551552 1565190 1569981 1571074 1570204 1582902 1592601 1584428 1579011 1585322
13633A585322N485l352r859J2061N099n535p852N664P508n819n65J2915P868L1
$$ 1585322 1590807 1587455 1577596 1589657 1594756 1589221 1581369 1587033 1594541 1588722 1588157 1601072 1608940 1608971
13619A608971K553J35K173K955r006m413l86P086Q226J0180j2937P804P989M348
$$ 1608971 1611524 1611659 1613832 1616787 1607781 1603368 1602982 1610068 1618294 1628474 1615537 1623341 1631330 1635678
13605A635678L928K738p68o445J2312J2122M073k852q838j019J471R066M414P430
$$ 1635678 1639606 1642344 1641576 1635131 1647443 1659565 1663638 1660786 1651948 1650929 1652400 1661466 1665880 1673310
$$ [...]
##END NTUPLES=NMR SPECTRUM
##END=
