##TITLE=Analysis number 312967
Compound Code btb 00300
Book Reference 378/98/3
Project Code adrs
Chemist Name benw
##JCAMPDX= 6.0         $$ Bruker NMR JCAMP-DX V2.0
##DATA TYPE= NMR SPECTRUM
##DATA CLASS= NTUPLES
##ORIGIN= Bruker BioSpin GmbH
##OWNER= NMR
$$ XWIN-NMR		Version 3.5
$$ Mon Aug 22 11:46:58 2005 GMT Daylight Time (UT+1h)  MAYBRIDGE\NMR@NMR_250MHZ
##.OBSERVE FREQUENCY= 250.131544655141
##.OBSERVE NUCLEUS= ^1H
##.ACQUISITION MODE= SIMULTANEOUS (DQD)
##.ACQUISITION SCHEME= undefined
##.AVERAGES= 16
##.DIGITISER RES= 18
##SPECTROMETER/DATA SYSTEM= dpx250
##.PULSE SEQUENCE= zg30
##.SOLVENT NAME= CDCl3
##.SHIFT REFERENCE= (INTERNAL, CDCl3, 0, 16.522)
##AUDIT TRAIL= $$ (NUMBER, WHEN, WHO, WHERE, WHAT)
$$ ##TITLE= Audit trail, XWIN-NMR		Version 3.5
$$ ##JCAMPDX= 5.01
$$ ##ORIGIN= Bruker BioSpin GmbH
$$ ##OWNER= NMR
$$ C:\u/data/dgb/nmr/ADRS/8210/pdata/1/auditp.txt
$$ ##AUDIT TRAIL=  $$ (NUMBER, WHEN, WHO, WHERE, WHAT)
(   1,<2005-08-22 11:46:15.16 +100>,<MAYBRIDGE\NMR>,<NMR_250MHZ>,
      <created by zg, POWCHK disabled, PULCHK disabled
       configuration hash MD5:
       62 19 C7 07 E1 42 D1 B7 37 6C 3D D0 77 39 F9 E6
       data hash MD5: 64K
       1B 27 E4 33 CD 69 C5 79 26 A0 22 59 95 0F AD E2>)
(   2,<2005-08-22 11:46:30.88 +100>,<MAYBRIDGE\NMR>,<NMR_250MHZ>,
      <Start of raw data processing
       ef LB = 0.3 FT_mod = 6 PKNL = 1 SI = 32K 
       data hash MD5: 32K
       9F FD D4 B6 A9 71 0E 9B A4 1D 15 F5 6B 1B 41 53>)
(   3,<2005-08-22 11:46:36.80 +100>,<MAYBRIDGE\NMR>,<NMR_250MHZ>,
      <apk 
       data hash MD5: 32K
       3A B9 69 16 49 A0 AD 06 F2 B1 03 84 DC F2 02 5C>)
(   4,<2005-08-22 11:46:38.66 +100>,<MAYBRIDGE\NMR>,<NMR_250MHZ>,
      <abs ABSG = 5 
       data hash MD5: 32K
       A8 8A E7 73 4C 49 1C 87 DE 8E 01 08 70 DF 99 81>)
$$ ##END=
$$ 
$$ hash MD5
$$ 07 A4 A0 EC CE 45 AA F0 D5 01 18 FB 8D 95 82 7A
##$RELAX= 
##$RELAX= 
##$RELAX= 
##$RELAX= 
##$RELAX= 
##$RELAX= 
##$RELAX= 
$$ Bruker specific parameters
$$ --------------------------
##$DU= <C:\u>
##$EXPNO= 8210
##$NAME= <ADRS>
##$PROCNO= 1
##$TYPE= <nmr>
##$USER= <dgb>
##$AMP= (0..31)
100 100 100 100 100 100 100 100 100 100 100 100 100 100 100 100 100 100 
100 100 100 100 100 100 100 100 100 100 100 100 100 100 
##$AQSEQ= 0
##$AQ_mod= 3
##$AUNM= <au_zg>
##$AUTOPOS= <5 >
##$BF1= 250.13
##$BF2= 250.13
##$BF3= 250.13
##$BF4= 250.13
##$BF5= 500.13
##$BF6= 500.13
##$BF7= 500.13
##$BF8= 500.13
##$BYTORDA= 1
##$CFDGTYP= 0
##$CFRGTYP= 5
##$CHEMSTR= <none>
##$CNST= (0..31)
1 1 145 1 1 1 1 1 1 1 1 1 1 1 1 1 1 1 1 1 1 1 1 1 1 1 1 1 1 1 1 1 
##$CPDPRG= <>
##$CPDPRG1= <>
##$CPDPRG2= <>
##$CPDPRG3= <>
##$CPDPRG4= <mlev>
##$CPDPRG5= <mlev>
##$CPDPRG6= <mlev>
##$CPDPRG7= <mlev>
##$CPDPRG8= <mlev>
##$CPDPRGB= <>
##$CPDPRGT= <>
##$D= (0..31)
0 1 0 0 0 0 0 0 0 0.06 0 0 0 0 0 0 0.0002 0 0 0 0 0 0 0 0 0 0 0 0 0 0 
0 
##$DATE= 1124707573
##$DBL= (0..7)
120 120 120 120 120 120 120 120 
##$DBP= (0..7)
150 150 150 150 150 150 150 150 
##$DBP07= 0
##$DBPNAM0= <>
##$DBPNAM1= <>
$$ [...]
##$SUBNAM7= <"">
##$SUBNAM8= <"">
##$SUBNAM9= <"">
##$SW= 20.6930455092707
##$SWIBOX= (0..15)
0 0 3 0 0 0 0 0 0 0 0 0 0 0 0 0 
##$SW_h= 5175.983436853
##$TD= 65536
##$TD0= 1
##$TE= 295.16
##$TE2= 300
##$TE3= 300
##$TEG= 300
##$TL= (0..7)
0 120 120 120 120 120 120 120 
##$TP= (0..7)
150 150 150 150 150 150 150 150 
##$TP07= 0
##$TPNAME0= <>
##$TPNAME1= <>
##$TPNAME2= <>
##$TPNAME3= <>
##$TPNAME4= <>
##$TPNAME5= <>
##$TPNAME6= <>
##$TPNAME7= <>
##$TPOAL= (0..7)
0.5 0.5 0.5 0.5 0.5 0.5 0.5 0.5 
##$TPOFFS= (0..7)
0 0 0 0 0 0 0 0 
##$TUNHIN= 0
##$TUNHOUT= 0
##$TUNXOUT= 0
##$USERA1= <user>
##$USERA2= <user>
##$USERA3= <user>
##$USERA4= <user>
##$USERA5= <user>
##$V9= 5
##$VALIST= <valist>
##$VCLIST= <CCCCCCCCCCCCCCC>
##$VD= 0
##$VDLIST= <DDDDDDDDDDDDDDD>
##$VPLIST= <PPPPPPPPPPPPPPP>
##$VTLIST= <TTTTTTTTTTTTTTT>
##$WBST= 1024
##$WBSW= 4
##$XGAIN= (0..3)
0 0 0 0 
##$XL= 0
##$YL= 0
##$YMAX_a= 270883
##$YMIN_a= -206353
##$ZGOPTNS= <>
##$ZL1= 120
##$ZL2= 120
##$ZL3= 120
##$ZL4= 120
##$ABSF1= 16.522
##$ABSF2= -4.171173
##$ABSG= 5
##$ABSL= 3
##$ALPHA= 0
##$AQORDER= 0
##$ASSFAC= 0
##$ASSFACI= 0
##$ASSFACX= 0
##$ASSWID= 0
##$AUNMP= <proc_1d>
##$AZFE= 0.1
##$AZFW= 0.1
##$BCFW= 0
##$BC_mod= 0
##$BYTORDP= 0
##$COROFFS= 0
##$CY= 12.5
##$DATMOD= 1
##$DC= 0
##$DFILT= <>
##$DTYPP= 0
##$F1P= 14.0000005364418
##$F2P= -0.99999901652339
##$FCOR= 0.5
##$FTSIZE= 32768
##$FT_mod= 6
##$GAMMA= 0
##$GB= 0
##$INTBC= 1
##$INTSCL= 1
##$ISEN= 128
##$LB= 0.3
##$LEV0= 0
##$LPBIN= 0
##$MAXI= 10000
##$MC2= 0
##$MEAN= 0
##$ME_mod= 0
##$MI= 0
##$NCOEF= 0
##$NC_proc= -5
##$NLEV= 6
##$NOISF1= 0
##$NOISF2= 0
##$NSP= 0
##$NTH_PI= 0
##$NZP= 0
##$OFFSET= 16.522
##$PC= 1
##$PHC0= -77.14313
##$PHC1= 13.39915
##$PH_mod= 1
##$PKNL= yes
##$PPARMOD= 0
##$PSCAL= 4
##$PSIGN= 0
##$REVERSE= no
##$SF= 250.13
##$SI= 32768
##$SIGF1= 0
##$SIGF2= 0
##$SINO= 400
##$SIOLD= 32768
##$SREGLST= <1H.CDCl3>
##$SSB= 0
##$STSI= 32768
##$STSR= 0
##$SW_p= 5175.98343685301
##$SYMM= 0
##$S_DEV= 0
##$TDeff= 65536
##$TDoff= 0
##$TI= <Analysis number 999999
Compound Code 99
Book Reference 9
Project Code 9>
##$TILT= no
##$TM1= 0
##$TM2= 0
##$TOPLEV= 0
##$USERP1= <user>
##$USERP2= <user>
##$USERP3= <user>
##$USERP4= <user>
##$USERP5= <user>
##$WDW= 1
##$XDIM= 32768
##$YMAX_p= 296170188
##$YMIN_p= -934553
$$ End of Bruker specific parameters
$$ ---------------------------------
##NTUPLES= NMR SPECTRUM
##VAR_NAME=  FREQUENCY,     SPECTRUM/REAL,   SPECTRUM/IMAG
##SYMBOL=    X,             R,               I
##VAR_TYPE=  INDEPENDENT,   DEPENDENT,       DEPENDENT
##VAR_FORM=  AFFN,          ASDF,            ASDF
##VAR_DIM=   32768,         32768,           32768
##UNITS=     HZ,            ARBITRARY UNITS, ARBITRARY UNITS
##FACTOR=    0.157963299565203, 1,           1
##FIRST=     4132.6476996994, 0,             0
##LAST=      -1043.33573715361, 0,           0
##MIN=       -1043.33573715361, -934553,     0
##MAX=       4132.6476996994, 296170188,     0
$$ Real data points
##PAGE= N=1
##DATA TABLE= (X++(R..R)), XYDATA
$$ [...]
$$ plain form
23052 496020 243389 -84999 -118042 -61547 162218 212118 158690 -29264 -49712 189434
23042 189434 386349 138157 -11242 6214 -29745 -143668 -291835 -314785 -211734 -143911
23032 -143911 -45514 176582 99726 -186013 -208131 -11231 177806 123828 41956 -58924
23022 -58924 6983 46292 44063 -58143 -222273 -142668 -96317 240405 297365 96649 -98700
23011 -98700 -33251 -18867 13875 180083 195739 77562 -20613 121516 -18187 -87640 14571
23000 14571 -53623 37035 64571 -87757 -19454 -166745 -309360 -302376 -229712 -129587 -248349
22989 -248349 -297273 -57851 58815 119291 -14155 80810 181355 78028 -20402 -140883
22979 -140883 -178889 -2369 -88555 -211629 -221802 -328955 -473421 -540722 -383682 -291870
$$ packed form
23052D96020k52631l28388l3043N6495K23765M9900n3428j87954k0448K39146
23042A89434J96915k48192j49399J7456l5959j13923j48167k2950J03051O7823
23032a43911R8397K22096p6856k85739k2118J96900J89037n3978q1872j00880
23022e8924O5907L9309k229j02206j64130P9605M6351L36722N6960k00716j95349
23011i8700O5449J4384L2742J66208J5656j18177r8175J42129j39703o9453J02211
23000A4571o8194R0658K7536j52328O8303j47291j42615O984P2664J00125j18762
22989b48349m8924K39422J16666O0476j33446R4965J00545j03327r8430j20481
22979a40883l8006J76520q6186j23074j0173j07153j44466o7301J57040R1812
$$ plain form
22969 -291870 -98193 -156947 -151507 -40989 -41529 -113558 -406994 -423372 -45811 148230 132559
22958 132559 104534 -9057 153456 143313 194704 15634 -69228 -123005 -96646 -79052 -16311
22947 -16311 -30833 -122575 -122958 -220919 -38700 -70719 -141896 -92421 -21983 -75783 -356837 -621772
22935 -621772 -571111 -293576 -204757 -241741 -324902 -144026 -125946 -375887 -408118 -339443 -331579
22924 -331579 -282578 -286977 -294411 -80039 -72151 -127894 -214336 -228447 -233810 -307244 -221974 -136705
22912 -136705 -115304 -84083 -13072 -130070 -139201 -254307 -78957 265454 357018 93086 -33923
22901 -33923 -208474 -81281 37965 -62799 -92642 -61098 -250845 -168525 155752 328364
22891 328364 307729 273688 437670 540063 601361 571918 228487 149034 195553 -58084 -85369
$$ packed form
22969b91870J93677n8754N440J10518n40p2029k93436j6378L77561J94041j5671
22958A32559k8025j13591J62513j0143N1391j79070q4862n3777K6359J7594O2741
22947a6311j4522r1742l83r7961J82219l2019p1177M9475P0438n3800k81054k64935
22935f21772N0661K77535Q8819l6984q3161J80876J8080k49941l2231O8675P864
22924c31579M9001m399p434K14372P888n5743q6442j4111n363p3434Q5270Q5269
22912a36705K1401L1221P1011j16998r131j15106J75350L44411R1564k63932j27009
22901c3923j74551J27193J19246j00764k9843L1544j89747Q2320L24277J72612
22891C28364k0635l4041J63982J02393O1298k9443l43431p9453M6519k53637k7285
$$ plain form
22880 -85369 331110 451339 163454 96805 63827 45052 118043 93840 -341817 -424269 -357580
22869 -357580 -34881 -124650 -173110 -29306 -263623 -179452 -42480 27988 -207973 -303513
22859 -303513 -220631 -61967 48036 -179445 -356680 -139927 184597 127804 -16171 -298551
22849 -298551 -321370 -6021 13222 -37737 117191 9054 -44905 47817 67886 -51475 -71528
22838 -71528 -193562 -168620 47206 56473 50149 31346 35832 -56163 -175530 -218056 -154549 -83142
22826 -83142 -244739 -107677 84817 -8953 95455 123202 110075 -116732 -358248 -532149
22816 -532149 -543088 -175302 31230 79849 220192 266695 250415 320910 298691 182410 103968
22805 103968 132164 142355 190040 67720 -52563 -115099 -79489 -205431 -193726 523 104008
$$ packed form
22880h5369M16479J20229k87885o6649l2978j8775P2991k4203m35657q2452O6689
22869c57580L22699q9769m8460J43804k34317Q4171J36972P0468k35961r5540
22859c03513Q2882J58664J10003k27481j77235K16753L24524n6793j43975k82380
22849b98551k2819L15349J9243n0959J54928j08137n3959R2722K0069j19361k0053
22838g1528j22034K4942K15826R267o324j8803M486r1995j19367m2526O3507P1407
22826h3142j61597J37062J92494r3770J04408K7747j3127k26807k41516j73901
22816e32149j0939L67786K06532M8619J40343M6503j6280P0495k2219j16281p8442
22805A03968K8196J0191M7685j22320j20283o2536L5610j25942J1705J94249J03485
$$ plain form
22794 104008 317063 492474 385627 127614 -147487 -387308 -252620 14666 -5507 121749
22784 121749 74899 -159189 -318459 -117776 42326 -123145 -174734 46092 260440 218921
22774 218921 40487 -164433 -177697 -212065 -244318 -131710 -197908 -128444 -12573 -41980 -71000
22763 -71000 -23881 -25251 -53679 -103600 158805 66754 58086 208185 79855 -18209 -176437
22752 -176437 -211374 -128897 -36820 -179848 -313854 -333015 -520476 -711562 -451649 -248206
22742 -248206 -77474 -11317 -94627 -196800 -120731 35648 218451 172161 72029 -44666
22732 -44666 -103951 25632 -3448 222836 274853 355707 308624 177626 -170513 -373561 -585311
22721 -585311 -395288 -71532 59161 21187 8554 -32619 78881 111689 -2225 34795
$$ packed form
22794A04008K13055J75411j06847k58013k75101k39821J34688K67286k0173J27256
22784A21749m6850k34088j59270K00683J60102j65471n1589K20826K14348m1519
22774B18921j78434k04920j3264l4368l2253J12608o6198O9464J15871k9407k9020
22763g1000M7119j370k8428m9921K62405r2051q668J50099j28330r8064j58228
22752a76437l4937Q2477R2077j43028j34006j9161j87461j91086K59913K03443
22742b48206J70732O6157q3310j02173P6069J56379J82803m6290j00132j16695
22732d4666n9285J29583k9080K26284N2017Q0854m7083j30998l48139k03048k11750
22721e85311J90023L23756J30693l7974j2633m1173J11500L2808j13914L7020
$$ plain form
22711 34795 87841 -80657 -267970 -322841 -227093 -39840 126245 89167 -63007 -188845
22701 -188845 60140 108659 50309 -57297 -275955 -185660 -57174 -32599 -22237 -43772 -156386
22690 -156386 -338586 -165326 -235674 -245859 -266130 -155018 -14953 -96547 -118922 2134
22680 2134 -31761 13713 -6508 -28750 174860 17610 -162239 -99810 -32009 97507 208205
22669 208205 336546 289849 207466 201141 -782 -77093 -211845 -238645 -9550 267806 408183
22658 408183 362477 105698 -75371 -122754 -133284 -117227 -63464 -27192 131413 92506 -967
22647 -967 -108716 -219626 -236396 165202 282432 149119 85835 -51425 -170250 -112974 -134597
22636 -134597 -259036 -282676 -291055 -509362 -472516 -414119 -106870 98920 7656 127686 138561
$$ packed form
22711C4795N3046j68498j87313n4871R5748J87253J66085l7078j52174j25838
22701a88845K48985M8519n8350j07606k18658R0295J28486K4575J0362k1535j12614
22690a56386j82200J73260p0348j0185k0271J11112J40065q1594k2375J21056
22680B134l3895M5474k0221k2242K03610j57250j79849O2429O7801J29516J10698
22669B08205J28341m6697q2383o325k01923p6311j34752k6800K29095K77356J40377
22658D08183m5706k56779j81069m7383j0530J6057N3763L6272J58605l8907r3473
22647i67j07749j10910j6770M01598J17230j33313o3284j37260j18825N7276k1623
22636a34597j24439k3640q379k18307L6846N8397L07249K05790r1264J20030J0875
$$ plain form
22625 138561 -24066 -4834 -60843 26883 104835 241232 145193 41525 -23115 -165824 -52568
22614 -52568 152464 221705 267068 229031 187757 -40313 -292741 -260197 -196680 -220488 -76468
22603 -76468 -26309 -262359 -359504 -432528 -207830 -154818 -312769 -285339 -297040 -271256 -72430
22592 -72430 -48247 43450 15689 -91434 -34607 -96814 -345859 -283617 -21441 16385 -16808
22581 -16808 195345 164189 171132 256749 103843 -53764 11864 131551 163396 159128 96825
22570 96825 -7507 156016 -186861 -405315 -463871 -289911 -6701 -53626 -339502 -440265
22560 -440265 -373049 -186913 -280449 -240120 -210905 -112482 29278 -59775 -258639 -169761 174832
22549 174832 271199 136837 2326 -104945 -35422 -110367 -58725 181443 -47095 -84885
$$ packed form
22625A38561j62627J9232n6009Q7726P7952J36397r6039j03668o4640j42709J13256
22614e2568K05032O9241M5363l8037m1274k28070k52428L2544O3517k3808J44020
22603g6468N0159k36050r7145p3024K24698N3012j57951K7430j1701K5784J98826
22592g2430K4183R1697k7761j07123N6827o2207k49045O2242K62176L7826l3193
22581a6808K12153l1156O943Q5617j52906j57607O5628J19687L1845m268o2303
22570I6825j04332J63523l42877k18454n8556J73960K83210m6925k85876j00763
22560d40265O7216J86136r3536M0329K9215R8423J41760q9053j98864Q8878L44593
22549A74832R6367j34362j34511j07271O9523p4945N1642K40168k28538l7790
$$ plain form
22539 -84885 -219468 -18722 68078 114262 71106 87407 300205 242377 132128 -175286 -207280
22528 -207280 -113229 92097 266619 190240 -4806 117177 82999 -56897 -65663 142586
22518 142586 270399 81601 -189472 -308794 -308548 -284048 -401706 -462516 -479863 -354825 -107414
22507 -107414 -184980 -203480 -259460 -268322 -301825 -200779 100423 194708 148826 71083 -208585
22496 -208585 -361112 -271313 -53424 -116143 -274642 -508219 -533577 -434851 -436265 -389443 -197577
22485 -197577 -99420 -103281 -88359 11742 161404 121815 -54160 -413687 -353715 -137941 -168851
22474 -168851 -245798 -270898 6290 55246 25483 -151550 -99259 24763 105764 230438 214266
22463 214266 82729 68164 243644 146169 -108008 -215074 -335611 -149374 -28524 -66599
$$ packed form
22539h4885j34583K00746Q6800M6184m3156J6301K12798n7828j10249l07414l1994
22528b07280R4051K05326J74522p6379j95046J21983l4178j39896q766K08249
22518A42586J27813j88798k71073j19322K46K4500j17658o0810j7347J25038K47411
22507a07414p7566j8500n5980q862l3503J01046L01202R4285m5882p7743k79668
22496b08585j52527Q9799K17889o2719j58499k33577k5358R8726j414M6822J91866
22485a97577R8157l861J4922J00101J49662l9589j75975l59527N9972K15774l0910
22474a68851p6947k5100K77188M8956k9763j77033N2291J24022Q1001J24674j6172
22463B14266j31537j4565J75480r7475k54177j07066j20537J86237J20850l8075
$$ plain form
22453 -66599 32737 152880 195220 63957 -77891 -197198 -128231 -256982 -156043 -210707
22443 -210707 -212872 -102189 79133 40627 -176315 -331642 74655 447697 527795 246278
22433 246278 100358 20272 187905 225803 -157323 -80917 -64097 -74629 -97469 35316 -48748
22422 -48748 36031 -74354 48224 74455 -13894 101267 211970 54241 39872 69410 123750
22411 123750 192310 108221 133509 -147418 -474641 -330025 -382648 -405371 -351971 -73770 442
22400 442 -131972 -100225 -139007 -379937 -609211 -641907 -532632 -448082 -395404 -119903 -74999
22389 -74999 -157966 -207997 -309203 -189896 9896 47014 -24636 -288967 -388698 -276190 -128583
22378 -128583 -236968 -397199 -260891 -112256 78143 -46154 -76926 131154 192898 -276646
$$ packed form
22453f6599R9336J20143M2340j31263j41848j19307O8967j28751J00939n4664
22443b10707k165J10683J81322l8506k16942j55327M06297L73042Q0098k81517
22433B46278j45920q0086J67633L7898l83126P6406J6820j0532k2840J32785q4064
22422d8748Q4779j10385J22578K6231q8349J15161J10703j57729j4369K9538N4340
22411A23750O8560q4089K5288k80927l27223J44616n2623k2723N3400K78201P4212
22400D42j32414L1747l8782k40930k29274l2696J09275Q4550N2678K75501M4904
22389g4999q2967n0031j01206J19307J99792L7118p1650k64331r9731J12508J47607
22378a28583j08385j60231J36308J48635J90399j24297l0772K08080O1744m69544
$$ plain form
22368 -276646 -473099 -424305 -132621 115641 76365 4313 -37179 -41851 -207824 -163759 -57446
22357 -57446 -353405 -391539 -244126 74067 149495 150545 156702 49767 -112769 -93339 3321
22346 3321 70621 -137761 -148586 -72769 -272916 -450560 -435382 -180999 155513 80373 17658
22335 17658 -52580 -81212 -124699 182037 124502 158502 126564 -13923 -163014 -162589 -76098
22324 -76098 -69108 -81210 -122976 -62630 -3368 -82170 -248129 -185321 -104391 -186685 -63627
22313 -63627 -96528 -136864 -134483 -206541 -194106 -158934 -163431 -57887 47696 204257 123594
22302 123594 88563 4456 21841 -311061 -422067 -376409 -410142 -346237 -193398 -148946 -166238
22291 -166238 -89907 252110 224297 -121938 -189558 -310508 -413591 -256073 126989 244757
$$ packed form
22368b76646j96453M8794K91684K48262l9276p2052m1492m672j65973M4065J06313
22357e7446k95959l8134J47413L18193P5428J050O157j06935j62536J9430R6660
22346C321O7300k08382j0825P5817k00147j77644J5178K54383L36512p5140o2715
22335A7658p0238k8632m3487L06736n7535L4000l1938j40487j49091M25Q6491
22324g6098O990j2102m1766O0346N9262p8802j65959O2808Q0930q2294J23058
22313f3627l2901m0336K381p2058J2435L5172m497J05544J05583J56561q0663
22302A23594l5031q4107J7385l32902j11006M5658l3733O3905J52839M4452j7292
22291a66238P6331L42017k7813l46235o7620j20950j03083J57518L83062J17768
$$ plain form
22281 244757 217780 -20791 -29881 -138601 -301795 -386337 -319508 -313903 -332124 -244775 63337
22270 63337 164469 231135 277937 98682 191780 376600 228607 -55815 -130933 -23352
22260 -23352 29471 77392 -55283 -301376 -318678 -221840 -65667 -7368 1833 -81546 -164767
22249 -164767 -205706 -49188 -125152 -169512 -306402 -231977 -9969 -66050 -106274 -40863 -103805
22238 -103805 -189724 -249631 -434429 -411937 -265974 65506 142160 439 -78532 26977
22228 26977 50336 213978 413569 337427 272588 181255 232987 135581 114586 65167 -97800
22217 -97800 -219041 -62272 -11362 19617 -68454 -351849 -405003 -327803 -469545 -469490 -161053
22206 -161053 -99224 -88174 -367386 -466803 -390798 -367950 -137012 -49797 -107310 113588 76242
$$ packed form
22281B44757k6977k38571r090j08720j63194q4542O6829N605j8221Q7349L08112
22270F3337J01132O6666M6802j79255R3098J84820j47993k84422p5118J07581
22260b3352N2823M7921j32675k46093j7302R6838J56173N8299R201q3379q3221
22249a64767m0939J56518p5964m4360j36890P4425K22008n6081m0224O5411o2942
22238a03805q5919n9907j84798K2492J45963L31480P6654j41721p8971J05509
22228B6977K3359J63642J99591p6142o4839r1333N1732r7406k0995m9419j62967
22217i7800j21241J56769N0910L0979q8071k83395n3154P7200j41742N5L08437
22206a61053O1829J1050k79212r9417P6005K2848K30938Q7215n7513K20898l7346
$$ plain form
22195 76242 -79783 -172471 -173932 79256 304307 214630 241505 239421 120583 -99905 -168872
22184 -168872 -64075 -25269 -9278 -83546 -91038 -42666 -103912 4190 131199 -70011 -70698
22173 -70698 62798 82912 113124 -17704 -350446 -211847 -134590 107625 -15697 -189336
22163 -189336 239738 378538 243287 -2454 -107112 -209995 8611 144207 282868 132042
22153 132042 102922 172199 -86645 -54333 -107375 229125 383763 342964 332483 214041 318650
22142 318650 128453 176099 262464 295986 89033 -55216 58908 -1759 100596 114618
22132 114618 84354 61150 -103950 -171802 -227048 -94927 -12145 -100043 -248100 -366168 -344474
22121 -344474 -143395 131340 18796 -81903 -211226 -404740 -200632 22195 -141078 -162380
$$ packed form
22195G6242j56025r2688j461K53188K25051q9677K6875k084j18838k20488o8967
22184a68872J04797L8806J5991p4268p492M8372o1246J08102J27009k01210o87
22173g0698J33496K0114L0212j30828l32742J38599P7257K42215j23322j73639
22163a89336M29074J38800j35251k45741j04658j02883K18606J35596J38661j50826
22153A32042k9120O9277k58844L2312n3042L36500J54638m0799j0481j18442J04609
22142C18650j90197M7646Q6365L3522k06953j44249J14124o0667J02355J4022
22132A14618l0264k3204j65100o7852n5246J32121Q2782q7898j48057j18068K1694
22121c44474K01079K74735j12544j00699j29323j93514K04108K22827j63273k1302
$$ plain form
22111 -162380 -5393 -95801 143945 27926 -79729 -107603 -139134 -34364 25552 -7686
22101 -7686 33365 178721 355517 88766 54466 174737 33131 -28023 -192803 -177158 -256002
22090 -256002 -302859 -295872 -354347 -541979 -575464 -557764 -388597 -436081 -411651 -252174 -103564
22079 -103564 -218896 -137401 -183466 -398704 -291702 -9475 58001 170202 -110235 -244069
22069 -244069 -382363 -219886 -133503 -200351 -226074 -13463 174487 146275 146269 -1499 -277748
22058 -277748 -241624 -101825 -213792 -230528 -150115 -106198 -231791 -434944 -354445 -104370
22048 -104370 278332 430806 156974 -174954 -105408 -32185 65278 249328 259678 90022
22038 90022 5322 94347 338464 414666 267168 107650 198926 275368 306680 114303 63573
$$ packed form
22111a62380J56987r0408K39746j16019j07655k7874l1531J04770N9916l3238
22101g686M1051J45356J76796k66751l4300J20271j41606o1154j64780J5645p8844
22090b56002m6857O987n8475j87632l3485J7700J69167m7484K4430J59477J48610
22079a03564j15332Q1495m6065k15238J07002K82227O7476J12201k80437j33834
22069b44069j38294J62477Q6383o6848k5723K12611J87950k8212oj47768k76249
22058b77748L6124J39799j11967j6736Q0413M3917j25593k03153Q0499K50075
22048a04370L82702J52474k73832l31928O9546P3223R7463J84050J0350j69656
22038I0022q4700Q9025K44117P6202j47498j59518R1276P6442L1312j92377n0730
$$ plain form
22027 63573 320413 410267 241672 113766 20542 -115747 81810 17287 166646 194358
22017 194358 191930 103515 140065 44724 -63292 -3717 -147591 -196139 -150961 -64440 168990
22006 168990 184709 185233 127307 177679 99994 103720 71320 -143672 -185312 -103832 31475 229645
21994 229645 55159 159314 235285 94955 157523 177246 129636 113503 -45123 -316434
21984 -316434 -195368 -37091 113491 -66117 -290764 -248307 70817 110280 78129 230328
21974 230328 296 -366131 -491379 -419469 -234821 -95642 124409 129619 -28136 162824
21964 162824 88571 106176 -177251 -410468 -244853 92042 148962 73365 -162745 -257457
21954 -257457 -296744 -412374 -299783 -292448 -416916 -271843 -121245 -212286 -423913 -637780
$$ packed form
22027F3573K56840Q9854j68595j27906r3224j36289J97557o4523J49359K7712
22017A94358k428q8415L6550r5341j08016N9575j43874m8548M5178Q6521K33430
22006A68990J5719N24n7926N0372p7685L726l2400k14992m1640Q1480J35307J98170
21994B29645j74486J04155P5971j40330O2568J9723m7610j6133j58626k71311
21984c16434J21066J58277J50582j79608k24647M2457L19124L9463l2151J52199
21974B30328k30032l66427j25248P1910J84648J39179K20051N210j57755J90960
21964A62824p4253J7605k83427k33217J65615L36895N6920p5597k36110r4712
21954b57457l9287j15630J12591P335j24468J45073J50598r1041k11627k13867
$$ plain form
21944 -637780 -446376 -214193 -88109 64395 65590 424829 580058 460616 249351 236268
21934 236268 212058 122522 283669 160795 -128494 15928 -104109 -268910 -240092 -131861
21924 -131861 110971 208864 -37799 -240573 12518 139639 215213 210121 103486 31323
21914 31323 314870 535430 414721 408001 469488 400558 368893 113455 77994 113332 87033
21903 87033 85379 48148 -40790 -99915 -103134 -178100 -46745 362468 431774 455521 395469 82534
21891 82534 8594 -64567 -266894 -130819 -59093 22369 -33953 -197977 -87802 133538 242381
21880 242381 146320 21173 178719 183662 110898 200259 141363 62095 116211 221791 432951
21869 432951 287787 217833 245548 356156 237975 64869 50062 108635 -50397 -272106
$$ packed form
21944f37780J91404K32183J26084J52504J195L59239J55229j19442k11265j3083
21934B36268k4210q9536J61147j22874k89289J44422j20037j64801K8818J08231
21924a31861K42832R7893k46663k02774K53091J27121P5574n092j06635p2163
21914C1323K83547K20560j20709o720O1487o8930l1665k55438l5461L5338k6299
21903H7033j654l7231q8938n9125l219p4966J31355M09213O9306K3747o0052l12935
21891H2534p3940p3161k02327J36075P1726Q1462n6322j64024J10175K21340J08843
21880B42381r6061j25147J57546M943p2764Q9361n8896p9268N4116J05580K11160
21869D32951j45164o9954K7715J10608j18181j73106j4807N8573j59032k21709
$$ plain form
21859 -272106 -476773 -307297 -56613 -40306 144166 193101 86468 75880 1304 -254852
21849 -254852 -218640 -209295 -316398 -494466 -630889 -645562 -709353 -607655 -524142 -183818 -47148
21838 -47148 67375 154695 228524 214440 107498 56754 214636 2936 -94194 -300921 -398018
21827 -398018 -443913 -193769 -49669 17091 129415 31183 -229824 -242878 -26159 30380
21817 30380 90048 232546 135500 -90796 17377 101319 255185 252703 71813 -77261 -141661
21806 -141661 -161376 -159210 -120853 -153094 -160737 -91498 132396 135611 -63112 -267331 -370980
21795 -370980 -350637 -322215 -299864 -235368 -220761 -121732 -101004 -27142 276047 272315 164639
21784 164639 -191540 -100893 -143501 -105012 164048 -128250 -314013 -332458 -186381 -4308
$$ packed form
21859b72106k04667J69476K50684J6307J84472M8935j06633j0588p4576k56156
21849b54852L6212R345j07103j78068j36423j4673o3791J01698Q3513L40324J36670
21838d7148J14523Q7320P3829j4084j06942n0744J57882k11700r7130k06727r7097
21827c98018m5895K50144J44100O6760J12324r8232k61007j3054K16719N6539
21817C0380N9668J42498r7046k26296J08173Q3942J53866k482j80890j49074o4400
21806a41661j9715K166L8357l2241p643O9239K23894L215j98723k04219j03649
21795c70980K0343K8422K2351O4496J4607R9029K0728P3862L03189l732j07676
21784A64639l56179R0647m2608L8489K69060k92298j85763j8445J46077J82073
$$ plain form
21774 -4308 -34974 380838 250699 42305 77110 -11797 -103804 7983 -102921 -171352 -247858
21763 -247858 -186810 -235550 -55774 -87116 111213 90805 -35467 -174702 -95860 -72359 -315290
21752 -315290 -243020 -84048 61929 -41015 -89533 -210976 -399256 -187502 -53120 -42821
21742 -42821 -173461 -238917 -272478 -368112 -278506 -120790 -126048 12371 79101 137155 170680
21731 170680 46250 -6915 -15147 -261114 -183583 76604 300555 300777 185085 -194693 74983
21720 74983 251769 24735 -54570 -5189 -12243 -93513 -290260 -290977 -166707 -87636 -52525
21709 -52525 -92190 75476 71382 172468 113570 -128699 -358155 -340104 -91798 10353 -103258
21698 -103258 -460480 -274697 -184794 -140944 -15394 14562 -73741 -212814 -173695 -263837 -366529
$$ packed form
21774d308l0666M15812j30139k08394L4805q8907r2007J11787j10904o8431p6506
21763b47858O1048m8740J79776l1342J98329k0408j26272j39235P8842K3501k42931
21752c15290P2270J58972J45977j02944m8518j21443j88280K11754J34382J0299
21742d2821j30640o5456l3561r5634Q9606J57716n258J38419O6730N8054L3525
21731A70680j24430n3165q232k45967P7531K60187K23951K22j15692l79778K69676
21720G4983J76786k27034p9305M9381p054q1270j96747p17J24270P9071L5111
21709e2525l9665J67666m094J01086n8898k42269k29456J8051K48306J02151j13611
21698a03258l57222J85783Q9903M3850J25550K9956q8303j39073L9119r0142j02692
$$ plain form
21687 -366529 -259928 -284530 -328595 -259012 -133305 -250226 -148657 742 43699 14723
21677 14723 -48776 -280016 -475679 -383263 -415752 -316448 -58539 305794 418130 484033 336123
21666 336123 252908 189270 145124 40581 -129597 -242827 -227823 -11665 259159 239293
21656 239293 236585 251566 -40358 -121818 -108262 -81449 -69496 -109871 -16788 -115579 -144488
21645 -144488 -122724 -250417 -219059 -37740 -29327 65549 68149 106486 -26758 -304069 -329991
21634 -329991 -486283 -417917 -298941 -152686 -109212 -28516 -18871 19536 67061 55715 -194449
21623 -194449 -207180 -421411 -334294 -426230 -369015 -50132 -42397 -290044 -292838 -269262 -409346
21612 -409346 -217732 -147003 -294869 -190774 -197807 -366581 -337893 75925 304719 393019
$$ packed form
21687c66529J06601k4602m4065O9583J25707j16921J01569J49399M2957k8976
21677A4723o3499k31240j95663R2416l2489R9304K57909L64333J12336O5903j47910
21666C36123q3215o3638m4146j04543j70178j13230J5004K16158K70824j9866
21656B39293k708J4981k91924q1460J3556K6813J1953m0375R3083r8791k8909
21645a44488K1764j27693L1358J81319Q413R4876K600L8337j33244k77311k5922
21634c29991j56292O8366J18976J46255M3474Q0696R645L8407M7525j1346k50164
21623a94449j2731k14231Q7117r1936N7215L18883P735k47647k794K3576j40084
21612d09346J91614P0729j47866J04095p033j68774K8688M13818K28794Q8300
$$ plain form
21602 393019 250113 -112217 -248479 -193322 -95547 -123239 -263470 -178848 -96703 -5423 16831
21591 16831 -126761 -168010 -61258 -222278 -45111 142963 59011 -48066 -95146 -7914
21581 -7914 158741 117317 114324 252794 225910 141735 30188 -82164 -42562 47422 98901
21570 98901 243510 14188 -225543 -221842 -129977 -42024 -42818 -177442 -77860 -157824 -227962
21559 -227962 -283766 -166958 -121912 -130655 -144018 -230384 -152427 38622 158922 50825 -293582
21548 -293582 -441844 -320642 -195620 -60351 -280569 -111609 -131781 -429480 -503834 -504695
21538 -504695 -574921 -290683 -77736 123630 88121 -61803 -72195 184787 220931 228155 208327
21527 208327 137524 124494 -33385 -128687 -159819 -323721 -132345 46294 216648 259590
$$ packed form
21602C93019j42906l62330j36262N5157R7775k7692j40231Q4622Q2145R1280K2254
21591A6831j43592m1249J06752j61020J77167J88074q3952j07077m7080Q7232
21581g914J66655m1424k993J38470k6884q4175j11547j12352L9602Q9984N1479
21570I8901J44609k29322k39731L701R1865Q7953p94j34624R9582p9964p0138
21559b27962n5804J16808M5046q743j3363q6366P7957J91049J20300j08097l44407
21548b93582j48262J21202J25022J35269k20218J68960k0172k97699p4354q61
21538e04695p0226K84238K12947K01366l5509j49924j0392K56982L6144P224j9828
21527B08327p0803j3030j57879r5302l1132j63902J91376J78639J70354M2942
$$ plain form
21517 259590 31255 -165640 -22640 14077 -28384 -301826 -155668 -99134 -88876 -51615
21507 -51615 21062 115565 85805 30440 1945 -202986 -260155 -149632 -179668 -79632 -17805
21496 -17805 -209965 -200075 -261502 -510907 -199471 -10685 -113266 -144473 -283041 -486596
21486 -486596 -265778 -173042 -154173 -252849 -119559 -35496 -137577 -238054 -92232 37926
21476 37926 -62192 -76416 55707 19479 106334 177305 -22718 -189521 -181509 -87162 -19515
21465 -19515 31873 70287 -155716 -546874 -514058 -296828 -51349 -228965 -193424 -160758 -224332
21454 -224332 -115946 -101161 -222159 -186145 -96209 47629 173078 79478 -1956 55037 -161522
21443 -161522 -291985 -387754 -505556 -236794 35178 150073 323090 399081 354212 495524
$$ packed form
21517B59590k28335j96895J43000L6717m2461k73442J46158N6534J0258L7261
21507e1615P2677R4503k9760n5365k8495k04931n7169J10523l0036J00036O1827
21496a7805j92160R890o1427k49405L11436J88786j02581l1207j38568k03555
21486d86596K20818R2736J8869r8676J33290Q4063j02081j00477J45822J30158
21476C7926j00118j4224J32123l6228Q6855P0971k00023j66803Q012R4347O7647
21465a9515N1388L8414k26003l91158L2816K17230K45479j77616L5541L2666o3574
21454b24332J08386J4785j20998L6014Q9936J43838J25449r3600q1434N6993k16559
21443a61522j30463r5769j17802K68762K71972J14895J73017P5991m4869J41312
$$ plain form
21433 495524 507516 239167 137045 31431 117110 -129369 -152085 -69711 59491 56765 -101547
21422 -101547 -69699 195997 230247 323479 344176 360659 144663 30295 -17183 -87965 35681
21411 35681 -55928 55079 268286 273988 151879 117684 -100531 -169025 -303488 -123727 -209522
21400 -209522 -458963 -435493 -25379 85944 22616 144849 46926 1368 -152724 -42267
21390 -42267 62732 263396 246996 164016 164950 72408 28584 74361 159310 104190 240833
21379 240833 172170 104105 -32510 -219398 58174 311952 -4771 -65819 67670 332347
21369 332347 379079 465910 279768 191287 290690 278560 -72424 -264411 -423551 -526346
21359 -526346 -264385 151633 209413 127552 241140 358994 327727 247060 397836 326406
$$ packed form
21433D95524J1992k68349j02122j05614Q5679k46479k2716Q2374J29202k726j58312
21422a01547L1848K65696L4250R3232K0697J6483k15996j14368m7478p0782J23646
21411C5681r1609J11007K13207N702j22109l4195k18215o8494j34463J79761q5795
21400b09522k49441K3470M10114J11323o3328J22233r7923m5558j54092J10457
21390d2267J04999K00664j6400q2980R34r2542m3824M5777Q4949n5120J36643
21379B40833o8663o8065j36615j86888K77572K53778l16723o1048J33489K64677
21369C32347M6732Q6831j86142q8481R9403j2130l50984j91987j59140j02795
21359e26346K61961M16018N7780q1861J13588J17854l1267q0667J50776p1430
$$ plain form
21349 326406 7837 -120202 -157590 -41439 94444 283477 29580 -41981 72251 144958
21339 144958 29692 181198 457330 469258 306831 73479 -54997 -121542 -98648 -37041
21329 -37041 233919 180651 -5753 47431 156579 333460 319404 -7160 -112959 -4250
21319 -4250 -89191 -53026 -115559 -275866 -140641 -105652 -20427 -44972 -110815 -275106 -372996
21308 -372996 -280911 -106270 -10917 -160292 -294956 -94797 31023 -24237 27842 -4524
21298 -4524 3671 -105229 -290138 -246708 -213863 -76517 52439 41703 -12623 -76109 -189295
21287 -189295 -25490 -9313 169672 297526 1424 -49902 -29017 -151025 -330389 -144919
21277 -144919 -311241 -124126 -76930 21233 -43403 -3803 80238 -75352 -263176 -305780 -231588
$$ packed form
21349C26406l18569j28039l7388J16151J35883J89033k53897p1561J14232P2707
21339A44958j15266J51506K76132J1928j62427k33352j28476o6545K2894O1607
21329c7041K70960n3268j86404N3184J09148J76881j4056l26564j05799J08709
21319d250q4941L6165o2533j60307J35225L4989Q5225k4545o5843j64291r7890
21308c72996R2085J74641R5353j49375j34664K00159J25820n5260N2079l2366
21298d524Q195j08900j84909M3430L2845J37346J28956j0736n4326o3486j13186
21287a89295J63805J6177J78985J27854k96102n1326K0885j22008j79364J85470
21277a44919j66322J87115M7196R8163o4636L9600Q4041j55590j87824m2604P4192
$$ plain form
21266 -231588 -108378 -88506 -204172 -15870 129362 249506 87260 96359 120294 144965
21256 144965 93486 44061 -11992 -69252 -5134 29287 179728 96167 -139276 28913 4465
21245 4465 -121827 -223528 -65237 -9098 -95081 -194704 -153493 -139006 -197970 -106252 -107074 -140411
21233 -140411 -30017 -209975 -254256 -103063 147256 474438 359391 245566 123449 -275337
21223 -275337 -434483 -256494 -174629 -266756 -335020 -224286 -283469 -432997 -282089 -79629
21213 -79629 -27802 -23455 -52416 -219741 -139699 -136228 -72185 -58894 -182429 2091 152611
21202 152611 145283 -4483 54458 6232 -23584 33648 77850 -5879 -205543 -326368 -413518
21191 -413518 -397910 -424332 -202294 166625 107350 -28588 -87746 -148371 -259365 -263758 -407528
$$ packed form
21266b31588J23210J9872j15666J88302J45232J20144j62246R099K3935K4671
21256A44965n1479m9425n6053n7260O4118L4421J50441q3561k35443J68189k4448
21245D465j26292j01701J58291N6139q5983r9623M1211J4487n8964R1718q22l3337
21233a40411J10394j79958m4281J51193K50319L27182j15047j13825j22117l98786
21223b75337j59146J77989Q1865r2127o8264J10734n9183j49528J50908K02460
21213g9629N1827M347k8961j67325Q0042L471O4043J3291j23535J84520J50520
21202A52611p328j49766N8941m8226k9816N7232M4202q3729j99664j20825q7150
21191d13518J5608k6422K22038L68919n9275j35938n9158o0625j10994m393j43770
$$ plain form
21180 -407528 -274414 -38876 184509 236653 -37246 -93629 -146077 -197181 -229966 -445611
21170 -445611 -449943 -413639 -545389 -312584 -129578 -30376 78967 51089 -27044 -193858 -121384
21159 -121384 -17512 -242197 -247212 -97657 -215594 -79443 -200927 -239053 -132713 -144722
21149 -144722 -179439 -236195 -205024 -258034 -63555 336208 239683 321199 355932 331792 237345
21138 237345 -23243 -258959 -162969 -74338 162299 106721 -112030 -29635 -72467 -236135
21128 -236135 -261541 -275301 -301212 10539 254361 419648 370586 196775 -98427 -24854
21118 -24854 54845 -181554 -347707 -450841 -332796 -310445 -399700 -274558 -206236 -142704 -126697
21107 -126697 25729 73335 173627 268817 112814 179829 254356 22716 -82368 -217345
$$ packed form
21180d07528J33114K35538K23385N2144k73899n6383n2448n1104l2785k15645
21170d45611m332L6304j31750K32805J83006R9202J09343k7878p8133j66814P2474
21159a21384J03872k24685n015J49555j17937J36151j21484l8126J06340j2009
21149a44722l4717n6756L1171n3010J94479L99763r6525Q1516L4733k4140r4447
21138B37345k60588k35716R5990Q8631K36637n5578k18751Q2395m2832j63668
21128b36135k5406j3760k5911L11751K43822J65287m9062j73811k95202P3573
21118b4854P9699k36399j66153j03134J18045K2351q9255J25142O8322O3532J6007
21107a26697J52426M7606J00292R5190j56003O7015P4527k31640j05084j34977
$$ plain form
21097 -217345 -135590 128690 27705 2747 11541 -14919 20725 111153 106009 -113821 -188683
21086 -188683 -277107 -348514 -285211 -325988 -346819 -319121 -328859 -64618 -72555 22810 -180837
21075 -180837 -184828 -82568 22500 43939 -64034 -128786 -354646 -316901 -148918 -127469 -47494
21064 -47494 123804 127603 270527 438716 138477 61749 -62000 -41939 -68112 -57641 -93185
21053 -93185 -288480 -542580 -433868 -319042 -148479 -75583 200036 171304 -58391 -118612
21043 -118612 -6955 11246 51087 -179687 -161539 -39558 39608 11935 54962 119898 -69091
21032 -69091 -137398 142082 -123583 -332452 -168456 -94646 -205606 -234159 -356863 -103800
21022 -103800 157324 296448 263956 105663 -43150 -125766 -92299 70195 193027 -70504
$$ packed form
21097b17345Q1755K64280j00985k4958Q794k6460L5644R0428n144k19830p4862
21086a88683q8424p1407O3303m0777k0831K7698r738K64241p937R5365k03647
21075a80837l991J02260J05068K1439j07973o4752k25860L7745J67983K1449P9975
21064d7494J71298L799J42924J68189l00239p6728j23749K0061k6173J0471l5544
21053i3185j95295k54100J08712J14826J70563P2896K75619k8732k29695o0221
21043a18612J11657J8201L9841k30774J8148J21981P9166k7673M3027O4936j88989
21032f9091o8307K79480k65665k08869J63996P3810j10960k8553j22704K53063
21022a03800K61124J39124l2492j58293j48813q2616L3467J62494J22832k63531
$$ plain form
21012 -70504 -115662 -108312 6853 90653 110105 58121 86261 -181634 -209343 -426990 -380875
21001 -380875 -413810 -260146 26798 236155 277638 126701 26220 59192 81012 -56261
20991 -56261 -51133 110756 150460 -122235 -283407 -154052 87124 127555 411856 414649 365110
20980 365110 311092 21494 -242960 -251068 -130183 -119145 -206949 -250212 -240051 -104682 68418
20969 68418 22316 -38705 -26160 -137644 -190631 17628 203831 240568 128534 54935 112749
20958 112749 217430 204117 277817 201964 147404 255743 403441 620010 447596 620739
20948 620739 540167 455134 325602 302427 356230 291689 362835 195009 270364 212668 84401
20937 84401 -41469 -286077 -199933 19644 137695 183458 363084 448783 627416 718216
$$ packed form
21012g0504m5158P350J15165Q3800J9452n1984K8140k67895k7709k17647M6115
21001c80875l2935J53664K86944K09357M1483j50937j00481L2972K1820j37273
20991e6261N128J61889L9704k72695j61172J29355K41176M0431K84301K793m9539
20980C65110n4018k89598k64454q108J20885J1038q7804m3263J0161J35369J73100
20969F8418m6102o1021J2545j11484n2987K08259J86203L6737j12034p3599N7814
20958A12749J04681j3313P3700p5853n4560J08339J47698K16569j72414J73143
20948F20739q0572q5033j29532k3175N3803o4541P1146j67826P5355n7696j28267
20937H4401j25870k44608Q6144K19577J18051M5763J79626Q5699J78633R0800
$$ plain form
20927 718216 445509 192540 186843 38300 -104927 29351 169032 227220 251898 -37690
20917 -37690 -232192 -191658 -79252 25299 163272 264341 112317 55983 44164 27344
20907 27344 114218 182758 283895 27653 -86827 -137446 -129121 -56673 126869 58882 -224628
20896 -224628 -348487 -82044 -99237 -111544 -114767 -145077 -69952 277515 205510 52733 -47312
20885 -47312 -100992 -153209 -11880 147717 -32198 36932 77810 125874 107328 122018 -282026
20874 -282026 -452718 -432937 -76836 248451 444615 310442 305813 185355 169958 76796
20864 76796 -140803 -190228 78561 -5948 -58041 39210 -121453 -93899 2795 151614 189162
20853 189162 379698 502382 366783 353116 177667 -26342 -193399 -183404 -72245 13528
$$ packed form
20927G18216k72707k52969n697j48543j43227J34278J39681N8188K4678k89588
20917c7690j94502M0534J12406J04551J37973J01069j52024n6334j1819j6820
20907B7344Q6874O8540J01137k56242j14480n0619Q325P2448J83542o7987k83510
20896b24628j23859K66443j7193j2307l223l0310P5125L47467p2005j52777j00045
20885d7312n3680n2217J41329J59597j79915O9130M0878M8064j8546J4690m04044
20874b82026j70692J9781L56101L25287J96164j34173m629j20458j5397r3162
20864G6796k17599m9425K68789q4509n2093R7251j60663K7554R6694J48819L7548
20853A89162J90536J22684j35599j3667j75449k04009j67057R995J11159Q5773
$$ plain form
20843 13528 179439 83312 114212 262358 312767 71864 -28071 -46351 -110035 -260700 -130266
20832 -130266 210332 487956 290082 164471 88997 54427 227520 128098 107018 391155
20822 391155 469630 181959 40039 65337 119186 366045 479759 282558 -22642 -181962
20812 -181962 -173923 48096 -2222 152854 74907 -228941 -437298 -252920 -191291 -21969
20802 -21969 238209 298451 341439 188950 -161205 -115877 70319 128496 53615 44991 14938
20791 14938 -58450 -146288 -70211 101060 14197 -67461 42905 50074 153050 -142989 -400338
20780 -400338 -263503 -9524 306462 456506 363774 160605 49458 -88939 53479 75944
20770 75944 104201 51537 58322 -2107 -202480 -444886 -591118 -387638 -230392 -226476 -319344
$$ packed form
20843A3528J65911r6127L0900J48146N0409k40903r9935j8280o3684j50665J30434
20832a30266L40598K77624j97874j25611p5474l4570J73093r9422k1080K84137
20822C91155P8475k87671j41920K5298N3849K46859J13714j97201l05200j59320
20812a81962Q039K22019n0318J55076p7947l03848k08357J84378O1629J69322
20802b1969K60178O0242M2988j52489l50155M5328J86196N8177p4881q624l0053
20791A4938p3388q7838P6077J71271q6863q1658J10366P169J02976k96039k57349
20780d00338J36835K53979L15986J50044r2732k03169j11147j38397J42418K2465
20770G5944K8257n2664O785o0429k00373k42406j46232K03480J57246L916r2868
$$ plain form
20759 -319344 -233991 -264944 -208629 -168206 -229275 -257447 -230388 -97112 -23244 3951 261047
20748 261047 359715 111228 -32720 45453 244481 305655 62111 -15741 217267 254646
20738 254646 250791 490697 548191 463912 155077 -29543 15210 104965 213548 188852 -49991
20727 -49991 -172955 -70209 -182525 -214757 -169007 -22635 60996 -8405 -48313 -142669 -99920
20716 -99920 -59208 45124 71832 -118268 -271453 -207449 -51749 83597 193708 160738
20706 160738 38207 204584 -1740 -9876 31282 -14799 -194742 -20610 343167 195186
20696 195186 -109034 -98493 -211227 -90077 110553 236371 213992 -43137 -41684 108420
20686 108420 192570 176130 43948 72012 -51081 -202085 11300 110211 58767 193445
$$ packed form
20759c19344Q5353l0953N6315M0423o1069k8172K7059J33276P3868K7195K57096
20748B61047R8668k48487j43948P8173J99028O1174k43544p7852K33008L7379
20738B54646l855K39906N7494q4279l08835j84620M4753Q9755J08583k4696k38843
20727d9991j22964J02746j12316l2232M5750J46372Q3631o9401l9908r4356M2749
20716i9920M0712J04332K6708j90100j53185O4004J55700J35346J10111l2970
20706A60738j22531J66377k06324q136M1158m6081j79943J74132L63777j47981
20696A95186l04220J0541j12734J21150K00630J25818k2379k57129J453J50104
20686A08420Q4150j6440j32182K8064j23093j51004K13385R8911n1444J34678
$$ plain form
20676 193445 381806 481901 310007 291239 367596 245581 197457 173428 187178 304252
20666 304252 448781 501741 326429 23118 21209 3140 156984 414430 403331 297005
20656 297005 286841 254437 382921 300541 282062 128638 56870 -6655 90201 93311 13642
20645 13642 -147883 -372608 -409560 -198690 -377514 -343463 -72181 247563 291621 482348
20635 482348 397691 56721 93687 273399 356011 493799 374371 188158 46639 18718
20625 18718 -112215 -153074 -114350 156614 156078 133781 212863 235319 324998 87402 -53714
20614 -53714 2826 36800 159292 457136 389231 244585 218602 140311 -80727 -71196 87389
20603 87389 275219 305398 424403 358479 293497 565443 677180 432915 168957 60699
$$ packed form
20676A93445J88361J00095j71894j8768P6357j22015m8124k4029J3750J17074
20666C04252J44529N2960j75312l03311j909j8069J53844K57446j1099j06326
20656B97005j0164l2404J28484q2380j8479j53424p1768o3525R6856L110p9669
20645A3642j61525k24725l6952K10870j78824L4051K71282L19744M4058J90727
20635D82348q4657l40970L6966J79712Q2612J37788j19428j86213j41519k7921
20625A8718j30933m0859L8724K70964n36k2297P9082K2456Q9679k37596j41116
20614e3714N6540L3974J22492K97844o7905j44646k5983p8291k21038R531J58585
20603H7389J87830L0179J19005o5924o4982K71946J11737k44265k63958j08258
$$ plain form
20593 60699 92828 129636 97682 113967 2681 -69200 -107 191482 353461 388537 445699
20582 445699 462547 553399 603427 759052 709574 707892 708482 601189 384046 299510 357512
20571 357512 166742 84982 84670 150187 185696 375156 191648 81572 391327 384673 160518
20560 160518 33750 22712 -38172 -170410 121711 275085 284092 133674 17844 -85726
20550 -85726 9002 -27024 -129672 -37846 19192 276560 280600 343262 292382 373020 272359
20539 272359 254181 214396 163385 143900 58628 -81366 -92027 166173 135591 405207 438650
20528 438650 460551 372911 81313 -27344 116623 152712 209958 288517 294996 309934 120507
20517 120507 156239 222063 186595 194547 -166935 -176855 -26899 -149522 -112686 -98988 82329
$$ packed form
20593F0699L2129L6808l1954J6285j11286p1881O9093J91589J61979L5076N7162
20582D45699J6848R0852N0028J55625m9478j682N90j07293k17143q4536N8002
20571C57512j90770q1760l12O5517L5509J89460j83508j10076L09755o654k24155
20560A60518j26768j1038o0884j32238K92121J53374R007j50418j15830j03570
20550h5726R4728l6026j02648R1826N7038K57368M040O2662n0880Q0638j00661
20539B72359j8178l9785n1011j9485q5272j39994j0661K58200l0582K69616L3443
20528D38650K1901q7640k91598j08657J43967L6089N7246P8559O479J4938j89427
20517A20507L5732O5824l5468P952l61482r920J49956j22623L6836J3698J81317
$$ plain form
20506 82329 20242 6966 -202725 -282377 -113504 268316 255864 -12197 75679 86459 -145955
20495 -145955 -119455 142535 264645 65402 -176563 -293367 -115463 -123484 -97332 82854
20485 82854 138244 87124 -83468 -123090 -46063 12607 93082 133629 -70235 -68792 -46877
20474 -46877 158779 182646 261822 214366 45600 2080 198075 357608 541625 526464 226212
20463 226212 173706 290846 467174 427143 234181 257711 278418 449609 644962 297098
20453 297098 18450 63746 92234 119194 164838 333498 182768 -122567 -174401 -47072
20443 -47072 -75214 44193 187741 185461 100757 25921 96485 52086 -94397 131886 55073
20432 55073 -171962 -148478 35841 63088 172325 227952 47477 40335 -30505 -48753 103891
$$ packed form
20506H2329o2087j3276k09691p9652J68873L81820j2452k68061Q7876J0780k32414
20495a45955K6500K61990J22110j99243k41965j16804J77904q021K6152J80186
20485H2854N5390n1120j70592l9622P7027N8670Q0475M0547k03864J443K1915
20474d6877K05656K3867P9176m7456j68766m3520J95995J59533J84017j5161l00252
20463B26212n2506J17140J76328m0031j92962K3530K0707J71191J95353l47864
20453B97098k78648M5296K8488K6960M5644J68660j50730l05335n1834J27329
20443d7072k8142J19407J43548k280q4704p4836P0564m4399j46483K26283p6813
20432E5073k27035K3484J84319K7247J09237N5627j80475p142p0840j8248J52644
$$ plain form
20421 103891 395750 272243 97433 61285 211785 225231 135942 40680 182077 361880
20411 361880 255969 241879 210043 228645 373737 341898 264248 231539 336413 517990 467295
20400 467295 443683 342226 81941 -3663 136684 256088 425780 319960 127572 49728
20390 49728 67691 -88623 -239560 -196946 -116150 -14121 11216 71513 54830 135921 283060
20379 283060 269617 18940 -90294 -90630 14288 -123249 -208001 -220515 -119858 -191077 67929
20368 67929 95627 15917 94024 -18187 64711 -129660 -152833 -163894 86508 63922 -150415
20357 -150415 -92313 -86858 -107521 32426 243372 345774 436116 512317 508044 335877 98889
20346 98889 139687 255899 147917 58233 -248412 -536124 -410611 -407921 -565227 -580033 -325023
$$ packed form
20421A03891K91859j23507j74810l6148J50500J3446q9289r5262J41397J79803
20411C61880j05911j4090l1836J8602J45092l1839p7650l2709J04874J81577n0695
20400D67295k3612j01457k60285q5604J40347J19404J69692j05820j92388p7844
20390D9728J7963j56314j50937M2614Q0796J02029K5337O0297j6683Q1091J47139
20379B83060j3443k50677j09234l36J04918j37537q4752j2514J00657p1219K59006
20368F7929K7698p9710P8107j12211Q2898j94371k3173j1061K50402k2586k14337
20357a50415N8102N455k0663J39947K10946J02402R0342P6201m273j72167k36988
20346I8889M0798J16212j07982q9684l06645k87712J25513K690j57306j4806K55010
$$ plain form
20335 -325023 54910 266727 303879 361169 264793 60819 164824 224872 24197 -10817
20325 -10817 98223 377175 713825 374820 73488 11692 -167518 -250763 -81764 97785
20315 97785 123643 142614 135045 73581 168571 28297 -147507 -327813 -164981 -177955 -186030
20304 -186030 -160031 -173237 -143495 -147830 65379 -23507 -365452 -326390 -186988 -260140 -230983
20293 -230983 -393311 -463402 -408470 -393477 -346312 -413425 -206758 -71761 -129744 -182022 -45823
20282 -45823 -69964 -105071 -122664 -106735 -21843 107554 389005 433331 281931 112729 90129
20271 90129 34707 22553 63597 44550 59871 159118 349471 237907 -69130 -289242 -285848
20260 -285848 -160910 -50497 -112483 -245187 -193242 -82774 36145 87428 215476 86800
$$ packed form
20335c25023L79933K11817L7152N7290r6376k03974J04005O0048k00675l5014
20325a0817J09040K78952L36650l39005l01332o1796j79210q3245J68999J79549
20315I7785K5858J8971p569o1464R4990j40274j75804j80306J62832j2974q075
20304a86030K5999j3206K9742m335K13209q8886l41945L9062J39402p3152K9157
20293b30983j62328p0091N4932J4993M7165o7113K06667J34997n7983n2278J36199
20282d5823k4141l5107j7593J5929Q4892J29397K81451M4326j51400j69202k2600
20271I0129n5422j2154M1044j9047J5321R9247J90353j11564l07037k20112L394
20260b85848J24938J10413o1986j32704N1945J10468J18919N1283J28048j28676
$$ plain form
20250 86800 65698 247942 241035 93575 14980 22574 -126836 -270136 -265284 -182991 -167639
20239 -167639 -22184 33864 -110356 81668 187033 96603 129353 61745 249117 459265
20229 459265 364274 65854 -73897 260830 90239 -305377 -365074 -236679 -146410 -77955
20219 -77955 -149800 -192965 -280098 -436896 -232984 137973 168247 96380 -102916 -49507 -135009
20208 -135009 -426049 -523918 -461275 -278037 -256746 -307995 51490 -103907 -324112 -253917
20198 -253917 -259581 -234573 -287215 -43042 -82180 -225292 -82912 112486 228678 302127 451021
20187 451021 413617 500600 290405 -112460 119279 220092 52731 -1916 -11560 8203 -213409
20176 -213409 -396490 -167883 37435 -174555 -280721 -487208 -530013 -437103 -185960 27408
$$ packed form
20250H6800k1102J82244o907j47460p8595P594j49410j43300M852Q2293J5352
20239a67639J45455N6048j44220J92024J05365r0430L2750o7608J87372K10148
20229D59265r4991k98420j39751L34727j70591l95616n9697J28395R0269O8455
20219g7955p1845m3165q7133j56798K03912L70957L0274p1867j99296N3409q5502
20208a35009k91040r7869O2643J83238K1291n1249L59485j55397k20205P0195
20198b53917n664K5008n2642K44173l9138j43112J42380J95398J16192P3449J48894
20187D51021l7404Q6983k10195m02865K31739J00813j67361n4647r644J9763k21612
20176b13409j83081K28607K05318k11990j06166k06487m2805R2910K51143K13368
$$ plain form
20166 27408 184867 248968 206803 235651 -47496 -273476 -299872 -73766 38768 144442
20156 144442 248671 207079 212360 341010 395812 175634 96770 71176 -32194 -49285 -177919
20145 -177919 -314400 -372621 -413680 -211954 93566 145809 109700 251337 353268 242704
20135 242704 107985 67125 177529 109204 201989 271114 52923 -99302 -117655 1321
20125 1321 49978 -23511 46239 208150 419995 417414 354500 264625 199657 306079 372799
20114 372799 124328 22652 -82160 30514 107440 348510 339639 440359 291527 167742
20104 167742 10402 -89154 -303371 -223867 -111295 -13757 37585 221197 168753 112655 173433
20093 173433 55760 167714 555969 660643 264459 217916 204229 224530 202047 249019
$$ packed form
20166B7408J57459O4101m2165K8848k83147k25980k6396K26106J12534J05674
20156A44442J04229m1592N281J28650N4802k20178p8864k5594j03370j7091j28634
20145a77919j36481n8221m1059K01726L05520N2243l6109J41637J01931j10564
20135B42704j34719m0860J10404o8325R2785O9125k18191j52225j8353J18976
20125A321M8657p3489O9750J61911K11845k581o2914q9875o4968J06422O6720
20114C72799k48471j01676j04812J12674P6926K41070q871J00720j48832j23785
20104A67742j57340r9556k14217P9504J12572R7538N1342J83612n2444n6098O0778
20093A73433j17673J11954L88255J04674l96184m6543j3687K0301k2483M6972
$$ plain form
20083 249019 339371 427191 388733 368353 361701 283616 389281 167312 -62794 -98844 -140714
20072 -140714 -110906 -189884 -222096 135535 340521 452913 611175 517859 462347 406092 553037
20061 553037 438776 274271 -51986 -177326 155943 353261 335784 473523 514642 285260
20051 285260 83080 224864 112485 191264 145270 74741 99416 -29987 132839 215714
20041 215714 348122 312566 194064 281736 425077 387737 399629 308239 260018 -56443 -271932
20030 -271932 -255689 2793 -19622 -283698 -227113 -224649 -279722 -205310 -79109 -114536 -153645
20019 -153645 -118013 -40500 126406 -1690 -238352 -223513 -111598 106677 83521 48144
20009 48144 77872 -150591 -215768 -162289 -274244 -183424 -174900 22171 289208 419331 340876
$$ packed form
20083B49019R0352Q7820l8458k0380o652p8085J05665k21969k30106l6050m1870
20072a40714K9808p8978l2212L57631K04986J12392J58262r3316n5512n6255J46945
20061E53037j14261j64505l26257j25340L33269J97318j7477J37739M1119k29382
20051B85260k02180J41784j12379P8779m5994p0529K4675j29403J62826Q2875
20041B15714J32408l5556j18502Q7672J43341l7340J1892r1390m8221l16461k15489
20030b71932J6243K58482k2415k64076N6585K464n5073P4412J26201l5427l9109
20019a53645L5632P7513J66906j28096k36662J4839J11915K18275k3156l5377
20009D8144K9728k28463o5177N3479j11955R0820Q524J97071K67037J30123p8455
$$ plain form
19998 340876 181655 237927 33451 44858 -56547 -238212 -33720 304051 145075 -16535
19988 -16535 -109580 29001 123764 -85063 -403938 -198337 -95534 -229842 -233798 -280809 -342466
19977 -342466 -344214 -326818 -171075 -35993 -188683 -250413 -8124 160810 16617 -224422
19967 -224422 -348261 -351772 -238434 -55371 51958 55020 -7798 40783 1386 39151 6845
19956 6845 -30410 -54407 225646 384731 178804 -159961 -160489 101921 198547 219753 207896
19945 207896 414712 450774 355651 173116 -5512 69570 289643 272938 177693 28792
19935 28792 33376 195681 424187 393867 128753 -121954 -161735 -14475 99471 162169 203070
19924 203070 71172 -189449 -349526 -320390 -264626 -367947 -389847 -337493 -301157 -50099
$$ packed form
19998C40876j59221N6272k04476J1407j01405j81665K04492L37771j58976j61610
19988a6535r3045J38581R4763k08827l18875K05601J02803j34308l956m7011o1657
19977c42466j748J7396J55743J35082j52690o1730K42289J68934j44193k41039
19967b24422j23839l511J13338J83063J07329L062o2818M8581l9397L7765l2306
19956F845l7255k3997K80053J59085k05927l38765n28K62410R6626K1206j1857
19945B07896K06816L6062r5123j82535j78628P5082K20073j6705r5245j48901
19935B8792M584J62305K28506l0320k65114k50707l9781J47260J13946O2698M0901
19924B03070j31898k60621j60077K9136N5764j03321k1900N2354L6336K51058
$$ plain form
19914 -50099 101277 8200 -168750 -134335 -149610 -102774 -233112 -493254 -299330 -78860
19904 -78860 30509 15813 172290 139595 31742 146121 20717 -120355 -113911 158743
19894 158743 157353 188245 168148 402979 258030 189321 301162 164000 -13109 146737
19884 146737 260624 77087 -104301 -84263 9318 335073 631573 776870 775625 679541
19874 679541 612118 529225 489924 714033 1084351 1077133 975495 938442 921377 870384 1084346
19863 1084346 1056079 949888 996985 859037 739602 747911 761554 711829 571177 295140
19853 295140 157875 -47598 85872 95170 60086 -62659 -86869 -11973 -13962 126701 335349
19842 335349 324297 62849 -342264 -374882 -67820 82730 -15037 -162356 40763 58963
$$ packed form
19914e0099J51376r3077j76950L4415j5275M6836j30338k60142J93924K20470
19904g8860J09369j4696J56477l2695j07853J14379j25404j41072O444K72654
19894A58743j390L0892k0097K34831j44949o8709J11841j37162j77109J59846
19884A46737J13887j83537j81388K0038R3581L25755K96500J45297j245r6084
19874F79541o7423q2893l9301K24109L70318p218j01638l7053j7065n0993K13962
19863A084346k8267j06191M7097j37948j19435Q309J3643m9725j40652k76037
19853B95140j37265k05473J33470R298l5084j22745k4210P4896j989J40663K08648
19842C35349j1052k61448m05113l2618L07062J50550r7767j47319K03119J8200
$$ plain form
19832 58963 -121171 -172903 -351560 -319403 -38491 122410 183434 633046 839450 956004
19822 956004 924917 1022270 1029595 1058023 1046035 1162319 1062281 1004697 1019692 878557 904814
19811 904814 881631 696749 588196 666382 698812 387576 279504 386752 560762 541894
19801 541894 418186 349643 361874 354582 334602 295328 -24137 -6904 12463 22627 159747
19790 159747 215627 216713 22716 -163316 -15253 78376 99820 -168148 -372742 -204114
19780 -204114 -41512 144052 530505 579752 229698 135427 -52615 -123467 -42690 -29868
19770 -29868 -90736 217408 445366 429398 330793 96779 177803 402806 301310 179515
19760 179515 62379 200391 323600 137451 -64299 -66504 -151565 -104856 -137890 -94951 51108
$$ packed form
19832E8963j80134n1732j78657L2157K80912J60901O1024M49612K06404J16554
19822I56004l1087R7353P325K8428j1988J16284j00038n7584J4995j41135K6257
19811I04814k3183j84882j08553P8186L2430l11236j08072J07248J74010j8868
19801E41894j23708o8543J2231p292j9980l9274l19465J7233J9367J0164J37120
19790A59747N5880J086j93997j86032J48063R3629K1444k67968k04594J68628
19780b04114J62602J85564L86453M9247l50054r4271j88042p0852Q0777J2822
19770b9868o0868L08144K27958j5968r8605k34014Q1024K25003j01496j21795
19760A79515j17136J38012J23209j86149k01750k205q5061M6709l3034M2939J46059
$$ plain form
19749 51108 195932 395369 432073 252680 424094 203572 19181 179753 148954 -11249
19739 -11249 -251076 -194561 -69395 217903 208249 65914 56809 99629 145110 316955 255240
19728 255240 178914 167445 159911 -112195 -104127 -174040 -239087 -325926 -190698 -157799 -213701
19717 -213701 -268612 -314808 -222731 -124505 -270180 -509406 -562010 -379066 -205065 -136662 -350824
19706 -350824 -171198 -129781 -186300 69885 172460 126788 77245 154480 253488 201211 -55180
19695 -55180 21629 207309 468295 395302 226044 171311 44947 -136777 37117 140690
19685 140690 -44506 -37084 108718 207153 2077 71240 137272 80795 82593 -80703 -34449
19674 -34449 10955 117893 181091 -27540 -122297 38231 39695 190498 507678 477344 392841
$$ packed form
19749E1108J44824J99437L6704j79393J71414k20522j84391J60572l0799j60203
19739a1249k39827N6515J25166K87298r654j42335r105M2820M5481J71845o1715
19728B55240p6326j1469p534k72106Q068o9913o5047q6839J35228L2899n5902
19717b13701n4911m6196R2077R8226j45675k39226n2604J82944J74001O8403k14162
19706c50824J79626M1417n6519K56185J02575m5672m9543P7235R9008n2277k56391
19695e5180P6809J85680K60986p2993j69258n4733j26364j81724J73894J03573
19685A40690j85196P422J45802R8435k05076O9163O6032n6477J798j63296M6254
19674c4449M5404J06938O3198k08631r4757J60528J464J50803L17180l0334q4503
$$ plain form
19663 392841 514410 426788 115100 210959 195572 33682 -236968 -182961 -113752 -8930
19653 -8930 -52296 -193894 -92903 128804 194701 173615 24056 158662 -7571 -175354
19643 -175354 -54833 100826 48482 -87788 -347032 -286283 -149259 -71465 119322 202916
19633 202916 36540 111874 292107 374090 159550 92267 213652 105239 -141999 -371636
19623 -371636 -223956 -78018 228101 482815 590270 701320 665769 734959 651065 630671
19613 630671 691390 673730 876410 855354 964755 1165051 1116748 728852 556190 543563
19603 543563 572158 684714 775185 827344 664658 361283 460520 329680 417626 256030
19593 256030 221471 26083 -230664 -313726 -264321 -43210 161803 115580 156409 80017 310991
$$ packed form
19663C92841J21569q7622l11688R5859j5387j61890k70650N4007O9209J04822
19653h930m3366j41598J00991K21707O5897k1086j49559J34606j66233j67783
19643a75354J20521J55659n2344j36270k59244O0749J37024P7794J90787Q3594
19633B02916j66376P5334J80233Q1983k14540o7283J21385j08413k47238k29637
19623c71636J47680J45938L06119K54714J07455J11050l5551O9190q3894k0394
19613F30671O0719j7660K02680k1056J09401K00296m8303l87896j72662j2627
19603E43563K8595J12556R0471N2159j62686l03375R9237j30840Q7946j61596
19593B56030l4559j95388k56747q3062M9405K21111K05013m6223M0829p6392K30974
$$ plain form
19582 310991 337061 469113 504172 460219 185936 315448 432348 242878 102300 -94576
19572 -94576 40040 132506 189670 242095 429069 257305 242388 436110 353305 350207 498607
19561 498607 602367 805206 1101824 1219777 1194356 1427404 1496624 1161353 1209949 1098635
19551 1098635 784165 536512 677788 850208 764130 488221 535635 473239 279775 79464
19541 79464 196590 632350 691772 457007 414864 330716 467641 445122 418331 258424 310422
19530 310422 406542 669725 751540 403192 243301 265314 339367 516670 401369 279440
19520 279440 244736 116199 -1765 -8751 -177912 -305884 -39137 23245 62238 239775
19510 239775 390500 301741 226247 159420 262449 470616 472102 336457 192170 206206 168720
$$ packed form
19582C10991K6070J32052L5059m3953k74283J29512J16900j89470j40578j96876
19572i4576J34616R2466N7164N2425J86974j71764j4917J93722q2805l098J48400
19561D98607J03760K02839K96618J17953k5421K33048O9220l35271M8596j11314
19551A098635l14470k47653J41276J72420q6078k75909M7414o2396j93464k00311
19541G9464J17126M35760N9422k34765m2143q4148J36925k2519k6791j59907N1998
19530C10422R6120K63183Q1815l48348j59891K2013P4053J77303j15301j21929
19520B79440l4704j28537j17964o986j69161j27972K66747O2382L8993J77537
19510B39775J50725q8759p5494o6827J03029K08167J486j35645j44287J4036l7486
$$ plain form
19499 168720 157008 209174 113703 172709 202311 153547 141021 216037 340119 302868 196187
19488 196187 -42006 19159 169712 285255 447327 437865 557326 611671 581862 369938
19478 369938 456192 696120 518816 357535 258263 167181 137961 53082 182371 322872
19468 322872 289848 252540 234467 281655 242397 144186 -7605 -35076 38901 36282 -88075
19457 -88075 201291 548680 330552 236667 376422 469017 510990 402720 399204 568558 480522
19446 480522 245182 390242 907595 974236 804210 636201 459681 425326 427701 490961
19436 490961 712081 959807 856150 557061 577696 644300 707255 714813 1048296 1171375
19426 1171375 1050163 1042467 1109643 879236 904982 1219640 1366799 1516693 1681463 1800160
$$ packed form
19499A68720j1712N2166r5471N9006K9602m8764j2526P5016J24082l7251j06681
19488A96187k38193O1165J50553J15543J62072r462J19461N4345k9809k11924
19478C69938Q6254K39928j77304j61281r9272r1082k9220q4879J29289J40501
19468C22872l3024l7308j8073M7188l9258r8211j51791k7471P3977k619j24357
19457h8075K89366L47389k18128r3885J39755R2595M1973j08270l516J69354q8036
19446D80522k35340J45060N17353O6641j70026j68009j76520l4355K375O3260
19436D90961K21120K47726j03657k99089K0635O6604O2955P558L33483J23079
19426A171375j21212p696O7176k30407K5746L14658J47159J49894J64770J18697
$$ plain form
19416 1800160 1581004 1386973 1280477 1303350 1152498 1139640 1213522 1099574 820682 666473
19406 666473 806093 954118 1231815 1327032 1050781 1248042 1438063 1637323 1652090 1595230
19396 1595230 1755139 1897684 2058278 2216687 2291278 2046824 1869112 1983424 1965911 1997462
19386 1997462 2279879 2410654 2561441 2621332 2883304 3154938 3577919 4030479 4336155 4468494
19376 4468494 4695425 4890999 5096547 5419481 5877154 6348449 6803516 7225722 8053695
19367 8053695 9358584 10668219 12219037 14124234 16570052 20139864 24947667 31277693
19359 31277693 39242818 49244897 61946659 76693274 90978139 103151281 114416011
19352 114416011 122809667 125705951 128113338 131757722 136580606 137677743 130486947 123010108
$$ packed form
19416A800160k19156j94031j06496K2873j50852j2858P3882j13948k78892j54209
19406F66473J39620J48025K77697R5217k76251J97261J90021J99260J4767n6860
19396A595230J59909J42545J60594J58409P4591k44454j77712J14312j7513L1551
19386A997462K82417J30775J50787N9891K61972K71634M22981M52560L05676J32339
19376D468494K26931J95574K05548L22934M57673M71295M55067M22206Q27973
19367H053695J304889J309635J550818J905197K445818L569812M807803O330026
19359C1277693P965125J0002079J2701762J4746615J4284865J2173142J1264730
19352A14416011Q393656K896284K407387L644384M822884J097137p190796p476839
$$ plain form
19344 123010108 119364394 113411325 104557289 100053538 98135913 94487882 89430945 79450683
19336 79450683 62460568 47632865 38443775 33025826 29841967 27975359 26479056 25366264
19328 25366264 24474772 23885180 23459608 23298799 23094510 22674292 22563381 22349034 22272524
19319 22272524 22442409 22523360 22722936 23484760 24647198 26200726 28333357 31293481 34996398
19310 34996398 39571115 45696640 54277518 66002728 80733536 98595148 117560830
19303 117560830 134348809 149385163 160665482 161600898 157001115 155168324 152127619 146270493
19295 146270493 143726846 144203350 146191097 145536390 137882572 128076033 118257321 108105189
19287 108105189 93390322 72539782 55547876 44830826 38376898 34244170 31334772
$$ packed form
19344A23010108l645714n953069q854036m503751j917625l648031n056937r980262
19336G9450683j6990115j4827703r189090n417949l183859j866608j496303j112792
19328B5366264q91492n89592m25572j60809k04289m20218j10911k14347p6510
19319B2272524J69885Q0951J99576P61824J162438J553528K132631K960124L702917
19310C4996398M574717O125525Q580878J1725210J4730808J7861612J8965682
19303A17560830J6787979J5036354J1280319R35416m599783j832791l040705n857126
19295A46270493k543647M76504J987747o54707p653818r806539r818712j0152132
19287A08105189j4714867k0850540j6991906j0717050o453928m132728k909398
$$ plain form
19280 31334772 29012984 27260350 25781375 24737298 23933782 23471508 23068588 22135682 21103415
19271 21103415 20436957 20105287 19649546 18655728 17813865 17290444 16930470 16269054 15550199
19262 15550199 14986025 14440732 13669791 13128918 12338960 11286357 10334325 9749229 9357281
19253 9357281 8799187 8583303 8361043 7920760 7726135 7402942 7222619 6868706 6510729
19244 6510729 6048368 5605363 4850416 4556395 4496225 4555238 4369587 3891317 3592422 3516511
19234 3516511 3432235 3416452 3455718 3298506 3115594 2956410 2920937 3172662 3002677 2858903
19224 2858903 2887891 3202139 3535493 3825358 3719938 3595508 3443877 3204255 3159813 2971408
19214 2971408 2897229 2636870 2606788 2391002 2333052 2512573 2529713 2541898 2435920 2212082
$$ packed form
19280C1334772k321788j752634j478975j044077q03516m62274m02920r32906j032267
19271B1103415o66458l31670m55741r93818q41863n23421l59974o61416p18855
19262A5550199n64174n45293p70941n40873p89958j052603r52032n85096l91948
19253I357281n58094k15884k22260m40283j94625l23193j80323l53913l57977
19244F510729m62361m43005p54947k94021o0170N9013j85651m78270k98895p5911
19234C516511q4276j5783L9266j57212j82912j59184l5473K51725j69985j43774
19224B858903K8988L14248L33354K89865j05420j24430j51631k39622m4442j88405
19214B971408p4179k60359l0082k15786n7950J79521J7140J2185j05978k23838
$$ plain form
19204 2212082 2209406 2304739 1884327 1650649 1620073 1613650 1541776 1329740 1234307 1308408 1164491
19193 1164491 928074 933376 1119841 1123725 1302913 1450076 1587355 1511886 1606731 1465625
19183 1465625 1089859 1010640 1211931 1465762 1492920 1333656 1291165 1483185 1784611 1749029
19173 1749029 1769566 1589205 1744467 1920629 2015218 2238983 2344538 2366590 2363407 2580227
19163 2580227 2731620 2564196 2304693 2099120 1882632 1798083 1700604 1629764 1725108 1509656
19153 1509656 1690707 1744860 1742356 1805491 1958303 1958240 1827701 1967148 2028969 2258302 2244951
19142 2244951 2175967 2297950 2388245 2219636 2199865 2272491 2490980 2590852 2334444 2282681
19132 2282681 2179210 1904156 1803575 1900916 2154253 2412964 2486661 2349914 2455909 2705800
$$ packed form
19204B212082k676R5333m20412k33678l0576o423p1874k12036r5433P4101j43917
19193A164491k36417N302J86465L884J79188J47163J37279p5469R4845j41106
19183A465625l75766p9219K01291K53831K7158j59264m2491J92020L01426l5582
19173A749029K0537j80361J55262J76162R4589K23765J05555K2052l183K16820
19163B580227J51393j67424k59503k05573k16488q4549r7479p0840R5344k15452
19153A509656J81051N4153k504O3135J52812o3j30539J39447O1821K29333j3351
19142B244951o8984J21983R0295j68609j9771P2626K18489R9872k56408n1763
19132B282681j03471k75054j00581R7341K53337K58711P3697j36747J05995K49891
$$ plain form
19122 2705800 2918928 3149439 3218094 3084283 3088152 3291821 3642156 4025455 4239359 4431699
19112 4431699 4569091 4960858 5645287 6259548 7055631 7693210 8738271 10220289 11711789
19103 11711789 13603592 16080553 19722570 24227323 30048357 37822746 47463078 59257605
19095 59257605 73377230 87398476 99580741 111077875 119650847 122653030 125336154
19088 125336154 129546493 136262008 141167448 139265241 136380862 135477164 130450654 117058555
19080 117058555 102628210 89247028 72135575 55424126 44018873 36674657 32071788
19073 32071788 29163331 27184382 25615648 24508540 23823555 23665674 23462644 23080866 22934435
19064 22934435 23147302 23152198 23030288 22747042 22581879 22433181 22205359 22561781 23303008 24314079
$$ packed form
19122B705800K13128K30511O8655j33811L869K03669L50335L83299K13904J92340
19112D431699J37392L91767O84429O14261P96083O37579J045061J482018J491500
19103A1711789J891803K476961L642017M504753N821034P774389R640332J1794527
19095E9257605J4119625J4021246J2182265J1497134Q572972L002183K683124
19088A25336154M210339O715515M905440j902207k884379r03698n026510j3392099
19080A17058555j4430345j3381182j7111453j6711449j1405253p344216m602869
19073C2071788k908457j978949j568734j107108o84985j57881k03030l81778j46431
19064B2934435K12867M896j21910k83246j65163j48698k27822L56422P41227J011071
$$ plain form
19054 24314079 25357775 27009447 29526077 32808961 37074601 43636191 53143842 65110823
19046 65110823 79835726 96689878 112196430 124102719 134583316 142128271 143803019
19039 143803019 149920333 162252598 175244391 187631189 194211068 187079932 176714915
19032 176714915 165791672 151098854 137137228 124773329 113189486 95542615 73741021
19025 73741021 57306388 46856017 40252795 35848756 32937718 31186272 29952565 28757445
19017 28757445 27548142 26369894 25544674 24790658 24096684 23503597 22792009 22231789 21419159
19008 21419159 20217887 18888386 17708815 16759597 15902557 14910562 14070682 13225058 12329164
18999 12329164 11393958 10683447 10184603 9565048 8786428 8267497 7966425 7505076 7047586
$$ packed form
19054B4314079J043696J651672K516630L282884M265640O561590R507651J1966981
19046F5110823J4724903J6854152J5506552J1906289J0480597P544955J674748
19039A43803019O117314J2332265J2991793J2386798O579879p131136j0365017
19032A76714915j0923243j4692818j3961626j2363899j1583843j7646871k1801594
19025G3741021j6434633j0450371o603222m404039k911038j751446j233707j195120
19017B8757445j209303j178248q25220p54016o93974n93087p11588n60220q12630
19008B1419159j201272j329501j179571r49218q57040r91995q39880q45624q95894
18999A2329164r35206p10511m98844o19555p78620n18931l01072m61349m57490
$$ plain form
18990 7047586 6770078 6484249 6215905 5834840 5450505 5073319 4753019 4389913 4257717
18981 4257717 4316339 4308694 4253062 4221671 4184949 3862245 3493308 3351427 3332920 3215801 3233612
18970 3233612 3308342 3258479 3352107 3253409 3063172 3109856 3287128 3464013 3360583 2865124
18960 2865124 2290961 1990517 1942975 1997236 1742725 1536673 1450649 1455137 1397777 1444293 1382284
18949 1382284 1240587 1084505 1115428 1527319 1543681 1492892 1262275 1183345 1138638 1181500
18939 1181500 1108238 936556 964952 895374 893791 879746 893622 744176 583066 446870 802381
18928 802381 1023631 1003266 684377 764841 910151 1088607 1104762 1050613 1147450 1309558
18918 1309558 1569353 1694424 1497247 1219026 1000357 897610 972300 610822 187582 254347
$$ packed form
18990G047586k77508k85829k68344l81065l84335l77186l20300l63106j32196
18981D257717N8622p645n5632l1391l6722l22704l68937j41881j8507j17119J7811
18970C233612P4730m9863R3628r8698j90237M6684J77272J76885j03430m95459
18960B865124n74163l00444m7542N4261k54511k06052q6024M488n7360M6516o2009
18949A382284j41697j56082L0923M11891J6362n0789k30617p8930m4707M2862
18939A181500p3262j71682K8396o9578j583j4045J3876j49446j61110j36196L55511
18928H02381K21250k0365l18889Q0464J45310J78456J6155n4149R6837J62108
18918A309558K59795J25071j97177k78221k18669j02747P4690l61478m23240O6765
$$ plain form
18908 254347 497987 477527 465355 451757 423989 187163 44528 223347 255901 453340
18898 453340 607415 456436 549897 723188 548141 376644 450566 577082 645046 563964
18888 563964 360222 371869 576205 848380 861921 814462 939622 828061 890240 927528
18878 927528 985590 972731 824733 686561 1017037 1203115 1251813 1139897 857537 648818
18868 648818 503785 511480 611323 629299 614525 498805 656637 685520 739063 482322 464072
18857 464072 362230 449560 508834 454138 489903 662220 684560 619342 507761 433414 407530
18846 407530 468426 442134 555921 662838 716026 653200 862757 1164487 1148807 1028185
18836 1028185 1063785 1221712 1383366 1561091 1480650 1443590 1492755 1545918 1529026 1514250 1241249
$$ packed form
18908B54347K43640k0460j2172j3598k7768k36826j42635J78819L2554J97439
18898D53340J54075j50979R3461J73291j75047j71497P3922J26516O7964q1082
18888E63964k03742J1647K04336K72175J3541m7459J25160j11561O2179L7288
18878I27528N8062j2859j47998j38172L30476J86078M8698j11916k82360k08719
18868F48818j45033P695R9843J7976j4774j15720J57832K8883N3543k56741j8250
18857D64072j01842Q7330N9274n4696L5765J72317K2340o5218j11581p4347k5884
18846D07530O0896k6292J13787J06917N3188o2826K09557L01730j5680j20622
18836A028185L5600J57927J61654J77725q0441l7060M9165N3163j6892j4776k73001
$$ plain form
18825 1241249 1138064 1001820 956296 1169731 1065125 776605 685098 898340 1253792 1267275
18815 1267275 1201928 1072785 1022279 944845 980583 743100 660016 622785 944683 983538 872679
18804 872679 1073056 1143886 954279 781497 681248 821079 885220 848717 1067522 1056741
18794 1056741 830244 966304 1083822 1077898 1222242 1183179 1093136 1235492 1441288 1749515
18784 1749515 2227550 2367939 2335960 2622033 2797781 2731780 2651895 2593147 2728831 2660170
18774 2660170 2812690 3210868 3424438 3674122 4114198 4213970 4245712 4592247 4913668 5286808
18764 5286808 5529502 5649909 5766411 6071889 6887991 7707598 8617782 9929239 11975974
18755 11975974 14607590 18249058 23297146 29716133 37711630 46656734 55050549 60640882
$$ packed form
18825A241249j03185j36244m5524K13435j04606k88520r1507K13242L55452J3483
18815A267275o5347j29143n0506p7434L5738k37483q3084l7231L21898L8855j10859
18804H72679K00377P0830j89607j72782j00249J39831O4141l6503K18805j0781
18794A056741k26497J36060J17518n924J44344l9063r0043J42356K05796L08227
18784A749515M78035J40389l1979K86073J75748o6001p9885n8748J35684o8661
18774B660170J52520L98178K13570K49684M40076R9772L1742L46535L21421L73140
18764E286808K42694J20407J16502L05478Q16102Q19607R10184J311457K046735
18755A1975974K631616L641468N048088O418987P995497Q945104Q393815N590333
$$ plain form
18747 60640882 63530998 63742357 58678349 53133675 52279262 55718747 61605787 66581829
18739 66581829 67854647 66533961 60708537 47693146 35122491 26859396 21849409 18854927
18731 18854927 16888227 15799439 15147609 14608333 14296103 14108453 13939048 13949029 13716742
18722 13716742 13791884 13663082 13633584 14222607 14989736 15982264 17459515 19217056 21650149
18713 21650149 24542775 27966588 32465635 38314562 46088635 56733318 70611949 87448825
18705 87448825 106759260 124982053 136923838 143835397 144952378 135266593 125333010 123340859
18697 123340859 127994237 135465272 138925300 136527063 132123973 122199176 104118226 89005264
18689 89005264 80349061 74199600 69031236 63685021 54615052 44483502 37242724 32383486
$$ packed form
18747F0640882K890116K11359n064008n544674q54413L439485N887040M976042
18739F6581829J272818j320686n825424j3015391j2570655q263095n009987k994482
18731A8854927j966700j088788o51830n39276l12230j87650j69405R981k32287
18722A3716742P5142j28802k9498N89023P67129R92528J477251J757541K433093
18713B1650149K892626L423813M499047N848927P774073J0644683J3878631J6836876
18705H7448825J9310435J8222793J1941785O911559J116981r685785r933583j992151
18697A23340859M653378P471035L460028k398237m403090r924797j8080950j5112962
18689H9005264q656203o149461n168364n346215r069969j0131550p240778m859238
$$ plain form
18681 32383486 29617374 27897950 26724816 25886798 24964551 24181744 23574687 23071129 22542596
18672 22542596 22058988 21973888 22152354 22297519 22528084 22632606 22897526 23818861 25454008
18663 25454008 27703556 30439128 33781595 38277408 44374298 53313186 65197092 79305909
18655 79305909 95316920 109481316 117158295 119489770 115111488 99551273 83906268
18648 83906268 76901649 77633696 83389406 92057328 100457790 104064230 103350275 97758894
18640 97758894 82529201 65688403 55040512 49924010 48403971 49859847 54069500 61159785
18632 61159785 71491224 85120974 101750814 119418131 132307211 138492166 140234945
18625 140234945 132689992 118423694 110656706 112331336 120528511 130692235 135946108 134505819
$$ packed form
18681C2383486k766112j719424j173134q38018r22247p82807o07057n03558n28533
18672B2542596m83608q5100J78466J45165K30565J04522K64920R21335J635147
18663B5454008K249548K735572L342467M495813O096890Q938888J1883906J4108817
18655G9305909J6011011J4164396P676979K331475m378282j5560215j5645005
18648H3906268p004619P32047N755710Q667922Q400462L606440p13955n591381
18640I7758894j5229693j6840798j0647891n116502j520039J455876M209653P090285
18632F1159785J0331439J3629750J6629840J7667317J2889080O184955J742779
18625A40234945p544953j4266298p766988J674630Q197175J0163724N253873j440289
$$ plain form
18617 134505819 127317208 107673699 81684455 62109942 49954883 42567286 37897929
18610 37897929 34391107 31803441 30018204 28689515 27504399 26673543 26132114 25965953
18602 25965953 25820162 25362824 25022679 24851418 24743208 24960923 25222278 25370325 25990902
18593 25990902 26639208 27442152 28808428 30883818 33828225 38137345 44796274 53352244
18585 53352244 63323719 74456601 84514002 93174229 102072052 108671461 114773871 125416338
18577 125416338 137549784 146992319 153964945 154416057 145485535 137338999 132156413 128628217
18569 128628217 124120360 117514585 108611227 90710299 69097021 53765039 44356218
18562 44356218 38544474 34866958 32141823 29846045 28239087 27159105 25922743 24643683
$$ packed form
18617A34505819p188611j9643509k5989244j9574513j2155059p387597m669357
18610C7897929l506822k587666j785237j328689j185116q30856n41429j66161
18602B5965953j45791m57338l40145j71261j08210K17715K61355J48047O20577
18593B5990902O48306Q02944J366276K075390K944407M309120O658929Q555970
18585E3352244R971475J1132882J0057401Q660227Q897823O599409O102410J0642467
18577A25416338J2133446R442535O972626M51112q930522q146536n182586l528196
18569A28628217m507857o605775q903358j7900928k1613278j5331982r408821
18562D4356218n811744l677516k725135k295778j606958j079982j236362j279060
$$ plain form
18554 24643683 23891498 23364695 23261411 23235691 23376622 23231516 22566235 21609785 20988429
18545 20988429 20428942 20090329 20116633 20469014 21115683 21742228 23111678 25122935 28074486
18536 28074486 32452127 38353013 45615711 53535812 59770529 62999989 64804473 63388071
18528 63388071 57521979 53841023 53815796 55338390 55396462 53823181 49937852 40782891 30641407
18519 30641407 23668297 19384548 16859118 15284377 14071459 13022416 12129534 11379758
18511 11379758 11021818 10535760 9988737 9796531 9858409 9510060 9149117 8827196 8629422
18502 8629422 8613041 8618545 8304624 7758758 7391337 6925151 6494336 6169078 5839076 5318530
18492 5318530 4954061 4700753 4454866 4235306 3833103 3471359 3281869 3205341 3221587 3121957
$$ packed form
18554B4643683p52185n26803j03284k5720J40931j45106o65281r56450o21356
18545B0988429n59487l38613K6304L52381O46669O26545J369450K011257K951551
18536B8074486M377641N900886P262698P920101O234717L229460J804484j416402
18528F3388071n866092l680956k5227J522594N8072j573281l885329r154961j0141484
18519C0641407o973110m283749k525430j574741j212918j049043q92882p49776
18511A1379758l57940m86058n47023j92206O1878l48349l60943l21921j97774
18502H629422j6381N504l13921n45866l67421m66186m30815l25258l30002n20546
18492E318530l64469k53308k45887k19560m02203l61744j89490p6528J6246r9630
$$ plain form
18482 3121957 3051516 3138214 2966002 2843971 2722315 2602084 2523377 2435892 2244734 2043650
18472 2043650 2115609 2094566 2302126 2466181 2431819 2186666 2038622 1836248 1684169 1213113
18462 1213113 1218959 1566246 1556366 1246558 1105498 1398406 1334841 1099653 998791 984294
18452 984294 1244019 1663410 1700745 1432887 1220261 1064901 1066518 1046338 1165716 1201313
18442 1201313 1013879 759512 485775 519736 662395 798579 525979 435068 578182 663569
18432 663569 518816 513663 616925 700671 739897 902220 1228893 1211450 899902 812867 900231
18421 900231 848554 873416 850616 758013 594870 579648 851514 962774 751318 532759
18411 532759 414415 581688 578913 444072 499038 273964 256075 355898 428765 744016 901018
$$ packed form
18482C121957p0441Q6698j72212j22031j21656j20231p8707q7485j91158k01084
18472B043650P1959k1043K07560J64055l4362k45153j48044k02374j52079m71056
18462A213113N846L47287r880l09808j41060K92908o3565k35188j00862j4497
18452I84294K59725M19391L7335k67858k12626j55360J617k0180J19378L5597
18442A201313j87434k54367k73737L3961J42659J36184k72600r0911J43114Q5387
18432F63569j44753n153J03262Q3746L9226J62323L26673j7443l11548q7035Q7364
18421I00231n1677K4862k2800r2603j63143j5222K71866J11260k11456k18559
18411E32759j18344J67273k775j34841N4966k25074j7889R9823P2867L15251J57002
$$ plain form
18400 901018 886399 938836 860257 797302 599567 528484 399736 345493 422098 351950 363099
18389 363099 257274 425370 701484 886953 924343 1085754 913102 637685 575735 700871
18379 700871 722545 407427 374167 304701 281403 130601 156695 115658 70686 428267 233993
18368 233993 57493 222283 363393 460123 417829 432380 507594 740137 742946 720324 818049
18357 818049 705087 523694 312391 242318 225682 414597 430228 526179 489113 635296
18347 635296 537638 386273 286377 331688 288540 242454 222894 310468 326273 349635 563189
18336 563189 437673 101870 83259 201242 142924 240264 499453 433162 280148 -38346
18326 -38346 -172002 11781 416465 665207 657823 325007 21775 -10339 84604 198588
$$ packed form
18400I01018j4619N2437p8579o2955j97735p1083j28748n4243P6605p0148J1149
18389C63099j05825J68096K76114J85469L7390J61411j72652k75417o1950J25136
18379G00871K1674l15118l3260o9466k3298j50802K6094m1037m4972L57581j94274
18368B33993j76500J64790J41110R6730m2294J4551P5214K32543K809k2622R7725
18357H18049j12962j81393k11303p0073j6636J88915J5631R5951l7066J46183
18347F35296r7658j51365r9896M5311m3148m6086j9560Q7574J5805K3362K13554
18336E63189j25516l35803j8611J17983n8318R7340K59189o6291j53014l18494
18326c8346j33656J83783M04684K48742p384l32816l03232l2114R4943J13984
$$ plain form
18316 198588 178831 288350 326603 320049 227715 315715 207504 305092 -84759 -392111 -357915
18305 -357915 -163142 -124315 -153360 -149593 -221605 -170187 -216531 -125433 127395 727441 912660
18294 912660 698924 465327 308661 206231 119456 214187 48829 -205028 -57695 -56428
18284 -56428 -114258 -100098 74756 112907 21790 133345 261920 444186 390200 216825 596487
18273 596487 575296 463292 442864 365023 385939 336221 418344 432666 175152 34513 -95015
18262 -95015 102774 315061 404028 49205 -8601 343572 501186 694759 672041 424858
18252 424858 182122 180504 226370 256804 407499 601596 387227 343144 395869 560359 567700
18241 567700 580845 609137 690062 570786 528057 815169 950466 889018 626652 660716 658372
$$ packed form
18316A98588j9757J09519L8253o554r2334Q8000j08211R7588l89851l07352L4196
18305c57915J94773L8827k9045L767p2012N1418m6344R1098K52828O00046J85219
18294I12660k13736k33597j56666j02430q6775R4731j65358k53857J47333J267
18284e6428n7830J4160J74854L8151r1117J11555J28575J82266n3986j73375L79662
18273E96487k1191j12004k0428p7841K0916m9718Q2123J4322k57514j40639j29528
18262i5015J97789K12287Q8967l54823n7806L52173J57614J93573k2718k47183
18252D24858k42736j618M5866L0434J50695J94097k14369m4083N2725J64490P341
18241E67700J3145K8292Q0925j19276m2729K87112J35297o1448k62366L4064k344
$$ plain form
18230 658372 530075 398420 514759 672625 578681 513396 602706 638481 784957 888390
18220 888390 942820 810454 725402 677106 433089 388629 405176 682022 661507 780559 527428
18209 527428 156197 -6430 319926 177788 67131 301754 513297 645873 532962 350170
18199 350170 211573 43459 125945 555421 581736 383365 530118 820102 639559 495776
18189 495776 389446 545254 782758 708194 889680 1197824 1370957 1513667 1459488 1487086
18179 1487086 1311011 1448887 1496499 1423855 1405219 1392976 1217363 1081172 1186507 1190252
18169 1190252 1213399 1264737 1315888 1263792 1205455 1215333 1126393 1034884 1039426 1069443 1423904
18158 1423904 1448427 1353628 1265955 1354665 1377281 1311665 1315773 1180549 1061180 1167688 1235764
$$ packed form
18230F58372j28297j31655J16339J57866r3944o5285Q9310L5775J46476J03433
18220H88390N4430j32366q5052m8296k44017m4460J6547K76846k0515J19052k53131
18209E27428l71231j62627L26356j42138j10657K34623K11543J32576j12911j82792
18199C50170j38597j68114Q2486M29476K6315j98371J46753K89984j80543j43783
18189D95776j06330J55808K37504p4564J81486L08144J73133J42710n4179K7598
18179A487086j76075J37876M7612p2644j8636j2243j75613j36191J05335L745
18169A190252K3147N1338N1151n2096n8337R878q8940r1509M542L0017L54461
18158A423904K4523r4799q7673Q8710K2616o5616M108j35224j19369J06508O8076
$$ plain form
18147 1235764 961962 1076255 1459068 1588381 1403774 1368795 1279426 1556434 1638686 1904145
18137 1904145 2091025 2293140 2193974 2240486 2460712 2640520 2950565 3025229 3288633 3891463
18127 3891463 4361314 4975685 6050079 7114544 8395231 10292850 12700557 15711755
18119 15711755 19657138 25072889 31814759 39767407 49722673 63199861 81725689 107992671
18111 107992671 143028770 186442372 236925290 279315440 295671742 296170188 275437818
18104 275437818 203303971 130986078 88496300 64787887 50435962 41408270 35295655
18097 35295655 30959463 27574634 25342741 23826669 22649936 21452995 20414957 19385102
18089 19385102 18522992 18055200 18018013 17860171 17681377 17705032 17999835 18225731 17735131 16644478
$$ packed form
18147A235764k73802J14293L82813J29313j84607l4979q9369K77008Q2252K65459
18137A904145J86880K02115r9166M6512K20226J79808L10045P4664K63404O02830
18127C891463M69851O14371J074394J064465J280687J897619K407707L011198
18119A5711755L945383N415751O741870P952648R955266J3477188J8525828K6266982
18111A07992671L5036099M3413602N0482918M2390150J6356302M98446k0732370
18104B75437818p2133847p2317893m2489778k3708413j4351925r027692o112615
18097C5295655m336192l384829k231893j516072j176733j196941j038038j029855
18089A9385102q62110m67792l7187j57842j78794K3655K94803K25896m90600j090653
$$ plain form
18079 16644478 15571255 14671175 13715509 12604561 11849285 11265421 10683828 10155076 9567269
18070 9567269 9075878 8550241 7897014 7593855 7468537 7097008 6789180 6514966 6332816
18061 6332816 6183151 5881601 5483606 5108022 4695836 4217150 3750159 3448513 3487104 3348360
18051 3348360 3045170 2839969 2703014 2611690 2519859 2294804 1912346 1799514 1804690 1835963
18041 1835963 1835184 1796653 1660393 1382049 1216370 1385909 1512869 1516783 1442040 1503221 1567821
18030 1567821 1388484 1162121 781653 879018 1007969 843323 666198 782005 972392 1155113
18020 1155113 1229801 1252120 1504860 1664515 1333630 1243603 1351733 1521710 1410419 1223320
18010 1223320 797200 515668 711183 823912 859447 848559 773895 695115 673641 581593
$$ packed form
18079A6644478j073223r00080r55666j110948p55276n83864n81593n28752n87807
18070I567269m91391n25637o53227l03159j25318l71529l07828k74214j82150
18061F332816j49665l01550l97995l75584m12186m78686m66991l01646L8591j38744
18051C348360l03190k05201j36955r1324r1831k25055l82458j12832N176L1273
18041A835963p79l8531j36260k78344j65679J69539J26960L914p4743O1181O4600
18030A567821j79337k26363l80468R7365J28951j64646j77125J15807J90387J82721
18020A155113P4688K2319K52740J59655l30885r0027J08130J69977j11291j87099
18010A223320m26120k81532J95515J12729L5535j0888p4664p8780k1474r2048
$$ plain form
18000 581593 364284 194930 275147 216413 289110 244871 125581 220301 229501 206347 116221
17989 116221 412960 510557 445899 571734 500210 482081 492178 254375 111068 221108
17979 221108 217643 371500 331424 109050 203081 140673 225467 162872 -110708 -260469 3397
17968 3397 210509 209177 110347 11016 146264 351678 230573 240096 374456 238056 181879
17957 181879 131035 130521 14549 78844 144529 266520 164907 191912 485044 298149 54903
17946 54903 218072 353399 548782 587623 629900 507455 314554 274379 205148 271225 239158
17935 239158 138964 219410 187030 -1347 87307 556259 620681 283570 290010 218969 223495
17924 223495 357977 318850 200778 157905 400496 461524 339423 432427 575515 621020
$$ packed form
18000E81593k17309j69354Q0217n8734P2697m4239j19290R4720R200k3154r0126
17989A16221K96739R7597o4658J25835p1524j8129J0097k37803j43307J10040
17979B21108l465J53857m0076k22374R4031o2408Q4794o2595k73580j49761K63866
17968C397K07112j332r8830r9331J35248K05414j21105R523J34360j36400n6177
17957A81879n0844n14j15972O4295O5685J21991j01613K7005K93132j86895k43246
17946E4903J63169J35327J95383L8841M2277j22445j92901m0175o9231O6077l2067
17935B39158j00194Q0446l2380j88377Q8654M68952O4422l37111O440p1041M526
17924B23495J34482l9127j18072m2873K42591O1028j22101R3004J43088M5505
$$ plain form
17914 621020 875276 962152 808700 507360 354368 474163 495406 411262 195148 49939
17904 49939 23633 164212 323153 191317 17181 -76433 -29726 4425 -18429 174345 184352
17893 184352 73927 125559 186485 -42375 -77892 -95921 -264297 -203414 -132738 -145702 -232247
17882 -232247 -286102 62151 285336 325592 64408 23631 48197 -107666 -123333 -61918 -158309
17871 -158309 -104887 3655 74138 196854 353624 356549 352165 382900 176744 255225 194077
17860 194077 128594 99310 92675 -52678 4169 297985 348216 110085 -129413 -218673 77213
17849 77213 172745 135422 233791 166174 84158 290278 514044 628294 534018 405711 289941
17838 289941 39495 -142714 -295877 -331771 -325826 -198763 -274610 -145158 27614 -53355
$$ packed form
17914F21020K54256Q6876j53452l01340j52992J19795K1243q4144k16114j45209
17904D9939k6306J40579J58941j31836j74136r3614M6707L4151k2854J92774J0007
17893A84352j10425N1632O0926k28860l5517j8029j68376O0883P0676j2964q6545
17882b32247n3855L48253K23185M0256k61184m0777K4566j55863j5667O1415r6391
17871a58309N3422J08542P0483J22716J56770K925m384L0735k06156P8481o1148
17860A94077o5483k9284o635j45353N6847K93816N0231k38131k39498q9260K95886
17849G7213R5532l7323R8369o7617q2016K06120K23766J14250r4276j28307j15770
17838B89941k50446j82209j53163l5894N945J27063p5847J29452J72772q0969
$$ plain form
17828 -53355 -431148 -266611 56809 173914 128405 80882 -125814 -271776 -140041 -3308
17818 -3308 -128107 -74075 -175263 -155543 121672 151168 42822 301589 216351 155863 -83575
17807 -83575 -264626 -487437 -618110 -418570 -1757 148203 254643 263929 268903 236483 -23703
17796 -23703 -192096 -72163 -180900 -208159 59428 241393 99876 -37495 12098 -42659
17786 -42659 -39687 -47950 -19100 60618 78563 -13899 -140481 -107472 -23540 118449 21148 -721
17774 -721 183071 50319 37240 -81011 -236595 -281650 -89068 -237632 -377970 -271591
17764 -271591 -85617 -115010 -425293 -531470 -431548 -94267 36212 163010 323301 136383
17754 136383 -232493 -363050 -132997 153655 227596 272534 163703 2787 -94613 13374
$$ packed form
17828e3355l77793J64537L23420J17105m5509m7523k06696j45962J31735J36733
17818c308j24799N4032j01188J9720K77215K9496j08346K58767q5238o0488k39438
17807h3575j81051k22811j30673J99540M16813J49960J06440R286M974l2420k60186
17796b3703j68393J19933j08737k7259K67587J81965j41517j37371M9593n4757
17786d2659K972q263K8850P9718J7945r2462j26582L3009Q3932J41989r7301k1869
17774g21J83792j32752j3079j18251j55584m5055J92582j48564j40338J06379
17764b71591J85974k9393l10283j06177R9922L37281J30479J26798J60291j86918
17754A36383l68876j30557K30053K86652P3941M4938j08831j60916r7400J07987
$$ plain form
17744 13374 31391 -33444 -162586 -231991 -254275 -221686 5456 -154001 -204464 229441 433668
17733 433668 295770 296250 321197 355311 299786 238664 49800 -137806 -13852 141972 170055
17722 170055 -195214 -304133 33468 374911 501118 651306 595340 300998 89386 148106
17712 148106 231308 334858 91899 42057 22720 -153736 -103297 -161550 -312170 -456706
17702 -456706 -430610 -390618 -172915 106508 67094 -113695 -148847 174212 139287 -7229
17692 -7229 -33288 -49904 -12655 47588 -71854 -187599 -103175 -7417 -111226 -46394 -60702
17681 -60702 -118401 -33134 -18356 -87724 -136082 -60886 -7455 64793 177671 72517 -215274
17670 -215274 -12838 305097 265860 255132 374700 209453 109122 293229 227575 57751
$$ packed form
17744A3374J8017o4835j29142o9405k2284L2589K27142j59457n0463M33905K04227
17733D33668j37898M80K4947L4114n5525o1122j88864j87606J23954J55824K8083
17722A70055l65269j08919L37601L41443J26207J50188n5966k94342k11612N8720
17712A48106Q3202J03550k42959m9842j9337j76456N0439n8253j50620j44536
17702d56706K6096L9992K17703K79423l9414j80789l5152L23059l4925j46516
17692g229k6059j6616L7249O0243j19442j15745Q4424R5758j03809O4832j4308
17681f0702n7699Q5267J4778o9368m8358P5196N3431P2248J12878j05154k87791
17670b15274K02436L17935l9237j0728J19568j65247j00331J84107o5654j69824
$$ plain form
17660 57751 113370 118803 164126 38772 24756 187814 357577 473112 464212 312620 210817
17649 210817 87153 104535 284214 434435 193479 -72613 -67404 -6115 76595 151149 55098
17638 55098 -82339 -128600 -293339 -323260 -101687 -52107 -152689 -373895 -440389 -393426 -279028
17627 -279028 -261039 -250457 -282873 -351669 -339861 -478507 -332505 -448157 -402506 -161932 -216486
17616 -216486 68650 252931 122369 -6040 162379 340687 249570 239991 292786 372631
17606 372631 376386 295358 300166 420046 318315 317646 227154 388069 404695 149472 -126199
17595 -126199 -156392 -94981 160200 379219 422573 415878 174783 96133 16185 93057 87461
17584 87461 -181196 -30138 107521 -372968 -477408 -458069 -271582 -295208 -345040 -368479
$$ packed form
17660E7751N5619N433M5323j25354j4016J63058J69763J15535q900j51592j01803
17649B10817j23664J7382J79679J50221k40956k66092N209O1289Q2710P4554r6051
17638E5098j37437m6261j64739k9921K21573M9580j00582k21206o6494M6963J14398
17627b79028J7989J0582l2416o8796J1808j38646J46002j15652M5651K40574n4554
17616b16486K85136J84281j30562j28409J68419J78308r1117r579N2795P9845
17606C72631L755q1028M808J19880j01731o69r0492J60915J6626k55223k75671
17595a26199l0193O1411K55181K19019M3354o695k41095p8650p9948P6872n596
17584H7461k68657J51058J37659m80489j04440J9339J86487k3626m9832k3439
$$ plain form
17574 -368479 -445857 -408789 -264517 -286077 -440334 -396159 -314075 -383812 -372156 -412244 -316507
17563 -316507 -187854 -24078 -120908 -82431 -7376 40967 61534 -19777 104934 -6330 -23447
17552 -23447 109796 186480 122821 200048 195822 92803 -74933 -139518 -94637 68037 218628
17541 218628 319642 205151 30617 65395 117989 122598 -59708 -56020 287088 417780 308604
17530 308604 249619 263966 60884 -82726 -47142 24382 126081 87344 150537 283894 279858
17519 279858 112066 8031 111980 -111523 -90391 -228074 130875 154061 5133 -104767
17509 -104767 -169090 -220815 -168436 294863 572761 344701 245033 240672 264927 386715 387729
17498 387729 273149 64115 -127873 107322 155250 -45121 5209 52896 198830 191650
$$ packed form
17574c68479p7378L7068J44272k1560j54257M4175Q2084o9737J1656m0088R5737
17563c16507J28653J63776r6830L8477P5055M8343K0567q1311J24711j11264j7117
17552b3447J33243P6684o3659P7227m226j03019j67736o4585M4881J62674J50591
17541B18628J01014j14491j74534L4778N2594M609j82306L688L43108J30692j09176
17530C08604n8985J4347k03082j43610L5584P1524J01699l8737O3193J33357m036
17519B79858j67792j04035J03949k23503K1132j37683L58949K3186j48928j09900
17509a04767o4323n1725N2379M63299K77898k28060r9668m361K4255J21788J014
17498C87729j14580k09034j91988K35195M7928k00371N0330M7687J45934p180
$$ plain form
17488 191650 192613 326947 334032 236931 83116 -40721 -114131 -176982 -336522 -388211 -123457
17477 -123457 40176 -80311 -165378 -147389 -137570 84335 239883 226008 106086 184271 490842
17466 490842 632550 542120 192637 148508 442062 501344 352023 232635 193868 -26672
17456 -26672 -108957 -21227 160545 74627 -81705 45108 72637 308017 557741 598392 629500
17445 629500 610858 850131 1308115 1420939 1321316 1379692 1482351 1106778 731323 601512
17435 601512 430149 151623 -60310 -130960 -104401 -99605 245725 224696 -114520 -266992
17425 -266992 -54323 -128823 -134515 -376247 -372632 -287966 -222615 -105335 -173504 -156664 -344379
17414 -344379 -400267 -360675 -172789 16356 68277 81323 -224009 -417034 -317883 -262576 -324051
$$ packed form
17488A91650R63J34334P085r7101j53815j23837p3410o2851j59540n1689K64754
17477a23457J63633j20487q5067J7989R819K21905J55548j3875j19922P8185L06571
17466D90842J41708r0430l49483m4129K93554N9282j49321j19388l8767k20540
17456b6672q2285Q7730J81772q5918j56332J26813K7529K35380K49724M0651L1108
17445F29500j8642K39273M57984J12824r9623N8376J02659l75573l75455j29811
17435F01512j71363k78526k11933p0650K6559M796L45330k1029l39216j52472
17425b66992K12669p4500n692k41732L615Q4666O5351J17280o8169J6840j87715
17414c44379n5888L9592J87886J89145N1921J3046l05332j93025R9151N5307o1475
$$ plain form
17403 -324051 -389449 -160136 -162482 33775 -28252 -194837 -366672 -228790 32774 128438
17393 128438 121370 136893 103240 199856 379417 315214 25965 15393 36699 82828 -25133
17382 -25133 48673 122776 -4754 74341 168700 109038 3376 -209487 -14776 68132 50175
17371 50175 -184538 -168237 -92616 -104450 -155452 -155935 -61025 -158076 -388586 -625589 -422786
17360 -422786 -164173 -114861 -230049 -305907 -251907 -225796 -48083 169770 336838 203243
17350 203243 74092 108180 120320 88362 -64589 -127718 -179263 -271694 -164189 -305035 -332690
17339 -332690 -293239 -74028 -101231 -35273 -35581 -231037 -364573 -371390 -296893 -182917 -202166
17328 -202166 -244164 -141640 -349171 -272850 -82291 -51517 -142924 -122084 -56662 -90129 -61981
$$ packed form
17403c24051o5398K29313k346J96257o2027j66585j71835J37882K61564R5664
17393A28438p068J5523l3653R6616J79561o4203k89249j0572K1306M6129j07961
17382b5133P3806P4103j27530P9095R4359n9662j05662k12863J94711Q2908j7957
17371E0175k34713J6301P5621j1834n1002m83R4910r7051k30510k37003K02803
17360d22786K58613M9312j15188p5858N4000K6111J77713K17853J67068j33595
17350B03243j29151L4088J2140l1958j52951o3129n1545r2431J07505j40846k7655
17339c32690L9451K19211k7203O5958l08j95456j33536o817P4497J13976j9249
17328b02166m1998J02524k07531P6321J90559L0774r1407K0840O5422l3467K8148
$$ plain form
17317 -61981 56599 -344209 -387884 210351 434854 353632 204565 -121711 -365733 -370324
17307 -370324 -247381 -212676 -189122 35616 114801 85966 3195 43238 261451 286177 103470
17296 103470 142488 49859 -69606 -238684 -30664 27943 258282 329115 199138 -133899
17286 -133899 -292192 -176953 -252743 -268618 -122302 59514 -71542 -354702 -342982 -349293
17276 -349293 -493727 -121327 139815 262566 200779 -13223 -137103 -94030 -80973 -45229
17266 -45229 259109 224521 160850 42843 -84161 -27855 63869 121023 -52260 -65744 -74866
17255 -74866 -58672 -12120 -86265 21968 106683 260186 279500 151583 17928 -32445 54281
17244 54281 111287 14983 -109094 26132 -59528 -255167 -342358 -546329 -884724 -815112 -428272
$$ packed form
17317f1981J18580m00808m3675N98235K24503q1222j49067l26276k44022m591
17307c70324J22943L4705K3554K24738P9185k8835q2771M0043K18213K4726j82707
17296A03470L9018r2629j19465j69078K08020N8607K30339P0833j29977l33037
17286a33899j58293J15239p5790j5875J46316J81816j31056k83160J1720o311
17276c49293j44434L72400K61142J22751o1787k14002j23880M3073J3057L5744
17266d5229L04338l4588o3671j18007j27004N6306R1724N7154j73283j3484r122
17255g4866J6194M6552p4145J08233Q4715J53503J9314j27917j33655n0373Q6726
17244E4281N7006r6304j24077J35226q5660j95639q7191k03971l38395O9612L86840
$$ plain form
17233 -428272 -368656 -163015 83597 -79561 106737 178607 339504 415063 290592 514731
17223 514731 488248 241996 -10214 -114075 -18177 -177648 -175955 -225997 -83141 17079
17213 17079 132929 132889 204958 -55155 -182415 -254080 -257017 -6629 175076 269331 323026
17202 323026 3164 -46075 -57422 -237969 -282613 -214422 -140438 -128181 305894 484377 392054
17191 392054 371039 222281 211620 247733 318255 281786 420876 211689 -78053 -82707 82600
17180 82600 198302 138150 -131968 -346476 -212119 -84625 66497 74166 50553 13133 123236
17169 123236 -57174 -62819 -118176 -241682 -231674 -52747 164223 189055 -72040 -144668 -251946
17158 -251946 -155590 87401 98735 126752 -60671 -147656 -423639 -283123 -50165 37116
$$ packed form
17233d28272N9616K05641K46612j63158J86298P1870J60897P5559j24471K24139
17223E14731k6483k46252k52210j03861R5898j59471J693n0042J42856J00220
17213A7079J15850m0P2069k60113j27260p1665k937K50388J81705R4255N3695
17202C23026l19862m9239j1347j80547m4644O8191P3984J2257M34075J78483r2323
17191C92054k1015j48758j0661L6113P0522l6469J39090k09187k89742m654J65307
17180H2600J15702o0152k70118k14508J34357J27494J51122P669k3613l7420J10103
17169A23236j80410n645n5357j23506J0008J78927K16970K4832k61095p2628j07278
17158b51946R6356K42991J1334K8017j87423q6985k75983J40516K32958Q7281
$$ plain form
17148 37116 -37651 -398901 -290412 -337580 -349324 -474499 -606863 -557815 -199841 -141345 -521872
17137 -521872 -448317 -155272 15350 -197228 -384841 -113584 144676 137720 -34154 67192
17127 67192 -46348 -170649 85350 202926 417001 320222 83816 104595 102996 15463 196148
17116 196148 241840 342243 317205 -27491 -236844 -67229 192055 341075 245419 72134
17106 72134 -47511 -176031 -403710 -437301 -392162 -278077 -3799 -98984 -155039 -25683
17096 -25683 -106023 -190743 -211680 -102838 -78852 282839 264552 -41910 -150598 -27732 5272
17085 5272 182102 218893 225564 131467 -102870 -107800 47510 229781 233993 57448 -38385
17074 -38385 -203604 -102391 78627 265909 259622 427450 384251 208828 168661 50637
$$ packed form
17148C7116p4767l61250J08489m7168j1744j25175j32364M9048L57974N8496l80527
17137e21872P3555K93045J70622k12578j87613K71257K58260o956j71874J01346
17127F7192j13540j24301K55999J17576K14075r6779k36406K0779j599q7533J80685
17116A96148M5692J00403k5038l44696k09353J69615K59284J49020r5656j73285
17106G2134j19645j28520k27679l3591M5139J14085K74278r5185n6055J29356
17096b5683q0340q4720k0937J08842K3986L61691j8287l06462j08688J22866L3004
17085E272J76830L6791O671r4097k34337m930J55310J82271M212j76545r5833
17074c8385j65219J01213J81018J87282o287J67828m3199j75423m0167j18024
$$ plain form
17064 50637 4080 90217 229725 177113 192532 127614 40698 52962 103500 -71497 -200593
17053 -200593 -45435 73081 16026 28776 -159047 -210134 -235221 -285706 11450 79311 72191
17042 72191 269156 366694 281764 172069 59539 -39831 -219278 -454703 -390876 -94469
17032 -94469 31577 226364 332169 155032 -24720 107641 183861 159049 227041 51324
17022 51324 -127262 -124436 -295379 -527163 -401918 67643 -67411 -122963 -69909 -186246
17012 -186246 -180911 -6680 -66520 -201283 -90058 57626 27086 -138925 55370 15686
17002 15686 -96375 -309276 -324005 -334004 -519918 -414421 -51196 152528 -9345 -99539
16992 -99539 141009 40326 79847 -61382 -427235 -521901 -562829 -321129 -36492 -40160 65644
$$ packed form
17064E0637m6557Q6137J39508n2612J5419o4918q6916J2264N0538j74997j29096
17053b00593J55158J18516n7055J2750j87823n1087k5087n0485K97156O7861p120
17042G2191J96965R7538q4930j09695j12530r9370j79447k35425O3827K96407
17032i4469J26046J94787J05805j77137j79752J32361P6220k4812O7992j75717
17022E1324j78586K826j70943k31784J25245M69561j35054n5552N3054j16337
17012a86246N335J74231n9840j34763J11225J47684l0540j66011J94295l9684
17002A5686j12061k12901j4729r999j85914J05497L63225K03724j61873r0194
16992i9539K40548j00683L9521j41229l65853r4666m0928K41700K84637l668J05804
$$ plain form
16981 65644 90673 61889 40722 -164957 -151285 -20870 127513 77434 114935 74364 -85893
16970 -85893 -207523 -112905 145639 243482 320311 149464 -11030 -119051 -243788 -255342
16960 -255342 -157426 -40980 -31688 19600 -119991 -160466 -234979 -521582 -592238 -573317 -441376
16949 -441376 -320788 -452418 -306977 -180639 187079 253731 104684 -82852 101076 -6619
16939 -6619 31153 77575 84324 152352 176267 202512 304754 211816 69698 -33158 -106674
16928 -106674 -198971 -67764 338302 432200 257778 35817 -32085 -96285 -35493 195853
16918 195853 215379 165300 22621 30766 -167257 -259852 -182289 -161646 -269806 -191228 -95435
16907 -95435 -31341 113443 286725 127604 -29668 -55358 -153361 -146254 -66201 -110134 -410124
$$ packed form
16981F5644K5029k8784k1167k05679J3672J30415J48383n0079L7501m0571j60257
16970h5893j21630R4618K58544R7843P6829j70847j60494j08021j24737j1554
16960b55342R7916J16446R292N1288j39591m0475p4513k86603p0656J8921J31941
16949d41376J20588j31630J45441J26338L67718O6652j49047j87536J83928j07695
16939f619L7772M6422O749O8028K3915K6245J02242r2938j42118j02856p3516
16928a06674r2297J31207M06066R3898j74422k21961o7902o4200O0792K31346
16918A95853J9526n0079j42679Q145j98023r2595P7563K0643j08160P8578R5793
16907i5435O4094J44784J73282j59121j57272k5690r8003P107Q0053m3933k99990
$$ plain form
16896 -410124 -486255 -459690 -361947 -435877 -508678 -432675 -105306 -1285 43881 242072 229876
16885 229876 43462 -114201 -218225 -230703 -365866 -457931 -415872 -356150 -281853 -108650
16875 -108650 -249108 -60754 63049 -127921 -310876 -364591 -395296 -413140 -255262 134787
16865 134787 267242 117673 168077 451005 484458 209973 -29204 -5288 179141 276252
16855 276252 366753 420084 362224 384728 224433 320372 229067 274469 226397 16996 -182508
16844 -182508 -40221 211599 88233 77922 43176 234156 277573 128756 135498 69916 292437
16833 292437 459148 505665 483877 199319 124253 368874 298959 60983 -20740 24905 189087
16822 189087 133421 99964 372397 324432 173184 190834 14345 -41219 83463 101442 201708
$$ packed form
16896d10124p6131K6565R7743p3930p2801P6003L27369J04021M5166J98191j2196
16885B29876j86414j57663j04024j2478j35163r2065M2059N9722P4297J73203
16875a08650j40458J88354J23803j90970j82955n3715l0705j7844J57878L90049
16865A34787J32455j49569N0404K82928L3453k74485k39177K3916J84429R7111
16855B76252R0501N3331n7860K2504j60295R5939r1305M5402m8072k09401j99504
16844a82508J42287K51820j23366j0311l4746J90980M3417j48817O742o5582K22521
16833B92437J66711M6517k1788k84558p5066K44621o9915k37976q1723M5645J64182
16822A89087n5666l3457K72433m7965j51248J7650j76489n5564J24682J7979J00266
$$ plain form
16811 201708 179956 25813 -13478 227690 386304 431794 392194 166373 -133626 -149616
16801 -149616 -40933 -21945 -5616 -134024 -228799 -181437 -148506 -372861 -380544 -373993 -349804
16790 -349804 -74361 175041 223374 322436 116676 -119346 -363551 -300239 -73244 -38006
16780 -38006 -190947 -182878 -138835 -252206 -162975 35358 -24073 59367 84539 -57544 -15194
16769 -15194 -61309 -270979 -456747 -411589 -324332 -403383 -319831 -371837 -381910 -199416 -135725
16758 -135725 -6400 46304 120887 216320 254009 361220 404411 229727 166654 -63325 -261008
16747 -261008 -374516 -122254 113295 176526 254139 130713 27442 -273319 -320112 -185244
16737 -185244 -28991 111080 190742 67325 77977 84166 93764 98166 -81137 -257371 -290068
$$ packed form
16811B01708k1752j54143l9291K41168J58614M5490l9600k25821k99999j5990
16801a49616J08683J8988J6329j28408r4775M7362L2931k24355p683O551K4189
16790c49804K75443K49402M8333R9062k05760k36022k44205O3312K26995L5238
16780c8006j52941Q069M4043j13371Q9231J98333n9431Q3440K5172j42083M2350
16769a5194m6115k09670j85768M5158Q7257p9051Q3552n2006j0073J82494O3691
16758a35725J29325N2704P4583R5433L7689J07211M3191j74684o3073k29979j97683
16747b61008j13508K52262K35549O3231P7613j23426j03271l00761m6793J34868
16737a85244J56253J40071P9662j23417J0652O189R598M402j79303j76234l2697
$$ plain form
16726 -290068 -294488 -144878 151679 390845 342046 256200 137882 180394 88336 -9920 -126667
16715 -126667 -282963 -429877 -442754 -317633 -147893 51960 136614 24707 145542 210644
16705 210644 423401 380049 398759 358553 45376 -181228 -140863 52774 108363 -12222
16695 -12222 -117588 -360739 -512661 -622294 -364330 -159343 261079 424681 58283 -9190
16685 -9190 -28978 -32132 -136224 -207420 -178665 -156090 54182 146847 -64141 81701 242666
16674 242666 214672 240467 1958 -234881 -328327 -482383 -303973 -21449 161122 153173
16664 153173 141744 -77359 -95024 18176 -42294 52753 63728 -16645 36232 256349 339364
16653 339364 304690 -143972 -226351 -207199 -173847 -122135 -271853 -340821 -171899 -121417 -80789
$$ packed form
16726b90068m420J49610K96557K39166m8799q5846j18318M2512r2058r8256j16747
16715a26667j56296j46914j2877J25121J69740J99853Q4654j11907J20835O5102
16705B10644K12757m3352J8710m0206l13177k26604M0365J93637N5589j20585
16695a2222j05366k43151j51922j09633K57964K04987M20422J63602l66398o7473
16685i190j9788l154j04092p1196K8755K2575K10272R2665k10988J45842J60965
16674B42666k7994K5795k38509k36839r3446j54056J78410K82524J82571p949
16664A53173j1429k19103j7665J13200o0470R5047J0975q0373N2877K20117Q3015
16653C39364l4674m48662q2379J9152L3352N1712j49718o8968J68922N0482M0628
$$ plain form
16642 -80789 199116 -65745 -125184 -220861 -302557 -181190 -3854 245611 195750 -51687
16632 -51687 -304962 -296756 -226403 -141171 -8873 137565 189124 99160 216941 145688 14561
16621 14561 -85624 103854 200984 46311 -134865 -259386 -154990 -10469 -136667 -215622
16611 -215622 -257818 -133977 -43098 -322290 -434323 -46927 304933 300400 141443 139164 7127
16600 7127 -91121 -66772 -151819 -263992 -220691 -73971 19654 -141726 -272678 -155141 -132946
16589 -132946 -154184 23805 11889 3012 8272 42293 55427 -215275 -270294 -219501 -122239
16578 -122239 12215 135623 117232 -662 -44478 34563 100401 195787 348909 149652
16568 149652 109515 -118694 -319558 -317590 -447420 -350632 -150440 -154069 -197165 -52109 156735
$$ packed form
16642h0789K79905k64861n9439r5677q1696J21367J77336K49465m9861k47437
16632e1687k53275Q206P0353Q5232J32298J46438N1559q9964J17781p1253j31127
16621A4561j00185J89478R7130j54673j81176j24521J04396J44521j26198p8955
16611b15622m2196J23841R0879k79192j12033L87396L51860m533j58957k279j32037
16600G127r8248K4349q5047j12173M3301J46720R3625j61380j30952J17537K2195
16589a32946k1238J77989j1916q877N260L4021J3134k70702n5019N0793R7262
16578a22239J34454J23408j8391j17894m3816P9041O5838R5386J53122j99257
16568A49652m0137k28209k00864J968j29830R6788K00192l629m3096J45056K08844
$$ plain form
16557 156735 128206 -7107 28346 -182526 -383513 -371535 -321302 -199135 -141649 53502
16547 53502 144074 2877 -148469 -185785 -42958 106242 104853 21155 145940 -49024 -279984
16536 -279984 -74099 114641 235281 231384 205176 97204 -120284 -32076 164605 106074
16526 106074 105992 145809 231695 332279 421498 269165 149582 199532 74769 -10129 -25656
16515 -25656 -44080 -20053 15261 50491 182330 68489 -173191 -124939 -185463 -382567 -453280
16504 -453280 -414567 -371577 -104909 281552 184406 -33607 -17409 -107272 -339863 -415806 -2521
16493 -2521 385543 206158 20741 -147850 -121397 -211912 -289159 -397417 -425383 -123627 91973
16482 91973 45051 -4423 -24679 -115750 -146045 -128060 -22204 110621 199733 147862 -101880
$$ packed form
16557A56735k8529j35313L5453k10872k00987J1978N0233J22167N7486J95151
16547E3502R0572j41197j51346l7316J42827J49200j389q3698J24785j94964k30960
16536b79984K05885J88740J20640l897k6208j07972k17488Q8208J96681n8531
16526A06074q2L9817Q5886J00584Q9219j52333j19583M9950j24763q4898j5527
16515b5656j8424K4027L5314L5230J31839j13841k41680M8252o0524j97104p0713
16504d53280L8713M2990K66668L86461r7146k18013J6198q9863k32591p5943M13285
16493b521L88064j79385j85417j68591K6453r0515p7247j08258k7966L01756K15600
16482I1973m6922m9474k0256r1071l0295J7985J05856J32825Q9112n1871k49742
$$ plain form
16471 -101880 -484020 -408928 -451510 -314946 -315599 -325577 -198000 -35114 -187015 -194400 -157057
16460 -157057 -132266 -180677 -195891 -153786 27028 143741 38443 -33106 -187518 -157513 -49044
16449 -49044 -31162 -40976 67497 -67094 -258546 -54214 -330001 -460043 -579087 -452549
16439 -452549 -347126 -222376 15223 109552 160733 148391 386585 449129 230959 205419
16429 205419 87430 194487 387589 268686 101238 88310 110931 266450 216960 229428
16419 229428 328858 239500 457824 560905 146625 -65556 -76182 258941 507559 596278
16409 596278 624904 580719 345188 162891 235730 191426 54556 115165 346432 472960
16399 472960 498092 421274 227592 -18911 -292338 -331676 -171506 -56761 86120 -99420
$$ packed form
16471a01880l82140P5092m2582J36564o53r978J27577J62886j51901p385L7343
16460a57057K4791m8411j5214M2105J80814J16713j05298p1549j54412L0005J08469
16449d9044J7882r814J08473j34591j91452K04332k75787j30042j19044J26538
16439d52549J05423J24750K37599R4329N1181j2342K38194O2544k18170k5540
16429B05419j17989J07057J93102j18903j67448j2928K2621J55519m9490J2468
16419B29428R9430q9358K18324J03081m14280k12181j0626L35123K48618Q8719
16409E96278K8626m4185k35531j82297P2839m4304j36870O0609K31267J26528
16399D72960K5132p6818j93682k46503k73427l9338J60170J14745J42881j85540
$$ plain form
16389 -99420 -119972 -133921 -104829 -67922 -337459 -330258 47658 86923 -25335 74927 160169
16378 160169 37884 8198 -112501 -102334 -118233 52805 220611 249491 193592 120012 23985
16367 23985 -223125 -232827 -107652 -26831 26947 -25924 -63254 -133735 -168743 19233 32141
16356 32141 131029 181670 52790 -207251 -295644 -318498 -316764 -400854 -458004 -362875 -79430
16345 -79430 -51555 -54382 -231787 -299999 -72732 70737 4627 -917 10270 12014 118514
16334 118514 96117 103400 15822 -110664 -84294 22969 55733 -31208 124400 270047 110928
16323 110928 -244433 -358940 -289712 -201040 -249345 -296978 -499407 -559831 -551237 -548470 -351089
16312 -351089 -244156 -69248 11193 -56488 -122051 -403765 -473063 -330589 -172677 -122291
$$ packed form
16389i9420k0552j3949K9092L6907k69537P201L77916L9265j12258J00262Q5242
16378A60169j22285k9686j20699J0167j5899J71038J67806K8880n5899p3580r6027
16367B3985k47110r702J25175Q0821N3778n2871l7330p0481l5008J87976J2908
16356C2141R8888N0641j28880k60041q8393k2854J734q4090n7150R5129K83445
16345g9430K7875k827j77405o8212K27267J43469o6110n544J1187J744J06500
16334A18514k2397P283q7578j26486K6370J07263L2764q6941J55608J45647j59119
16323A10928l55361j14507O9228Q8672m8305m7633k02429o0424Q594K767J97381
16312c51089J06933J74908Q0441o7681o5563k81714o9298J42474J57912N0386
$$ plain form
16302 -122291 -41106 -219333 -388271 -367369 -288646 75484 32933 -113281 -35822 -10298 45535
16291 45535 23634 228390 320504 299074 361561 364386 76735 -241722 -322218 -254433 -255229 -222808
16279 -222808 -192067 43055 89768 353869 352167 -104790 -371846 -130995 -27751 -28542 12851
16268 12851 -95146 -307185 -273202 -183212 -12210 -202933 -443097 -320058 -71597 -61793
16258 -61793 120994 153109 367579 329836 150807 60506 -146996 -185653 -314535 -223378 -216498
16247 -216498 -269494 -155457 -88026 28078 46979 125725 126845 139734 315641 311102 282079
16236 282079 230308 11250 -392553 -579628 -385665 -209278 -202284 -288346 -323351 -391107 -378237
16225 -378237 -399544 -242669 -73166 140945 120219 95465 182802 186648 279629 309826 185323
$$ packed form
16302a22291Q1185j78227j68938K0902P8723L64130m2551j46214P7459K5524N5833
16291D5535k1901K04756R2114k1430O2487K825k87651l18457q0496O7785p96L2421
16279b22808L0741K35122M6713K64101j702m56957k67056K40851J03244p91M1393
16268A2851j07997k12039L3983Q9990J71002j90723k40164J23039K48461R804
16258f1793J82787L2115K14470l7743j79029r0301k07502l8657j28882R1157O880
16247b16498n2996J14037O7431J16104J8901P8746J120J2889J75907m539k9023
16236B82079n1771k19058m03803j87075J93963J76387O994q6062l5005o7756J2870
16225c78237k1307J56875J69503K14111k0726k4754Q7337L846R2981L0197j24503
$$ plain form
16214 185323 140031 121098 203599 45903 -6196 -77184 -175126 -307294 -326419 -203121 -134577
16203 -134577 161473 18617 -150420 -122960 -178256 39608 83349 -98036 -325486 -94582
16193 -94582 -84303 -169858 -262055 -192010 -226032 -134432 -99211 -37361 -109192 12647 11105 13130
16181 13130 63894 -14755 94701 -142348 -153685 -82614 -45332 173530 110479 -39355 110936
16170 110936 50255 208353 545684 414597 327462 292698 319572 167340 -57912 22465
16160 22465 128034 18067 -169921 74314 233557 254322 334495 223182 -97786 -40807
16150 -40807 -41385 21631 147326 -25142 22924 -119619 -280355 -167278 -220696 -63264 249240
16139 249240 281537 392650 187318 5192 -9466 -313047 -346112 -84081 -91673 56134
$$ packed form
16214A85323m5292j8933Q2501j57696n2099p0988r7942j32168j9125J23298O8544
16203a34577K96050j42856j69037K7460n5296K17864M3741j81385k27450K30904
16193i4582J0279q5555r2197P0045l4022R1600L5221O1850p1831J21839j542K025
16181A3130N0764p8649J09456k37049j1337P1071L7282K18862o3051j49834J50291
16170A10936o0681J58098L37331j31087q7135l4764K6874j52232k25252Q0377
16160B2465J05569j09967j87988K44235J59243K0765Q0173j11313l20968N6979
16150d0807n78O3016J25695j72468M8066j42543j60736J13077n3418J57432L12504
16139B49240L2297J11113k05332j82126j4658l03581l3065K62031p592J47807
$$ plain form
16129 56134 243528 102688 -188635 -309263 -270863 -250162 -312104 -398314 -325634 -74392 117205
16118 117205 163419 64061 -96946 -56960 25690 126517 259189 232048 -3484 -24724 -29404
16107 -29404 -22136 59284 187927 55605 -108656 -459046 -448003 -306074 -242592 -62186 215587
16096 215587 172255 7877 77057 130205 172739 78533 3844 89804 -84470 -193220 -152623
16085 -152623 -23405 -22772 227444 183859 -133656 -190804 -59925 -121775 114625 181424 141650
16074 141650 8683 -3973 -255619 -216314 -62705 -37644 -189431 -217007 -194576 -219220 -54776
16063 -54776 109991 78908 -47799 -81171 -19904 -51415 -87724 -154861 -162270 13060 -106536
16052 -106536 -303895 -543222 -486813 -513587 -440953 -277663 26567 133012 -25715 -67670
$$ packed form
16129E6134J87394j40840k91323j20628L8400K0701o1942q6210P2680K51242J91597
16118A17205M6214r9358j61007L9986Q2650J00827J32672k7141k35532k1240m680
16107b9404P268Q1420J28643j32322j64261l50390J1043J41929O3482J80406K77773
16096B15587m3332j64378O9180N3148M2534r4206p4689Q5960j74274j08750M0597
16085a52623J29218O33K50216m3585l17515n7148J30879o1850K36400O6799l9774
16074A41650j32967j2656k51646L9305J53609K5061j51787k7576K2431k4644J64444
16063e4776J64767l1083j26707l3372O1267l1511l6309o7137p409J75330j19596
16052a06536j97359k39327N6409k6774P2634J63290L04230J06445j58727m1955
$$ plain form
16042 -67670 -79959 -230294 -369134 -491866 -193802 -96659 -268111 -47938 145242 139021
16032 139021 -29981 -262284 -309879 -269040 -214327 -11009 -173444 -308934 -173167 -98903
16022 -98903 -50705 -58253 203785 152818 -165357 -328623 -461960 -471182 -311377 -176967 -264594
16011 -264594 -356863 -125457 -161331 -289213 -281928 -161834 -120545 -191038 79443 271574 369698
16000 369698 173475 86961 25522 -110689 -205586 -208428 -122814 -111258 -288389 -328796 -115063
15989 -115063 52141 66248 75507 121198 297854 298246 374452 165114 257180 280267 239785
15978 239785 31513 -315548 -307132 -167675 -42400 57968 9798 66430 226488 177514
15968 177514 95730 23836 -25720 -75557 117588 214566 237190 -7683 80848 69421 18859
$$ packed form
16042f7670j2289j50335j38840j22732K98064R7143j71452K20173J93180o221
16032A39021j69002k32303m7595M0839N4713K03318j62435j35490J35767P4264
16022i8903M8198p548K62038n0967l18175j63266j33337r222J59805J34410q7627
16011b64594r2269K31406l5874j27882P285J20094M1289p0493K70481J92131R8124
16000C69698j96223q6514o1439j36211r4897k842Q5614J1556j77131m0407K13733
15989a15063J67204J4107R259M5691J76656L92P6206k09338R2066K3087m0482
15978B39785k08272l47061Q416J39457J25275J00368m8170N6632J60058m8974
15968A77514q1784p1894m9556m9837J93145R6978K2624k44873Q8531j1427n0562
$$ plain form
15957 18859 -4715 181860 163427 115395 170239 143742 68095 -36340 -90070 7374 -143956
15946 -143956 71744 85110 -194329 -237845 -230316 -225975 -122170 -53328 -48054 -52316 109925
15935 109925 118732 150426 216777 302188 251549 93917 -116473 70046 238291 228555 11121
15924 11121 82936 227210 112550 -210612 -24850 -90977 -121556 -53045 78989 53010 216434
15913 216434 299733 158518 76112 108930 -9123 -87491 -93344 -14280 113319 206345 311327
15902 311327 132983 -123116 -102642 -305000 8605 389259 228423 -112937 -191808 -380912
15892 -380912 -462488 -586070 -514802 -394191 -179291 -82697 -208153 -478623 -533712 -243426
15882 -243426 5839 223843 45411 -270552 -323781 -202920 122440 329164 331641 -68131
$$ packed form
15957A8859k3574J86575j8433m8032N4844k6497p5647j04435n3730R7444j51330
15946a43956K15700J3366k79439m3516P529M341J03805O8842N274m262J62241
15935A09925Q807L1694O6351Q5411n0639j57632k10390J86519J68245r736k17434
15924A1121P1815J44274j14660l23162J85762o6127l0579O8511J32034k5979J63424
15913B16434Q3299j41215q2406L2818j18053p8368n853P9064J27599R3026J04982
15902C11327j78344k56099K0474k02358L13605L80654j60836l41360p8871j89104
15892c80912q1576j23582P1268J20611K14900R6594j25456k70470n5089K90286
15882b43426K49265K18004j78432l15963n3229J20861L25360K06724K477l99772
$$ plain form
15872 -68131 -128390 -51224 -249830 -410097 -423457 -220123 -82002 -32767 -214839 -454323
15862 -454323 -456326 -476065 -311712 -83315 209851 218818 203128 345622 404901 105748 152564
15851 152564 255533 336019 263285 189312 71829 249008 188635 90485 22535 -136479 -36379
15840 -36379 -23108 -41408 -118423 67493 246709 61699 96149 116395 22326 -40331 -27064
15829 -27064 -19772 -325164 -429391 -316935 -152464 107579 34527 -255019 -511998 -367064
15819 -367064 -252321 -395219 -305789 -312215 -315707 -389133 -201454 -74275 -224143 -260731 -180267
15808 -180267 -234366 -127224 -313633 -312301 -230135 -137208 -151678 -157061 -272537 -379440 -289899
15797 -289899 -170289 -104921 -42607 90626 -152224 -161134 -70664 -105138 -152305 -163519 -49642
$$ packed form
15872f8131o0259P7166j98606j60267j3360K03334J38121M9235j82072k39484
15862d54323k003j9739J64353K28397K93166Q967j5690J42494N9279k99153M6816
15851A52564J02969Q0486p2734p3973j17483J77179o0373r8150o7950j59014J00100
15840c6379J3271j8300p7015J85916J79216j85010L4450K0246r4069o2657J3267
15829b7064P292l05392j04227J12456J64471K60043p3052k89546k56979J44934
15819c67064J14743j42898Q9430o426l492p3426J87679J27179j49868l6588Q0464
15808a80267n4099J07142j86409J332Q2166R2927j4470n383j15476j06903Q9541
15797b89899J19610O5368O2314J33233k42850q910R0470l4474m7167j1214J13877
$$ plain form
15786 -49642 55351 -19167 -37113 -33690 -207251 -107805 -141870 -189652 -188120 -490926 -422219
15775 -422219 -420831 -334305 -278834 -371319 -499228 -384525 -350877 -443308 -343079 -283514 -465468
15764 -465468 -408276 -340232 -116201 -85816 -23820 -149640 -490173 -512990 -254244 68777
15754 68777 36648 -37821 186668 207230 224857 203929 298191 398186 395951 320608 208296
15743 208296 372355 275084 131434 -42208 226067 230299 59588 -27934 39149 -53725 86269
15732 86269 203423 138269 40663 126337 94284 42286 128914 177849 161623 -79735 74359
15721 74359 -6770 -79859 -40610 118223 -12201 -273817 -339511 -346047 -215388 -36617 167025
15710 167025 129308 -25914 -192123 -115064 -57653 -139774 -73236 766 157637 363891 44334
$$ packed form
15786d9642J04993p4518j7946L423j73561R9446l4065m7782J532l02806O8707
15775d22219J388Q6526N5471r2485j27909J14703L3648r2431J00229N9565j81954
15764d65468N7192O8044K24031L0385O1996j25820l40533k2817K58746L23021
15754F8777l2129p4469K24489K0562J7627k0928R4262R9995k235p5343j12312
15743B08296J64059r7271j43650j73642K68275M232j70711q7522O7083r2874J39994
15732H6269J17154o5154r7606Q5674l2053n1998Q6628M8935j6226k41358J54094
15721G4359q1129p3089L9249J58833j30424k61616o5694o536J30659J78771K03642
15710A67025l7717j55222j66209P7059N7411q2121O6538P4002J56871K06254l19557
$$ plain form
15699 44334 55584 -72315 -128396 -67213 -55899 -49013 -86587 -189253 -220943 -287668 -338809
15688 -338809 -297536 -196097 3854 101213 299606 339053 53735 152013 268321 160321
15678 160321 107312 100521 4949 -32887 -42301 -88023 -169861 -72619 -111191 -367296 -522244
15667 -522244 -508399 -436464 -390946 -167966 -109126 -263214 -376911 -449311 -513917 -319771 -173397
15656 -173397 -130079 -224238 -92567 220293 186606 76879 218121 198247 113056 55440 -57527
15645 -57527 -27458 158258 191678 211491 97609 -115981 -42142 70094 137480 60118 28531
15634 28531 -206246 -308446 104586 358248 480695 420270 23848 2471 39083 -10055
15624 -10055 107051 142481 163467 100177 119241 14221 -28225 -116035 -127597 37411 -12207
$$ packed form
15699D4334J1250j27899n6081O1183J1314O886l7574j02666l1690o6725n1141
15688c38809M1273J01439J99951R7359J98393L9447k85318R8278J16308j08000
15678A60321n3009o791r5572l7836r414m5722q1838R7242l8572k56105j54948
15667e22244J3845P1935M5518K22980N8840j54088j13697p2400o4606J94146J46374
15656a73397M3318r4159J31671L12860l3687j09727J41242j9874q5191n7616j12967
15645e7527L0069J85716L3420J9813j13882k13590P3839J12236O7386p7362l1587
15634B8531k34777j02200M13032K53662J22447o0425l96422k1377L6612m9138
15624a0055J17106L5430K0986o3290J9064j05020m2446q7810j1562J65008m9618
$$ plain form
15613 -12207 -1465 51073 307559 238490 179781 113693 -30663 72155 318441 319879 -61508
15602 -61508 -60086 211879 264624 -61649 -288740 -142825 -126443 -339039 -290536 -21767 -92361
15591 -92361 -82092 9286 50975 -45279 -178834 -134977 -61267 -122329 -121196 -45601 -71539 -49704
15579 -49704 -30783 -15026 -14750 85929 34684 -166823 -104446 66071 288510 603239 743247
15568 743247 446838 333762 362273 91921 -87126 105035 124970 179599 208302 215500 364083
15557 364083 120417 43006 -44042 -365090 -564089 -448410 -308088 -234213 114602 292935
15547 292935 8020 -36446 -135279 -198020 -41414 -29686 -85703 -197418 -157278 -35951 108903
15536 108903 326195 485601 267503 -117699 -104327 80040 -1316 -71764 -9029 72798
$$ packed form
15613a2207J0742N2538K56486o9069n8709o6088j44356J02818K46286J438l81387
15602f1508J422K71965N2745l26273k27091J45915J6382k12596M8503K68769p0594
15591i2361J0269R1378M1689r6254j33555M3857P3710o1062J133P5595k5938K1835
15579d9704J8921J5757K76J00679n1245k01507O2377J70517K22439L14729J40008
15568G43247k96409j13076K8511k70352j79047J92161J9935N4629K8703P198J48583
15557C64083k43666p7411q7048l21048j98999J15679J40322P3875L48815J78333
15547B92935k84915m4466r8833o2741J56606J1728n6017j11715M0140J21327J44854
15536A08903K17292J59406k18098l85202J3372J84367q1356p0448O2735Q1827
$$ plain form
15526 72798 -68439 -113421 216116 291119 136543 -25947 -97508 -223504 -388761 -205969
15516 -205969 135 -45243 200376 341403 330679 72499 -10885 -27812 -196457 -79169
15506 -79169 59810 -136163 -201959 -117099 -88360 -5226 -146313 -222643 -142699 20989 748
15495 748 -38650 -173007 -139756 -80485 102378 217924 304281 203978 189145 188828 -57482
15484 -57482 -128075 -123909 -89920 -179180 -71019 29676 6197 139458 272100 192579 276741
15473 276741 330363 -10583 -110306 -246212 -407662 -145705 -98874 -351416 -499301 -349265
15463 -349265 -285136 -116702 -16195 252322 294278 102755 -3090 -83030 -216137 -336065
15453 -336065 -502984 -530448 -617836 -504885 -512877 -324459 -208929 -150759 6912 221988
$$ packed form
15526G2798j41237m4982L29537P5003j54576j62490p1561j25996j65257J82792
15516b05969K06104m5378K45619J41027j0724k58180q3384j6927j68645J17288
15506g9169J38979j95973o5796Q4860K8739Q3134j41087p6330P9944J63688k0241
15495G48l9398j34357L3251N9271J82863J15546Q6357j00303j4833l17k46310
15484e7482p0593M166L3989q9260J08161J00695k3479J33261J32642p9521Q4162
15473B76741N3622l40946r9723j35906j61450K61957M6831k52542j47885J50036
15463c49265O4129J68434J00507K68517M1956j91523j05845p9940j33107j19928
15453c36065j66919k7464q7388J12951p992J88418J15530N8170J57671K15076
$$ plain form
15443 221988 130783 113889 41562 37110 8079 64595 109716 121471 276535 228424 203994
15432 203994 178574 182564 281106 312079 280081 156188 34308 49829 -194925 -145721 -104864
15421 -104864 70816 244443 338389 300393 354512 373336 -13 16294 174980 13474
15411 13474 -136641 -106772 199338 221676 75080 -69912 174429 129760 115711 297657
15401 297657 345555 329497 183450 -41984 -189092 -63283 -28127 98818 144483 -21563
15391 -21563 -29346 30105 109868 404368 483561 108326 201047 81563 -58555 170408 426416
15380 426416 410544 83570 -19161 -127333 -145894 -85554 -130164 -154386 -176116 -57800 -130764
15369 -130764 -285972 -295520 -278601 -235719 -191308 -113246 -180294 -193287 -165390 -88018 -218149
$$ packed form
15443B21988r1205j6894p2327m452k9031N6516M5121J1755J55064m8111k4430
15432B03994k5420L990R8542L0973l1998j23893j21880J5521k44754M9204M0857
15421a04864J75680J73627R3946l7996N4119J8824l73349J6307J58686j61506
15411A3474j50115K9869L06110K2338j46596j44992K44341m4669j4049J81946
15401B97657M7898j6058j46047k25434j47108J25809L5156J26945M5665j66046
15391b1563p783N9451P9763K94500P9193l75235R2721j19484j40118K28963K56008
15380D26416j5872l26974j02731j08172j8561O0340m4610k4222k1730J18316p2964
15369a30764j55208r548J6919M2882M4411P8062o7048j2993K7897P7372j30131
$$ plain form
15358 -218149 -169644 -87554 24789 120849 127907 -30894 -124650 32956 219971 109991 -97210
15347 -97210 -42775 8466 69639 -76877 110517 211627 126470 97141 186468 -102332 -140370
15336 -140370 -186835 -227332 -110734 50037 305002 179455 -91236 -138180 -158220 -104737
15326 -104737 71555 166877 266531 236985 341447 346494 356245 228507 -93572 -179846 -269653
15315 -269653 -281646 -111031 171007 108948 149245 77786 127108 -2993 -58208 -109216 -491145
15304 -491145 -412123 -303786 -70707 -125153 -194735 -208567 -273572 -120804 -95200 -110998 -32741
15293 -32741 -199099 -307043 -486197 -504173 -363852 -396415 -315466 -32577 97300 -92860
15283 -92860 -222804 20237 -10852 -45632 -37415 -121697 -232456 -103458 18780 77755 163018
$$ packed form
15358b18149M8505Q2090J12343R6060P058j58801r3756J57606J87015j09980k07201
15347i7210N4435N1241O1173j46516J87394J01110q5157k9329Q9327k88800l8038
15336a40370m6465m0497J16598J60771K54965j25547k70691m6944k0040N3483
15326a04737J76292R5322R9654k9546J04462N047R751j27738l22079q6274q9807
15315b69653j1993J70615K82038o2059M0297p1459M9322j30101n5215n1008l81929
15304d91145P9022J08337K33079n4446o9582j3832o5005J52768K5604j5798P8257
15293c2741j66358j07944j79154j7976J40321l2563Q0949K82889J29877j90160
15283i2860j29944K43041l1089l4780Q217q4282j10759J28998J22238N8975Q5263
$$ plain form
15272 163018 418100 247878 152666 153358 223939 303151 252262 174991 137700 57577 2504
15261 2504 109664 237787 77187 -63870 -124580 -189531 -210919 -208162 -93407 11616 -44059
15250 -44059 66814 36356 -12385 -71533 59121 242648 187007 -31610 -101574 -172683 -104267
15239 -104267 46296 -337 158236 356978 393372 385622 200991 30858 -47487 7509 253519
15228 253519 195814 201418 236839 198784 172801 140013 160975 213815 218439 41096 -87975
15217 -87975 51416 149642 301362 252482 155542 -56994 -258785 -294225 -360425 -569553 -417841
15206 -417841 -132059 -90856 -46442 -45488 243783 639609 569348 354658 130634 205238 192121
15195 192121 182468 136565 1502 -35543 -197377 -315528 -315108 -286228 -264684 -173141 -208175
$$ packed form
15272A63018K55082j70222r5212O92P0581P9212n0889p7271l7291q0123n5073
15261B504J07160J28123j60600j41057o0710o4951k1388K757J14755J05023n5675
15250d4059J10873l0458m8741n9148J30654J83527n5641k18617o9964p1109O8416
15239a04267J50563m6633J58573J98742L6394p750j84631j70133p8345N4996K46010
15228B53519n7705N604L5421l8055k5983l2788K0962N2840M624j77343j29071
15217h7975J39391R8226J51720m8880r6940k12536k01791l5440o6200k09128J51712
15206d17841K85782M1203M4414R54K89271L95826p0261k14690k24024P4604j3117
15195A92121r653m5903j35063l7045j61834j18151M20K8880K1544R1543l5034
$$ plain form
15184 -208175 -76264 5228 24781 11041 -52141 -157851 -107646 -53599 -46039 -226010 -121721
15173 -121721 27237 -194869 -246728 -130731 -226769 -391448 -524013 -700629 -509891 -235424
15163 -235424 -224619 -35639 37921 -60807 -179108 -292543 -184141 -9470 51630 177688
15153 177688 439502 206204 5164 106000 118029 123931 135659 104108 187667 317813 203263
15142 203263 88178 142122 203658 311487 249005 176877 182318 246843 102503 -43233 56973
15131 56973 153058 236642 134002 175442 266127 190798 133531 366624 399459 382781 359457
15120 359457 48095 -46269 105662 208804 261881 70620 -123212 -192970 -186897 -91064 21466
15109 21466 340875 375901 131284 80450 134109 197717 95512 196996 232277 305229 391430
$$ packed form
15184b08175J31911Q1492J9553j3740o3182j05710N0205N4047P560j79971J04289
15173a21721J48958k22106n1859J15997r6038j64679j32565j76616J90738K74467
15163b35424J0805J88980P3560r8728j18301j13435J08402J74671O1100J26058
15153A77688K61814k33298k01040J00836J2029N902J1728l1551Q3559J30146j14550
15142B03263j15085N3944O1536J07829o2482p2128N441O4525j44340j45736J00206
15131E6973R6085Q3584j02640M1440R0685p5329n7267K33093L2835j6678k3324
15120C59457l11362r4364J51931J03142N3077j91261j93832o9758O073R5833J12530
15109B1466L19409L5026k44617n0834N3659O3608j02205J01484L5281P2952Q6201
$$ plain form
15098 391430 93496 -164298 -306769 -234806 10314 89896 182652 234404 290779 118717
15088 118717 -13819 -152667 -248574 -78981 17701 185407 39295 -81492 10666 243568
15078 243568 172645 35215 138361 145275 102951 68484 -74756 -157539 -325915 -182849 61001
15067 61001 94513 115070 159428 113452 -6249 104936 321860 217529 193205 149583 -89895
15056 -89895 -129785 -281867 -394425 -456401 -332029 196191 324215 438347 334004 127091
15046 127091 14423 -56619 100629 173224 -45947 -222730 -471302 -410252 -306118 -107002
15036 -107002 -269983 -396004 -431329 -503884 -295679 85402 201230 246452 276447 344700
15026 344700 134204 101184 55226 17579 36517 88102 143720 134773 -25252 -155783 -203250
$$ packed form
15098C91430k97934k57794j42471P1963K45120P9582R2756N1752N6375j72062
15088A18717j32536j38848r5907J69593R6682J67706j46112j20787R2158K32902
15078B43568p0923j37430J03146O914m2324l4467j43240q2783j68376J43066K43850
15067F1001L3512K0557M4358m5976j19701J11185K16924j04331k4324m3622k39478
15056h9895l9890j52082j12558o1976J24372N28220J28024J14132j04343k06913
15046A27091j12668p1042J57248P2595k19171j76783k48572O1050J04134J99116
15036a07002j62981j26021l5325p2555K08205L81081J15828M5222K9995O8253
15026C44700k10496l3020m5958l7647J8938N1585N5618q947j60025j30531m7467
$$ plain form
15015 -203250 -77564 104827 187679 392766 328120 107996 -70469 76125 183861 57394
15005 57394 149483 194191 379968 200165 65470 260392 124489 91431 67777 110963 146286
14994 146286 202107 341533 247976 30140 106593 -23430 -181380 -7055 441047 313006
14984 313006 64839 203720 282277 106156 -101773 -363813 -281411 -84277 24834 -103774
14974 -103774 -26219 -74307 -305495 -239228 -116253 24774 133746 206886 267850 174424 79885
14963 79885 -63331 -300683 -126417 -153505 -380495 -338212 -332549 -181448 6482 58245 84540
14952 84540 -156134 -511787 -566078 -491248 -307460 -237743 1532 54487 -133976 -178205 -127955
14941 -127955 -152740 -153559 -69874 35416 385117 484599 463863 257275 43113 -147828 -138933
$$ packed form
15015b03250J25686J82391Q2852K05087o4646k20124j78465J46594J07736j26467
15005E7394R2089M4708J85777j79803j34695J94922j35903l3058k3654M3186L5323
14994A46286N5821J39426r3557k17836P6453j30023j57950J74325M48102j28041
14984C13006k48167J38881P8557j76121k07929k62040Q2402J97134J09111j28608
14974a03774P7555m8088k31188O6267J22975J41027J08972P3140O0964r3426r4539
14963G9885j43216k37352J74266k7088k26990M2283N663J51101J87930N1763K6295
14952H4540k40674l55653n4291P4830J83788O9717K39275N2955j88463m4229N0250
14941a27955k4785q19Q3685J05290L49701R9482k0736k06588k14162j90941Q895
$$ plain form
14930 -138933 -126752 -112362 -229025 -198458 -326080 -261385 -127969 -198533 -159168 118375 -58174
14919 -58174 -182149 54026 108076 205062 224583 112669 860 -45225 -162044 -285180
14909 -285180 -374263 -283359 -173836 106640 35989 -234824 -331081 -306121 -405045 -336144 -471664
14898 -471664 -374214 -13486 208139 -83625 -136422 48622 -85662 -409285 -449670 -73779
14888 -73779 290958 157501 158075 -15396 24744 14908 -5094 -13910 -124577 -329913 -298287
14877 -298287 -151914 -327032 -509071 -441050 -400806 -413924 -257855 -370939 -410528 -370488
14867 -370488 -475940 -450327 -440762 -351764 -282864 -267176 -39034 129442 -7399 -54897 143351
14856 143351 325915 217320 -175730 -502 262668 287735 385305 385295 275345 149767 407974
$$ packed form
14930a38933J2181J4390j16663L0567j27622O4695J33416p0564L9365K77543j76549
14919e8174j23975K36175N4050R6986J9521j11914j11809m6085j16819j23136
14909b85180q9083R0904J09523K80476p0651k70813r6257K4960r8924O8901j35520
14898d71664R7450L60728K21625k91764n2797J85044j34284l23623m0385L75891
14888g3779L64737j33457N74j73471M0140r836k0002q816j10667k05336L1626
14877b98287J46373j75118j82039O8021M0244j3118J56069j13084l9589M0040
14867c70488j05452K5613R565Q8998O8900J5688K28142J68476j36841m7498J98248
14856A43351J82564j08595l93050J75228K63170K5067R7570j0j09950j25578K58207
$$ plain form
14845 407974 454569 195974 -31161 -159577 -289161 -332524 -147856 -68668 8593 -288694
14835 -288694 -303172 -141729 -136862 28666 6340 -132455 -168452 -218391 -424094 -109170 13270
14824 13270 8700 68207 -44811 60274 133400 57946 -162817 -170908 151822 102128 -133980
14813 -133980 -210301 -198129 -189274 -353192 -268004 -80988 -188923 -29499 20721 -227892 -161497
14802 -161497 -218939 -309366 -380477 -286301 -7703 24336 -27618 86989 192679 369526 325142
14791 325142 198331 239968 128260 -96720 75910 243682 157581 -70846 -133990 -34073
14781 -34073 -80646 24968 103865 27665 48046 109113 110581 3037 184805 314813 23516
14770 23516 -276488 -329691 -320871 -389899 -175312 5458 -83423 58025 -116499 -27745 110880
$$ packed form
14845D07974M6595k58595k27135j28416j29584m3363J84668P9188P7261k97287
14835b88694j4478J61443M867J65528k2326j38795l5997m9939k05703L14924J22440
14824A3270m570N9507j13018J05085P3126p5454k20763q091L22730m9694k36108
14813a33980p6321J2172Q855j63918Q5188J87016j07935J59424N0220k48613O6395
14802a61497n7442r0427p1111R4176K78598L2039n1954J14607J05690J76847m4384
14791C25142j26811M1637j11708k24980J72630J67772q6101k28427o3144R9917
14781c4073m6573J05614P8897p6200K0381O1067J468j07544J81768J30008k91297
14770B3516l00004n3203Q820o9028K14587J80770q8881J41448j74524Q8754J38625
$$ plain form
14759 110880 -27564 75795 91741 146283 184898 75802 264538 339440 312143 212391 -4698
14748 -4698 -72075 -337906 -483278 -512350 -384255 -150077 -29505 160516 342776 149096
14738 149096 -30429 160554 198189 204332 132180 -14514 35904 165887 157261 224720 -32812
14727 -32812 31794 194328 243871 -68526 -265994 -25937 202810 294853 170286 97384
14717 97384 153766 91386 -25767 215973 109378 -85501 -142423 -52778 -164552 -269418
14707 -269418 -77878 141828 361363 270488 170835 159983 252238 213959 19009 -85279
14697 -85279 49860 78303 150086 124212 202571 93821 1904 -216766 -186692 -422891 -658168
14686 -658168 -367395 -305670 4964 109645 203899 148883 356654 407297 7384 -195305
$$ packed form
14759A10880j38444J03359J5946N4542L8615j09096J88736P4902k7297r9752k17089
14748d698o7377k65831j45372k9072J28095K34178J20572J90021J82260j93680
14738A49096j79525J90983L7635O143p2152j46694N0418J29983q626O7459k57532
14727c2812O4606J62534M9543l12397j97468K40057K28747R2043j24567p2902
14717I7384N6382o2380j17153K41740j06595j94879n6922Q9645j11774j04866
14707b69418J91540K19706K19535r0875r9653j0852R2255l8279j94950j04288
14697h5279J35139K8443P1783k5874P8359j08750r1917k18670L0074k36199k35277
14686f58168K90773O1725L10634J04681R4254n5016K07771N0643l99913k02689
$$ plain form
14676 -195305 -157343 -333049 -205000 -29765 5709 -59341 -54014 -56826 134233 287479 452018
14665 452018 166069 105360 -1008 -113061 -186134 -106517 -323964 -186937 -159305 -236034
14655 -236034 -258960 -458373 -352570 -237235 -195863 -128933 -309825 -412648 -166937 125913
14645 125913 5288 29897 283628 469968 379845 295647 202653 219123 247441 171396 41336
14634 41336 -194375 -31700 70548 56029 -5619 -57180 -58908 -176194 -76926 216455 125820
14623 125820 -98263 -150608 -222573 -262553 -29526 73675 -130438 -99339 -130169 -157965 -14094
14612 -14094 352509 355551 54185 1209 -73166 67858 9478 -165779 -237688 74479 158476
14601 158476 185578 97894 21797 -142189 -292130 -515477 -375003 -178812 -259635 -548155
$$ packed form
14676a95305L7962j75706J28049J75235L5474o5050N327k812J91059J53246J64539
14665D52018k85949o0709j06368j12053p3073P9617k17447J37027K7632p6729
14655b36034k2926j99413J05803J15335M1372O6930j80892j02823K45711K92850
14645A25913j20625K4609K53731J86340r0123q4198r2994J6470K8318p6045j30060
14634D1336k35711J62675J02248j4519o1648n1561j728j17286R9268K93381r0635
14623A25820k24083n2345p1965l9980K33027J03201k04113L1099l0830k7796J43871
14612a4094L66603L042l01366n2976p4375J41024n8380j75257p1909L12167Q3997
14601A58476K7102q7684p6097j63986j49941k23347J40474J96191q0823k88520
$$ plain form
14591 -548155 -495605 -192339 -77812 225764 303113 196067 209331 67925 -17692 136451
14581 136451 65599 -18604 -196689 -41114 51937 40463 -43216 -225519 -168139 -213785 -28768
14570 -28768 109202 44634 -85486 9314 174090 72142 -7369 -162512 -210843 -285039 -203972
14559 -203972 19087 266208 340237 97881 -32782 -251062 -113003 -42652 -144045 75220
14549 75220 50734 144672 49373 -129437 -266208 -216599 -171622 -178855 13957 3670 71810
14538 71810 228889 101360 94954 14969 -105347 -34783 -20902 90426 27279 -139490 -225239
14527 -225239 -124897 -6138 -14310 -115682 -102771 -210984 -229229 20125 281502 479317
14517 479317 430661 164319 186058 217032 245824 349485 242433 174244 139719 58382 179500
$$ packed form
14591e48155N2550L03266J14527L03576P7349j07046J3264j41406q5617J54143
14581A36451p0852q4203j78085J55575R3051j1474q3679j82303N7380m5646J85017
14570b8768J37970o4568j30120R4800J64776j01948p9511j55143m8331p4196Q1067
14559b03972K23059K47121P4029k42356j30663k18280J38059P0351j01393K19265
14549G5220k4486R3938r5299j78810j36771M9609M4977p233J92812j0287O8140
14538G1810J57079j27529o406p9985j20316P0564J3881J11328o3147j66769q5749
14527b25239J00342J18759q172j01372J2911j08213j8245K49354K61377J97815
14517D79317m8656k66342K1739L0974K8792J03661j07052o8189l4525q1337J21118
$$ plain form
14506 179500 223649 179376 -35394 -144451 44967 324381 271859 67060 31672 156877
14496 156877 322737 431562 347123 326741 168540 -158861 -223772 84729 -11693 -127384
14486 -127384 24576 49743 217644 405492 173980 -25317 -51405 311689 369993 144157
14476 144157 -51648 -18698 -16368 13411 -52858 -127303 -124168 -245761 -437138 -287749 -207500
14465 -207500 -154950 -36074 157633 270446 431384 441260 525920 255219 261728 363633 385465
14454 385465 155365 100650 365652 187153 90921 -22655 -69684 -79504 -217897 -154286 -135417
14443 -135417 -93347 -113909 -19759 106163 -101235 -193606 43078 142490 280676 144649
14433 144649 89269 -120277 -331556 57531 419395 215953 -314663 -320378 -331716 -446175
$$ packed form
14506A79500M4149m4273k14770j09057J89418K79414n2522k04799l5388J25205
14496A56877J65860J08825q4439k0382j58201l27401o4911L08501r6422j15691
14486a27384J51960K5167J67901J87848k31512j99297k6088L63094N8304k25836
14476A44157j95805L2950K330K9779o6269p4445L135j21593j91377J49389Q0249
14465b07500N2550J18876J93707J12813J60938R876Q4660k70701O509J01905K1832
14454C85465k30100n4715K65002j78499r6232j13576m7029r820j38393O3611J8869
14443a35417M2070k0562R4150J25922k07398r2371K36684R9412J38186j36027
14433A44649n5380k09546k11279L89087L61864k03442n30616n715j1338j14459
$$ plain form
14423 -446175 -256333 -214863 -339240 -357080 -494453 -608622 -521677 -283060 -281309 81402
14413 81402 383087 233349 205337 279048 242078 265667 -66973 -78752 -198109 -429321 -571040
14402 -571040 -364713 -319866 -337748 -325016 -40911 5510 76088 -12691 -74149 55198 177703
14391 177703 190028 236019 209521 66603 -5790 -15822 73277 -7795 -126454 -68619 120014
14380 120014 42972 -148134 -283375 -347710 -360365 -412439 -224332 -209558 -158524 59986 205473
14369 205473 215991 -4333 -171537 -220939 -45829 29358 -46178 -182287 -64434 -1579
14359 -1579 -38744 -84134 -82305 -163873 -264269 15573 229389 220036 243198 151720 37975
14348 37975 93883 106021 -130944 -38370 88910 160890 8323 59817 156812 142678 10438
$$ packed form
14423d46175J89842M1470j24377j7840j37373j14169Q6945K38617J751L62711
14413H1402L01685j49738k8012P3711l6970K3589l32640j1779j19357k31212j41719
14402e71040K06327M4847j7882J2732K84105M6421P0578q8779o1458J29347J22505
14391A77703J2325M5991k6498j42918p2393j0032Q9099q1072j18659N7835J88633
14380A20014p7042j91106j35241o4335j2655n2074J88107J4774N1034K18510J45487
14369B05473J0518k20324j67204m9402J75110P5187p5536j36109J17853O2855
14359a579l7165m5390J829q1568j00396K79842K13816r353K3162r1478j13745
14348C7975N5908J2138k36965R2574J27280P1980j52567N1494R6995j4134j32240
$$ plain form
14337 10438 188770 247098 262735 385629 610010 258295 74303 126872 -4120 -85425
14327 -85425 -109697 102441 260400 343512 106070 -151070 8987 67740 -314381 -394951
14317 -394951 -429415 -154763 -38378 -35806 -113306 44322 -146821 -74755 72100 2331 -250793
14306 -250793 -236557 -188790 -234855 -111140 -59541 -229338 -79922 -127431 -185146 -285172 -357707
14295 -357707 -406134 -418186 -141390 -9867 -137095 -209194 -104521 -274230 -333393 -180174
14285 -180174 24686 53517 151061 211912 3452 -44682 104921 227719 374924 277269
14275 277269 161198 -90273 -143548 -237065 -57615 324776 505706 321246 257610 430972
14265 430972 423769 391586 316050 285333 144396 -9165 126542 64812 -225491 -261770 19519
$$ packed form
14337A0438J78332N8328J5637J22894K24381l51715j83992N2569j30992q1305
14327h5425k4272K12138J57959Q3112k37442k57140J60057N8753l82121q0570
14317c94951l4464K74652J16385K572p7500J57628j91143P2066J46855o9769k53124
14306b50793J4236M7767m6065J23715N1599j69797J49416m7509n7715j00026p2535
14295c57707m8427j2052K76796J31523j27228p2099J04673j69709n9163J53219
14285a80174K04860K8831R7544O0851k08460m8134J49603J22798J47205r7655
14275B77269j16071k51471n3275r3517J79450L82391J80930j84460o3636J73362
14265D30972p203l2183p5536l0717j40937j53561J35707o1730k90303l6279K81289
$$ plain form
14254 19519 172736 347360 167219 -166530 -228275 -241900 9043 93368 399555 562469
14244 562469 283211 429296 319588 165212 88435 4390 -43579 155291 234281 -61898
14234 -61898 -181261 -167545 -228894 -467529 -472347 -441745 -315750 -132895 45392 61962 1069
14223 1069 33079 -131632 -190272 -294942 -270619 -258873 -126206 -215062 -184675 -140722 -207422
14212 -207422 -112882 -11131 93234 90666 72658 10305 -180097 -341647 -266904 63652 166816
14201 166816 196289 313499 247795 183000 194505 171292 30245 -101417 -132871 -41276 93446
14190 93446 49283 70547 26641 74362 236923 91677 -60012 -29949 -148366 -83345 -50691
14179 -50691 -64975 147513 55128 9689 -46621 56635 171011 199094 71636 192017 -23795
$$ packed form
14254A9519J53217J74624j80141l33749o1745j3625K50943Q4325L06187J62914
14244E62469k79258J46085j09708j54376p6777q4045m7969J98870P8990k96179
14234f1898j19363J3716o1349k38635m818L0602J25995J82855J78287J6570o0893
14223A069L2010j64711n8640j04670K4323J1746J32667q8856L0387M3953o6700
14212b07422R4540J01751J04365k568j8008o2353j90402j61550P4743L30556J03164
14201A66816K9473J17210o5704o4795J1505k3213j41047j31662l1454R1595J34722
14190I3446m4163K1264m3906M7721J62561j45246j51689L0063j18417O5021L2654
14179e0691j4284K12488r2385m5439n6310J03256J14376K8083j27458J20381k15812
$$ plain form
14168 -23795 -3128 93260 203955 172206 183211 166487 -55665 -210748 -96296 -146569 -220263
14157 -220263 -154325 1491 -146344 -8437 -4909 -91331 -29457 102466 -90234 -257296
14147 -257296 -169034 -477 81191 123019 129463 157501 58676 157423 490532 446285 391679
14136 391679 330513 167325 -4880 44081 198303 260062 313949 268447 204839 206036 5927
14125 5927 190933 331876 138941 -41645 27154 114154 203130 133171 -10941 -116286 -98896
14114 -98896 -164746 -107379 -110423 -203422 -177034 -216403 -205010 -67478 176406 156719 141051
14103 141051 271563 452941 225611 -317439 -293829 -208927 -23273 64693 92136 188622
14093 188622 221102 281923 288667 29044 -136812 44926 121836 77304 116042 54367 18146
$$ packed form
14168b3795K0667R6388J10695l1749J1005j6724k22152j55083J14452n0273p3694
14157b20263O5938J55816j47835J37907L528q6422O1874J31923j92700j67062
14147b57296Q8262J68557Q1668M1828O444K8038r8825R8747L33109m4247n4606
14136C91679o1166j63188j72205M8961J54222O1759N3887m5502o3608J197k00109
14125E927J85006J40943j92935j80586O8799Q7000Q8976o9959j44112j05345J7390
14114i8896o5850N7367l044r2999K6388l9369J1393J37532K43884j9687j5668
14103A41051J30512J81378k27330n43050K3610Q4902J85654Q7966K7443R6486
14093A88622L2480O0821O744k59623j65856J81738P6910m4532L8738o1675l6221
$$ plain form
14082 18146 -224229 -209828 -162032 -31591 -78890 -173055 -8399 -26221 -260660 -143868 -60923
14071 -60923 -128945 -51962 -128892 -455299 -422578 -315294 -137921 -222864 -351511 -196981 -213965
14060 -213965 -404886 -473148 -399260 -460716 -443483 -150856 129196 56677 -193337 -132261 -6682
14049 -6682 172896 174851 67308 -63188 -80291 34593 -187038 -234392 -192863 -449582 -295901
14038 -295901 -75326 -39044 175331 56766 -293513 -160630 73210 167019 182049 91446
14028 91446 129121 146408 131354 -35154 155469 196160 -194911 -136259 122591 35978 -120965
14017 -120965 -263188 31783 -14932 -60837 -149401 -229721 27054 169652 187289 217345 148742
14006 148742 -84211 -159590 -216653 -266198 -186766 112901 202878 137853 98691 -110241 -165602
$$ packed form
14082A8146k42375J4401M7796J30441m7299r4165J64656j7822k34439J16792Q2945
14071f0923o8022P6983p6930l26407L2721J07284J77373q4943j28647J54530j6984
14060b13965j90921o8262P3888o1456J7233K92627K80052p2519k50014O1076J25579
14049f682J79578J955j07543j30496j7103J14884k21631m7354M1529k56719J53681
14038b95901K20575L6282K14375j18565l50279J32883K33840R3809J5030r0603
14028I1446L7675J7287j5054j66508J90623M0691l91071N8652K58850q6613j56943
14017a20965j42223K94971m6715m5905q8564q0320K56775J42598J7637L0056o8603
14006A48742k32953p5379n7063m9545P9432K99667Q9977o5025l9162k08932n5361
$$ plain form
13995 -165602 -147805 -166495 -258204 -280528 -221433 -322551 -161893 31648 -42226 -217986 -284060
13984 -284060 -107293 82609 -111130 -60180 53499 152310 106718 185678 374087 132807
13974 132807 -101222 -152784 -225899 -223299 -328275 -263363 -167982 -300231 -195592 -13107 63355
13963 63355 36052 -36269 -195277 -218927 116237 111937 51766 -71540 -180839 25812 -65855
13952 -65855 -179035 -266352 -419902 -491322 -283874 -326096 -346265 -448806 -367232 -279835 -355930
13941 -355930 -337694 -80125 13645 50076 -119215 11327 23579 -106658 -147918 -223177 -34545
13930 -34545 52073 -25576 -80165 -219837 -382391 -154757 -208836 -217678 83958 237071 241694
13919 241694 223466 181091 291346 263222 177438 250569 210225 32554 -23933 -172230 -114302
$$ packed form
13995a65602J7797j8690r1709k2324N9095j01118J60658J93541p3874j75760o6074
13984b84060J76767J89902j93739N0950J13679R8811m5592P8960J88409k41280
13974A32807k34029n1562p3115K600j04976O4912R5381j32249J04639J82485P6462
13963F3355k7303p2321j59008k3650L35164m300o0171j23306j09299K06651r1667
13952f5855j13180q7317j53550p1420K07448m2222k0169j02541Q1574Q7397p6095
13941c55930J8236K57569R3770L6431j69291J30542J2252j30237m1260p5259J88632
13930c4545Q6618p7649n4589j39672j62554K27634n4079q842L01636J53113M623
13919B41694j8228m2375J10255k8124q5784P3131m0344j77671n6487j48297N7928
$$ plain form
13908 -114302 59983 25508 17979 -52701 -81768 -71778 -62823 -24577 3725 -113442 -201485 -236069
13896 -236069 -279485 -242744 -296666 -260096 -74185 -99460 -181314 -190094 -190315 -55083 53812
13885 53812 -121738 -118007 -254133 -165322 -64875 -177352 -391659 -385677 -209803 -219243 -88956
13874 -88956 17907 -166157 -156215 -86622 -103884 38951 84669 121183 193655 111441 135957
13863 135957 121736 -108922 -175941 -261749 -271357 -227465 -86491 195893 252585 203468 -43247
13852 -43247 -230219 -42370 -113959 -146712 -39591 -50679 -50000 -267529 -293081 -218609 -253717
13841 -253717 -95068 33201 64282 359430 344256 247878 238128 292585 94129 170818 132554
13830 132554 99575 150058 168522 128360 -19431 -36119 137818 35369 163976 292740
$$ packed form
13908a14302J74285l4475p529p0680k9067R990Q955L8246K8302j17167q8043l4584
13896b36069m3416L6741n3922L6570J85911k5275q1854q780k21J35232J08895
13885E3812j75550L731j36126Q8811J00447j12477k14307N982J75874r440J30287
13874h8956J06863j84064R942O9593j7262J42835M5718L6514P2472q2214K4516
13863A35957j4221k30658o7019q5808r608M3892J40974K82384N6692m9117k46715
13852d3247j86972J87849p1589l2753J07121j1088O79k17529k5552P4472l5108
13841b53717J58649J28269L1081K95148j5174r6378r750N4457j98456P6689l8264
13830A32554l2979N0483J8464m0162j47791j6688J73937j02449J28607J28764
$$ plain form
13820 292740 172536 20131 47906 48389 -107236 -60482 -86843 79852 244580 168047 90019
13809 90019 3052 -198032 -391566 -466131 -350208 -397123 -357062 -307873 -137275 -258215 -293083
13798 -293083 -133836 -24762 -58393 -191467 -110320 -105774 -177189 -253724 -392015 -332557 -95445
13787 -95445 -145028 -200151 -209737 -209157 -133452 -99425 -94410 -190438 -95186 -73757 -61268 22799
13775 22799 -93123 -6743 72992 50453 84892 209994 253042 -45721 -158768 -161651 -250239
13764 -250239 -425372 -296041 -228048 -45890 55070 -23761 -142824 -297749 -140301 91382
13754 91382 -278 -221525 -223452 -80303 21478 -22479 -179450 -333398 -414476 -232927 -148062
13743 -148062 -159687 -196978 -98654 2502 -114340 -165421 -29773 -67162 68282 246704
$$ packed form
13820B92740j20204j52405K7775M83j55625M6754k6361J66695J64728p6533p8028
13809I0019q6967k01084j93534p4565J15923m6915M0061M9189J70598j20940l4868
13798b93083J59247J09074l3631j33074Q1147M546p1415p6535j38291N9458K37112
13787i5445m9583n5123r586N80P5705L4027N015r6028R5252K1429J2489Q4067
13775B2799j15922Q6380P9735k2539L4439J25102M3048k98763j13047k883q8588
13764b50239j75133J29331O7993J82158J00960p8831j19063j54925J57448K31683
13754I1382r1660k21247j927J43149J01781m3957j56971j53948q1078J81549Q4865
13743a48062j1625l7291R8324J01156j16842n1081J35648l7389J35444J78422
$$ plain form
13733 246704 402512 443832 510435 513726 421280 433117 281038 195897 60873 -48800 -73103
13722 -73103 30874 -60618 -94889 55764 135321 49498 -75122 -142603 -147134 -91994 -264506
13711 -264506 -288363 75571 228399 346153 125941 57862 44061 -109204 -162999 -165716 -162256
13700 -162256 -28712 -397187 -420508 -325389 -400959 -261726 -120846 180079 -46207 -65680
13690 -65680 23163 -95021 145486 474665 408925 138788 128166 247302 139815 -79096
13680 -79096 -79666 146852 520394 542519 167357 -134765 -274456 -39093 35936 -107698 15877
13669 15877 64360 -148882 -56389 116836 293939 323140 217959 -35002 -113184 -59604 -275758
13658 -275758 -294881 -6696 330107 424420 119146 -42830 52220 69673 -10845 46084 -77984
$$ packed form
13733B46704J55808M1320O6603L291r2446J1837j52079q5141j35024j09673k4303
13722g3103J03977r1492l4271J50653P9557q5823j24620o7481m531N5140j72512
13711b64506k3857L63934J52828J17754k20212o8079j3801j53265n3795k717L460
13700a62256J33544l68475k3321R5119p5570J39233J40880L00925k26286j9473
13690f5680Q8843j18184K40507L29179o5740k70137j0622J19136j07487k18911
13680g9096n70K26518L73542K2125l75162l02122j39691K35363P5029j43634J23575
13669A5877M8483k13242R2493J73225J77103K9201j05181k52961p8182N3580k16154
13658b75758j9123K88185L36803R4313l05274j61976R5050J7453q0518N6929j24068
$$ plain form
13647 -77984 -74664 62569 133276 97707 137416 236142 256914 244986 -22412 24062 27386 -25722
13635 -25722 -121040 -157997 -172517 -146287 -103297 -75527 171925 63335 -122581 -129875 -98412
13624 -98412 -143592 -96358 -73377 -125937 191689 406918 21214 -8338 147737 74005 66750
13613 66750 247163 185050 231922 224962 172288 407061 442325 470753 602586 253510 134628
13602 134628 143503 203871 170207 26028 176690 301174 296289 -16407 -183993 -167881 -121794
13591 -121794 -60717 158448 33530 62363 31153 -136834 -45660 27514 -48302 -152712 -241764
13580 -241764 -114241 -93128 23308 -90373 -176127 -52151 38386 112348 99404 290907
13570 290907 350537 400878 447889 243387 -89643 -167088 -118279 -92908 117036 264977 370753
$$ packed form
13647g7984L320J37233P0707l5569L9709R8726K0772j1928k67398M6474L324n3108
13635b5722r5318l6957j4520K6230M2990K7770K47452j08590j85916p294L1463
13624i8412m5180M7234K2981n2560L17626K15229l85704k9552J56075p3732p255
13613F6750J80413o2113M6872o960n2674K34773L5264K8428J31833l49076j18882
13602A34628Q875O0368l3664j44179J50662J24484m885l12696j67586J6112M6087
13591a21794O1077K19165j24918K8833l1210j67987R1174P3174p5816j04410q9052
13580b41764J27523K1113J16436j13681q5754J23976R0537P3962j2944J91503
13570B90907N9630N0341M7011k04502l33030p7445M8809K5371K09944J47941J05776
$$ plain form
13559 370753 271183 35542 52917 62259 21553 46446 73423 21050 -91329 -38822 57956
13548 57956 -69767 -155586 -126137 -3873 -79408 -188788 -287847 -329734 -173285 -34266 -61118
13537 -61118 -5560 52616 109675 -12866 -165535 -377824 -240163 -102384 -66472 -209281
13527 -209281 -160858 -4969 -70664 53341 145123 -74453 -137725 -131727 -183816 -47596 -226709
13516 -226709 -254820 -86668 40185 -33656 -106211 -217618 -144688 -202752 -268071 -337185 -311945
13505 -311945 -33760 16172 -332717 -413052 -559723 -499536 -222452 -88562 -22023 42874
13495 42874 25951 -1702 2098 -94290 -393744 -361851 -158170 74713 5722 -139796 69124
13484 69124 170272 200905 254249 274175 258963 100624 -8645 82685 44208 41970 -147997
$$ packed form
13559C70753r9570k35641J7375R342m0706K4893K6977n2373j12379N2507R6778
13548E7956j27723q5819K9449J22264p5535j09380r9059m1887J56449J39019k6852
13537f1118N5558N8176N7059j22541j52669k12289J37661J37779L5912j42809
13527b09281M8423J55889o5695J24005R1782k19576o3272N998n2089J36220j79113
13516b26709k8111J68152J26853p3841p2555j11407P2930n8064o5319o9114K5240
13505c11945K78185M9932l48889q0335j46671O0187K77084J33890O6539O4897
13495D2874j6923k7653L800r6388k99454L1893K03681K32883o8991j45518K08920
13484F9124J01148L0633N3344J9926j5212j58339j09269R1330l8477k238j89967
$$ plain form
13473 -147997 -383068 -419854 -288073 -153989 64762 172079 71251 -115267 -259204 -364790
13463 -364790 -323070 -463355 -499872 -118594 116789 189361 312683 297065 229687 26431
13453 26431 -216059 -406759 -400557 -210785 -48246 193885 -27543 -307045 -133837 41948
13443 41948 -14863 19334 102576 76582 -117522 -138421 -167394 -168356 -121176 -12215 66691 202769
13431 202769 429430 215368 174065 294915 312303 184298 73872 61875 24309 119659
13421 119659 287253 400545 59808 -75345 -180817 -195564 -16853 124786 230943 53605
13411 53605 -216871 -282588 -282798 -248339 -383757 -487190 -400097 -305234 -210488 -240672 -454455
13400 -454455 -217099 -205174 -227254 -226362 -208861 -170994 -405244 -250402 -180849 -253832 -297549
$$ packed form
13473a47997k35071l6786J31781J34084K18751J07317j00828j86518j43937j05586
13463c64790M1720j40285l6517L81278K35383P2572J23322j5618o7378k03256
13453B6431k42490j90700O202J89772J62539K42131k21428k79502J73208J75785
13443D1948n6811L4197Q3242k5994j94104k0899k8973r62M7180J08961P8906J36078
13431B02769K26661k14062m1303J20850J7388j28005j10426j1997l7566R5350
13421A19659J67594J13292l40737j35153j05472j4747J78711J41639J06157j77338
13411E3605k70476o5717k10L4459j35418j03433Q7093R4863R4746l0184k13783
13400d54455K37356J1925k2080Q92J7501L7867k34250J54842O9553p2983m3717
$$ plain form
13389 -297549 -206663 -139728 -129779 -140772 -74824 -153417 -224399 -165791 -11958 25574 2578
13378 2578 -241335 -388507 -138331 -65823 -176776 -130051 20379 385 -83735 -90806 -143007
13367 -143007 -131231 -115716 30127 -2909 -37851 -150141 -242889 -58183 -37080 -147218 -197269
13356 -197269 24394 70895 -5824 -164210 -127763 -119634 -256907 -319747 -376877 -465258 -396935
13345 -396935 -251244 -240566 -159848 -175925 -128965 -222215 23720 62854 44217 -105094 -113686
13334 -113686 38708 114240 357366 221476 163485 55343 82369 5568 -131616 -177953
13324 -177953 -239615 40723 67131 -142061 -124105 -39368 166669 80031 -60478 -88544 186584
13313 186584 332989 483368 550931 627944 522559 418006 432471 525701 557116 428446
$$ packed form
13389b97549R0886O6935R949j0993O5948p8593p0982N8608J53833L7532k2996
13378B578k43913j47172K50176P2508j10953M6725J50430j9994q4120p071n2201
13367a43007J1776J5515J45843l3036l4942j12290r2748J84706K1103j10138n0051
13356a97269K21663M6501p6719j58386L6447Q129j37273o2840n7130q8381O8323
13345c96935J45691J0678Q0718j6077M6960r3250K45935L9134j8637j49311q592
13334a13686J52394P5532K43126j35890n7991j08142K7026p6801j37184m6337
13324a77953o1662K80338K6408k09192J7956Q4737K06037q6638j40509k8066K75128
13313A86584J46405J50379O7563P7013j05385j04553J4465R3230L1415j28670
$$ plain form
13303 428446 265512 -26497 -244216 -257438 -141072 -177961 9625 145619 136569 71212
13293 71212 43278 145532 178854 -6294 136077 192949 229387 177327 87621 19867 -380967
13282 -380967 -360612 -219897 -30342 93447 73195 -84556 -11706 10391 47032 -117843
13272 -117843 -65924 153772 1820 -245956 -132166 -344 77226 -54392 33566 234980
13262 234980 123515 36680 186974 196767 86261 155416 1989 -3589 3942 -59282 -97193
13251 -97193 39085 108480 182868 111244 223590 384384 574984 405172 306614 205278
13241 205278 111235 -13138 -114101 -196853 -105451 -33386 -160494 -226898 -148068 43524 97092
13230 97092 48138 165934 32720 -165960 -91747 -38367 50018 87156 50493 35582 67643
$$ packed form
13303D28446j62934k92009k17719j3222J16366l6889J87586J35994r050o5357
13293G1212k7934J02254L3322j85148J42371N6872L6438n2060q9706o7754m00834
13282c80967K0355J40715J89555J23789k0252j57751P2850K2097L6641j64875
13272a17843N1919K19696j51952k47776J13790J31822P7570j31618Q7958K01414
13262B34980j11465q6835J50294R793j10506O9155j53427n578P531o3224l7911
13251i7193J36278O9395P4388p1624J12346J60794J90600j69812r8558j01336
13241B05278r4043j24373j00963q2752R1402P2065j27108o6404P8830J91592N3568
13230I7092m8954J17796j33214j98680P4213N3380Q8385L7138l6663j4911L2061
$$ plain form
13219 67643 59093 98404 127851 256048 97954 90831 -28261 -24459 169040 262829 303790
13208 303790 329688 282568 197919 74415 -118685 -135032 -91207 -81171 64634 103539 -175207
13197 -175207 -45887 170964 246016 181600 218014 -11204 -192101 -102922 23676 155016
13187 155016 -37979 -114573 -67354 28813 -278156 -328576 -278056 -66970 -120401 -106551 -14437
13176 -14437 214273 131892 -73256 -112587 -123666 35069 99529 191199 -8370 -91404 -126164
13165 -126164 -143930 -175739 -170400 -251566 -185508 -109774 -88232 -111552 -113351 -244383 -211438 -211316
13153 -211316 -74158 19385 79348 67566 59277 12119 -27241 260500 335709 328707 436724
13142 436724 109033 -19229 46614 -103097 -211409 -198455 -132190 -99163 -110866 -233434
$$ packed form
13219F7643q550L9311K9447J28197j58094p123j19092L802J93499R3789M0961
13208C03790K5898m7120q4649j23504j93100j6347M3825J0036J45805L8905k78746
13197a75207J29320K16851P5052o4416L6414k29218j80897Q9179J26598J31340
13187A55016j92995p6594M7219R6167l06969n0420N0520K11086n3431J3850R2114
13176a4437K28710q2381k05148l9331j1079J58735O4460R1670j99569q3034l4760
13165a26164j7766l1809N339q1166O6058P5734K1542k3320j799j31032L2945J22
13153b11316J37158R3543N9963j1782q289m7158l9360K87741P5209p002J08017
13142D36724l27691j28262O5843j49711j08312J2954O6265L3027j1703j22568
$$ plain form
13132 -233434 -393613 -457102 -403041 -171386 157861 257445 270157 -112895 -137632 -120037 -124281
13121 -124281 -39558 -148179 -371763 -171983 196591 348706 165949 365057 467363 441765
13111 441765 520492 336688 434574 170432 -50934 -170663 79873 124982 1974 -291070
13101 -291070 -308991 -294303 -244013 -22562 -227819 -8115 128843 -3757 -39523 12672
13091 12672 211765 321043 120259 -106650 -128269 -22208 38656 60990 -246305 -319999
13081 -319999 -206323 -238038 -211685 -99510 -213485 -312465 -251074 -264279 -265167 -291929 -392681
13070 -392681 -201483 -140911 84948 80928 -1734 -29355 -123933 -109009 118570 254288 381276
13059 381276 508542 524284 255668 -61799 -240144 -15252 129289 -224619 -279927 39480
$$ packed form
13132b33434j60179o3489N4061K31655L29247R9584J2712l83052k4737J7595m244
13121a24281Q4723j08621k23584J99780L68574J52115j82757J99108J02306k5598
13111D41765P8727j83804R7886k64142k21366j19729K50536M5109j23008k93044
13101b91070j7921J4688N0290K21451k05257K19704J36958j32600l5766N2195
13091A2672J99093J09278k00784k26909k1619J06061O0864K2334l07295p3694
13081c19999J13676l1715K6353J12175j13975r8980O1391j3205q88k6762j00752
13070c92681J91198O0572K25859m020q2662k7621r4578J4924K27579J35718J26988
13059C81276J27266J5742k68616l17467j78345K24892J44541l53908n5308L19407
$$ plain form
13049 39480 191717 81337 54620 -15166 -31931 -47321 57829 25294 106849 290652 300854
13038 300854 46268 -112006 -165457 -6301 71049 -153265 -501973 -331298 -113610 -134562
13028 -134562 -58313 36315 -205892 -259143 -210068 -147122 -7461 134911 374972 163865
13018 163865 -53607 -214953 -270612 -349163 -388065 -481246 -612040 -696652 -445833 -28448
13008 -28448 6399 -162080 -175069 -133978 -125371 -144794 -196144 -59318 -12078 -287217 -197387
12997 -197387 146758 -19908 -90110 88674 299491 296280 248735 67651 215443 341409
12987 341409 219770 110336 -207298 -121437 -61297 160302 127710 -98487 -80304 -37275
12977 -37275 -30396 -91359 -218152 -183199 4963 -62588 -253602 -249253 -199093 -177725 -192472
$$ packed form
13049C9480J52237j10380k6717o9786j6765j5390J05150l2535Q1555J83803J0202
13038C00854k54586j58274n3451J59156P7350k24314l48708J70675K17688k0952
13028a34562P6249R4628k42207n3251M9075O2946J39661J42372K40061k11107
13018A63865k17472j61346n5659p8551l8902r3181j30794q4612K50819M17385
13008b8448L4847j68479j2989M1091Q607j9423n1350J36826M7240k75139Q9830
12997a97387L44145j66666p0202J78784K10817l211m7545j81084J47792J25966
12987C41409j21639j09434l17634Q5861O0140K21599l2592k26197J8183M3029
12977c7275O879o0963j26793L4953J88162o7551j91014M349N0160K1368j4747
$$ plain form
12966 -192472 -254891 -126104 208252 87597 -231764 -322106 -149478 -15189 126411 -39876
12956 -39876 -89340 -14114 -37871 25575 103370 84972 106982 218035 330324 123468 -72484
12945 -72484 1534 23444 -16556 47176 -8209 -60218 -260934 -262407 -184731 -165875 -27465
12934 -27465 71321 152827 113226 -159366 -191143 27027 88068 83995 -2131 5178 -173335
$$ packed form
12966a92472o2419J28787L34356j20655l19361r0342J72628J34289J41600j66287
12956c9876m9464P5226k3757O3446P7795j8398K2010J11053J12289k06856j95952
12945g2484P4018K1910m0000O3732n5385n2009k00716j473P7676J8856J38410
12934b7465R8786Q1506l9601k72592l1777K18170O1041m073q6126P309j78513
$$ [...]
##END NTUPLES=NMR SPECTRUM
##END=
