##TITLE=Analysis number 323051
Compound Code cc 50209
Book Reference 464/68/7
Project Code adrs
Chemist Name chrisr
##JCAMPDX= 6.0         $$ Bruker NMR JCAMP-DX V2.0
##DATA TYPE= NMR SPECTRUM
##DATA CLASS= NTUPLES
##ORIGIN= Bruker BioSpin GmbH
##OWNER= nmr
$$ XWIN-NMR		Version 3.5
$$ Tue Oct 17 16:26:26 2006 GMT Daylight Time (UT+1h)  MAYBRIDGE\nmr@NMR_250MHZ
##.OBSERVE FREQUENCY= 250.131544655141
##.OBSERVE NUCLEUS= ^1H
##.ACQUISITION MODE= SIMULTANEOUS (DQD)
##.ACQUISITION SCHEME= undefined
##.AVERAGES= 16
##.DIGITISER RES= 18
##SPECTROMETER/DATA SYSTEM= dpx250
##.PULSE SEQUENCE= zg30
##.SOLVENT NAME= CDCl3
##.SHIFT REFERENCE= (INTERNAL, CDCl3, 0, 16.522)
##AUDIT TRAIL= $$ (NUMBER, WHEN, WHO, WHERE, WHAT)
$$ ##TITLE= Audit trail, XWIN-NMR		Version 3.5
$$ ##JCAMPDX= 5.01
$$ ##ORIGIN= Bruker BioSpin GmbH
$$ ##OWNER= nmr
$$ C:\u/data/dgb/nmr/ADRS/700/pdata/1/auditp.txt
$$ ##AUDIT TRAIL=  $$ (NUMBER, WHEN, WHO, WHERE, WHAT)
(   1,<2006-10-17 16:26:04.93 +100>,<MAYBRIDGE\nmr>,<NMR_250MHZ>,
      <created by zg, POWCHK disabled, PULCHK disabled
       configuration hash MD5:
       49 4B E0 1D 92 C2 6B 37 9F E6 65 BC 52 41 86 1D
       data hash MD5: 64K
       9E 6E 49 F0 92 A9 6F D8 17 4B 13 AA F0 0B C0 06>)
(   2,<2006-10-17 16:26:16.90 +100>,<MAYBRIDGE\nmr>,<NMR_250MHZ>,
      <Start of raw data processing
       ef LB = 0.3 FT_mod = 6 PKNL = 1 SI = 32K 
       data hash MD5: 32K
       17 2B D6 69 AD 5E 75 03 68 C4 EC 64 EB 86 61 8C>)
(   3,<2006-10-17 16:26:18.57 +100>,<MAYBRIDGE\nmr>,<NMR_250MHZ>,
      <apk 
       data hash MD5: 32K
       39 7D AB 20 59 52 A8 D6 DB 70 53 79 84 CA 26 C7>)
(   4,<2006-10-17 16:26:19.40 +100>,<MAYBRIDGE\nmr>,<NMR_250MHZ>,
      <abs ABSG = 5 
       data hash MD5: 32K
       7D 70 6C EF 21 39 64 FE EA 05 1E 7F 3B 53 C8 28>)
$$ ##END=
$$ 
$$ hash MD5
$$ 78 93 E5 D1 AA B8 FD 18 68 D1 EA 92 E0 CC 5B 8C
##$RELAX= 
##$RELAX= 
##$RELAX= 
##$RELAX= 
##$RELAX= 
##$RELAX= 
##$RELAX= 
$$ Bruker specific parameters
$$ --------------------------
##$DU= <C:\u>
##$EXPNO= 700
##$NAME= <ADRS>
##$PROCNO= 1
##$TYPE= <nmr>
##$USER= <dgb>
##$AMP= (0..31)
100 100 100 100 100 100 100 100 100 100 100 100 100 100 100 100 100 100 
100 100 100 100 100 100 100 100 100 100 100 100 100 100 
##$AQSEQ= 0
##$AQ_mod= 3
##$AUNM= <au_zg>
##$AUTOPOS= <5 >
##$BF1= 250.13
##$BF2= 250.13
##$BF3= 250.13
##$BF4= 250.13
##$BF5= 500.13
##$BF6= 500.13
##$BF7= 500.13
##$BF8= 500.13
##$BYTORDA= 1
##$CFDGTYP= 0
##$CFRGTYP= 5
##$CHEMSTR= <none>
##$CNST= (0..31)
1 1 145 1 1 1 1 1 1 1 1 1 1 1 1 1 1 1 1 1 1 1 1 1 1 1 1 1 1 1 1 1 
##$CPDPRG= <>
##$CPDPRG1= <>
##$CPDPRG2= <>
##$CPDPRG3= <>
##$CPDPRG4= <mlev>
##$CPDPRG5= <mlev>
##$CPDPRG6= <mlev>
##$CPDPRG7= <mlev>
##$CPDPRG8= <mlev>
##$CPDPRGB= <>
##$CPDPRGT= <>
##$D= (0..31)
0 1 0 0 0 0 0 0 0 0.06 0 0 0 0 0 0 0.0002 0 0 0 0 0 0 0 0 0 0 0 0 0 0 
0 
##$DATE= 1161098764
##$DBL= (0..7)
120 120 120 120 120 120 120 120 
##$DBP= (0..7)
150 150 150 150 150 150 150 150 
##$DBP07= 0
##$DBPNAM0= <>
##$DBPNAM1= <>
$$ [...]
##$SUBNAM7= <"">
##$SUBNAM8= <"">
##$SUBNAM9= <"">
##$SW= 20.6930455092707
##$SWIBOX= (0..15)
0 0 3 0 0 0 0 0 0 0 0 0 0 0 0 0 
##$SW_h= 5175.983436853
##$TD= 65536
##$TD0= 1
##$TE= 683.16
##$TE2= 300
##$TE3= 300
##$TEG= 300
##$TL= (0..7)
0 120 120 120 120 120 120 120 
##$TP= (0..7)
150 150 150 150 150 150 150 150 
##$TP07= 0
##$TPNAME0= <>
##$TPNAME1= <>
##$TPNAME2= <>
##$TPNAME3= <>
##$TPNAME4= <>
##$TPNAME5= <>
##$TPNAME6= <>
##$TPNAME7= <>
##$TPOAL= (0..7)
0.5 0.5 0.5 0.5 0.5 0.5 0.5 0.5 
##$TPOFFS= (0..7)
0 0 0 0 0 0 0 0 
##$TUNHIN= 0
##$TUNHOUT= 0
##$TUNXOUT= 0
##$USERA1= <user>
##$USERA2= <user>
##$USERA3= <user>
##$USERA4= <user>
##$USERA5= <user>
##$V9= 5
##$VALIST= <valist>
##$VCLIST= <CCCCCCCCCCCCCCC>
##$VD= 0
##$VDLIST= <DDDDDDDDDDDDDDD>
##$VPLIST= <PPPPPPPPPPPPPPP>
##$VTLIST= <TTTTTTTTTTTTTTT>
##$WBST= 1024
##$WBSW= 4
##$XGAIN= (0..3)
0 0 0 0 
##$XL= 0
##$YL= 0
##$YMAX_a= 436971
##$YMIN_a= -240827
##$ZGOPTNS= <>
##$ZL1= 120
##$ZL2= 120
##$ZL3= 120
##$ZL4= 120
##$ABSF1= 16.522
##$ABSF2= -4.171173
##$ABSG= 5
##$ABSL= 3
##$ALPHA= 0
##$AQORDER= 0
##$ASSFAC= 0
##$ASSFACI= 0
##$ASSFACX= 0
##$ASSWID= 0
##$AUNMP= <proc_1d>
##$AZFE= 0.1
##$AZFW= 0.1
##$BCFW= 0
##$BC_mod= 0
##$BYTORDP= 0
##$COROFFS= 0
##$CY= 12.5
##$DATMOD= 1
##$DC= 0
##$DFILT= <>
##$DTYPP= 0
##$F1P= 14.0000005364418
##$F2P= -0.99999901652339
##$FCOR= 0.5
##$FTSIZE= 32768
##$FT_mod= 6
##$GAMMA= 0
##$GB= 0
##$INTBC= 1
##$INTSCL= 1
##$ISEN= 128
##$LB= 0.3
##$LEV0= 0
##$LPBIN= 0
##$MAXI= 10000
##$MC2= 0
##$MEAN= 0
##$ME_mod= 0
##$MI= 0
##$NCOEF= 0
##$NC_proc= -5
##$NLEV= 6
##$NOISF1= 0
##$NOISF2= 0
##$NSP= 0
##$NTH_PI= 0
##$NZP= 0
##$OFFSET= 16.522
##$PC= 1
##$PHC0= -48.45814
##$PHC1= 9.502621
##$PH_mod= 1
##$PKNL= yes
##$PPARMOD= 0
##$PSCAL= 4
##$PSIGN= 0
##$REVERSE= no
##$SF= 250.13
##$SI= 32768
##$SIGF1= 0
##$SIGF2= 0
##$SINO= 400
##$SIOLD= 32768
##$SREGLST= <1H.CDCl3>
##$SSB= 0
##$STSI= 32768
##$STSR= 0
##$SW_p= 5175.98343685301
##$SYMM= 0
##$S_DEV= 0
##$TDeff= 65536
##$TDoff= 0
##$TI= <Analysis number 999999
Compound Code 99
Book Reference 9
Project Code 9>
##$TILT= no
##$TM1= 0
##$TM2= 0
##$TOPLEV= 0
##$USERP1= <user>
##$USERP2= <user>
##$USERP3= <user>
##$USERP4= <user>
##$USERP5= <user>
##$WDW= 1
##$XDIM= 32768
##$YMAX_p= 422768645
##$YMIN_p= -1045152
$$ End of Bruker specific parameters
$$ ---------------------------------
##NTUPLES= NMR SPECTRUM
##VAR_NAME=  FREQUENCY,     SPECTRUM/REAL,   SPECTRUM/IMAG
##SYMBOL=    X,             R,               I
##VAR_TYPE=  INDEPENDENT,   DEPENDENT,       DEPENDENT
##VAR_FORM=  AFFN,          ASDF,            ASDF
##VAR_DIM=   32768,         32768,           32768
##UNITS=     HZ,            ARBITRARY UNITS, ARBITRARY UNITS
##FACTOR=    0.157963299565203, 1,           1
##FIRST=     4132.6476996994, 0,             0
##LAST=      -1043.33573715361, 0,           0
##MIN=       -1043.33573715361, -1045152,    0
##MAX=       4132.6476996994, 422768645,     0
$$ Real data points
##PAGE= N=1
##DATA TABLE= (X++(R..R)), XYDATA
$$ [...]
18867A938083q5630J86461L62794J74114j98833L3092L47446M3368K54069K75698
$$ 1938083 1852453 2038914 2401708 2575822 2376989 2410081 2757527 2800895 3054964 3330662
18857C330662K94021J91961L53632L41634O12143J180925J853262L161871M963802
$$ 3330662 3624683 3816644 4170276 4511910 5124053 6304978 8158240 11320111 16283913
18848A6283913Q952102J3039779J1874718K415490m650720n991818o054106o150842
$$ 16283913 25236015 38275794 50150512 52566002 47915282 41923464 35869358 29718516
18840B9718516n478740l941084j667928P34041L775866P891132J2168675J0217882
$$ 29718516 24239776 20298692 18630764 19364805 23140671 31031803 43200478 53418360
18832E3418360N54987n810156o446586o562281o907360o220451n028541l109881
$$ 53418360 53973347 48163191 41716605 35154324 28246964 22026513 16997972 13888091
18824A3888091k223307j435002p12740n01712n78137m38316k44643J52608R2296
$$ 13888091 11664784 10229782 9517042 9015330 8437193 7998877 7754234 7906842 7999138
18815G999138k94001j86027J70372M21038L35981K27908N48176Q51387Q51145
$$ 7999138 7705137 7519110 7689482 8110520 8446501 8674409 9222585 10073972 10925117
18806A0925117J705696K505819L881983O882100J1919211J5846658J0686000K93208
$$ 10925117 12630813 15136632 19018615 25900715 37819926 53666584 64352584 64645792
18798F4645792l614559k045922R52292N388348Q871870M735209l475377m582615
$$ 64645792 61031233 58985311 59937603 65325951 74197821 78933030 75457653 70875038
18790G0875038j337168L366228O497034K396680n476013p264454n006680j164023
$$ 70875038 69537870 72904098 79401132 81797812 76321799 69057345 64050665 62886642
18782F2886642M232051P204568J064763p472120r387234q844836q720290q125096
$$ 62886642 67118693 74323261 75388024 67915904 58528670 49683834 40963544 32838448
18774C2838448o347920m693308l159685k014604j129363o50977o75664p94334
$$ 32838448 26490528 21797220 18637535 16622931 15493568 14842591 14166927 13372593
18766A3372593l24153q58182n29497o16837o95319k58478J1876l34229l63480
$$ 13372593 13048440 12190258 11660761 11043924 10348605 10090127 10102003 9767774 9404294
18757I404294K20859Q89643O06215J216754K329961L436950N368022R765981J5058854
$$ 9404294 9625153 10514796 11121011 12337765 14667726 18104676 23472698 33238679 48297533
18748D8297533J4636031L886320n582803p459732p528047p537860o646646m665657
$$ 48297533 62933564 66819884 61237081 53777349 46249302 38711442 32064796 27399139
18740B7399139k493087L57815L887800Q650631J3356246J2213423J236057o740020
$$ 27399139 24906052 25263867 29151667 37802298 51158544 63371967 64608024 57868004
18732E7868004q048369p952025q129803p424607n789321m231861k986045k006975
$$ 57868004 49819635 41867610 33737807 26313200 20523879 16292018 13305973 11298998
18724A1298998j305441j186098j006332n38761m79815k02067n03815m03618j25347
$$ 11298998 9993557 8807459 7801127 7262366 6782551 6580484 6076669 5673051 5547704
18715E547704k08090m71019m58195K17895l49037j12176l19113k56360k14954
$$ 5547704 5339614 4868595 4410400 4628295 4279258 4167082 3847969 3591609 3376655
18706C376655l742P9342q7875K85435O8604k23796m12911K39249J07343l99886
$$ 3376655 3372913 3452255 3364380 3649815 3718419 3494623 3081712 3320961 3428304 3028418
18696C028418K22246M1764r9503j27717l98501q03447k44410K61365J53527j28749
$$ 3028418 3250664 3292428 3192925 3065208 2666707 1863260 1618850 1880215 2033742 1904993
18686A904993N6085q0352k45853M5109J36721J293j20460k5360j92673n1180J60058
$$ 1904993 1961078 1880726 1634873 1679982 1816703 1817996 1697536 1672176 1479503 1428323 1588381
18675A588381j34368k82185j34901Q3045l5743K20915K10698j02269k29153k18434
$$ 1588381 1454013 1171828 1036927 1119972 1084229 1305144 1515842 1413573 1184420 965986
18665I65986R9028J38555j10061j48827J730K8544J33407J70255r8565n1060k31441
$$ 965986 1065014 1203569 1093508 944681 946411 974955 1108362 1278617 1180052 1128992 897551
18654H97551n7012l53904j73922P2417K70924o905p0779K71460K33371J4227k30064
$$ 897551 840539 486635 312713 385130 656054 649149 578370 849830 1083201 1097428 867364
18643H67364j59852k02188J98204P9729k94628Q1420m6648J1831M6767k0519j4504
$$ 867364 707512 505324 703528 783257 488629 570049 523401 535232 581999 561480 546976
18632E46976r5306k96698j13467K92808L87644J20247R166k6159j35511j05943
$$ 546976 451670 154972 41505 334313 721957 842204 851370 825211 689700 583757
18622E83757K33922l8289k30060J64067k09455j55955L56057J23080L9043K23783
$$ 583757 817679 779390 549330 713397 503942 347987 704044 827124 866167 1089950
18612A089950O6424k04496m4321J19870J72630m39376k65024l82755K53227J95660
$$ 1089950 1156374 951878 907557 1027427 1200057 760681 495657 112902 366129 561789
18602E61789Q866k87194K14974K85672l58784j87406O4277K54045J45703j63366
$$ 561789 570655 283461 498435 784107 425323 237917 302194 556239 701942 538576
18592E38576M2608J65889O1940k19583p3612r3085K16346J52492q9135m37321
$$ 538576 581184 747073 809013 589430 515818 422733 639079 791571 702436 265115
18582B65115j85539J2704O4328o5073K6859P6338Q1558M51921L54644j85072j44159
$$ 265115 79576 92280 156608 91535 118394 194732 276290 728211 1082855 897783 753624
18571G53624k09686q8734J77773K54739q6115J17665J7942P8550K02766m3023
$$ 753624 543938 455204 632977 887716 801601 919266 937208 1015758 1218524 1175501
18561A175501k88326J15177Q2746J93662l6724J31463n9433j15258J4343k43085
$$ 1175501 887175 1002352 1085098 1278760 1242036 1373499 1314066 1198808 1213151 970066
18551I70066l24632N6165J64689k88463j42017J3317m8661K2868O4065J54640
$$ 970066 645434 701599 866288 577825 435808 449125 400464 423332 487397 642037
18541F42037J67662j46687K36280L70968P3353J45464j43468j58105j52964o0431
$$ 642037 809699 663012 899292 1270260 1343613 1489077 1345609 1187504 1034540 974109
18531I74109L4330q0978P6132k03709j60934K41677j95206k01917Q0841O7651
$$ 974109 1008439 927461 1003593 799884 638950 880627 685421 483504 564345 631996
18521F31996n0448r834k52457j73311J60584K95219M4000j50436K9488O7879M2697
$$ 631996 581548 571714 319257 145946 306530 601749 645749 495313 524801 592680 635377
18510F35377k4240k16965j49207k55650M6661K04852L89638K58356p3675k70537
$$ 635377 611137 394172 244965 -10685 35976 240828 630466 888822 815147 544610
18500E44610j09736k34000l13976Q8234K25488R2811j27036j6974K97256J50751
$$ 544610 434874 200874 -113102 -24868 200620 293431 166395 149421 446677 597428
18490E97428k45037J53235J29049J45096j58064j32705K32189l212L33821R8221
$$ 597428 352391 505626 634675 779771 621707 489002 721191 717979 1051800 1150021
18480A150021o3720k06100p1260j07557J6232N9580j35735j6580p9820k9919l07872
$$ 1150021 1086301 880201 808941 701384 717616 777196 641461 624881 545061 515142 207270
18469B07270K8425K61924J99939j52069j25303J15620J85061J36964R3512L6921
$$ 207270 235695 497619 697558 545489 420186 535806 720867 857831 951343 988264
18459I88264Q1365q1195j95059k0828l4005k21694Q6398L67145J79997j61964
$$ 988264 1069629 988434 793375 772547 738542 516848 603246 970391 1150388 988424
18449I88424J92594Q3403J14190j48453k30422j24731J17093J9656K9685j52957
$$ 988424 1181018 1264421 1378611 1230158 999736 875005 992098 1011754 1041439 888482
18439H88482l25736J67646J48057J3511j19379J8554p7097n6140L10491Q8957
$$ 888482 562746 730392 878449 891960 772581 791135 714038 657898 968389 1057346
18429A057346k49879j54032j1304L4935J4628J10250o0575J2686m0610m444j16702
$$ 1057346 807467 653435 642131 677066 691694 801944 741369 754055 713445 709001 592299
18418E92299l8000K98110l401j13192J50132p6535k59723O2948K24049j23690
$$ 592299 554299 852409 849008 735816 885948 809413 549690 612638 836687 712997
18408G12997j99444L16216J03446P3332q6952Q8274l9029K32946J97344j1821
$$ 712997 513553 829769 933215 1006547 919595 1007869 968840 1201786 1399130 1387309
18398A387309o1341k11714k15796j92506L17834J33812K42536J79211J90473J43967
$$ 1387309 1325968 1114254 898458 705952 1023786 1157598 1400134 1579345 1769818 1913785
18388A913785N1584R5493J13489j1919Q8820k34797l11884J85489O3850O2659
$$ 1913785 1965369 2060862 2174351 2162432 2251252 2016455 1704571 1890060 1953910 2016569
18378B016569J30793K15218j08398K08026P46637O59549K07763N25640Q99669
$$ 2016569 2147362 2362580 2254182 2462208 3208845 3868394 4076157 4601797 5501466
18369E501466J363281J920042L217190M935653O962181R128408J0513651R816298
$$ 5501466 6864747 8784789 12001979 16937632 23899813 33028221 43541872 53358170
18361E3358170P452843M515854Q38846l719979o872268q684856q622550p505198
$$ 53358170 60811013 65326867 66165713 62445734 55573466 46888610 38266060 30760862
18353C0760862o509893n174599l583804k936809k137711j620599j037186p03949
$$ 30760862 24250969 19076370 15492566 12555757 10418046 8797447 7760261 7056312
18345G056312o8949n9168l44729r2643o4370P5026J09764Q623l44193m32340j73589
$$ 7056312 6987363 6928195 6583466 6490823 6426453 6501479 6611243 6619866 6275673 5843333 5669744
18334E669744J5628K25715L17149L78987N09525L07975K25323J56977L05385O50696
$$ 5669744 5685372 5911087 6228236 6607223 7116748 7424723 7650046 7807023 8112408 8763104
18324H763104J395084J542882J611932K117139L632421N402335P944877J2132376
$$ 8763104 10158188 11701070 13313002 15430141 19062562 24464897 32409774 44542150
18316D4542150J6289425K0194423K1634691K0944507J7840659J1381278K100044
$$ 44542150 60831575 81025998 102660689 123605196 141445855 152827133 154927177
18309A54927177n299629j2068059j7376795j9092042j9020604j6701573j3654446
$$ 154927177 149627548 137559489 120182694 101090652 82070048 65368475 51714029
18302E1714029j0681371q189258o017480m434468l082223k115376j599266j234204
$$ 51714029 41032658 32843400 26825920 22391452 19309229 17193853 15594587 14360383
18294A4360383j114484q13802n71473m16592o2762J48903l73066l72228j16633
$$ 14360383 13245899 12432097 11860624 11444032 11381270 11530173 11157107 10784879 10668246
18285A0668246N6048k06376n47170j90492j71143K3641Q2978k38006j19722K5916
$$ 10668246 10724294 10517918 9970748 9780256 9609113 9632754 9715732 9477726 9358004 9383920
18275I383920l723J65356P61125J287656J623516K078292L137173N253790Q345126
$$ 9383920 9380197 9545553 10306678 11594334 13217850 15296142 18433315 23687105 32032231
18266C2032231J2608572J5935730J7369455J5546397J1688832O079876j081294
$$ 32032231 44640803 60576533 77945988 93492385 105181217 111261093 110179799
18259A10179799q652923j3408840j4805860j3974282j2320508r716621p706574
$$ 110179799 101526876 88118036 73312176 59337894 47017386 37300765 29594191
18252B9594191n944668m243377l216419k353669j688150j012820p56504n96464
$$ 29594191 23649523 19406146 16189727 13836058 12147908 11135088 10378584 9782120
18244I782120p19722m88951l34384m3959j48326l90003k72902r4233J13120n9700
$$ 9782120 9062398 8573447 8239063 8195104 8046778 7656775 7383873 7289640 7402760 7343060
18234G343060m72398m31393j95309l34240k43125k47844m22101j07233M9020r2496
$$ 7343060 6870662 6439269 6243960 5909720 5666595 5418751 4996650 4889417 4938437 4845941
18224D845941k66934j22222r3593M5993j66307k81563m77909j39885J34152l7831
$$ 4845941 4579007 4456785 4363192 4409185 4242878 3961315 3483406 3343521 3477673 3439842
18214C439842l57495J26155j07912k5999J47431k1776j57482J58316R1419N2356
$$ 3439842 3082347 3208502 3100590 3074591 3222022 3200246 3042764 3201080 3292499 3344855
18204C344855l40730l82383l1671K79576K4541K16764j0240p013L34709m7679
$$ 3344855 3004125 2621742 2590071 2869647 2894188 3110952 3100712 3093699 3428408 3380729
18194C380729o4382J12430N6581K90296N9532k37189k09342j0668J10653R8798
$$ 3380729 3316347 3428777 3485358 3775654 3835186 3597997 3388655 3377987 3488640 3587438
18184C587438k57015m83530m91891P2931j1852l92717J2663J07345M4835J40740
$$ 3587438 3330423 2846893 2355002 2427933 2416081 2023364 2036027 2143372 2188207 2328947
18174B328947n7961l3756k58688j21203J79469L48473N3797j48591k03640R07
$$ 2328947 2270986 2237230 1978542 1857339 2036808 2385281 2439078 2290487 2086847 2087754
18164B087754K9819l64073j27402R3754J99101Q7726j60016J5314j25808p8557
$$ 2087754 2117573 1753500 1626098 1719852 1918953 2006679 1846663 1861977 1736169 1657612
18154A657612m7930J38611K97995O693j35367j93978J01877L48324K18907K36276
$$ 1657612 1609682 1748293 2046288 2052981 1917614 1723636 1825513 2173837 2392744 2629020
18144B629020L91655L08728L29601L06724j65560j73347r8506K37704K62776K37094
$$ 2629020 3020675 3329403 3659004 3965728 3800168 3626821 3528315 3766019 4028795 4265889
18134D265889L3227K8565J54814K14446J2622K32126M38780N93343M00752N30678
$$ 4265889 4299116 4327681 4482495 4696941 4709563 4941689 5380469 5973812 6374564 6905242
18124F905242O89423J199079J160184J502315J972844K371941K815538M621672
$$ 6905242 7594665 8793744 9953928 11456243 13429087 15801028 18616566 23238238
18116B3238238P045920J1055403K0257048L8965973P3256244J02660495N9045379
$$ 23238238 30284158 41339561 61596609 100562582 173818826 276479321 335524700
18109C35524700k4812300m6978534m3409615m5057179m5895425l6036778k5064187
$$ 335524700 310712400 263733866 220324251 175267072 129371647 93334869 68270682
18102F8270682j7043349j1710698p830519n382111m094815k810967k426161j617872
$$ 68270682 51227333 39516635 31686116 26304005 22209190 19398223 16972062 15354190
18094A5354190j192027j327182p36312o01876o96756p46469o11409q55738l2891
$$ 15354190 14162163 12834981 12098669 11496793 10800037 10053568 9442159 8586421 8553530
18085H553530k20997m13302j18084l80728m42763k44475j8236j67096k58613j83437
$$ 8553530 8332533 7919231 7801147 7420419 6977656 6733181 6714945 6547849 6289236 6105799
18075F105799J41803q4721j32314j06325J96707j4722k69706m1539J27008k3890
$$ 6105799 6247602 6162881 6030567 5924242 6120949 6106227 5836521 5794982 5921990 5898100
18065E898100J77062K07785J54957j32967k85076k33202j98849n8663M9284L183
$$ 5898100 6075162 6282947 6437904 6304937 6019861 5786659 5587810 5529147 5578431 5581614
18055E581614L7475J26511j65559r0885K12502P9576N9960L07544K82997J6232
$$ 5581614 5619089 5745600 5580041 5489156 5701658 5781234 5841194 6148738 6431735 6447967
18045F447967O87059R32688N95326R39016J728699K355072L513052M490192M521745
$$ 6447967 7135026 8067714 8663040 9602056 11330755 13685827 17198879 21689071 26210816
18036B6210816L922501M928188P108415P652511N667116N142386N754441N701719
$$ 26210816 30133317 35061505 42169920 49822431 55489547 60631933 66386374 72088093
18028G2088093O377708P205100N579732K556793L134781M604737J864081j411590
$$ 72088093 78465801 85670901 91250633 93807426 96942207 101546944 103411025 101999435
18020A01999435k110028k559868k913775k019973k053838n595566q077487o984894
$$ 101999435 99889407 97329539 94415764 92395791 90341953 84746387 76668900 69684006
18012F9684006n868885o934009q264380p467892o251948n451241m246777l135071
$$ 69684006 63815121 56881112 48616732 41148840 34896892 29445651 25198874 22063803
18004B2063803k523373k161604j331837o63659n61546n23785m80280l07674m2553
$$ 22063803 19540430 17378826 16046989 15383330 14821784 14297999 13817719 13510045 13467492
17995A3467492K45719N46810O40326J146819J833067K583351K370573K385518
$$ 13467492 13713211 14260021 14900347 16047166 17880233 20463584 22834157 25219675
17987B5219675L161182M402239L975833K951940L053265M385166M893160N777872
$$ 25219675 28380857 32783096 36758929 39710869 42764134 47149300 52042460 57820332
17979E7820332N810021M092940L364774M924545N201518K205634J45039R5615
$$ 57820332 63630353 67723293 71088067 76012612 81214130 83419764 83564803 83660418
17971H3660418r48711k257258j021906p04790l127854n083038l124353j312542
$$ 83660418 82711707 80454449 79432543 78727753 75599899 70516861 67392508 66079966
17963F6079966j005851l53659L35386K094317N445923P684847N868728L352709
$$ 66079966 65074115 64720456 65055842 67150159 72596082 80280929 86149657 89502366
17955H9502366N007486O514574K640599j552130j340631J00299J029944K942619
$$ 89502366 94509852 101024426 103665025 102112895 100772264 100872563 101902507 104845126
17947A04845126M312557L568135M542706Q133302R020264M731023J37355L12881
$$ 104845126 109157683 112725818 117268524 125401826 134422090 139153113 139290468 139603349
17939A39603349J405440k378315o712608p292614n740915m862040m183175l574524
$$ 139603349 141008789 138630474 131917866 124625252 118884337 114022297 109839122 106264598
17931A06264598m986386n087456l314350l990705p617913q664045p547849p064744
$$ 106264598 101278212 96190756 92876406 88885701 81267788 72603743 65055894 57991150
17923E7991150p803826p656542o504566n460957m029273l272410k671872j939884
$$ 57991150 50187324 42530782 36026216 30565259 26535986 23263576 20591704 18651820
17915A8651820j335561r48893q81473r00460o14951p41728n93647l81600m11493
$$ 18651820 17316259 16367366 15485893 14585433 13970482 13228754 12635107 12253507 11842014
17906A1842014m70620k60995k71971o24170l78459n1728l09397j9580k15442n23323
$$ 11842014 11371394 11110399 10838428 10214258 9835799 9784071 9474674 9455094 9239652 8716329
17896H716329l27481j71939k02288J09774k13643n36040k16565j95182m35859
$$ 8716329 8388848 8216909 8014621 8124395 7910752 7374712 7158147 6962965 6527106
17887F527106o83965l74079M6122N5964O9181J75437j24748k11435m3649k2414
$$ 6527106 5843141 5469062 5515184 5571148 5640329 5815766 5691018 5479583 5435934 5413520
17877E413520j46825j16033q3000j99953P2831J46402j06267R2867k07229k04454
$$ 5413520 5266695 5150662 5067662 4867709 4940540 5086942 4980675 5073542 4866313 4661859
17867D661859l2660R2461K35133J6239n915p3489M6538J90318l1780q2386K9145
$$ 4661859 4629199 4721660 4956793 4973032 4967117 4893628 4940166 5130484 5098704 5016318 5045463
17856E045463k3543J60705k6937j46974J12155P4876K21203L72953J27134K82998
$$ 5045463 5021920 5182625 5155688 5008714 5120869 5195745 5416948 5789901 5917035 6200033
17846F200033M0726L82958M74496K20263j85528l62270J22470N78788M81023O97873
$$ 6200033 6240759 6623717 7098213 7318476 7132948 6770678 6893148 7471936 7952959 8650832
17836H650832P34487J029782J640662K239019L770175N758232P716183P981832
$$ 8650832 9385319 10415101 12055763 14294782 18064957 23823189 31539372 39521204
17828C9521204Q688842R362305O856623L702415L391725K999670J002494L01311
$$ 39521204 48210046 57572351 64428974 68131389 71523114 74522784 75525278 75826589
17820G5826589J206211l38769k953523k739736k122523k273722j666746n66728
$$ 75826589 77032800 76694031 73740508 71000772 68878249 66604527 64937781 64371053
17812F4371053J722772J895763l70374p5927Q06557l67288j452608o88683j135042
$$ 64371053 66093825 67989588 67619214 67543287 68349844 67982556 66529948 65841265 64706223
17803F4706223l606405m529327m970459o497252o805131o081119n048862l999279
$$ 64706223 61099818 56570491 51600032 45102780 38297649 32216530 27167668 23168389
17795B3168389k958469k447719j894648j084337r70257n37322j97383J80766J04462
$$ 23168389 20209920 17762201 15867553 14783216 13812959 13275637 13078254 13259020 13363482
17786A3363482J06849N9690M31727J040703J738121L141213M676559N888508O216427
$$ 13363482 13470331 13530021 13961748 15002451 16740572 19881785 24558344 30446852 36663279
17777C6663279O972029P480948M981442K374823K498312K111760L24666j44415
$$ 36663279 43635308 51116256 56097698 58472521 60970833 63082593 63407259 63262844
17769F3262844J278265K03091k062711j924354j481872j221799j130504o6388
$$ 63262844 64541109 64744200 62681489 60757135 59275263 58053464 56922960 56856572
17761E6856572J182246P80060p70176l08023J50001o65222r82739N4633p35827
$$ 56856572 58038818 58818878 58048702 57740679 57890680 57225458 56242719 56297352 55561525
17752E5561525k959875l865314m102172n299960n568023m986113l837127k993796
$$ 55561525 52601650 48736336 44634164 39334204 33766181 28780068 24942941 21949145
17744B1949145k013491j502557j112199m94637M24183J054250K325991L905007
$$ 21949145 19935654 18433097 17320898 16826261 17250444 18304694 20630685 24535692
17736B4535692P033174J2112563J5397570J0393281Q20248j958697M75884N290531
$$ 24535692 31568866 43681429 59078999 69472280 70292528 68333831 68809715 74100246
17728G4100246Q594746L822150o627674j0489265r999152r762308r516489p883613
$$ 74100246 82694992 86517142 79889468 69400203 59401051 49638743 40122254 32238641
17720C2238641n681227m123276k934698j934092j426658q69194m90130l72886
$$ 32238641 26557414 22434138 19499440 17565348 16138690 15269496 14779366 14406480
17712A4406480k26263O035L51641O58754J155865K008605K698804M818047Q381023
$$ 14406480 14180217 14186252 14537893 15196647 16352512 18361117 21059921 25877968 34258991
17703C4258991J3378445J4103432O386806r93772o23146L089786P810735Q539680
$$ 34258991 47637436 61740868 68127674 67133902 66510756 69600542 77411277 85950957
17695H5950957N96611p627799q268769o680538m631947p2775O538650R506694
$$ 85950957 86547568 78919769 70651000 63970462 59338515 59265740 65804390 75311084
17687G5311084K586266l802505l560536J94167M966520N972669p12723q374700
$$ 75311084 77897350 74094845 70534309 70728476 75694996 81667665 80954942 72580242
17679G2580242j0053717r203198r297220q247875o497472m569391l462538k483381
$$ 72580242 62526525 53323327 44026107 35778232 29280760 24711369 21248831 18765450
17671A8765450j679826j321749q36933o19653l35094L5816J64863K82696N40883
$$ 18765450 17085624 15763875 14926942 14307289 13972195 14008011 14172874 14455570 14996453
17662A4996453J202229K011983K986960N474514R416791J3688575J1211564K112106
$$ 14996453 16198682 18210665 21197625 26672139 36088930 49777505 60989069 63101175
17654F3101175k007766n34783L225942P229889M951701m406548r268635r268890
$$ 63101175 61093409 60558626 63784568 71014457 75966158 71559610 62290975 53022085
17646E3022085q691710q407956p196512n481988l875100k926344j876631j715093
$$ 53022085 44330375 35922419 28725907 23243919 19368819 16442475 14565844 12850751
17638A2850751j083703p42746o67979l61592l90793n13745m03707m83564k24796
$$ 12850751 11767048 11024302 10356323 9994731 9603938 9090193 8686486 8202922 7978126
17629G978126j71220j72054l16807j69321j02686J88658K78802N1703J13769l56802
$$ 7978126 7806906 7634852 7318045 7148724 7046038 7234696 7513498 7565201 7678970 7322168
17619G322168k01898Q4727L63221L87580K90392M24802L25893L58957N86010Q63785
$$ 7322168 7120270 7204997 7568218 7955798 8246190 8670992 8996885 9355842 9941852 10805637
17609A0805637J039510J292081K450982L851929N943842J0697406J6709506J8283715
$$ 10805637 11845147 13137228 15588210 19440139 25383981 36081387 52790893 71074608
17601G1074608J0805637M065923O543228J5254252K1992504J5195265k025227
$$ 71074608 81880245 85946168 92489396 107743648 129736152 144931417 142906190
17594A42906190j1739379j0103763n613270l735767q598733j4965831j4937396
$$ 142906190 131166811 121063048 115449778 111714011 103115278 88149447 73212051
17587G3212051j2619174j1089266r816746q016721n674540l649844k641924k246070
$$ 73212051 60592877 49503611 39686865 31670144 25995604 22345760 19703836 17457766
17579A7457766j962491j179194p48235o68961o07814n95792n82351n04257q1244
$$ 17457766 15495275 14316081 13567846 12898885 12291071 11695279 11112928 10608671 10527427
17570A0527427o9106o20966n20020k07567m5621Q9469O5012K67123q8346j65475
$$ 10527427 10458321 9837355 9317335 9109768 9064147 9153616 9218628 9485751 9397405 9231930
17560I231930M10193Q54511Q66078N62404R71591J761965K961548M386381P492331
$$ 9231930 9642123 10496634 11362712 11925116 12896707 14658672 17620220 22006601 29498932
17551B9498932J2720580J7260149J3621671N388324M007189J0212013J8193109
$$ 29498932 42219512 59479661 73101332 78489656 82496845 92708858 110901967
17544A10901967J8597151N431944p989417j0661413p357128l492503m691893j1348623
$$ 110901967 129499118 134931062 126941645 116280232 108923104 105430601 100738708 89390085
17536H9390085j4213306j2819098j1123391j0170854p820863n880709m415049
$$ 89390085 75176779 62357681 51234290 41063436 33242573 27361864 22946815
17529B2946815l327536k018721j452994j459436j096692p70467p31894o61944
$$ 22946815 19619279 17600558 16147564 14688128 13591436 12820969 12089075 11427131
17521A1427131o99025o28806k81355n84538o34567l90008l90856j53526l67117
$$ 11427131 10728106 10099300 9817945 9233407 8598840 8208832 7817976 7664450 7297333
17512G297333n64963m67620k82549j96155k12987l31732k03463j14L027j43840
$$ 7297333 6732370 6264750 5982201 5786046 5573059 5241327 5037864 5037750 5040777 4896937
17502D896937k52903J06669R9170K3954k9047k55539k96687O4294j49434j03082
$$ 4896937 4644034 4750703 4849873 4873827 4844780 4589241 4292554 4356848 4207414 4104332
17492D104332Q797k36291l92880l0839J10491K43029Q2876k31260j6356K55212
$$ 4104332 4113129 3876838 3483958 3453119 3563610 3806639 3889515 3658255 3641899 3897111
17482C897111J21506K08672L92830N8870P4010p1733k79020k61709k64163K16433
$$ 3897111 4018617 4227289 4620119 4678989 4752999 4681266 4402246 4140537 3876374 4092807
17472D092807M18352q4885l79316k90960m39967l62926m14282q9669P5784j99096
$$ 4092807 4511159 4426274 4046958 3755998 3316031 2953105 2538823 2449154 2524938 2325842
17462B325842K44001j11173q5583j62084j16535j08278j70933o2884P7201R7581
$$ 2325842 2569843 2458670 2373087 2211003 2094468 1986190 1815257 1752373 1829574 1927155
17452A927155M2272k13680k62468Q5947K26625L70816L33090M41633M92696j53901
$$ 1927155 1969427 1755747 1493279 1579226 1805851 2176667 2509757 2951390 3444086 3290185
17442C290185k37702n3433j54905n25497m20837l83690o2270N2853K7087K10465
$$ 3290185 3052483 2999050 2844145 2318648 1897811 1514121 1451851 1504704 1531791 1742256
17432A742256K37709m43818M5613L9106n3709j7070O0781Q0247m6929j70609J36119
$$ 1742256 1979965 1536147 1581760 1620866 1567157 1550087 1610868 1691115 1644186 1473577 1609696
17421A609696r7400m2082L9979l2277j7734j0j3879j70513j36103l3197K23034
$$ 1609696 1512296 1470214 1510193 1477916 1460182 1460172 1446293 1275780 1139677 1106480 1329514
17410A329514q3622k7346o1253k26577J8571M25889K61600J11177O7417j08142
$$ 1329514 1245892 1218546 1157293 930716 949287 1375176 1636776 1747953 1815370 1707228
17400A707228q6367J02139J0550P2514n4879K4953J62129k50915J20074K8213
$$ 1707228 1620861 1723000 1733550 1806064 1751185 1776138 1938267 1687352 1807426 1835639
17390A835639M05484J61856J36675k5799m06843k67755j62112n9151J81769m0385
$$ 1835639 2241123 2402979 2539654 2513855 2107012 1839257 1677145 1617994 1799763 1759378
17380A759378j91360J68271M3397J03915m9342j09089k08258j49910k53661n7635
$$ 1759378 1568018 1736289 1779686 1883601 1834259 1725170 1516912 1367002 1113341 1055706
17370A055706R3338q8704n1619k08070l65014p666q4459P6164K90837O5300p1941
$$ 1055706 1149044 1060340 1008721 800651 435637 427971 343512 419676 710513 775813 703872
17359G03872m9537N5262j57563O6097M3251l25643k22682M4263L29081O2402k30769
$$ 703872 654335 709597 552034 618131 661382 335739 113057 157320 486401 548803 318034
17348C18034N9415N7839N2992K42053K08431j42920l11086j52222K01087p6467
$$ 318034 377449 435288 488280 730333 938764 795844 484758 332536 533623 457156
17338D57156p3275j3997J13940L85676q1623l34902k58869n3277j3655K4382m142
$$ 457156 383881 369884 483824 869500 787877 452975 194106 140829 127174 151556 147414
17327A47414j19747p9394q6998J37092L55423j6336l18813N7143K03949k2372
$$ 147414 27667 -51727 -138725 -1633 353790 337454 18641 75784 279733 257361
17317B57361P9569K6690J37939R5992j42864j6762J91712O1935K24358J22778
$$ 257361 336930 363620 501559 597551 454687 437925 629637 691572 915930 1038708
17307A038708m3535k73276j81274J71720K11594n6113j53482k12210M8371P9171
$$ 1038708 995173 721897 540623 712343 923937 867824 714342 502132 550503 629674
17297F29674P3050M57354L53540L3286m1253l5322j78317p1294N1744R6926M7240
$$ 629674 702724 1160078 1513618 1546904 1505651 1470329 1292012 1220718 1272462 1369388 1416628
17286A416628j06769R7513k25490j25589M9567P2642M0915J45716j58068j70456
$$ 1416628 1309859 1407372 1181882 1056293 1105860 1178502 1219417 1365133 1207065 1036609
17276A036609j43536m05385r1629K22357k9536k19158J13118Q6718j54714K72093
$$ 1036609 893073 487688 396059 618416 588880 369722 482840 569558 414844 686937
17266F86937J09473r5127K223J73638K8756J18843J26944j19221n9984k3334k0472
$$ 686937 796410 701283 703506 877144 905900 1024743 1151687 1032466 972482 949148 928676
17255I28676n3636N6307O2163k18508Q988K1842j43853j00491L98658M55114J4767
$$ 928676 875040 931347 993510 775002 783990 805832 661979 561488 960146 1415260 1430027
17244A430027j66473j80160n9752j09285J70980O7980L01258j19298j62303k10080
$$ 1430027 1263554 1083394 1023642 914357 1085337 1153317 1454575 1335277 1172974 962894
17234I62894k60581l9064K55516J39629R4384k62250j34843j35428Q4658J14879
$$ 962894 702313 663249 918765 1058394 1152778 890528 755685 620257 704915 819794
17224H19794j27048k96517K5101J14202J72198J12000j79852l60356P2722K8938
$$ 819794 692746 396229 421330 535532 707730 819730 639878 279522 352244 381182
17214C81182J7886N7603L708K4107L8430J31885p5317j66556j89774R2677M740
$$ 381182 399068 456671 460379 484486 522916 654801 579484 412928 223154 315831 320571
17203C20571J66833k8366P4856k19849m74276o7116n0127J42100J77303J02828
$$ 320571 487404 459038 533894 314045 -160231 -227347 -277474 -135374 41929 144757
17193A44757k5396J18965j28594m5794O3874j14984K98155q4664J8787M6394P5696
$$ 144757 119361 238326 109732 63938 127812 12828 310983 226319 245106 291500 367196
17182C67196N5970P7976K0096K33341o4429K0159J60691M672l4452J51463Q8766
$$ 367196 423166 501142 521238 754579 690150 710309 871000 875672 841220 992683 1081449
17171A081449R4314l78674j89556Q1202o9357p3757k25389k29630L08649Q7868
$$ 1081449 1175763 797089 607533 688735 619378 545621 320232 90602 399251 487119
17161D87119J04748K16845L68086m7154m62767M5508L0570j16505O0762n3219
$$ 487119 591867 808712 1176798 1129644 666877 712385 742955 626450 687212 633993
17151F33993j74576K54825n1359o156K39707m8509r3062l12532k39147L98814
$$ 633993 459417 714242 662883 656727 896434 847925 754863 442331 203184 601998
17141F01998M1495l4028O8399p5858n661J31365r0350j94875j64232J42808m7377
$$ 601998 643493 609465 677864 602006 596345 727710 637360 442485 278253 421061 373684
17130C73684J44052J68890M3764k3133M5399j16006J98000J12641j41291l03755
$$ 373684 517736 686626 730390 707257 752656 636650 834650 947291 806000 502245
17120E02245r9J955j60703j77859j8919o7183J28390l70640j26590P1420L34379
$$ 502245 502146 504101 343398 165539 146620 79437 207827 -162813 -289403 -217983 116396
17109A16396J89749j17596o083K1552k54728K44224M60594R9370M8013n123K3609
$$ 116396 306145 188549 182466 204018 -50710 193514 654108 753478 801491 796368 819977
17098H19977L74833q2880m19312k9078l9043l8426R8013n9322j49646K9062L02697
$$ 819977 1194810 1111930 692618 663540 624497 586071 684084 624762 475116 504178 806875
17087H06875J21815k51943m68819r598j25618p7716L22142p8388j47575L56684
$$ 806875 928690 676747 207928 198330 72712 -5004 317138 238750 91175 447859
17077D47859K9731j23019m1633P6025R3894o366k95929j7355M1469J03038K10641
$$ 447859 477590 354571 312938 388963 482857 476491 180562 163207 204676 307714 518355
17066E18355J05182K38612J92351n2122l8893p3115k81699l79928K32605j6829
$$ 518355 623537 862149 1054500 1002378 963485 890370 608671 228743 461348 444519
17056D44519l53595r6722L6828N2127j38687M3336K11934r3083n7595p884p0856
$$ 444519 90924 -5798 31030 83157 -55530 -12194 199740 106657 49062 41178 -29678
17045b9678j8454l3805O1763L0452j87395j63712j35764K13613K84542n0545K9847
$$ -29678 -48132 -81937 -20174 10278 -177117 -340829 -476593 -262980 21562 -28983 864
17034H64K2934R3098k12249q1439O6090K45145K74414r4101k52816Q5019J57293
$$ 864 23798 116896 -95353 -176792 -110702 134443 408857 314756 61940 146959 304252
17023C04252k25866j21046J10969J29203K02846j18942J75324J98105J35594K62739
$$ 304252 78386 -42660 68309 197512 400358 281416 456740 654845 790439 1053178
17013A053178j86453j35483p3124K7803J13833J44220N8513j74280k49193J90730
$$ 1053178 866725 731242 658118 685921 799754 943974 1002487 828207 579014 769744
17003G69744k30653l76503k66345j86105J09262O2726J16263j29977J12017J67683
$$ 769744 539091 162588 -103757 -289862 -180600 -117874 -1611 -131588 -19571 148112
16993A48112j93539j82064K2818o5914k04904K50386M25278n3772j42879j24944
$$ 148112 -45427 -227491 -204673 -270587 -475491 -225105 200173 146401 3522 -121422
16983a21422j66351J33664L15969q6527j90682j93423N9600j39070N9329L40296
$$ -121422 -287773 -154109 161860 75333 -115349 -308772 -249172 -388242 -328913 11383
16973A1383R1195R3895j14121k27229q3443r8366K63541j05274j65862j51549
$$ 11383 102578 196473 82352 -144877 -228320 -326686 -63145 -168419 -334281 -485830
16963d85830J86099q773K26542K4266j3332Q6260k52919K71658q1085J9997Q1826
$$ -485830 -299731 -308504 -81962 -57696 -71028 15232 -237687 33971 -47114 -27117 54709
16952E4709m2156N8658N3965J13599k96708j75198O8732j54124J28662K88793
$$ 54709 12553 71211 125176 238775 -57933 -233131 -164399 -318523 -189861 98932
16942I8932J90167m754p1104n8697R071o0615J54665P7428M3447k61998r0116
$$ 98932 289099 284345 213241 154544 163615 103000 257665 335093 378540 116542 26426
16931B6426q6385j60242J9614R2666J86599l0807j95679L00207Q4992J03966q4313
$$ 26426 -59959 -220201 -200587 -107921 78678 47871 -147808 152399 237391 341357 257044
16920B57044j65249J79943q2653l7823j84912r3587M5280K10143J08338M7284
$$ 257044 91795 271738 189085 151262 -33650 -127237 -81957 128186 236524 283808
16910B83808N5016l59504k81865j91617K99389Q0812j90676j59011O1587J60165
$$ 283808 338824 -20680 -302545 -494162 -194773 -113961 -304637 -463648 -402061 -241896
16900b41896K60691L8225k72618q9571j00476q7683J49746j8708J9343q2399l3139
$$ -241896 18795 57020 -215598 -305169 -405645 -493328 -343582 -362290 -342947 -425346 -458485
16889d58485K82194N8175k87405r4630L59283J02640K2594o9050m5928J76890
$$ -458485 -176291 -118116 -405521 -500151 -140868 -38228 -15634 -84684 -130612 46278
16879D6278k14073J13080j05411j47905J22768J11204K16131k09406Q1841J34551
$$ 46278 -167795 -54715 -160126 -308031 -185263 -74059 142072 -67334 14507 149058
16869A49058J00770J77204j2518l06546j65148k36230p8985J81031j09531o8481
$$ 149058 249828 427032 414514 107968 -57180 -293410 -372395 -191364 -300895 -369376
16859c69376K8752L63665j13880q6717K15810J80579N0135N5272l3763L5578Q9851
$$ -369376 -340624 23041 -90839 -177556 38254 218833 268968 324240 290477 326055 415906
16848D15906k42758j00984J5966n8914l2214o2496j93916l21143k08065K27837
$$ 415906 173148 72164 88130 29216 -2998 -65494 -259410 -580553 -788618 -560781
16838e60781K73903K64232M9132j62749J92478k0653j00638P9776P7479L1833
$$ -560781 -286878 -22646 26486 -136263 56215 35562 -65076 14700 92179 124012
16828A24012K475L4103j35008J50303J8619j4438k86776L8012J82743K13120j04060
$$ 124012 126487 160590 25582 175885 194504 180066 -106710 -68698 114045 327165 223105
16817B23105j79517k17779J04244K38265J97715m5328k72773k93084J83678L53968
$$ 223105 43588 -174191 -69947 168318 366033 320705 47932 -245152 -61474 292494
16807B92494J19638m01957l82355n0170J62673j11025J97497K68459N4607j06422
$$ 292494 412132 10175 -372180 -422350 -259677 -370702 -173205 95254 149861 43439
16797D3439k81393O8274J32717O1827L7607J24842p3866m1251K38796R8466j39324
$$ 43439 -237954 -169680 -36963 24864 62471 187313 113447 72196 310992 409458 270134
16786B70134m6783J05716n6573J10232N3711j13705k59519j37110k6854K18269
$$ 270134 223351 329067 272494 382726 436437 322732 63213 -73897 -100751 117518
16776A17518j0391k20018k829J80380Q8139N3025Q4089M1051J11630p1445k69051
$$ 117518 107127 -112891 -115720 64660 152799 205824 289913 330964 442594 371149 102098
16765A02098j66181k17803R5656M37163q0568j78601P5287K19624M5079k01515
$$ 102098 -64083 -281886 -186230 250933 170365 -8236 67051 286675 331754 130239
16755A30239k34650J04619k04768j76556J06657J52399J33197j89230q8390J2236
$$ 130239 -104411 208 -204560 -381116 -274459 -122060 11137 -178093 -266483 -254247
16745b54247R8200l9700j19444L4858J4415L28948j89007j16490j836j26740R0870
$$ -254247 -156047 -195747 -315191 -280333 -265918 63030 -125977 -242467 -244303 -371043 -280173
16734b80173Q0946J94822j9821J66291J13905j61670J03029K50019q1448k86932
$$ -280173 -199227 -4405 -24226 142065 255970 94300 197329 447348 365900 78968
16724G8968j27734j77054Q6999J22362Q5591k4219j25650J39084M6211j63487
$$ 78968 -48766 -225820 -138821 -16459 69132 44913 -80737 58347 104558 -58929
16714e8929J55569j30097k75690j04197l9836J38292l009l0312n2906K09668K20301
$$ -58929 96640 -33457 -309147 -413344 -453180 -314888 -317897 -348209 -401115 -191447 28854
16703B8854K52596M5424J31052K21068P438l58550l98522k10330J07812K74130
$$ 28854 281450 326874 457926 678994 686432 327882 -70640 -280970 -173158 100972
16693A00972o4938o2467J12070M10472K36088l14373m41068n8388K78561j14218
$$ 100972 36034 -26433 85637 496109 732197 417824 -23244 -81632 196929 82711
16683H2711q6784j48728p7689J2728j3901K30566J40802n9926J18063j80942K3316
$$ 82711 -4073 -152801 -230490 -217762 -231663 -1097 139705 79779 197842 16900 40216
16672D0216l89490m86703R3221K49477K90385L22216n4167j4945N3667J53132
$$ 40216 -349274 -835977 -742756 -493279 -202894 119322 65155 50210 103877 257009
16662B57009k88632r2916K8570o3772J15759l0948J15586J11992J15187J45445
$$ 257009 -31623 -124539 -95969 -159741 -43982 -74930 40656 152648 267835 413280
16652D13280R2258n12184r1204J23078K14528J6705j28950k00367k9417k12317
$$ 413280 505538 -6646 -97850 25228 239756 256461 127511 -72856 -102273 -314590
16642c14590J57697m0700j75467q1348k7251K31662M16054L0855J11316n731n68067
$$ -314590 -156893 -197593 -373060 -454408 -481659 -249997 166057 196912 308228 302497 -265570
16631b65570j83914j07319M5190K06205L56211k5853K18148J8235k73412K3575
$$ -265570 -449484 -556803 -511613 -305408 50803 24950 243098 261333 -12079 11496
16621A1496K12243R7041J5613k48345L8824r0720j20320n8021o1916k66459j67401
$$ 11496 223739 320780 336393 88048 126872 36152 -84168 -142189 -204105 -470564 -637965
16610f37965R4885M39300q9756l9067K7012P3195r8458K54381J41271q3383J01548
$$ -637965 -543080 -103780 -193536 -232603 -205591 -132396 -230854 23527 164798 81415 182963
16599A82963k88735l73529R615J80662J16531k4990n1525J10371J89213k3489
$$ 182963 -105772 -479301 -469686 -289024 -172493 -197483 -249008 -138637 50576 27087
16589B7087r3368o9874K57255L39861j96599j8906J0583M2493J11063l0783k29370
$$ 27087 -66281 -136155 121100 460961 264362 245456 256039 298532 409595 378812 149442
16578A49442n0245l8484M7518J21870J10311j24218j46340J49683J37220o1936
$$ 149442 99197 60713 108231 230101 340412 216194 69854 219537 356757 294821
16568B94821l08581o9114j71787j5043m1607q4716P4242j04315J73859K83311
$$ 294821 -13760 -82874 -254661 -269704 -311311 -396027 -321785 -426100 -252241 31070
16558C1070K7682M0775K39517K21368R9188l2139j03121q7755j10011j26310l48609
$$ 31070 58752 99527 339044 560412 659600 627461 524340 436585 326574 200264 -148345
16547a48345J9755j51648N7998j0675k75016j40599K95173R9810l1837j67677
$$ -148345 -128590 -280238 -222240 -232915 -507931 -648530 -353357 -253547 -285384 -453061
16537d53061J6633K79700N7388j82299J3522l0506K7515M7635m0120q774J63424
$$ -453061 -436428 -156728 -99340 -281639 -268117 -298623 -271108 -223473 -263593 -272367 -108943
16526a08943m5999m8749J56304j07030P12o2304K39775j89607k01765o119J02802
$$ -108943 -154942 -203691 -47387 -154417 -153705 -216009 23766 -165841 -367606 -373725 -270923
16515b70923j5289j3912N6725L18843R3307j49198j15097k50159j97283J59852
$$ -270923 -286212 -300124 -243399 75444 168751 19553 -95544 -345703 -542986 -383134
16505c83134M8430K66120K46416l5739j62674J0735N4664j31809j33544k17715
$$ -383134 -334704 -68584 177832 142093 -20581 -9846 44818 -86991 -220535 -438250
16495d38250k1531N0749K0053q6948N7263K63570J99627n827k24034n1568K66488
$$ -438250 -459781 -409032 -388979 -475927 -418664 -155094 44533 38706 -185328 -236896 29592
16484B9592J9876j46444k92179K47273N7502o4693k31781J61156J72025K24476
$$ 29592 49468 -96976 -389155 -141882 -84380 -149073 -380854 -219698 -47673 176803
16474A76803J79470L9673j69859l66845j7198J20096K11708M9916j57574k31598
$$ 176803 356273 395946 226087 -140758 -157956 -37860 173848 223764 66190 -165408
16464a65408R8851J88848q227n0847K30642N122P8475j2860k49755j61768r117
$$ -165408 -66557 122291 114064 63217 293859 298981 377456 364596 114841 -46927 -56044
16453e6044O6954J79007J26636J27403q933j89672k16951o6679K6334R9325j14207
$$ -56044 10910 189917 316553 443956 435023 245351 28400 -38279 -11945 87380 -26827
16442b6827l53131K18079J4293K01642J96177j93993n5663l1123J27179J05964
$$ -26827 -379958 -161879 -147586 54056 250233 56240 577 -30546 96633 202597
16432B02597l10501k32908n7195Q4323j15330J61483j64415j48687P2451J49080
$$ 202597 -107904 -340812 -398007 -313684 -429014 -267531 -431946 -580633 -508182 -359102
16422c59102K16521J54216K03145j52463m4631j21725k43578J41976R3732Q1475
$$ -359102 -142581 11635 214780 62317 17686 -104039 -347617 -205641 -111909 -30434
16412c0434p1873j51737k38566L11930J30874J30739l1782k83656L7626j08956
$$ -30434 -102307 -254044 -492610 -180680 -49806 80933 49151 -234505 -196879 -305835
16402c05835j27441K00034L02543J84655J01254l08423l62701j45731J22462K27526
$$ -305835 -433276 -233242 69301 253956 355210 46787 -315914 -461645 -339183 -111657
16392a11657K33047M4567K35498J50357k95298m21886o0186J72236J68900j24730
$$ -111657 121390 165957 401455 551812 256514 -165372 -225558 -53322 115578 -9152
16382i152j05071j2347J38097K38702j14340l3571J67222J61283J06963j80715
$$ -9152 -114223 -126570 11527 250229 135889 102318 269540 430823 537786 357071
16372C57071k48419k36720q9217J06077J64001L48158j27555j24018O4285L2749
$$ 357071 108652 -128068 -217285 -111208 52793 400951 273396 149378 213663 246412
16362B46412o9187p8845L591k8739p7701j43803K2983N0397j31900l2800L1900
$$ 246412 177225 98380 101971 73232 -4469 -148272 -125289 -74892 -206792 -239592 -207692
16351b07692L50420L17912l67597k43770m6336J78210J49469P9090K269j99353
$$ -207692 142728 460640 93043 -150727 -197063 -18853 130616 209706 211975 12622
16341A2622j84896m6690P0835K23648l7660k20432K83874j23981l9946j00999
$$ 12622 -172274 -218964 -148129 75519 37859 -182573 101301 -22680 -62626 -163625
16331a63625q1657o8707j9954K57446l2095K50241J98899J00230j06932j16671
$$ -163625 -245282 -313989 -333943 -76497 -108592 141649 340548 440778 333846 217175
16321B17175J2240k7505q4760r9877L1898l6137J64982j25667o5086j22820k02056
$$ 217175 229415 201910 117150 17273 49171 13034 178016 52349 -12737 -135557 -337613
16310c37613Q3128J13513q0029J29228k46841l54701K69854R3084M5239K26074
$$ -337613 -254485 -140972 -221001 -91773 -338614 -693315 -423461 -330377 -285138 -59064
16300e9064J2657o2984J99408j2686j89759j6979N2025J76224K65838j3314j28276
$$ -59064 -46407 -109391 90017 77331 -112428 -129407 -77382 98842 364680 351366 223090
16289B23090m9396l0042r45n9627K83121j06184l70493j74888q0107j02600P0887
$$ 223090 173694 143652 142707 83080 366201 260017 -110476 -285364 -365471 -468071 -397184
16278c97184m2086L27459L01249j44179j91634R8032J92917j0915k9564r3083
$$ -397184 -439270 -111811 189438 45259 -146375 -48343 144574 133659 104095 11012
16268A1012k10698p4957J95610J05572k89064L468n928M7744L11941J92662N9207
$$ 11012 -199686 -274643 -79033 26539 -262525 -259057 -264985 -217241 94700 287362 346569
16257C46569k26780k14086J55250J72028j29782m0998j71511p2159J92766j34704
$$ 346569 119789 -94297 60953 232981 103199 62201 -109310 -181469 11297 -123407
16247a23407k36495r5908L10992J77864j06009r7765K11015J14190j060K2760
$$ -123407 -359902 -455810 -144818 33046 -72963 -170728 40287 154477 153417 176177
16237A76177N9147k14404J62439L07462M2613J14852j15580j93845j01746P6527
$$ 176177 235324 20920 183359 490821 533434 648286 532706 338861 237115 313642
16227C13642p5970q7353O8701o361p6830J42762k34060M2162J64001O0483N8533
$$ 313642 237672 150319 219020 212659 135829 278591 44531 86693 250694 311177 369710
16216C69710k27293n6523R4784j87374j63406j3945N0019J11735J44119R402J35889
$$ 369710 142417 85894 180678 -6696 -170102 -184047 -134028 -22293 121826 131228 267117
16205B67117j21126R5204J20369j17233l16046R1799j089k72259q723o1868J54607
$$ 267117 145991 241195 361564 244331 -71715 20084 18995 -253264 -261987 -323855 -169248
16194a69248N5303o5836o0296j13793P4114J85886l7963j40087n3387J0055J72164
$$ -169248 -113945 -179781 -240077 -353870 -279756 -93870 -131833 -271920 -325307 -315252 -143088
16183a43088J11792K83138k59387l35633j78351K56485R8236P6231J5635O403
$$ -143088 -31296 251842 -7545 -343178 -521529 -265044 -166808 -90577 -74942 -68539
16173f8539L9288J49466J81484Q2600k96165m6626j02756L481L5560j43666m3597
$$ -68539 -29251 120215 301699 384299 88134 41508 -61248 -57767 -22207 -165873 -209470
16162b09470J00312J58P9210r40n261Q7380k63418k09760J94479K09200p0848
$$ -209470 -109158 -109000 -29790 -30730 -35991 51389 -212029 -421789 -227310 -18110 -88958
16151h8958K34480K71727N7366L1549l31720r1186j9940n771K71549k5731J5472
$$ -88958 145522 417249 474615 506164 174444 83258 63318 57547 329096 303365 318837
16140C18837K76707j35340j32513m9400J4448j45659j57536k9453K14987j2102
$$ 318837 595544 460204 327691 278291 292739 147080 -10456 -39909 175078 162976
16130A62976k27744l5917J38172Q409J57456j12012l04630Q1535m1386K26798
$$ 162976 -64768 -100685 37487 45896 203352 91340 -213290 -131755 -173141 53657
16120E3657J33623j90135J634M8659Q7187l3886j36579l27682j48759J8945K12359
$$ 53657 187280 -2855 -1221 47438 134625 100739 -35840 -363522 -512281 -493336 -280977
16109b80977L5318J26526K39138R6562k25531k3778L14964j86378p8215P5417
$$ -280977 -245659 -119133 120005 216567 -8964 -32742 282222 95844 17629 93046
16099I3046N3981j43446k55814k56646P5278K26116J96141M6147j48602J55041
$$ 93046 147027 3581 -252233 -508879 -433601 -207485 -11344 34803 -113799 41242
16089D1242J77007r9854j72704P5914R6280p5475J67158l25866l54648J91878
$$ 41242 218249 118395 -54309 21605 117885 42410 209568 -116298 -470946 -279068
16079b79068R085J61769J98377J08928r436j74734O3995l50208j63022J68625
$$ -279068 -269983 -108214 90163 199091 189655 14921 78916 -271292 -434314 -265689
16069b65689k5568K03372j41576M8060K12415p3293k1199R9148j54906m44114
$$ -265689 -291257 -87885 -229461 -181401 31014 -42279 -63478 35670 -119236 -563350
16059e63350J87773K4981k05512n648L34100J86094Q8528J019l0729J55722j28678
$$ -563350 -375577 -350596 -556108 -561756 -227656 -41562 46966 47985 17256 172978 44300
16048D4300j34620J21179k434j6438J04973L67163J73974q7847p6781j19070l65802
$$ 44300 -90320 30859 28425 11987 116960 484123 658097 570250 493469 374399 8597
16037H597j05691J65876l3766j87530j93538K50599L1740J5615Q9182J24010l8263
$$ 8597 -97094 68782 35016 -152514 -346052 -95453 -63713 -48098 41084 165094 126831
16026A26831q6425p1283o0526p441M9776J56952J65991R616k93830j13422J25516
$$ 126831 40406 -30877 -91403 -98844 -49068 107884 273875 283491 -10339 -123761 1755
16015A755L42731n4832k44255L3312N7353n338k28796j43605K7511R3891K47238
$$ 1755 344486 289654 45399 78711 136064 130726 -98070 -241675 -214164 -120273 126965
16004A26965J4316M5202K10731j20005k83764Q161j99071J33409K13959m6740
$$ 126965 141281 186483 397214 277209 -6555 1606 -197465 -64056 149903 103163
15994A03163j83938j80238N0663M5266q0330n611J12077k83771k57474P0841J95747
$$ 103163 -80775 -261013 -210350 -165084 -245414 -251025 -138948 -422719 -680193 -609352 -413605
15983d13605K1078P5183M2929j54858l3941L71131M1245J37045M6043l66365l49485
$$ -413605 -392527 -317344 -274415 -429273 -463214 -92083 -50838 86207 132250 -234115 -583600
15972e83600R8127j7057K79511k20707R1863k3518J15044p8109L02397J10602
$$ -583600 -485473 -502530 -223019 -443726 -351863 -375381 -260337 -338446 -36049 74553
15962G4553p1076j3292K54840J19206J86828m3082k12327r4491j94801k48159
$$ 74553 3477 -9815 245025 364231 551059 507977 295650 201159 6358 -241801
15952b41801j47363K06613L31138K46250m68622k29928R9609m6845P6594N63723
$$ -241801 -389164 -182551 148587 394837 -73785 -303713 -204104 -250949 -174355 389368
15942C89368J69554j07936j1235N3515j91892j65650K6934P4188l65925j04664
$$ 389368 558922 450986 439751 493266 301374 135724 162658 236846 -129079 -233743
15932b33743M6573m000J75519r0571M6211K39913l7577m5481j44186j73960J65497
$$ -233743 -187170 -191170 -15651 -106222 -60011 179902 142325 96844 -47342 -221302 -55805
15921e5805K41387J07840j9334P0181n0875p569J8850l38211j49057j15301j68867
$$ -55805 185582 293422 274088 344269 293394 285825 304675 -33536 -182593 -297894 -466761
15910d66761J64225p7333k51204L6196n7902J73985L21235K6622j8279J28954
$$ -466761 -302536 -379869 -631073 -594877 -652779 -478794 -157559 -130937 -149216 -20262
15900b0262R5220j56870k0537K34745k16701l0698J63917K16091J65491k31649
$$ -20262 74958 -81912 -102449 132296 -84405 -115103 48814 264905 430396 198747
15890A98747k09264j75000M444N1902k9327n8150J16771j29066J42588k9549O3507
$$ 198747 -10517 -185517 -181073 -129171 -158498 -216648 -99877 -228943 -86355 -115904 -52397
15879e2397k6599j04880q833p0746M6340K4700J41448K92449j37161p6072l09650
$$ -52397 -78996 -183876 -192709 -263455 -217115 -192415 -50967 241482 104321 28249 -281401
15868b81401r9325P8067m7981j00822O8793M13467J62862J31958l12104k58578
$$ -281401 -380726 -302659 -350640 -451462 -382669 30798 193660 325618 13514 -245064
15858b45064j89114O1221Q3493j6925j11225q0523J59688K70402K198k01842L1183
$$ -245064 -434178 -372957 -289464 -306389 -417614 -498137 -338449 -68047 -65849 -267691 -236508
15847b36508K03765o0448k26028j18055J68558K24110j72261j36485Q9788L7613
$$ -236508 -32743 -93191 -319219 -437274 -268716 -44606 -216867 -353352 -263564 -225951
15837b25951P6590J63783K19421k8699K92258L04055O5643k25527l38762j98211
$$ -225951 -149361 14422 233843 205144 497402 801457 867100 641573 302811 104600
15827A04600p9996l6665m1682r46q4292K77943Q0160R0330l02376j05225j27679
$$ 104600 24604 -12061 -53743 -54689 -138981 138962 219122 309452 7076 -98149 -225828
15816b25828n2672j60645J79371N4321N7014K60165R6567j77554N7425P309q1549
$$ -225828 -278500 -439145 -259774 -205453 -148439 111726 208293 30739 88164 95473 13924
15805A3924Q5639j26660k07202r1514M7153r0637J70422K76692L3613J36907k8187
$$ 13924 99563 -27097 -234299 -325813 -278660 -369297 -198875 77817 111430 248337 220150
15794B20150k85831N601J18905l3965M8709J15115J4604K21473j19620j7828j36141
$$ 220150 -65681 -60080 58825 24860 73569 188684 203288 424761 305141 287313 151172
15783A51172r0224J13393Q7437J0601l43200J16436J84447k06818r5871M0246
$$ 151172 60948 174341 261778 272379 -70821 45615 230062 23244 -72627 -32381
15773c2381k3788j30101L11074L13373L4272m4273j50609j08839m404l30031j32473
$$ -32381 -56169 -186270 124804 438177 472449 428176 277567 168728 164324 -165707 -298180
15762b98180M4111j41759q9371J35815J93173O4557J64903j06319j09417K28446
$$ -298180 -254069 -395828 -485199 -349384 -156211 -91654 73249 -33070 -142487 85959
15752H5959J06027j81980k1250J8782p1254j42301P4050p2265j1695J754p2468
$$ 85959 191986 10006 -11244 7538 -63716 -206017 -131967 -204232 -215927 -214173 -286641
15741b86641J97057M28890K42490j01395k38732j96647r5775m8922j79191j0424
$$ -286641 -89584 339306 581796 480401 241669 45022 -50753 -99675 -278866 -289290
15731b89290J0641j44048Q2065K44941M1678K82471j5176k24252J9199L20322
$$ -289290 -278649 -422697 -340632 -95691 -54013 228458 213282 -10970 8229 328551
15721C28551K04281J8590n8308k99929n3059o66j80052k63643m0503Q4081N4755
$$ 328551 532832 551422 493114 193185 140126 139460 -40592 -304235 -344738 -260657 -205902
15710b05902K06597Q7147j10631K15790l76347l5089L95975N7842j88150J88588
$$ -205902 695 87842 -22789 193001 -183346 -218435 177540 235382 47232 235820
15700B35820N5415k02331j16698q6233j36751j9326K974L281K55423l3277o0311
$$ 235820 291235 88904 -27794 -114027 -250778 -270104 -267130 -263849 -8426 -41703 -102014
15689a02014r9324j48898J87653K34796J03914m5702k93743j62938O0138J10798
$$ -102014 -201338 -350236 -162583 72213 176127 130425 -163318 -326256 -266118 -155320
15679a55320R0306j06831Q5583N4464j99834J188R9907L34857J20295k39170L493
$$ -155320 -65014 -171845 -86262 -31798 -231632 -230444 -130537 204320 324615 85445 88938
15668H8938j45332k92993j23142M295J99307J29282J94567J89544L9041l7459
$$ 88938 -56394 -349387 -472529 -468234 -268927 -139645 54922 244466 283507 246048
15658B46048J00606k93180j37331P423j92791j48075J17167j6075K98751Q9555
$$ 246048 346654 53474 -83857 -76434 -269225 -417300 -300133 -316208 -17457 72098
15648G2098k5449m2518K8330J11988l5756J44692j4965p6389l02132n6458K55775
$$ 72098 46649 4131 32461 144449 108693 253385 238420 162031 -140101 -196559 59216
15637E9216R9041j10416m1947q8398o575o9319k5898K07185K15262R5208j3219
$$ 59216 158257 47841 5894 -82504 -89079 -158398 -184296 22889 238151 333359 320140
15626C20140k13541p8341o9126m7657K19109K18945p4921k928Q4025r0111N1604
$$ 320140 106599 28258 -40868 -88525 130584 349529 274608 271680 355705 265594 317198
15615C17198K22588k26428l44405R0405Q6795P4178j46091l06369M3332K1219
$$ 317198 539786 313358 -31047 59358 146153 220331 74240 -232129 -188797 -167578
15605a67578J15383k5129q1848K36788J55751L5196j81685l03024j87668k12289
$$ -167578 -52195 -77324 -159172 77616 233367 268563 86878 -216146 -403814 -616103
15595f16103J19430K09811J49890J90220M4828j32497q5987j02025O5897M30661
$$ -616103 -496673 -286862 -136972 53248 98076 -34421 -120408 -222433 -156536 274125
15585B74125L9813l00176o738K26864J41710J3344n47466k21848j12544r9019
$$ 274125 313938 13762 7024 233888 375598 388942 -158524 -380372 -492916 -591935
15575e91935J5075K15289J48045J12265j27081J10731L30496j08524j72837k1924
$$ -591935 -576860 -361571 -213526 -101261 -228342 -117611 212885 104361 -68476 -90400
15565i0400J22380P1787Q4145k47407k07843J13981m8211j00833P6010L26336
$$ -90400 31980 103767 187912 -59495 -267338 -153357 -201568 -302401 -226391 99945
15555I9945Q7335j59206j16082J09334J4402j39007J22169r7943J27324j12491
$$ 99945 187280 28074 -88008 21326 35728 -103279 18890 -79053 48271 -64220
15545f4220j63147j64345j31209k5507m6536K3366J39985L92711M7807P5047o3546
$$ -64220 -227367 -391712 -522921 -548428 -594964 -571598 -431613 -38902 8905 83952 20406
15534B0406M8040j26518o2301K66323K6940j17145J2540L00505O045m5375k9942
$$ 20406 68446 -58072 -120373 145950 172890 55745 68285 368790 374835 329460 299518
15523B99518m70433q3004L13027J09144p2720O6715K25109j03839j88003m385
$$ 299518 -170915 -253919 59108 168252 95532 162247 387356 283517 95514 91129
15513I1129k47333r7941l3711N896j72917R4121L76409J38126m4845l39138r4368
$$ 91129 -156204 -254145 -287856 -281960 -454877 -360756 15653 153779 108934 -230204 -324572
15502c24572L9326J21451L24296J32263k41857j28879J79194L46517k37506j77015
$$ -324572 -285246 -163795 160501 292764 50907 -77972 101222 447739 210233 33218
15492C3218j56648J40793j076J55242L4162j18089j18202Q6653J16350p7507k01383
$$ 33218 -123430 17363 16287 171529 205691 87602 -30600 56053 172403 94896 -106487
15481a06487L1035K55797K22084k35700L7372M04173j27458k57710q9513L3123
$$ -106487 -75452 180345 402429 166729 204101 608274 480816 223106 133593 166716
15471A66716n6479P7351j7030K1687J56215K4496k60257l11267o6425o7503m8986
$$ 166716 110237 187588 170558 192245 348460 372956 112699 -198568 -264993 -332496 -381482
15460c81482P8400Q0644k39741J42709K31224J23901n3794m904p8464R587k61898
$$ -381482 -303082 -222438 -462179 -319470 -88246 35655 -18139 -23043 -101507 -91920 -353818
15449c53818Q936Q8692M4352O4840j74586p8319L17760J09951O6893K7931k3231
$$ -353818 -344882 -256190 -211838 -146998 -321584 -399903 -82143 27808 94701 122632 99401
15438I9401l7449n0410n8473P2542N6980p0675r3944L03031K33915o8928l7866
$$ 99401 61952 11542 -46931 25611 82591 11916 -82028 221003 454918 385990 348124
15427C48124j28243k86262J6375j40045q2445J24769n7263m2851J04148K19007
$$ 348124 219881 -66381 -50006 -190051 -272496 -147727 -204990 -247841 -143693 75314
15417G5314j95712p3306Q2248j75070j02858K4603m3461r4272J77943J18807j2675
$$ 75314 -120398 -193704 -111456 -286526 -389384 -364781 -408242 -502514 -324571 -205764 -218439
15406b18439K88835L19125J25217k137o2776n386J18477j50178l89317j56998
$$ -218439 70396 389521 514738 512601 449825 444439 562916 412738 23421 -133577
15396a33577o7649m062J19255j49746j34439R9441J90629j53926j53138j06486
$$ -133577 -201226 -205288 -86033 -235779 -370218 -270777 -80148 -234074 -387212 -493698
15386d93698J96146L77472L8716K8008r0963q4385l0432K15079p8029j65676J06261
$$ -493698 -297552 79920 118636 146644 55681 -28704 -59136 155943 77914 -87762 18499
15375A8499q3697l79443J4828L45510L04158k06619l8740J27058L307j02308k8113
$$ 18499 -65198 -444641 -429813 -84303 219855 13236 -25504 101554 104861 2553 -25560
15364b5560k66697q987N2645J30390j24572k3987l0122J03125k54514r6943K36980
$$ -25560 -292257 -301244 -248599 -118209 -242781 -266768 -296890 -193765 -448279 -545222 -308242
15353c08242K04344M0277J14796j08755j6640q2736k01296l15734k9752J44494
$$ -308242 -103898 -63621 51175 -57580 -74220 -156956 -358252 -673986 -703738 -559244
15343e59244L44042J72238J04707K18187l61462k22173J81076p5450j22375J88672
$$ -559244 -215202 -42964 61743 279930 -81532 -303705 -122629 -198079 -320454 -131782
15333a31782q3065k79018R7765J13587J86879J62760j08428p3033K06641L71982
$$ -131782 -214847 -493865 -396100 -282513 -95634 67126 -41302 -114335 92306 464288
15323D64288J08727q0739J26095o4128k88038L285k21711o3258j57091K73853
$$ 464288 573015 492276 618371 554243 266205 269490 47779 -15479 -172570 101283
15313A01283L44302j82585j84406k89675k75351L21350J09622l2499o0212J01622
$$ 101283 445585 263000 78594 -211081 -486432 -165082 -55460 -87959 -148171 -46549
15303d6549r5892j81407K4176L11133L81162j43803m6665R720j58289q5117K75720
$$ -46549 -142441 -323848 -299672 11461 392623 248820 202155 211875 53586 -31531 244189
15292B44189J92382j46476k67010L4734l0031P6252k70225k5520l3247K87996
$$ 244189 436571 290095 23085 57819 27788 104040 -166185 -191705 -224952 63044
15282F3044R8064m0664J23660l7545O6554j65338p2305r1756Q4220k62549j54607
$$ 63044 161108 120444 244104 206559 273113 107775 35470 -56286 27934 -234615 -389222
15271c89222J55932L17377j40143j18279J84361J691K58211J40087k78495k99372
$$ -389222 -233290 84087 -56056 -174335 10026 11717 269928 410015 131520 -167852
15261a67852m6785J84200J38483k07151j08395K5156r5521K18650J69199r1430
$$ -167852 -214637 -30437 108046 -99105 -207500 -182344 -277865 -59215 109984 18554
15251A8554j88084j86350q1225K87640K46659R2899J40710m4776q2670m67973
$$ 18554 -169530 -355880 -437105 -149465 97194 190093 330803 286027 203357 -264616
15241b64616R6477R9234K73860j07136k67453K87554L99904J10655q5300k03457
$$ -264616 -168139 -68905 204955 97819 -169634 117920 517824 628479 543179 339722
15231C39722k60388m88448J28216J20772j03057Q520J27463l27578J26289r4548
$$ 339722 79334 -409114 -280898 -160126 -263183 -254663 -127200 -454778 -328489 -423037
15221d23037M6826o3016k16J18471j31273m4024k9087Q2693j43061J91709J09908
$$ -423037 -376211 -439227 -439443 -320972 -452245 -496269 -525356 -442663 -585724 -394015 -284107
15210b84107K16821j0616L8507j31061j90489o9126M7754P4992N660J32739K5720
$$ -284107 -67286 -77902 -39395 -170456 -360945 -430071 -382317 -307325 -301665 -168926 -143206
15199a43206L3134K06768R6847l62300P7922L9087j39131R3158L30512j84992
$$ -143206 -110072 96696 193543 -168757 -90835 -51748 -190879 -97721 232791 47799
15189D7799j95528j64813J93723Q3887q25K27490p3900k10333m9840K15K8265
$$ 47799 -147729 -312542 -118819 -34932 -35757 191733 117833 -92500 -142340 -142125 -113860
15178a13860Q2812L0043O9169j41338k07275k97281q4639n226J86058K47427j03631
$$ -113860 -31048 -1005 68164 -73174 -280449 -577730 -662369 -667595 -481537 -234110 -337741
15167c37741j32728J68388j03276K4765J65639P0619l6132j85727k1071J11444
$$ -337741 -470469 -302081 -405357 -380592 -214953 -144334 -180466 -366193 -387264 -275820
15157b75820J42330J80657R0842k03790j8020K01417Q4853P7838j00085k04429
$$ -275820 -133490 47167 138009 -65781 -83801 117616 202469 280307 180222 -24207
15147b4207j54767R5086L48127J89088j28781j45948Q6005k2463k05759L8113
$$ -24207 -178974 -83888 264239 453327 324546 178598 264603 242140 36381 74494
15137G4494K12403j09245j3733l127k94595n3994Q2636j24934r9622n9052r4685
$$ 74494 286897 177652 163919 160792 -133803 -187797 -105161 -230095 -329717 -388769 -483454
15126d83454n3380J77863K02286K08180K39415R8735o5259K7247j78843k41766
$$ -483454 -536834 -358971 -156685 51495 290910 389645 324386 351633 172790 -68976
15116f8976Q2251j87505j5248L58482M1419j34301j08818M34135J99799j67128
$$ -68976 13275 -174230 -189478 169004 210423 76122 -32696 401439 601238 434110
15106D34110j91600l07873p2191J61926j70618k11168J83869P1424K11143L38472
$$ 434110 242510 -65363 -137554 24372 -146246 -357414 -173545 -102121 109022 447494
15096D47494J13271k77493m39688l55297O1644Q3418J6684m8827J37862K34760
$$ 447494 560765 283272 -156416 -511713 -450069 -366651 -349967 -398794 -260932 -26172
15086b6172j30791k85256j09400J60571M39925l1316l16761N9118O84j56349L5365
$$ -26172 -156963 -442219 -551619 -391048 48877 17561 -299200 -240082 -239398 -395747 -360382
15075c60382K16067l9298K1220J17780J63472P5798r4091J08405j47449k30905
$$ -360382 -144315 -183613 -162393 -44613 118859 194657 100566 208971 61522 -169383
15065a69383K63074K51852J6876o352m17046m6330j88670k65374O9552J27365
$$ -169383 93691 345543 362419 356067 -60979 -107309 -295979 -561353 -491801 -364436
15055c64436L03951k0501Q7361J1877J00438l3482l55493j03041n7305O9242K40099
$$ -364436 -60485 -80986 6375 18252 118690 85208 -270285 -373326 -430631 -361389 -121290
15044a21290J73438J26350K08420L01077K8837l8196l86051l6736k17684l1832
$$ -121290 52148 178498 386918 687995 716832 678636 292585 255849 38165 6333
15034F333K06370J85861q5344J16273j93737j86190L6095j37158j21623n4769
$$ 6333 212703 398564 313220 429493 235756 49566 85661 -51497 -173120 -227889
15024b27889J9612J96690J07451M686M790M2196j76750j69662N3081q3147J24175
$$ -227889 -208277 -11587 95864 100550 105340 147536 -29214 -198876 -145795 -228942 -104767
15013a04767N6006k2905L3195q6213j74390N5917q419J55919J09011k71156O9488
$$ -104767 -48761 -71666 -38471 -124684 -299074 -243157 -251576 -95657 13354 -257802 -188314
15002a88314k4916j34719J12000l3379K63812J30230K99697K66030j85683l20662
$$ -188314 -213230 -347949 -235949 -269328 -5516 124714 424411 690441 504758 184096
14992A84096K6708j23209j50935J1812j0596J80639j11258J62704J01010m69305
$$ 184096 210804 87595 -63340 -51528 -62124 118515 7257 169961 270971 -198334
14982a98334K4602O0502j45371k12959K30640J52201K07206K18442K8064j01247
$$ -198334 -173732 -113230 -258601 -471560 -240920 -88719 118487 336929 364993 263746
14972B63746l38868j42779J53976K66413l4447J3552p7172j34736l2129j80665
$$ 263746 -75122 -217901 -63925 202488 168041 181593 104421 -30315 -62444 -243109
14962b43109k6891O5827n7356O4542k56066j68865n2289L06817J76796K00510
$$ -243109 -270000 -204173 -261529 -196987 -453053 -621918 -674207 -367390 -190594 9916
14952I916M4890j29990j04215m2546J63412K28190L96737q8828j56859q7626j00033
$$ 9916 54806 -75184 -179399 -221945 -58533 169657 566394 477566 320707 233081 133048
14941A33048J67565Q605k26081k26992k1840J26897j79995L3379j62586j37960
$$ 133048 300613 309218 83137 -143855 -165695 -38798 -218793 -185414 -348000 -485960
14931d85960J45368r988J83433J31445k12854Q0482J93402J8244M4845J14019
$$ -485960 -340592 -350580 -167147 -35702 -248556 -168074 25328 43572 88417 202436
14921B02436o4733l00760J15348J45134j20274p9055l0733k1307Q35m6405K78092
$$ 202436 137703 -163057 -47709 97425 -22849 -101904 -132637 -153944 -153109 -199514 78578
14910G8578Q7992j1348j1942j74397r211Q0903K12246K21998n48871k85072M6431
$$ 78578 166570 155222 143280 -31117 -40328 40575 252821 474819 -74052 -359124 -312693
14899c12693R3644J66494R0886J2450l09592R5357L31227R6111k34364p0649J15744
$$ -312693 -219049 -52555 38331 50781 -258811 -163454 167773 263884 29520 -41129 74615
14888G4615N3153j64984p9231J97516j77802p9560J92791O0213r1304j41337j09610
$$ 74615 127768 -37216 -116447 81069 -96733 -176293 16498 76711 -14593 -155930 -265540
14877b65540l3539J09125j6473j72386J62013p6616J54830J11469k8082j62133
$$ -265540 -299079 -189954 -206427 -378813 -216800 -293416 -138586 -27117 -55199 -217332
14867b17332j2428K19902l3556N6883o6627q0548L7664k36675J73222L44882P9661
$$ -217332 -229760 -9858 -43414 13469 -53158 -133706 -96042 -332717 -159495 185387 265048
14856B65048n4791q1965k43678n8428k09607k65252K23232J95936K98692N2196
$$ 265048 210257 128292 -115386 -173814 -383421 -648673 -425441 -229505 69187 121383
14846A21383L71878r3820j33013j00881p3694O595j67262K38954J99711j52244
$$ 121383 493261 399441 266428 165547 91853 98448 -68814 170140 369851 217607
14836B17607p5517N7267J90090l27840l9545p9671m49244J94086J55602L7815
$$ 217607 142090 199357 389447 61607 22062 -57609 -506853 -312767 -157165 -119350
14826a19350P3270p7826J09528K57249m5573q3934l7514J08904m4817j79162j96876
$$ -119350 -46080 -123906 -14378 242871 197298 113364 75850 184754 139937 -39225 -236101
14815b36101r1353J27698L74479J1566j40922O8086k9020l5956k17266q8182J71728
$$ -236101 -327454 -199756 174723 186289 45367 113453 84433 48477 -168789 -256971 -85243
14804h5243K44233j11396k2244O8825R3763j38091L0520J49334O8423R5213Q5584
$$ -85243 158990 47594 25350 94175 187938 49847 80367 229701 298124 393337 478921
14793D78921L5321k81404k87070Q4327j63768j47870J96198M7925J38723K3302
$$ 478921 514242 232838 -54232 30095 -133673 -281543 -85345 -37420 101303 124605
14783A24605N299q3225k86829m7422n8731O4579q229L95958O2111R2661o2276
$$ 124605 129904 46679 -240150 -287572 -346303 -281724 -289953 106005 168116 260777 198501
14772A98501j97318j34150J39619N4410L5476J00808Q3816o8550l90987l3894
$$ 198501 1183 -132967 6652 61062 96538 197346 281162 212612 -178375 -212269
14762b12269K03897m0222J29976L29774P7485l2932m8049k24360j50525M2167
$$ -212269 -8372 -48594 81382 411156 488641 455709 407660 183300 32775 74942
14752G4942J72141M4170k49972n1449P831R2806p6479M2452P1516j62590j8983
$$ 74942 247083 291253 41281 -10168 -2337 90469 13990 56442 127958 -34632 -53615
14741e3615R0729j88301k25621k1029K67070Q2717J37254k29002M2531j81384
$$ -53615 37114 -151187 -376808 -397837 -130767 -48050 89204 -139798 -97267 -278651
14731b78651l3785K77936N06522J67657m36508k70823K91097J91926j97067k09834
$$ -278651 -312436 -34500 472022 639679 203171 -67652 223445 415371 218304 8470
14721H470J56784p7943n9783q2355Q9720r0702k43316K9715J04746J49772n5436
$$ 8470 165254 87311 27528 -54827 34893 -55809 -299125 -269410 -164664 -14892 -70328
14710g0328k15923p5619J95325J90921q5778J71324k20277r9270P2985j00726
$$ -70328 -286251 -361870 -166545 24376 -61402 109922 -110355 -209625 -136640 -237366
14700b37366J8740j81191M8521K05154j25249Q5946j17513j64285N7044J33478
$$ -237366 -218626 -399817 -351296 -146142 -271391 -185445 -302958 -467243 -410199 -276721
14690b76721j30414L6168j20332j04225p475K3198M125R6872J35117Q12O1939
$$ -276721 -407135 -370967 -491299 -595524 -602999 -579801 -575676 -478804 -343687 -342875 -280936
14679b80936P9260J35358J54258j43727m40517j27846M37850J47887j48056j5729
$$ -280936 -201676 -66318 87940 -55787 -496304 -624150 -186300 -38413 -186469 -202198
14669b02198K1497J35472J56879L514j48078k41893k16701M32721J56235j36881
$$ -202198 -180701 -45229 111650 115164 -32914 -274807 -491508 -58787 97448 -39433
14659c9433J08665J16572j88504O4693M828j49223R4214q9311Q2426j38291j64014
$$ -39433 69232 185804 -2700 61993 66821 -82402 11812 -77499 4927 -133364 -297378
14648b97378J47313j3848J0018K70002K29637l89674k11488L61372J89556k02343
$$ -297378 -150065 -163913 -153895 116107 345744 -43930 -255418 105954 295510 93167
14638I3167k15428k9258M4555n3371l54594l0265r9020R2306M11110M52621J64537
$$ 93167 -122261 -151519 -106964 -160335 -514929 -545194 -644214 -551908 -140798 311823 476360
14627D76360l46095n28998n0220P181R5604K33691K03945m3372j72191o2006k8942
$$ 476360 130265 -398733 -448953 -441772 -346168 -112477 91468 48096 -124095 -186101 -215043
14616b15043j66304R3880j20539q6831L11952R0514N0312j37090j74406j14698
$$ -215043 -381347 -287467 -408006 -494837 -182885 -92371 -42059 -179149 -353555 -468253
14606d68253k725J28885L38415k862N1171O3863l3417k83766J06835L32937J17501
$$ -468253 -470978 -342093 -3678 -6540 44631 108494 75077 -208689 -101854 231083 348584
14595C48584j32747p1563J35218K16755O1552j96572q2631J86034N0238o5807
$$ 348584 215837 144274 279492 496247 557799 361227 278596 464630 514868 449061
14585D49061j98902j48789m37514J30772M0042n4317J2896j77802M5750K17682
$$ 449061 250159 101370 -336144 -205372 -165330 -219647 -206751 -384553 -338803 -121121
14575a21121J05621L36261j10760m35514j10279k69890K05116M88924j00476l8522
$$ -121121 -15500 320761 210001 -225513 -335792 -605682 -400566 88358 -12118 -50640
14565e0640J34665P1449j44260m69489q7365J55018K11621M0814r0103r6738J63602
$$ -50640 84025 155474 11214 -458275 -545640 -390622 -179001 -138187 -228290 -325028 -161426
14554a61426J04070N587J54415j25086j75063K44859J01575K18883j74944n07309
$$ -161426 -57356 -51769 102646 -22440 -197503 47356 148931 367814 192870 -314439
14544c14439l68725P9799j3815K07750K46794K00009o0373k01960o3520j27220
$$ -314439 -683164 -603365 -617180 -409430 -162636 37373 -23000 -224960 -288480 -415700
14534d15700J97799K86206K95539k32572n3366q5587k92255J22802J25712L65833
$$ -415700 -217901 68305 363844 131272 77906 -7681 -299936 -177134 -51422 314411
14524C14411K13140k98189q6858J11880N2249J67337k7578J73519K51902K68785
$$ 314411 527551 229362 142504 254384 306633 473970 446392 619911 871813 1140598
14514A140598L19408l8627L07867J31527J40055p0618L7781K07501j40537Q058
$$ 1140598 1460006 1421379 1729246 1860773 2000828 1930210 1967991 2175492 2034955 2043013
14504B043013k7168k34673k52922q270k2873m84817k65811j14270j57364N5761
$$ 2043013 2015845 1781172 1528250 1519980 1497107 1012290 746479 632209 474845 530606
14494E30606k1875j25604J4651J5478R3376j89069O633J4745J06696N8111k30572
$$ 530606 508731 383127 397778 413256 506632 317563 324196 338941 445637 503748 273176
14483B73176k07156o0438m4564L62034o9024o1957j07611J39586k8635J34151
$$ 273176 66020 5582 -38982 323052 254028 192071 84460 224046 195411 329562
14473C29562J80209J24381j49473K29306K28372j40893o9207J1965J61356J83818
$$ 329562 509771 634152 484679 713985 942357 801464 732257 744222 905578 1089396
14463A089396M66362L54200L66867J42004L53812M39663N71320L65482j22497
$$ 1089396 1555758 1909958 2276825 2418829 2772641 3212304 3783624 4149106 4026609
14454D026609o3598J98414N5922p2934j62043l9678j70007j25922m97318m54000
$$ 4026609 3963011 4161425 4217347 4144413 3982370 3942692 3772685 3646763 3149445 2695445
14444B695445m51841n9406r5616j19344j6267Q6073Q4817M8964J89653J3865j81722
$$ 2695445 2243604 2184198 2088582 1969238 1952971 2039044 2123861 2172825 2362478 2376343 2194621
14433B194621L04004J05695j20376J03013K47096Q283n2744j55581l6258J142
$$ 2194621 2498625 2604320 2483944 2586957 2834053 2842336 2789592 2634011 2597753 2598895
14423B598895K7512k29355j85079l74334J4595J0753p7907l60890k50742K249
$$ 2598895 2626407 2397052 2211973 1837639 1852234 1862987 1785080 1424190 1173448 1175697
14413A175697M7720m3377J01195l7798K19238m67501j78009r9893J22848R7473
$$ 1175697 1223417 1180040 1281235 1243437 1462675 995174 817165 717272 840120 937593
14403I37593K45338Q5256N7399j52423j5070k6784o2350J75223L6959k00347j44772
$$ 937593 1182931 1268187 1325586 1173163 1158093 1131309 1068959 1244182 1281141 1080794 936022
14392I36022p4837J09099K24620k69208k63158k94051o9373J739J07830K55364
$$ 936022 861185 970284 1194904 925696 662538 368487 299114 300853 408683 664047
14382F64047R0266J24614O2989k48700j13920o4245j35172M0389R7424m7398K5587
$$ 664047 754313 878927 941916 693216 579296 515051 379879 420268 517692 470294 495881
14371D95881p021K4534j1078M9600o0735k56792M5224J9842o3641J13061k25241
$$ 495881 488860 513394 502316 551916 491181 234389 279613 299455 235814 348875 123634
14360A23634N8433Q5521j66092q4942L22289j9573j16296J769K47331k37670k38543
$$ 123634 182067 267588 101496 16554 338843 319270 202974 204743 452074 214404 -24139
14349b4139L18895K5081k69015j16177K62272K72072L1761K3141J21628l4798
$$ -24139 294756 319837 50822 -65355 196917 468989 500750 523891 645519 610721
14339F10721r9946o7540k86189j29852o1066P7562r3980L875J10338m4348J19504
$$ 610721 510775 443235 157046 27194 -33872 43690 -50290 -46415 63923 19575 139079
14328A39079J8355J16499k8437K43518J91791J5310j7020k06026o9333o2928m3865
$$ 139079 157434 273933 245496 489014 680805 696115 679095 473069 403736 340808 296943
14317B96943R0302J94676K7936o9576O8424P5035k29392j47991j66692M6668J23917
$$ 296943 387245 581921 609857 540281 608705 683740 454348 306357 139665 186333 310250
14306C10250j02206j02554l5135k3692J09044M6307J30697J9776n455j49934l07872
$$ 310250 208044 105490 70355 46663 155707 202014 332711 352487 347032 197098 -110774
14295a10774p9778O113K05200J43703k75628N4591j811j38294m0817K60987J11920
$$ -110774 -190552 -184439 20761 164464 -111164 -56573 -58384 -196678 -237495 23492 135412
14284A35412j92394N3801M2503K71423M1479j82592k50881j28257M5005J40825
$$ 135412 -56982 -3181 39322 310745 352224 169632 -81249 -209506 -164501 -23676
14274b3676O5669j18214K51549Q7219l13739j26062R849j57034r0022K25704J13344
$$ -23676 41993 -76221 175328 262547 -51192 -177254 -167405 -324439 -414461 -188757 -75413
14263g5413L84988r8232l90066o8358j34778O2374Q0959l9745l34335R2416L86518
$$ -75413 309575 211343 -178723 -247081 -381859 -319485 -238526 -278271 -612606 -520190 -133672
14252a33672N5559M1789k29946k5473j20921j47870o4444m4672J28856o5875j27831
$$ -133672 -78113 -36324 -266270 -291743 -412664 -560534 -624978 -669650 -540794 -606669 -734500
14241g34500J85989K02832J52221M2609k4884J66366M5658J62223K90876K92004
$$ -734500 -548511 -345679 -193458 -150849 -175733 -9367 36291 198514 489390 781394
14231G81394j16719l59846K48233Q3680j09594J43622j45201O2029M5919p8020
$$ 781394 664675 304829 553062 636742 527148 670770 525569 587598 633517 555497
14221E55497k10407L5979k51464k3532q8925J2528j75353q1412J02098K34293
$$ 555497 345090 381069 129605 106073 17148 29676 -145677 -227089 -124991 109302
14211A09302K19651m3503l51173q9064L32514j5784k2622J6257j30395J7801j18822
$$ 109302 328953 285450 -65723 -154787 177727 161943 139321 155578 25183 42984 -75838
14200g5838O6843K61754k548m475o495J9944R2285K36944K41172p3308J3859J43298
$$ -75838 -8995 252759 250211 245736 239241 259185 351470 588414 829586 756278 770137 913435
14188I13435J29617r9020j07646P3926K47751k01064k55128J41152r9170p2292
$$ 913435 1043052 944032 836386 910312 1158063 956999 701871 843023 743853 671561
14178F71561N0004n1036l45012l8347j93225k02324J15726P7376n1943j16394
$$ 671561 721565 670529 325517 287170 93945 -108379 7347 84723 32780 -83614
14168h3614P0132J61073K22356j15272r6646L12470L96633j09423N9915l1025
$$ -83614 -13482 147591 369947 254675 158029 470499 867132 757709 817624 786599
14158G86599m0448r8233l75030p0514k09886J24937L73445J93678J51868J18419
$$ 786599 746151 647918 272888 202374 -7512 117425 490870 684548 836416 954835
14148I54835J15616j16652J31672K65679n9803k1419J88473r1253k80028M838
$$ 954835 1070451 953799 1085471 1351150 1291347 1269928 1458401 1367148 1087120 1091958
14138A091958j16792N5782J62457K55853K98197O007j56693N1048o7173M5881
$$ 1091958 975166 1030948 1193405 1449258 1747455 1753462 1596769 1647817 1580644 1626525
14128A626525P8830j78729J97975K4067j23504M13224M16033J17723o2333l5317
$$ 1626525 1705355 1526626 1724601 1748668 1625164 2038388 2454421 2572144 2509811 2474494
14118B474494O3346n1930K71515L76269N2565p6319J407K90533J56414k07043
$$ 2474494 2537840 2485910 2757425 3133694 3186259 3109940 3111347 3401880 3558294 3351251
14108C351251K38499L51496P887N9078O21164N33919O4796K03846N20537O7910
$$ 3351251 3589750 3941246 3949133 4008211 4629375 5163294 5228090 5431936 5952473 6020383
14098F020383K84095N17772M16680N12416N50502N30801O55139P65728N21924
$$ 6020383 6304478 6822250 7238930 7751346 8301848 8832649 9487788 10253516 10775440
14089A0775440O07644R37471J072131R74427J331119J234655J644124J760442
$$ 10775440 11383084 12320555 13392686 14367113 15698232 16932887 18577011 20337453
14081B0337453J896730K293392K974859L769605M398262N163205O088622O995154
$$ 20337453 22234183 24527575 27502434 31272039 35670301 40833506 46922128 53917282
14073E3917282Q598425J0468723J3414534J7213462K1717081K7023102L1430543
$$ 53917282 62515707 72984430 86398964 103612426 125329507 152352609 183783152
14066A83783152L5693269L8606044L9932228L8715940L4198951K6738554J7742656
$$ 183783152 219476421 258082465 298014693 336730633 370929584 397668138 415410794
14059D15410794P357851m245643j5187764k3989215l0676979l4773603l6423742
$$ 415410794 422768645 418523002 403335238 379346023 348669044 313895441 277471699
14052B77471699l6080515l3762003k9910561k5347621k1493414j7914995j4778241
$$ 277471699 241391184 207629181 177718620 152370999 130877585 112962590 98184349
14045I8184349j1919629r799086q390996o979151n715727n053176m271360l644783
$$ 98184349 86264720 76465634 68074638 61095487 55379760 50326584 46055224 42410441
14037D2410441l202074l003331k298084k295136k013591j645562j389482j578383
$$ 42410441 39208367 36205036 33906952 31611816 29598225 27952663 26563181 24984798
14029B4984798j559545j155290r26675j018705j043345o28418n01968q63189o17378
$$ 24984798 23425253 22269963 21343288 20324583 19281238 18652820 18150852 17287663 16670285
14020A6670285n10354l11969m36964l20995k41578k88005k56026l38741p33439
$$ 16670285 16159931 15847962 15410998 15090003 14848425 14560420 14304394 13965653 13232214
14011A3232214n18473m81807m74101l79056m44510k0453n17449n09546k45389
$$ 13232214 12713741 12231934 11757833 11378777 10934267 10913814 10396365 9886819 9641430
14002I641430o39321l62019l31249p5999m92627l29935k45475k85356l75062k65028
$$ 9641430 9002109 8640090 8308841 8232842 7740215 7410280 7164805 6879449 6504387 6239359
13992F239359q9676K68447l23041l39470J3507j96577m61833o0852n4170J2217
$$ 6239359 6149683 6418130 6095089 5755619 5769126 5572549 5110716 5049864 4995694 5007911
13982E007911l32912K995r2028j1963j05369j5649M9223k77398l04733k01131
$$ 5007911 4674999 4677994 4585966 4574003 4468634 4452985 4502208 4224810 3920077 3718946
13972C718946l26205J18073j30324j59333P7085k9101J31240o2180k10028k31032
$$ 3718946 3392741 3510814 3380490 3221157 3298242 3269141 3400381 3338201 3128173 2897141
13962B897141J51508Q9859K19093J5465j11028m05283k20790M2524k10034j7984
$$ 2897141 3048649 3138508 3357601 3373066 3262038 2856755 2635965 2678489 2468455 2450471
13952B450471K1424P2943k2502k85800k68349J42537L94704k84646j69504p5717
$$ 2450471 2471895 2544838 2522336 2236536 1968187 2110724 2505428 2220782 2051278 1975561
13942A975561R5540K63409l1172J25980J08606K15477R8667K92727K69941n712
$$ 1975561 2071101 2334510 2303338 2429318 2537924 2753401 2852068 3144795 3414736 3409024
13932C409024K5133J00686K09620O20820Q04145K17008K70344M81007M36206J302
$$ 3409024 3434157 3534843 3744463 4365283 5169428 5386436 5656780 6137787 6573993 6575295
13922F575295k03210j72025k67148m17926j41479o94359p95755n29037j88429
$$ 6575295 6372085 6200060 5932912 5514986 5373507 4679148 3883393 3354356 3165927
13913C165927k69811k74824O117l9213k57803j39453j22378l89358j96106k72669
$$ 3165927 2896116 2621292 2627409 2588196 2330393 2190940 2068562 1679204 1483098 1210429
13903A210429K37404P6419o7429J41289j01721l32369j76237J63220J17666R4040
$$ 1210429 1447833 1524252 1456823 1598112 1496391 1164022 987785 1151005 1268671 1362711
13893A362711J07482J75624l71149k72287o7246R8351J47220j97258q1543K315
$$ 1362711 1470193 1645817 1274668 1002381 935135 1033486 1180706 983448 901905 904220
13883I04220L77961K23917n1675q5969J4380j52464l40589K0539R9698j57716
$$ 904220 1282181 1506098 1454423 1368454 1382834 1230370 889781 910320 1010018 852302
13873H52302k8078J72266j50698N0545J80509m5533O5262j04076k70275j1018
$$ 852302 824224 996490 845792 896337 1076846 1031313 1096575 992499 722224 711206
13863G11206L03800m8295n0303k7151j38405j09907J27123Q8768P8992j7759j12252
$$ 711206 1015006 966711 916408 889257 750852 640945 768068 856836 935828 918069 805817
13852H05817j96013j8229l9556j15025J4568j28355O1631M519J82478r4249j90026
$$ 805817 609804 591575 552019 436994 451562 323207 384838 389357 571835 477586 287560
13841B87560j63983J03356Q6403K12586J18533r8657m09543j64472K00655J06439
$$ 287560 123577 226933 313336 525922 644455 545798 136255 -28217 172438 278877
13831B78877J01944j74520r038j55589J76417K23640Q5775L1996j055j42883j72490
$$ 278877 380821 206301 197263 41674 218091 441731 527506 559502 558447 415564 243074
13820B43074N9122J49911k78185k66125K65387L13051J25958k13749m15665m00188
$$ 243074 302196 452107 173922 -92203 173184 486235 612193 398444 -17221 -417409
13810d17409J36094M06402m0836j14292J0842R5874K67101L54091j54587m35684
$$ -417409 -281315 125087 84251 -30041 -19199 76675 343776 697867 543280 107596
13800A07596k59071K18726K16147k50101N7084J27099J1836l7479J53867Q5256
$$ 107596 -151475 67251 283398 33297 90381 217480 229316 191837 345704 430960
13790D30960k85308J39368Q2176L1001M3590j45374k49534J614j59642L040L542
$$ 430960 145652 285020 367196 398197 441787 296413 46879 48493 -111149 -108109 -104567
13779a04567j37511j78177J4369J64524K16292M9364J8377k27079j41108J49054
$$ -104567 -242078 -420255 -405886 -241362 -25070 24294 42671 -184408 -325516 -176462
13769a76462l61430J84533K51745L3587Q8010M7536J13376K48980Q7724j96697
$$ -176462 -537892 -353359 -101614 -68027 19983 67519 180895 429875 517599 320902
13759C20902k2500K57042k13891k48751K2552o403R2713O6938l34073M9282J51104
$$ 320902 298402 555444 341553 92802 115354 108951 201664 268602 -65471 -16189 134915
13748A34915K26644l31945r0898j23341k73312J63190K44738P1528K80630J22109
$$ 134915 361559 29614 -61284 -184625 -457937 -294747 -50009 21519 302149 424258
13738D24258N8104k26259r6235J21621q8201j08969J04366J92087Q0714q6916
$$ 424258 482362 256103 159868 281489 193288 84319 188685 380772 461486 374570
13728C74570j82772l46179j95309J58681L30620j0965j09329k54469k20441M4235
$$ 374570 191798 -154381 -349690 -191009 139611 128646 19317 -235152 -455593 -411358
13718d11358J50779J78578K46718j03095j24605j03366o9493J89571N8307j77783
$$ -411358 -260579 -82001 164717 61622 -62983 -166349 -235842 -46271 12036 -165747
13708a65747N2508L8268j3322R0811K75779j92263j48750L39927n7142l33699
$$ -165747 -113239 -74971 -88293 2518 278297 86034 -62716 277211 220069 -113630
13698a13630J17079k3120J52647J11530L6304j54693j26038N0163R6802K41267
$$ -113630 3449 -19671 132976 244506 280810 126117 79 50242 147044 388311
13688C88311n5975j03395k25591r4387L1357J82240n9652j27268P6559K29827
$$ 388311 332336 228941 3350 -91037 -59680 122560 62908 -64360 12199 242026
13678B42026J00604k0495k16565L4618l2794N9098J40949j87881O1039k12559
$$ 242026 342630 322135 105570 140188 107394 166492 307441 119560 180599 -31960
13668c1960q5320J06965m8865m2550J11672L12303m6159j26465l47628p722k1729
$$ -31960 -117280 -10315 -59180 -101730 9942 322245 276086 149621 -198007 -205729 -227458
13657b27458p899J14910J45193j97352j98690L7161K24945r414N8987J84716M7753
$$ -227458 -235357 -120447 24746 -172606 -371296 -334135 -109190 -118604 -59617 125099 172852
13646A72852k49913Q7924K51245M5305j20838j00959k27036L15817J8433l6507
$$ 172852 -77061 10863 262108 307413 186575 85616 -141420 174397 192830 156323
13636A56323K3432l974N1717L7072k7169J14759K16070J18657k99786l55710l22577
$$ 156323 179755 175781 227498 264570 237401 352160 568230 686887 387101 31391 -291186
13625b91186k3658J36687J93632J70009l4292J97669J17985N4821l1580k72232
$$ -291186 -314844 -178157 15475 185484 151192 348861 466846 521667 490087 217855
13615B17855J49369K61273L53939K16674R6764k22241J16202J77273K69989K33289
$$ 217855 367224 628497 982436 1199110 1295874 1073633 1189835 1367108 1637097 1870386
13605A870386J12492K62887L8582l1928k63658R7884k45625l40052R3446K3222
$$ 1870386 1982878 2245765 2284347 2252419 1988761 2086645 1841020 1500968 1594414 1617636
13595A617636k48500j78195j23201J40296j25992j84717k3788q4655L1196l3246
$$ 1617636 1369136 1190941 1067740 1208036 1082044 897327 873539 788884 820080 786834
13585G86834J37272J79005K6838j61129l72221j78297K36715j50856j0131J13537
$$ 786834 924106 1103111 1129949 968820 596599 418302 655017 504161 494030 607567
13575F07567k73177J68951K36116j60591l80827R8608K7362J4101j06654p6646
$$ 607567 334390 503341 739457 578866 198039 296647 324009 338110 231456 154810
13565A54810J48091K89956l10249l12219k86932m3078M3697K66869M4654J24880
$$ 154810 302901 592857 282608 -29611 -316543 -359621 -315924 -49055 -4401 120479
13555A20479j90076k06174O559K7167O6492R7326K2911J7852l7376j93017p3877
$$ 120479 -69597 -275771 -269212 -242045 -175553 -78227 -55316 -37464 -74840 -267857 -341734
13544c41734J52974K07312O9706J23288J83483m9138k05873k3478j30845k03041
$$ -341734 -188760 18552 88258 211546 395029 345891 140018 116540 -14305 -217346
13534b17346n3219K64355j68679j97455L6685K34187o9367j29720J79472J35442
$$ -217346 -270565 -6210 -174889 -372344 -335659 -101472 -170839 -300559 -121087 14355
13524A4355j93138N0106O0299l35741l2309J54423K48901K19854m2618P0889J06836
$$ 14355 -178783 -128677 -68378 -404119 -436428 -282005 -33104 186750 144132 215021 321857
13513C21857K28325O1264o6416k94856P9700l2243o9408L01320l8742m13413m1181
$$ 321857 550182 611446 545030 250174 329874 297631 228223 529543 490801 77388 36207
13502C6207k2406J51967k2132q5020j19058O4740Q4581J01627K61077J74734j49444
$$ 36207 13801 165768 143636 58616 -60442 4298 88879 190506 451583 626317 476873
13491D76873l71121L8621J86296J35451J11983j33205L8033j83310r8526k76336
$$ 476873 105752 144373 330669 466120 578103 444898 482931 299621 201095 -75241
13481g5241q0877o9805k01817P6595J28931l9392J11488r8986K95381K92863r7439
$$ -75241 -156118 -225923 -427740 -351145 -222214 -261606 -150118 -249104 46277 339140 241701
13470B41701k13585l75659p4723K85482L51453R7742R4237P4391q121m4370j84123
$$ 241701 28116 -347543 -422266 -136784 214669 312411 406648 481039 472918 428548 244425
13459B44425j8241K22240N9971k51281K03238q571l39219j94763J34064n9071
$$ 244425 226184 448424 508395 257114 460352 451781 112562 -82201 51863 -7208
13449g208p2661J39815J16825j21129m9707j87067R811J91701l24269k36583M09584
$$ -7208 -79869 59946 176771 55642 5935 -181132 -171321 20380 -303889 -540472 -130888
13438a30888K67893M6116q4471j83992L21741L17601j96730k01256k32984m7932
$$ -130888 137005 183121 98650 -85342 236399 554000 357270 156014 -76970 -124902
13428a24902j53831N9357p705j52125J67652N9201k73171K72935K65859L97204
$$ -124902 -278733 -219376 -227081 -379206 -211554 -152353 -425524 -152589 113270 510474
13418E10474j25877l67285N0014N2452j76093k70887r949j85646J02642J61723
$$ 510474 384597 17312 67326 119778 -56315 -327202 -337151 -522797 -420155 -258432
13408b58432Q1142R5726K17636K54438J10592j63567k20374L2569l1649j07292
$$ -258432 -177290 -81564 136072 390510 501102 337535 117161 149730 118081 10789
13398A0789q156j42630J8890Q411p1864m8332J39535M1465n1249k9746L1613J40553
$$ 10789 2633 -139997 -121107 -112696 -184560 -232892 -93357 -51892 -103141 -132887 -101274 39279
13386C9279j28350k93344N2045K61408J39266m11312m61499J84356Q0841M4078
$$ 39279 -89071 -382415 -330370 -68962 70304 -341008 -802507 -618151 -537310 -493232
13376d93232j41422j98587J08739J93468J15156J232K13520k7981j87612J67166
$$ -493232 -634654 -833241 -724502 -531034 -415878 -414646 -201126 -229107 -416719 -249553
13366b49553O9108M4982J59046j71325P1933K9122m1926J77606j4827k28386m5216
$$ -249553 -180445 -135463 23583 -147742 -75809 -46687 -88613 88993 74166 -154220 -199436
13355a99436Q9188o6841J45739J24213j49483J55049K3340q8728J65983O0303
$$ -199436 -110248 -177089 -31350 92863 -56620 98429 121769 33041 199024 259327
13345B59327L2447k58951l15846N3721k4103j8354K6991Q858J87573q8687n3599
$$ 259327 291774 32823 -283023 -229302 -253405 -271759 -244768 -235910 -48337 -137024 -190623
13334a90623J06483k74598l8642j24007J51622N42606O1778r8098m64329J1805
$$ -190623 -84140 -358738 -397380 -521387 -369765 172841 234619 136521 -327808 -316003
13324c16003R4175q7241q6348j17141K3205P4727J35688j65426Q6241J65550R2012
$$ -316003 -221828 -309069 -395417 -512558 -489353 -414626 -278938 -444364 -358123 -192573 -100561
13313a00561p6985J48565L1052k18434O6999N2666J35637N9026K2239O3055j61063
$$ -100561 -177546 -28981 2071 -216363 -149364 -96698 38939 97965 120204 183259 22196
13302B2196n9801J73592K43193L9565l02719j34066o7762J26595J04035n4556
$$ 22196 -37605 135987 379180 418745 116026 -18040 -85802 40793 144828 90272
13292I0272p528j24640j6645J74998p5014l58390j15924M4783j42730j01999K18705
$$ 90272 82744 -41896 -58541 116457 41443 -316947 -432871 -388088 -530818 -632817 -414112
13281d14112J36045P8419R0682j2718q1217J00131O7178l86461K051L43244K58388
$$ -414112 -278067 -199648 -108966 -121684 -202901 -102770 -35592 -422053 -420002 -76758 181630
13270A81630R4319R6951O3788p4861k12439p143k4883M4967J95847j12956k24359
$$ 181630 275949 372900 436688 361827 149388 142245 117362 162329 358176 245220 20861
13259B0861l77455J9608K30203O814k7789R7916K9598n7316J93390j50023k05650
$$ 20861 -356594 -336986 -106783 -99969 -127758 -29842 -244 -57560 135830 -14193 -219843
13248b19843Q5557K33476K34176L3259l29586o6331J67804k98090k30399K27681
$$ -219843 -134286 99190 333366 366625 37039 -29292 138512 -159578 -389977 -162296
13238a62296L26720k2473k33262p8627J48974K8223Q199K43080N5289l2343M0522
$$ -162296 164424 141951 -91311 -169938 -20964 7259 15458 258538 313827 281484 322006
13227C22006q6273k43801Q2489l5281j33028J62575L7863O7008J30204N2052j40247
$$ 322006 235733 -8068 74421 39140 -93888 68687 106550 173558 303762 355814 215567
13216B15567J87563k16107j28437j28638l56514L1098j56481K34451P4062J7667
$$ 215567 403130 187023 58586 -70052 -426566 -395468 -551949 -317498 -243436 -225769
13206b25769k4833q1979q0978J90046n1333l9194J50188J46261j17320k16067
$$ -225769 -250602 -332581 -413559 -223513 -274846 -314040 -163852 -17591 -134911 -350978
13196c50978K3960K92005m8792p2254K13538L25767j22784l81128m7296J90749
$$ -350978 -327018 -35013 -83805 -156059 57479 383246 260462 -120666 -167962 22787
13186B2787M8507J60465L02008J74605q810k90355j5426k01307M9581m9821J12237
$$ 22787 71294 231759 533767 708372 699562 409207 393781 192474 242055 192234 304471
13175C04471L09571k1800l20878l26823N1470O1989k25542j11629J17377j42544
$$ 304471 614042 592242 271364 -55459 -3989 58000 -167542 -279171 -161794 -304338
13165c04338N8791K00820M7696j16649K1273M8219O1920j61163Q0851m7602p4370
$$ -304338 -245547 -44727 2969 -113680 -92407 -44188 17732 -143431 -62580 -110182 -184552
13154a84552M572K7993j9354L6073p5264l7919K12711p5336L1081j37481K54636
$$ -184552 -179980 -151987 -171341 -135268 -210532 -248451 -35740 -111076 -79995 -217476 37160
13143C7160J20763J52998j52405j65209k50436r7966J568J88434j94832j60471
$$ 37160 157923 310921 158516 -6693 -257129 -355095 -353527 -165093 -359925 -520396
13133e20396O2462M20728J04294j22923j38479n8308j24137m2441j57457K06554
$$ -520396 -457934 -37206 67088 -55835 -194314 -252622 -376759 -419200 -576657 -370103
13123c70103j00981K0127o3784N2781K10290K1411Q3117k44362M667M2868K00956
$$ -370103 -471084 -450957 -514741 -461960 -251670 -230259 -147142 -391504 -386837 -343969 -143013
13112a43013P3792J65875o6970r4622J61566J03506k67101k29907p3558J63504
$$ -143013 -69221 96654 29684 -64938 96628 200134 -66967 -296874 -370432 -206928
13102b06928n4780p1960K10164J51640J8660L41082J2669j94058j86231k97423
$$ -206928 -261708 -333668 -123504 28136 46796 387878 400547 206489 20258 -277165
13092b77165k54754J98160L69904j2172k8604J33576m386m349l3419r0013J25877
$$ -277165 -531919 -333759 36145 23973 -4631 128945 124559 120210 86791 -3222 122655
13081A22655k42145j01898L9667k08653J69571K45560J35517r908j51076j96720
$$ 122655 -119490 -221388 -181721 -390374 -220803 24757 160274 150366 -710 -197430
13071a97430J16298M8719k69749j67916n9287L61934L44982j6293k42056k41676
$$ -197430 -81132 -32413 -302162 -470078 -529365 -167431 177551 161258 -80798 -322474
13061c22474O8610Q2388J41366L2303j4180P0191k57404l29344J05813M33690
$$ -322474 -253864 -171476 -30110 2193 -11987 58204 -199200 -528544 -422731 10959
13051A0959K90813M6508j90830j30720J41373K05041k05795j03452q3073n9330
$$ 10959 301772 348280 157450 26730 168103 373144 167349 63897 -19176 -78506
13041g8506j62821J9314J31542J55226L55610J11049k71824j50376O929l8240
$$ -78506 -241327 -222013 -90471 64755 420365 531414 259590 109214 116143 77903
13031G7903k32357j999J24419J45344m365l3150j57560N9807K5720M0886r0199
$$ 77903 -154454 -156453 -32034 113310 108945 75795 -81765 -21958 3762 44648 -45551
13020d5551k17828J10325J05619j19407r6965r9123Q1688P3399J23376l17198
$$ -45551 -263379 -153054 -47435 -166842 -263807 -362930 -281242 -207843 -84467 -401665
13010d01665j25367J64305L01134K07367J24681j40648j88146k16699J60593n3839
$$ -401665 -527032 -362727 -61593 145774 270455 129807 -58339 -275038 -114445 -168284
13000a68284Q918r7331k81735j05800K4797L12071M08741o3247j10722j29331
$$ -168284 -159366 -256697 -538432 -644232 -619435 -307364 101377 38130 -72592 -201923
12990b01923J01165J3497O6912O154o4099q7083j26977O8140J66688q5751j10593
$$ -201923 -100758 -87261 -20349 -14195 -78294 -165377 -292354 -224214 -57526 -143277 -253870
12979b53870q9624P3685K04325j03753n8655O9326J65526K71685j13938k61018
$$ -253870 -343494 -269809 -65484 -169237 -227892 -158566 6960 278645 164707 -96311
12969i6311j35051r3522j69606M67876J45745j07889j2247k20258J28079M5520
$$ -96311 -231362 -324884 -494490 -26614 119131 11242 -1005 -221263 -93184 -47664
12959d7664q6126m0895J27869K76212l00446m0038J32454M6136J29855m208k04529
$$ -47664 -133790 -174685 -46816 229396 -71050 -111088 21366 67502 197357 193149 -11380
12948a1380j56222J33524o7786q1626J34532K8732N2264N4099N8766j7087R2250
$$ -11380 -167602 -34078 -101864 -183490 -48958 -20226 32038 86137 144903 127816 220066
12937B20066J4413l4000k14817j33510J75080K26832J49710m1698l11380n3850
$$ 220066 234479 200479 -14338 -147848 27232 254064 403774 362076 50696 -3154
12927c154O7584p3631L2996j32208k55379J92470L55761q4452Q0949L43994j71453
$$ -3154 64430 -9201 23795 -108413 -363792 -171322 184439 99987 180936 524930 353477
12916C53477k75327j07476n4097Q5149k3697J2959n6846j01895K06702K57419
$$ 353477 78150 -29326 -83423 1726 -21971 -9012 -65858 -167753 38949 296368
12906B96368j8808k77907m45944J7459L01663J19242N1846m6266j02436J46311
$$ 296368 277560 -347 -446291 -428832 -127169 -7927 43919 -2347 -104783 41528
12896D1528k6496j1499P4538r279M3234R2984j30126j90710k8338Q9159J34095
$$ 41528 15032 3533 78071 68792 112026 205010 74884 -115826 -144164 -55005 79090
12885G9090k72608k77670k42250L40606J02548j16313o7830J94519L74907j9730
$$ 79090 -193518 -471188 -713438 -372832 -270284 -386597 -454427 -259908 114999 95269
12875I5269j21507j82844P206J65178N1394J40636k37596l75266Q3666N12119
$$ 95269 -26238 -209082 -201876 -36698 14696 155332 -82264 -457530 -373864 138255
12865A38255K91193K13741l4291o1965l06152m55609k48468N9279J25012M0713
$$ 138255 429448 643189 608898 546933 240781 -214828 -463296 -404017 -279005 -238292
12855b38292K10009N5152Q814J93655O9841M7579M2549r5441J54234j7396j45221
$$ -238292 -28283 26869 35683 229338 299179 346758 389307 293866 448100 430704 285483
12844B85483l22158m618J88547k17462M6114j77325N5826N11258M1492k03259
$$ 285483 -36675 -41293 147254 -70208 -24094 -201419 -145593 365665 407157 203898
12834B03898J54642J56331n5587j83694j94858J44801j3925k40927k8530k9245
$$ 203898 358540 514871 459284 275590 80732 225533 211608 -29319 -57849 -87094
12824h7094q5019J96008n7545m6700K10812J77294j54151o0743m3000k60928j12524
$$ -87094 -172113 23895 -33650 -80350 130462 307756 153605 92862 49862 -211066 -323590
12813c23590L17021R3662j66086j08751k49819q3031J05477J36460L07227K90746
$$ -323590 -6569 87093 -78993 -187744 -437563 -520594 -415117 -278657 28570 319316
12803C19316K2356j29923l5554K875N9393j69334K0426j65255k98168p0007M6541
$$ 319316 341672 211749 176195 179070 238463 69129 89555 -75700 -373868 -443875 -397334
12792c97334K98442q5989J01639M2404r391n7458j30031r1557N5724l4804K1678
$$ -397334 -98892 -184881 -83242 -40838 -50229 -107687 -237718 -329275 -273551 -308355 -286677
12781b86677J02023J19008J22110J1049k14697l5361J62167J77382j96885k81966
$$ -286677 -184654 -65646 56464 67513 -147184 -182545 -20378 157004 -39881 -321847
12771c21847Q6288J60769J12422q177J98045J83015j77074k47162j24635M2999
$$ -321847 -235559 -74790 37632 29455 227500 410515 233441 -13721 -138356 -95357
12761i5357J93232j8065K2268J25065J31897J58324l6425j10126j6206k83363
$$ -95357 97875 79810 102078 227143 359040 517364 480939 370813 354607 71244
12751G1244k33320k68674n5094K6481j5974n5977J00521j1007J53860o1332K78620
$$ 71244 -162076 -430750 -485844 -459363 -475337 -531314 -430793 -441800 -287940 -349272 -70652
12740g0652M13173R2314j30059m2194O6460M1677m865m82274k41217j53114J87598
$$ -70652 342521 434835 304776 262582 329042 370719 365854 -116420 -357637 -510751 -323153
12729c23153J86268M5778J01933R9662o4381k40335P1704j80455k62216n8268
$$ -323153 -136885 -91107 10826 110488 46107 -194228 -122524 -302979 -565195 -623463
12719f23463j4933K17570K62451J13112J82138j45060K49525j11741K4777j04706
$$ -623463 -638396 -420826 -158375 -45263 136875 -8185 241340 129599 154376 49670
12709D9670j42478J26500k146q4K09526k37316j26475K76955j70103j71004J49584
$$ 49670 -92808 33692 31546 31462 240988 3672 -122803 154152 -15951 -186955 -37371
12698c7371L3157k05271L19386K13957j52485j97880l012K1435J18192J53632
$$ -37371 -4214 -209485 109901 323858 171373 -26507 -29519 -8084 110108 263740
12688B63740n5462j79107k5813K5656k2012J22376Q2566J77726M0395J80658l01515
$$ 263740 208278 29171 3358 29014 7002 129378 211944 389670 430065 610723 309208
12677C09208k19924k29406M9422J83145J36233K53978J57058q3258m40854p0122
$$ 309208 89284 -140122 -90700 92445 228678 482656 639714 556456 115602 45480
12667D5480N0375J60174K62560M10183O19748J097366J521948J257029K16152
$$ 45480 95855 256029 518589 928772 1548520 2645886 4167834 5424863 5641015
12658E641015n65418p10540o56983n92075o84250o47620m11149k79935j56155
$$ 5641015 5075597 4365057 3708074 3115999 2431749 1784129 1372980 1093045 936890
12649I36890l98088j31246j08614o0590R034J25211j48497l39225k78560R4517
$$ 936890 538802 407556 298942 238352 247386 372597 224100 -115125 -393685 -299168
12639b99168J00765P6071m672j79962j14523L940O877L04235L8041j13996J61831
$$ -299168 -198403 -122332 -127004 -306966 -421489 -417549 -410672 -106437 -68396 -182392 -20561
12628b0561j52854j79898k68733L23560L51674p012M7723m1661K78222J05241
$$ -20561 -173415 -353313 -622046 -298486 53188 46176 93899 52238 330460 435701
12618D35701j04067j95808l10429k17859J40150j53064j29330M38132J11947J34068
$$ 435701 331634 135826 -174603 -392462 -252312 -405376 -534706 -96574 15373 149441
12608A49441j47497k1788j88498n6341L42193R4356k82154k59538K22703L94643
$$ 149441 1944 -19844 -208342 -264683 77510 171866 -110288 -369826 -147123 247520
12598B47520p4886q5784k15242j27610j02390M2684q4389J82492M25294P7293
$$ 247520 172634 86850 -128392 -256002 -358392 -315708 -400097 -217605 207689 284982
12588B84982p0514j15027O5383l3359l8570k40116k78448j10124R0037L03209
$$ 284982 214468 99441 164824 131465 92895 -147221 -425669 -535793 -445756 -142547
12578a42547K40897O9300k95787k09189p0471J70236J52613J16132k18807j17349
$$ -142547 98350 167650 -128137 -337326 -407797 -237561 -84948 31184 -187623 -304972
12568c04972l04319J36983L38996J82508K041P786j10123k15079m4368n551n4194
$$ -304972 -609291 -472308 -133312 49196 51237 59023 -51100 -266179 -310547 -316098 -370292
12557c70292Q8743n5793m2818K85739q8603j57431J91855M575K44351q5825R8403
$$ -370292 -281549 -337342 -380160 -94421 -183024 -340455 -148600 -144025 100326 14501 112904
12546A12904J14138j35307k59679P9097M4299J88435K31400j7386j15524q2450
$$ 112904 227042 91735 -167944 -88847 -44548 143887 375287 357901 242377 159927
12536A59927k0967O3447o5220r5225K61385o3717l11319j84650K5552Q4102J51201
$$ 159927 138960 202407 137187 41962 303347 239630 -71689 -256339 -230787 -146685 4516
12525D516K02012L3052J41728n4648Q2261j61710j98292j39551P4712J39663q4872
$$ 4516 206528 239580 381308 326660 408921 247211 48919 -90632 -15920 123743 38871
12514C8871Q4166J36156m1405j33699k03995p3327L07820K03784k21083k25727
$$ 38871 123037 259193 217788 84089 -119906 -193233 114587 318371 97288 -128439
12504a28439K6176K04462j59393J38879n1765j65990M3482L5927J6086O597q3823
$$ -128439 -102263 102199 -57194 81685 29920 -136070 -92588 -56661 -40575 -33978 -117801
12493a17801j26013O9689j53588k07298o4087K87542L88100N8315o020k1095q7796
$$ -117801 -243814 -174125 -327713 -535011 -599098 -311556 76544 134859 128839 107744 19948
12482A9948o1083j73935j44753j0322r0554M2092J77232M2725L9910R2312K41490
$$ 19948 -41135 -215070 -359823 -370145 -460699 -418607 -241375 -198650 -158740 -66428 175062
12471A75062J84968L652l85253k448J73769J00588r3631k77297J80262K40945
$$ 175062 360030 363682 -21571 -24019 149750 250338 156707 -120590 59672 300617
12461C00617Q8097k1489J56434m04859o19040N1420K98200J70548K23080j39042
$$ 300617 388714 367225 523659 118800 -500240 -448820 -150620 19928 243008 103966
12451A03966q1127J13877K7283o0442N5235N1127k411l214q4092R326j0682p0080
$$ 103966 22839 136716 163999 103557 158792 209919 207508 204294 120202 129528 118846 48766
12439D8766j0Q0268J97923p7768L2096j51418K6333Q6584n918j4516m37565n8880
$$ 48766 48756 129024 326947 249179 281275 129857 156190 242774 236856 222340 -215225 -274105
12427b74105K29169R0895J40514k64707j54547J20113J22063K17486L902J5545
$$ -274105 -44936 45959 186473 -78234 -232781 -112668 9395 226881 230783 246328
12417B46328K1857j59369k74002Q1202m8633q7814M8331j09284n4475N4037K84989
$$ 246328 268185 108816 -165186 -83984 -132617 -220431 -172100 -281384 -335859 -281822 3167
12406C167R8025j31256j93417J02996O79766L98739k76376l5109N4286k54259
$$ 3167 101192 -30064 -223481 -120485 559281 958020 681644 646535 700821 446562
12396D46562q1710Q6140J80928L820j51223m00998j94324J73053m2132N4527j09270
$$ 446562 364852 450992 631920 635740 484517 83519 -110805 62248 20116 74643 -34627
12385c4627j20401k79472q8783k6948J85134n688j24663m0787j4342N7849O092
$$ -34627 -155028 -434500 -523283 -550231 -365097 -370785 -495448 -536235 -550577 -492728 -486636
12374d86636L00699K14412j12451j23130M0463O3812O7075R6548K22078M0949
$$ -486636 -185937 28475 -83976 -207106 -166643 -102831 -35756 60792 282870 323819
12364C23819j14287J58712k69061p2590p4168l07440n3562q8175j54625L85885
$$ 323819 209532 368244 99183 26593 -47575 -355015 -408577 -496752 -651377 -265492
12354b65492J34027J19868J58691J80749J50396k06951l05503k23828q1607j1672
$$ -265492 -131465 -11597 147094 327843 478239 271288 -34215 -258043 -339650 -351322
12344c51322j3568K38020L04199K36748k62099o1268n5695k10717k80041o8557
$$ -351322 -364890 -126870 177329 414077 151978 90710 35015 -175702 -455743 -524300
12334e24300J99813R3408L31577K94470l28871j84704J9453k4205j130Q3090J2958
$$ -524300 -324487 -231079 100498 394968 66097 -118607 -99154 -123359 -124489 -41399 -28441
12323b8441r4829L1659r0356j09440L19831l7528k68790K0701P2690Q0033K35098
$$ -28441 -123270 -91611 -181967 -291407 28424 -9104 -277894 -257193 -184503 -104470 130628
12312A30628k54764n70J92106J08511K43652o5240j90262l22584N1973K08575
$$ 130628 -124136 -124706 67400 175911 419563 354323 164061 -158523 -106550 102025
12302A02025m6713j03676J16363K11677R5992j00120J00225J56733j61335N0330
$$ 102025 55312 -48364 67999 279676 375668 275548 375773 532506 371171 421501
12292D21501l81728l35483O3157J06667J65283J97930N612m5502K15563j753o7072
$$ 421501 39773 -295710 -232553 -125886 39397 237327 242939 197437 413000 411247 344175
12281C44175j62171k569m5347j27881m5809j07643k79235o3036K78374K85806
$$ 344175 182004 179435 134088 6207 -39602 -147245 -426480 -489516 -211142 74664
12271G4664l1787J84919n1568q7704r0934m7979n0606j84563P8566J07964R4550
$$ 74664 42877 227796 176228 88524 -2410 -50389 -100995 -285558 -206992 -99028 -4478
12260d478K08617q4307K486M4014l02489j68609J22054L2170J78340J4409o9553
$$ -4478 204139 119832 122318 166332 -136157 -304766 -182712 -150542 27798 42207 -27346
12249b7346L31693J66141l6818k10305j49517p6979k11005j8865N4957J06628
$$ -27346 304347 470488 433670 223365 73848 -3131 -214136 -233001 -178044 -71416
12239g1416O4389Q4785k10537k28974J22612M28047N6698k03477j86227K57100
$$ -71416 -7027 77758 -132779 -361753 -239141 188906 245604 42127 -144100 113000
12229A13000K71594k64555j85750J24468J08712m034o0795r8070Q1872K53264
$$ 113000 384594 120039 -65711 58757 167469 163435 102640 4570 86442 339706
12219C39706Q5860m165j19146q0433J0361k25169l4564O3307R0605K58127k4254
$$ 339706 425566 421401 302255 221822 232183 7014 -27550 35757 126362 384489 360235
12208C60235O8018k29133j60601N4862k73387J63492K0564k537J6077K4849p7702
$$ 360235 428253 199120 38519 93381 -180006 -16514 4050 1513 17590 42439 -35263
12197c5263j20750j49621L1005M04524J65327j83053j17689o8889Q9960J08363
$$ -35263 -156013 -305634 -274629 129895 295222 112169 -5520 -74409 15551 123914
12187A23914K38812L59753R9191l33166k30017j94822n1089J77711M1953k09971
$$ 123914 362726 722479 821670 488504 258487 63665 12576 190287 232240 22269
12177B2269j8341Q8472k17964m54792J15271J27800J13893K79056k34626j82374
$$ 22269 3928 92400 -125564 -580356 -465085 -337285 -223392 55664 -178962 -361336
12167c61336j42411R5848K56728j12766q1898K14153J24358p0888l9967K51151
$$ -361336 -503747 -407899 -151171 -263937 -345835 -131682 -7324 -78212 -118179 132972
12157A32972o2282J06809J02206r1575K3566k73905n8741p951k6618k8345l9162
$$ 132972 70690 177499 279705 188130 211696 -62209 -120950 -128901 -155519 -183864 -223026
12146b23026J6268N224K238K22431o0675J40692j70246L05377K51475j72346k21875
$$ -223026 -206758 -201534 -199296 23135 -37540 103152 -67094 238283 489758 317412 95537
12135I5537k79961R4365K4366k07125J30342N85501J62809j25674l3665j92844
$$ 95537 -184424 -90059 -65693 -272818 -142476 443025 605834 480160 446495 253651
12125B53651Q1450R0210l45467l23404Q2793j16917O9171K03184P9138n5060j65797
$$ 253651 335101 425311 79844 -243560 -160767 -277684 -208513 -5329 73809 18749 -147048
12114a47048J61647J23728R2977N0773r3425j69062k40052k25510J55101K16036
$$ -147048 14599 138327 231304 282077 188652 19590 -220462 -445972 -290871 -74835
12104g4835J65180j46357k65501Q447J08310o8311j17057n7545j66489P1562j17213
$$ -74835 90345 -56012 -321513 -313066 -204756 -273067 -390124 -447669 -614158 -542596 -659809
12093f59809J02840O2168J86489O841K04967K31386J21525j23777L6619K66188
$$ -659809 -556969 -494801 -308312 -301471 -96504 134882 256407 132630 169249 435437
12083D35437r6752k42396k92359J4171J36433j35010j9426K28107P1899r5906
$$ 435437 338685 96289 -196070 -181899 -45466 -180476 -199902 28205 100104 4198
12073D198q3503J09003K13159O4041J8558j54321k40209K587l0040j19139j74345
$$ 4198 -79305 29698 242857 306898 325456 171135 -69074 -66487 -96527 -215666 -390011
12062c90011j36044k83273J13693J56545L4343N17618n1796k21914o764L4304
$$ -390011 -526055 -809328 -695635 -539090 -504747 12871 -38925 -260839 -267603 -233299
12052b33299j06032r1947j11855K28807J27680j30246J87779K13223K28013j12075
$$ -233299 -339331 -431278 -543133 -314326 -186646 -316892 -129113 84110 312123 200048
12042B00048M498o0742N3845K18704O9808k00357k69360j16131l39116l05368
$$ 200048 204546 143804 197649 416353 486161 285804 16444 -99687 -438803 -744171
12032g44171K5111M05100L33830R0659q5694R8032j08688k4934k89774j43594
$$ -744171 -719060 -313960 19870 110529 24835 122867 14179 -10755 -300529 -444123
12022d44123K39008j61187J11609J08164K94499j46880k11279r3372m62846K99013
$$ -444123 -205115 -366302 -254693 -146529 147970 1090 -210189 -303561 -766407 -467394
12012d67394O8459j60096K54311L35381N8004P3493n4398P8117q3460n6712j4259
$$ -467394 -398935 -559031 -304720 30661 88665 162158 107760 185877 102417 45705 31446
12001C1446J2506j75556k8549p6205M5614J01607k3371j29887j06897R5599Q6228
$$ 31446 43952 -131604 -160153 -236358 -190744 -89137 -112508 -242395 -349292 -253693 -167465
11990a67465K77298J24947k01976j65846L9245j8708k23530j24326M9025L08458
$$ -167465 109833 234780 32804 -133042 -93797 -112505 -336035 -460361 -411336 -102878
11980a02878n9105K50929J20818Q636l13478p245J85940j18417m5794O0112L264
$$ -102878 -161983 88946 209764 218400 -95078 -102323 83617 -34800 -80594 -20482 -17218
11969a7218j50958O0936m0535K8516l2865L0524P1162Q5042p3554p5575J10109
$$ -17218 -168176 -107240 -147775 -119259 -152124 -121600 -50438 34604 -38950 -114525 -4416
11958d416J0426q3954K64339n6425m95672j79816K22538L6637P1978Q0335m6061
$$ -4416 6010 -77944 186395 129970 -365702 -545518 -322980 -286343 -214365 -134030 -180091
11947a80091L66732L9924j88861j0784L4634l7290j24233n0376J9059J36064J51811
$$ -180091 186641 226565 37704 26920 61554 24264 -99969 -150345 -131286 4778 156589
11936A56589l58216k5918K47259P5186k8433l28242N2726p5590J3389J02763Q8959
$$ 156589 -201627 -227545 19714 94900 66467 -261775 -209049 -284639 -271250 -168487 -79528
11925g9528l2644j5975L9300k95737j80014K00874K89601K39280J66925R5884
$$ -79528 -112172 -128147 -88847 -384584 -564598 -363724 -74123 165157 332082 427966
11915D27966p2514q6691n7824j36286K6458j05610P2714L3635j08184k43799p3027
$$ 427966 355452 268761 210937 74651 101109 -4501 68213 101848 -6336 -250135 -323162
11904c23162n9472O5584K07928J81396L39279L2789k90307O5949J23932o7555
$$ -323162 -382634 -317050 -109122 72274 411553 444342 154035 219984 343916 276361
11894B76361O888n9492k58761M7747K45271j65691l09056R6864Q2114K999m0555
$$ 276361 283249 223757 -35004 12743 258014 92323 -216733 -119869 -37755 -34756 -75311
11883g5311j4193L41491R6740k09714k38629j01113l83903K3591K88702K67611
$$ -75311 -89504 251987 348727 139013 -99616 -200729 -584632 -561041 -272339 -4728
11873d728M63398Q5491k52207p9305M9689k22496k43324o2420R1999R0471j98355
$$ -4728 458670 544161 291954 212649 262338 39842 -203482 -265902 -173903 -83432 -281787
11862b81787J45589j2186l02617P0869M95426K66047L1729m29514j78241r6656
$$ -281787 -136198 -148384 -451001 -380132 115294 381341 413070 -16444 -194685 -291341
11852b91341M2118K6867Q2543J22917k3490K86921j29622p5689J24201N3695q005
$$ -291341 -249223 -222356 -139813 -16896 -40386 246535 116913 41224 165425 219120 211115
11841B11115P1108j61740j69651j81298K36866L9501J5235k45508K26072j83635
$$ 211115 282223 120483 -49168 -230466 6400 45901 61136 -184372 41700 -141935
11831a41935k74280K74866M27810J49193q1113n0567m039p11k59190J79398q6898
$$ -141935 -416215 -141349 286461 435654 354541 303974 299935 299224 40034 219432 132534
11820A32534j41008j44910p9497L24131J95813J04738K8681k88462j55018m0411
$$ 132534 -8474 -153384 -232881 91250 287063 391801 420482 132020 -22998 -63409
11810f3409j36016l68643J01478K03760m5562J90800K13971O1216m1693N4103
$$ -63409 -199425 -568068 -466590 -262830 -308392 -117592 96379 157595 115902 170005
11800A70005q6917J1957l9227J08404L97327m5754k74436k64221K95625L4168
$$ 170005 83088 95045 55818 164222 561549 515795 241359 -22862 272763 306931
11790C06931k10869K76271O8262P776k88620l59002K17191K14041O164J6470j06174
$$ 306931 96062 372333 440595 448371 159751 -199251 17940 231981 238145 254615 148441
11779A48441O232j55382p2738j32615o3018J47652N5763Q1404P2476L42454J92958
$$ 148441 154673 -709 -73447 -206062 -269080 -121428 -65665 15739 88215 430669 623627
11768F23627j23328j67668k43275q3514J34615L7817N4847J46816K3941k49115
$$ 623627 500299 332631 89356 5842 140457 178274 233121 379937 403878 154763
11758A54763j44467R2428J76387o3233K01057J09301j69332j87328N5853J79884
$$ 154763 10296 102724 279111 215878 416935 526236 356904 169576 225429 405313
11748D05313K4875k75889k83125J92601O9075o8864J46881K53658K39681k82798
$$ 405313 430188 154299 -128826 63775 132850 63986 210867 464525 704206 421408
11738D21408m54669k02562J73782J48079R2870j00907j09697j11369n3266J48245
$$ 421408 -33261 -235823 -62041 86038 178908 78001 -31696 -143065 -196331 -48086
11728d8086N9964K81550l0384k15286j34396k12889K03999J30840K53882l0223
$$ -48086 11878 293428 263044 47758 -86638 -299527 -95528 35312 289194 258971
11718B58971p7574k19194q5182j73355N1473K50820K99895M1665o1938l2004k13001
$$ 258971 181397 -37797 -122979 -296334 -244861 5959 305854 347519 285581 253577 40576
11707D0576l59145J18183J61422Q2178R4373p0778N0217l80051j84081N8364K03998
$$ 40576 -318569 -200386 -38964 43214 137587 66809 117026 -263025 -447106 -388742 -184744
11696a84744L60449L89651Q0693M7759j10856k67955l7828R5575l3014l8423k1827
$$ -184744 175705 565356 646049 693808 582952 314997 277169 372744 339730 301307 279480
11685B79480k57801O8149N195k00139j154K9286N2840J9227K71358p6617N9539
$$ 279480 21679 89828 95023 -105116 -106270 -76984 -24144 -4917 266441 189824 249363
11674B49363k77597j11647M1236J32619j07936j35945J26801l1370J75948J33131
$$ 249363 -28234 -139881 -98645 33974 -73962 -209907 -83106 -114476 61472 194603
11664A94603k84698k06394O7446M9036o520j70291j05291p134J87185j26604o6725
$$ 194603 -90095 -296489 -229043 -180007 -186527 -356818 -462109 -469243 -282058 -408662 -475387
11653d75387P8754L16730L37053l7689k85976L725q0279Q014K59424R1181j24764
$$ -475387 -396633 -79903 257150 219461 -66515 -62790 -143069 -135055 124369 215550 90786
11642I0786K29133j93760J36040K05263M2321l8148L6626j93171P81l47j22750
$$ 90786 319919 126159 262199 467462 509783 471635 508261 315090 315871 315524 192774
11631A92774j35589l0206o6252K02677j67810p6270q2945R4107m5060K3650q4380
$$ 192774 57185 26979 -39273 163404 -4406 -80676 -163621 -69514 -114574 -90924 -175304
11620a75304q5768R900J92957m7842q7570k70993k25317L15220K59719J4498R3157
$$ -175304 -261072 -251172 -58215 -106057 -193627 -464620 -689937 -374717 -114998 -100500 -7343
11609g343q7358k98012k6374J55903P2602R4314j55428j42904J69332k27961m8396
$$ -7343 -94701 -392713 -419087 -263184 -190582 -96268 -251696 -394600 -225268 -453229 -501625
11598e01625J13223M6400j69269r2529P828J20870M05596K40195j16636j74861
$$ -501625 -388402 -342002 -511271 -603800 -595972 -475102 -69506 170689 54053 -120808
11588a20808J01348m4523K2718j88776k51384J87107M285P1403r8050n0413J47854
$$ -120808 -19460 -63983 -41265 -230041 -481425 -294318 -290033 -218630 -316680 -367093 -219239
11577b19239Q7843j45189j44880J100l7896J42200M473J54564L07740R3466o0003
$$ -219239 -131396 -276585 -421465 -420365 -458261 -316061 -311588 -157024 150716 244182 184179
11566A84179o2550m06902j43274J70157K11525l9298L448J18393q1201j38764
$$ 184179 121629 -285273 -428547 -258390 -46865 -86163 -82715 35678 -45523 -184287
11556a84287j81246q4338J87453Q5564n8026K39725m3310j96472K9192J10049
$$ -184287 -365533 -449871 -262418 -176854 -234880 4845 -38465 -234937 -205745 -95696
11546i5696k41560n7743L04150J76965K0317j44766j59009l0272r2116j32384
$$ -95696 -337256 -394999 -90849 86116 106433 -38333 -197342 -227614 -319730 -452114
11536d52114J22042M7305J60678k49981j10290M8587K00966K72589k3635m4365
$$ -452114 -330072 -282767 -122089 -372070 -482360 -433773 -232807 39782 16147 -28218
11526b8218k0795j7173p665j09993k09110L099L39927M13952L124J67769j79381
$$ -28218 -49013 -66186 -73851 -183844 -392954 -389855 -49928 364024 367148 534917 355536
11515C55536k60444q5703l1783m2917k429J70590k2169j65158o3676o4196J74174
$$ 355536 95092 9389 -22394 -65311 -67740 102850 80681 -84477 -148153 -212349 -38175
11504c8175J23780Q4595L6776o5334l95500m1677L6994r8072j70940J44037O8358
$$ -38175 85605 170200 206976 141642 -253858 -295535 -258541 -356613 -527553 -383516 -315158
11493c15158L39967O5226k00689J71698k0324r1610K7435L5587O3984j46451J17578
$$ -315158 24809 90035 -110654 61044 40720 -50890 -23455 12132 76116 -70335 47243
11482D7243n8972J07027J8452M3427Q7551L6689J1575M025j46259k38553r8981
$$ 47243 -11729 95298 113750 157177 244728 281417 292992 297017 150758 -87795 -186776
11471a86776q5755M9858j98809J14344J02818m9457P3515k9866K12391J12563
$$ -186776 -272531 -222673 -421482 -307138 -204320 -253777 -180262 -210128 2263 114826
11461A14826K7076l03417l43849n6757L67642L08639P2869o162J20143k48794
$$ 114826 141902 -161515 -505364 -562121 -194479 114160 187029 180867 301010 52216
11451E2216j20621k35820J56099o700k48622j96075N1780N0188K58432K82323
$$ 52216 -68405 -304225 -148126 -154826 -403448 -599523 -547743 -497555 -239123 43200
11441D3200J42429o4182k79722L8686r6226j9787J37110J82762J01237Q1271j43411
$$ 43200 185629 121447 -158275 -119589 -215815 -235602 -98492 84270 185507 266778 123367
11430A23367N6202j03664k55481p0068L23178J4485j82629m8460J5004N132j66012
$$ 123367 179569 75905 -179576 -249644 73534 88019 -94610 -143070 -128066 -122934 -288946
11419b88946M4784P7093O7740j05233j14527L65213J04147j46967m0373m7203
$$ -288946 -244162 -167069 -99329 -204562 -319089 46124 150271 3304 -37069 -84272
11409h4272p8747K9481K37894P9393l1320l0373j27829M9421M92174K48604j49403
$$ -84272 -163019 -133538 104356 183749 152429 122056 -5773 43648 535822 784426 635023
11398F35023n1565j12402o6390N9988J74758J5916k65610l19530m5548J81198
$$ 635023 583458 471056 404666 464654 639412 655328 389718 70188 24640 205838
11388B05838L40829n657l90804j13977p7186q6175J8959m0816j31206m4763L39509
$$ 205838 546667 541010 150206 36229 -40957 -127132 -108173 -148989 -280195 -324958 14551
11377A4551K54517L7375j39769j37722j88426R6528L11129K10302J27462L88573
$$ 14551 269068 306443 166674 28952 -159474 -62946 248183 458485 585947 974520
11367I74520L50055J15179j3811j6847r1622j55877k32040j19999q1141J06105
$$ 974520 1324575 1439754 1425943 1409096 1317474 1161597 929557 809558 728417 834522
11357H34522m652j38844k41847l32090L1645O1993J08349q5430j42269k29158
$$ 834522 829870 691026 449179 117089 148734 210727 319076 233646 91377 -137781
11347a37781p0603P6487q6630M21316K69365J78213j56887J1154J55879J78195
$$ -137781 -208384 -131897 -218527 202789 472154 650367 493480 504634 660513 838708
11337H38708J98926K68600L42607J52844r5438j90413j25753l07493k97983j23852
$$ 838708 1037634 1306234 1648841 1801685 1706247 1515834 1390081 1082588 784605 660753
11327F60753j79696J00576P1812O4998l59164k13266J2513K32776K10056j7780
$$ 660753 481057 581633 653445 718443 359279 146013 158526 391302 601358 583578
11317E83578j95505L2015o4620j91189M3971n8326m14133J30118J74823N5028
$$ 583578 388073 420088 355468 164279 208250 149924 -264209 -134091 40732 95760
11307I5760K60897k6954M5018j75775j55778j16880K86206m3933j85494k12885
$$ 95760 356657 329703 374721 198946 43168 -73712 212494 168561 -16933 -229818
11297b29818j36625J28026L30679J08184j19032k34888j29542m219J89012N1366
$$ -229818 -366443 -238417 92262 200446 81414 -153474 -283016 -287235 -98223 -46857
11287d6857J48693r2274n8854j66634K833j8748J26033R7568J02874K83920p1794
$$ -46857 101836 9562 -49292 -215926 -213093 -231841 -105808 -8240 94634 378554 306760
11276C06760k69417P59J27899N4386K7396r6646k02304K40201o5640o339j48297
$$ 306760 37343 38102 166001 220387 247783 151137 -51167 189034 123394 117055 -31242
11265c1242l59996j39973J16063p2838P9753P1702N4459M8708R0784M2234n3210
$$ -31242 -391238 -531211 -415148 -487986 -408233 -336531 -282072 -233364 -142580 -100346 -153556
11254a53556j2975J24225r5129l8745o76J67040J7998j01990j67866Q0251L63485
$$ -153556 -166531 -42306 -137435 -176180 -176856 -9816 8182 -93808 -261674 -181423 182062
11243A82062J10154Q6787o1229l38612M5611P4231p978j86225j19248J503M1595
$$ 182062 292216 379003 317774 -20838 24773 99004 91026 -95199 -214447 -212944 -171349
11232a71349K34447o6082j22145M0658l9341J08339K40851L6167l48577j97404
$$ -171349 63098 -2984 -125129 -84471 -123812 -15473 225378 261545 -87032 -284436
11222b84436k65336K39640J77834j60468K47588K38950J10881j8998M8665k7624
$$ -284436 -549772 -310132 -132298 -292766 -45178 193772 304653 285655 334320 306696
11212C06696j17899J09026J46304j90698n0921p4156r2038k20554p1486M77226
$$ 306696 188797 297823 444127 253429 202508 128352 36314 -184240 -255726 221500
11202B21500J25659l38093n4160K83613m1484M6841q1017l32303j90168J84679
$$ 221500 347159 9066 -45094 238519 197035 243876 162859 -169444 -359612 -174933
11192a74933J06780k19409J1034J88745P4174R0667j2092j25669j36835M0270
$$ -174933 -68153 -287562 -276528 -87783 -13609 77058 64966 -60703 -197538 -157268
11182a57268J22434K0127J05427k5903O5072l606r3338k28881J77977J22840Q6912
$$ -157268 -34834 -14707 90720 64817 129889 126283 32945 -195936 -17959 104881 191793
11171A91793m107j40526L2054j03223k81469l56211l8497p2091L344O2901M40534
$$ 191793 187686 47160 79214 -24009 -305478 -661689 -700186 -772277 -768933 -706032 -265498
11160b65498J26413J54254L57335j06432j3410P2516p1558n4043l26011k45944
$$ -265498 -139085 15169 372504 266072 252662 325178 253620 199577 -126434 -372378
11150c72378p1221J1043L17001j11220J01841K05275Q531k09531j23475J43643
$$ -372378 -443599 -432556 -115555 -226775 -124934 80341 88872 -120659 -244134 -100491
11140a00491K16047q9704J33439n1585j50041K02669j10072l18021k7946J85282
$$ -100491 115556 25852 159291 107706 -42335 160334 50262 -267759 -295705 -110423
11130a10423L57832J61816J77169q7464k99372l52576j50074j2773K2565L04606
$$ -110423 247409 409225 586394 498930 199558 -153018 -303092 -315865 -293300 11306
11120A1306K3758K06536J43400j44761k0127j06349j90508K52232O0304K1912
$$ 11306 35064 241600 385000 240239 220112 113763 -76745 175487 235791 257703
11110B57703J28351O2353j94042M4549n534q8800m0177k23096j60119Q8914J66781
$$ 257703 386054 448407 254365 298914 293380 204580 164403 -58693 -218812 -129898 36883
11099C6883K79243M1067r6680J19354l3067K6733J53392j11708k5591P3048j30660
$$ 36883 316126 357193 260513 379867 346800 373533 526925 415217 389626 462674 332014
11088C32014j97953k25857L62782K06443k69920J05060J25543m6787N9950k7638
$$ 332014 134061 -91796 270986 477429 207509 312569 438112 391325 451275 423637
11078D23637j89094R9332r8350j06503K19751J02782j09750j92777R1402J64002
$$ 423637 234543 333875 235525 129022 348773 451555 341805 149028 240430 404432
11068D04432J4047k97357j9141J44312K00689n1360j18447m0236J13994N3466
$$ 404432 418479 121122 101981 246293 446982 395622 277175 236939 350933 404399
11058D04399k397Q701R8846L9667o9591M0161j61173k14653M594J29777J6011
$$ 404399 402002 410703 509549 549216 479625 519786 358613 143960 148554 278331 294342
11047B94342l2785j03029O574j10749l2258L20183K35421k16156L1036j25210
$$ 294342 261557 158528 165102 54353 22095 342278 577699 361543 392579 267369
11037B67369m5704J12728K58070K77629M8871o0608k94331j77685j12225o5890
$$ 267369 221665 334393 592463 870092 918963 858355 564024 386339 274114 208224
11027B08224p353K19778J15498p0665o6349k2437k20647O7626J5715k38913m0799
$$ 208224 200871 420649 536147 465482 399133 376696 156049 223675 239390 477 -40322
11016d0322j18363J89831J89564l38766J57635L19385l8636l1176Q9346p3998
$$ -40322 -158685 31146 220710 -118056 39579 358964 320328 289152 378498 304500
11006C04500q4446k2246P1617M9003l9091j8702K25164j55019o0751j04662J21320
$$ 304500 220054 197808 269425 318428 279337 260635 485799 330780 270029 165367 286687
10995B86687l2491j40754P9458J31419j98931k56415L3202L81399M07719k43753
$$ 286687 254196 113442 192900 324319 125388 -131027 -97825 283574 691293 447540
10985D47540j87114n2852r0844l6693r1332r8370k33487p3232M54555R7217j56858
$$ 447540 260426 207574 116730 80037 -11295 -109665 -343152 -416384 38171 135388 -21470
10974b1470J989M4734k00248n6968K57236J07329j06371q6047K04365j26148k65328
$$ -21470 -19481 25253 -174995 -231963 25273 132602 26231 -59816 144549 18401 -246927
10963b46927j03962J62325K50046j96579k61860O5898m9169J64602K73684j69946
$$ -246927 -350889 -188564 61482 -135097 -396957 -331059 -380228 -215626 58058 -111888
10953a11888j74652Q9509R4012L6304q3785l3089O0013K21188M1678L4427M2594
$$ -111888 -286540 -197031 -103019 -66715 -150500 -183589 -123576 97612 139290 173717 216311
10942B16311j28300O6742N0281j74908k9897k90987l27295O5063L11384K07359
$$ 216311 88011 154753 205034 30126 229 -290758 -618053 -552990 -241606 -34247
10932c4247J25947j58844j4461j18902r0700j92850K9196J16041j2391J75891
$$ -34247 91700 -67144 -81605 -200507 -291207 -484057 -454861 -338820 -351211 -175320
10922a75320j2459K15254K54599l4171j34187j98141l688j27896j64940J05920
$$ -175320 -187779 27475 282074 247903 113716 -84425 -88113 -216009 -380949 -275029
10912b75029K38022Q1120p6690j05471Q3424J28171Q331j74505J18822J38582
$$ -275029 -37007 44113 -32577 -138048 -54624 73547 81878 -92627 26195 164777
10902A64777J18259O7650j45879k266k04727j64823J46438p9189J17505J25788
$$ 164777 283036 350686 204807 202541 -2186 -167009 -20571 -99760 17745 143533
10892A43533J77622K2591m19878k58516L71695K13381l05385j26049j1336q0796
$$ 143533 321155 343746 -76132 -334648 37047 250428 -54957 -181006 -192342 -273138
10882b73138J56087p4648r7753J84260L33455j11780j82569J23288j54281q9617
$$ -273138 -117051 -191699 -289452 -105192 228263 116483 -66086 57202 -97079 -186696
10872a86696M6292L11189Q5771l99340j46660j13179J37353k67225M0620J68335
$$ -186696 -140404 170785 256556 -142784 -289444 -402623 -265270 -532495 -491875 -323540
10862c23540L15548L68302Q4258j6588J33763k32591j49078j76120j61300J07026
$$ -323540 -7992 360310 444568 427980 561743 329152 180074 3954 -157346 -50320
10852e0320m5063j91447j65842L99053J44118J13416Q1975j67192j69460j26889
$$ -50320 -95383 -286830 -452672 -53619 90499 203915 285890 118698 -50762 -177651
10842a77651r1847j79590M79187r1132r6798J49506L2178l5964O9150L63874J50544
$$ -177651 -269498 -449088 30099 -61033 -157831 -8325 23853 -12111 57039 420913 571457
10831E71457N621j5629m04255o9778j17729J22256J27467j71842l00448k31785
$$ 571457 577078 561449 157194 87416 -30313 91943 219410 47568 -252880 -484665
10821d84665J8392m6640K40597J33083J50434k605q6474o2831N6601K8261J3372
$$ -484665 -466273 -512913 -272316 -139233 11201 8596 -77878 -140709 -84108 -55847 -42475
10810d2475m0082J74403M4687j59178m06883L10655K43213k37150k34064J7805
$$ -42475 -82557 91846 136533 -22645 -429528 -118873 124340 -112810 -346874 -329069
10800c29069L34806O845r3063n3836l6791L32962j8716r2787K04676r1099j4203
$$ -329069 5737 12582 -80481 -134317 -171108 161854 143138 50351 255027 163928 149725
10789A49725j23677R1573J83301P1745j46352m2118j5006J14976l3858k37676
$$ 149725 26048 117621 300922 372667 226315 184197 169191 284167 250309 12633
10779A2633J22184J79802j39107j38769k68778l3041J99940r9259k01632R1162
$$ 12633 134817 314619 175512 36743 -232035 -265076 -65136 -164395 -366027 -274865
10769b74865P5349N4488J91799o5372J11164K44691m6005p6494k46111R6028J47292
$$ -274865 -199516 -145028 46771 -18601 92563 337254 291249 214755 -31356 64672 211964
10758B11964q6999J0685J8769j39777m2016j05478m1485K59749o5571r1031m0919
$$ 211964 124965 135650 154419 14642 -27374 -132852 -174337 85412 19841 -71190 -112109
10747a12109m6383o5050O01Q7481J00134J47879K68516R5894l23455r0328j2371
$$ -112109 -158492 -223542 -222941 -135460 -35326 112553 381069 476963 153508 63180 50809
10736E0809m4336j84651o4563J98932p1716J95984P9674k8881K0022n7059j1596
$$ 50809 6473 -178178 -242741 -43809 -115525 80459 160133 131252 151274 94215 82619
10725H2619J17760O9803l5424k0170j97349J18932K90399K3316N9660J30480j22734
$$ 82619 200379 270182 234758 214588 17239 136171 426570 449886 509546 640026 517292
10714E17292l93186j12585j02232j42873j51405k5575K61847N5188j12837j24832
$$ 517292 124106 11521 -90711 -233584 -384989 -410564 -148717 -93529 -206366 -331198
10704c31198k0042J67246K29947N8468M4246K01867k02415k88270l43204j52903
$$ -331198 -351240 -183994 45953 104421 148667 350534 148119 -140151 -483355 -636258
10694f36258K09281J32978j26124J9000J56617j47835J91384j5586J81796P9295
$$ -636258 -426977 -293999 -420123 -401123 -244506 -392341 -200957 -216543 -34747 44548
10684D4548L66528j27392j17424j6211J34215L4930k01072l2062J15909K81073
$$ 44548 411076 283684 166260 150049 284264 319194 118122 86060 201969 483042
10674D83042M8852k00589L9869j39304l60991p3861l9429k38539J857L02876Q2417
$$ 483042 531894 331305 371174 231870 -129121 -202982 -242411 -480950 -479093 -176217 -93800
10663i3800J68513L3979J12850P0813N4774k80500O5710R1101Q32Q4228Q8878
$$ -93800 74713 108692 221542 292355 347129 66629 132339 223440 224272 308500 397378
10652C97378k08211l24034k19573L70564L84654j58223n1882J8530j02883j15934
$$ 397378 189167 -134867 -354440 16124 400778 242555 190673 209203 106320 -9614
10642i614n435R0389J12847q3662j67681l19102k33646O9087L76730J31988k0780
$$ -9614 -15049 75340 188187 104525 -63156 -382258 -615904 -546817 -170087 -38099 -58879
10631e8879j65911j23740o3401J31854K68539l9265k9432K11236j79823k9880
$$ -58879 -224790 -348530 -411931 -280077 -11538 -50803 -80235 131001 -48822 -78702
10621g8702J9616J37838m29998n07643k3311L58240K09720J070R5819j1176j3976
$$ -78702 -59086 78752 -351246 -858889 -882200 -523960 -314240 -313170 -217351 -228527 -242503
10610b42503N96480L7136k32481k07445J48597K42557N1490l4845j99187j01369
$$ -242503 353977 391113 158632 -48813 99784 342341 393831 358986 159799 58430
10600E8430P9740o8406j20227Q3835k0940K67623j80466l48722M9676J3898J67685
$$ 58430 138170 69764 -50463 33372 12432 280055 99589 -249133 -199457 -185559 -17874
10589a7874k4275J93335n3267K0711J44345k9052J23974K09636M21148M4776j66040
$$ -17874 -42149 151186 97919 118630 262975 233923 357897 567533 988681 1033457 867417
10578H67417j36081l51652j07456M0729j75757Q252j5893j35684o1527q030M1422
$$ 867417 731336 379684 272228 312957 137200 145452 129559 -6125 -67652 -75682 -34260
10567c4260K07485j13283r4844L9799m5376j37202o8182K07021j9292j47661j79221
$$ -34260 173225 59942 -34902 4897 -40479 -177681 -245863 -38842 -58134 -205795 -385016
10556c85016j1712L04794J84842K09L5441k56372k87104j33712K56012L84646
$$ -385016 -396728 -91934 92908 93117 128558 -127814 -414918 -548630 -292618 92028
10546I2028K13517m7880j76848r4788l1917j53440j8126J13589p980K11364J54586
$$ 92028 305545 257665 80817 -13971 -45888 -199328 -217454 -103865 -111845 99519 254105
10535B54105q5203L05535M5451j33373j87615l59605l68396J16682J85682J7875
$$ 254105 168902 474437 519888 386515 198900 -160705 -529101 -412419 -226737 -208862
10525b08862N2150J44707k6684j92982K51720J59309K7389l59520o3955k6725
$$ -208862 -156712 -12005 -38689 -231671 20049 179358 206747 -152773 -216728 -243453
10515b43453l28433j07033K72705J75129L00772L86525j13885j52847j0263j28598
$$ -243453 -571886 -678919 -406214 -231085 69687 456212 342327 189480 179217 50619
10505E0619J77328K42082O5786l48915j18028m6251J60613j17424m1164L88087
$$ 50619 227947 470029 535815 186900 68872 22621 183234 65810 24646 412733
10495D12733J8354k82394j35190R8882O8050j22480n3996J83565J70981j27672
$$ 412733 431087 148693 13503 112385 180435 57955 3959 187524 358505 230833
10485B30833k25933k47243J43727K34964N437q132j7079J41325K51939L7708j11217
$$ 230833 4900 -242343 -98616 136348 141785 133653 116574 257899 509838 547546 436329
10474D36329j85934M5915K07531k38372n0479R4430j49881M1263l1080j29916
$$ 436329 250395 296310 503841 265469 214990 309420 159539 200802 169722 39806
10464C9806r5683J29454J35650m9304L0037K4804M9672J80465J39020j27362l27582
$$ 39806 -55877 73577 209227 159923 189960 214764 264436 444901 583921 456559 128977
10453A28977M33729J79795j95132K33065J10813k69899k16081J26064r3808j50309
$$ 128977 562706 742501 547369 780434 891247 621348 405267 531331 437523 287214
10443B87214L49535k6476j85398J2950Q7711N5949N8990k28926l7759j03718j41510
$$ 287214 636749 610273 424875 437825 525536 581485 640475 411549 373790 270072 128562
10432A28562J9063Q6208k20051K55890k53475k93510J10566o0343o4518m4393
$$ 128562 147625 233833 13782 269672 16197 -277313 -166747 -227090 -291608 -336001
10422c36001K65495K83548m4647j57376n0895J52150L00617j26876m2650J57424
$$ -336001 -70506 213042 168395 11019 -39876 112274 412891 286015 243365 400789
10412D00789R1807k80398M4099N1050l47489J71182J52540j4919k52207J4032
$$ 400789 492596 212198 256297 307347 -40142 131040 283580 268661 16454 30486
10402C0486J08698o2848k2038J05583J00384j73367j19709L3776j4006M6466N5508
$$ 30486 139184 76336 54298 159881 260265 86898 -32811 965 -13041 33425 88933
10391H8933J22989n8292j83561j71016K7177l7419J24378N5193K22729P781Q664
$$ 88933 211922 153630 -29931 -200947 -173770 -211189 -86811 -31618 191111 198892 207556
10380B07556q1913j10167K08547K62469O0838j56276O980l07234p8525j85015
$$ 207556 125643 15476 224023 486492 547330 391054 398034 90800 12275 -172740
10370a72740O3892K8399n7665n3981J8616J96407K16692J31249k4254p8824L16891
$$ -172740 -108848 -80449 -138114 -192095 -173479 22928 239620 370869 346615 267791 584682
10359E84682N1549k45115m12962j09642M6251k6141K93548J97457l8822L5988
$$ 584682 636231 391116 -21846 -131488 -85237 -111378 182170 379627 340805 376793
10349C76793m1921K98989N073n2589J08530m4066K8391o3892L835k00757l93794
$$ 376793 334872 633861 638934 586345 694875 650809 679200 615308 619143 418386 24592
10338B4592k06313l025L63784N6764m02364J98948N7336k2766P8296K94010J61611
$$ 24592 -181721 -184746 179038 235802 -166562 32386 89722 66956 145252 439262 600873
10327F00873o4549r4339l30973r036K84703J39419n62591l00951j34505J98616
$$ 600873 536324 441985 111012 101976 386679 526098 -36493 -337444 -471949 -273333
10317b73333L67591K5592J56085l247R1271K48366l1222k27924P4589J73710L926
$$ -273333 94258 119850 275935 272688 363959 612325 581103 353179 427768 601478 605404
10306F05404j30579j2722o9545Q6103J03845j06250k23541m54261J61360L17768
$$ 605404 474825 462103 392558 478661 582506 476256 252715 -201546 -40186 277582
10296B77582m8895r4897n083K6275J28201k4872k85871l9072k42964r3017K38035
$$ 277582 228687 133790 128707 154982 283183 258311 -27560 -66632 -309596 -402613 -164578
10285a64578P0048K19411L11874r522L5571j89383l7902J3612n6237m7391j25585
$$ -164578 -94530 124881 436755 427233 462804 273421 235519 249131 192894 145503 19918
10274A9918j93777K1148J4956j8149L0141j89058J48192K25928l6081K23937j70528
$$ 19918 -173859 -152711 -137755 -155904 -125763 -314821 -166629 59299 23218 247155 76627
10263G6627l92l9379j13210j81785k400j09020K10055j8370l9647K41528l919
$$ 76627 76235 36856 -76354 -258139 -260539 -369559 -159504 -177874 -217521 24007 20088
10252B0088j15971k37070M5562J93079K513J64611K20175J37940L23326L09320
$$ 20088 -95883 -332953 -287391 -94312 -91799 72812 292987 430927 754253 1063573
10242A063573l84783m95166o5543k2956p8709J27934R0261k33521N519J57015
$$ 1063573 678790 183624 118081 95125 16416 144350 234611 1090 6609 163624
10232A63624j51893m26363j09774K09227M53654P0190J31349j48754j39234N6130
$$ 163624 11731 -414632 -524406 -315179 138475 208665 340014 191260 52026 108156
10222A08156M1314j3011k99930o0903L67979M02540K61793k12497k54247j47600
$$ 108156 149470 136459 -163471 -224374 143605 546145 807938 595441 341194 193594
10212A93594k58903j72656l1623J82607J21703P5493q6154O3447O2203k09054
$$ 193594 -65309 -237965 -269588 -86981 34722 110215 24061 87508 149711 -59343
10202e9343k82798N5957J05654J51965j47104Q4455J52637r0288J35916R9131
$$ -59343 -342141 -286184 -180530 -28565 -175669 -91214 61423 -28865 107051 206182
10192B06182N9863j4375r5306j74051k59387K00909M1555j22494l7379j70760
$$ 206182 266045 251670 156364 -17687 -277074 -76165 -34610 -157104 -194483 -365243
10182c65243N3151M95397Q3925j43277J90643L00575m6515q0900q6420p0137k27694
$$ -365243 -312092 183305 267230 123953 314596 615171 568656 487756 401336 331199 103505
10171A03505q9277J23545J88136J4630l12301L9708J41545o9833j14746q1087
$$ 103505 14228 137773 325909 340539 28238 67946 209491 139658 24912 -56175
10161e6175j67025j90497J12889J04303J41584K3101k01425j9051J66954K19083
$$ -56175 -223200 -413697 -300808 -196505 -54921 -31820 -233245 -252296 -85342 133741
10151A33741q0189Q4258K72533N3570J38820K41511j29100k3512K39415j52206
$$ 133741 53552 137810 410343 463913 602733 844244 715144 691632 931047 778841
10141G78841k15641k09K65423N1983j19769k62701k28683o3479J60229j3475j09871
$$ 778841 563200 562991 828414 880397 760628 497927 269244 205765 365994 352519 242648
10130B42648J05019K8728j64002m9118k99483r4710L07225L47660Q3007r7027
$$ 242648 347667 376395 212393 163275 -136208 -230918 76307 423967 506974 409947
10120D09947J02952j48958r3288Q4379k17598L7597J90302J13552r5404L6725
$$ 409947 512899 363941 270653 355032 137434 175031 365333 478885 383481 420206
10110D20206k660J23511J28267l39193j84487M4086j13358J03420J18026J80290
$$ 420206 417546 541057 669324 330131 145644 189730 76372 179792 297818 478108
10100D78108J48323N8427l13561m8673K17863k8212J25070J63q7002N5028K27887
$$ 478108 626431 684858 371297 322624 540487 512275 637345 637508 550506 605534 833421
10089H33421L03344N4705j25383j39976p0358L31316O6503Q8117m8395J5339K52957
$$ 833421 1136765 1191470 1066087 926111 855753 1187069 1253572 1341689 1293294 1308633 1561590
10078A561590L10338K51130J12585k04057L4690K19255M12772L72260Q94362J155067
$$ 1561590 1871928 2123058 2235643 2031586 2066276 2285531 2698303 3070563 3964925 5119992
10068E119992N67718J62063L54964M79990M70572M66494J187133J570334K301710
$$ 5119992 5687710 5849773 6204737 6684727 7155299 7621793 8808926 10379260 12680970
10059A2680970L181246M642905O581956J0628247J9329921L7117990P2117229
$$ 12680970 15862216 20505121 27087077 37715324 57045245 94163235 166280464
10052A66280464J09893113P4657265k0729648m9255936m4678704m6231520m8852658
$$ 166280464 276173577 350830842 330101194 280845258 236166554 189935034 141082376
10045A41082376l9264236k7526887j8638507j2823059q668651n932958m268138
$$ 141082376 101818140 74291253 55652746 42829687 34161036 28228078 23959940
10038B3959940l106819k493020j708498j346407q71771o18252n93338r48188j154492
$$ 23959940 20853121 18360101 16651603 15305196 14433425 13815173 13221835 12273647 11119155
10029A1119155p98471m40559k89280m94100o35793n79919l89416m01215j11827
$$ 11119155 10320684 9880125 9590845 9096745 8460952 7881033 7491617 7090402 6978575
10020F978575m80068m96528k84515k24870n7414k20546l6847j40336m04806k55205
$$ 6978575 6498507 6001979 5717464 5492594 5435180 5214634 5177787 5037451 4632645 4377440
10010D377440q3887N4736o9033J66587J43213k71950j71379j33916l16044k67839
$$ 4377440 4293553 4348289 4279256 4445843 4589056 4317106 4145727 4011811 3695767 3427928
10000C427928j1208K892k03837N3328M3092k5756n9745l73460l56025j15925J15822
$$ 3427928 3416720 3419612 3215775 3269103 3312195 3286439 3226694 2853234 2497209 2381284 2497106
9989B497106J74281j22807j42945l0021j1366O5518N4225k44625p1579N4903j45305
$$ 2497106 2671387 2548580 2405635 2375614 2364248 2429766 2483991 2239366 2167787 2222690 2077385
9978B077385k17537J49898j03204j15735j56709k8553k09177q9878K23770K03979
$$ 2077385 1859848 2009746 1906542 1790807 1634098 1605545 1396368 1306490 1530260 1734239
9968A734239K00106l06919l6597k3021o4708l17332j93092K30494K66525k87056
$$ 1734239 1934345 1627426 1590829 1567808 1503100 1185768 992676 1223170 1489695 1202639
9958A202639m4531J09364o3365J96598J45381j746m5804Q5730j64644J70871K63026
$$ 1202639 1158108 1267472 1204107 1400705 1546086 1544340 1498536 1584266 1419622 1590493 1853519
9947A853519J04261k26932j79065O4369J18158M49269K06013l31959q311k33316
$$ 1853519 1957780 1730848 1551783 1616152 1734310 2183579 2389592 2057633 2049322 1816006
9937A816006J84710k82956k92106K1248J57551j74063j92699K45132J95282m4211
$$ 1816006 2000716 1717760 1425654 1446902 1604453 1430390 1237691 1482823 1678105 1633894
9927A633894k15016o4228k59286n3198p24p5695J43107m6503k34508m4149j79819
$$ 1633894 1418878 1354650 1095364 1042166 1041442 965747 1108854 1062351 827843 783694 603875
9916F03875m974K60490j8801k03519J8685P7226j28138K87737J41125l09749j97352
$$ 603875 598901 859391 840590 637071 655756 732982 604844 892581 1033706 723957 526605
9905E26605l461P4367J79023p4366n7911j32838L2930J48810J1232P3382K46581
$$ 526605 523144 597511 776534 702168 644257 511419 544349 693159 704391 777773 1024354
9894A024354k3380l1769J4023K1614l15479J4716L27883O3749j49642r2420J90103
$$ 1024354 1000974 969205 983228 1004842 689363 704079 1031962 1095711 946069 853649 1043752
9883A043752J22223j20368j06124k62890P4146K84283m3065k2629l1187k80270
$$ 1043752 1165975 1045607 939483 676593 750739 1035022 991957 969328 938141 657871
9873F57871J20126L69816J57149j0384J31233j52389j82058K7410J16067L70888
$$ 657871 777997 1147813 1304962 1294578 1425811 1273422 1091364 1118774 1234841 1605729
9863A605729L3019l3850o0937K60284L82297J28453N1832m9921J75748P8985j49287
$$ 1605729 1638748 1604898 1543961 1804245 2186542 2314995 2366827 2316906 2492654 2571639 2422352
9852B422352l60766j19041J71283j20001k12092j64920r543j99528k9243J10605
$$ 2422352 2061586 1942545 2113828 1993827 1781735 1616815 1607272 1407744 1378501 1489106
9842A489106j49443k03367J8963m6357k20846N3068L0354j38509J51227J37604
$$ 1489106 1339663 1136296 1155259 1108902 888056 941124 971478 832969 984196 1121800
9832A121800J87314j60946L7865j47364P9679j03901l36351p8919J72464O1897
$$ 1121800 1309114 1148168 1186033 1038669 1118348 1014447 678096 599177 771641 833538
9822H33538J53450J83962j69036j13321P4777k38882k49885J28386K79973K4609
$$ 833538 986988 1170950 1001914 888593 963370 724488 474603 602989 882962 907571
9812I07571L23646K44835j12382j44370j82432J03275o583J62158j08941m5383
$$ 907571 1231217 1476052 1363670 1219300 1036868 1140143 1133560 1295718 1186777 1141394
9802A141394J47308K41313J6981M9862K8751q8943m2114j79144J09707J8004k77964
$$ 1141394 1288702 1530015 1546996 1596858 1625609 1536666 1494552 1315408 1425115 1443119 1165155
9791A165155J49666R9097J38548K1503M0645J38424p6127j15256J09982q731n194
$$ 1165155 1314821 1413918 1552466 1573969 1614614 1753038 1676911 1561655 1671637 1662906 1657712
9780A657712m33988j88169P2713J76962K58673j49939k80979L13340K44999j72208
$$ 1657712 1223724 1035555 1108268 1285230 1543903 1393964 1112985 1426325 1671324 1499116
9770A499116J03576r3826l26437L7685K60417m5705j06843R6879J58974j70629
$$ 1499116 1602692 1508866 1182429 1220114 1480531 1434826 1327983 1424862 1583836 1413207
9760A413207K29885j19013o10454J0309L98573L36718J45629n3904J7181o7886
$$ 1413207 1643092 1524079 913625 923934 1322507 1659225 1804854 1750950 1768131 1700245
9750A700245p5550J33726K29390m3913J43212l5392k61182k06360j10728J35026
$$ 1700245 1624695 1758421 1987811 1943898 2087110 2051718 1790536 1584176 1473448 1608474
9740A608474J8719m20020R5640L14829L87684j0225L5825m9010L8735k56913J35092
$$ 1608474 1627193 1207173 1302813 1617642 2005326 1995101 2030926 1981916 2020651 1763738 1898830
9729A898830Q9535J62177r590p1491k07850O6257K71456K97833K36341K8251K1047
$$ 1898830 1988365 2150542 2140952 2069461 1861611 1927868 2199324 2497157 2733498 2761749 2782796
9718B782796j5255L4349j5290q8749k41394L3778K06883j04927j93990m9746L97112
$$ 2782796 2767541 2801890 2786600 2697851 2456457 2490235 2697118 2592191 2398201 2348455 2745567
9707B745567J24875m43978k35625J83243K01633J15368J07115J3011r5846o2770
$$ 2745567 2870442 2426464 2190839 2374082 2575715 2691083 2798198 2811209 2715363 2652593
9697B652593l6655J12407K39877P7928O938R0290L8035L85033J64468P8818k46179
$$ 2652593 2615938 2728345 2968222 3046150 3053088 3143378 3181413 3566446 3730914 3809732 3563553
9686C563553n7450j69888q5867n000P7552K02061m9974J18298o4577j48166m578
$$ 3563553 3506103 3336215 3250348 3245348 3322900 3524961 3474987 3593285 3528708 3380542 3375964
9675C375964L55608K19539k73309j12211P6498K93251j14112K11890K64762J56856
$$ 3375964 3731572 3951111 3677802 3565591 3642089 3935340 3821228 4033118 4297880 4454736
9665D454736r8257o906J86777J22607K78046o0003q0499K36041K08690J07342
$$ 4454736 4356479 4349573 4536350 4658957 4937003 4877000 4796501 5032542 5241232 5348574
9655E348574r186k52971l9102J72202J79726Q9809K89973L8966K20111N00340
$$ 5348574 5339388 5086417 5047315 5219517 5399243 5489052 5779025 5817991 6038102 6538442
9645F538442J76789K06966k23609n23607l59793J06079J70582J61948L25705m7908
$$ 6538442 6715231 6922197 6698588 6174981 5815188 5921267 6091849 6253797 6579502 6531594
9635F531594j35873j2118J6044j22211j62441J54000J56068J85983K8878J63636
$$ 6531594 6395721 6383603 6399647 6277436 6114995 6268995 6425063 6611046 6639924 6803560
9625F803560N3301K66745P4691l14072r5118K61109K21990M55887K1595l2980
$$ 6803560 6856861 7123606 7198297 6884225 6789107 7050216 7272206 7728093 7749688 7716708
9615G716708J8912J15618J87641K33619K83871K61025k7829l01286m7697k74122
$$ 7716708 7735620 7851238 8038879 8272498 8556369 8817394 8789565 8488279 8440582 8166460
9605H166460J47678K82578R8992j112k5641M04553L84006L5770N3778K08990N0750
$$ 8166460 8314138 8596716 8695708 8694596 8668955 9073508 9457514 9493284 9547062 9756052 9806802
9594I806802N802n6813L49670M05067L13588m0825j17419J25855o4662J44637
$$ 9806802 9812604 9755791 10105461 10510528 10824116 10783291 10665872 10791727 10727065 10871702
9584A0871702L82426O3023M36732J80196K6046K12282R2721j2461j05960R2353
$$ 10871702 11254128 11317151 11753883 11934079 11960125 12172407 12265128 12252667 12146707 12239060
9574A2239060j35665j79019P6484L00156K15365L66905J93382r9903K20335J25232
$$ 12239060 12103395 11924376 12000860 12301016 12516381 12883286 13076668 12976765 13197100 13322332
9564A3322332N33753M35461J59015p4430o734L8582L66467O4238K21479R9851
$$ 13322332 13856085 14291546 14450561 14376131 14369397 14407979 14774446 14838684 15060163 15160014
9554A5160014J29924J54687j75614j20480J27756L25606J55249K88420r9585J65452
$$ 15160014 15289938 15444625 15269011 15148531 15276287 15601893 15757142 16045562 15945977 16111429
9544A6111429J21676J83852J13995m4608k8138L1351J11255j74364N6417K82933
$$ 16111429 16233105 16416957 16530952 16486344 16458206 16489557 16600812 16426448 16482865 16765798
9534A6765798K67330Q5861J83553L21407R3812K95985J71386k80064j57477K64437
$$ 16765798 17033128 17118989 17302542 17623949 17717761 18013746 18185132 17905068 17747591 18012028
9524A8012028J33225K04149J10739K78057J59175J9792m1308j74574l0963Q4308
$$ 18012028 18145253 18349402 18460141 18738198 18897373 18917165 18875857 18701283 18670320 18754628
9514A8754628M20962K05979k89813n6299j1285J91059N16553k6385l13721p5080
$$ 18754628 19175590 19381569 19091756 19035457 19024172 19215231 19731784 19705399 19391678 19316598
9504A9316598K22981o769J64497K68504K5124j78914J24126J65902J43085j82301
$$ 19316598 19539579 19532810 19697307 19965811 19990935 19812021 19936147 20102049 20245134 20062833
9494B0062833j42518j23117O8576K42990Q8995k7069m5554j77071r5628j20364
$$ 20062833 19920315 19797198 19865774 20108764 20197759 20170690 20125136 19948065 19852437 19732073
9484A9732073O3439J12594m4090j3897k09010p9402n8594j9341J4143j29785k21682
$$ 19732073 19795512 19908106 19864016 19850119 19641109 19561707 19503113 19483772 19497915 19368130 19146448
9473A9146448L4516J1692j67915j46923K27034R3510Q9247K17782j52792l09695
$$ 19146448 19180964 19192656 19024741 18877818 19104852 19198362 19287609 19505391 19352599 19042904
9463A9042904l4312j09194P7400L40304j58595j83850j42969j02608j35672k9266
$$ 19042904 19008592 18899398 18976798 19317102 19158507 18974657 18831688 18729080 18593408 18564142
9453A8564142r7728l62183k28523M3385J01090L6190k06261p8380K54630K49612
$$ 18564142 18466414 18104231 17875708 17919093 18020183 18056373 17850112 17771732 18026362 18275974
9443A8275974Q4072k10767o8962q9678l21793k04633j94073J28084J02550n3981
$$ 18275974 18360046 18149279 18080317 17990639 17668846 17464213 17270140 17398224 17500774 17446793
9433A7446793r6469J3024J58150r0275m28524j25560N486q6965J83359R5996j82644
$$ 17446793 17350324 17363348 17521498 17431223 17002699 16877139 16882625 16795660 16979019 17075015 16892371
9422A6892371J42560m4435l03524j14729j45031K0461o6611l33847j51132K91333
$$ 16892371 17034931 16990496 16686972 16572243 16427212 16447673 16381062 16047215 15896083 16187416
9412A6187416J53894P273J1189j30980O3123Q5619j07384k60369J13877j03220
$$ 16187416 16341310 16348583 16359772 16228792 16291915 16377534 16270150 16009781 16123658 16020438
9402A6020438l35912j90931j34020k43245p9428K00974J67870k25894p9731n1673
$$ 16020438 15684526 15493595 15359575 15116330 15036902 15237876 15405746 15179852 15100121 15048448
9392A5048448j80455J5835K01326k7224p3986l13280j98522q9360j86049L0729
$$ 15048448 14867993 14883828 15085154 15057930 14983944 14670664 14472142 14382782 14196733 14227462
9382A4227462J74028J62690Q00K33949K63115k86409k63933l06785m44975k993
$$ 14227462 14401490 14564180 14564980 14798929 15062044 14775635 14511702 14204917 13759942 13756949
9372A3756949k3680K5425O8236L88123K23162K0644l55682o798J59258j48664
$$ 13756949 13733269 13758694 13826930 14215053 14438215 14458859 14103177 14096379 14255637 14106973
9362A4106973k06137j35135J07226R6261l035j85959l6512k23442k8662K46869
$$ 14106973 13900836 13765701 13872927 13969188 13966153 13780194 13743682 13520240 13491578 13738447
9352A3738447N0526j80982j31195J02987q269k58919M3938L55876J20697k55521
$$ 13738447 13788973 13607991 13476796 13579783 13571514 13312595 13356533 13712409 13833106 13577585
9342A3577585k63063j07255J38763k48280l84602P3581M6984J16471k05381j74420
$$ 13577585 13314522 13207267 13346030 13097750 12713148 12786729 12833713 12950184 12744803 12570383
9332A2570383m3758J03885K61718M4857k36393l5656k6128L06767P194M5976J01902
$$ 12570383 12526625 12630510 12892228 12937085 12700692 12665036 12638908 12945675 12952869 12998845 13100747
9321A3100747k09664l95511J39288J70871O1273j56727J72207P2745j47035J07485
$$ 13100747 12891083 12495572 12634860 12805731 12867004 12710277 12882484 12955229 12808194 12915679
9311A2915679l10199j87780O1516J18831J20507Q0289k28243k46920j98268J02128
$$ 12915679 12605480 12417700 12479216 12598047 12718554 12798843 12570600 12323680 12125412 12227540
9301A2227540q2555n3100M18292Q8118j78735l3901J48165K3522j49278J4187
$$ 12227540 12144985 12091885 12510177 12598295 12419560 12385659 12533824 12557346 12408068 12422255
9291A2422255m01081k20851M8080M8842J04083N3101k4160J16726j88998P2086
$$ 12422255 12021174 11800323 11848403 11897245 12001328 12054429 12030269 12146995 11957997 12030083
9281A2030083J22976k07226j47412J39925j24856j54001j27407O5K39950q9955
$$ 12030083 12153059 11945833 11798421 11938346 11813490 11659489 11532082 11532147 11772097 11682142
9271A1682142J3558k5271O4006J78442r0801j58920j09669J0249l1643k1148j40463
$$ 11682142 11695700 11670429 11734435 11912877 11822076 11663156 11553487 11563736 11532093 11510945 11370482
9260A1370482k76447J74894J16420L7648o7553j66898n47j32357J64631M11606
$$ 11370482 11094035 11268929 11385349 11422997 11355444 11188546 11187999 11055642 11220273 11631879
9250A1631879K7344j39781j71645j49248R0946K25317K1799r5579M7181j32856
$$ 11631879 11659223 11519442 11347797 11198549 11289495 11514812 11536611 11441032 11488213 11355357
9240A1355357j81153k6853Q5729J14162k21516j31031j75553Q3950O0784k80747
$$ 11355357 11174204 11147351 11233080 11347242 11125726 10994695 10819142 10903092 10963876 10683129
9230A0683129k09440k17096M017P7059K33539K65788q1169m53898j19450Q8892
$$ 10683129 10473689 10256593 10260610 10337669 10571208 10836996 10755827 10301929 10182479 10271371
9220A0271371j10438j06344L9470j51274k15394J93683L18997k1300q331K78706
$$ 10271371 10160933 10054589 10094059 9942785 9727391 9921074 10240071 10218771 10210440 10489146
9210A0489146k31814m93952O5414Q1823j25785n7079J23674j43758K1764J2531
$$ 10489146 10257332 9763380 9828794 9910617 9784832 9727753 9851427 9707669 9729433 9741964
9200I741964l1940j02697l40401n4872J18282K4622l4820j34124J6422M6012o2147
$$ 9741964 9710024 9607327 9266926 9212054 9330336 9354958 9320138 9186014 9202436 9248448 9186301
9189I186301j29491k56943j62412j18993N3782k29266J2491R9292O5350o4278
$$ 9186301 9056810 8799867 8637455 8518462 8572244 8342978 8355469 8454761 8520111 8455833
9179H455833o5228j44101k26462l8992j16367J02043n9033J37304K40750j73837
$$ 8455833 8390605 8246504 8020042 7981050 7864683 7966726 7907693 8044997 8285747 8111910
9169H111910n4902l14316l83927J25129M9322m8573j36727R0820j85833M2261
$$ 8111910 8057008 7742692 7358765 7483894 7533216 7484643 7347916 7438736 7252903 7295164
9159G295164J7354n2473N2158k37404k99119k21177j32252J17103K16851L7953
$$ 7295164 7312518 7260045 7312203 7074799 6775680 6554503 6422251 6539354 6756205 6794158
9149F794158j64964k25078k93702j54106j78860J29762L3592J50948o667j22204
$$ 6794158 6629194 6404116 6110414 5956308 5777448 5907210 5940802 6091750 6085083 5962879
9139E962879q0233n9772l6752Q7751K00064J26231j14595l4206m739l4068M9284
$$ 5962879 5882646 5822874 5786122 5873873 6073937 6200168 6085573 6051367 6046628 6012560 6061844
9128F061844k50397Q5930J07653J54404j90416l92921J12956O5958m14459j97620
$$ 6061844 5811447 5897377 6005030 6159434 5969018 5576097 5689053 5755011 5340552 5142932
9118E142932L43192J02175k82092j48405j17033K2732j91373R7288p657m8039
$$ 5142932 5486124 5588299 5306207 5157802 5040769 5063501 4872128 4969416 4961759 4913720
9108D913720j54051k08938O2304p2716q1850L8565M5731L17065j9484k61972j87691
$$ 4913720 4759669 4550731 4613035 4540319 4458469 4497034 4542765 4859830 4840346 4578374 4390683
9097D390683k6070R2864m807P0441q4164n7064M398n2185j72377J5374q6835K14885
$$ 4390683 4364613 4457477 4452670 4523111 4438947 4381883 4386281 4334096 4161719 4177093 4090258 4305143
9085D305143K94933L9317k69400q7269k22436k09207Q8532N3731n6810J30403
$$ 4305143 4600076 4639393 4369993 4282724 4060288 3851081 3939613 3993344 3936534 4066937
9075D066937J93099k13877N0028J00737M1100J067q3217j81759J91769p318j44876
$$ 4066937 4260036 4046159 4096187 4196924 4238024 4239091 4155874 3974115 4165884 4158566 4013690
9064D013690j51102k05508K40955K97995K6371j79855k50553j87586q4002j5519
$$ 4013690 3862588 3657080 3898035 4196030 4222401 4042546 3791993 3604407 3520405 3504886
9054C504886j67714k59737M84488L44424o9117k09398j6295J10325n0493k1838
$$ 3504886 3337172 3077435 3561923 3906347 3837230 3627832 3611537 3721862 3671369 3649531
$$ [...]
##END NTUPLES=NMR SPECTRUM
##END=
