##TITLE=Analysis number 322742
Compound Code km 00977
Project Code adrs
Chemist Name prosynth
##JCAMPDX= 6.0         $$ Bruker NMR JCAMP-DX V2.0
##DATA TYPE= NMR SPECTRUM
##DATA CLASS= NTUPLES
##ORIGIN= Bruker BioSpin GmbH
##OWNER= nmr
$$ XWIN-NMR		Version 3.5
$$ Mon Oct 16 08:16:07 2006 GMT Daylight Time (UT+1h)  MAYBRIDGE\nmr@NMR_250MHZ
##.OBSERVE FREQUENCY= 250.131544655141
##.OBSERVE NUCLEUS= ^1H
##.ACQUISITION MODE= SIMULTANEOUS (DQD)
##.ACQUISITION SCHEME= undefined
##.AVERAGES= 16
##.DIGITISER RES= 18
##SPECTROMETER/DATA SYSTEM= dpx250
##.PULSE SEQUENCE= zg30
##.SOLVENT NAME= CDCl3
##.SHIFT REFERENCE= (INTERNAL, CDCl3, 0, 16.522)
##AUDIT TRAIL= $$ (NUMBER, WHEN, WHO, WHERE, WHAT)
$$ ##TITLE= Audit trail, XWIN-NMR		Version 3.5
$$ ##JCAMPDX= 5.01
$$ ##ORIGIN= Bruker BioSpin GmbH
$$ ##OWNER= nmr
$$ C:\u/data/dgb/nmr/ADRS/350/pdata/1/auditp.txt
$$ ##AUDIT TRAIL=  $$ (NUMBER, WHEN, WHO, WHERE, WHAT)
(   1,<2006-10-16 08:15:42.52 +100>,<MAYBRIDGE\nmr>,<NMR_250MHZ>,
      <created by zg, POWCHK disabled, PULCHK disabled
       configuration hash MD5:
       49 4B E0 1D 92 C2 6B 37 9F E6 65 BC 52 41 86 1D
       data hash MD5: 64K
       93 43 10 45 EF ED 15 24 AA 33 AA 00 4B 0A D1 6D>)
(   2,<2006-10-16 08:15:58.63 +100>,<MAYBRIDGE\nmr>,<NMR_250MHZ>,
      <Start of raw data processing
       ef LB = 0.3 FT_mod = 6 PKNL = 1 SI = 32K 
       data hash MD5: 32K
       F1 EB 8B A7 51 4B A9 71 86 DE AD 16 5C 8B 10 53>)
(   3,<2006-10-16 08:16:00.31 +100>,<MAYBRIDGE\nmr>,<NMR_250MHZ>,
      <apk 
       data hash MD5: 32K
       64 2C 80 CE 1C 20 09 54 F0 28 41 94 BF 0A 9F 9E>)
(   4,<2006-10-16 08:16:01.03 +100>,<MAYBRIDGE\nmr>,<NMR_250MHZ>,
      <abs ABSG = 5 
       data hash MD5: 32K
       DF D2 92 45 95 80 89 3C 1D EF 9D F6 A9 17 80 E6>)
$$ ##END=
$$ 
$$ hash MD5
$$ 1F 64 22 3A 9B F1 90 C3 86 2C 97 66 5C E1 6C DC
##$RELAX= 
##$RELAX= 
##$RELAX= 
##$RELAX= 
##$RELAX= 
##$RELAX= 
##$RELAX= 
$$ Bruker specific parameters
$$ --------------------------
##$DU= <C:\u>
##$EXPNO= 350
##$NAME= <ADRS>
##$PROCNO= 1
##$TYPE= <nmr>
##$USER= <dgb>
##$AMP= (0..31)
100 100 100 100 100 100 100 100 100 100 100 100 100 100 100 100 100 100 
100 100 100 100 100 100 100 100 100 100 100 100 100 100 
##$AQSEQ= 0
##$AQ_mod= 3
##$AUNM= <au_zg>
##$AUTOPOS= <12 >
##$BF1= 250.13
##$BF2= 250.13
##$BF3= 250.13
##$BF4= 250.13
##$BF5= 500.13
##$BF6= 500.13
##$BF7= 500.13
##$BF8= 500.13
##$BYTORDA= 1
##$CFDGTYP= 0
##$CFRGTYP= 5
##$CHEMSTR= <none>
##$CNST= (0..31)
1 1 145 1 1 1 1 1 1 1 1 1 1 1 1 1 1 1 1 1 1 1 1 1 1 1 1 1 1 1 1 1 
##$CPDPRG= <>
##$CPDPRG1= <>
##$CPDPRG2= <>
##$CPDPRG3= <>
##$CPDPRG4= <mlev>
##$CPDPRG5= <mlev>
##$CPDPRG6= <mlev>
##$CPDPRG7= <mlev>
##$CPDPRG8= <mlev>
##$CPDPRGB= <>
##$CPDPRGT= <>
##$D= (0..31)
0 1 0 0 0 0 0 0 0 0.06 0 0 0 0 0 0 0.0002 0 0 0 0 0 0 0 0 0 0 0 0 0 0 
0 
##$DATE= 1160982941
##$DBL= (0..7)
120 120 120 120 120 120 120 120 
##$DBP= (0..7)
150 150 150 150 150 150 150 150 
##$DBP07= 0
##$DBPNAM0= <>
##$DBPNAM1= <>
##$DBPNAM2= <>
$$ [...]
##$SUBNAM7= <"">
##$SUBNAM8= <"">
##$SUBNAM9= <"">
##$SW= 20.6930455092707
##$SWIBOX= (0..15)
0 0 3 0 0 0 0 0 0 0 0 0 0 0 0 0 
##$SW_h= 5175.983436853
##$TD= 65536
##$TD0= 1
##$TE= 683.16
##$TE2= 300
##$TE3= 300
##$TEG= 300
##$TL= (0..7)
0 120 120 120 120 120 120 120 
##$TP= (0..7)
150 150 150 150 150 150 150 150 
##$TP07= 0
##$TPNAME0= <>
##$TPNAME1= <>
##$TPNAME2= <>
##$TPNAME3= <>
##$TPNAME4= <>
##$TPNAME5= <>
##$TPNAME6= <>
##$TPNAME7= <>
##$TPOAL= (0..7)
0.5 0.5 0.5 0.5 0.5 0.5 0.5 0.5 
##$TPOFFS= (0..7)
0 0 0 0 0 0 0 0 
##$TUNHIN= 0
##$TUNHOUT= 0
##$TUNXOUT= 0
##$USERA1= <user>
##$USERA2= <user>
##$USERA3= <user>
##$USERA4= <user>
##$USERA5= <user>
##$V9= 5
##$VALIST= <valist>
##$VCLIST= <CCCCCCCCCCCCCCC>
##$VD= 0
##$VDLIST= <DDDDDDDDDDDDDDD>
##$VPLIST= <PPPPPPPPPPPPPPP>
##$VTLIST= <TTTTTTTTTTTTTTT>
##$WBST= 1024
##$WBSW= 4
##$XGAIN= (0..3)
0 0 0 0 
##$XL= 0
##$YL= 0
##$YMAX_a= 458452
##$YMIN_a= -368218
##$ZGOPTNS= <>
##$ZL1= 120
##$ZL2= 120
##$ZL3= 120
##$ZL4= 120
##$ABSF1= 16.522
##$ABSF2= -4.171173
##$ABSG= 5
##$ABSL= 3
##$ALPHA= 0
##$AQORDER= 0
##$ASSFAC= 0
##$ASSFACI= 0
##$ASSFACX= 0
##$ASSWID= 0
##$AUNMP= <proc_1d>
##$AZFE= 0.1
##$AZFW= 0.1
##$BCFW= 0
##$BC_mod= 0
##$BYTORDP= 0
##$COROFFS= 0
##$CY= 12.5
##$DATMOD= 1
##$DC= 0
##$DFILT= <>
##$DTYPP= 0
##$F1P= 14.0000005364418
##$F2P= -0.99999901652339
##$FCOR= 0.5
##$FTSIZE= 32768
##$FT_mod= 6
##$GAMMA= 0
##$GB= 0
##$INTBC= 1
##$INTSCL= 1
##$ISEN= 128
##$LB= 0.3
##$LEV0= 0
##$LPBIN= 0
##$MAXI= 10000
##$MC2= 0
##$MEAN= 0
##$ME_mod= 0
##$MI= 0
##$NCOEF= 0
##$NC_proc= -3
##$NLEV= 6
##$NOISF1= 0
##$NOISF2= 0
##$NSP= 0
##$NTH_PI= 0
##$NZP= 0
##$OFFSET= 16.522
##$PC= 1
##$PHC0= -47.59821
##$PHC1= 2.974256
##$PH_mod= 1
##$PKNL= yes
##$PPARMOD= 0
##$PSCAL= 4
##$PSIGN= 0
##$REVERSE= no
##$SF= 250.13
##$SI= 32768
##$SIGF1= 0
##$SIGF2= 0
##$SINO= 400
##$SIOLD= 32768
##$SREGLST= <1H.CDCl3>
##$SSB= 0
##$STSI= 32768
##$STSR= 0
##$SW_p= 5175.98343685301
##$SYMM= 0
##$S_DEV= 0
##$TDeff= 65536
##$TDoff= 0
##$TI= <Analysis number 999999
Compound Code 99
Book Reference 9
Project Code 9>
##$TILT= no
##$TM1= 0
##$TM2= 0
##$TOPLEV= 0
##$USERP1= <user>
##$USERP2= <user>
##$USERP3= <user>
##$USERP4= <user>
##$USERP5= <user>
##$WDW= 1
##$XDIM= 32768
##$YMAX_p= 429621674
##$YMIN_p= -263285
$$ End of Bruker specific parameters
$$ ---------------------------------
##NTUPLES= NMR SPECTRUM
##VAR_NAME=  FREQUENCY,     SPECTRUM/REAL,   SPECTRUM/IMAG
##SYMBOL=    X,             R,               I
##VAR_TYPE=  INDEPENDENT,   DEPENDENT,       DEPENDENT
##VAR_FORM=  AFFN,          ASDF,            ASDF
##VAR_DIM=   32768,         32768,           32768
##UNITS=     HZ,            ARBITRARY UNITS, ARBITRARY UNITS
##FACTOR=    0.157963299565203, 1,           1
##FIRST=     4132.6476996994, 0,             0
##LAST=      -1043.33573715361, 0,           0
##MIN=       -1043.33573715361, -263285,     0
##MAX=       4132.6476996994, 429621674,     0
$$ Real data points
##PAGE= N=1
##DATA TABLE= (X++(R..R)), XYDATA
$$ [...]
25032B864051P6712J6475K9922N4177Q5846J44029J53071J15456J43442M9205
$$ 2864051 2940763 2957238 2987160 3041337 3127183 3271212 3424283 3539739 3683181 3732386
25022C732386O3926Q1267J92797K09199J74852J21166J95137J97434J43222K04164
$$ 3732386 3796312 3877579 4070376 4279575 4454427 4575593 4770730 4968164 5111386 5315550
25012E315550K85300K74703J88074J00283K54177K49693K53506L29568L04337
$$ 5315550 5600850 5875553 6063627 6163910 6418087 6667780 6921286 7250854 7555191
25003G555191L31569M04290L81026L41324L65356M87426M47020M89276N31814
$$ 7555191 7886760 8291050 8672076 9013400 9378756 9866182 10313202 10802478 11334292
24994A1334292N64782O87141P09152P67242P56277Q17705Q59568Q97804Q98046
$$ 11334292 11899074 12586215 13295367 14062609 14818886 15636591 16496159 17393963 18292009
24985A8292009R83584J123994J212877J346212J378543J420038J556833J598700
$$ 18292009 19275593 20399587 21612464 22958676 24337219 25757257 27314090 28912790
24977B8912790J642625J784504J802743J777867J814878J800266J748469J695317
$$ 28912790 30555415 32339919 34142662 35920529 37735407 39535673 41284142 42979459
24969D2979459J581944J514874J262068J063537P76858M84670J69772j17162l84923
$$ 42979459 44561403 46076277 47338345 48401882 49178740 49663410 49833182 49716020 49331097
24960D9331097o73480r33083j202790j324974j408774j606159j670827j609480
$$ 49331097 48657617 47724534 46521744 45196770 43787996 42181837 40511010 38901530
24952C8901530j730469j792651j709428j624191j550149j476436j507168j449071
$$ 38901530 37171061 35378410 33668982 32044791 30494642 29018206 27511038 26061967
24944B6061967j340963j229538j137769j067208j070722j019090r46373r10277
$$ 26061967 24721004 23491466 22353697 21286489 20215767 19196677 18250304 17340027
24936A7340027p34393n81041o85708p00230p52426o86734n71225m65902m86726
$$ 17340027 16605634 16024593 15338885 14638655 13886229 13199495 12628270 12162368 11675642
24927A1675642m38544l66396m73645m23517l56183l76247l71979l87599k92472
$$ 11675642 11237098 10870702 10397057 9973540 9617357 9241110 8869131 8481532 8189060
24918H189060k18453k52533l44991k89537j64568k22635j99769j65316j93900
$$ 8189060 7970607 7718074 7373083 7083546 6918978 6696343 6496574 6331258 6137358
24909F137358k57923j54597j53184k22259j13942p9139r6607k41407j73645j33322
$$ 6137358 5879435 5724838 5571654 5349395 5235453 5156314 5059707 4818300 4644655 4511333
24899D511333r3522j56026j28233j25220p3239K260q8176j19303j85357j58372
$$ 4511333 4417811 4261785 4133552 4008332 3935093 3937353 3849177 3729874 3544517 3386145
24889C386145m5957l4254m9763j322r9623o3277q5088q3256j27213j23382r010
$$ 3386145 3340188 3305934 3256171 3254849 3155226 3091949 3006861 2923605 2796392 2673010 2664000
24878B664000L0788q4679j20331o9182j1032k7409j1053k0541j09363j75483r5631
$$ 2664000 2694788 2610109 2489778 2420596 2409564 2382155 2371102 2350561 2241198 2065715 1970084
24867A970084n7281q0101J1362O9358M0285K2902l4665o5145n4912k3450k7113
$$ 1970084 1912803 1832702 1844064 1913422 1953707 1976609 1941944 1876799 1821887 1798437 1771324
24856A771324j23112l5612O2403k9933p4858p8777j4753L1869K0301k2254o5531
$$ 1771324 1648212 1612600 1675003 1645070 1570212 1491435 1476682 1508551 1528852 1506598 1441067
24845A441067k3442k9810q3364j2328k326K2762l7113l6145k1965j8928q998j8760
$$ 1441067 1417625 1387815 1304451 1292123 1289797 1312559 1275446 1239301 1217336 1198408 1189410 1170650
24833A170650K9006N1564n5286o9090o8588l7715l9809L8917l5702j15587m4848
$$ 1170650 1199656 1251220 1195934 1126844 1058256 1020541 980732 1019649 983947 868360 823512
24822H23512L4852L1453r572J3932O357k7350K5065P3581n165r4767l9898j9666
$$ 823512 858364 889817 880245 894177 900534 873184 898249 971830 966665 871898 832000 812334
24810H12334k5639j8715M3843q4989q5963J7481L4869P0239O513m3421k3242m2565
$$ 812334 786695 767980 811823 726834 640871 658352 693221 763460 769973 726552 703310 660745
24798F60745n4578k1077J13817o1033j9280k4302Q1621Q3199o6039n3619j8430
$$ 660745 606167 585090 698907 637874 618594 594292 675913 759112 693073 639454 621024
24787F21024n116l5122M7189j0438j1397k2596j5142K8776K0138n480j9904L6997
$$ 621024 615908 580786 627975 617537 606140 583544 568402 597178 617316 611836 591932 628929
24775F28929l0654n2628N6468k6826n4843k1462J430j2055k7330J0114j5005k5287
$$ 628929 598275 545647 602115 575289 520446 498984 500414 488359 461029 471143 456138 430851
24763D30851K8048L5572n3293q0409m6564K8652O5583K0766q1604Q33J9293J8592
$$ 430851 458899 494471 441178 360769 314205 342857 408440 429206 347602 348435 367728 386320
24751C86320J9124L0618m2523p2786q334n1396K5544N2821P069j1073J6523L8425
$$ 386320 405444 436062 393539 320753 312419 261023 286567 339388 346457 335384 351907 390332
24739C90332R1604j3662k4265n8312j31j7345j03248l5606j7529j7353J7242J9475
$$ 390332 481936 468274 444009 385697 385566 368221 264973 229367 211838 194485 211727 231202
24727B31202N6364M4247k9112J4680j1331n021M9269J8108r417q9326n1698J1446
$$ 231202 287566 331813 302701 317381 306050 301029 350298 368406 358989 269663 217965 229411
24715B29411K4548J4989k7933q4370O3472Q6191N710j9043l4309P522J5165m4661
$$ 229411 253959 268948 241015 156645 220117 306308 312018 292975 258666 266188 281353 236692
24703B36692l3041p8720l077L8058p227L9021J11881k7525j8084K0426J6253j1749
$$ 236692 203651 124931 121854 159912 152685 191706 303587 276062 257978 278404 294657 282908
24691B82908k3953J5999j8293j9102J8736K9696N7409J6675J7135J6376N6151
$$ 282908 258955 274954 256661 237559 256295 285991 343400 360075 377210 393586 449737
24680D49737N0983R735o6536m8304l9039Q272n2364n3465n0468p5N7844l8951
$$ 449737 500720 510455 443919 395615 356576 364848 312484 259019 208551 208476 266320 227369
24668B27369n7718k5742R730K3406q103n983p986k1023L9943N1848k9077l0959
$$ 227369 169651 143909 153639 177045 168942 162959 154973 133950 173893 225741 196664 165705
24656A65705q6289j0081M472J0980L4481R006K3462L2151j6855K8591K2876M445
$$ 165705 79416 69335 73807 84787 119268 128274 151736 183887 167032 195623 218499 222944
24644B22944l4010k483J3524N1151o794l4260o4133p0112j6278O4838m083J6509
$$ 222944 188934 186451 199975 251126 244332 210072 145939 75827 59549 124387 120304 136813
24632A36813l4067j9015o8542m1296p1364Q6882O1508J2593K7092M9347N388j6631
$$ 136813 102746 83731 15189 -26107 -97471 -10589 50919 63512 90604 139951 145339 128708
24620A28708m2834l3064k8240k636K43N7026M474j3241L3859L8425M3571N0654
$$ 128708 85874 52810 24570 21934 22177 79203 83677 70436 104295 142720 186291 236945
24608B36945n7226r6542j7815K879N7955K2165m1711l3845k5112O2072L1151j7934
$$ 236945 179719 83177 65362 68241 126196 148361 106650 72805 47693 109765 140916 122982
24596A22982K3807J4418p938k7442J8400j1962J5369k9743q636J2559L6864K1110
$$ 122982 146789 161207 153269 125827 144227 132265 147634 117891 109255 121814 158678 179788
24584A79788k0876K6521o4011l5744k8086q566j0980m441J1555J5739L4105m2482
$$ 179788 158912 185433 121422 85678 57592 49026 38046 33605 45160 60899 95004 52522
24572E2522O1980N124K0594L4278J8211k3637m3083O519p1776k7926j4310m231
$$ 52522 114502 119626 140220 174498 192709 169072 125989 132508 60732 32806 18496 14265
24560A4265M4168j9441q062O9599Q272o8394j0005M3588J0940M6043J0144k3862
$$ 14265 58433 38992 30930 100529 108801 40407 30402 73990 84930 130973 141117 117255
24548A17255K2868l8772m5708o3659M5498K2763J7630k0915n6659K0791k7784
$$ 117255 140123 101351 55643 -8016 37482 60245 77875 56960 301 21092 -6692
24537f692n6439K6414Q4072L5276O998k2496n3560p8792j234P1492K5726M619
$$ -6692 -63131 -36717 47355 82631 89629 67133 13573 -65219 -66453 5039 30765 35384
24525C5384m5635m1411J05722J81388l5290j13779r4258m4234M8732J9628o506
$$ 35384 -10251 -51662 54060 235448 200158 86379 -7879 -52113 -3381 16247 9741
24514I741O2380m3885o3548l3327j1472J4361P2538K6340l0600j3412n284j1750
$$ 9741 72121 28236 -35312 -68639 -80111 -65750 6788 33128 2528 -10884 -16168 -27918
24502b7918l9590k5704M6333N7996M6966L7431l4615m3566R182L0930j3921k7814
$$ -27918 -67508 -93212 -46879 11117 58083 95514 60899 17333 26515 57445 43524 15710
24490A5710K0479n2023O781J098k943K7522J861K3737r959p0376M436J6354M0063
$$ 15710 36189 -15834 -9053 -7955 -10898 16624 18485 42222 32263 -38113 -33677 -17323 22740
24477B2740M8776q1790q4162O219r313L0815J736l0176M7371R3381K6411m6682
$$ 22740 71516 -10274 -94436 -88217 -97530 -66715 -64979 -95155 -47784 45597 72008 25326
24465B5326o465L7764L313j8495j2040J9473K9044N3748N9717M2254j3943o3014
$$ 25326 18861 56625 59938 41443 29403 48876 77920 131668 191385 233639 219696 156682
24453A56682o8650l0894N0578K6390l9615l8362m1739n364P0997n374m2479J3089
$$ 156682 88032 57138 107716 134106 94491 56129 14390 9026 80023 74649 32170 45259
24441D5259J1590R471q446M7558K0243P471k7235j3250O9377N1291l4044r1390
$$ 45259 56849 66320 57874 105432 125675 133146 105911 92661 162038 213329 179285 87895
24429H7895n9915J7883k4835L6488q646q5938K6353J53124l402o2602j9712L9777
$$ 87895 27980 45863 21028 57516 48870 -37068 -10715 142409 139007 76405 56693 96470
24417I6470K151n6040p5129l3287J7025M3055K4726K9954k156j2366N0043J0912
$$ 96470 98621 42581 -32548 -65835 -48810 -5755 18971 48925 46769 34403 84446 95358
24405I5358o1749Q20j5374J500L7801J6031k1971k7595k1450r8992J9333M3013
$$ 95358 33609 34429 19055 20555 58356 74387 52416 24821 3371 -95621 -76288 -33275
24393c3275K2231j6101l2132l371N8073Q2804Q123l3303k5940J5919q973K431
$$ -33275 -11044 -27145 -59277 -62648 -4575 78229 86352 53049 27109 43028 34055 36486
24381C6486R0946L451m6797n1014L760k4374J8104M8265J9075K8708k7978o3840
$$ 36486 127432 130883 84086 33072 36832 12458 30562 78827 97902 126610 98632 34792
24369C4792o640k1195k6771K4114J9348R249m3344l6855O1025O1904m253p5274
$$ 34792 28152 6957 -19814 4300 23648 32897 -10447 -47302 13723 75627 71374 -3900
24357c900o4277l3865L7012K1846l0485K268K0980J7732j1613J5783M655k8389
$$ -3900 -68177 -102042 -65030 -43184 -73669 -71401 -50421 -32689 -44302 -28519 -23864 -52253
24345e2253l7609O2155K4631j5798j5671L4348J03566L3715r011p1796m7541K0555
$$ -52253 -89862 -27707 -3076 -18874 -34545 -197 103369 137084 128073 56277 8736 29291
24333B9291K9364K2273K9627J4942j3832p6171l1832j8009m2157N1256J1121r1608
$$ 29291 58655 80928 110555 125497 111665 35494 3662 -14347 -56504 -5248 5873 -85735
24321h5735K6555M7795N1053k3482J5885k9269K8182m8122j7309M078M8253L8017
$$ -85735 -59180 -11385 39668 16186 32071 2802 30984 -17138 -34447 -30369 17884 55901
24309E5901O3956J2096o5454n5488k0883o6634K1862M1421l2987k7140N1376j6550
$$ 55901 119857 131953 66499 11011 -9872 -76506 -54644 -13223 -46210 -73350 -21974 -38524
24297c8524m819N4226K6296p63J8874j6931L6921K2091j1655r27J6470k0973p5015
$$ -38524 -43343 10883 37179 36416 55290 38359 75280 97371 85716 84789 101259 80286 5271
24284E271n6051k175j4230L2044R6905J0254p2396M4N4370J0068Q0200O376q1493
$$ 5271 -50780 -52955 -67185 -35141 61764 72018 -378 -334 54036 64104 144304 150680 69187
24271F9187q6586k9821J243L2549J41931L8293n4899o5769l8481K5616k0763m3602
$$ 69187 -17399 -47220 -45977 -13428 128503 166796 111897 46128 7647 33263 12500 -31102
24259c1102R7634l4073m5031q0726J8669M370k0377N5007O3520m4198m4196l9504
$$ -31102 66532 32459 -12572 -93298 -74629 -70259 -90636 -35629 27891 -16307 -60503 -100007
24247a00007M6458J6329j0036l305m3345L3482M4256M7471r900l6262O051K1378
$$ -100007 -53549 -37220 -47256 -50561 -93906 -60424 -16168 31303 21403 -14859 -8808 12570
24235A2570j6687J8348k7925m4098n7348k5039N9518R75K4488L7480M304M4773
$$ 12570 -4117 14231 -13694 -57792 -115140 -140179 -80661 -79686 -55198 -17718 -13414 31359
24223C1359J2818r3166k9911N1588P2848m9351k0734J7578K6658K0966O3515r759
$$ 31359 44177 -48989 -78900 -27312 45536 -3815 -24549 -6971 19687 40653 104168 94409
24211I4409l4814n2021o5571j967O8538K5477j078l2401j4754k7444J8313L5244
$$ 94409 59595 7574 -57997 -59964 8574 34051 32973 572 -14182 -41626 -23313 11931
24199A1931j1302l3993k9974J1847j0934J5545O3775R9461P2306l2858m0059m6181
$$ 11931 629 -33364 -63338 -51491 -62425 -46880 16895 116356 188662 155804 115745 69564
24187F9564N528j2819M6070O089o7258r999k3248R731q9927o1591J7900O7025
$$ 69564 75092 62273 108343 114432 47174 37175 13927 23658 -66269 -127860 -109960 -42935
24175d2935K8922j0333L7946M4500k7263j7047j0582K8167N6729j0150k5292o2939
$$ -42935 -14013 -24346 13600 58100 30837 13790 3208 31375 88104 77954 52662 -10277
24163a0277q773n1415P0837J14097J5345q419j13210J7400J28822k8917l8797
$$ -10277 -19050 -70465 372 114469 129814 121395 8185 25585 154407 125490 86693
24152H6693K392k4361P059k3286m1310j7418p085l782n2327k0200L0329J7902
$$ 86693 89085 64724 71783 48497 7187 -10231 -17316 -21098 -73425 -93625 -63296 -45394
24140d5394K8777m1318J1073N50M1805l644l0509n0775m5103Q4135N897J8384
$$ -45394 -16617 -57935 -46862 -46312 -4507 -8151 -38660 -89435 -134538 -50403 -44506 -26122
24128b6122L3333K5984j2286O835n1210n4700O707L3393N7513K0977j1132l1566
$$ -26122 7211 33195 20909 27744 -23466 -78166 -71459 -38066 19447 40424 29292 -2274
24116b274o9304n0242L326O0406J319k0739N3379M7989k9895J3226L829k7976
$$ -2274 -71578 -121820 -118494 -58088 -56769 -77508 -24129 23860 -6035 7191 11020 -16956
24104a6956J0787K7136k395K7331n6178m0838M0503N4267K1876k5471m1780K1575
$$ -16956 -6169 20967 18572 45903 -10275 -51113 -10610 43657 65533 40062 -1718 19857
24092A9857P3960p71q640k1843p728J4680q7439p5281O5770L0149o517K2625L0978
$$ 19857 93817 93046 84406 62563 54835 69515 -17924 -93205 -27435 2714 -3803 18822 49800
24079D9800j7243n3741l3664j9044k2625J6881L5118R2170J063k9954j4099L6069
$$ 49800 32557 -21184 -54848 -73892 -96517 -79636 -44518 47652 48715 18761 4662 40731
24067D0731P1738k5387k5232n1010k3863k7538R6246k2066k9668J1335k8843K6010
$$ 40731 112469 87082 61850 10840 -13023 -40561 55685 33619 3951 15286 -13557 12453
24055A2453P9895L1941L8352J4322p9057m9001Q283n9676l10m076k6120N2399
$$ 12453 92348 124289 162641 176963 97906 48905 57188 -2488 -2798 -6874 -32994 19405
24043A9405n5729n583L21j0847P9098J5905k9645r314j8711n1172P878K2835k6747
$$ 19405 -36324 -41907 -41586 -52433 26665 42570 12925 3611 -15100 -66272 -58394 -35559 -62306
24030f2306l4199J3768l4304N7296P3249k1048n1266K6898P6457N7091L636n9978
$$ -62306 -96505 -82737 -117041 -59745 13504 -7544 -58810 -31912 44545 101636 105272 45294
24018D5294o1045k4209j9243j2126K0194j57L6152j4782k4751Q531J6816k3453
$$ 45294 -15751 -39960 -59203 -71329 -51135 -51292 -15140 -29922 -54673 -46142 -29326 -52779
24006e2779l4497J9008K9425N5605M2850k9240n817m780q250Q664j00368q3757
$$ -52779 -87276 -68268 -38843 16762 59612 30372 24555 19775 11525 20189 -80179 -163936
23994a63936K0306M5844K5618l4441K8174k6268q051L0871K822M2406L5705j7097
$$ -163936 -143630 -97786 -72168 -106609 -78435 -104703 -112754 -81883 -79061 -36655 -950 -18047
23982a8047N2883l4874k5606N4101p015P7857l902n8353L7132J464n6248l0099
$$ -18047 34836 -38 -25644 28457 21442 99299 95397 37044 74176 75640 19392 -10707
23970a0707o5905Q6061J40896L856L728n247j1977j9857k561p8694k2980l7492
$$ -10707 -76612 9449 150345 154201 157929 152682 140705 120848 118287 39593 16613 -20879
23958b0879o9349P397L9231P9865M8203L0188J3813n2840k1757J6907J5056J2924
$$ -20879 -90228 -82831 -43600 36265 84468 114656 128469 75629 53872 70779 85835 98759
23946I8759Q8813k1534k0439n7464r7484K4522j491o6410L8191n136j4954J9262
$$ 98759 187572 166038 145599 88135 -9349 15173 13682 -52728 -14537 -19673 -34627 -15365
23934a5365n545m2154P2336m0191p9465j2750M9531N6141j4026J0229n834p8180
$$ -15365 -20910 -63064 9272 -30919 -110384 -123134 -73603 -17462 -31488 -21259 -27093 -105273
23922a05273l792Q1956M03k6670K4156J5016j1909J4796j6827Q7181k995r8129
$$ -105273 -109065 -27109 -26706 -53376 -29220 -14204 -26113 -11317 -28144 59037 56042 -42087
23910d2087q6691m1974J4564M2421L0902P750k1947j0453M3427P4387K5596k8351
$$ -42087 -128778 -170752 -156188 -113767 -82865 -75115 -97062 -107515 -64088 10299 35895 7544
23898G544o0913K1381N6479j4869J2513k2228O707p1120n3125M5517r621q500
$$ 7544 -53369 -31988 24491 9622 22135 -93 6614 -64506 -117631 -72114 -81735 -90235
23886i0235m30J1209j283J5869P780k6302L9963o382n9312l5628J5372M9658L0384
$$ -90235 -90665 -79456 -80739 -64870 -57090 -83392 -43429 -49811 -109123 -144751 -129379 -79721 -49337
23873d9337K2262j4610o8874J73M2869q318K8752O76n1341m3678m018J01191L2302
$$ -49337 -27075 -41685 -110559 -110386 -67517 -75835 -47083 -46407 -97748 -141426 -145444 -44253 -11951
23860a1951n1830m0163k630L1988N4574J312k5934k6507K7452M5401O1811k5253
$$ -11951 -63781 -103944 -106574 -74586 -20012 -18700 -44634 -71141 -43689 1712 63523 38270
23848C8270m1806j7435n2598J8117J6211O941n419N6448j3357q499n96M5995M294
$$ 38270 -3536 -20971 -73569 -55452 -39241 -32300 -37719 18729 5372 -3127 -3723 42272 46566
23835D6566N74K321l0937l5055j7774K3583J4700l291K9288M0888j4764n4654
$$ 46566 47140 49461 18524 -16531 -34305 -10722 3978 687 29975 70863 56099 1445
23823A445j0817j136L549n5155J7708m6928N448M1505K4008n4766M1574j0153
$$ 1445 -9372 -10508 -6959 -62114 -44406 -91334 -85886 -44381 -20373 -75139 -33565 -43718
23811d3718M6158l3482P3419K8389k8925j0473l8837L461J8439p294j1859J5256
$$ -43718 2440 -31042 42377 70766 41841 31368 -7469 -4008 14431 7137 -4722 10534
23799A0534J136m2302n763J3882l0362L9100n506j4724p808L9445k848M6634L627
$$ 10534 11670 -30632 -36395 -22513 -52875 -13775 -19281 -34005 -41813 -2368 -5216 41418 45045
23786D5045K4829R561l1695n3245l4202j4415K9994J0759o7997k2362P1906K0868
$$ 45045 69874 79435 47740 -5505 -39707 -54122 -24128 -13369 -81366 -103728 -31822 -10954
23774a0954l3227m8225K2194N8642j7337j1815L189L3037Q842k996K3321j7768
$$ -10954 -44181 -92406 -70212 -11570 -28907 -40722 -37533 -4496 4346 1350 24671 6903
23762F903L2884k5204j3771o5898n8011M7557L8209P7060N787k0320m9970L0940
$$ 6903 39787 14583 812 -65086 -123097 -75540 -37331 39729 45516 25196 -24774 6166
23750F166O6048J5027o0988m8718r413l3675M1414O3095k4553n7810n6092O177
$$ 6166 72214 87241 26253 -22465 -31878 -65553 -24139 38956 14403 -43407 -99499 -93322
23738i3322L9183m890j43081k1725R0469L8759m487K2711L4230L4508K4927l2910
$$ -93322 -54139 -59029 -202110 -223835 -133366 -94607 -99094 -76383 -42153 -7645 17282 -15628
23726a5628j11851j1038M2514M2509L912J0749k1712N7070J666j3644p1982n5926
$$ -15628 -127479 -138517 -96003 -53494 -49582 -38833 -60545 -3475 -1809 -15453 -87435 -143361
23714a43361L1334Q4990J8133M1561l1667n6258J2924Q0008M981p2014l4502R984
$$ -143361 -112027 -27037 -8904 32657 990 -55268 -42344 37664 42645 -29369 -63871 -53887
23702e3887O0133J6080j8460n7856n953j1002P4749M8957j716n5724J3508l4064
$$ -53887 6246 22326 3866 -53990 -59943 -70945 3804 52761 51045 -4679 8829 -25235
23690b5235k1243o760K7007K3639l1140O343O6958K6094m8024j9283j6178o234
$$ -25235 -46478 -53238 -26231 -2592 -33732 -27389 39569 65663 17639 -1644 -17822 -24056
23678b4056j2140L5721L957n4866n7596j1621Q3340N2861l3618q5758J1496k6067
$$ -24056 -36196 -475 3482 -51384 -108980 -120601 -37261 15600 -18018 -103776 -92280 -118347
23666a18347N7668j5872P785q529M4835M545J9777M0158m2810m8009M915L4475
$$ -118347 -60679 -76551 -68766 -77295 -32460 -27915 -8138 32020 -10790 -58799 -53884 -19409
23654a9409O5438J1707l913l5086K840M848l1013n1402O1061N046J069n2429l358
$$ -19409 46029 57736 53823 18737 21577 26425 -4588 -55990 5071 10117 11186 -41243 -44601
23641d4601M5907M1113k1119O673o1140M7266j7758o9250L2210O0968m9602P54
$$ -44601 1306 42419 21300 27973 -33167 14099 -3659 -72909 -40699 20269 -29333 -28579
23629b8579r167L5013P9469m6172j34019p384K6673j7280N9176K3579N9261j3631
$$ -28579 -37746 -2733 76736 30564 -103455 -110839 -84166 -101446 -42270 -18691 40570 26939
23617B6939j3498o1411j9617K6266J2252j8692m7750K5243O2272j6230m2179J09019
$$ 26939 13441 -47970 -67587 -41321 -29069 -47761 -95511 -70268 -7996 -24226 -66405 42614
23605D2614L9516j6838K313O489p5564k1384K7305K6097N4016N3077o5304j03274
$$ 42614 82130 65292 67605 74094 -1470 -22854 4451 30548 84564 137641 72337 -30937
23593c0937l1663n8080J9107N3346K7778K6757O0702L5443q5111j3963L7717K7803
$$ -30937 -62600 -120680 -101573 -48227 -20449 6308 67010 102453 17342 3379 41096 68899
23581F8899o7691o338m0006J2785k7876K3826N5432n5599L7318N4023L8730o6175
$$ 68899 1208 -5130 -45136 -32351 -60227 -36401 19031 -36568 750 54773 93503 27328
23569B7328K6449M6838O1232k1365k591r4499k3421N096j9486J669K901j19197
$$ 27328 53777 100615 161847 140482 137891 43392 19971 25067 5581 7250 10151 -109046
23557a09046l7161Q5571P6182l1172l6169K3701L0686N927L299l8102J9791L8488
$$ -109046 -146207 -60636 15546 -15626 -51795 -28094 2592 8519 11818 -26284 -6493 31995
23545C1995k8211m7392n755L7698N1107J38987K1137j01193r8380J9996K2351
$$ 31995 3784 -43608 -49363 -11665 39442 178429 199566 98373 -7 19989 42340
23534D2340j0482k5428l1300l2928J8508k2649K3548M3172N6878J784l5322k2322
$$ 42340 31858 6430 -24870 -57798 -39290 -61939 -38391 4781 61659 63443 28121 5799
23522E799K3017N5629n0459j9069n4533K967j9480n2058M6894q255n1704j9175
$$ 5799 28816 84445 33986 14917 -39616 -36649 -56129 -108187 -61293 -69548 -121252 -140427
23510a40427K508O0968L7242k3185k0237Q2864N9666j1853n5930m1497K4762K9603
$$ -140427 -137919 -76951 -39709 -62894 -83131 -267 59399 47546 -8384 -49881 -25119 4484
23498D484j5835k7412L120p72k1410j5989J0931O4296j356o778K9854j8050l3204
$$ 4484 -11351 -38763 -35643 -36415 -57825 -73814 -62883 1413 57 -6721 23133 5083 -28121
23485b8121K5261J5997p4291n2301L7068J8599l1517M7044J11644K6425p1062
$$ -28121 -2860 13137 -61154 -113455 -76387 -57788 -89305 -42261 69383 95808 24746
23474B4746q621j6779p839j6665M1061O270l6507J7456k8792n9829J8170j284
$$ 24746 16125 -654 -8493 -25158 15903 22173 -14334 3122 -25670 -85499 -67329 -68613
23462f8613L2110N6646J8184Q2670K9516j3332J3192n9264O880l2593r5220o9868
$$ -68613 -36503 20143 38327 120997 150513 137181 150373 91109 97989 65396 -29824 -99692
23450i9692J1100L2216K8685j568k1267n84k6655N7961N3968O8128J3749J2415
$$ -99692 -88592 -56376 -27691 -29259 -50526 -51110 -77765 -19804 34164 102292 116041 128456
23438A28456P9l5683k9333j327l5469k0904l1850m9148L4083L6412M4592J3767
$$ 128456 128535 92852 63519 62192 26723 5819 -26031 -75179 -41096 -4684 39908 53675
23426E3675k6177l4328p625J3144k4710l0370J268K1752P0504J2303l9411r947
$$ 53675 27498 -6830 -14455 -1311 -26021 -56391 -55123 -33371 37133 49436 10025 78
23414G8p71O2023p5391j1379J7554M8434n8665j8383J9059m6515m2134l5430O3536
$$ 78 -693 61330 -14061 -25440 -7886 40548 -18117 -36500 -17441 -63956 -106090 -141520 -77984
23401g7984N8992Q706j5391m7459j2823L003N0219J1107K4781o074j3141n0496
$$ -77984 -18992 -10286 -25677 -73136 -85959 -82956 -32737 -21630 3151 -2923 -16064 -66560
23389f6560m3827K0342J5940L175R784J2192r646k0533k3520o3503P3843L5948
$$ -66560 -110387 -90045 -74105 -70930 -61146 -48954 -58600 -79133 -102653 -166156 -92313 -56365
23377e6365j0050L2387M4776o4339M9165j3931j0752M1949M7426j6979N587L5239
$$ -56365 -66415 -34028 10748 -53591 -4426 -18357 -29109 12840 60266 43287 48874 84113
23365H4113o3629L2732M6811k2352o4069j2240N99M6610O1894n1619n5909j7512
$$ 84113 20484 53216 100027 77675 13606 1366 1965 48575 110469 58850 2941 -14571
23353a4571m846l0997j662N1643L5863J6136j12480l4541N1844J7248M3566J6936
$$ -14571 -19417 -50414 -52076 -433 35430 51566 -60914 -95455 -43611 -26363 17203 34139
23341C4139l4384q9832k2965N715l0994L74M6180P0120k0865j7427L4048q974
$$ 34139 -245 -90077 -113042 -107327 -138321 -137947 -91767 -21647 -42512 -59939 -25891 -34865
23329c4865o7807j5636L2953P7156K5762K9878p5200o0734O8795Q3842o297j2156
$$ -34865 -102672 -118308 -85355 -8199 17563 47441 -27759 -88493 -19698 64144 57847 45691
23317D5691j6354J697R997j5520J5508L7961o5410l4721M3397K0341k3469k0316
$$ 45691 29337 31034 41031 25511 41019 78980 13570 -21151 22246 42587 19118 -1198
23305a198l5626q235j11m3174j9610N1830Q28r212l0212M509J668P4642R1637
$$ -1198 -36824 -45059 -45170 -88344 -107954 -56124 -55296 -64508 -94720 -90211 -88543 -13901 77736
23292G7736o490k4305k9362j5243K478l8037L8912o187J8128j0075L903M667m1125
$$ 77736 71246 46941 17579 2336 4814 -33223 5689 -498 17630 7555 11458 16125 -25000
23279b5000k0832K1988L7564K1551R609q398J7182M9666m0867k4103j8506R926
$$ -25000 -45832 -23844 13720 35271 44880 36482 53664 103330 62463 38360 19854 29780
23267B9780L9323l5559J4359K9373J0982r405J047n9618n9087L3065n434J9699
$$ 29780 69103 33544 47903 77276 88258 78853 79900 20282 -38805 -5740 -11174 8525
23255H525J4297P730J8959N250L2237r3084m8101L2203m5125l0273K1772O5030
$$ 8525 22822 30552 49511 54761 86998 -6086 -54187 -21984 -67109 -97382 -75610 -10580
23243a0580N5022M172k5656L2330O767m0818J7506k385n4876m6091j3889o250
$$ -10580 44442 48614 22958 55288 62055 21237 38743 36358 -18518 -64609 -78498 -84748
23231h4748K1137K8339Q5215k2906k731m5854n6464J0890m1262j7113N5432L2279
$$ -84748 -63611 -35272 49943 27037 24306 -21548 -78012 -67122 -108384 -125497 -70065 -37786
23219c7786K7348L1244k91o5978q1900N7037M0078o8200n5253J01928J36474L5578
$$ -37786 -10438 20806 20515 -45463 -127363 -70326 -30248 -98448 -153701 -51773 84701 120279
23207A20279k3968m6843j5709K970M5229N1014o8122r8828l3440k6539Q6864O2448
$$ 120279 96311 49468 33759 36729 81958 132972 64850 -33978 -67418 -93957 -7093 55355
23195E5355K5255J16055O872o8347n9187j7754L386l4767J3996J0198j4500K5968
$$ 55355 80610 196665 203537 135190 76003 58249 61635 26868 40864 51062 36562 62530
23183F2530m0530n4590k2173m0159M627l4189K0182L9190K1248L7184J6966k7748
$$ 62530 22000 -32590 -54763 -94922 -90295 -124484 -104302 -65112 -43864 -6680 10286 -17462
23171a7462P0384K9497j8066o1195l8719L7798K3110J2177j5443k3674K0968l5714
$$ -17462 52922 82419 64353 3158 -35561 2237 25347 37524 22081 -1593 19375 -16339
23159a6339o1651P1453O8395o2010p6217l6120J6988Q7806R5929l9681o7043o5944
$$ -16339 -77990 -6537 61858 -152 -76369 -112489 -95501 -7695 88234 48553 -18490 -84434
23147h4434m1042L6882K9068J3308P7552J8325l5862k326o097K0562Q625K9054
$$ -84434 -125476 -88594 -59526 -46218 31334 49659 13797 11471 5374 25936 34561 63615
23135F3615J7379l4825k1414k0921J3966k1069j1263l3284K9167k7924n9373k7468
$$ 63615 80994 46169 24755 3834 17800 -3269 -14532 -47816 -18649 -46573 -105946 -133414
23123a33414o545M7542O7013o423k3020J4687M5106N2669l5194m1278L7129n2876
$$ -133414 -139959 -92417 -25404 -31827 -54847 -40160 4946 57615 22421 -18857 18272 -34604
23111c4604q3143k9566K7140j4537L1061O9349J0390j0234K8345k5787R8242k8285
$$ -34604 -117747 -147313 -120173 -134710 -103649 -34300 -23910 -34144 -5799 -31586 66656 38371
23099C8371q7160O5276R1758l6706n1000M7148k1961p8606l0840N695k7627J4359
$$ 38371 -48789 16487 108245 71539 20539 67687 45726 -32880 -63720 -58025 -85652 -71293
23087g1293P5929N6458K212j9182k8447J8703j2728k4228k712K2174Q337j9115
$$ -71293 4636 61094 63306 44124 15677 34380 21652 -2576 -5288 16886 25223 6108
23075F108o5052K7535O0152L4505k8958l0377j0139N1531N281J5476j9157r066
$$ 6108 -58944 -31409 28743 63248 34290 3913 -6226 45305 50586 66062 46905 37839
23063C7839r698l7070J6140M8331K6775n3452n8125n5855j1517P1616K159j6960
$$ 37839 28141 -8929 7211 55542 82317 28865 -29260 -85115 -96632 -25016 -22857 -39817
23051c9817K3693k8185N9974j5315k2039J4463k9169M3148j5251k8561J7485J36
$$ -39817 -16124 -44309 15665 350 -21689 -7226 -36395 6753 -8498 -37059 -19574 -19438
23039a9438l0398M4721j8931K2691P8197N1462p5859M0396M6131L8086N1431l6998
$$ -19438 -49836 -5115 -24046 -1355 76842 128304 52445 92841 138972 177058 228489 191491
23027A91491n3616p5040j23023M9271K065Q115q6265p4994l9020l150J05064J28773
$$ 191491 137875 62835 -60188 -10917 -8852 -737 -87002 -161996 -201016 -204166 -99102 29671
23015B9671M6773L8017O1482r866n6902k3187J0085j4209l6536l9285m8518J4127
$$ 29671 76444 114461 175943 166077 109175 85988 96073 81864 45328 6043 -42475 -28348
23003b8348K0371N0822O8383J5306l2567M631j5533J035k0413p9191K1086K8088
$$ -28348 -7977 42845 111228 126534 93967 98598 83065 84100 63687 -15504 5582 33670
22991C3670j6697O617J9211p9505K4117M0214l5746q7667k3902O066N3395R850
$$ 33670 16973 23590 42801 -36704 -12587 27627 -8119 -95786 -119688 -113622 -60227 -50377
22979e0377O625j383K3561k3299o059p165l686J2780l2483N958k920K3043l3717
$$ -50377 -43752 -45135 -21574 -44873 -50932 -58097 -61783 -49003 -81486 -75528 -78448 -55405 -89122
22966h9122K9874O9715Q3664J4609O3544r9766j05622p5457O5364N5520n40l5577
$$ -89122 -59248 10467 94131 108740 172284 72518 -33104 -108561 -43197 12323 11783 -23794
22954b3794m3828r911k042J4680O8566O8142l3981l9317q248K8828J4836K9743
$$ -23794 -67622 -77533 -79575 -64895 3671 71813 37832 -1485 -9733 19095 33931 63674
22942F3674q5246O973O092n1150m0828K3313J16818j6533l1640k3968N7803k6193
$$ 63674 -21572 -14599 -8507 -59657 -100485 -77172 39646 23113 -8527 -32495 25308 -885
22930h85j4011L6516K7021L4585o2034m9905m1017k2979O0357P0397m8563m8214
$$ -885 -14896 21620 48641 83226 21192 -28713 -69730 -92709 -32352 38045 -10518 -58732
22918e8732j9895j7627K3175L4554m37J0259K1093j5467l9741Q2471M9428p7297
$$ -58732 -78627 -96254 -73079 -38525 -38962 -28703 -7610 -23077 -62818 19653 69081 -8216
22906h216n7996N384k3050M4759K0545J3878m582J7006Q7921M2660l9851p5059
$$ -8216 -66212 -60828 -83878 -39119 -18574 -4696 -9278 7728 95649 138309 98458 23399
22894B3399j0740N1958l2461l6841p4467L351R9275k6666l3414Q9798N8209l4875
$$ 23399 12659 64617 32156 -4685 -79152 -75801 23474 -3192 -36606 53192 111401 76526
22882G6526l5971p371j0827r719L9971K2861l1246K4090L2536j3526p8074p2136
$$ 76526 40555 33184 22357 12638 52609 75470 44224 68314 100850 87324 9250 -62886
22870f2886J5074j4082K0303M5554p3485n555R4426K8666q049p7756L484P5723
$$ -62886 -47812 -61894 -41591 3963 -69522 -75077 19349 48015 39966 -37790 -34306 41417
22858D1417R376m8616n7081m2894j758k5690K2935O7059J411q625m1235o1699
$$ 41417 50793 2177 -54904 -97798 -99556 -125246 -102311 -35252 -33841 -42466 -83701 -145400
22846a45400j0807n1276K2880Q9340j8268m5443l0212J1531J1809L5828K890K6169
$$ -145400 -156207 -207483 -184603 -95263 -113531 -158974 -189186 -177655 -165846 -130018 -127128 -100959
22834a00959O1274k1584j6158j2560O1924j9591L9241L6154j6389L4100l0882
$$ -100959 -39685 -61269 -77427 -89987 -28063 -47654 -8413 27741 11352 45452 14570
22823A4570k154K3485l258n342l3274m6341l0381k7207J1393Q4240L0369r5285
$$ 14570 12416 35901 32643 27301 -5973 -52314 -82695 -109902 -98509 -14269 16100 -79185
22811g9185k4825O4420P042K5252m0059n9353j243M1328O0545K2888m712L9633
$$ -79185 -104010 -39590 -32548 -7296 -47355 -106708 -107951 -66623 -6078 16810 12098 51731
22799E1731J1671m6443k8648j3725P294j3678k1755q792n0431j9763l0584J6061
$$ 51731 63402 16959 -11689 -25414 -18120 -31798 -53553 -62345 -112776 -132539 -163123 -147062
22787a47062Q1979N1432J7915k7483J5054k5482k93J01528j8560o258j620J5525
$$ -147062 -65083 -13651 4264 -23219 -8165 -33647 -33940 67588 49028 42770 41150 56675
22775E6675l6420P417J0737O617k4226o5240L4276R04L4219J6870m8095m4041
$$ 56675 20255 27672 38409 45026 20800 -44440 -10164 -9260 24959 41829 -6266 -50307
22763e0307l8402P764L8467J2927j6148m919O5916k108l6589l2259K9027k2125
$$ -50307 -88709 -80945 -42478 -29551 -45699 -50618 15298 13190 -23399 -55658 -26631 -48756
22751d8756J5610J8366j5986J2948n627n805J6991N5018o075o5832p2290l7040
$$ -48756 -33146 -14780 -30766 -17818 -23445 -29250 -12259 42759 36684 -29148 -101438 -138478
22739a38478P9105L8405j9859j7635K9237L0814O180Q1286L9963l0748J140m8902
$$ -138478 -59373 -20968 -40827 -58462 -29225 1589 7769 89055 129018 98270 99410 50508
22727E0508n812k2749j6118k4543q881J3918k6334L4035K9020n4393k9028J00722
$$ 50508 44696 21947 5829 -18714 -27595 -13677 -40011 -5976 23044 -31349 -60377 40345
22715D0345L4379o75q1406j9346K5581j4755j0298j7423L073n926j0081k9930
$$ 40345 74724 74049 -7357 -26703 -1122 -15877 -26175 -43598 -40525 -46451 -56532 -86462
22703h6462P32M125K3783O7952Q5819l6920n4325m997j4312O1644j7962j5191
$$ -86462 -85730 -81605 -57822 10130 95949 59029 4704 -293 -14605 47039 29077 13886
22691A3886O550M9962J286n9759p9062k8689k7809j6873J08239R803q3658m7810
$$ 13886 20436 70398 71684 11925 -67137 -95826 -123635 -140508 -32269 -22466 -106124 -153934
22679a53934k4446N5788J2125L5211P724K3773J5769l8747o892j2071Q2133M8674
$$ -153934 -178380 -122592 -110467 -75256 -67532 -43759 -27990 -66737 -73629 -85700 -3567 45107
22667D5107J1836J0057l1026j65N956k6222k8989j6202J4373M3299L956o7673
$$ 45107 56943 67000 35974 35809 41765 15543 -13446 -29648 -15275 28024 31980 -35693
22655c5693j5673P48M9180j4466k5128K1080N5012J03826K9683m8025l2098m4614
$$ -35693 -51366 -50618 -1438 -15904 -41032 -19952 35060 138886 168569 120544 88446 43832
22643D3832p6099p630M0492L6664M9123K7534m8321k3859q10k3163K5084k9432
$$ 43832 -32267 -39897 595 37259 86382 113916 65595 41736 40926 17763 42847 13415
22631A3415o216M0887j0966n6260K9484P0336M0207o3281n3608l5215k897K4621
$$ 13415 7199 48086 37120 -19140 10344 80680 120887 57606 3998 -31217 -34114 -9493
22619i493n454J4439O09o2600M2722P2677M0799j9676o916k8329n8331l8433O2788
$$ -9493 -14947 -508 101 -62499 -19777 52900 93699 74023 67107 38778 -19553 -57986 4802
22606D802M172p7860l3367O2685M6928K068r0315j1837N8559N5291m1331J2983
$$ 4802 8974 -68886 -102253 -39568 7360 9428 -80887 -92724 -34165 21126 -20205 -7222
22594g222J5458k4745R308K1065L6617M224n2306j4720K7691j7289J7644m289
$$ -7222 8236 -16509 -7201 13864 50481 54705 2399 -12321 15370 -1919 15725 11436
22582A1436J9401L2642J3471m6677j3274m4726M3435L9996m1452J0974j3878l4569
$$ 11436 30837 63479 76950 30273 16999 -27727 15708 55704 14252 25226 11348 -23221
22570b3221p1528P379K3736L1382j5965j8844l5289j532N1245L089n0911n3204
$$ -23221 -94749 -87370 -63634 -32252 -48217 -67061 -102350 -103882 -52637 -49548 -100459 -153663
22558a53663K5176N2383M9070K2963j1706l0887k412P4171k6264M397j6608o4755
$$ -153663 -128487 -76104 -27034 -4071 -15777 -46664 -49076 25095 -1169 3228 -13380 -78135
22546g8135L0701K3433l663M8583P1548m407m9111p3081o2191k4754L4945K2625
$$ -78135 -47434 -24001 -27664 20919 92467 88060 38949 -34132 -96323 -121077 -86132 -63507
22534f3507L4128K5571o9331M6447n6137k348M3109n5751n2336M3663O6318J9623
$$ -63507 -29379 -3808 -73139 -26692 -82829 -85177 -42068 -97819 -150155 -106492 -40174 -20551
22522b0551j157J4876j0185m9885l8374K5337n7549m1165R7489N7967J9475n2089
$$ -20551 -21708 -6832 -17017 -66902 -105276 -79939 -137488 -178653 -81164 -23197 -3722 -55811
22510e5811J6M5627j0536m6293L8587j0905k1588j0821o3144J7851K7655k9322
$$ -55811 -55795 -10168 -20704 -66997 -28410 -39315 -60903 -71724 -134868 -117017 -89362 -118684
22498a18684K3639J3620O3567Q0959L4874k354l1890n03l810l457K1574N2270
$$ -118684 -95045 -81425 -17858 63101 97975 95621 63731 63228 59418 55961 77535 129805
22486A29805j8652p0293o6288p8432l2546N6571M7113l7749o2932N4169K8069
$$ 129805 111153 40860 -25428 -103860 -136406 -79835 -32722 -70471 -133403 -79234 -51165
22475e1165q41n2227q114O7304k0697n163Q3690n359r0942q016j4062L667Q025
$$ -51165 -52006 -104233 -112347 -45043 -65740 -70903 12787 7428 -83514 -91530 -105592 -101925 -93900
22462i3900J4664j0101K0893N378M4522K1792n0154Q953L087k5998L3258M8270
$$ -93900 -79236 -89337 -68444 -63066 -18544 3248 -46906 -37953 -34866 -60864 -27606 20664
22450B0664K1851K8075M2557m0616j02169L7699L7981m33n304N2165n039q8124
$$ 20664 42515 70590 113147 72531 -29638 8061 46042 45609 40305 92470 87431 -693
22438f93n6392j9095K7297K0667M0349J1270j4417p835l6642m7153o9272R2709
$$ -693 -57085 -76180 -48883 -28216 12133 23403 8986 1151 -35491 -82644 -151916 -59207
22426e9207J3406m2896r332O8966L5673j9871o5745J9784Q3980P5560K6935n9839
$$ -59207 -45801 -88697 -98029 -29063 6610 -13261 -79006 -59222 24758 100318 127253 67414
22414F7414o4576m2135m4999J2557m761k1050q276L1340L7047R381j6534N360
$$ 67414 2838 -39297 -84296 -71739 -76500 -97550 -105826 -74486 -37439 -28058 -44592 -39232
22402c9232M1608k2738P130l9252Q609P7867p5668l0430o566M1847L7172K6153
$$ -39232 2376 -20362 -13232 -52484 -43875 33992 -41676 -72106 -78672 -36825 347 26500
22390B6500k1823k2991l9301j8097k4459M461k939M1988Q3274J3990K5054l3763
$$ 26500 4677 -18314 -57615 -75712 -100171 -95710 -98649 -56661 26613 40603 65657 31894
22378C1894r1627o9163p404M9822Q662l5335j0504m69L5691M7314K7934K8435
$$ 31894 -59733 -128896 -136300 -86478 -77816 -113151 -123655 -124124 -88433 -41119 -13185 15250
22366A5250J6576k1954l1577q650M9268L5571n0261r0419o66J9184K9981J5274
$$ 15250 31826 9872 -21705 -30355 18913 54484 4223 -86196 -86862 -67678 -37697 -22423
22354b2423O9076J2795r419P88m665j8552K429k6142L0410Q6315l7045p7823J7221
$$ -22423 46653 59448 50029 50817 46152 27600 30029 3887 34297 120612 83567 5744 22965
22341B2965K676L1409Q337m8301o2198p584J9270q142k5336k1473Q891L9156O1511
$$ 22965 25641 57050 65387 17086 -45112 -52696 -33426 -41568 -66904 -88377 -79486 -40330 21181
22328B1181J0434l085J9409j1052m9438q807l368m81n3614L944K2406j4799M1428
$$ 21181 31615 28530 47939 36887 -12551 -21358 -24726 -25207 -78821 -74877 -52471 -67270 -25842
22315b5842P1666J5608m347j8478p361m0841L5422O5548o533m5500k6698L6804
$$ -25842 45824 61432 57085 38607 31246 -9595 25827 91375 84842 39342 12644 49448
22303D9448K6778k9137n0135m5511l0208K8317L7710N0490n2621l3691M071k2414
$$ 49448 76226 47089 -3046 -48557 -78765 -50448 -12738 37752 -14869 -48560 -44489 -66903
22291f6903N3562Q1437J0062O377k6400M5830J9657o4116o4049l3456K8541L0798
$$ -66903 -13341 68096 78158 84535 58135 103965 123622 59506 -4543 -37999 -9458 21340
22279B1340N6362L4672j6581l8695K459J5424r55r011k0955R0837Q8519l3217
$$ 21340 77702 112374 95793 57098 59557 74981 74026 65015 44060 134897 223416 190199
22267A90199j28746o1682j649nP5196L9348j4359q2113n1240j5768j1851l6852
$$ 190199 61453 -229 -1878 -1883 73313 112661 98302 16189 -35051 -50819 -62670 -99522
22255i9522K1273Q0733L9647n4636m5957l869L491j8034J9074l7378n3420k5685
$$ -99522 -78249 2484 42131 -12505 -58462 -62331 -58840 -76874 -57800 -95178 -148598 -174283
22243a74283N3816N6955K1901L7030J7481m3488r1577j0660P2134J02667n8074
$$ -174283 -120467 -63512 -41611 -4581 12900 -30588 -122165 -132825 -60691 41976 -16098
22232a6098j39415m6626J0884P668K6844P339R8651O5133j8604J3950m6194m1105
$$ -16098 -155513 -202139 -191255 -183587 -156743 -149404 -50753 14380 -4224 9726 -36468 -77573
22220g7573J2189Q683k369P1355K72q4266l2621L696R0677L3954l8674K36M6350
$$ -77573 -65384 -56701 -59070 12285 12557 -71709 -104330 -100634 -9957 23997 -14677 -14441 31909
22207C1909M7589M4552n5694o5551J8215q4508j6744P9261L1480N2607J5509l5697
$$ 31909 79498 124050 68356 2805 21020 -63488 -80232 -971 30509 83116 98625 62928
22195F2928M5767l8324k5240O6134m4228r1712m124K6920K9034K3927p3663m5286
$$ 62928 108695 70371 45131 111265 67037 -24675 -28799 -1879 27155 51082 -22581 -67867
22183f7867N0690l2205r8772j3061N8986O4892Q341k5671N1148K435J9076L86
$$ -67867 -17177 -49382 -148154 -161215 -102229 -37337 -28996 -54667 -3519 -1084 17992 18378
22171A8378o5869n5828L3899n673k8111L1371m692N8114N9538K3183K6355J7535
$$ 18378 -47491 -103319 -69420 -75093 -103204 -71833 -76525 -18411 41127 64310 90665 108200
22159A08200l9769m5887n5683q572O2719N519j0112N8210K5068m4141k3024p8251
$$ 108200 68431 22544 -33139 -41711 21008 26527 16415 74625 99693 55552 32528 -45723
22147d5723o5376O8607J4466l6280q641l03J415r681j3736Q5400P8693p822o1791
$$ -45723 -111099 -42492 -28026 -64306 -72947 -73250 -71835 -81516 -95252 -9852 68841 61019 -772
22134g72j5791N9967l2187m0836J1342J4828l949l863R564L2157K3651P14m368
$$ -772 -16563 43404 11217 -29619 -18277 -3449 -7398 -11261 -1697 30460 54111 54825 50457
22121E0457l7459k3191J0213m5291j556J08228L4887o4658o7413j4211M9749m001
$$ 50457 12998 -10193 20 -45271 -46827 61401 96288 31630 -35783 -49994 -245 -4246
22109d246L3521Q894M761R422J2333k7648l6023K2281P4943q900l6800j9132K4365
$$ -4246 29275 38169 42930 52352 64685 37037 1014 23295 98238 89338 52538 33406 57771
22096E7771K7875j3468o282J14J324j8126m2311Q237M3048l0643j29473j8249
$$ 57771 85646 72178 65896 66010 67334 49208 6897 15134 58182 27539 -101934 -120183
22084a20183O3952L9875l3322j3577l054L07j8097P2487O9804O264k5983r535
$$ -120183 -56231 -16356 -49678 -63255 -66309 -66002 -84099 -11612 58192 64456 38473 28938
22072B8938j8892L1136n4083p7541N2799O8906M125O7791J3240p9480m9588p767
$$ 28938 10046 41182 -12901 -90442 -37643 31263 35388 103179 116419 36939 -12649 -20416
22060b0416j4578l8054M7915Q636n1708k5045j6059N3278O4377M7582j7170m4673
$$ -20416 -34994 -73048 -25133 -16497 -68205 -93250 -109309 -56031 8346 55928 38758 -5915
22048e915m2298Q607J3844j946N9523L8114J5852m2325l3289p0657l0764J16884
$$ -5915 -48213 -39606 -25762 -27708 31815 69929 85781 43456 10167 -60490 -91254 25630
22036B5630R6411K735l1785l0636o1352l7188K4027K9302N6778Q7560l3374j78050
$$ 25630 122041 124776 92991 62355 1003 -36185 -12158 17144 73922 161482 128108 -49942
22024d9942o4362j5972J18198M2983L9506P9368N0581M293l4851o1482k1235m6869
$$ -49942 -114304 -130276 -12078 30905 70411 149779 200360 204653 169802 108320 87085 40216
22012D0216J4385o213j9557o3939K1908M1179m5202R425P0310L0244m2216p6663
$$ 40216 54601 48388 28831 -35108 -13200 27979 -17223 -7798 62512 92756 50540 -26123
22000b6123m6017k1391Q428J03382K2377o057K821o860m9306o4211K3251M192
$$ -26123 -72140 -93531 -85103 18279 40656 34599 37420 30560 -18746 -82957 -59706 -55514
21988e5514n3698l275N2655J9476j6776L0294N080N039P8210k9896r1008m9566
$$ -55514 -109212 -112487 -59832 -40356 -57132 -26838 -21758 -16719 61491 31595 -59413 -108979
21976a08979N9312M3188m9640J9123j1597K0430R00L9172j0377j8610k4346j3239
$$ -108979 -49667 -6479 -56119 -36996 -48593 -28163 -27263 11909 1532 -17078 -41424 -54663
21964e4663M0849n5009j4871o186K1997K5240j9628L4249M8976m4782K6142N362
$$ -54663 -13814 -68823 -83694 -89880 -67883 -42643 -62271 -28022 20954 -23828 2314 7676
21952G676M8660L4611j14568r2165n037n070M5031j7435O0953P9932j0686M4913
$$ 7676 56336 90947 -23621 -115786 -120823 -125893 -80862 -98297 -37344 42588 31902 76815
21940G6815n7743m8416n5327n094k2327j186o658o3133l2607K8780J03799L2348
$$ 76815 19072 -29344 -84671 -89765 -112092 -113278 -119936 -183069 -215676 -186896 -83097 -50749
21928e0749L6154j1060m117L5325k5275o746L8526L0962j1861m3107M9365m3469
$$ -50749 -14595 -25655 -29772 5553 -19722 -26468 12058 43020 31159 -11948 37417 -6052
21916f052K7032L7311M753M4865o6748k3450n2163p4072R2738P9767N6125l2025
$$ -6052 20980 58291 63044 107909 41161 17711 -34452 -108524 -15786 63981 120106 88081
21904H8081J2185M7655j7049q8391m9388J243L7425j451K2431o9840M0957l4916
$$ 88081 100266 147921 130872 42481 -6907 -5664 31761 30310 52741 -17099 23858 -11058
21892a1058n2617L0511l9134l0699K9237O0258j3684r222j02856J5929L1044M8746
$$ -11058 -63675 -33164 -72298 -102997 -73760 -13502 -27186 -36408 -139264 -123335 -92291 -43545
21880d3545l649K1581m6641o209K3821p162n964P2631j084R957M0921j5865R80
$$ -43545 -47194 -25613 -72254 -78463 -54642 -61804 -67768 4863 3779 13736 54657 38792 39772
21867C9772k5092l1333j1182K9115k983j1729j4269k0044L4304o15O306N0976
$$ 39772 14680 -16653 -27835 1280 -1703 -13432 -27701 -47745 -13441 -14056 -7750 43226
21855D3226L2835O2977n2637n8765Q501j0952J6359l0602L110K4814P7656L1202
$$ 43226 76061 139038 86401 27636 36137 25185 41544 10942 14052 38866 116522 147724
21843A47724o0016m0610J8100l4314O2108Q3933n2906k6822m6651J2744k3513
$$ 147724 87708 47098 65198 30884 92992 176925 124019 97197 50546 63290 39777
21832C9777k0434M371l4763K7268K7235N3779k9748K6288J7116o612p1353p0097
$$ 39777 19343 23714 -11049 16219 43454 97233 67485 93773 110889 104277 32924 -37173
21820c7173M5417P7093M680q37m3161R559N310l0104K3615o8767n0639M9829Q1947
$$ -37173 8244 85337 90017 89180 46019 55578 60888 30784 54399 -14368 -65007 -15178 66769
21807F6769Q8963N088p4728m368J3039J5396j1131j33029J8988O8046l9470k7297
$$ 66769 155732 160820 86092 81724 94763 110159 99028 -34001 -15013 53033 13563 -13734
21795a3734J7526l726j8756j3839j6953m7897r521M8830O268R0095m0408n1748
$$ -13734 3792 66 -18690 -32529 -49482 -97379 -106900 -58070 -51802 38293 -2115 -53863
21783e3863k0027L2954M5119j4707q2932j9987M7404K9971k53j3472Q239k4540
$$ -53863 -73890 -40936 4183 -10524 -93456 -113443 -66039 -36068 -36321 -49793 -41554 -66094
21771f6094n0131M9827J8461K8888J00794Q976j03889n3181N3989J3066j7266
$$ -66094 -116225 -66398 -47937 -19049 81745 90721 -13168 -66349 -12360 706 -16560
21760a6560k3802k3226O2263M0711J050j4237n401K6703M312n4426j4724K6507
$$ -16560 -40362 -63588 -1325 39386 40436 26199 20798 47501 51813 -2613 -17337 9170
21748I170k3213l3975j044M2218r495k0923L1848L8410N0507n5996n2103j4217
$$ 9170 -14043 -48018 -49062 -6844 -16339 -37262 -5414 32996 83503 27507 -24596 -38813
21736c8813l5849J8362J23o0301o5049N574J8765j186R5953M921K5358J6691k8074
$$ -38813 -74662 -56300 -56177 -116478 -181527 -175953 -157188 -158374 -62421 -57500 -32142 -15451 -43525
21723d3525K8323k4403p51j0882M1482K1882o0401j9765k802j6756J4387L5512
$$ -43525 -15202 -39605 -40356 -51238 -9756 12126 -48275 -68040 -70842 -87598 -73211 -37699
21711c7699q118M7740K5641N0834n7077m1262N0939J147J304k3969J4361k2874
$$ -37699 -45817 1923 27564 78398 21321 -19941 30998 32145 33449 9480 23841 967
21699I67p2479k9672K8241M5592J0567M3856m6015j2158K1461L6244j4088p4951
$$ 967 -71512 -101184 -72943 -27351 -16784 27072 -18943 -31101 -9640 26604 12516 -62435
21687f2435L2055K9287k3160P31k830o7421o5375N71J3425L6877M0235N4741m123
$$ -62435 -30380 -1093 -24253 -23522 -26352 -93773 -159148 -158577 -145152 -108275 -68040 -13299 -17422
21674a7422k1646k8471m8628N0461O5871M8598o2637k9274K8097j1103q2900J00
$$ -17422 -39068 -67539 -116167 -65706 165 48763 -13874 -43148 -15051 -26154 -109054 -108954
21662a08954N6245j7564L6974j6839N2641M6870Q5201r796j69753r2304M244M4140
$$ -108954 -52709 -70273 -33299 -50138 2503 49373 134574 124778 -44975 -137279 -133035 -88895
21650h8895j1268N4642k3470l0054j986R0984J9480J6611j5492M507K4979k589
$$ -88895 -100163 -45521 -68991 -99045 -101031 -10047 9433 26044 10552 15059 40038 37449
21638C7449k5585k4735n9281L6292O8843j8817r3014j8298L7798j6572L3296L0351
$$ 37449 11864 -12871 -72152 -35860 32983 14166 -78848 -97146 -59348 -75920 -42624 -12273
21626a2273l6790J4606l8476n3942J5328N5820k713m1091n6036p142O9751P0670
$$ -12273 -49063 -34457 -72933 -126875 -111547 -55727 -58440 -99531 -155567 -162709 -92958 -22288
21614b2288K7358M0977r2974m3070M6891L1511J5036N592n9389m6843O7774L2325
$$ -22288 5070 46047 -46927 -89997 -43106 -11595 3441 9033 -50356 -97199 -29425 2900
21602B900J0389k801O5672m3615n2729O359j1716m6105l6432N0441N7116N2334
$$ 2900 13289 10488 76160 32545 -20184 -13825 -25541 -71646 -108078 -57637 -521 51813
21590E1813l8015j6682n7918o4885M6861j3868M9736J4844k8749Q433M6418K6791
$$ 51813 13798 -2884 -60802 -125687 -78826 -92694 -42958 -28114 -56863 -48430 -2012 24779
21578B4779l9534k757R064L2885j6836N303J3778L2439j4364p195n9498O3168
$$ 24779 -14755 -17512 -8448 24437 7601 12904 26682 59121 44757 37562 -21936 41232
21566D1232O449N315k2773m6976r4322P960O9967J05446N551j1806o2351j2172
$$ 41232 47681 52996 30223 -16753 -111075 -103115 -33148 72298 77849 66043 3692 -8480
21554h480K1648P1332J2123n7383j12469o6829k805J15712J03333k4397l4407
$$ -8480 13168 84500 96623 39240 -73229 -140058 -142863 -27151 76182 51785 17378
21543A7378l0818j0107L632m7639m4523l488K8955m588M8523M2112l8671n0003
$$ 17378 -13440 -23547 -19915 -67554 -112077 -115565 -86610 -91198 -42675 -563 -39234 -89237
21531h9237K6783O8760K3112o970p9051m3299L0988J9902q0217M0296L9509O738
$$ -89237 -62454 6306 29418 22448 -56603 -99902 -68914 -49012 -129229 -88933 -49424 -42686
21519d2686p5504J7907N1896J6799n509Q2863L0068j02626n1430r463K9168K4434
$$ -42686 -118190 -100283 -48387 -31588 -37097 45766 75834 -26792 -78222 -87685 -58517 -34083
21507c4083J745j7453K7139o250k2822k4762Q1310N8588m7258o094L8915j3019
$$ -34083 -32338 -49791 -22652 -28902 -51724 -76486 4824 63412 16154 10060 48975 35956
21495C5956j2664M6622n8942N7523J2284l1414M2630l9393j02049L9957k7966
$$ 35956 23292 69914 10972 68495 80779 49365 91995 52602 -49447 -9490 -37456
21484c7456J422k859k2894k7573L343M4085P09K1680K4850M623M9036q186o392
$$ -37456 -36034 -38893 -61787 -89360 -86017 -41932 -41223 -19543 5307 9930 58966 50780 44388
21471D4388l6004k5382r953r236l8965N16Q3381J6270l1859j0127K9998L817k3921
$$ 44388 8384 -16998 -26951 -36187 -75152 -74636 8745 25015 -6844 -16971 13027 16844 -7077
21458g077J0637K9372O072L7766N16r2771q7217R2149L4158N4725K0018l4910
$$ -7077 3560 32932 39004 76770 77286 -15485 -102702 -10553 23605 78330 98348 63438
21446F3438p7817k5613M6921r0851P1683O9707j7797O9980k1011j32577r3817
$$ 63438 -14379 -39992 6929 -83922 -12239 57468 39671 109651 88640 -43937 -137754
21435a37754L1363J01157k3297K8050J6520J4771n2883K9768M5773n7422k4758
$$ -137754 -106391 -5234 -28531 -481 16039 30810 -22073 7695 53468 -3954 -28712
21424b8712Q1802k4630k5408k5993k5590p1684n372J06658L5889K690k574k0574
$$ -28712 53090 28460 3052 -22941 -48531 -120215 -125587 -18929 16960 19650 17076 -3498
21412c498l7125L936m3555l3929J7533K6235k5599K6226j4979j463M8490M3180
$$ -3498 -40623 -36687 -80242 -114171 -96638 -70403 -96002 -69776 -84755 -86218 -37728 5452
21400E452O3084j4054r473n7664o3540m8447O8799M5613O5711K6653m3647l242
$$ 5452 68536 54482 45009 -12655 -76195 -124642 -55843 -10230 55481 82134 38487 35245
21388C5245l3798l2497l478L2335l348M0623J8688M0532j3150L5798l7425l4782
$$ 35245 1447 -31050 -34528 -2193 -5541 35082 53770 94302 81152 116950 79525 44743
21376D4743m2148M4065P472p6696K6080j669L968J2734l7647n2549L9376J02796
$$ 44743 2595 46660 54132 -22564 3516 1847 5815 18549 -19098 -71647 -32271 70525
21364G0525Q783j01825o0139L5060j7570m7654n9575K2324K8220l6140q818P5764
$$ 70525 79308 -22517 -82656 -47596 -65166 -112820 -172395 -150071 -121851 -157991 -166809 -91045
21352i1045P0103L78R608L884P6823N6046k5678o6462R958N304q885M1263J3244
$$ -91045 -20942 -20564 -10956 -7072 69751 125797 100119 33657 43615 48919 40034 81297 94541
21339I4541n9777m3806L6584K4594m823n9659k1030n730R4597K6265k4756k0756
$$ 94541 34764 -9042 27542 52136 47313 -12346 -33376 -39106 55491 81756 57000 36244
21327C6244o5496p2149J0739O6931J0634k1647P4180L614J3254n1047l4805O133
$$ 36244 -29252 -101401 -90662 -23731 -13097 -34744 39436 43050 56304 5257 -29548 -23415
21315b3415N4391K6704M5116K009p766o3992l3243l7290m632L586J4982J4548
$$ -23415 30976 57680 102796 104805 97039 33047 -196 -37486 -42118 -38532 -23550 -9002
21303i002k473J1983k5208q678o640L0873J3571m1085K8000J6749n1078m0090
$$ -9002 -11475 508 -24700 -33378 -40018 -9145 4426 -36659 -8659 8090 -42988 -83078
21291h3078J2079J5040L9033P3313n0196J400L9490p3715l9320j200J7504j1324
$$ -83078 -70999 -55959 -16926 56387 6191 7591 47081 -26634 -65954 -67154 -49650 -60974
21279f0974R9879L3613j9455n8808l2878m8689n8567M0469K1978K663M0221k308
$$ -60974 38905 72518 53063 -5745 -38623 -87312 -145879 -105410 -83432 -80769 -40548 -42856
21267d2856n4607k447O6372J9438q9966o3918L8530O0022K2931P067L7585k4557
$$ -42856 -97463 -99910 -33538 -14100 -104066 -167984 -129454 -69432 -46501 -39434 -1849 -26406
21255b6406m7601K6905M0333n14n2805k2510k3100n1366K8532P2157K5131O7520
$$ -26406 -74007 -47102 -6769 -7283 -60088 -82598 -105698 -157064 -128532 -56375 -31244 36276
21243C6276O365n5558J2778K3100M1646K512o5439n8318N2244K0949r2748J5116
$$ 36276 42641 -12917 -139 22961 64607 67119 1680 -56638 -4394 16555 -76193 -61077
21231f1077K1908L2464Q9960n8930j35261l4013R204M4568M1214J6709N1439j5487
$$ -61077 -39169 -6705 83255 24325 -110936 -144949 -135745 -91177 -49963 -33254 18185 2698
21219B698j3771N540j494K5018J7313k502n1006J715j2663K0504K14k7J939L5450
$$ 2698 -11073 -5533 -7027 17991 35304 32802 -18204 -16489 -29152 -8648 -8434 -8461 -6522 28928
21205B8928M8189O05o4322m3518o0354M7106N150M0440O6926K517n8122p2087
$$ 28928 77117 77722 13400 -30118 -90472 -43366 -38216 2224 69150 71667 13545 -58542
21193e8542K3713N769P565M6627N6479J3587P216M82K1646j5182m3129O144j7689
$$ -58542 -34829 -29060 -21495 25132 81611 95198 102414 102896 124542 109360 66231 72375 54686
21180E4686n5562o0875j8888M8119N5882K615o8862k9657P8866R6474M1569M0887
$$ 54686 -876 -61751 -80639 -32520 23362 25977 -42885 -72542 6324 102798 144367 185254
21168A85254m743j04747l334j2052o2211k5522L7212K4497l5089k9418m0447l5674
$$ 185254 180511 75764 72430 60378 -1833 -27355 9857 34354 -735 -30153 -70600 -106274
21156a06274j8398O2241L7076J7440M0679l225j1626J4748k3427K4400n9480J7519
$$ -106274 -124672 -62431 -25355 -7915 32764 29539 17913 32661 9234 33634 -25846 -8327
21144h327n824l2044J5117N3703k6987o0899m655o4635p073N6474J2775m288m917
$$ -8327 -14151 -46195 -31078 22625 -4362 -65261 -69916 -134551 -141624 -85150 -72375 -76663 -81580
21131h1580N4860P7481J6351j01556R956M1154n7895n15r643m2885M0444Q9476
$$ -81580 -26720 50761 67112 -34444 -24488 16666 -41229 -41744 -51387 -94272 -53828 35648
21119C5648O6106l8167m4085l9343l9368L9612O1600Q012J3121n8249p6768j5191
$$ 35648 101754 63587 19502 -19841 -59209 -19597 42003 50015 63136 4887 -71881 -87072
21107h7072M776j4486m2051M3513P9400P8800O9325J8186K7056q6753p4624l6113
$$ -87072 -82296 -96782 -138833 -95320 -15920 62880 132205 150391 177447 90694 16070 -20043
21095b0043J9731l2775j5533l1409j3322j4539P4768K3844j4203k555M691O6239
$$ -20043 -312 -33087 -48620 -80029 -93351 -107890 -33122 -9278 -23481 -26036 -21345 44894
21083D4894m6677l7671j3726L4530M7513M7291Q481L329j4254n3263j25937L1450
$$ 44894 -1783 -39454 -53180 -18650 28863 76154 84635 87964 73710 20447 -105490 -74040
21071g4040m5276p912p239O3205K6147K9641k3061l1988j2876k0913M0283M5698
$$ -74040 -119316 -127228 -134467 -71262 -45115 -15474 -38535 -70523 -83399 -104312 -64029 -18331
21059a8331m4505n6419l5019l750K376K5973J9966K8041K7965m4578K5518k9278
$$ -18331 -62836 -119255 -154274 -158024 -155648 -129675 -109709 -81668 -53703 -98281 -72763 -102041
21047a02041n4507K8037J05598J2933n8955p7249j5226j3100n600j175K4746n1605
$$ -102041 -156548 -128511 -22913 -9980 -68935 -146184 -161410 -174510 -180110 -181285 -156539 -208144
21035b08144j6236Q0701Q2561O5937N6086J5507r4879P2342L0703o3737j9244
$$ -208144 -224380 -143679 -61118 4819 60905 76412 -18467 53875 84578 20841 1597
21024A597J5360M5656l2228Q111q4989m6130l4851L5697J9014R3101N3579l6909
$$ 1597 16957 62613 30385 38496 -46493 -92623 -127474 -91777 -72763 20338 73917 37008
21012C7008k7517P7371O6899k8735l3268l8144K8271L6564K5665o2286j3336J1214
$$ 37008 9491 86862 153761 125026 91758 53614 81885 118449 144114 81828 68492 79706
21000G9706j6415K8550m2358m9180n4610M6537P4136M6127l9591l0307j6614j2066
$$ 79706 63291 91841 49483 303 -54307 -7770 66366 112493 72902 42595 25981 13915
20988A3915M0179K13j0615m2312o1696J6823m4597l607J07782M9813L4326J433
$$ 13915 54094 54307 43692 1380 -60316 -43493 -88090 -91697 16085 65898 100224 101657
20976A01657K41p0734m4704K6493L9214l5848p733M6614k9909k9198K9901O0044
$$ 101657 101898 31164 -13540 12953 52167 16319 8586 55200 25291 -3907 25994 86038
20964H6038p8179l9758j7600N1034L295q621P8255J899O018n4018k5539m1711
$$ 86038 7859 -31899 -49499 1535 4830 -3791 74464 76363 82381 28363 2824 -38887
20952c8887j97P38k6285L9101M6403m1174k0639O6568M1032p5017K684J5235o6419
$$ -38887 -39084 -38346 -64631 -25530 20873 -20301 -40940 25628 66660 -8357 -5673 9562 -56857
20939e6857n0534N7326L6581k7660l136L0427l0165j1397N571R179O3657k76j5639
$$ -56857 -107391 -50065 -13484 -41144 -44280 -13853 -44018 -55415 -49844 -40665 22992 22716 7077
20926G077Q7660K3564n464M0670K7596l6010q2738K6692M6159j9832m1175j9750
$$ 7077 94737 118301 112837 153507 181103 145093 62355 89047 135206 115374 74199 54449
20914E4449p7K0049o5888o5926K1637q852o2217O67J5134k0160K4181O3031k3534
$$ 54449 54372 74421 8533 -57393 -35756 -44608 -106825 -106158 -91024 -111184 -87003 -23972 -47506
20901d7506l0642Q573l9117J13625N2727q7165q662Q2781J4445m5015l9698k1329
$$ -47506 -78148 -69575 -108692 4933 57660 -29505 -38167 44614 59059 14044 -25654 -46983
20889d6983o506j337O5012K5579m2118K6359L5191N9707l8961n0089n3269o9885
$$ -46983 -53489 -54826 10186 35765 -6353 20006 55197 114904 75943 25854 -27415 -97300
20877i7300j942L3293N0347J5743O664j231J183O365n488k0092k1193K0382M5016
$$ -97300 -99242 -65949 -15602 141 6805 5574 6757 13122 7634 -12458 -33651 -13269 31747
20864C1747K6150m694m2742L039j1479n1625m9701M3612L1212K5106k6326o2419
$$ 31747 57897 53203 10461 13500 2021 -49604 -99305 -55693 -24481 625 -25701 -88120
20852h8120M05k2577L6730M8551P4401O2336M7208J9346J7908Q265p1564p7265
$$ -88120 -87715 -110292 -73562 -25011 49390 111726 158934 178280 196188 204453 132889 55624
20840E5624k2632l6050k2771J8765l2126P153N6921k9184k9734m3829K7437P1906
$$ 55624 32992 -3058 -25829 -7064 -39190 -32037 24884 -4300 -34034 -77863 -50426 21480
20828B1480p9444M5601J1305J1219O0647L5189m0950l3687p542k3032m2298J6828
$$ 21480 -57964 -12363 -1058 10161 70808 105997 65047 31360 23818 786 -41512 -24684
20816b4684M8115k1816m0770Q2100N0574J254l7723J5346m8017L0583K2095o6040
$$ -24684 23431 1615 -39155 42945 93519 94773 57050 72396 24379 54962 77057 11017
20804A1017O9920N7644o0067k8376L3100l2677n7036l9613m8008k4615O3263N9322
$$ 11017 80937 138581 78514 50138 83238 50561 -6475 -46088 -94096 -118711 -55448 3874
20792C874P4537k8749r6182q7846K8343J3689J1602J6048J4647K0509P453J362
$$ 3874 78411 49662 -46520 -134366 -106023 -92334 -80732 -64684 -50037 -29528 -22075 -20713
20780b0713L4774r166l8728O9489M4387l4940q8053k5880j2827j8973L8383M7307
$$ -20713 14061 4895 -33833 35656 80043 45103 -42950 -68830 -81657 -100630 -62247 -14940
20768a4940P6471m0147k3797L8650K7648N952m4104l1400l9410l7492m7489N7894
$$ -14940 61531 21384 -2413 36237 63885 69837 25733 -5667 -45077 -82569 -130058 -72164
20756g2164L8149N9345K3193m5512L2908K8951j4652k7682M5085j9930n8856L0294
$$ -72164 -34015 25330 48523 3011 35919 64870 50218 22536 67621 47691 -11165 19129
20744A9129k1046k2276J00429k1636l0964L0735m5358o681N724k467k8682K7730
$$ 19129 -1917 -24193 76236 54600 23636 54371 9013 2332 8056 5589 -23093 4637
20732D637o520J0222L9645K2819m172R910m8145K2199k8273J420l5281J7441J8408
$$ 4637 -1883 8339 47984 70803 66631 76541 28396 50595 22322 23742 -11539 5902 24310
20719B4310o0570r341n5267o724J924m871m539L0248Q7731J09036n5091r4073
$$ 24310 -36260 -45601 -100868 -107592 -105668 -110539 -115078 -84830 2901 111937 56846 -37227
20707c7227K1272m6481L1855L7072m6880k2254l1192L7712j521o3786k085O6493
$$ -37227 -15955 -62436 -30581 6491 -40389 -62643 -93835 -56123 -57644 -121430 -123515 -57022
20695e7022O3255K0673L6481l1809j7098J644L8944J4832n3033j9976m7082M0469
$$ -57022 6233 26906 63387 31578 14480 16124 55068 69900 16867 -3109 -50191 -9722
20683i722N296l5146M5494Q4132K7922J455l312j2816N0809k4650r0943j2707
$$ -9722 -4426 -39572 5922 90054 117976 119431 116119 103303 154112 129462 38519 25812
20671B5812j6099O8293N4845P892k7552l6018j280J3932M5092M4808o273j5287
$$ 25812 9713 78006 132851 140743 113191 77173 75893 89825 134917 179725 173452 158165
20659A58165q757q7410p1969j2909k5191P2593o955l174K8159o738l1826K1607
$$ 158165 149408 61998 -9971 -22880 -48071 24522 17567 14393 42552 35814 3988 25595
20647B5595P1261k5316j05374k1799P8656L9671O117K2632L9273K6612K6855J8774
$$ 25595 96856 71540 -33834 -55633 23023 62694 68811 91443 130716 157328 184183 202957
20635B02957Q3808j1838Q952M9441j7155p8231p1414j2648o0934o9026m6977p700
$$ 202957 286765 274927 283879 333320 316165 237934 166520 153872 92938 23912 -23065 -30765
20623c0765L8233M7157j2146n688L5747L133k0756R538j5869k4961l4878l9631
$$ -30765 7468 54625 42479 36791 72538 75671 54915 64453 48584 23623 -11255 -50886
20611e0886L4802J184m5825K2331L3280P8806J1251P2461M0081L9458O7184l7561
$$ -50886 -16084 -14900 -60725 -38394 -5114 73692 84943 157404 197485 236943 304127 266566
20599B66566M282n095o2536n4433k9540j6440p1090l4264M07Q4707O462j3506
$$ 266566 270848 265753 203217 148784 119244 102804 31714 -2550 -2143 82564 89026 75520
20587G5520M7310m3498l9889j7973m6825N999J7003J5361j018l540n7849J1134
$$ 75520 122830 79332 39443 21470 -25355 -19356 -2353 13008 11990 8450 -49399 -38265
20575c8265J08441N8227j2481j2002L0219K8007k0870m4883j0408M7193P972r004
$$ -38265 70176 128403 115922 103920 134139 162146 141276 96393 85985 133178 141150 132146
20563A32146n150q2061k733J1485O2210O624n4619p9451l9082M5643M6327M9970
$$ 132146 126996 44935 42202 53687 115897 122521 67902 -11549 -50631 -4988 41339 91309
20551I1309n0783n9142m377N1748O4148O2295O776L8936l4789j8457L1994O0351
$$ 91309 40526 -18616 -22993 28755 92903 155198 161974 200910 166121 147664 179658 240009
20539B40009n322K0248M3645J12317J74505K26158K36706K66842K21097J77909
$$ 240009 234687 254935 298580 410897 585402 811560 1048266 1315108 1536205 1714114
20529A714114Q5999j8505k03572l66452k99666k41480j65315o7239p4729r3052
$$ 1714114 1800113 1781608 1578036 1211584 911918 670438 505123 437884 363155 270103
20519B70103n5311o7583n2327J5445k6774L8318J7321L4921J4983m5490k0444
$$ 270103 214792 147209 94882 110327 83553 121871 139192 174113 189096 143606 123162
20508A23162P03o4974k1886K0702J928k0283k9080o803J03098M0877o0056j7952
$$ 123162 123865 58891 37005 57707 59635 39352 10272 3469 106567 147444 87388 69436
20496F9436J8618o7899Q932N0611K4652K6558l8538m7353J014L0911l765m1752
$$ 69436 88054 20155 29087 79698 104350 130908 92370 45017 46031 76942 73177 31425
20484C1425k4291M8098J5896k046o8174n8942M5388M6002N4533Q677J2552O473
$$ 31425 7134 55232 71128 69082 908 -58034 -12646 33356 87889 96566 109118 115591
20472A15591o6453J2639k6324l1491N4309q965n6014M9773L6513l1973j1688P9077
$$ 115591 49138 61777 35453 3962 58271 49306 -6708 43065 79578 47605 35917 114994
20460A14994O8399q7882m0858J4054l0199o991R959O0057L2957n7360m2894L415
$$ 114994 183393 95511 54653 68707 38508 31517 41476 101533 134490 77130 34236 37651
20448C7651l5928K9958L6002n1798m624J5306J9722J4566p514M56j2324N4464
$$ 37651 1723 31681 67683 15885 11261 26567 46289 60855 53341 53797 41473 95937
20436I5937L3304O03n9665p4646R666K6767l4957k1321K6955M5949j2216P354
$$ 95937 129241 129844 70179 -4467 5199 31966 -2991 -24312 2643 48592 36376 43730
20424D3730j1753N897p8772r8261k3963m967O1938P4279J4685k487M3657J7895
$$ 43730 31977 37874 -40898 -139159 -163122 -168089 -106151 -31872 -17187 -19674 23983 41878
20412D1878o6306m438P4837q6256p9093R2537P774k9426M0551N5841j7759j0076
$$ 41878 -24428 -28866 45971 -40285 -119378 -26841 -19067 -48493 -7942 47899 30140 20064
20400B0064n6667K0821J0048J4158O9794N243m4064K0047K9947k3287k4294l3493
$$ 20064 -36603 -15782 -5734 8424 78218 83461 39397 59444 89391 66104 41810 8317
20388H317j5731L5211J5472Q803o1703m4632j1946j878P3767J3192j00001j00010
$$ 8317 -7414 27797 43269 52072 -9631 -54263 -66209 -68087 5680 18872 -81129 -181139
20376a81139J8416O7113O9358K2797K1820J3777J6106K828m5216Q6180P2584m3293
$$ -181139 -162723 -95610 -26252 -3455 18365 32142 48248 51076 5860 92040 164624 121331
20364A21331m7337o856n1930k057L2118K0917j9780L29J2076J1481k8784k9377
$$ 121331 73994 67138 15208 13151 45269 66186 46406 46735 58811 70292 41508 12131
20352A2131o8273L1094L5953n0789m7283K3637K2198K5552m2543K0756N3698N5952
$$ 12131 -56142 -25048 10905 -39884 -87167 -63530 -41332 -15780 -58323 -37567 16131 72083
20340G2083K5992l7336L2799N0120J4166m316K1278p7791r628N785L1491M5901
$$ 72083 98075 60739 93538 143658 157824 153508 174786 96995 87367 93152 124643 170544
20328A70544K9630k7019K9591p655O8646J6888M2905M1051M784N6612j6343k2196
$$ 170544 200174 173155 202746 195091 263737 280625 323530 364581 369365 425977 409634 387438
20316C87438l5214o6870k6690n2950r8628l7601J0036P4596l5241k8685j5539
$$ 387438 352224 285354 258664 205714 107086 69485 79521 154117 118876 90191 74652
20305G4652J1326N9238j8338k3361K821j4235M260J6175J4434k1839p4022k7756
$$ 74652 85978 145216 126878 103517 106338 92103 96363 112538 126972 105133 31111 3355
20293C355p498L7196o505n491M7314K0401Q1578N8930K4038j223L487k7950o0842
$$ 3355 -4143 33053 26548 21057 68371 88772 170350 229280 253318 252095 255582 227632 166790
20280A66790l8009q3036J3869Q9001N5928m8307n2202l7615J39258J13692k9382
$$ 166790 128781 45745 59614 148615 204543 156236 104034 66419 205677 319369 289987
20269B89987O610N1407L706n2173k2695q4748o3387J9442O945m21L7897j9845
$$ 289987 296597 348004 351710 299537 276842 192094 128707 148149 155094 154673 192570 172725
20257A72725M0534o471l8536K0582J005R818P406M0058q357o2044o5290k3844
$$ 172725 213259 206788 168252 188834 189839 199657 207063 247121 238764 176720 111430 87586
20245H7586O223N5972J24790J29529L3579j8192l4698p2632r0915k6594L3146
$$ 87586 93809 149781 274571 404100 437679 419487 384789 312157 221242 194648 227794
20234B27794L1511j9963l0075l7219p048j2810K5413K3922k323M8148Q865j6583
$$ 227794 259305 239342 209267 172048 165000 152190 177603 201525 199202 247350 256215 239632
20222B39632r494k5931J2140o8920p5218J8134k9687K4903r385O5713O0761p103
$$ 239632 230138 204207 216347 147427 72209 90343 60656 85559 76174 141887 202648 195545
20210A95545j0490k1983l4511K7224k7378L908P5259L2901m1181k17j1427m6118
$$ 195545 185055 163072 128561 155785 128407 132315 207574 240475 199294 199077 187650 141532
20198A41532K6002O6329Q0228J00416J62609N4514j1368p943j22541o2312j5343
$$ 141532 167534 233863 314091 414507 577116 631630 620262 612319 489778 427466 412123
20187D12123p475j3943j1955j7887m6264m4249j4451K6161K8688O727o3954p041
$$ 412123 404648 390705 378750 360863 314599 270350 255899 282060 310748 317475 253521 246480
20175B46480L07N9620M5955j8288j8512l5821m1814J0879n5560J6278R9137O3316
$$ 246480 246787 306407 352362 334074 315562 279741 237927 248806 193246 209524 308661 371977
20163C71977L6873Q9921o176L0427q8423p2142J07519M1326k3109K9991L0237
$$ 371977 408850 498771 492595 523022 434599 362457 469976 511302 488193 518184 548421
20152E48421j4724l1267m6154m5744K5610R001O2013R0131l297j5338M3107m9805
$$ 548421 533697 502430 456276 410532 436142 445143 507156 597287 593990 578652 621759 571954
20140E71954K6670R0488J5766Q6117k9861j5486k4691k1197N0151p705N9188K0888
$$ 571954 598624 689112 704878 790995 761134 745648 720957 699760 749911 742206 801394 822282
20128H22282L8666M4027J00324O4999l1184j6754k2102J00933M5009O1061L1387
$$ 822282 860948 904975 1005299 1070298 1039114 1022360 1000258 1101191 1146200 1207261 1238648
20117A238648L4422M8820P372L9354N3142J38632P8646Q1312o152J08915J81724
$$ 1238648 1273070 1321890 1329262 1368616 1421758 1560390 1639036 1720348 1714196 1823111 2004835
20106B004835J01917J07877J24048J00664J65790J77428K13519K29577R4179J83767
$$ 2004835 2106752 2214629 2338677 2439341 2605131 2782559 2996078 3225655 3319834 3503601
20096C503601K89113L22536M18652L92715L71748M17888M62503N44760O48594
$$ 3503601 3792714 4115250 4533902 4926617 5298365 5716253 6178756 6723516 7372110
20087G372110O98769Q20391R91397J173087J288663J606659J880110K194671K709541
$$ 7372110 8070879 8891270 9882667 11055754 12344417 13951076 15831186 18025857 20735398
20078B0735398L351770M322864N616407Q020711J2212567J8982855K9360122M2564273
$$ 20735398 24087168 28410032 34026439 42047150 54259717 73242572 102602694 145166967
20070A45166967N4586191N9184246N2535690L8156562K2972060J905001n4401555
$$ 145166967 199753158 258937404 311473094 349629656 372601716 374506717 320105162
20063C20105162r1738138p1493241m5294928k8161343j8239382j2364027q568396
$$ 320105162 228367024 156873783 111578855 83417512 65178130 52814103 44245707
20056D4245707o225998m743882l644540k909667k629645k392256k238635j930935
$$ 44245707 38019709 33275827 29631287 26721620 24091975 21699719 19461084 17530149
20048A7530149j616112j366149j113894r98507q80432p49805o44133n59502n35698
$$ 17530149 15914037 14547888 13433994 12435487 11555055 10805250 10161117 9601615 9065917
20039I065917m12423l99319m58133l45233k29383l08902l19701l26301l10800
$$ 9065917 8653494 8254175 7796042 7450809 7221426 6912524 6592823 6266522 5955722
20030E955722k08631k20136k54734k67123k21061j72969o5072j90643k25589j40398
$$ 5955722 5747091 5526955 5272221 5005098 4784037 4611068 4545996 4355353 4129764 3989366
20020C989366p2648j39298j10884p5019q7887r4592p9868r7196j10278r973j14926
$$ 3989366 3916718 3777420 3666536 3591517 3503630 3409038 3329170 3231974 3121696 3111723 2996797
20009B996797j26469r8557j37129p1353p950q5264l5837n3158j33949j73333j33082
$$ 2996797 2870328 2771771 2634642 2563289 2555339 2470075 2434238 2381080 2247131 2073798 1940716
19998A940716k2109k1049m5858j17486l1124J4509l4270j13622q371M0855j3825
$$ 1940716 1918607 1897558 1851700 1734214 1703090 1717599 1683329 1569707 1561336 1602191 1588366
19987A588366j16233n0229j0045l3470J2528o4173j11245L6534o5722k4411m5155
$$ 1588366 1472133 1421904 1411859 1378389 1390917 1326744 1215499 1252033 1186311 1161900 1116745
19976A116745l7843n0045p5368k7735J183M3405O2960l9863p4610N261k7038k8004
$$ 1116745 1078902 1028857 953489 925754 926937 970342 1033302 993439 918829 924090 897052 869048
19964H69048k6213l2404K720J0404m6730l6927P090o5766k7324P0119N5620m3658
$$ 869048 842835 810431 813151 823555 776825 739898 746988 681222 653898 724017 779637 735979
19952G35979r2280n5061J0160N1386l9047N2418O2215n7480L2709P9898M3285
$$ 735979 643699 588638 598798 650184 611137 663555 725770 668290 700999 780897 824182
19941H24182K5536J36410j6770j23774j16431j18204j01959q349n565j0304l4091
$$ 824182 849718 986128 969358 845584 729153 610949 508990 500641 495076 484772 450681
19930D50681M7494M3082o17m4773m8114j4969J2357j8113k5419J1995L0265r4475
$$ 450681 498175 541257 540640 495867 447753 432784 445141 427028 401609 413604 443869 349394
19918C49394r721O7277n7356n3362K8387j5109m5212l6753n5871m0957M6529j0654
$$ 349394 339673 406950 349594 296232 324619 309510 264298 227545 171674 130717 177246 166592
19906A66592N9284R1846K4703O4788M5846P460k1878J0951k4038m5032k2544j5066
$$ 166592 225876 317722 342425 407213 453059 460519 438641 449592 425554 380522 357978 342912
19894C42912k2114R151o1976J550J03400j875n5646j3647m8147l5556r3140n5459
$$ 342912 320798 329949 267973 269523 372923 371048 315402 301755 253608 218052 124912 69453
19882F9453L9709L0430P226k5472k7794J9567l204K0083O0330j9938m5121k6694
$$ 69453 109162 139592 146818 121346 93552 113119 109915 129998 190328 170390 125269 98575
19870I8575K9235n0241j4379j8287n5537m955Q8938O7626m7463N5168K3655j4052
$$ 98575 127810 77569 63190 44903 -10634 -15589 73349 140975 93512 148680 172335 158283
19858A58283m2389m5602O2360j1532l4037o656k2329K0709J0422N146K1172k1967
$$ 158283 115894 70292 132652 121120 87083 80427 58098 78807 89229 94375 115547 93580
19846I3580n6409n5191M5304l635j7341l2328K0276M6012K9767J1277j3552k3884
$$ 93580 37171 -18020 27284 23649 6308 -26020 -5744 40268 70035 81312 67760 43876
19834D3876J6499L5271K4650N346J677N459N3169K2481n8964j09004n1615N2722
$$ 43876 60375 95646 120296 125642 127319 132778 185947 208428 149464 40460 -11155 41567
19822D1567M7186P6207O377N490J597o7029n3535j4308M6622J08530P7151n0550
$$ 41567 88753 164960 171337 176827 178424 111395 57860 43552 90174 198704 275855 225305
19810B25305j07743m9967K0083j0552l394k4274n3888L6628N7927L5147K504j9390
$$ 225305 117562 67595 87678 77126 73732 49458 -4430 32198 90125 125272 127776 108386
19798A08386J4457K2953k6410k2130K2015M3824j1266l4467K5285q2124l0651
$$ 108386 122843 145796 119386 97256 119271 163095 151829 117362 142647 60523 29872
19787B9872K8078K9497L242n0498k7854m701J4506N6312K8989m5160R574j4378
$$ 29872 57950 87447 90689 40191 12337 7636 22142 78454 107443 62283 71857 57479
19775E7479q0377J1015L9666N1382l7400J3363m7682m037j06572o7700J5034Q705
$$ 57479 -22898 -11883 27783 79165 41765 55128 7446 3409 -103163 -170863 -155829 -147124
19763a47124R2621L8389j6393K7268L1366j2792Q7059J04723j9986o4381m191
$$ -147124 -54503 -16114 -32507 -5239 26127 13335 100394 205117 185131 120750 116559
19752A16559k1888l2057L130l521n333k1094l4054k5783M8966O7508O0519j9778
$$ 116559 94671 62614 65744 62223 56890 35796 1742 -24041 24925 92433 152952 133174
19740A33174m000j1061J6312p141N0149o0098o0567p065n951o5429K3465K1329
$$ 133174 129174 118113 134425 127284 177433 117335 56768 49703 43752 -21677 1788 23117
19728B3117m1603J9847K5137l2782m6208k8283K1552M7356Q9855N9425J0028p4728
$$ 23117 -18486 1361 26498 -6284 -52492 -80775 -59223 -11867 77988 137413 147441 72713
19716G2713j07760m4380l7506J4382n0972n2405j7509P6030O6005n4855j1955
$$ 72713 -35047 -79427 -116933 -102551 -153523 -205928 -223437 -147407 -81402 -136257 -148212
19705a48212R7332O9734Q3624N7396M9067k7309j7265J804L6146N3639m3943O227
$$ -148212 -50880 18854 102478 159874 208941 181632 164367 166171 202317 255956 212013 218240
19693B18240J9515p2896j2243l8618K8982N0599k8317Q1870L3786R879K2166r1300
$$ 218240 237755 164859 152616 113998 142980 193579 165262 247132 280918 290797 312963 221663
19681B21663j48790j0995O7043M0658J4884J4406J0051k0043m4911O484L6846
$$ 221663 72873 61878 128921 169579 184463 198869 208920 188877 143966 150450 187296
19670A87296L1016q067k8974n420L2464N4384J0217M562l102k161M9925K2652
$$ 187296 218312 210245 181271 175851 208315 262699 272916 277478 274376 272215 322140 344792
19658C44792p3979J4009p260Q2802O2630k5362M2065Q4349K9788k7176n4622p9670
$$ 344792 270813 284822 277562 360364 422994 397632 439697 524046 553834 526658 472036 392366
19646C92366j45832j25176l0779M2061p087K3332o1455N0299m4985N5942j4540
$$ 392366 246534 121358 90579 132640 125553 148885 87430 137729 92744 148686 134146
19635A34146k1459R569m8815L7054J03959l1351j7278M1531m3107m7365L9923
$$ 134146 112687 122256 73441 110495 214454 183103 165825 207356 164249 116884 156807
19624A56807L3037o4118J6140K5759j0140K094K1544J0771N7168k680j2890K0608
$$ 156807 189844 125726 141866 167625 157485 159579 181123 191894 249062 246382 233492 254100
19612B54100n5668R111N3277N0778j0953P021k0993J04902O2802K6628P7709J64695
$$ 254100 198432 207543 260820 311598 300645 307666 286673 391575 454377 481005 558714 723409
19600G23409J71528K15210L84105K94240Q6318Q8291L588o0286l13490m33495
$$ 723409 894937 1110147 1494252 1788492 1874810 1963101 1966689 1906403 1592913 1159418
19590A159418l36374j68270j07286J060m6815r8709q4040j07449J4452K6804N5554
$$ 1159418 823044 654774 547488 548548 501733 403024 318984 211535 225987 252791 308345
19579C08345q3119n1854p392M756M5255l010n8573n1355R343J0765J4527M5788
$$ 308345 225226 173372 165980 170736 215991 212981 154408 103053 112396 123161 137688 183476
19567A83476L2965m5289L7250j6778k1150k7613j5143n361L6963K5294r024K8488
$$ 183476 216441 171152 208402 191624 170474 142861 127718 122357 159320 184614 175590 204078
19555B04078J10988K7952r0539r3319k6561r181o5913n549J2384O1288K6185l7125
$$ 204078 315066 343018 252479 159160 132599 123418 57505 51956 64340 125628 151813 114688
19543A14688n8256N937K3959j7926N5305N7620N4102K2594m2178k4917M0734J1045
$$ 114688 56432 62369 86328 68402 123707 181327 235429 258023 215845 190928 231662 242707
19531B42707m6360L4778K2886m4747L373J20114J75815O8008L3576O0116J0148
$$ 242707 196347 231125 254011 209264 212637 332751 508566 576574 610150 670266 680414
19520F80414m4912j06428j07044o0254L3219P9776l2786p5119n8171q1425k9602
$$ 680414 635502 529074 422030 361776 394995 474771 441985 366866 308695 227270 197668
19509A97668n7523O9445Q6341L2861j917o3935L269P9352K9160O6344M7256k846
$$ 197668 140145 209590 295931 328792 326875 262940 266209 345561 374721 441065 488321 485475
19497D85475l0839k0870k788j1547J0354L6141j4491p0574K071N4243L2550K8327
$$ 485475 454636 433766 430978 419431 429785 465926 451435 380861 382932 437175 469725 498052
19485D98052M5106J9988j4051k7140J3023K1619j0962m9595K0750N3870K2332
$$ 498052 543158 563146 549095 521955 534978 556597 545635 496040 516790 570660 592992
19474E92992q0497P775M7078j3958M5439J13522K5643N9024O1601k6215N5106
$$ 592992 512495 520270 567348 553390 598829 712351 737994 797018 858619 832404 887510
19463H87510n103m0235L3782L1552k7315k5737R6038P4200J1452m4004J6k7314
$$ 887510 882407 842172 875954 907506 880191 854454 950492 1024692 1036144 992140 992156 964842
19451I64842L0087O8541R1606R1224Q3744r896J04622Q7248J01164N2194L4662
$$ 964842 994929 1063470 1155076 1246300 1330044 1320148 1424770 1512018 1613182 1665376 1700038
19440A700038N9396M1667R6968J37835J29231R3782N6392J45497R8701J13100
$$ 1700038 1759434 1801101 1898069 2035904 2165135 2258917 2315309 2460806 2559507 2672607
19430B672607J62510J90432K06523K74406K84952L20433L55397L57173M02613
$$ 2672607 2835117 3025549 3232072 3506478 3791430 4111863 4467260 4824433 5227046
19421E227046M15516M43018N95268O13033P33260P82934R13899J093504J389558
$$ 5227046 5642562 6085580 6680848 7293881 8027141 8810075 9723974 10817478 12207036
19412A2207036J714673K080545K677567L342038M350200N774967P988694J1748048
$$ 12207036 13921709 16002254 18679821 22021859 26372059 32147026 40135720 51883768
19404E1883768J8082589K8173510M2369176N7663714O7807321O5783936N1364207
$$ 51883768 69966357 98139867 140509043 198172757 265980078 331764014 383128221
19397C83128221L3272853J3220600l8421855r6631613r3394303o2035879l7933811
$$ 383128221 416401074 429621674 391199819 294568206 201173903 139138024 101204213
19390A01204213k3843472j5880206j1107798p928910n824110m674118l712928
$$ 101204213 77360741 61480535 50372737 42443827 36619717 31945599 28232671
19383B8232671k928911k418462k073737j798278j552194j360167j205812j057676
$$ 28232671 25303760 22885298 20811561 19013283 17461089 16100922 14895110 13837434
19375A3837434r27931p13666o60457o19975m32103m40706m03692l70588k30423
$$ 13837434 12909503 12195837 11535380 10915405 10483302 10042596 9638904 9268316 9037893
19366I037893k08220j39395j79691j60601j84540j14252j69745k46835k24050
$$ 9037893 8829673 8690278 8510587 8349986 8165446 8051194 7881449 7634614 7410564
19357G410564l14508l84153l64366l80399l09142k89425k12869k88312k83661
$$ 7410564 7096056 6711903 6347537 5967138 5657996 5368571 5155702 4867390 4583729
19348D583729k23599j90192k14020j64285j84402j44383l4832q5246j34078j80508
$$ 4583729 4360130 4169938 3955918 3791633 3607231 3462848 3428016 3342770 3208692 3028184
19338C028184j65314r1216j05061o4404m5707j32569j06431n2612k3030p4922
$$ 3028184 2862870 2771654 2666593 2602189 2556482 2423913 2317482 2264870 2241840 2166918
19328B166918l3041m4617P143J2489m0067o5113n9493o8428p8044r8292l4377
$$ 2166918 2133877 2089260 2096403 2108892 2068825 2003712 1944219 1875791 1797747 1699455 1665078
19317A665078m260N6666r0081p4953o3838k2812l0711m2020q33O5936j1825p1226
$$ 1665078 1660818 1717484 1627403 1552450 1488612 1465800 1435089 1393069 1392236 1458172 1446347 1375121
19305A375121j04398m6286j2524p6307m2317R606j4588k876m046o3167r0645J1008
$$ 1375121 1270723 1224437 1211913 1135606 1093289 1102895 1088307 1085431 1081385 1018218 927573 938581
19293I38581j9910k1815m0244l1861m0698J0855j7j0379m1949p0917j32980j1048
$$ 938581 918671 896856 856612 824751 784053 794908 794891 784512 742563 671646 538666 527618
19281E27618N6459Q143l3341Q6845O3550L0184m5790M9932R3335M8363J06854
$$ 527618 584077 592220 558879 645724 709274 739458 693668 743600 836935 885298 992152
19270I92152j395k856j7356j18894j25362j35300q7922n1963J3830N9238j7986
$$ 992152 990757 987901 970545 851651 726289 590989 503067 451104 464934 524172 506186
19259E06186l1580j9562K1115j7028m1719O721N518O448L016l1668n3416r75l2851
$$ 506186 474606 455044 476159 459131 417412 424133 429651 436099 439115 407447 354031 353056 320205
19246C20205k4810j9313k8817K8433k400o3686J2535j3973l2177p7545L411k514
$$ 320205 295395 276082 247265 275698 273298 209612 222147 208174 175997 98452 101863 99349
19234I9349N2931j81R2865Q6307J3138J7694j2191j6406m1705l2309R536R531
$$ 99349 152280 152099 244964 331271 344409 362103 349912 333506 291801 259492 269028 278559
19222B78559L8349L0229K3801n2279j7665r0196k4540L7667j6983o4191q6360
$$ 278559 316908 347137 370938 318659 300994 210798 186258 223925 206942 142751 56391
19211E6391l9755L1787Q8404P5571p2579p3150j5543M1233o0918l0651P4341M4038
$$ 56391 16636 48423 136827 212398 139819 66669 51126 92359 31441 790 75131 119169
19199A19169k0675J4883L3873N3759O149o3271n5174J7801k7384P0602M8986K2424
$$ 119169 98494 113377 147250 201009 207158 143887 88713 106514 79130 149732 198718 221142
19187B21142k8747q742q76m0969k8184m5192k2759M4468Q8p6063k6796J08450
$$ 221142 192395 183653 182777 141808 113624 68432 45673 90141 90229 14166 -12630 95820
19175I5820Q7693P470j5567J1460j1722n459j9889j055l5657l7954k4932m1458
$$ 95820 183513 190983 175416 186876 175154 169695 149806 148751 113094 75140 50208 8750
19163H750N8798L7945l2351n349l6113m884K5684M3613o966k6420J1456N5500
$$ 8750 67548 105493 73142 67793 31680 26796 52480 96093 89127 62707 74163 129663
19151A29663L9779o7806L5467Q6986O0953L7460m3165k7858K8588J51035J50648
$$ 129663 169442 101636 137103 224089 285042 322502 279337 251479 280067 431102 581750
19140E81750K45598K30497J96997J52225P0695K3775k39032m46750k89528q1534
$$ 581750 827348 1057845 1254842 1407067 1477762 1501537 1262505 815755 526227 444693
19130D44693r5547n5061n9002p430l5566k999l8014m9672M0329Q2899L1719r052
$$ 444693 349146 294085 235083 227653 192087 189088 151074 101402 141731 224630 256349 247297
19118B47297l2897j2353M5237O88l1308O6578M6015k5769J7133R5075J35710K36640
$$ 247297 214400 202047 247284 247972 216664 283242 329257 303488 320621 415696 551406 788046
19106G88046K24805J52330J65498J29723l89j74719m00671l07796j43398l7791
$$ 788046 1012851 1165181 1330679 1460402 1460013 1285294 884623 576827 433429 395638
19096C95638m870o0530j04706L1659r774M3679M043k190L3287M5903P1009Q7413
$$ 395638 390768 330238 225532 257191 247417 291096 295139 292949 326236 372139 443148 530561
19084E30561Q7417o9450n5480j22558n2109P3590Q1454P0295l388m3402n2404
$$ 530561 617978 548528 493048 370490 318381 391971 473425 543720 540332 496930 444526
19073D44526l4704Q856j6368n7421M6376R6751N4940J2000k1327J5945J9798k9132
$$ 444526 409822 418678 402310 344889 391265 488016 542956 554956 533629 549574 569372 540240
19061E40240r3764m1620P1367J1424J5642m5491n6671N1349p397l5546Q303J7856
$$ 540240 446476 404856 476223 487647 503289 457798 401127 452476 445079 409533 417836 435692
19049D35692O4845K7472j7683J2250j3430Q2505J2613j2454K385n5307o575J299
$$ 435692 500537 528009 510326 522576 509146 591651 604264 591810 594195 538888 532313 533612
19037E33612K4022k6261o2847l826J4200O1717J8384O4317k368L0049Q780l6991
$$ 533612 557634 531373 468526 464700 478900 540617 559001 623318 620950 650999 659779 622788
19025F22788k9421N1768P0813K4537r9514K0144L8712o127Q333K6025K8859p4968
$$ 622788 593367 645135 715948 740485 640971 661115 699827 693700 702033 728058 756917 681949
19013F81949m4076O1151N8204P167M4048j83P9003o5030o2066J7195K0827l6382
$$ 681949 637873 699024 757228 764395 808443 808260 887263 822233 760167 777362 798189 761807
19001G61807O287M1208o2137j24058Q858J5634Q184L8986L8775K9641p9676m4976
$$ 761807 768094 809302 747165 623107 631965 647599 655783 694769 733544 763185 683509 638533
18989F38533p1493l8867L7714K9940K0813J6959J9566L5314J3182N7828P7731
$$ 638533 567040 528173 565887 595827 616640 633599 653165 688479 701661 759489 837220
18978H37220m2631n6415K4509n200P912P817o1176P5072K5123p4016o0575K6094
$$ 837220 794589 738174 762683 757483 765395 773212 712036 787108 812231 738215 677640 703734
18966G03734l8454K4101J7547O620k3178n0304K6091k9047n7027o5850J4770l628
$$ 703734 665280 689381 706928 713548 690370 640066 666157 637110 580083 514233 529003 525375
18954E25375P2130M7257n2896J0975m253k2429M7384k7085m9185L923n1716j9132
$$ 525375 597505 644762 591866 602841 598588 576159 623543 596458 547273 551196 499480 480348
18942D80348r353q6861l1653k6723l1313K0524M0744p275j263o4540Q24O3904
$$ 480348 470995 384134 352481 325758 294445 314969 355713 348438 347175 282635 283459 347363
18930C47363k5219l7848K9129j4559L0148o349n6688l0764K7233j5961j2599M7636
$$ 347363 322144 284296 313425 298866 329014 322665 265977 235213 262446 246485 233886 281522
18918B81522O935J2892L137k8957j3613L0977P6256j2564j00040q2193K7708O5248
$$ 281522 288457 301349 304486 275529 261916 292893 369149 356585 256545 174352 202060 267308
18906B67308l7599j5280J67L0819k5232q2747q122M0256K5023L285k6655j01996
$$ 267308 229709 214429 214596 245415 220183 137436 129314 169570 194593 197878 171223 69227
18894F9227j3287K9530O568l5159L4658L3453k9234j1018J2364N9789J3540l5339
$$ 69227 55940 85470 92038 56879 91537 124990 95756 84738 97102 156891 170431 135092
18882A35092j8806o852n365O0317Q0404k3838l9801m4137p9162m7510P0598p802
$$ 135092 116286 109434 104069 164386 244790 220952 181151 137014 57852 10342 80940 73138
18870G3138n0041k6523P749M879o6587N2147M5505J6240O5646N3304J9102q118
$$ 73138 23097 -3426 4323 9202 -57385 -5238 40267 56507 122153 175457 194559 186441
18858A86441j53570M1204j7861q2677m2716J5180L6093M2895K2708m2723J5033
$$ 186441 32871 74075 56214 -26463 -69179 -53999 -17906 24989 47697 4974 20007
18847B0007K4725J6937J1533k465j811M737j5746j6439O7314O8499j2781o2312
$$ 20007 44732 61669 73202 70737 68926 73663 57917 41478 108792 177291 164510 102198
18835A02198N550J4476j5370k3628N3976l0995J6798O0659l8217o7481p800n1561
$$ 102198 107748 122224 106854 83226 137202 106207 123005 183664 145447 77966 70166 18605
18823A8605l5814J7969j4425q1304o7930Q9679J14455K3500r620o23q265L1528
$$ 18605 -17209 760 -13665 -94969 -162899 -73220 41235 64735 55115 54492 46227 77755
18811G7755J4703n2142l6959L2487p8982k2664O9670P2342l7081P816J3695k065
$$ 77755 92458 40316 3357 35844 -43138 -65802 3868 76210 39129 46945 60640 58575
18799E8575J6583q432P5385J3090n4197Q010J4436k996K0816M6826p3714o1200
$$ 58575 75158 66726 142111 155201 101004 109014 123450 120454 141270 188096 114382 53182
18787E3182K6364K7745k5669k7766p2105N0032O0412L7599R997m6131N6054l7484
$$ 53182 79546 107291 81622 53856 -18249 31783 92195 129794 139791 93660 149714 112230
18775A12230l9940o0186p837P6919o7060m1351M1201N5604j9992j9540o0348L4473
$$ 112230 72290 12104 4267 81186 14126 -27225 13976 69580 49588 30048 -30300 4173
18763D173K6302K0252l3642j9929m4586Q363J9225Q2131k3211n2874l8301K7850
$$ 4173 30475 50727 17085 -2844 -47430 -39067 -19842 62289 39078 -13796 -52097 -24247
18751b4247Q2359K6452r49n4292n2452p5243M3980L1629Q969M6603J7856l6638
$$ -24247 58112 84564 83615 29323 -23129 -98372 -54392 -22763 -13794 32809 50665 14027
18739A4027O8123m6611n127n9349j125M2978k5108j5026K5766l2662q023N6790
$$ 14027 82150 35539 30412 -28937 -30062 12916 -12192 -27218 -1452 -34114 -42137 14653
18727A4653L5557k3243K5687k948J737n9108j11K2202j4015l0493K7052K4593
$$ 14653 50210 26967 52654 49706 51443 -7665 -7776 14426 411 -30082 -3030 21563
18715B1563L5228l0466m1817j7245M8350N6415j036j7604n0815K6409L6199J4255
$$ 21563 56791 26325 -15492 -32737 15613 72028 70992 53388 2573 28982 65181 79436
18703G9436K7775P2127k9984J5626J150k309m2755o4472j158j0780L3553j4023
$$ 79436 107211 179338 149354 164980 166130 163821 121066 56594 55436 44656 78209 64186
18691F4186K3688J1008N4944k6014j7208n7963j4846o888k518J9782l3968j151
$$ 64186 87874 98882 153826 127812 110604 52641 37795 30907 28389 48171 14203 13052
18679A3052l2530M5499N3292K2095R512K009J1061M826J3020P310r6968k2561
$$ 13052 -19478 26021 79313 101408 110920 112929 123990 128816 141836 149146 52178 29617
18667B9617l7447K2739L6212J2413l9099J646R766n714m2477m9877L2771M6192
$$ 29617 -7830 14909 51121 63534 24435 26081 35847 30133 -12344 -62221 -29450 16742
18655A6742L5118O783r537k3844p6533O3163K5517k6417m205j8302p4161M5626
$$ 16742 51860 58643 49106 25262 -51271 11892 37409 10992 6787 -11515 -85676 -40050
18643d0050R5462m5529p0767M3384j9085M9062L3580k9542Q671N9889r856J8684
$$ -40050 55412 9883 -60884 -17500 -36585 12477 46057 16515 25186 85075 75219 93903
18631I3903K1395M0429K5002m8568j00932K6913R271k4971l5723L0668m748k5075
$$ 93903 115298 155727 180729 132161 31229 58142 67413 42442 6719 37387 32639 7564
18619G564P576L3356m7368J3534L5202l098l6528r0387k8148r659N7359M3030
$$ 7564 15140 48496 1128 14662 49864 46766 10238 -80149 -108297 -117956 -60597 -17567
18607a7567O743q753n5514Q098k9982L5538O3533K7037L0500l5189m6950m0451
$$ -17567 -10824 -19577 -75091 -66993 -96975 -61437 2096 29133 59633 24444 -22506 -62957
18595f2957L5226J4332j1329k3462n7263R2616K8679n6599K342L1918N810k1484
$$ -62957 -27731 -13399 -24728 -48190 -105453 -12837 15842 -40757 -38415 -6497 -687 -22171
18583b2171J2058O988j7540M2777k1196j6560O9466L9218l4353l4927L0878M6557
$$ -22171 -10113 -3125 -20665 22112 916 -15644 53822 93040 58687 23760 54638 101195
18571A01195k2735l6951l0067j8075j1565L785K9744j4964L0477J8076o8239k4453
$$ 101195 78460 41509 11442 -6633 -18198 -14413 15331 367 30844 48920 -19319 -43772
18559d3772L0835Q3891k2631q652l103P86l6090Q189l4711K0242O1076J9341j5683
$$ -43772 -12937 70954 48323 39671 36568 37354 1264 9453 -25258 -5016 56060 75401 59718
18546E9718k2222n9983O197m1343P2354J2310k4983K8252M0845K3686J495K0906
$$ 59718 37496 -22487 -16290 -57633 14721 27031 2048 30300 71145 94831 96326 117232
18534A17232j7709l420j7725M6241n9631j36312k8967J20598P3219Q0146Q8965
$$ 117232 99523 96103 78378 124619 64988 -71324 -100291 20307 93526 173672 262637
18523B62637k9687k7467J3546k4431n0437L906n1238k0806P7578N2513k9Q6111
$$ 262637 232950 205483 219029 194598 144161 148067 96829 76023 153601 206114 206085 292196
18511B92196J45798j4009n9248L0026K5338o4091j11591o4875J44342m0556J6813
$$ 292196 437994 423985 364737 394763 420101 356010 244419 179544 323886 283330 300143
18500C00143N7910M9138L4581R545j9712j0424m3519L0444K1068n3171k1362k3121
$$ 300143 358053 407191 441772 451317 431605 421181 377662 408106 429174 376003 354641 331520
18488C31520l2705m2470p5294N0504O1497r1970r387O1792k2765j3372l2471l0594
$$ 331520 298815 256345 181051 231555 293052 201082 191695 253487 230722 217350 184879 154285
18476A54285k2860o092l4295J3098j126m4622q052L7406J8508K6692O648n2752
$$ 154285 131425 125333 91038 104136 103010 58388 50336 87742 106250 132942 139590 86838
18464H6838o6126l3349m492p8728l9772Q7780Q4659O1483O7913J1835l2493L5462
$$ 86838 20712 -12637 -17129 -95857 -135629 -47849 36810 98293 166206 178041 145548 181010
18452A81010m2473k9861j3088m1266k898P5786o6588j12745O230J4579Q7889J766
$$ 181010 138537 108676 95588 54322 51424 127210 60622 -52123 -45893 -31314 56575 58341
18440E8341k2049J4412J6796N68K7359n2420o6597L930p3550l0741K6504M5183
$$ 58341 36292 50704 67500 68068 95427 43007 -23590 -19660 -93210 -123951 -97447 -52264
18428e2264R51k9178O2588O8499q9250j5353N3968J9620J8975n4825j0811n493
$$ -52264 -51313 -80491 -17903 50596 -38654 -54007 -39 19581 38556 -16269 -27080 -32573
18416c2573J4235L8149n8534k7756J4375Q6090Q1829P5916j4302j32088o1194
$$ -32573 -18338 19811 -38723 -66479 -52104 33986 115815 191731 177429 45341 -15853
18405a5853l106R7186J8862O030l2439j1923P7832L3878j4104l6225j6139q0549
$$ -15853 -18959 78227 97089 103119 70680 58757 136589 170467 156363 120138 103999 23450
18393B3450K4494N5417p295k5885l8188n6652J5154L6064m4172L3773l934m3805
$$ 23450 47944 103361 96066 70181 31993 -24659 -9505 26559 -17613 16160 12226 -31579
18381c1579J6012J2529J187p0239j449l7216j1030J6335P6225N3209j8501m0948
$$ -31579 -15567 -3038 -1851 -72090 -73539 -110755 -121785 -105450 -29225 23984 5483 -35465
18369c5465o9244k8637N1131N1995K2939k647K7341N3678R306q481n3130P4572
$$ -35465 -104709 -133346 -82215 -30220 -7281 -9928 17413 71091 80397 71916 18786 93358
18357I3358P5276j9209q7758n1401L113o878J53767N6213k5400j19311n5499L1021
$$ 93358 168634 149425 61667 10266 13379 6501 160268 216481 191081 71770 16271 47292
18345D7292K4427R3131J1985o0905k6961K9263L8992N741j4408p120j292l6171
$$ 47292 71719 164850 176835 115930 88969 118232 157224 162965 148557 141437 140145 103974
18333A03974l2882l7089O2779K5652k4020n7577k8294N1629p8309Q181J02832
$$ 103974 71092 34003 96782 122434 98414 40837 12543 64172 -14137 -5956 96876
18322I6876N9798K2943m8492k3921K8801m665l1847J826K6102j0280j6541N1622
$$ 96876 156674 179617 131125 107204 136005 131340 99493 101319 127421 117141 100600 152222
18310A52222L5585m2058k2464J215m3611k2390O904K7809j9920j3246k8878Q1
$$ 152222 187807 145749 123285 124500 80889 58499 65403 93212 73292 60046 31168 31249
18298C1249N3772K3162J7728k2234o5577n898n710j9487J3668L5380k298L6600
$$ 31249 85021 108183 125911 103677 38100 32202 26492 7005 20673 56053 53755 90355
18286I0355J6577K8401r651j02213j2741L7663j929M3699k4408k9044M5283P4957
$$ 90355 106932 135333 125682 23469 10728 48391 46462 90161 65753 36709 81992 156949
18274A56949j559m6156J5367j4118n3791j6325p5008J0273R9339K482N7671M7948
$$ 156949 155390 109234 124601 110483 56692 40367 -34641 -24368 74971 77453 135124 183072
18262A83072l7280l5192r0019J5855L62K9906q277m389M9664O6318L769k7797
$$ 183072 145792 110600 20581 36436 36798 66704 58427 54038 103702 170020 173789 145992
18250A45992o1575o7404l416N382J1994m6983J8790Q8602l0465m6648J5847L1591
$$ 145992 84417 17013 13597 18979 30973 -16010 2780 91382 60917 14269 30116 61707
18238F1707K0557n2043o5210L6945Q7438L251N358o1085J3758n759j116M1760
$$ 61707 82264 30221 -34989 1956 89394 92645 98003 36918 50676 44917 43801 85561
18226H5561N684o6053o3358J9527L9128L5609j8419J20k2257k8172l355J18425
$$ 85561 91245 25192 -38166 -18639 20489 56098 37679 37799 15542 -12630 -15985 102440
18214A02440P1602q578k8008m2827n8868K0684J9881N0587L0504J5545K3808K684
$$ 102440 174042 165464 137456 94629 35761 56445 76326 126913 157417 172962 196770 199454
18202A99454m9342r8335l8811R1371p610j03059j2500R4881P5304J1645j2901
$$ 199454 150112 51777 12966 104337 96727 -6332 -18832 76049 151353 162998 150097
18191A50097m6343J8248Q9020n4704q3680N899j026K8849J3393P8405j3853o043
$$ 150097 103754 122002 211022 156318 72638 78537 77511 106360 119753 198158 184305 178262
18179A78262m5223K901n8161n3015L6936J3431K2922M8215k0334l7889K0191q714
$$ 178262 133039 135940 77779 24764 61700 75131 98053 146268 125934 88045 108236 99522
18167I9522L2599L9088P185m2652J5834K2730J5868q4553p1661O3580L5034K9907
$$ 99522 132121 171209 178394 135742 151576 174306 190174 105621 33960 97540 132574 162481
18155A62481j4869j6268J9387M7795l232L0437k453L0811L2986K6098N8566q60
$$ 162481 147612 131344 150731 198526 195294 225731 223278 254089 287075 313173 371739 370879
18143C70879l6820j1321k1082m0775p5220O3838Q3748P2816k0167j7820J8845
$$ 370879 334059 322738 301656 260881 185661 249499 333247 406063 385896 368076 386921
18132C86921l0620j271R43J4513R0547L0065K161J2160Q9532N2008J089k6639
$$ 386921 356301 355030 355973 370486 461033 491098 493259 505419 594951 646959 648048 621409
18120F21409j4693P0982J00805L2130Q8812Q0176P2116J11435N6955J34911Q1617
$$ 621409 606716 677698 778503 810633 899445 979621 1051737 1163172 1220127 1355038 1436655
18109A436655R4975K05113K11679K39216K09362J97552K88660M43729O09761Q59499
$$ 1436655 1531630 1736743 1948422 2187638 2397000 2594552 2883212 3326941 3936702 4796201
18099D796201J128067J478026J955572K574288K931308L020416K955210K638372
$$ 4796201 5924268 7402294 9357866 11932154 14863462 17883878 20839088 23477460
18091B3477460J757665P55091j96291n35180m1951J122296K562503M058767N191282
$$ 23477460 25235125 25990216 25793925 25258745 25216794 26339090 28901593 32960360 38151642
18082C8151642N527503N148239M063148K239438j96259k727300l614781k490581
$$ 38151642 43679145 48827384 52890532 55129970 54933711 52206411 48591630 46101049
18074D6101049j80954K457803M710050O290579O526741N523841L659605P18294
$$ 46101049 45920095 48377898 53087948 59378527 65905268 71429109 75088714 75807008
18066G5807008l207831o890679q034556o439139l592870r38115J128386K423833
$$ 75807008 72599177 65708498 57673942 51234803 47641933 46703818 47832204 50256037
18058E0256037K790343K102843P65629j240690l902879o136134o539358n215404
$$ 50256037 53046380 55149223 55914852 54674162 50771283 44635149 38095791 32880387
18050C2880387l297564j742398o09239J23501K96996k0169o22049j558222k597830
$$ 32880387 29582823 27840425 27231186 27354687 27651683 27631514 27009465 25451243 22853413
18041B2853413l385632l476705k926879k289900j723398j314063r74275p21307
$$ 22853413 19467781 15991076 13064197 10774297 9050899 7736836 6762561 6041254
18033F041254o43191m51513l15941k95094l16587k34660k67216k89613j92305
$$ 6041254 5398063 4946550 4630609 4335515 4018928 3784268 3517052 3227439 3035134
18024C035134j34952p4898q5723j38275l6823j01192j47257p0510j05207j28786
$$ 3035134 2900182 2825284 2739561 2601286 2564463 2463271 2316014 2245504 2140297 2011511
18014B011511r3183j07897j02141p6257m5620p2250m9092l7857k5641r708l2101
$$ 2011511 1918328 1810431 1708290 1632033 1586413 1514163 1465071 1427214 1401573 1391865 1359764
18003A359764k8008l4454L3332p937l2315o552j13841j25855j29384r5997O8380
$$ 1359764 1331756 1297302 1330634 1322697 1290382 1283830 1169989 1044134 914750 818753 887133
17992H87133M0435K4609M524k5716n6427K735j843J391K364k8348m4485j9969
$$ 887133 927568 952177 956701 930985 874558 877293 875450 876841 879205 850857 806372 786403
17980G86403j3498n2008p5000k4808m4910L097L3854p8722O4472N0591P261p9746
$$ 786403 772905 720897 645897 621089 576179 579276 613130 534408 598880 649471 656732 576986
17968E76986m6255m4040j5484K3977J4306q371J3424K7102n3278j1267L5650j3995
$$ 576986 530731 486691 471207 495184 509490 501119 514543 541645 488367 477100 512750 498755
17956D98755j1564L6970J3096l5209q8661n2842L0993P2737n2080o7408L7291
$$ 498755 487191 524161 537257 502048 413387 360545 391538 464275 412195 344787 382078
17945C82078O5553p5982p3702M2536J4380m4729L5733N699m5626m5668k3482N0232
$$ 382078 447631 371649 297947 340483 354863 310134 345867 351566 305940 260272 236790 287022
17933B87022L1259K8926j3879n9380l1785J3739J5669k3770n2878r479L4186J0150
$$ 287022 318281 347207 333328 273948 242163 255902 271571 247801 194923 185444 219630 229780
17921B29780k2870n095l4416K88O0332Q980J1686r572n3005m6922K757O2916P143
$$ 229780 206910 201815 167399 167687 228019 236999 248685 239113 186108 139186 141943 204859 212002
17908B12002r2865K9873j3893o1809k2411K6966l7613j6054K4317l1005J8015
$$ 212002 119137 149010 135117 73308 50897 77863 40250 24196 48513 17508 35523
17897C5523L1355R1024o9683m5784p082P10M9190J0490J6521j9513J1706J2048
$$ 35523 66878 157902 88219 42435 35353 36063 85253 95743 112264 92751 104457 116505
17885A16505k7115Q810K7280L4224l484j02408o2278J0337N5205q572p3577J376
$$ 116505 89390 98200 125480 159704 156220 53812 -8466 1871 57076 48504 -25073 -23697
17873b3697J14007J3440o7991k6027l8131l5052J6585M3213L3760k2434l5856
$$ -23697 90310 103750 35759 9732 -28399 -63451 -46866 -3653 30107 7673 -28183
17862b8183N0398J8262r866p6774k4418m9797J4659M2115O1359K5440M4746M1538
$$ -28183 22215 40477 30611 -46163 -70581 -120378 -105719 -63604 -2245 23195 67941 109479
17850A09479m6807l3323L7994Q5368j061r0675L7332N4928l3307p8109k0219L633
$$ 109479 62672 29349 67343 152711 151650 60975 98307 153235 119928 41819 21600 25233
17838B5233J6979K6769J6134K391j1632p0338M0083k1396P421M0959o991m3184
$$ 25233 42212 68981 85115 87506 75874 5536 45619 24223 31644 72603 65612 22428
17826B2428L0175k100K055k578n4291K664l041J3054j9707l7403o3518k8539j4642
$$ 22428 52603 50503 52558 49980 -4311 -1647 -4688 8366 -11341 -48744 -112262 -140801 -155443
17813a55443M6536N5082n0578l9670J3174O4458R0419R8249j3597n5375q0453
$$ -155443 -108907 -53825 -104403 -144073 -130899 -66441 23978 122227 108630 53255 -27198
17802b7198p6612M2570K8441j2730o312K7086j3749j4777J2505n4011l5140J5977
$$ -27198 -103810 -61240 -32799 -45529 -51841 -24755 -38504 -53281 -40776 -94787 -129927 -113950
17790a13950L1959J4359m3352M350K7581P2598L3056K2634m2747M2169Q239M0304
$$ -113950 -81991 -67632 -110984 -106634 -79053 -6455 26601 49235 6488 48657 56896 97200
17778I7200J07846o3048p7910l920m8628l3835O416L4538K0310L6570K9026j9344
$$ 97200 205046 141998 64088 60168 11540 -22295 -15879 18659 38969 75539 104565 85221
17766H5221n0030o2650K6414j4585k4837R579M9065K0334o5297K1288L5763k6283
$$ 85221 35191 -27459 -1045 -15630 -40467 -30888 18177 38511 -26786 -5498 30265 3982
17754C982l0469K8384J6166L1796L2983m7567K8053o6146j7101N5500Q718k2237
$$ 3982 -26487 1897 18063 49859 82842 35275 63328 -2818 -19919 35581 44299 22062
17742B2062l6320j9798m1703J6539j94K9416K6561l0827j4480J1267J6195K2500
$$ 22062 -14258 -34056 -75759 -59220 -59414 -29998 -3437 -34264 -48744 -37477 -21282 1218
17730A218l783K045L5584o339K8352J4413K4k7873K1886n8629k2968P705M5603
$$ 1218 -2565 -520 35064 28725 57077 71490 71514 43641 65527 6898 -16070 -8365 37238
17717C7238k378l1967J2868l2818l3750j7255J0035L3923J6669j0473o619P9971
$$ 37238 34860 2893 15761 -17057 -50807 -68062 -58027 -24104 -7435 -17908 -24527 55444
17705E5444O5805o5367m9611j0117P929Q2831o4198q3476o4920l455K0684M5907
$$ 55444 121249 55882 6271 -3846 4083 86914 22716 -60760 -125680 -129135 -108451 -62544
17693f2544Q2055K8553j3134k6355k2487j8060K5245O33m6167m8120N0181J4512
$$ -62544 19511 48064 34930 8575 -13912 -31972 -6727 -6094 -52261 -100381 -50200 -35688
17681c5688J2874L0692M4481n750m2944r1289M4962N6847J01351J9697n5183m7923
$$ -35688 -22814 7878 52359 46609 3665 -87624 -42662 14185 115536 135233 80050 32127
17669C2127l6707M9091M3160j3278q9960p1438j168M2116M6058j3621P801J4382
$$ 32127 -4580 44511 87671 74393 -15567 -87005 -88173 -46057 1 -13620 -5819 8563
17657H563K2149M4172K2942M3667L2873Q70Q655K7054k5539O1920k9382K2858
$$ 8563 30712 74884 97826 141493 174366 175236 183891 210945 185406 247326 217944 240802
17645B40802P6318J3302n189j924k4453r793n8519r478K066J2139P4887J09235
$$ 240802 317120 330422 325233 323309 298856 289063 230544 221066 223132 235271 310158 419393
17633D19393o230k586j8288k3115J5369j858m9326q2560m3974N0893Q1839M5389
$$ 419393 413163 410577 392289 369174 384543 382685 333359 250799 206825 257718 339557 384946
17621C84946K3410N9748o139j02821K9669n8321r6555o4631J6351j0925n5441
$$ 384946 408356 468104 461965 359144 388813 330492 233937 169306 185657 174732 119291
17610A19291R973m2076k3428k3053Q912k6680j5550k8225J9540j5361L1549N6281
$$ 119291 129264 87188 63760 40707 49619 22939 7389 -20836 -1296 -16657 14892 71173
17598G1173j429m2445n2642K1485r378l7769n7832p474O6630M7795J2792k8328
$$ 71173 69744 27299 -25343 -3858 -13236 -51005 -108837 -116311 -49681 -1886 10906 -17422
17586a7422l9651J2315R2452n6766j1580M9437M8506j4466o8055l3803J1597J2507
$$ -17422 -57073 -44758 47694 -9072 -20652 28785 77291 62825 -5230 -39033 -27436 -14929
17574a4929K6333M2782l2566L364k7332o8824K2474J8958L4937K0563J5187M335
$$ -14929 11404 54186 21620 24984 -2348 -71172 -48698 -29740 5197 25760 40947 45282
17562D5282k4412P7388m6730o0630M8700O3376J6015m3006n8471m2851K8286l2770
$$ 45282 20870 98258 51528 -9102 39598 102974 118989 75983 17512 -25339 2947 -29823
17550b9823k2474J5774j9611L7319o5549n4169O6009M6081O169J3616j9901n6417
$$ -29823 -52297 -36523 -56134 -18815 -84364 -138533 -72524 -26443 -20274 -6658 -26559 -82976
17538h2976M7761O7626P750j9788m9335K7063M4055k2254p3645n6511n9712L1336
$$ -82976 -35215 32411 40161 20373 -28962 -1899 42156 19902 -53743 -110254 -169966 -138630
17526a38630K8141L666L736k7771L6484J17551M961o8468L121K0749k5094J1083
$$ -138630 -110489 -106823 -103087 -130858 -94374 23177 28138 -40330 -37209 -16460 -41554 -30471
17514c0471j6774O932Q4697L1747p3871k9879j961j168M0392n3146o4297J676
$$ -30471 -47245 -40313 44384 76131 2260 -27619 -29580 -30748 9644 -43502 -107799 -106123
17502a06123Q3100l154N144n4896j7002J6220J8382Q9539j3920m7779k1096n4908
$$ -106123 -23023 -26177 -21033 -75929 -92931 -76711 -58329 31210 17290 -30489 -51585 -106493
17490a06493K6383M0866O3999K0249L3054k8089k9090p4661q5119N1716J3484
$$ -106493 -80110 -39244 24755 45004 78058 49969 20879 -53782 -138901 -87185 -73701
17479g3701J9725p21K97N836M2183J1875J1223n8221J1154J5346k8099j0438k9413
$$ -73701 -53976 -54697 -54400 -48564 -6381 5494 16717 -41504 -30350 -15004 -43103 -53541 -82954
17466h2954n9149N1511L5990J3617K5816l2172l9924L1694J14697l3322j8397
$$ -82954 -142103 -90592 -54602 -40985 -15169 -47341 -87265 -55571 59126 25804 7407
17455G407m224q9734l9690L9467k9315M2600M8589J6015j9172p4068J676K5766
$$ 7407 3183 -86551 -126241 -86774 -116089 -73489 -24900 -8885 -28057 -102125 -100449 -74683
17443g4683K3639K5085K6289j9643K9150Q374j3118k2603k6584K9698o236m4410
$$ -74683 -51044 -25959 330 -19313 9837 18211 5093 -17510 -44094 -14396 -20632 -65042
17431f5042j8930M0068L1896K7984j7548L2885p051k5613K1909K7053M2387j0922
$$ -65042 -83972 -43904 -12008 15976 -1572 31313 24262 -1351 20558 47611 89998 79076
17419G9076j1917k0478l0223m5912m7600P4279M1877p750j3166l7236J9171M3151
$$ 79076 67159 46681 16458 -29454 -77054 -2775 39102 31352 18186 -19050 121 43272
17407D3272O2957J2164J6140n4426q1902l1767M8244O6105q671n9180m7699L9319
$$ 43272 106229 118393 134533 80107 -1795 -33562 14682 80787 72116 12936 -34763 4556
17395D556L2083P134j08854q624Q7792P840K1047p360l464n201L664k2902L9624
$$ 4556 36639 43773 -65081 -73705 14087 21927 42974 35614 32150 26949 30613 7711 47335
17382D7335q0198l5005m7857k289L0413M2835J3815n3731K1171Q2132j6017m1118
$$ 47335 -32863 -67868 -115725 -118014 -87601 -44766 -30951 -84682 -63511 18621 2604 -38514
17370c8514N2882K3724j7021N3111M3745j8521m3185O849n5150k6036L786O2558
$$ -38514 14368 38092 21071 74182 117927 99406 56221 63070 7920 -18116 -14330 48228
17358D8228r1746q1244l6170P214K6572J4769M898j9614L8271Q9730m3738o2411
$$ 48228 -43518 -124762 -160932 -153718 -127146 -112377 -107479 -127093 -88822 908 -42830 -105241
17346a05241j150P1529J6750k051J8508N1408L0408p0655L9739K8629n0871J9823
$$ -105241 -106391 -34862 -18112 -20163 -1655 49753 80161 9506 49245 77874 27003 46826
17334D6826k0549l8158m4923J8926K3012m3966j8098J1435K0881K1412K0995l642
$$ 46826 26277 -11881 -56804 -37878 -14866 -58832 -76930 -65495 -44614 -23202 -2207 -5849
17322e849M9306N939k469j3486r6764k0918k5036n8711M2042O0769N4128k6291
$$ -5849 43457 49396 46927 33441 -63323 -84241 -109277 -167988 -125946 -65177 -11049 -37340
17310c7340L5870J03795K6264o1713r9174l5599R8885J4161o2016k4823N9989
$$ -37340 -1470 102325 128589 66876 -32298 -67897 30988 45149 -16867 -41690 18299
17299A8299Q3120p722J4264m4064q1528n3828l922L0842N3199l6207m216k9005
$$ 18299 101419 93697 107961 63897 -17631 -71459 -75381 -44539 8660 -27547 -31763 -60768
17287f0768M9505k3167O7166M3608J3338j4780l0593l7006l7716J0512k010n9920
$$ -60768 -11263 -34430 32736 76344 89682 74902 44309 7303 -30413 -19901 -21911 -81831
17275h1831J5337M6228M2843Q037k9421l6351j372J7558N3491P2182m423J5207
$$ -81831 -66494 -20266 22577 30614 1193 -35158 -36530 -18972 34519 106701 102278 117485
17263A17485J9265l3683k739j9563o2497K3657L669k8994J61M9515K1252q3570
$$ 117485 136750 103067 100328 80765 18268 41925 45594 16600 16761 66276 87528 3958
17251C958j7888k9766k1865J4534j7278L6330k7463M498J6843k4027j0584j554
$$ 3958 -13930 -43696 -65561 -51027 -68305 -31975 -59438 -54940 -38097 -62124 -72708 -74262
17239g4262J1910J3772K6378M4320l670l7859K879j024Q929j5513j09682n6430
$$ -74262 -62352 -48580 -22202 22118 18448 -19411 -16532 -17556 -8627 -24140 -133822 -190252
17227a90252P2811N7125l0258N663L9298R1472j5127l1577p387m8489J2023K8639
$$ -190252 -117441 -60316 -90574 -84911 -45613 45859 30732 -845 -8232 -56721 -44698 -16059
17215a6059J8491j2773J7261N958n5665j433j766k6718N891M2606K0096n6970
$$ -16059 2432 -10341 6920 12878 -42787 -44220 -45986 -72704 -66813 -24207 -4111 -61081
17203f1081N68P3819Q524n1156m0726K5174n9577p0858M177O1531K7455N4994
$$ -61081 -60513 13306 21830 -29326 -70052 -44878 -104455 -175313 -171136 -109605 -82150 -27156
17191b7156N4993P5331n6306L041j558K2792M3566j9899q0850K9913n0506j7491
$$ -27156 27837 103168 46862 49903 48345 71137 114703 94804 13954 43867 -6639 -24130
17179b4130J8073l0539k7073l7257L7451J30428o6577j21378N06M0103K8811m4493
$$ -24130 -6057 -36596 -63669 -100926 -63475 66953 376 -121002 -120496 -80393 -51582 -96075
17167i6075k7091J0176J5849J2164M3798K2163P8741K9495l1374m1166Q3160j116
$$ -96075 -123166 -112990 -97141 -84977 -41179 -19016 59725 89220 57846 16680 99840 98724
17155I8724o9r4118n1911K6689N3797P0310K2865l6141k5463l0455k5051O2321
$$ 98724 98655 4537 -47374 -20685 33112 103422 126287 90146 64683 34228 9177 71498
17143G1498L0954K8390K2107m3245n6090j14053n6700K2996K1692K9884K8096
$$ 71498 102452 130842 152949 109704 53614 -60439 -117139 -94143 -72451 -42567 -14471
17132a4471K8740K3802N3139k5343o0985K1892p4285m0364J4794M2299k7095K9238
$$ -14471 14269 38071 91210 65867 4882 26774 -47511 -87875 -73081 -30782 -57877 -28639
17120b8639k813j08073L0776J6273N8921Q7302k0004L86K4283p809o9953K4392
$$ -28639 -31452 -139525 -108749 -92476 -33555 53747 33743 34129 58412 50603 -19350 5042
17108E042K6509o7428L1849r43j2580m2536K7767N2211j3535j4429K081k8415
$$ 5042 31551 -35877 -4028 -4971 -17551 -60087 -32320 19891 6356 -8073 -5992 -34407
17096c4407l6116O4044M4417r83p93N9143M9628o0636j14110n6162k7503K2094
$$ -34407 -70523 -6479 37938 36955 36162 95305 144933 84297 -29813 -85975 -113478 -91384
17084i1384L2810M9409K0651O303l2879o698j2431m830L732M0207P802O912n1533
$$ -91384 -58574 -9165 11486 17789 -15090 -21788 -34219 -39049 -35317 4890 12692 19604 -31929
17071c1929n8488k5822J1030P5832m98o0151K8940K8663j947L7417P2259O0922
$$ -31929 -90417 -116239 -105209 -29377 -29875 -90026 -61086 -32423 -34370 3047 75306 136228
17059A36228m091K6605N4682j8754r5337j19024l0571l1467K0599j4085J5944
$$ 136228 132137 158742 213424 194670 99333 -19691 -50262 -81729 -61130 -75215 -59271
17048e9271J3651M030o1521k2252R0610J7755N396P672L8798k0080Q102K5344
$$ -59271 -45620 -41590 -103111 -125363 -34753 -16998 -11602 -3930 34868 14788 22890 48234
17036D8234q4288l0281p2037L6379M2016M3057M4525j36n1183K0685j5188m9126
$$ 48234 -36054 -66335 -138372 -101993 -59977 -16920 27605 27469 -23714 -3029 -18217 -67343
17024f7343J6575j3022M262l831j2972k2122M4918O9872k6325q4681m636K5019
$$ -67343 -50768 -63790 -59528 -63359 -76331 -98453 -53535 16337 -9988 -94669 -99305 -74286
17012g4286k3867K0495J8908n585K7948P608l942O3610J9927p8342m8651K8605
$$ -74286 -98153 -77658 -58750 -64335 -36387 -28779 -32721 30889 50816 -27526 -76177 -47572
17000d7572O208R215l3146r0991L849J1363Q5068L5742l9641j4772K5076J016
$$ -47572 -41364 -32149 -65295 -156286 -152437 -141074 -56006 -20264 -59905 -74677 -49601 -48585
16988d8585M2129j7525m8216K1415K2337P944k939J4074R9498k5421n8111k0246
$$ -48585 -6456 -23981 -72197 -50782 -28445 -20501 -23440 -9366 90132 64711 6600 -13646
16976a3646L1001p9562m9682p056P8678K0420o923l7178q035j1988L0912j226
$$ -13646 17355 -62207 -111889 -118945 -40267 -19847 -26770 -63948 -71983 -83971 -53059 -54285
16964e4285j1275n1075L0854M0528k745M3288K8454O5707k1581r6267n9387r201
$$ -54285 -65560 -116635 -85781 -45253 -47998 -4710 23744 89451 67870 -28397 -87784 -96985
16952i6985N2167l6969j733L0749q172L1817M5905O217K9879K6204j6957K0960
$$ -96985 -44818 -81787 -83520 -52771 -60943 -29126 16779 22996 52875 79079 62122 83082
16940H3082m330k9681l7310j4501L0154K0356L3813j8916l0614K4896k222L4862
$$ 83082 78752 49071 11761 -2740 27414 47770 81583 62667 32053 56949 54727 89589
16928H9589j9683l3314k5252M4170L6548p1621Q06M4564j7875o1548q4311j1466
$$ 89589 69906 36592 11340 55510 92058 20437 21243 65807 47932 -13616 -97927 -109393
16916a09393N224n5169N1713M4782k848l2107n2394k3433J5331K1526k6871J9790
$$ -109393 -104169 -159338 -107625 -62843 -65691 -97798 -150192 -173625 -158294 -136768 -163639 -143849
16904a43849N0517m1746l2028P6683J02435M2105l0389l1782l951k0217j9095
$$ -143849 -93332 -135078 -167106 -90423 12012 54117 23728 -8054 -12005 -32222 -51317
16893e1317L808j4074j1659P3310O7988M1284J1509K5655M5124m0196j11235n6789
$$ -51317 -47509 -61583 -73242 68 68056 109340 120849 146504 191628 151432 40197 -16592
16881a6592J2011K0203o2761J4806J160r85P5016N5291n0083k444p994n2139l4282
$$ -16592 -4581 15622 -47139 -32333 -31173 -32158 42858 98149 48066 45622 37628 -14511 -48793
16868d8793M1885O5237l0304J5872O591n493K3727p702k0698o3046l3282N5405
$$ -48793 -6908 58329 28025 43897 50488 44995 68722 61020 40322 -22724 -56006 -601
16856f01K327p3775o6990M1074M1437L2778N3202M123l6118m3174J07769K5471
$$ -601 1726 -72049 -139039 -97965 -56528 -23750 29452 33575 -2543 -45717 62052 87523
16844H7523m2475l8248M4141M5952K0122p6337k7964k318j8150k3660K0107J87
$$ 87523 45048 6800 50941 96893 117015 40678 12714 10396 -7754 -31414 -11307 -11120
16832a1120L3715M570m0101L7077O3571p052J0103k9538j9948N660j5939m5504
$$ -11120 22595 27165 -12936 24141 87712 80660 90763 61225 41277 46937 30998 -14506
16820a4506n4228M255M1290P686j2939J1676k3448P1610L9668l5673p8072R078
$$ -14506 -68734 -64479 -23189 -15503 -28442 -16766 -40214 31396 71064 35391 -42681 -33603
16808c3603J15908m3792j06937l264J0253L66l825R5794M9393L98L2721m7763
$$ -33603 82305 38513 -68424 -71688 -61435 -61069 -64894 30900 80293 80691 113412 65649
16796F5649j1188l3280J4916M8018r118R657k392J4520l8363q2843p8572N4910
$$ 65649 54461 21181 36097 84115 74997 84654 82262 96782 58419 -24424 -102996 -48086
16784d8086K2290O5745j1483q2097p8772k7685M9023L2296K4360K8160O1905K3989
$$ -48086 -25796 39949 28466 -53631 -132403 -160088 -111065 -78769 -54409 -26249 35656 59645
16772E9645K7447k8099r751j850m214j1010p760L5514M1502j08007p7068J17353
$$ 59645 87092 58993 49242 47392 43178 32168 24408 59922 101424 -6583 -83651 33702
16760C3702L769J5678J0662k8930j21376j9924K0497O6784J3962o826N8504N6399
$$ 33702 37471 53149 63811 34881 -86495 -106419 -85922 -19138 -5176 -12002 46502 102901
16748A02901n3872K95P2960l4880j0071R593k2246j2202p8215K286j4005J6008
$$ 102901 49029 49324 122284 87404 77333 86926 64680 52478 -25737 -23451 -37456 -21448
16736b1448J0795r436j00647J6290M8123K3796q549L7978j0046j5862J5337N9040
$$ -21448 -10653 -20089 -120736 -104446 -56323 -32527 -41076 -3098 -13144 -29006 -13669 45371
16724D5371M6865l4707n9383n2061o4549l2497J1655J02280M3785o4451k897L1639
$$ 45371 92236 57529 -1854 -53915 -118464 -150961 -139306 -37026 6759 -57692 -60589 -28950
16712b8950J9853m001K5445n0116k5242N3953q425P8444P2900K4091k1522k431
$$ -28950 -9097 -13098 12347 -37769 -63011 -9058 -17483 60961 133861 157952 136430 133999
16700A33999k2489q8761J5730j7438L854O3916l5893r768L1762N521o8266n5313
$$ 133999 111510 22749 38479 21041 24895 88811 52918 43150 74912 80433 12167 -43146
16688d3146k1889J2878J0791M0546K5009m0881j9264L6825q324o605K1454j6873
$$ -43146 -65035 -52157 -41366 -820 24189 -16692 -35956 869 -7455 -14060 7394 -9479
16676i479R821L3240K2241J1593k5045r3736k4055J3920L1476n620m3154k7813
$$ -9479 342 33582 55823 67416 42371 -51365 -75420 -61500 -30024 -35644 -78798 -106611
16664a06611k8161K2504O9316N1541m2043l235J0291O509m4363l3993L3652O2326
$$ -106611 -134772 -112268 -42952 8589 -33454 -36689 -26398 -19889 -64252 -98245 -64593 -2267
16652b267M773k9558l6714k463j112K161k4582J5843M1540p823m5699j6492L4221
$$ -2267 2506 -27052 -63766 -66229 -67341 -65180 -89762 -73919 -32379 -40202 -85901 -102393 -68172
16639f8172j5320O186L0700K0841O7126J04101k2181k3483L541q6792k8944L8613
$$ -68172 -83492 -77306 -46606 -25765 41361 145462 123281 99798 103339 16547 -12397 26216
16627B6216r035n0609J1259M2146k3870L782j0375L3667j914O996Q88o855L8292
$$ 26216 17181 -33428 -22169 19977 -3893 -111 -10486 23181 21267 28263 29151 22296 60588
16614F0588N4104k3742j3765R6J649p2591k7385P2051J1526n4943o4764m4080
$$ 60588 114692 90950 77185 77281 78930 6339 -21046 51005 62531 7588 -57176 -101256
16602a01256J2913P2007Q0789l9293m1102J3064P729O930n2741j9521L2999j1259
$$ -101256 -88343 -16336 64453 25160 -15942 -2878 4851 11781 -40960 -60481 -27482 -38741
16590c8741k9794m9983R271j8275l6717K3075L1170M4339L9419n6247K6841J22464
$$ -38741 -68535 -118518 -109247 -127522 -164239 -141164 -109994 -65655 -26236 -82483 -55642 66822
16578F6822L0844q92r2510l7996L6833m3086k4309J0399j4265M6695N5706k0620
$$ 66822 97666 96774 4264 -33732 3101 -39985 -64294 -53895 -68160 -21465 34241 13621
16566A3621L592N1432m7851m1150J4715k8908j1087k0748j1280J9317J5273N0501
$$ 13621 17213 68645 20794 -20356 -5641 -34549 -45636 -66384 -77664 -58347 -43074 7427
16554G427K9354p3948m8007J6719N0142P8196n539o9789o4470j1148j8635m1598
$$ 7427 36781 -37167 -85174 -68455 -18313 59883 54344 -15445 -79915 -91063 -109698 -151296
16542a51296N1609l652K9918k5762o8544j7273K9924L7778L0684o8335J8069J12230
$$ -151296 -99687 -103339 -73421 -99183 -167727 -185000 -155076 -117298 -86614 -154949 -136880 -24650
16530b4650J9580L0798M7073l3822n7449K3593o999q2045M2171L2806k2419k0524
$$ -24650 -5070 25728 72801 38979 -18470 5123 -1876 -83921 -41750 -8944 -31363 -51887
16518e1887J7160M2136k8482n3385m7081j8509K4883K613J2293L6932K102M405
$$ -51887 -34727 7409 -21073 -74458 -121539 -140048 -115165 -112552 -100259 -63327 -61225 -56820
16506e6820j4407l9410m6293M1932K6510l4939M510L1051J7748P252P166K2190
$$ -56820 -71227 -110637 -156930 -114998 -88488 -123427 -118917 -87866 -70118 -62866 -55700 -33510
16494c3510M2341N332n891J3892M5728O13j0059k9158n1224J6840P5571O883j13036
$$ -33510 8831 14163 8272 22164 67892 68505 58446 29288 -21936 -5096 70475 77358 -35678
16481c5678n8271J530K014m916K7348K8499k1689n771o362k0080j8127K3133k9278
$$ -35678 -93949 -92419 -90405 -95321 -67973 -39474 -61163 -66934 -73296 -93376 -111503 -88370 -117648
16468a17648m440N7140L1999M4892O823L9341K4244N529l9914k6597K9454j1629
$$ -117648 -122088 -64948 -32949 11943 18766 58107 82351 87880 47966 21369 50823 39194
16456C9194o1361j4239J4814P2089k0739l8707l234M918k3702k2684J9999L3780
$$ 39194 -22167 -36406 -21592 50497 29758 -8949 -12183 -7265 -30967 -53651 -33652 128
16444A28K9964n1844K4187L3536J4176L2761l0554J530K1460l5264j8438L5974
$$ 128 30092 -21752 2435 35971 50147 82908 52354 53884 75344 40080 21642 57616
16432E7616o2787j9046J9262M6321k5666O435j9578J3391O7362n247l7297J4041
$$ 57616 -5171 -24217 -4955 41366 15700 22135 2557 15948 83310 78063 40766 54807
16420E4807k7773m0498l8369M322O7344L8154k7048l5006k1781J6784o7863J4272
$$ 54807 27034 -13464 -51833 -47511 19833 57987 30939 -4067 -25848 -9064 -76927 -62655
16408f2655N8196j8279q4285L8316R0372P3690n2593K446m0840L5611K0372M5044
$$ -62655 -4459 -22738 -107023 -68707 21665 95355 42762 45208 4368 39979 60351 105395
16396A05395m9846o7765p8681k4911M384O5585o164n0869j6672j8529O2543M1426
$$ 105395 55549 -12216 -90897 -115808 -111424 -45839 -52003 -102872 -119544 -138073 -75530 -34104
16384c4104j5132L8609N63k0768L7144P8134L4000j9224k1819r999l2891o1146
$$ -34104 -49236 -10627 -10064 -30832 6312 84446 118446 99222 77403 67404 34513 -26633
16372b6633L2426K9085j4218K2066j9224P445j3150l1180J4711L2351l8433l9362
$$ -26633 5793 34878 20660 42726 23502 30947 17797 -13383 1328 33679 -4754 -44116
16360d4116N4655j0527O469j704k5565M0723L1094l2294M594o9M3045J6803J1798
$$ -44116 10539 12 6481 4777 -20788 19935 51029 18735 23329 23260 66305 83108 94906
16347I4906J13j0122j4485j9053j1324o0904n4429J0340L2900l5269O5391J0848
$$ 94906 95019 84897 70412 51359 40035 -20869 -75298 -64958 -32058 -67327 -1936 8912
16335H912m3019P3736R871P1588l3079q6619R904J3371J4286r5257n8078L0190
$$ 8912 -34107 39629 49500 121088 88009 1390 11294 24665 38951 -56306 -114384 -84194
16323h4194N9380O9933J9738j2882m7399q5360p2420J5490K796R6673N4280J7243
$$ -84194 -24814 45119 64857 51975 4576 -80784 -153204 -137714 -134918 -38245 16035 33278
16311C3278j905j3594q3319N5279L0152j4846J5238J724n7891L9397K2739j15865
$$ 33278 31373 17779 -65540 -10261 19891 5045 20283 22007 -35884 3513 26252 -89613
16299h9613r2548P3629J27185k745p2377M2172k7248J5039L4830Q688k368p406
$$ -89613 -182161 -108532 18653 15908 -56469 -14297 -41545 -26506 8324 17012 14644 7238
16287G238l0586L7211K5335k4567J5577R400n6247n0838m489K3365J0661K3659
$$ 7238 -23348 13863 39198 14631 30208 39608 -16639 -67477 -71966 -48601 -37940 -14281
16275a4281Q597j9642k7495L2235L7110k1564J6895J5466j5159m1550p947k5126
$$ -14281 -5684 -25326 -52821 -20586 16524 -5040 11855 27321 12162 -29388 -37335 -62461
16263f2461K22o3587k2930O8851K0190j2439m8033R607M5041K4360j7992j8883
$$ -62461 -62239 -125826 -148756 -79905 -59715 -72154 -120187 -110580 -65539 -41179 -59171 -78054
16251g8054J9604K3108j3575L6574K5746o6265m546m593K2249k2800n701J6443
$$ -78054 -58450 -35342 -48917 -12343 13403 -52862 -57408 -62001 -39752 -62552 -68253 -51810
16239e1810J4854O618j2252l3376k3645N1492Q5250q745O081O7206j0246o3334
$$ -51810 -36956 -30338 -42590 -75966 -99611 -48119 37131 28386 34467 101673 91427 28093
16227B8093o0372l9645r308K6154m70J8352M206l1182k8803j4861K1360k135O5058
$$ 28093 -32279 -71924 -81232 -55078 -55548 -37196 -32990 -64172 -92975 -107836 -86476 -88611 -23553
16214b3553N520K0482m2021l0261P0680P2554m1827l3970j6141j4146K5215M1396
$$ -23553 -18033 2449 -39572 -69833 847 73401 31574 -2396 -18537 -32683 -7468 33928
16202C3928M2233k5859L5270K6307j1874q4645j1097j2828m6610L660k0497K3365
$$ 33928 76161 50302 85572 111879 100005 15360 4263 -8565 -55175 -51515 -72012 -48647
16190d8647J3070k395m7102m7754N4107J07857P7477o9590k8596M6800L4808m0535
$$ -48647 -35577 -37972 -85074 -132828 -78721 29136 106613 37023 8427 55227 90035 49500
16178D9500q0931J7195P599M555j3694J4801j359p1093M1965Q4602l107l551o9744
$$ 49500 -31431 -14236 -6637 -2082 -15776 -975 -2334 -73427 -31462 53140 50033 46482 -23262
16165b3262j5957L6997J9955L1633J831j1118O7221j9627m9709o3473q007L6689
$$ -23262 -39219 -2222 17733 49366 51197 40079 107300 87673 37964 -25509 -33516 3173
16153C173p410k5177q065k1481L8055L7452Q5517N1615n0409j94J7468k001o6219
$$ 3173 -4237 -29414 -37479 -58960 -20905 16547 102064 153679 103270 103076 120544 118543 52324
16140E2324N3502m8668M180L2287m4301l6788q643O0729j9955k7888J3917j3139
$$ 52324 105826 57158 61338 93625 49324 12536 3893 64622 44667 16779 30696 17557
16128A7557R885P2348M8662k8833l6079j2389k0147L3212J0661j8292J4060j3649
$$ 17557 27442 99790 148452 119619 83540 71151 51004 84216 94877 76585 90645 76996
16116G6996J774o4012l4981n1357l4022L8152O3807J618K0834M8909j8775l7107
$$ 76996 78770 14758 -20223 -71580 -105602 -67450 -3643 -2025 18809 67718 48943 11836
16104A1836L461j3152O9196P8117L9940o2366o7378L428P4057K945o4666j8122
$$ 11836 15297 2145 71341 149458 189398 127032 59654 63082 137139 140084 75418 57296
16092E7296K4881K468k5619k0611Q2151K9875o5315J2510m46M175k2439j8782
$$ 57296 82177 84645 59026 38415 120566 150441 85126 97636 97190 101365 78926 60144
16080F0144J226l3440N6784n6358j4610M4679K7944M6603k4254J8833L5248K4144
$$ 60144 61370 27930 84714 28356 13746 58425 86369 132972 108718 127551 162799 186943
16068A86943J0060l4435q4321k2152n5363n704K4826l3509l8048Q78k2905l5782
$$ 186943 197003 162568 78247 56095 732 -4972 19854 -13655 -51703 -50825 -73730 -109512
16056a09512K0959K0046K5305P6299j2742m6096R557L2141L5316J1139K1649p987
$$ -109512 -88553 -68507 -43202 33097 20355 -25741 -16184 15957 51273 62412 84061 76074
16044G6074p2908L0701M1881r348l2308p0699N212Q1733O6068j2135J6709J1333
$$ 76074 3166 33867 75748 66400 34092 -36607 -31395 50338 116406 104271 120980 132313
16032A32313o8954p0781O7124M8656L6939L0800K9912j3612R618j4300j6059L2279
$$ 132313 63359 -7422 59702 108358 145297 176097 206009 192397 202015 187715 171656 203935
16020B03935K2577M808N5112K2453L5400n4751L5798J05655M7852l9259n785R9322
$$ 203935 226512 231320 286432 308885 344285 289534 325332 430987 478839 439580 433795 533117
16008E33117J33184J44815J13887N8161J01360P6957J04075J41557J86237Q6952
$$ 533117 666301 811116 925003 983164 1084524 1161481 1265556 1407113 1593350 1680302
15998A680302Q9439k3715m016p9313k3264n7942j62892j11431n2862o5684p1273
$$ 1680302 1769741 1746026 1742010 1662697 1639433 1581491 1418599 1307168 1254306 1188622 1117349
15987A117349n3011l7926q9461j41956q9895o2825O1018m998r4749J6330o8521
$$ 1117349 1064338 1026412 936951 794995 705100 642275 703293 698295 603546 619876 551355
15976E51355p4406L4340P7554K8808L9308L4213N2986J0874j2985N3291J1204
$$ 551355 476949 511289 588843 617651 656959 691172 744158 755032 742047 795338 806542
15965H06542L0210J66434J29450J03658J21626J59615K71646L06029K25275J76514
$$ 806542 836752 1003186 1132636 1236294 1357920 1517535 1789181 2095210 2320485 2496999
15955B496999J76609K49921K00936J46505O0804M343j17418j04258j96460k42733
$$ 2496999 2673608 2923529 3124465 3270970 3331774 3336117 3218699 3114441 2917981 2675248
15945B675248k38633k33489k00096k54612k74307j98573p3122r8374j19370q1670
$$ 2675248 2436615 2203126 2003030 1748418 1474111 1275538 1202416 1104042 984672 903002
15935I03002o9041p372M6777j6734o5353j08512m1010m3157m0731K9707L3738
$$ 903002 833961 826589 873366 856632 791279 682767 641757 598600 557869 587576 621314
15924F21314K8987j7778L1388N9976Q332N5013L6516r453N2719p219J8040J19360
$$ 621314 650301 632523 663911 723887 732219 787232 823748 814295 867014 859795 877835 997195
15912I97195J25397J31350J28017J1345L1266O7687O0780K1935J2298m7964r2234
$$ 997195 1122592 1253942 1381959 1393304 1424570 1492257 1553037 1574972 1587270 1539306 1447072
15901A447072o7585j15359j34225m6666p5109j85014n3170R323n0538j52327l0772
$$ 1447072 1379487 1264128 1129903 1083237 1008128 823114 769944 779267 728729 576402 545630
15890E45630O737p3450m6260j5835o5526r942O0008n66o5550m0333Q541l8927
$$ 545630 552367 478917 432657 416822 351296 341354 401362 400796 335246 294913 303454 264527
15878B64527j03766M2537J9680l6766N5096j0404q0970n9713J5222L6025j864
$$ 264527 160761 203298 222978 186212 241308 230904 149934 90221 105443 141468 139604
15867A39604p4699o4321j3548J03326j1630M9634M5937k3468j5717J5012n9287
$$ 139604 64905 584 -12964 90362 78732 128366 174303 150835 135118 150130 90843
15856I0843m6124q8771j3864Q5010N6142l7922m4286J1743J21270P7647J6315
$$ 90843 44719 -44052 -57916 27094 83236 45314 1028 12771 134041 211688 228003
15845B28003m2488n6647q753n2511k1910K3290m8233j58806K6999P2105L7338
$$ 228003 185515 128868 120115 67604 45694 68984 20751 -138055 -111056 -38951 -1613
15834a613P4773N9551q5202k8641J0816j462j9800K5284k0916L6597L8826J9565
$$ -1613 73160 132711 47509 18868 29684 28222 8422 33706 12790 49387 88213 107778
15822A07778J1471O0208K465k8648q716N5409K9667p6974m9331k7971l2638j0309
$$ 107778 119249 179457 181922 153274 144558 199967 229634 152660 103329 75358 42720 32411
15810C2411J0607L6233m3436q6771k7174M788j5290j0853K2017K386k4464o574
$$ 32411 43018 79251 35815 -50956 -78130 -73342 -88632 -99485 -77468 -75082 -99546 -106120
15798a06120J5035N6789R213m4145j6498L5010N493J0975O5173N2280K528j1554
$$ -106120 -91085 -34296 -25083 -69228 -85726 -50716 -45223 -34248 30925 83205 85733 74179
15786G4179O0852o6835n7354o304Q2705L3922K2291N736n5787k8985O147j8642
$$ 74179 135031 68196 10842 4538 87243 121165 143456 149192 93405 64420 70567 51925
15774E1925L7541n160l0332l583P3076n1677P875r788j22995J6700M8854N699
$$ 51925 89466 84306 53974 50391 123467 71790 79665 69877 -53118 -36418 12436 18135
15762A8135K1758n7900K4269j0904m0227L3245l732n8860n5496M8620P7889K503
$$ 18135 39893 -18007 6262 -4642 -44869 -11624 -15356 -74216 -129712 -81092 -3203 -700
15750g00m579K6963N3377n169l0488k2171m1687K5272Q8225J2481p737l6787n793
$$ -700 -5279 21684 75061 69892 39404 17233 -24454 818 89043 101524 93787 57000 51207
15737E1207j206j5649m0612n2702R413P6853M1232L0145M7109j3046J9292j3801
$$ 51207 50001 34352 -6260 -58962 -49549 27304 68536 98681 145790 132744 152036 138235
15725A38235k1078l4775o5950n9834k3467J3284J18697M4364q3116n0882J7809
$$ 138235 117157 82382 16432 -43402 -66869 -53585 65112 109476 26360 -24522 -6713
15714f713L000r2987L1868J6233r91J32446O4985p7351j0171J8894l218m6362
$$ -6713 -3713 -96700 -64832 -48599 -49590 82856 147841 70490 60319 79213 75995 29633
15702B9633l3635l8339K2838K6954K867M652n2091o6793L6379Q0388J11088j5475
$$ 29633 -4002 -42341 -19503 7451 10318 14970 -37121 -103914 -67535 12853 123941 108466
15690A08466k3507L5614n8163j6204K1165o9264j562M9743l1975q3681k3222P031
$$ 108466 84959 120573 62410 46206 67371 -1893 -3455 46288 14313 -69368 -92590 -85559
15678h5559k914K9824p446m0060L2354J5456k47N4611k3223j26505m3636K6420
$$ -85559 -88473 -58649 -66095 -106155 -73801 -58345 -58592 -3981 -27204 -153709 -197345 -170925
15666a70925J0537J356P467j5804l914N8799L1382J2242K3505J7048O4942m346
$$ -170925 -160388 -159032 -151565 -167369 -171283 -112484 -81102 -68860 -45355 -28307 36635 32289
15654C2289j0245l8442l3499n8041J7593K3891J4124k6927L302P32p535P4749
$$ 32289 22044 -16398 -49897 -107938 -90345 -66454 -52330 -79257 -75955 -75223 -82758 -8009
15642h009M5795NN6178J7129r0826q2364j3456K8756L2819K7561M3913o2863m5029
$$ -8009 37786 37791 93969 111098 20272 -62092 -75548 -46792 -13973 13588 57501 -5362 -50391
15629e0391l2860m1300O3306R5752N3323k094m7411o6405P6261j6120j5573P2635
$$ -50391 -83251 -124551 -61245 34507 87830 85736 38325 -28080 48181 32061 16488 89123
15617H9123m0798K9670O643n4103k4013M9368q082l1479l0923j859m645l5301
$$ 89123 48325 77995 84638 30535 6522 55890 47808 16329 -14594 -16453 -21098 -56399
15605e6399Q176r674o0095l7878M3230J6742j4773m005J0368N8506M0138k286
$$ -56399 -48223 -57897 -117992 -155870 -112640 -95898 -110671 -114676 -104308 -45802 -5664 -7950
15593g950j5151N4875J9638k1509J5211k9710l4753L9452J451l4397L1950k1549
$$ -7950 -23101 31774 51412 29903 45114 15404 -19349 20103 21554 -12843 19107 -2442
15581b442M3664m3057L3950J9425m2828n6318K3432L0599l5903n1303M6575l948
$$ -2442 41222 -1835 32115 51540 8712 -47606 -24174 6425 -29478 -80781 -34206 -38154
15569c8154J4135J0888j5691K1950l1242j7169L3655K3898l262N637L8547K6625
$$ -38154 -24019 -13131 -28822 -6872 -38114 -55283 -21628 2270 -992 4645 43192 69817
15557F9817o2355o7622m743J5269J551j956Q4635L0182N0232L5667m1667j6234
$$ 69817 7462 -60160 -64903 -49634 -48083 -50039 34596 64778 115010 150677 109010 92776
15545I2776q942j7872l3019m9766K4934P4783m5924n1539j5826N3213K7557j0174
$$ 92776 83834 65962 32943 -16823 8111 82894 36970 -14569 -30395 22818 50375 40201
15533D0201r1086j05128L3285Q2387Q8718n549J340L262l3095k7757l3542L7268
$$ 40201 -50885 -156013 -122728 -40341 48377 42828 44168 47430 14335 -13422 -46964 -9696
15521i696J11270K5949l9935j9504m0224k3367J0124j3101L1639k100R099l639
$$ -9696 101574 127523 87588 68084 27860 4493 14617 1516 33155 31055 40154 36515
15509C6515l9579m926m6546J1678Q0388J1523k2965L4784n3172N1402M7411k5939
$$ 36515 -3064 -7990 -54536 -42858 37530 49053 26088 60872 7700 59102 106513 80574
15497H0574q8724L000L8600M5258o2308k5631O4903O3479P697o5767L8087p5220
$$ 80574 -8150 -5150 33450 78708 16400 -9231 55672 119151 126848 61081 99168 23948
15485B3948m6222l5517P219k643m6891r934P0548n375N407M1302L9065M39o4388
$$ 23948 -22274 -57791 -50572 -53215 -100106 -110040 -39492 -44867 -39460 1842 40907 41346 -23042
15472b3042k8864n3444L3037N554k5491L9448J7562M5793n3570Q0084R4193J881
$$ -23042 -51906 -105350 -72313 -66759 -92250 -52802 -35240 10553 -43017 37067 131260 133141
15460A33141m3673K4491k1136n9147J4833J9469k7346J0309J5579l5334n7644
$$ 133141 89468 113959 92823 33676 48509 67978 40632 50941 66520 31186 -26458
15449b6458K888N0476p304k9950n3004J5337r42k7267K8238j6841l1893k7758
$$ -26458 -23570 26906 19602 -10348 -63352 -48015 -48957 -76224 -47986 -64827 -96720 -124478
15437a24478Q4102J6678n2397k9056L9933J2047M0018J13521l196q5279l4430
$$ -124478 -40376 -23698 -76095 -105151 -65218 -53171 -13153 100368 97172 11893 -22537
15426b2537P6731M6025l3054J6030p9583M0818l8775J3356K7911L7286K9738K7366
$$ -22537 54194 100219 67165 83195 3612 44430 5655 19011 46922 84208 113946 141312
15414A41312o6577n0785N4107K1914l7195J428j6925j8917N1289L9262m2095o7151
$$ 141312 74735 23950 78057 99971 62776 64204 47279 28362 79651 118913 76818 9667
15402I667M1736L0256m2142k2009M5426Q0160R122J8326L9467m2991L162l3345
$$ 9667 51403 81659 39517 17508 62934 143094 152216 170542 210009 167018 170180 136835
15390A36835l1182J1656n4026k9260p140p6822J3118M7554l9161l0903N354k4734
$$ 136835 105653 117309 63283 34023 26883 -49939 -36821 10733 -28428 -59331 -53977 -78711
15378g8711M5623P0804L1951m3174l9067Q319J7145P7071N6872R543p3000k7345
$$ -78711 -33088 37716 69667 26493 -12574 -4255 12890 89961 146833 156376 83376 56031
15366E6031n6140j1620M4927o973j4710j4846r464l3454J1060k6252k9693J7442
$$ 56031 -109 -11729 33198 26225 11515 -3331 -12795 -46249 -35189 -61441 -91134 -73692
15354g3692J7802L4261k9231n592N4691K3456l1252o9800p413l5495J1362J00762
$$ -73692 -55890 -21629 -50860 -56452 -1761 21695 -9557 -79357 -86770 -122265 -110903 -10141
15342a0141N9096o8512n8756L2456J1386N3241P7515l1960m8723j9442m0941r8077
$$ -10141 48955 -19557 -78313 -45857 -34471 18770 96285 64325 15602 -3840 -44781 -142858
15330a42858k274L8833O1685K7232l4534K4635N7224K1854K6160j4886k7293p0726
$$ -142858 -145132 -106299 -44614 -17382 -51916 -27281 29943 51797 77957 63071 35778 -34948
15318c4948O912k5780j5211P911j5139k3480K6384J2066J4693K900J7927k8266
$$ -34948 -28036 -53816 -69027 -61116 -76255 -99735 -73351 -61285 -46592 -43692 -25765 -54031
15306e4031K4696M4835J2036l6154j9844o4417N5722N3601o5032l9874l6310l415
$$ -54031 -29335 15500 27536 -8618 -28462 -92879 -37157 16444 -48588 -88462 -124772 -128187
15294a28187Q7753j3312o6528L1270Q8192l9725r9779j5018M8324P0715O6229
$$ -128187 -40434 -53746 -120274 -89004 -812 -40537 -140316 -155334 -107010 -36295 29934
15283B9934P935K7931K4728k1427p5598J4770J9061k0042l8327j2990N9742J5585
$$ 29934 37869 65800 90528 69101 -6497 8273 27334 7292 -31035 -44025 15717 31302
15271C1302n9804l3010K9529K2110m5419n1475O7575N1258J6924M1051P50q286
$$ 31302 -28502 -61512 -31983 -9873 -55292 -106767 -39192 12066 28990 70041 70791 62505
15259F2505k4524j017j3879J8945J6158O1040k2277J4926p8198r7300k8430J4290
$$ 62505 37981 36964 23085 42030 58188 119228 96951 111877 33679 -63621 -92051 -77761
15247g7761p846K1774J4177p5707q267Q6519m322m8349Q3638M6647j6049J0375
$$ -77761 -85607 -63833 -49656 -125363 -133630 -47111 -51433 -99782 -16144 30503 14454 24829
15235B4829k7751L493K5685J0200J0879p831m7110J4117J3055q408J2787P850
$$ 24829 -2922 571 26256 36456 47335 39504 -7606 6511 19566 11158 23945 31795
15223C1795J194J4468l000k6856K1313k8547K3971n172j9508J092L3393l098l7655
$$ 31795 32989 47457 44457 17601 38914 10367 34338 29166 9658 10750 44143 41045 3390
15210C390j2319r218p498k5805n0956j0527P6120N3828j0877j8303L1612K7074
$$ 3390 -8929 -18147 -25645 -51450 -102406 -112933 -36813 17015 6138 -12165 19447 46521
15198D6521M9735m4475o7864k3719n7824m3826O5546K3760J3687n7108J0045L0438
$$ 46521 96256 51781 -16083 -39802 -97626 -141452 -75906 -52146 -38459 -95567 -85522 -55084
15186e5084Q4846L7376o592k4645n843P304k8949j0530k811j2677R357J04756
$$ -55084 29762 67138 60546 35901 30058 37362 8413 -2117 -4928 -17605 -8248 96508
15174I6508J10013k5304l4558l3992L3742n522q8161l1432L3639l6765o920Q349
$$ 96508 206521 181217 146659 112667 146409 140887 52726 21294 54933 18168 11248 19597
15162A9597l5231m4889o4092k0531j6142N3826r571M8563M8260L45N176R458n8229
$$ 19597 -15634 -60523 -124615 -145146 -161288 -107462 -117033 -68470 -20210 -19865 -14689 -5231 -63460
15149f3460q167N6071j4311m9632k4142l7161j5436M9102k5079m8307M5908O1101
$$ -63460 -71627 -15556 -29867 -79499 -103641 -140802 -156238 -107136 -132215 -180522 -134614 -73513
15137g3513l8069q3030P6817J51355L8710O1130p4789p1842k5135K6275K4675
$$ -73513 -111582 -194612 -117795 33560 72270 133400 58611 -13231 -38366 -12091 12584
15126A2584M326J3739k1756N685l6457K6754L9194l0575k1124p76j37L7346k9417
$$ 12584 16910 30649 8893 14578 -21879 4875 44069 13494 -7630 -8406 -8543 28803 -614
15113f14n5862m5651L6999N9304l0218p8943k3560J11686J7229K1547q8482k7912
$$ -614 -56476 -102127 -65128 -5824 -36042 -114985 -138545 -26859 -9630 11917 -76565 -104477
15101a04477J6343n3790j4860P8482Q641K7414Q4055m5101l9900p6460j37O9331
$$ -104477 -88134 -141924 -156784 -78302 -69661 -42247 41808 -3293 -43193 -119653 -119790 -50459
15089e0459n3105m2028n775l063j9962M4611Q2590M3792J23456k4720j3104O2713
$$ -50459 -103564 -145592 -151367 -154430 -174392 -129781 -47191 -3399 120057 95337 82233 144946
15077A44946l3708l9238M7150J2737j8380n058K1787n2285l5163l4857r544O465
$$ 144946 111238 72000 119150 131887 113507 108449 130236 77951 42788 7931 -1613 4852
15065D852O9970j5466n4591q6225n81N1544K4439J1371k5912o538j6776m8627
$$ 4852 74822 59356 4765 -81460 -82041 -30497 -6058 5313 -20599 -27137 -43913 -92540
15053i2540j6699M4266j0856J2250N3027k7964j6124P6086L0332k6746L7882R425
$$ -92540 -109239 -64973 -75829 -63579 -10552 -38516 -54640 21446 51778 25032 62914 72339
15041G2339K4184N508m8301K698o555j11237r2975O0692N0696j5451p243l1873
$$ 72339 96523 102031 53730 56428 49873 -61364 -154339 -93647 -42951 -58402 -65645 -97518
15029i7518j1724O7477M3132O27r4916o5890P053l53m569N6918K120k592N2583
$$ -97518 -109242 -41765 1367 1994 -92922 -158812 -151759 -152112 -156681 -99763 -97643 -100235 -47652
15016d7652R70r873J0782m0260K1742j0647l9189M8325R9729k6933m8970J6827
$$ -47652 -46682 -56555 -45773 -86033 -64291 -74938 -114127 -65802 33927 6994 -41976 -25149
15004b5149P7587M0716p1360n3600j0640k9701k4766L9825O243J6718J8823J2499
$$ -25149 52438 93154 21794 -31806 -42446 -72147 -96913 -57088 -50845 -34127 -15304 -2805
14992b805O5877M690m5336k6810R501K3839r1050l7944M0484M7119K0404n551
$$ -2805 63072 67762 22426 -4384 5117 28956 -62094 -100038 -59554 -12435 7969 2418
14980B418k5775J2247q45m773l0109n5454K4181M2280J8628J8436L6581L9351
$$ 2418 -23357 -11110 -11955 -16728 -46837 -102291 -78110 -35830 -17202 1234 37815 77166
14968G7166K6510k8710m9687J7798l215m7668L6159O4621j0833o4234k7616k5442
$$ 77166 103676 74966 25279 43077 39862 -7806 28353 92974 82141 17907 -9709 -35151
14956c5151p1014k8323j0516n145M6224J8297O5817N9155M2485l6285m6319k7771
$$ -35151 -106165 -134488 -145004 -150149 -103925 -85628 -19811 39344 81829 45544 -775 -28546
14944b8546l0093L9509K7227r241k7823M7029J5396M6362M7261j7387k3966l3364
$$ -28546 -58639 -19130 8097 -1144 -28967 18062 33458 79820 127081 109694 85728 52364
14932E2364P374n6399k0032J4449o143m1338q390J2099l0695j247R578l8355q0888
$$ 52364 59738 3339 -16693 -2244 -8387 -49725 -58115 -46016 -76711 -77958 -68380 -106735 -187623
14919a87623O2584N665P972N4568K3049P7855J9227J2410M0305K4789p2268j4856
$$ -187623 -125039 -119374 -111402 -56834 -33785 44070 63297 75707 116012 140801 68533 53677
14907E3677Q317n6809k9247q12J5545l0954q421N2759M1546K2917n3912o9627
$$ 53677 61994 5185 -24062 -24874 -9329 -40283 -48704 4055 45601 68518 14606 -55021
14895e5021M0822L5692m2557J4115L1710J2015P046L7276J6713k6014j4765O123
$$ -55021 -14199 21493 -21064 -6949 24761 36776 43822 81098 97811 71797 57032 63155
14883F3155o9072k5175N7574O232N0807L4964o9719q3194m6757m2741k1662L8901
$$ 63155 -5917 -31092 26482 32714 83521 118485 48766 -34428 -81185 -123926 -145588 -106687
14871a06687Q4876N409l5994N7447J2962J5178K470J5161l8046k3261J857j0833
$$ -106687 -21811 -16402 -52396 5051 18013 33191 35661 50822 12776 -10485 -8628 -19461
14859a9461R24Q0338L2526l8013N1285o7837k5041K4137L0931k1201P122Q1422
$$ -19461 -18537 61801 94327 56314 107599 39762 14721 38858 69789 48588 55710 137132
14847A37132n2105n9840L9810M3748J0949L9173j6310j8907n6831l0643K4321
$$ 137132 85027 25187 64997 108745 119694 158867 142557 123650 66819 36176 60497
14836F0497k7604m1935J4617K9947K3158k7007j7727n8909J8267M8689M2528k2952
$$ 60497 32893 -9042 5575 35522 58680 31673 13946 -44963 -26696 21993 64521 41569
14824D1569j2666K2011K6690p6560L9377l2284m7526J3692o0123k4686K529P6652
$$ 41569 28903 50914 77604 1044 40421 8137 -39389 -25697 -85820 -110506 -107977 -31325
14812c1325J1406P1458K9580J2473L7691R157q7287n3770l5170l1249q4403J3339
$$ -31325 -19919 51539 81119 93592 131283 140440 53153 -617 -35787 -67036 -151439 -138100
14800a38100O2372k4876r992L2359P6259M0962O2485l062J2687k2722r3154j10690
$$ -138100 -75728 -100604 -110596 -78237 -1978 38984 101469 98407 111094 88372 -4782 -115472
14788a15472p1830K5186K9225j7477K2077N4976M3626M4290O8829q0658p7315
$$ -115472 -187302 -162116 -132891 -150368 -128291 -73315 -29689 14601 83430 2772 -74543
14777g4543n601J04830M6361l3743j0185j8366l1107j872j7791N1094M3036n9649
$$ -74543 -80144 24686 71047 37304 27119 8753 -22354 -24226 -42017 9077 52113 -7536
14765g536m6714k773L4148N4644O178q904l475r7146P797J04103N6179K7617p1113
$$ -7536 -54250 -57023 -22875 31769 37947 29043 25568 -71578 -63781 40322 96501 124118 53005
14752E3005o2771L7935l949j5236j9853M5266J03518M12k9486k5342m072r4946
$$ 53005 -9766 28169 24220 8984 -10869 34397 137915 138327 108841 83499 79427 -15519
14740a5519j8982j7521m8467Q7364N8110o8156l5130N1216p6584M674j5933J1066
$$ -15519 -34501 -52022 -100489 -13125 44985 -23171 -58301 -7085 -83669 -78995 -94928 -83862
14728h3862M8405O2393n0171K8738P9903k4493o2557k8362N3942k7955j14538
$$ -83862 -35457 26936 -23235 5503 85406 60913 -1644 -30006 23936 -4019 -118557
14717a18557j6492K0878l4197l451K884M4768J8792P6132o154J5853r408J3627
$$ -118557 -135049 -114171 -148368 -151819 -148935 -104167 -85375 -9243 -15397 456 -8952 4675
14705D675N577L025M3225M4214k1891J0748p0702m4687N2356N5482l934K2283
$$ 4675 10252 13277 56502 100716 78825 89573 18871 -25816 26540 82022 78088 100371
14693A00371k9690K1921l3688p7645k1074P0492K6633k1995o1427j6956K136L8588
$$ 100371 70681 92602 58914 -18731 -39805 30687 57320 35325 -26102 -43058 -40922 -2334
14681b334K1527p4791l5118K9743M2738n1153m2197j0966J2761n13N9656Q48L962
$$ -2334 19193 -55598 -90716 -60973 -18235 -69388 -111585 -122551 -109790 -110303 -50647 -49799 -45837
14668d5837n650N7046L2909l1606l7608q1920o6644K5840j303Q7674N3756r221
$$ -45837 -51487 5559 38468 6862 -30746 -112666 -179310 -153470 -154773 -67099 -13343 -22564
14656b2564m8628J3293R4979M7864j9912p9611K1853K1378p3859K7P9544K6455
$$ -22564 -71192 -57899 37080 84944 65032 -14579 7274 28652 -45207 -45180 34364 60819
14644F0819q920n4397l8116J3838q303J8462j6429n981j1251K7107J797n4936
$$ 60819 51899 -2498 -40614 -26776 -35079 -16617 -33046 -39027 -50278 -23171 -21374 -76310
14632g6310K556M2270k0523K2020k9600m4437j9589K0786N1150N3105K8441k8671
$$ -76310 -73754 -31484 -52007 -29987 -59587 -104024 -123613 -102827 -51677 1428 29869 1198
14620A198k0995O6315M8293o0960L24J4421j920m0850l736J0053j7726K0186l9360
$$ 1198 -19797 46518 94811 33851 34175 48596 46676 5826 2090 12143 -5583 14603 -24757
14607b4757l8601k4671L6715J9505N781j1346J6023N7512O7044j677L151n9407
$$ -24757 -63358 -88029 -51314 -31809 -26028 -37374 -21351 36161 103205 101528 104679 45272
14595D5272R267m2364l3076k0953L8207R2690P9927k5798m3664n1613m1113k0106
$$ 45272 54539 12175 -20901 -41854 -3647 89043 168970 143172 99508 47895 6782 -13324
14583a3324L5057j2475m0876M6017j235N2014k2290l6004j3932M3426p023O258
$$ -13324 21733 9258 -31618 14399 13164 65178 42888 6884 -7048 36378 29355 35613
14571C5613K4634M1380m4475m5516j701k760O3023N2925J6411l7569o2101l9060
$$ 35613 60247 101627 57152 11636 9935 7175 70198 123123 139534 101965 39864 804
14559H04k39k2625M7510K1288r4021J8685L9188L273j4370J8292L4016L4507n1021
$$ 804 565 -22060 25450 46738 -47283 -28598 10590 13863 -507 17785 51801 86308 35287
14546C5287j5247K8444R439n1250l0957r190J5006L3176k4678N289L4584K8561
$$ 35287 20040 48484 57923 6673 -24284 -33474 -18468 14708 -9970 -4681 29903 58464
14534E8464J5478l3817n6111l3378L4754J8626L681P4269K304m2868p4924L5107
$$ 58464 73942 40125 -15986 -49364 -14610 4016 7697 81966 84270 41402 -33522 1585
14522A585N7626j0997P0525K3232o0500p4249o3501m4812Q6585p007j3286l5558
$$ 1585 59211 48214 118739 141971 81471 7222 -56279 -101091 -14506 -21513 -34799 -70357
14510g0357l1710M0175K0129J551P33q111j8165L8704M7528N3869k2193k2030
$$ -70357 -102067 -61892 -41763 -40212 -39479 -47590 -65755 -27051 20477 74346 52153 30123
14498C0123L8907m9165p4015N9714K6665J322l8680L7155M5193K4710n6468K4946
$$ 30123 69030 19865 -54150 5564 32229 33551 -5129 32026 77219 101929 45461 70407
14486G0407P530r2381l1814m0309j8580k494j6824J04008Q0499K5502O1333o4309
$$ 70407 77937 -14444 -46258 -86567 -105147 -107641 -124465 -20457 60042 85544 146877 82568
14474H2568m2363n655M7055M0873K8805l9610l1685J8003l3254l2798j0501o4310
$$ 82568 40205 34550 81605 122478 151283 111673 79988 97991 64737 31939 21438 -42872
14462d2872q2923r480P8332J48931P231q4418o5362O169N081P6576j1511o1974
$$ -42872 -125795 -135275 -56943 91988 99219 14801 -50561 -44392 -39311 37265 25754 -36220
14450c6220m4488r181l9661k6836K7990R2255N3418K1219l8720q6063Q8493J01540
$$ -36220 -80708 -89889 -129550 -156386 -128396 -36141 17277 38496 -224 -86287 2206 103746
14438A03746J5259j53034j3971L8252J4658K068O7017L5470o3421l7242j7401
$$ 103746 119005 -34029 -48000 -9748 4910 6978 73995 109465 46044 8802 -8599
14427h599k7386N2674L9870k4419m1714k815l7919O7434M5659r159q5045n1554
$$ -8599 -35985 16689 56559 32140 -9574 -12389 -50308 17126 62785 53626 -31419 -82973
14415h2973R974N1472N9388J391L2283M9137j7433L6169j1664l7316N326J277
$$ -82973 -72999 -21527 37861 39252 71535 120672 103239 139408 127744 90428 95754 97031
14403I7031m5323j6574r810q97j1222P959j4503O646J5946l6961l0404m605N6255
$$ 97031 51708 35134 25324 24427 13205 21164 6661 13307 29253 -7708 -38112 -42717 13538
14390A3538N3418J8503m0250j0173n9577K7378J7052k3959j4126l3577L131L5769
$$ 13538 66956 85459 45209 35036 -24541 2837 19889 -4070 -18196 -51773 -48642 -12873
14378a2873K2617Q298j0638k4862O37M2612M4261m513j6391o3654l1824p4178
$$ -12873 9744 18042 7404 -17458 -16821 25791 70052 65539 49148 -14506 -46330 -120508
14366a20508m8433K5015J12979K1202k914n4308k0300J4686o076M9594m498L7977
$$ -120508 -168941 -143926 -30947 -9745 -12659 -66967 -87267 -72581 -78657 -29063 -33561 4416
14354D416P1077p1832l2064L6402M9391l877L5555l0110l2918J4913j4321l1278
$$ 4416 75493 3661 -28403 7999 57390 53513 89068 58958 26040 40953 26632 -4646
14342d646N828J6115J6421P0742k2455o1078n6868M2903L5347L0537L2650j9658
$$ -4646 1182 17297 33718 104460 82005 20927 -35941 6962 42309 72846 105496 85838
14330H5838K3388L7486m1377j12839p3764l3921m685K4030R9133K9725m2579l8625
$$ 85838 109226 146712 105335 -7504 -81268 -115189 -119874 -95844 3289 33014 -9565 -48190
14318d8190N4203J7521r5620j9529M9893k8052l6321k529J14624M6286j0451K2569
$$ -48190 6013 23534 -72086 -91615 -41722 -69774 -106095 -108624 6000 52286 41835 64404
14306F4404l1477l728M665n1415j0447J2504K0729J0616M3580l3268j9013j7425
$$ 64404 32927 29199 33864 -17551 -27998 -15494 5235 15851 59431 26163 7150 -10275
14294a0275n7432r09R490M4486l3106K619L0131l4522K1410j5869J0797p713K6540
$$ -10275 -67707 -68616 -59126 -14640 -47746 -45127 -14996 -49518 -28108 -43977 -33180 -40893 -14353
14281a4353O2502K0186l5493p8182j7970O9897P085l7464K0486j3255O28l72K4402
$$ -14353 48149 68335 32842 -45340 -63310 6587 13672 -23792 -3306 -16561 -15933 -16305 8097
14268H097K3341l2572Q654P8268P333j7970o810J3748j0958j2729j01739k8205
$$ 8097 31438 -1134 7520 85788 93121 75151 68341 82089 71131 58402 -43337 -71542
14256g1542q496L6032O5779j3171r397M7289K5396l2229p4185q31K4238K8275
$$ -71542 -80038 -44006 21773 8602 -795 46494 71890 39661 -34524 -35355 -11117 17158
14244A7158K317k9739O4839P9162j5240R807o4263o8520q17m769m1434M0258P1790
$$ 17158 19475 -10264 54575 133737 118497 128304 64041 -4479 -5296 -10065 -51499 -11241 60549
14231F0549N0819k0607o8269l4370K5710N3320L1358k4708l714K29M1522n5632
$$ 60549 111368 90761 22492 -11878 13832 67152 98510 73802 70088 70317 111839 56207
14219E6207l5588J1966L0227J1997j942J7983j0626j9836p8422o5541J9825M6088
$$ 56207 20619 32585 62812 74809 72867 90850 80224 60388 -18034 -83575 -63750 -17662
14207a7662M7737Q757l1758m3762l0486P6459L6539k4836j6607K2102m0694k2341
$$ -17662 30075 38832 7074 -36688 -67174 9285 45824 20988 4381 26483 -14211 -36552
14195c6552K6480O0478M1258n5596m4977j120K6069J0648Q529m1635Q528J9742
$$ -36552 -10072 50406 91664 36068 -8909 -10029 16040 26688 35217 -6418 2110 21852
14183B1852j7777l4500q38j8741R267M6933J3680l2649M368M1169M0403L0849
$$ 21852 4075 -30425 -31263 -50004 -40737 6196 19876 -12773 -8405 32764 73167 104016
14171A04016L434m6119K0319j4380n21m8966l6749J6069Q1982L0608L8348n4987
$$ 104016 107450 61331 81650 67270 66749 17783 -18966 -2897 79085 109693 148041 93054
14159I3054p8554L0299M4627N4115M751j30810r8822n1727K2602L5809K2979p6013
$$ 93054 14500 44799 89426 143541 148292 17482 -81340 -133067 -110465 -74656 -51677 -127690
14147a27690j1035Q0814O4871Q4100K4653l7492k9193n1744q023p4888R753J10652
$$ -127690 -138725 -57911 6960 91060 115713 78221 49028 -2716 -10739 -85627 -75874 34778
14135C4778O5676J9560N2125j3749l3861q737m9138n2038l9462k6934l980J26
$$ 34778 100454 120014 172139 158390 124529 115792 66654 14616 -24846 -51780 -55760 -55634
14123e5634l5116M0192N3141J0070k4847m4775j9690Q6277O3905M3896l1484q8433
$$ -55634 -90750 -50558 2583 12653 -12194 -56969 -76659 9618 73523 117419 85935 -2498
14111b498K3380m963j8287j3239l4260M0747O5422m748j7975M0089k4604m9681
$$ -2498 20882 15919 -2368 -15607 -49867 -9120 56302 51554 33579 73668 49064 -617
14099f17p6928m5390P0868J08418K0649n7922q1997l7912O4743O185J9337n7251
$$ -617 -77545 -122935 -52067 56351 77000 19078 -62919 -100831 -36088 -29903 -10566 -67817
14087f7817R7835O905m0440l946O8764R028K4943r679q5420p1271K04M0569L05
$$ -67817 30018 36923 -3517 -7463 61301 70329 95272 85593 173 -71098 -70894 -30325 -30020
14074c0020k0166j77N4302L6408k6279k2923k6605J041K3735l117n872m605k4482
$$ -30020 -50186 -50363 3939 40347 14068 -8855 -35460 -34419 -10684 -13801 -19673 -24278 -48760
14061d8760O7275J1783l2445k487L020n2112n7214K2393M1628N0422J8682m263
$$ -48760 18515 30298 -2147 -4634 -1614 -53726 -110940 -88547 -46919 3503 22185 17922
14049A7922k588M076n89k1061N76Q6371k8317m2866k691K9031k346O5009J4622
$$ 17922 15334 19410 18821 -2240 -1664 84707 56390 13524 10833 39864 37518 102527 117149
14036A17149j877k3787K1252q370K5839k7527l5271k5798K5596l1440L7021M1118
$$ 117149 115272 91485 112737 104367 130206 102679 67408 41610 67206 35766 72787 113905
14024A13905J512n2568m4253l700O1210l2417n7836n2670J4572J13965N4765o4837
$$ 113905 115417 62849 18596 14896 76106 43689 -14147 -66817 -52245 61720 116485 51648
14012E1648j0934k3271L3410R8395P3990j37424j39335o885M4019J6405N5927
$$ 51648 40714 17443 50853 149248 223238 85814 -53521 -60406 -16387 18 55945
14001E5945L1988L5523O174k4304q8335q3787L6967P1175K2262p1125m497m9922
$$ 55945 87933 123456 129630 105326 16991 -66796 -29829 41346 63608 -7517 -12014 -61936
13989f1936K2427O4192j4519K1977l539n3653M417M7599P6312M627m8687l9567
$$ -61936 -39509 24683 10164 32141 28602 -25051 -20634 26965 103277 107904 59217 19650
13977A9650k396k7272K2608K3420l9654n3625l5475k1312j0604m2571k754L8390
$$ 19650 17254 -10018 12590 36010 -3644 -57269 -92744 -114056 -124660 -167231 -169985 -131595
13965a31595N9762P3878n2785o5103J6377P3709Q985J1154k6486J3615L1136k326
$$ -131595 -71833 2045 -50740 -115843 -99466 -25757 -16772 -5618 -32104 -18489 12647 10321
13953A0321N24O5790J847l5880K5836r749j8003m383k7971r0842K7120L2156j8905
$$ 10321 10845 76635 78482 42602 68438 58689 40686 36303 8332 -82510 -55390 -23234 -42139
13940d2139M3025J9411K9623P5247k951l3530J5618m1749L2298J0382n1867J1181
$$ -42139 886 20297 49920 125167 122216 88686 104304 62555 94853 105235 53368 64549
13928F4549K0958n5526j6020J3214m4967l0778J897J00496k1988l3446n3415k968
$$ 64549 85507 29981 13961 27175 -17792 -48570 -46673 53823 31835 -1611 -55026 -57994
13916e7994J2304M9476L1112r0266R744R7145R425M905l012m8707k9951M0377
$$ -57994 -45690 3786 34898 -55368 -45624 51521 60946 65851 62839 14132 -15819 24558
13904B4558j6414Q474m9521o1794m3658N1673O0377L6408L7804M0081q9523j9869
$$ 24558 8144 16618 -32903 -94697 -138355 -86682 -26305 10103 47907 87988 -1535 -21404
13892b1404m3689k6625M8042j8001M8000O5178J9199k7035l5122l6533p994M8139
$$ -21404 -65093 -91718 -43676 -61677 -13677 51501 70700 43665 8543 -27990 -35984 12155
13880A2155N423j5786l3028M741j3160O902J3804J5375k035l0127m4877k2033
$$ 12155 17578 1792 -31236 -26495 -39655 -32753 -18949 -3574 -5609 -35736 -80613 -102646
13868a02646R4877J3127l3280K7838P1702L3493k0586l2407K148r77K2886l4386
$$ -102646 -7769 5358 -27922 -84 71618 105111 84525 52118 54266 53289 76175 41789
13856D1789k3009j4431L6800l5066l7051k8378K4348M4411r804k9954J9110K9399
$$ 41789 18780 4349 41149 6083 -30968 -59346 -34998 9413 -391 -30345 -11235 18164
13844A8164N6195j6982m5574p4023l684Q634n3317O406P9305J8977N566o801l6988
$$ 18164 74359 57377 11803 -62220 -65904 -57270 -110587 -104181 -24876 -5899 -333 -7134 -44122
13831d4122l2983J3006R2409N9674O154m8323J627j4997N9579K7117n6915p3692
$$ -44122 -77105 -64099 28310 87984 94138 45815 47442 32445 92024 119141 62226 -11466
13819a1466j8936n85m3235J5211K9957n173m1405k8393n781N417K2576J1287m532
$$ -11466 -30402 -30987 -74222 -59011 -29054 -34227 -75632 -104025 -109806 -104389 -81813 -70526 -75058
13806g5058J880n2451J4600O8296k508K4819J4349K8129o6097j4952K7813j9512
$$ -75058 -73178 -125629 -111029 -42733 -45241 -20422 -6073 22056 -44041 -58993 -31180 -50692
13794e0692K7886p361P914J3075j1853p5806K4513o4111j3733J02170k0365n987
$$ -50692 -22806 -30167 -22253 -9178 -21031 -96837 -72324 -136435 -150168 -47998 -68363 -74350
13782g4350J5618J11031L0375p5791n980K8863k585R71O3990k4260J104l1724
$$ -74350 -58732 52299 82674 6883 903 29766 27181 28152 92142 67882 68986 37262
13770C7262q1252l2889k1372j5787o933P393J5397l590l4363N2294M2222M1949
$$ 37262 -43990 -76879 -98251 -114038 -120971 -113578 -98181 -101771 -136134 -83840 -41618 331
13758C31M4648j1426K294R1983m1220q6385j5839M381k0579o3080J4770Q1976
$$ 331 44979 33553 35847 127830 86610 225 -15614 -11233 -31812 -94892 -80122 1854
13746A854J6136N0372l3951j10396j31348J06482O2521M2984K1334M5844j0197
$$ 1854 17990 68362 34411 -75985 -207333 -100851 -38330 4654 25988 71832 61635
13735F1635m3892J4040M2898M0326l1571r6496n5174M2590j0133n5645K9813n13
$$ 61635 17743 31783 74681 115007 83436 -13060 -68234 -25644 -35777 -91422 -61609 -62122
$$ [...]
##END NTUPLES=NMR SPECTRUM
##END=
