##TITLE=Analysis number 322985
Compound Code mo 07738
Project Code adrs
Chemist Name ugmt
##JCAMPDX= 6.0         $$ Bruker NMR JCAMP-DX V2.0
##DATA TYPE= NMR SPECTRUM
##DATA CLASS= NTUPLES
##ORIGIN= Bruker BioSpin GmbH
##OWNER= nmr
$$ XWIN-NMR		Version 3.5
$$ Mon Oct 16 18:59:24 2006 GMT Daylight Time (UT+1h)  MAYBRIDGE\nmr@NMR_250MHZ
##.OBSERVE FREQUENCY= 250.131544655141
##.OBSERVE NUCLEUS= ^1H
##.ACQUISITION MODE= SIMULTANEOUS (DQD)
##.ACQUISITION SCHEME= undefined
##.AVERAGES= 16
##.DIGITISER RES= 18
##SPECTROMETER/DATA SYSTEM= dpx250
##.PULSE SEQUENCE= zg30
##.SOLVENT NAME= CDCl3
##.SHIFT REFERENCE= (INTERNAL, CDCl3, 0, 16.522)
##AUDIT TRAIL= $$ (NUMBER, WHEN, WHO, WHERE, WHAT)
$$ ##TITLE= Audit trail, XWIN-NMR		Version 3.5
$$ ##JCAMPDX= 5.01
$$ ##ORIGIN= Bruker BioSpin GmbH
$$ ##OWNER= nmr
$$ C:\u/data/dgb/nmr/ADRS/550/pdata/1/auditp.txt
$$ ##AUDIT TRAIL=  $$ (NUMBER, WHEN, WHO, WHERE, WHAT)
(   1,<2006-10-16 18:59:02.69 +100>,<MAYBRIDGE\nmr>,<NMR_250MHZ>,
      <created by zg, POWCHK disabled, PULCHK disabled
       configuration hash MD5:
       49 4B E0 1D 92 C2 6B 37 9F E6 65 BC 52 41 86 1D
       data hash MD5: 64K
       D6 84 C5 D9 85 AB 9F 33 0D 15 78 7A 4E F6 96 8F>)
(   2,<2006-10-16 18:59:16.60 +100>,<MAYBRIDGE\nmr>,<NMR_250MHZ>,
      <Start of raw data processing
       ef LB = 0.3 FT_mod = 6 PKNL = 1 SI = 32K 
       data hash MD5: 32K
       C7 95 D6 C4 61 37 5B 31 90 A6 65 E8 69 4F 37 8F>)
(   3,<2006-10-16 18:59:18.58 +100>,<MAYBRIDGE\nmr>,<NMR_250MHZ>,
      <apk 
       data hash MD5: 32K
       2D 20 A7 30 6A F3 B7 48 CF 95 57 3F 8A 88 B6 75>)
(   4,<2006-10-16 18:59:19.35 +100>,<MAYBRIDGE\nmr>,<NMR_250MHZ>,
      <abs ABSG = 5 
       data hash MD5: 32K
       A3 A8 9F DE 93 30 43 F8 44 E3 C6 73 47 23 37 A8>)
$$ ##END=
$$ 
$$ hash MD5
$$ C4 FF 3E 33 14 82 37 02 A1 97 95 C4 31 14 EA 47
##$RELAX= 
##$RELAX= 
##$RELAX= 
##$RELAX= 
##$RELAX= 
##$RELAX= 
##$RELAX= 
$$ Bruker specific parameters
$$ --------------------------
##$DU= <C:\u>
##$EXPNO= 550
##$NAME= <ADRS>
##$PROCNO= 1
##$TYPE= <nmr>
##$USER= <dgb>
##$AMP= (0..31)
100 100 100 100 100 100 100 100 100 100 100 100 100 100 100 100 100 100 
100 100 100 100 100 100 100 100 100 100 100 100 100 100 
##$AQSEQ= 0
##$AQ_mod= 3
##$AUNM= <au_zg>
##$AUTOPOS= <36 >
##$BF1= 250.13
##$BF2= 250.13
##$BF3= 250.13
##$BF4= 250.13
##$BF5= 500.13
##$BF6= 500.13
##$BF7= 500.13
##$BF8= 500.13
##$BYTORDA= 1
##$CFDGTYP= 0
##$CFRGTYP= 5
##$CHEMSTR= <none>
##$CNST= (0..31)
1 1 145 1 1 1 1 1 1 1 1 1 1 1 1 1 1 1 1 1 1 1 1 1 1 1 1 1 1 1 1 1 
##$CPDPRG= <>
##$CPDPRG1= <>
##$CPDPRG2= <>
##$CPDPRG3= <>
##$CPDPRG4= <mlev>
##$CPDPRG5= <mlev>
##$CPDPRG6= <mlev>
##$CPDPRG7= <mlev>
##$CPDPRG8= <mlev>
##$CPDPRGB= <>
##$CPDPRGT= <>
##$D= (0..31)
0 1 0 0 0 0 0 0 0 0.06 0 0 0 0 0 0 0.0002 0 0 0 0 0 0 0 0 0 0 0 0 0 0 
0 
##$DATE= 1161021541
##$DBL= (0..7)
120 120 120 120 120 120 120 120 
##$DBP= (0..7)
150 150 150 150 150 150 150 150 
##$DBP07= 0
##$DBPNAM0= <>
##$DBPNAM1= <>
##$DBPNAM2= <>
##$DBPNAM3= <>
$$ [...]
##$SUBNAM7= <"">
##$SUBNAM8= <"">
##$SUBNAM9= <"">
##$SW= 20.6930455092707
##$SWIBOX= (0..15)
0 0 3 0 0 0 0 0 0 0 0 0 0 0 0 0 
##$SW_h= 5175.983436853
##$TD= 65536
##$TD0= 1
##$TE= 683.16
##$TE2= 300
##$TE3= 300
##$TEG= 300
##$TL= (0..7)
0 120 120 120 120 120 120 120 
##$TP= (0..7)
150 150 150 150 150 150 150 150 
##$TP07= 0
##$TPNAME0= <>
##$TPNAME1= <>
##$TPNAME2= <>
##$TPNAME3= <>
##$TPNAME4= <>
##$TPNAME5= <>
##$TPNAME6= <>
##$TPNAME7= <>
##$TPOAL= (0..7)
0.5 0.5 0.5 0.5 0.5 0.5 0.5 0.5 
##$TPOFFS= (0..7)
0 0 0 0 0 0 0 0 
##$TUNHIN= 0
##$TUNHOUT= 0
##$TUNXOUT= 0
##$USERA1= <user>
##$USERA2= <user>
##$USERA3= <user>
##$USERA4= <user>
##$USERA5= <user>
##$V9= 5
##$VALIST= <valist>
##$VCLIST= <CCCCCCCCCCCCCCC>
##$VD= 0
##$VDLIST= <DDDDDDDDDDDDDDD>
##$VPLIST= <PPPPPPPPPPPPPPP>
##$VTLIST= <TTTTTTTTTTTTTTT>
##$WBST= 1024
##$WBSW= 4
##$XGAIN= (0..3)
0 0 0 0 
##$XL= 0
##$YL= 0
##$YMAX_a= 396120
##$YMIN_a= -676116
##$ZGOPTNS= <>
##$ZL1= 120
##$ZL2= 120
##$ZL3= 120
##$ZL4= 120
##$ABSF1= 16.522
##$ABSF2= -4.171173
##$ABSG= 5
##$ABSL= 3
##$ALPHA= 0
##$AQORDER= 0
##$ASSFAC= 0
##$ASSFACI= 0
##$ASSFACX= 0
##$ASSWID= 0
##$AUNMP= <proc_1d>
##$AZFE= 0.1
##$AZFW= 0.1
##$BCFW= 0
##$BC_mod= 0
##$BYTORDP= 0
##$COROFFS= 0
##$CY= 12.5
##$DATMOD= 1
##$DC= 0
##$DFILT= <>
##$DTYPP= 0
##$F1P= 14.0000005364418
##$F2P= -0.99999901652339
##$FCOR= 0.5
##$FTSIZE= 32768
##$FT_mod= 6
##$GAMMA= 0
##$GB= 0
##$INTBC= 1
##$INTSCL= 1
##$ISEN= 128
##$LB= 0.3
##$LEV0= 0
##$LPBIN= 0
##$MAXI= 10000
##$MC2= 0
##$MEAN= 0
##$ME_mod= 0
##$MI= 0
##$NCOEF= 0
##$NC_proc= -4
##$NLEV= 6
##$NOISF1= 0
##$NOISF2= 0
##$NSP= 0
##$NTH_PI= 0
##$NZP= 0
##$OFFSET= 16.522
##$PC= 1
##$PHC0= 156.7117
##$PHC1= 4.719993
##$PH_mod= 1
##$PKNL= yes
##$PPARMOD= 0
##$PSCAL= 4
##$PSIGN= 0
##$REVERSE= no
##$SF= 250.13
##$SI= 32768
##$SIGF1= 0
##$SIGF2= 0
##$SINO= 400
##$SIOLD= 32768
##$SREGLST= <1H.CDCl3>
##$SSB= 0
##$STSI= 32768
##$STSR= 0
##$SW_p= 5175.98343685301
##$SYMM= 0
##$S_DEV= 0
##$TDeff= 65536
##$TDoff= 0
##$TI= <Analysis number 999999
Compound Code 99
Book Reference 9
Project Code 9>
##$TILT= no
##$TM1= 0
##$TM2= 0
##$TOPLEV= 0
##$USERP1= <user>
##$USERP2= <user>
##$USERP3= <user>
##$USERP4= <user>
##$USERP5= <user>
##$WDW= 1
##$XDIM= 32768
##$YMAX_p= 335464289
##$YMIN_p= -49728
$$ End of Bruker specific parameters
$$ ---------------------------------
##NTUPLES= NMR SPECTRUM
##VAR_NAME=  FREQUENCY,     SPECTRUM/REAL,   SPECTRUM/IMAG
##SYMBOL=    X,             R,               I
##VAR_TYPE=  INDEPENDENT,   DEPENDENT,       DEPENDENT
##VAR_FORM=  AFFN,          ASDF,            ASDF
##VAR_DIM=   32768,         32768,           32768
##UNITS=     HZ,            ARBITRARY UNITS, ARBITRARY UNITS
##FACTOR=    0.157963299565203, 1,           1
##FIRST=     4132.6476996994, 0,             0
##LAST=      -1043.33573715361, 0,           0
##MIN=       -1043.33573715361, -49728,      0
##MAX=       4132.6476996994, 335464289,     0
$$ Real data points
##PAGE= N=1
##DATA TABLE= (X++(R..R)), XYDATA
$$ [...]
23451 -4431 -1349 81 899 3946 11408 6431 6183 -1520 -8629 -12578 -13356 -13933 -2256 8191 -837
23436 -837 6179 5864 -1313 5960 8082 4334 -9064 -6556 3577 10027 1799 -7424 -5316 -6044 -11424
23421 -11424 -12024 -10417 -3281 -5798 -9697 -6841 -3547 -5847 -3845 -9304 -11991 -13539 -9778 1169
23407 1169 -4188 -11629 -14846 -8999 -1759 -3169 -8726 -15334 -16300 -13390 -7505 -4820 1659 3708 -1151
23392 -1151 -8764 -1207 11126 6852 4978 -2634 191 4912 -729 -1383 12304 17343 14222 3263
23378 3263 5709 2455 3042 5738 -2857 -20699 -20533 -5807 5187 -9476 -20128 -13186 -7743 -5559
23364 -5559 -5249 614 1799 2152 8521 15887 23814 13588 6869 -6228 -12688 -12499 -18402 -13903 -3827
23349 -3827 -984 -1931 -1323 595 -652 -4870 -6360 -10209 -12417 -3513 -7739 -13651 -3736 -1909 6099
23334 6099 14237 9996 5954 -1205 -5479 -8252 -3044 1961 4911 -4672 3888 4950 -4935 -13153 -14265
23319 -14265 -13008 -19343 -9536 -5852 -1010 245 -1849 5417 10288 12917 15188 13001 5615 5502 3578
23304 3578 -6822 -4551 5 13573 17532 8559 2582 12000 9844 6489 2995 1577 3950 3546
23290 3546 -1396 -5386 -3026 -1880 -2060 -1437 -2535 -5489 -2234 -4476 -6221 -4999 -5608 -1643 3350
23275 3350 -7472 -12696 -3284 3557 10945 4969 6378 18027 21667 12821 11496 4705 -5076 -12535
23261 -12535 -11008 -4982 -12118 -10971 -1274 -4298 -4874 -2699 -3818 100 7327 9408 5987 4915 2269
23246 2269 -5115 -13231 -12550 -1016 -5120 3730 13803 8672 -5467 -6685 -9902 -13834 -20833 -20553
23232 -20553 -15016 -10599 -1513 -9408 -14688 -4269 -6188 -3138 1387 8479 7911 1163 3406 15133
23218 15133 18124 14910 12117 4086 -1051 -2038 -3172 -2987 854 2216 -1403 -7611 -12110 -3436 -5711
23203 -5711 -4978 6981 8538 -2214 -8499 -8394 -12982 -16128 -16951 -9291 -1989 -11985 -14201 -18743 -22077
23188 -22077 -14988 -12172 -8466 -5740 -697 6306 430 -6294 -3220 11 -5338 -10628 -6491 -2528
23174 -2528 -3802 5382 16355 21441 25133 20087 14360 4927 508 -301 7454 2403 3675 486 -7731
23159 -7731 -12052 -9851 -11165 -6750 -760 9440 19656 17080 1656 -4668 -7087 -6635 -13103 -14287
23145 -14287 -12951 -4891 2777 7173 1333 -1026 -1017 -6226 -16145 -15201 -9358 -12569 -18598 -15644 -9794
23130 -9794 5235 12890 13289 11968 9258 12685 19600 9906 -858 -9486 2009 6673 3040 11724
23116 11724 10821 10517 7208 2862 -1745 -2431 176 4334 4796 5695 -1626 -11276 -17224 -20227 -11213 -1544
23100 -1544 10372 18587 14151 15751 8180 3352 743 -4161 -7627 -5020 -3303 -8057 -2375 2708
23086 2708 6374 5017 4089 -2301 -856 1579 9769 8251 7077 6796 6307 16177 19557 2601 -1957
23071 -1957 671 9210 9443 5155 2209 2163 404 -7231 -6386 3699 11817 6196 6993 12969 -1782
23056 -1782 -17415 -24476 -15243 -13388 -12013 -2878 -1739 -3536 2902 -160 -6484 -9480 -10499 -12924
23042 -12924 -2335 5837 8844 5836 4954 5687 -4674 -9222 -899 -1782 -3161 986 -2493 -11459 -5928
23027 -5928 -1616 7810 14130 16387 23300 19055 9991 7858 6955 10867 8135 -200 -3454 3712 9441
23012 9441 6160 5019 1192 -4226 -10483 -9472 -6482 -4110 -8401 -7143 -13832 -10850 -4229 -1629 -6727
22997 -6727 -6262 4580 17803 18012 26643 27807 12716 8438 9758 -9359 -17443 -6935 -4297 -3242
22983 -3242 -4479 5649 10917 4857 7370 5136 2328 -831 -8169 -1263 5992 4229 7815 5365
22969 5365 12708 10456 -317 -7132 -12704 -18821 -16507 -11531 -11043 3046 3930 -169 -5534 -13570 -4360
22954 -4360 -2141 -5278 -8724 -13038 -14815 -25615 -12509 -7956 1454 13820 5645 -5785 -7332 -3589
22940 -3589 -1578 -734 -641 -6587 -15251 -7169 -1053 4546 10622 7010 6212 -185 1453 3330 883 5600
22924 5600 2330 -4517 -4813 -3445 -5009 -10249 -14873 -2108 -229 -3711 -4415 -168 2017 -1277 1593
22909 1593 -543 -1017 3766 13273 8275 9627 10528 12153 3219 -3138 -2645 -1151 -2549 2301 -3920
22894 -3920 -16904 -13025 -1193 9111 15964 8618 7073 -943 1710 5412 3574 -571 11524 17962
22880 17962 10015 12276 6869 -3891 -4306 -2724 -6139 -14603 -9220 3104 8826 42 -2835 -8207
22866 -8207 -1020 3397 7191 -2833 -10978 -1713 10004 14327 1209 -10577 -2019 -452 -4335 4178
22852 4178 8733 4842 8338 3126 -722 5666 6308 504 -3460 3628 3146 4173 1350 266 -3038
22837 -3038 -4975 -3647 8454 8729 -6187 -12563 -15150 -19890 -22150 -18806 -16276 -7402 -6628 2939 -2099
22822 -2099 -13598 -23637 -23836 -13182 -4006 -6012 -5211 -4560 5 4197 -2950 -482 6743 7690 3830
22807 3830 8044 12595 2621 -221 -930 -6924 -1032 14165 20682 21622 24438 21418 18655 22622 21200
22792 21200 22141 4369 -5299 -18586 -21104 -15827 -6424 4217 3229 6759 14419 6106 -2307 -2824
22778 -2824 -10215 -16663 -20183 -16310 -17396 -15488 -6856 3360 7767 6593 649 10310 12762 2767
22764 2767 -2616 -5638 -8963 -10220 -359 5845 2141 4097 -622 6085 15887 14044 5455 2863 10535
22749 10535 8975 11886 10111 779 -5426 -10188 -5671 -1515 1122 1498 5734 10835 4022 -36 5343
22734 5343 6901 5587 801 7534 7504 2057 -2119 8477 21926 16788 9007 3892 -2153 633 4852
22719 4852 4603 4845 6798 4629 -2809 -10414 -9490 -7381 -15329 -16070 -7683 -6552 -5538 -8984 -10359 -3919
22703 -3919 724 -676 698 -2385 -2588 -1213 6309 3956 317 -4528 768 386 -958 -14798 -8212
22688 -8212 -8454 -11432 -7388 -5518 -7847 -7896 -6676 1069 2478 -4334 -8430 -11874 -2875 878 670 -4033
22672 -4033 43 -2682 -7434 -3237 4866 12423 15301 13258 9617 4796 11813 10294 12010 18158 19763
22657 19763 18868 19635 12471 1913 -6282 -7348 -2700 -4697 -7727 -8239 -4608 -4350 -2688 11393 19257
22642 19257 20643 15329 10342 11872 10633 5276 3685 -2948 -10336 -4433 5272 8121 1351 5613
22628 5613 6416 7697 3308 5853 6114 7424 5175 3365 -1956 -10294 -263 1080 1308 3657 -5027
22613 -5027 -11842 -562 12316 6253 -11133 -16966 -12825 -10055 -14333 -11557 -19755 -23786 -23836 -14860
22599 -14860 -7146 1199 5059 -31 -6562 -13154 -13791 -5841 1564 4622 393 4196 8067 9489 9028
22584 9028 3433 -950 4125 222 -2204 -157 7846 2113 -1090 -516 -6171 -1095 6362 -337 -992
22569 -992 -4382 -5147 -10897 -7921 6261 7418 12611 8481 133 -6221 -11344 -9482 -10322 -11246 -1593
22554 -1593 -9284 -18635 -16649 -8916 -11163 -14111 -14911 -14537 -10762 -3301 -623 2186 6062 10005 11078
22539 11078 8898 15226 16792 9085 7348 6947 7225 9447 4889 3665 5076 12234 12540 6461 5773
22524 5773 -2524 -1593 -1009 -4953 -3228 5380 4177 -6420 -5019 8367 8127 3495 1570 811 3805
22509 3805 -4524 -15875 -17031 -2355 9557 3794 -1845 -6460 -2726 11150 12178 16426 10810 9825
22495 9825 16659 17959 7626 9064 15785 16066 14244 10809 9498 10748 7315 3823 7821 15553 23289
22480 23289 20161 17476 19376 22092 18796 13447 11377 12599 7605 17383 33441 62138 66703 76854
22466 76854 101976 116421 108838 93232 85107 68757 49176 30776 14343 -2755 13 -12524
22454 -12524 -20982 -10048 -1004 -3125 2225 1231 1773 2763 8176 15923 22798 24219 16483 5814 8872
22439 8872 2739 2422 878 -6056 -7063 -2806 3166 769 4537 3489 -8560 -4750 1370 10223 6245
22424 6245 6028 -3382 -8332 -13001 -5875 -5556 -6517 -5434 -1539 5009 8921 8372 19424 24757 16996
22409 16996 7224 14895 15484 21381 22215 6119 -2194 -2383 -14717 -12343 -7398 2568 22996 27592
22395 27592 14373 7305 -3169 -2311 299 -6926 -13912 -5944 -5305 -15488 -16696 -14992 -19405 -7831
22381 -7831 640 6013 3455 -8968 -6157 -17372 -18276 -13836 -21058 -18365 -16063 -17862 -12934 -1216
22367 -1216 925 5534 10598 9504 12722 9141 -3702 -559 5666 5730 13352 10748 9838 12719 20407
22352 20407 19798 9653 9648 13134 11378 4182 -2999 -5632 8848 14349 10813 3997 8329 2739 -8331
22337 -8331 -10769 -9276 2680 12842 16132 12659 4676 -1028 1873 -1588 -7565 -4303 -265 5776
22323 5776 9700 11617 -436 -8765 -10573 -16463 -21110 -3412 6434 10130 9067 9680 8000 8516 3948
22308 3948 5264 4614 12801 12189 13406 4426 -8969 -12317 -11433 -4802 3860 10565 13096 17123 8094
22293 8094 5573 9805 11386 16267 9077 15189 19665 14648 7205 7418 10220 2795 1113 -943 3642
22278 3642 10673 7103 49 -5159 -12877 -20616 -14097 -8333 1469 2010 -2781 -199 275 14 -1513
22263 -1513 2936 2322 273 -958 31 -291 4755 14201 8761 -9992 -7815 6003 3390 -10981 -18735
22248 -18735 -9304 4997 19782 8254 -1825 -781 659 -1327 -3593 -3536 -4712 -8902 -9514 -8877
22234 -8877 -1837 2407 66 -8843 -17378 -13865 -5049 3092 9534 13469 4353 -5039 -508 5443 855
22219 855 3103 9876 8694 2634 6019 3622 305 -1623 -3407 2033 2584 -6840 -19654 -12809 -2200
22204 -2200 1918 6306 8496 3826 -169 -7873 -13143 -13550 -5611 -5750 1102 -3079 -5489 -8950 -7897
22189 -7897 -7977 -10207 -9480 -8666 -12492 -16862 -22115 -13592 -9108 -8071 -16431 -16434 -15683 -9137 -7878 1938 11085
22172 11085 14046 -246 -9903 -14261 -11509 -1941 4338 7189 -62 -784 6306 4085 248 10852
22158 10852 16321 6213 -1362 -6631 -328 4462 4609 13289 7988 -3307 -824 7900 7053 -7309
22144 -7309 -13506 -11929 -9847 -5907 -7421 2990 8930 3347 9752 17102 7947 6558 6049 1192 -3909
22129 -3909 2234 7912 16773 14449 6576 12580 14317 13400 7418 -2041 -1517 -4073 -12081 -7361 1557
22114 1557 12565 2523 905 9932 8057 10789 17147 12528 12741 9959 -2068 -7059 -7179 -6406 -5335
22099 -5335 -4832 -5150 -3683 2208 8389 9964 6200 1341 6440 6806 -3475 -3872 -4660 133 8723 7545
22083 7545 -4453 -1065 4961 4382 -1955 -14474 -20538 -15064 -4280 1745 -1642 -6161 -1335 -3567
22069 -3567 -3588 -4123 -6303 -3075 1184 -2738 -3129 4078 12306 15918 10513 9429 14126 4322 -3773 -12012
22053 -12012 -7462 -5320 -1361 -5358 -3273 -990 1404 5434 9125 11373 16822 2312 -3583 -6891
22039 -6891 -622 -8821 -14105 -10410 -7695 -9339 -7585 -1543 1576 -6483 -11993 -14052 -7770 3998
22025 3998 5802 11052 18659 20365 11542 5159 3244 2543 7977 4276 -2120 -2310 -7510 -13721 -13456
22010 -13456 -10856 -6123 -3462 8083 8138 -4208 -2068 -2909 -7077 -7306 -8526 -17078 -20677 -18147 -10928
21995 -10928 -7365 224 11312 23750 31823 22503 8460 6792 7604 -8113 -7044 -4738 4518 6785
21981 6785 3072 1412 -10538 -13361 -9416 -10911 -12864 -12726 -6986 -8725 -3823 2314 8856 2036 -11704
21966 -11704 -12623 -9873 -11786 -18918 -11380 904 7233 6148 1764 1269 1561 3379 -9856 -14505 -15491
21951 -15491 -4563 5909 9979 12281 19551 25581 20361 15443 18591 13214 -3635 -12750 -4466 3773
21937 3773 -4639 -1469 9772 15507 11074 7658 11563 -5084 -12347 -3381 -2469 1045 4434 -3211
21923 -3211 -1946 -4930 -4026 -6114 -672 -7179 -14420 -1398 9934 191 -13823 -6512 9192 5272
21909 5272 -4320 -9575 6864 9658 6220 571 1265 10285 13701 10683 13087 13325 5534 3974 -5746
21894 -5746 -4730 3398 12774 2411 -4986 -14527 -15397 -4110 -169 -3318 -92 10330 12551 8486
21880 8486 4618 3142 18466 16682 1497 -3558 -5774 -8365 82 -1544 -5023 -4902 -554 -555 -14
21865 -14 8670 13962 18537 9406 -1198 -7822 -15220 -14542 -19437 -14598 -12335 -3846 -1320 988 6892
21850 6892 2640 1929 -1427 -1196 -2063 -15240 -16821 -14746 -16454 -12535 -17403 -14054 -11219 -9378 -10231
21835 -10231 -14369 -9608 -4569 584 -4711 -3340 -10179 -22354 -17059 -14618 -14850 -17191 -12208 -916
21821 -916 -7145 -11223 -6514 -7790 -7884 -7923 -3406 -954 6447 7433 -2616 -5349 -6781 -7705 504 7838
21805 7838 11250 10461 6687 -3292 405 15933 25967 14280 -22 -11718 -12222 -14711 -12245 -2752
21791 -2752 7070 11238 132 -1381 -10108 -15952 -20817 -16751 -22314 -25877 -16141 -17826 -18193 -21935 -24233
21776 -24233 -15727 -11458 -12287 -6212 -3189 -6063 -1579 -5616 -8475 2189 9033 -950 -12265 -10014
21762 -10014 -318 -1221 -3807 -2229 -3956 -7662 9516 14721 15087 10056 6688 5535 1727 -4293 -7812
21747 -7812 -6496 -10026 -3024 2935 623 -1814 -17629 -21893 -9005 -5353 -9313 188 3906 4253
21733 4253 2634 1661 3549 1614 -3013 -3729 923 2777 1829 5190 5912 5134 291 3553 3879 4994
21717 4994 15130 20352 21664 8046 1817 -1667 2715 4781 3038 9996 9155 4540 4246 3730 -1026
21702 -1026 146 6785 2970 -9157 -10430 -4391 -9266 -26146 -30954 -21126 -2792 7298 1601 3523
21688 3523 2777 -2906 867 1838 -848 1345 -2872 -11927 -20448 -17093 -13119 996 8852 9039 12508
21673 12508 4908 2067 4307 9013 19824 22830 18824 15801 15608 10333 13356 18274 18683 14999 9800
21658 9800 7731 9122 2028 -1163 -1846 -2853 -11312 -10787 -3102 6885 12152 19784 14278 8888 1858
21643 1858 -5419 -8718 -13177 -11448 -15430 -9656 8192 12145 2816 -4329 -8821 -12823 -13884 -9412
21629 -9412 -5429 1455 8584 14641 18356 14990 12714 10069 22511 21422 14542 20940 15712 9752
21615 9752 3715 6630 10216 4384 -10582 -10642 -1518 2706 -2521 4469 -2988 -1910 5940 8525 16051
21600 16051 8084 -138 -7507 -11433 -13678 -16595 -21354 -18271 -2280 2993 2195 3591 -599 -5583
21586 -5583 -11820 -27582 -27976 -24683 -24763 -22198 -9524 -9975 -16724 -2306 3342 11015 17081 29219 36926
21571 36926 32529 21366 12294 8554 820 8608 4057 -6937 -10679 -10234 -6344 -7582 -13634 -3483
21557 -3483 1845 5988 5720 -3272 -1717 2117 -1522 -10835 -517 2805 5179 11508 11780 14481 11763
21542 11763 1385 -7644 -3457 -2607 -3893 262 11048 14971 11861 16019 15608 14357 21483 14962
21528 14962 3399 215 4994 12111 14426 23371 11434 5229 5298 10037 6951 -4037 -8556 -11872
21514 -11872 -18881 -17204 -17545 -10646 -2868 -4489 1310 2581 8316 17377 8835 -291 565 10383 8602
21499 8602 6243 7761 8465 4876 1678 6648 6360 8483 4720 3149 4403 2489 1988 11804 10724
21484 10724 1456 -452 -6317 -8473 -1604 -1692 -756 -3426 -14384 -14837 -20016 -16340 -17478 -21402 -22142
21469 -22142 -20646 -10021 -3849 1232 4163 -2547 -4023 962 522 -3282 -13396 -16543 -14452 -9633
21455 -9633 -11979 -8642 2427 4507 1467 5027 7687 16141 21419 22320 20301 20004 19895 13001 11010
21440 11010 8885 2409 -3921 -3278 2237 -2670 -8929 -9691 -4025 -9619 -14548 -3086 2809 2231 1929
21425 1929 4262 5642 7867 14920 18550 10882 2604 -7732 -12747 -3178 10137 13446 9386 7726
21411 7726 3842 -158 -5346 -10520 -18352 -19912 -12913 -3474 264 -4084 -9303 -7310 -1673 -7305 -10615
21396 -10615 -7833 1265 2903 1399 9322 8127 -3760 -8230 -10453 1708 6765 2637 -5069 -6658
21382 -6658 -5200 -5695 -10702 -12762 -10202 -13416 -18924 -12177 -5981 -3955 -1880 -764 -2555 -4242 4587
21367 4587 4524 8053 13643 10217 3703 -2973 -4529 -5701 2768 8349 1222 -2289 -3993 -7043 -15287
21352 -15287 -12458 -18762 -14249 -5579 -1057 -2887 -3081 -4775 -7370 -6298 -5321 -4624 7055 15466 9674
21337 9674 11428 12822 10940 330 3596 8257 3092 -5565 -1673 4895 5643 7593 7326 -2123 -5716
21322 -5716 -5736 -7162 -7664 2306 59 -8070 -9400 573 5760 117 682 2328 3348 2959 -2385 -14183
21306 -14183 -8451 -11042 -22 5149 -3376 -10239 -16950 -16318 -20673 -20642 -20704 -19126 -17539 -9305 -5115
21291 -5115 2332 542 -10619 -11463 -484 -679 -5056 -10317 -8162 -7693 -9167 -8167 -13963 -8682 -6385
21276 -6385 -6495 -3876 -1168 3102 -8597 -17687 -7158 -6875 -11313 -2695 3320 998 -696 -4597 -224
21261 -224 2874 2299 9024 7039 4214 9253 6430 2366 1229 -678 -6086 -11158 -10810 -3356 -8654
21246 -8654 -4871 -11487 -19357 -10572 -2759 4733 4181 6910 10710 8523 5365 6495 5772 -6117 -18004
21231 -18004 -10571 -10256 -10991 -3056 6407 9830 11599 7626 -5720 -4013 -1309 -10799 -11663 -2815 9692
21216 9692 8766 -6233 -6683 -4640 -6375 -10556 -14633 -9445 -7948 -12994 -10850 -6782 -9397 -2725 -390
21201 -390 -12631 -14539 -5193 -4600 3642 5829 -954 1395 765 1042 -3628 -2903 -1735 -2155 -6403 -7173
21185 -7173 -786 -5049 -7434 -16417 -9937 4422 11805 6529 923 15456 15632 7054 9525 15150
21171 15150 8221 -1505 -9955 -10377 -2224 11162 8626 -2665 -6928 -3365 596 -2390 -12856 -21664
21157 -21664 -18999 -2522 12147 1564 -9672 -7911 1569 11596 19950 9588 -7876 -15310 -1044
21144 -1044 8047 10179 5635 -348 4749 7045 12883 8082 7593 1181 -10981 -17432 -20331 -24914 -18854
21129 -18854 -9904 -1655 564 6451 6187 -2047 -3312 -73 6569 10586 -2096 -7767 -890 -227 4466
21114 4466 2027 5962 3779 -605 3557 -1533 -2427 1646 -445 -8182 -5387 2070 1120 1510 -975
21099 -975 -3637 -14135 -7048 11750 10385 -496 -5778 -830 -650 2331 4725 4993 -1222 -6237 -670
21084 -670 13475 15313 12294 17896 13776 1710 -7445 -16496 -12465 -8471 -10054 -13621 -7126 1444
21070 1444 -367 -7127 -4175 -2936 -13244 -9556 992 4102 3614 -4867 -10676 -13188 -8630 -15869
21056 -15869 -12624 5578 22773 19717 6793 2061 14370 12441 -5467 -10069 -5876 -3255 -682
21043 -682 1534 1568 15272 18592 9083 -722 -7421 -9531 -6780 -9037 -9401 -6625 248 2954 5128
21028 5128 5990 5061 3366 13763 17670 10019 7946 8484 54 -4146 -10018 -10257 -11901 2285 -4055
21013 -4055 -16024 -17803 -11828 -2029 1818 -4905 -8757 -15686 -20206 -28329 -23491 -11180 827 9621
20999 9621 11778 9653 -4500 -22422 -24570 -6502 -3028 -13223 -22384 -20685 -13308 -3075 4106
20986 4106 3370 7477 3499 -3716 -1602 7162 5337 7132 -2607 -4000 -3547 -2377 -9200 -13981 -13485
20971 -13485 -10610 -6477 1981 16119 16924 11938 12215 13604 17775 4133 -9765 -16968 -11891 -9279
20957 -9279 -11289 -12209 -18047 -5147 2439 1204 -4908 -11718 -12151 -13867 -16371 -16831 -6599 -4343 -6103
20942 -6103 -9339 -5139 30 -1318 -14692 -24328 -29503 -23778 -18976 -10074 -5040 -5439 -5357 -3668 -7198
20927 -7198 -7940 -11007 -6133 -7435 3767 1655 3454 -3856 -10704 1794 6225 4162 -39 4206
20913 4206 274 -1855 -5132 1761 503 5581 4002 -11328 -8049 -8511 33 -3726 -11248 -10069 -10899
20898 -10899 471 5034 -1188 -4817 -1504 -6065 -6947 -790 -554 -5500 -7931 -8207 -8339 -431 9812
20883 9812 8970 4384 6452 2670 7986 4875 4996 4388 1535 -515 702 -5809 -9606 -3857 8061
20868 8061 5668 -1657 -7460 -11586 -12362 -5805 -21 7894 6261 6341 9689 5318 -150 -9383 -14682
20853 -14682 -20862 -18763 -8965 -5942 -5230 4921 -1899 -8364 -11299 -8747 4247 16703 22043 9850
20839 9850 -647 -14535 -25010 -29983 -30032 -13122 -4129 -9118 -7753 709 -2728 -9413 4369 16275
20825 16275 25740 24310 26103 15014 10092 2768 943 -3308 -11022 -10729 -8986 -11749 -12636 -6361 -3061
20810 -3061 -8412 2868 2374 2 1207 214 -3084 842 -2677 -4242 -4886 -4465 4058 3868 -4133 -6882
20794 -6882 -5866 -4189 -10373 -9538 -11593 -11425 -13419 -18731 -16575 -7515 -2278 3691 4752 4002 -2481
20779 -2481 1139 -2900 1474 3121 -3034 -2114 -1524 3973 3106 4876 -2703 -5580 -8203 -6537 -6085 -6817
20763 -6817 2344 7198 -3408 -16033 -10033 -2966 5 -7906 1179 6850 8650 6971 10354 18476
20749 18476 18989 11605 4596 -140 -1155 -1124 -9699 -13543 6252 13624 7974 12213 10729 17090 22492
20734 22492 22721 25380 23980 21723 20301 14586 15559 24754 26271 24152 31466 24070 8117 -3694
20720 -3694 -5977 -9247 -4130 343 1077 -5082 -1990 3035 483 -5128 -5799 -9743 -21348 -16899 -8461
20705 -8461 -5969 -4915 -6967 -12024 -24888 -27968 -19152 -9638 -13083 -11765 -15369 -16418 -28527 -30576
20691 -30576 -24606 -21371 -17288 -17294 -8934 -2326 1635 -9458 -10866 -12227 -12758 -12420 -11295 -12811 -16568
20676 -16568 -24993 -23170 -8829 -782 -3724 -2743 -995 8001 8603 -495 3424 5610 -940 -9082 -16061
20661 -16061 -12217 -9875 932 540 -6848 -10247 -15815 -24456 -15829 -5822 -4715 -3304 -12730 -20155
20647 -20155 -18178 -16071 -23198 -34838 -26435 -17732 -13407 -10980 -12913 -15184 -14663 -10987 -12921 -7943
20633 -7943 2328 2166 2077 13631 21307 22169 16552 10081 -3222 -1365 3564 2693 -1440 -8741 -20550
20618 -20550 -20095 -14271 -12127 -15473 -12903 -15064 -6617 -8943 -12997 -11382 -19945 -18244 -5130 -2155
20604 -2155 830 1440 7076 -4414 -9006 -7656 -11446 -19480 -21244 -12562 -4015 -213 -1585 -203 5260
20589 5260 7590 12839 14806 16545 20644 16043 7660 6912 7469 7384 4477 -1538 -5636 -10112 -7672 -1111
20573 -1111 1927 919 -1520 4860 6339 -1917 -978 -646 1656 5226 8199 4859 2561 11325 11789
20558 11789 19698 15699 4564 -7452 -10610 -11149 -7771 -13112 -20084 -17245 -491 11229 1888 -9196
20544 -9196 -12851 -9818 -9386 -10552 -12312 -1605 7336 8758 -1053 -3850 -13593 -13434 -15269 -8129 -7820
20529 -7820 -9301 -2459 2991 278 -4450 -4575 -6819 -9387 -6416 -2848 4039 3446 13438 5580 4485
20514 4485 -2381 -10369 -5924 -6416 -530 12850 14978 -983 -2592 7991 9161 9584 10264 8580 3538
20499 3538 3302 -3106 -10045 -2099 6545 -1093 -68 10441 14284 6915 4668 3971 4264 -295 -367 -4323
20483 -4323 -7991 -10290 591 10636 13989 12731 -7094 -6987 -15108 -16844 -11227 -9074 -6182 -2521
20469 -2521 -7260 -3805 3715 13796 3837 -7744 -10607 494 2396 1100 10766 1084 -11963 -2882
20455 -2882 4057 7014 7153 12232 6787 5875 7169 3209 4014 12318 15556 11359 4798 5674 -1160 -4468
20439 -4468 950 1021 8409 7622 5021 13454 5726 -2346 -7965 -8934 -11451 -3206 2255 -6082 -11579 -3550
20423 -3550 -5409 -3747 4591 7306 5389 6945 -2738 2445 -489 -3139 -1461 -946 -3164 1023 768
20408 768 2630 -1053 -1677 7434 10836 12828 7805 4970 1694 44 5777 2655 -3040 -14156 -18737
20393 -18737 -16281 -4859 164 3 -1737 -2519 -8174 -19670 -8405 8497 5095 -5547 -176 1402
20379 1402 -4639 -14214 -21668 -12355 -4454 -4230 -5644 -3670 -1439 1160 1626 2027 6331 10453 2281
20364 2281 3951 16530 20346 10170 -2880 -17248 -25723 -14922 658 10261 5751 -3666 1347
20351 1347 -3800 -9574 -4105 -2895 -10689 -4031 1969 1474 2508 387 -1586 4110 11605 15846 9222
20336 9222 7017 -1577 -8638 -12543 -11989 -9600 -14898 -6383 10495 -4551 -9230 1356 7744 93
20322 93 -13445 -14408 -17355 -7487 -4049 1110 5954 7275 6989 9352 -230 -576 4844 5944 1625 4576
20306 4576 12901 23495 21222 6392 5960 5781 3691 5389 8407 7065 5421 7388 2807 1064 2429
20291 2429 6216 6114 10567 13856 11743 12871 2745 -1187 1297 -4730 -3543 814 -1887 -2291 -364
20276 -364 -10688 -12451 -10298 -2962 2945 765 2608 3224 8750 15984 10635 -1493 -4073 -652 3045
20261 3045 3797 8032 11066 4430 -691 -7157 -1203 -2244 -9182 -14611 -7235 -8009 -14069 -13394 -9804
20246 -9804 1668 3640 -5773 -5336 3125 4885 10787 7254 9253 11475 9413 2351 -2612 7701
20232 7701 -2196 -3132 7054 11540 13063 9774 -474 -6476 -9310 1808 -951 -18656 -30233 -25268
20218 -25268 -18667 -11306 -7990 -3854 -5536 -6890 -1471 2745 -6599 -9460 -5323 -4389 -7092 -10243 -6779
20203 -6779 -1757 3229 9610 11561 7391 1945 -6001 -6413 -9863 -17791 -7719 -3077 -5387 5281
20189 5281 13684 19357 10114 -3654 1980 2546 6322 11494 2656 -1005 -2613 -3841 -3592 -1798 6944
20174 6944 9372 10884 15535 21498 23272 11574 81 601 1605 8497 5422 -5432 1047 5548
20160 5548 3592 2135 -1937 -2422 -1315 2301 5244 12986 13799 5463 -6683 -13153 -10617 -5050 -9159
20145 -9159 -19536 -15577 -13677 -22903 -31004 -17602 -16132 -21470 -13485 -5575 5702 8394 14687 3764
20131 3764 2765 3902 14491 24710 15175 1037 -71 3482 3726 12073 13915 14037 2252 -12101
20117 -12101 -10663 -3050 5447 1099 -1185 822 -3313 -3742 4362 8358 3861 -5564 -11815 -14323 -6449
20102 -6449 2336 15637 13790 2738 -4653 -15424 -14880 -17605 -15178 -12068 -5895 -10832 -12238 -6134
20088 -6134 -4654 1681 -5657 1952 2302 -5853 -13718 -15676 -9378 -5764 -7864 -5884 -10661 -5036 1719
20073 1719 16972 13306 11598 7210 2338 1093 1504 2397 8038 9848 6827 5213 -2764 -11538 -15565
20058 -15565 -8827 3867 15444 12977 1998 4282 7305 1760 1522 8664 3411 9541 2911 -14944
20044 -14944 -22043 -12585 -4365 -3373 -465 6865 4720 1873 5364 -2420 178 8196 3010 -717 -9461
20029 -9461 -11237 -15588 -11574 -5513 -321 -4455 -11008 -12916 -6314 -4979 -634 5074 1402 4940 4853
20014 4853 18679 18574 9799 7650 5759 -1105 -90 458 -77 4000 6329 -321 -1734 -11470 -16992
19999 -16992 -17324 -23971 -8076 8709 14778 11743 17821 13318 2446 -3580 -3259 -8343 -10381 -11836
19985 -11836 -1872 591 369 4719 963 1360 236 2574 2070 3006 9564 12188 8096 11628 13886
19970 13886 6888 -3667 -8179 -6192 -7319 -7162 -9100 -14812 -9500 1413 1064 2154 7663 1152
19956 1152 4525 695 -5791 3214 11971 10685 7633 7574 1106 -3753 -16168 -11943 3396 2105 -9201
19941 -9201 -13635 -11381 -6544 -4494 -16728 -22702 -12811 -6953 -11733 -12806 -12628 -13456 -11754 -4695 3244
19926 3244 -1300 -11147 -13729 -4445 1512 -461 -5631 -17540 -16686 -9076 -1708 2992 1943 7 648
19911 648 6818 -9924 -8521 -3023 -4485 -2070 -10555 -9407 8614 14220 18020 16532 11338 3679
19897 3679 4813 3320 7054 8385 6330 14750 8468 -174 -10161 -6420 -1771 -4726 -9070 -1325 757
19882 757 -6418 -6417 -3731 -5218 2787 8007 5979 -7390 -11097 -12491 -17528 -18899 -7798 13251 22930
19867 22930 32403 30840 15572 3451 -4388 -8551 -3725 -3628 1074 14837 25030 18751 17302 18896
19853 18896 20450 17152 11217 8029 8419 16046 14869 15311 8132 148 -2216 717 5569 5931 8341
19838 8341 7628 5070 -2623 -7495 -77 9667 12508 -1228 -14389 -23179 -20109 -12898 286 -4190
19824 -4190 -984 4935 5301 14736 28968 34855 29517 26743 13758 10545 4895 16782 18241 16550
19810 16550 17814 13150 -389 -11802 -12406 -7678 -10560 -15499 -25685 -24862 -20639 -15040 -17252 -17490
19796 -17490 -12787 -15149 -7700 -5441 -504 1494 -2975 -1913 4539 8590 5726 369 -6656 -1755
19782 -1755 -631 -487 -8147 -10516 -3214 -1632 -3822 -4568 10149 14121 11497 3620 1392 752 3592
19767 3592 10816 13233 5709 8024 14267 19833 21188 4685 -1646 -1072 4380 6940 2784 -94 10953
19752 10953 16860 14527 4398 5321 1044 1453 10673 15219 14063 10569 5846 -3872 -4695 2601 4945
19737 4945 4640 2164 6633 15380 21455 24263 17793 11104 7955 12035 2465 -9312 -5371 -723 -4470
19722 -4470 2942 11927 11750 5478 4258 11378 6502 -4628 989 -2422 -2539 -1679 571 6103 11411
19707 11411 14691 12806 9844 4922 2726 13164 15052 18682 13578 7013 1701 6593 14915 12654
19693 12654 3809 -2235 1104 15023 20814 25544 21483 13655 15599 16139 12485 6857 -1176 1662
19679 1662 1921 2220 -3193 -2536 5179 8819 4847 -1364 -6907 -1171 -950 65 -914 -775 5459 11422
19663 11422 19147 10208 8545 5337 -2168 8432 20464 20536 5713 -11 -2265 4144 9437 564
19649 564 -4971 -6300 2855 5903 4008 2272 2945 -7144 -2997 15393 31763 30502 21902 11223
19635 11223 7558 2354 -7873 -4179 668 4642 2780 -8642 -11616 -11400 -6298 -2743 2850 3390
19621 3390 -3836 -2430 -3901 -7991 3761 12717 11375 13365 13536 8444 6795 5200 -5140 -1278
19607 -1278 -5970 -10773 -3944 -1241 -3210 195 2094 1723 10544 6891 -3114 -5021 7026 15487
19593 15487 9193 2522 -4266 -8280 -15313 -9559 5673 11614 4343 3769 775 5889 5744 -3317 -14397
19578 -14397 -14239 -6651 -486 -1856 -13290 -10366 122 3297 4975 7744 5824 539 3808 9797
19564 9797 12386 15108 12999 2445 -2342 -238 -592 8053 12028 13054 6731 6206 3309 956 2822
19549 2822 12893 7645 -6076 -9727 -3740 5431 14898 20421 17704 8378 10599 1851 -2288 -8213
19535 -8213 -5538 -163 9122 5862 2182 4189 6373 -2186 1505 -2755 -6614 1278 5656 1788 -12284
19520 -12284 -6463 4163 9354 3827 25 2203 3421 1912 -2857 8992 14390 4379 7009 8744
19506 8744 11440 12519 11024 15156 25804 28249 24768 12605 -3781 -7274 -5562 4835 12244 10004
19492 10004 12992 12990 13697 9420 1609 8178 11460 9680 16437 19999 13533 13460 10062 16125 13660 11876
19476 11876 11542 10218 3849 4894 4764 6396 5278 -692 -6519 7205 16837 19211 16680 6849 -7644
19461 -7644 -19312 -12728 8837 19407 19770 15978 13765 2545 4650 11971 3765 146 5029 12397
19447 12397 9874 1620 -6444 -15743 -15117 -10583 -2950 10315 24490 20868 7413 -15600 -15608 -10502
19433 -10502 1359 544 -461 4645 6338 8651 9954 3715 -3531 -700 2704 304 4809 -3953
19419 -3953 941 13431 7985 1088 -9770 -19211 -14921 6019 10243 4253 13887 19693 25187 18097
19405 18097 15983 16111 11284 7874 11621 15905 14922 4692 -136 6679 8758 18260 22062 13409 6240
19390 6240 -3431 -5734 -2477 -3604 -1705 39 -4202 -8247 -557 8111 6956 18206 19187 9318 5780
19375 5780 11331 10429 8275 5942 4628 -347 -8102 -2956 1003 1605 2301 7513 17823 28731 31212
19360 31212 30702 31096 30535 19156 17838 7009 5051 1851 642 6803 19041 28629 23022 15901
19346 15901 22477 25197 29050 21114 7142 13613 8389 1312 -4147 -3448 3977 13239 13365 7466 14777
19331 14777 21804 21269 15299 15648 16706 5080 718 8576 23513 33228 35696 21958 7208 11193
19317 11193 2598 6756 13071 9050 11449 12734 9863 10988 11317 13512 9856 5055 8419 15266 14266
19302 14266 2197 3216 8750 16323 28189 26026 13710 10005 17942 14748 13993 20274 30159 24784
19288 24784 21979 16844 18880 30737 25331 9196 981 10299 14467 13493 11318 1894 1402 2574
19274 2574 269 15527 21716 24028 13010 8805 4908 11290 14646 6382 -219 635 -3523 -6265
19260 -6265 1551 54 -231 12156 23397 18692 18561 6076 6249 6727 18668 25197 33818 24372 3275
19245 3275 -2999 -160 3189 13106 14500 12684 16766 7910 13677 17139 4830 953 12420 18158
19231 18158 21273 26665 12218 12653 26107 22366 17396 19725 25830 17035 6757 -2452 -1799 9212
19217 9212 16916 28963 29011 19683 18737 25915 28260 25921 16482 18423 7265 761 7259 15317 25160
19202 25160 23360 11788 9622 13112 10044 17828 10207 16793 28282 19637 21902 20596 17951 17089
19188 17089 24326 35467 33029 24173 22215 22039 26184 30413 28904 28168 33671 28035 19568 27581 39484
19173 39484 46678 41503 29684 17985 11974 16069 27864 23663 23857 25504 29560 27235 36244 38718
19159 38718 34105 15177 8612 17621 21704 14939 24139 27501 22628 10003 10678 15930 13769 17327
19145 17327 13400 10146 30671 40456 32450 20967 17248 2742 8413 22177 31718 35890 36808 32238
19131 32238 34689 43603 36182 35318 35261 31928 28914 30749 34497 42843 47321 52479 65866 87481 87779
19116 87779 83222 71315 59445 60958 61249 68556 80107 87293 86911 74098 58982 53868 55020 55639
19102 55639 57938 55631 48780 56469 50738 37099 32487 25897 21349 20042 26857 32491 34703 33786
19088 33786 41749 46510 40755 35904 37151 38080 48150 51759 61429 58068 63660 60300 52191 46749
19074 46749 42225 45889 52135 55814 66352 82226 98729 109341 99680 92011 80486 74343 74908
19061 74908 63811 58193 59096 63843 63354 60655 55408 51138 43062 45505 43503 50867 47163 46842 42270
19046 42270 31248 30996 34172 32362 29488 36427 37693 31475 27592 32138 33666 33498 31297 28113 20543
19031 20543 16068 27498 32303 28513 30305 37104 30698 29394 30798 32346 29199 34267 43328 48354
19017 48354 53220 48326 36563 35524 36193 40842 40941 33009 30819 20587 24216 32829 27183 25321 27497
19002 27497 26366 24459 34525 47529 44961 45750 50617 43098 41815 35926 29584 32765 36634 35179
18988 35179 32433 32052 28064 25728 37974 39793 43979 43686 45753 41019 33248 40244 50539 45535
18974 45535 49159 48164 36736 28763 28604 29776 36997 41581 48350 43394 39222 41605 47805 54015 52349
18959 52349 48162 47651 37414 31852 44988 48030 40439 51442 49148 38053 30756 27138 30109 26542
18945 26542 26186 36458 38664 42844 37278 31692 33139 39101 28502 31068 44052 43602 35747 38155
18931 38155 42867 44930 47723 50943 51182 49055 48619 45375 44368 43112 50906 48479 50059 56496 50558
18916 50558 48498 49996 53746 48427 56784 74499 73226 72865 70080 83618 93174 90790 74019 75838
18902 75838 79551 81127 87027 85176 81774 88433 98115 107389 125544 156042 169919 188350 221666
18889 221666 263110 307418 341193 361890 374402 399244 416936 434832 448314 452072 454950 462628
18877 462628 465703 458618 453021 431905 410868 410904 426433 425106 418197 419935 431460 422545 406236
18864 406236 394613 394932 385005 374138 355119 336704 317498 303674 292014 264029 238653 222428
18852 222428 204961 208579 223713 231483 238796 249606 277868 306479 328761 350532 372388 392434
18840 392434 400294 408497 424813 434872 439039 441735 445637 447602 466646 497186 511698 523154 543164
18827 543164 580392 605170 613050 611195 596936 568324 530272 498397 474668 444033 416774 382702
18815 382702 355252 325216 282827 252599 237844 216374 200093 190815 188122 177926 164019 154159
18803 154159 152476 152934 138327 135186 140405 146070 157592 164378 168951 193331 207843 207614 219080
18790 219080 232093 250700 264381 258642 250324 263133 278132 309447 349485 389247 412496 411974
18778 411974 392390 347579 297162 256931 220189 200505 201279 212068 236384 253728 286496 315564
18766 315564 309789 271869 230556 201382 169904 150530 146744 150913 157339 169808 168345 171228 167363
18753 167363 166146 170291 193701 222519 250972 292493 333090 371182 429824 475394 508943 523974
18741 523974 525051 524394 545651 583885 632326 675291 696868 701858 680070 628690 572374 527234
18729 527234 498519 495630 510065 520427 524228 499469 452029 397382 343716 289254 262024 239829
18717 239829 219452 197348 175582 163745 158985 164641 164037 169158 165259 155647 145521 145177 145582 155348
18703 155348 158514 176589 203400 234018 262095 279085 295437 311708 336091 366970 411803 460172
18691 460172 500675 517418 502901 473144 435164 407106 396901 397538 419107 448226 483294 509450
18679 509450 503015 476747 441795 407203 372697 348748 324522 308368 296174 295583 289094 267568
18667 267568 246175 230912 228188 225774 218046 213090 203026 192730 174722 164469 172122 173691 167358
18654 167358 159514 153066 151558 155958 160574 174913 192252 202043 211820 221876 237104 245568 249862
18641 249862 274718 302359 314729 322486 338552 359959 372056 391826 418671 432706 444889 470935
18629 470935 491671 507764 515422 515029 508326 488324 458728 442045 437543 426196 407507 393112
18617 393112 375361 369047 363493 348074 337502 321355 296374 271150 260889 265502 259245 255911
18605 255911 257780 266500 274918 283818 287034 279360 279618 300227 319106 337165 352823 376767 398079
18592 398079 413817 424075 433646 436575 446283 453263 464065 479720 491141 508765 521659 525619
18580 525619 524779 512676 493071 467609 450590 431762 416773 404063 403065 399657 385144 373236
18568 373236 355660 328058 309206 301739 296940 293301 278041 261841 255691 250760 250804 256257 258146
18555 258146 256062 254787 255955 250625 251225 246516 257731 270186 268097 285314 306022 322972 347328
18542 347328 359081 378096 391616 396287 405927 401475 402219 405316 416694 428689 446303 464023 473373
18529 473373 490521 501710 505795 507972 500443 487100 471184 464396 465121 463844 453891 454950 460793
18516 460793 458820 456152 455595 447052 449069 446108 440377 444613 450452 458009 451270 438690 449849 468209
18502 468209 485188 492706 495132 509425 534150 563469 588242 601736 629819 661879 681548 699677
18490 699677 711736 723038 734403 739340 740331 731248 722920 712040 700406 693779 702193 714478 717786
18477 717786 726109 732036 739435 757965 774001 780838 787226 786804 784414 779407 785327 790394 794084 786207
18463 786207 790611 800930 805463 817754 834450 854907 883760 898568 898299 887735 883512 886782 903032
18450 903032 927490 944359 963865 978510 1003426 1033572 1065049 1099104 1117299 1146671 1174586
18439 1174586 1198331 1226565 1249888 1261660 1279263 1307484 1343567 1386225 1432359 1472771 1514592
18428 1514592 1562771 1634400 1706429 1780260 1869992 1969164 2075281 2194159 2307372 2433375
18418 2433375 2577361 2738814 2911964 3096577 3276074 3454456 3656173 3895794 4175386
18409 4175386 4503723 4878149 5307752 5817852 6430008 7199223 8180265 9475523 11243437
18400 11243437 13659392 16857590 20878163 25569656 30785093 36298018 41419056 45468399
18392 45468399 48549120 50751568 51361019 50363993 49411934 49704197 50991378 53116792 56493227
18383 56493227 60800272 64706664 67530619 69496529 69520020 66196323 60723712 55208073
18375 55208073 50218549 45475549 41143209 37509221 35019447 33722689 32956878 32184091
18367 32184091 31481058 30764910 29512092 27679278 25939349 24597702 23540132 22805530
18359 22805530 22791196 23758981 25814080 28961124 33091419 38133130 43843149 49636048
18351 49636048 55299803 61281440 67483042 72875932 77003857 81163491 86780394 93717629
18343 93717629 101030305 108157327 115184517 122032985 127979069 131866328 132552416 131472389
18335 131472389 131360602 132091955 131128393 128103597 125189983 123019300 119486612 112103451
18327 112103451 101202991 89137475 77725928 67209847 57261849 48420839 41484838
18320 41484838 36823042 33948672 32064216 30647739 29502079 28210515 26315765 24057699
18312 24057699 22005881 20151952 18319419 16633774 15308555 14311867 13530936 12910104
18304 12910104 12442396 12129864 11945481 11856849 11866660 11952667 12123357 12396410 12843152 13599185
18294 13599185 14833533 16823781 19939099 24682151 31272590 39181014 47168268 53687761
18286 53687761 56520592 53900155 47837518 43117441 42400032 45622345 51710056 59211585
18278 59211585 66050969 69852596 69288175 64367454 55944617 45968069 37240684 31231431
18270 31231431 27756611 26161920 25994529 26887567 28322259 29788146 30748904 30514492 28698480
18261 28698480 25788189 22856039 20553249 19020737 18209695 17998782 18249959 18975456 20278493
18252 20278493 22361757 25339450 29004004 32972438 36761968 39542903 40945983 42542695
18244 42542695 46448346 53473006 63536586 76036803 89730948 102889047 114073213
18237 114073213 123204989 131677144 140126142 146626382 146225483 134702254 113824400 91136075
18229 91136075 73115123 61865736 56570831 55551207 57085774 59513940 61094549 60210509
18221 60210509 56274995 50329394 43768377 37373923 31633422 26951187 23392134 20898932
18213 20898932 19218643 18046515 17213980 16606197 16155731 15921570 15963848 16299033 16977957
18204 16977957 18126219 19921541 22627162 26471131 31341672 36703945 41785201 45572458
18196 45572458 46898905 45963846 45324219 47457093 52694796 60099179 68270204 75184201
18188 75184201 79129837 80395062 80104123 77921750 73535582 67347990 58968249 48745109
18180 48745109 39130178 32098917 27776591 25476585 24585154 24739844 25713034 27375478
18172 27375478 29592463 32232741 35325436 38800907 41982613 44222682 45091442 44029392
18164 44029392 41501732 39191792 38047392 38796422 42093812 47847388 55055789 61859766
18156 61859766 66519504 67679430 64207160 57064183 49257306 42470333 37661383 35448240
18148 35448240 35467340 36645187 37686303 37799308 36419440 33055379 28671907 24509574
18140 24509574 20920716 18357772 16993234 16665178 17157652 18300504 19939388 21681716
18132 21681716 23008644 23769272 23781976 22654722 20778860 18939843 17309698 16057925
18124 16057925 15507979 15789300 16913879 18908128 21893708 25995434 31164528 37165254
18116 37165254 43829497 50687074 56750007 61438363 64971336 67358589 67592563 65482829
18108 65482829 62643539 57417628 46798576 34796151 26354220 20845115 17122553 14581767
18100 14581767 12857225 11712705 10994992 10656350 10685549 11089062 11819694 12742780 13612439
18091 13612439 14142381 14076907 13281177 11959499 10541005 9329423 8480004 7988309 7816840
18082 7816840 7985089 8498697 9318007 10300744 11232866 11920791 12192245 12028824 11761125
18073 11761125 11743484 12117632 12987665 14201621 15356863 16131866 16259078 15488965 14022652
18064 14022652 12392950 10932321 9847989 9296786 9171910 9188620 9148701 8922590 8330207
18055 8330207 7387637 6384110 5429520 4594142 3953939 3499329 3176765 2948559 2778136
18046 2778136 2642560 2529444 2430800 2345309 2258901 2177341 2105516 2029064 1948953 1872817 1800263
18035 1800263 1742451 1703869 1658004 1616138 1576854 1527913 1493215 1461924 1422886 1373487 1329222
18024 1329222 1293071 1254000 1226975 1201970 1176413 1160939 1143711 1127294 1103512 1080014 1055833
18013 1055833 1024879 985520 963905 946636 933867 905339 870054 846730 824353 802555 790184
18002 790184 775450 764421 750690 732695 724191 707883 695528 679765 667998 665117 654643 645525
17990 645525 647380 650937 651565 648688 639382 633981 616451 591686 570944 549277 532600 526612 525877
17977 525877 517207 503621 501593 487949 473502 465929 461743 453131 437088 427397 432194 433652 430363
17964 430363 423597 412588 404720 389916 366705 354412 341061 327642 322824 312938 310676 319589 323374
17951 323374 317726 319199 318568 312718 306257 302923 292982 290813 285212 282111 287792 296711 290946 280438
17937 280438 273235 270449 269885 262455 259528 258323 250238 235515 227681 234502 248433 245716 240444 246346
17923 246346 246523 245138 241966 234955 238393 239714 234131 232622 234905 231993 232681 239589 240599 233841 222016
17908 222016 215157 204133 201019 201918 213215 215414 214223 206226 206732 220507 227390 239347 254269
17895 254269 276074 292480 314448 346157 378625 408844 439243 488988 530742 555042 569036
17884 569036 581036 602485 616267 635710 659051 685947 706777 720661 723802 727682 730823 721455
17872 721455 711270 692797 673894 645684 616018 574926 534092 499263 447407 400732 368901
17861 368901 343939 324023 310136 310943 296364 288203 284663 279696 267930 260918 251539 247110 248733
17848 248733 252987 269323 281241 307363 339912 368253 391362 427025 465531 483760 501373 525093
17836 525093 542746 546294 554004 565547 580308 592885 588988 588551 589819 583990 563205 532618 512011
17823 512011 488531 464531 442720 414659 390778 372086 352491 341529 327247 325881 319617 300801
17811 300801 273663 237138 207446 195919 174493 162733 151216 144230 152630 165318 157005 166278
17799 166278 175399 176014 175317 175418 169837 159050 150991 150502 163369 173729 184751 201206 205283 204476
17785 204476 207180 212610 238628 267875 302672 345479 388577 408417 423111 432712 432506 438962 454637
17772 454637 473449 480090 491341 504330 501675 487664 445818 390369 342551 300643 261248 224034
17760 224034 199845 183782 184076 176805 161858 154596 159775 167071 170718 170261 176575 181330 187585 186201
17746 186201 188871 193634 192206 181194 174325 194477 226289 245438 282382 332155 388571 449496
17734 449496 510325 555193 597211 616284 612186 604420 602095 603066 599874 589631 560290 534659 513923
17721 513923 495113 464796 439151 427743 434745 439034 425894 401556 362519 319889 276388 246472
17709 246472 231099 215128 210540 198794 176286 160094 155167 144760 138333 126372 120723 127670
17697 127670 140804 151151 143919 140958 147031 158847 183014 216181 250923 282928 312844 329677
17685 329677 337020 333459 322249 304279 277046 251040 213593 201302 202702 214450 235379 272928
17673 272928 312017 353407 389398 406766 390953 367320 335325 294606 265866 255582 251913 248061
17661 248061 238506 234556 248963 251341 259537 258061 231536 218529 215499 202026 176944 183216 190930
17648 190930 180044 165522 151539 144355 144996 141123 120699 105457 96837 91874 80578 83413 87072
17635 87072 84500 84567 85436 88544 95079 100960 121021 141838 150318 158318 172718 184607 207920 221456
17621 221456 237175 250747 255326 262127 264205 281042 310643 332691 347226 351884 339192 314445
17609 314445 295149 268852 240489 222133 209836 199143 191176 184975 187165 182691 180868 165025
17597 165025 135144 104119 101823 97244 93775 93477 77416 64754 69278 66253 62279 61846 67589 69957
17583 69957 70573 74707 86076 91644 96720 101298 106120 111308 121899 129908 131734 129511 139294 156510
17569 156510 174901 190747 191951 176350 154287 143637 125831 106787 105865 112455 111459 116044 122017
17556 122017 126314 122276 116091 112534 100712 83540 72931 69462 68850 62204 56653 50923 54954 59479
17542 59479 49921 40775 38561 41747 47329 47523 56925 61731 41220 29001 23778 33079 47845 51407
17528 51407 50831 43670 35415 37111 33396 25090 23382 25960 30816 28081 27934 33559 43292 47116 40181
17513 40181 30025 28101 17599 12726 23582 28695 32143 42332 50802 48593 42277 34417 21010
17500 21010 31049 39015 40472 46286 48591 40086 35392 31721 25988 18697 30214 40503 42858 50649
17486 50649 53534 50456 51041 43944 47241 47090 43350 46954 52857 55041 49967 48562 51072 58325 55859
17471 55859 45225 36533 34895 47078 48303 40041 26274 27113 26462 30627 37772 39752 33528 18842
17457 18842 20572 26941 39187 40893 24862 21431 34005 43639 40967 35134 33954 37396 51619
17444 51619 61198 83327 98439 115409 133299 141876 111475 78796 60629 57150 52905 50271 44412
17431 44412 39802 22350 21861 24305 17940 16227 20762 32677 33303 23638 19675 23657 20459 25984
17417 25984 23101 21283 17260 24774 29429 30562 24351 25180 20950 18779 18065 13133 16068 19817 27752
17402 27752 32878 38831 29027 22393 25685 32828 28481 25789 25488 26535 26510 18783 13912 6886 11051
17387 11051 17843 18810 23869 12581 14738 13379 -1096 6671 19208 16671 20827 16589 8702 13941
17373 13941 17598 20597 25803 16191 17405 16810 12987 12678 15521 24853 31708 22924 16109 16847 21534
17358 21534 24116 32967 36243 31765 32689 31129 29603 22027 26618 26613 24760 20138 17640 17747 28334
17343 28334 39358 33234 31978 29872 23527 29855 30577 27440 27312 29252 22570 11212 22742 36609
17329 36609 36064 35033 37821 41719 45704 37851 25565 22688 38271 40600 35854 30745 30326 20552
17315 20552 9410 6936 7738 20957 26548 33718 39656 27309 24241 26530 28611 26480 24311 22472
17301 22472 21257 22773 20173 19379 14545 10875 19126 27164 23964 21759 12214 5580 13382 581
17287 581 -8136 -3581 -3873 3423 15794 22886 15397 9191 9877 1305 -98 1467 -6390 -7054 -928
17272 -928 2804 -266 -1279 -3086 -5354 125 10230 11619 5226 11933 20362 19486 10475 17897 11569
17257 11569 1634 2693 -145 -2364 6488 17375 17220 8453 11177 17722 21923 23996 22377 25721
17243 25721 26768 21067 19135 16325 18730 23349 22464 17560 11267 16409 25146 14557 9785 5948
17229 5948 5266 9068 11527 5690 10447 18080 21229 23231 29002 30021 31079 24046 17562 9224 5390
17214 5390 3602 10374 18557 17097 22407 21532 21823 25670 23444 26494 27870 36550 37770 28621 18846
17199 18846 22827 29957 28761 29336 31628 35427 44044 43012 31924 29606 34460 25582 18683 7902
17185 7902 -1919 -7571 -12486 -12836 -9502 -181 8260 11346 11416 22535 25156 23136 13931 14552 24881
17170 24881 20033 21797 12347 14357 10783 6267 7540 8126 9818 8029 7377 -293 -2508 -4773 -8357
17155 -8357 -7678 2732 2304 1575 8895 9343 15348 17200 13802 10746 6042 1496 -296 13542 24822
17140 24822 20969 17004 12309 7824 -6662 -10934 -6011 4933 1668 -5916 -7380 7391 20356
17127 20356 20757 20410 16484 23134 22020 20306 18903 12381 24203 21727 17621 20357 11673 9072 11102
17112 11102 5382 1371 -3532 -2645 -10085 -2409 1379 5460 -6220 -10208 -12503 -3075 6187 2173
17098 2173 -4696 2085 14663 11546 2959 -6038 -4830 6958 10797 4692 -530 -4944 -1965 593
17084 593 840 1736 14027 16680 12639 5147 -129 6488 21598 24322 12064 7486 8295 18765 20198
17069 20198 24610 31145 23551 18555 13221 5589 14449 22204 14437 5355 11703 15557 18238 30650
17055 30650 34893 31050 27761 9623 -2829 -3431 -657 8897 16635 17467 27432 28221 22429 17565 20391
17040 20391 16414 5668 5747 6039 3407 9996 19351 14137 7643 7593 3462 827 908 9856 12668 18299
17024 18299 16861 23804 27994 14569 3340 -1430 9726 23081 25617 26644 22384 15126 9240
17011 9240 22661 25356 16355 21762 17148 5471 -3886 -11660 -9491 -14600 -12775 -14272 -10836 -5656
16997 -5656 3665 13855 17907 13551 9620 10827 12257 7099 14872 17720 15353 16888 22879 19690
16983 19690 18821 17239 6408 8394 2675 -6735 -1987 -6977 -4059 -844 3675 10605 8611 7151
16969 7151 7377 1750 -9928 -20680 -6779 8385 316 3786 8149 10344 8390 6801 10293 8556
16955 8556 8328 2352 1147 -7451 -7950 -7181 -333 -10061 -13991 -8881 -11019 -14858 -7135 -1528 4048
16940 4048 -1081 2320 6737 14489 12275 5396 4328 9836 15771 15893 22436 17063 3884 -5641 -5638
16925 -5638 374 5129 -1236 -5848 4540 17745 22561 21127 14815 8830 2808 -1265 -10415 -15566
16911 -15566 -6862 5015 5841 5256 1552 8842 12965 13790 14793 13608 12588 4206 424 2201 6342
16896 6342 3427 1865 -100 3259 4866 13000 8596 3627 2291 -3305 -7532 -4618 3340 10041 11263
16881 11263 4794 4081 5284 9036 -6058 -8026 -2295 -1486 -717 5974 3491 2898 3483 1585 3959
16866 3959 5791 9058 17499 18523 4403 -11631 -16544 -3402 10033 13042 16345 9718 6471 13164
16852 13164 15510 10615 8180 -1658 -2455 1492 -989 4787 3372 -8138 -4971 -798 -4327 -4117 -256
16837 -256 3335 585 -3876 -7003 -1692 8952 8174 8258 10506 339 -8662 -9680 -70 3843 1701
16822 1701 -7 -427 1220 2632 1150 -5824 -171 -5773 -13359 -11778 -8482 -6974 1380 4138 -2649
16807 -2649 1776 -1870 -7730 -4682 -5171 5905 10007 6081 17221 21450 10954 1786 7138 12248
16793 12248 14840 20275 14976 8263 13150 5874 5920 3870 -6901 -13530 -17231 -24588 -10870 -1570
16779 -1570 -2891 -86 -2196 -1393 -2970 -1864 253 -4310 18 9577 5364 -4887 -3827 10182
16765 10182 24654 14174 3651 -4456 -6371 -7294 1596 7516 1153 -188 113 3077 -665 -3741
16751 -3741 -4623 1305 5304 1900 3291 -7360 -7915 -18057 -29946 -25084 -14723 -10453 -15402 -8903
16737 -8903 -965 -6496 -13346 -13450 -7304 -10634 -11488 -13488 -11103 -1508 3517 2800 9787 9619 8567 12587
16721 12587 13833 11 -13013 -10306 2493 6762 11890 1999 -2321 -5721 -61 777 -11363 -14900
16707 -14900 -7685 2539 11036 11886 17137 10899 -219 -7672 -8207 -9019 -6307 -2045 1410 4667 3376
16692 3376 2736 5151 5651 -3865 -11780 -19715 -4684 -6164 -5030 3344 -2550 -3428 1994 1180 -103
16677 -103 2866 871 -6398 1376 -7619 -17837 -14873 -6380 -10072 -12512 -14580 -11375 -1602 -5240 -8824
16662 -8824 -4150 3652 6095 4113 -11851 -21476 -23351 -15023 -11598 -10976 -3867 -9062 -3360 -5716 -12663
16647 -12663 -9030 1984 6483 2688 -2996 -1755 -1131 1548 12919 10598 505 -6068 -6007 3235
16633 3235 16487 16026 18485 15419 3929 193 7443 6943 2823 9005 2700 -823 -2360 -6292 -5001
16618 -5001 -1219 -662 -779 2327 -2661 -3574 553 466 -10297 -15838 -16451 -18478 -15501 -16446 -17722 -15085
16602 -15085 -9324 -2030 6027 5349 859 5040 6003 -463 585 10353 3468 -4839 -1230 4270 378
16587 378 376 -8490 -3749 -1650 -10070 -9869 -3816 5580 17681 19035 2758 -10876 -7582 -1987 -626
16572 -626 -12605 -4628 6990 8708 -4359 -13999 -5745 1166 -1847 -9886 -8514 -6616 1956 7001
16558 7001 9848 10372 3962 1652 6822 14050 10653 1174 5456 7201 3065 5211 1490 -1944 6030
16543 6030 10983 6585 9748 1237 -1951 -2944 3018 -1622 -9301 -11640 -13328 -10705 -7994 -9287 -10181
16528 -10181 -8538 -12617 -13260 -7721 -13530 -15537 -3613 -7026 -1534 5583 7376 8545 8790 1610 -10199
16513 -10199 244 14180 12342 8655 5680 8247 14113 13152 11578 8395 7501 -2657 -4770 -7184
16499 -7184 -11473 -17279 -12963 -6131 820 5066 195 -353 -5267 -8270 -3971 -5540 -4681 -8195 -3915
16484 -3915 7029 8306 5854 -1705 -9857 -9407 -5493 -1936 2933 1587 -2262 -8352 -7622 -8668 -9544
16469 -9544 -15151 -18222 -17523 -8461 -16377 -23273 -27948 -13630 -4694 -3133 -692 -5495 -9978 -12844 -16250
16454 -16250 -11343 -2558 -4466 -3814 842 1136 3135 1961 1821 6280 6711 9843 17860 15990 13381
16439 13381 2398 3621 9535 -553 -13515 -18402 -14919 -8502 -8902 -6232 1351 7984 5615 -3800
16425 -3800 -6662 2834 2393 -918 -4463 -1969 -2061 11990 18599 21232 13122 -3456 -1990 2825 12982
16410 12982 1826 4314 10267 9216 5072 596 -1805 1355 9170 15620 28712 33692 26716 26607
16396 26607 20921 17749 15748 10575 9311 6547 6798 -1109 -1011 1153 5938 6536 10930 13103 8685
16381 8685 3875 -4513 -17349 -15970 -17110 -9833 -13999 -12480 -8574 -5410 -233 -207 -2972 -7977 -10289
16366 -10289 -12621 -17331 -17329 -16933 -12113 -10519 552 -4180 -8108 -12990 -9051 -2362 159 3249 4451
16351 4451 8890 13604 18980 13722 2596 -1529 -738 -12278 -15457 -12144 -8669 -8899 -14248 -14929 -5715
16336 -5715 -13378 -19195 -18237 -12155 -3644 -151 1395 -2166 -4909 -8162 -3518 1470 -4860 -12480 -13989
16321 -13989 -9179 -7518 -9151 -12196 -13725 -12293 -15276 -9180 -8725 -6933 -11067 -18822 -14415 -387
16307 -387 1285 -7577 -16089 -19176 -8361 -14406 -13624 -4428 3229 3193 -6786 -6709 -9102 -10377 -13694 -3950
16291 -3950 -2677 -3088 -4163 -3579 -8559 -1347 -5135 -5759 -3231 -9748 -9633 -11361 -11428 -7158 -4106 5282
16275 5282 3876 4822 -2100 -10497 -16599 -13848 -16472 -11665 -4515 -9507 -14586 -11632 -18039 -15638 -10967
16260 -10967 -14958 -10477 -3505 3652 4992 -7790 -10736 -13192 -8400 -3477 -4741 -12861 -13283 -11636
16246 -11636 -11970 -5764 -197 -4612 -6815 -10014 -7924 4417 -3091 -6204 201 -1418 -11071 -5930
16232 -5930 -9595 -11525 -7383 -10788 -7491 -5442 -14616 -15190 -16975 -21682 -23199 -20251 -15216 419 2376
16217 2376 3912 1662 3097 6419 10746 -2909 -13721 -9256 -5326 -9132 -14211 -13223 -14968 -7809
16203 -7809 -2900 3924 -3166 -10411 -8848 2271 10928 10275 11763 -1985 -4670 -8599 -8492 -4493 -5427
16188 -5427 -13863 -16589 -5242 5098 -635 -5213 -8637 -7287 -4957 -4710 511 4878 -2216 -7974
16174 -7974 -20941 -13665 -5749 1439 -62 618 10 -5431 -2964 8654 8186 3743 -7227 -10229 2121
16159 2121 1545 -6265 -15675 -23027 -14791 -9969 -10243 -21432 -25052 -21557 -19316 -17636 -19283 -12688 -8665
16144 -8665 -15233 -10668 -14431 -4300 5176 -3118 -13983 -13441 -7709 2497 6074 2494 -4665 -3701
16130 -3701 -11005 -10603 4403 12214 10586 10278 9858 5419 -3049 -3891 -3817 1809 12002 6993 1583 -7084
16114 -7084 -19098 -13215 -11167 -7407 -3138 -8930 -7855 -3019 -7051 -13972 -9751 -16044 -10545 -636
16100 -636 5941 12925 7262 5138 5010 2418 1457 1918 3304 -10861 -13880 2550 6705 409 -13402
16085 -13402 -16901 -14156 -10592 -10790 -3495 6456 11495 -4318 -9970 -5668 -5675 -2572 2250 -2042 -3276
16070 -3276 -3597 -13413 -16418 -17362 -15164 -10633 -7560 -5110 -2246 7528 2155 543 3834 4609 8274
16055 8274 13786 10454 -6502 -23187 -17593 -9316 -8743 -5950 -13898 -13643 -9597 -11735 -17652 -7183
16041 -7183 -3778 -11216 -10409 -7069 206 -1302 -3137 -1851 -7959 -15415 -19957 -17526 -12102 -6820 -10015
16026 -10015 -15089 -7704 7546 16555 6627 -5814 -7658 -16054 -22680 -20214 -11402 -10514 -9702 -7318
16012 -7318 1474 -4511 -6575 -16929 -17039 -3433 8699 7987 11736 12089 10328 10125 162 -6962 -12650
15997 -12650 -11634 -14624 -14543 -2743 -5638 -5211 3759 7206 2827 9261 10126 9775 -249 1480 -260
15982 -260 -11884 -12761 -15352 -17354 -17587 -19363 -18275 -19068 -23275 -21025 -25660 -29555 -23101 -15678 -13006
15967 -13006 -10326 -12520 -11995 -10587 -9707 -9853 -14497 -17144 -21298 -18485 -6787 -4522 10844 13721 -1101
15952 -1101 -9937 -9018 -1533 -1465 -3241 -999 -7105 1652 2500 -8799 -13364 -17469 -7077 -3205 -6142
15937 -6142 -17244 -12174 -18673 -26255 -28211 -26393 -22157 -14910 -2261 11528 21669 21500 21173 15724
15923 15724 21674 26074 21054 18591 15385 8166 -9312 -11334 -2366 -13249 -24627 -26227 -22595 -20436
15909 -20436 -25800 -35040 -31890 -24584 -19294 -14300 -20183 -15999 -2257 -740 -8925 -15877 -26361 -28001
15895 -28001 -22380 -21799 -13620 -5658 -13156 -23256 -32094 -35271 -36528 -37774 -37947 -41389 -45383 -41044 -30873
15880 -30873 -25537 -13240 -3301 6776 13688 24468 33641 38060 29467 22788 17191 13860 -1700
15867 -1700 -16665 -19846 -28807 -35616 -35187 -31161 -27928 -25656 -22015 -23395 -22238 -15605 -5685 1416 -1719
15852 -1719 -5381 2154 11791 17028 15611 7297 -646 -9324 -1116 2763 9373 13813 4722 -1103 -2193
15837 -2193 7237 8017 -3361 -5077 2351 8071 3778 -8926 -19524 -19698 -17057 -15045 -16828 -25838
15823 -25838 -27393 -29568 -25447 -19144 -15845 -13234 -12773 -16556 -12179 -11536 -5666 -4706 -1477 -457 -13641
15808 -13641 -14217 -7175 993 -667 -6230 -14317 -15758 -9557 -6931 -6799 -15011 -14223 789 2874 -2770
15793 -2770 5449 6453 6356 263 -6102 1973 3248 3382 3015 -4428 -4803 2518 -1781 -9056 -14006 -12559
15777 -12559 -25514 -24375 -20151 -24930 -19627 -5388 2956 5868 -1681 -12433 -19485 -23714 -18942 -11234
15763 -11234 -2275 -3316 -6826 -12659 -8118 -531 3205 -5276 -17007 -16890 -8889 -13009 -17318 -16952 -10304
15748 -10304 -12750 -12206 -9027 -4567 3287 7148 495 -7994 -3928 -3329 1509 -3763 -17605 -26750 -26978
15733 -26978 -28744 -27907 -23311 -7931 -11336 -6802 -4787 -10904 -10933 -12943 -12700 -6534 -1722 -4328 -1711
15718 -1711 -9901 -22626 -18542 -19133 -11734 -6931 234 5914 -2801 -9584 -5744 -11591 -19681 -13120 -15288
15703 -15288 -21555 -29340 -27709 -26393 -23986 -14257 -10800 -16864 -13026 -6090 -6372 -12819 -16200 -15968 -26021
15688 -26021 -23828 -5748 6868 5863 -760 -10773 -7974 -2922 -2069 -7429 -13595 -10954 -11197 -12432
15674 -12432 -8681 -4802 -13998 -16392 -10791 -7668 -1694 2558 1102 1769 310 -1262 727 -1225 -11507
15659 -11507 -15848 -3654 201 -5626 -4424 3034 -2813 -9827 -11328 -15844 -21859 -21605 -27847 -27813 -16355
15644 -16355 -11302 -2646 -2362 324 -8666 -11516 -7112 -12539 -16803 -20349 -15544 -1682 8 3830
15630 3830 1722 -6487 -14650 -20485 -18763 -11354 -15605 -15913 -5696 -3630 -9337 -5564 -3240 -3561 -8059
15615 -8059 -11574 -18192 -24451 -15509 -8623 -4129 1170 5972 2346 -7559 -6574 -10865 -15538 -14137 -21316
15600 -21316 -23154 -29807 -19489 -12057 -7668 -3278 -7899 -11199 -12509 -13144 -9040 -13356 -7430 -1079
15586 -1079 905 -3423 -11610 -22739 -19904 -17564 -22122 -23109 -28325 -32004 -32743 -23181 -15086 -17903 -26418
15571 -26418 -24891 -19200 -18438 -14153 -16900 -18881 -16141 -19638 -21124 -20931 -14514 -13326 -18045 -20446 -24093
15556 -24093 -16546 -13679 -16967 -22527 -23765 -20965 -16220 -18837 -18638 -21964 -23080 -25048 -21123 -9662
15542 -9662 -7865 -14696 -18780 -23465 -20449 -22656 -19992 -22330 -20285 -26321 -29043 -29970 -28517 -28455 -22232
15527 -22232 -23719 -25964 -23205 -21504 -23511 -31724 -24989 -18864 -15988 -14094 -12036 -4031 6160 824
15513 824 -10437 -10951 -6029 -6470 -3989 -3094 -4941 -11830 -11064 -2793 -1075 749 -1388 -2139 3004 1245
15497 1245 2265 2213 2111 -1568 -5301 -7557 -9993 -1180 15557 22718 26219 15518 4247 -283 -7750
15482 -7750 -14239 -16784 -16831 -13910 -15640 -18990 -14234 -807 -1471 -6013 -15097 -13540 -14343 -10432 795
15467 795 1602 -1693 -1844 5995 12268 6852 -10922 -12312 -10038 -3434 2181 -3253 -7634 -10676 5241
15452 5241 9549 9705 7928 -1337 -7242 -2782 4345 5868 3010 -2293 7965 3644 840 -2013 -5650
15437 -5650 -909 -102 -7439 -2697 -11051 -21270 -29131 -31067 -33080 -31545 -31910 -29307 -11639 2669
15423 2669 439 -9756 -14201 -11959 -9065 -8069 -12642 -10120 -16479 -17780 -13330 -8727 -10463 -18948 -15577
15408 -15577 -13536 -17006 -25423 -34292 -25756 -19385 -4459 -2541 -11678 -18311 -12217 -9503 -14928 -17303
15394 -17303 -19050 -19094 -15442 -18577 -8705 -8278 -10343 -4625 -11741 -22492 -16847 -21736 -14625 -9414 -12140
15379 -12140 -17408 -14148 -6887 -3534 -7055 -7308 -11077 -14768 -9046 -5158 -4170 -6292 1364 8791 11371
15364 11371 8897 -5667 -12566 -4006 2703 -1195 -11720 -13496 -22340 -29779 -32762 -30668 -23330 -6172
15350 -6172 -2830 -2302 -2789 -10661 -15087 -13117 -11639 -9952 -12135 -3720 2675 -3204 -10272 -14780 -19247
15335 -19247 -17666 -20215 -28883 -24547 -21811 -15475 -10664 -11099 -12821 -10041 -5318 7966 6780 -2491
15321 -2491 -8470 -9095 -2930 -2697 1994 317 -8405 -5669 -4175 -21357 -20947 -20582 -16936 -9624 -13580
15306 -13580 -9773 -79 5088 -2247 3185 44 -6163 -9553 -12020 -10000 -14893 -11839 -17736 -16709
15292 -16709 -18179 -17364 -5027 -1712 7649 10229 1263 -13609 -15108 -8957 -9086 -6246 -3200 2065
15278 2065 2518 2049 -7344 -7201 1032 6400 961 -4047 -7427 -16346 -21812 -28272 -19803 -4395 -948
15263 -948 -6656 -13512 -21490 -18110 -17488 -15305 -12222 -14163 -9357 -4233 -3315 -6463 -5129 2580 -1103
15248 -1103 -5972 -5899 -2724 -769 -1238 -9150 -13800 -14966 -12304 -15873 -16996 -17929 -19480 -24951 -20731 -16996
15232 -16996 -10361 -15534 -13064 -9545 -7639 -9819 -11442 -10176 -2322 -2597 -8246 -6257 -4142 -16425
15218 -16425 -18742 -18299 -16862 -18318 -14237 -15673 -18066 -14495 -1893 12462 8460 -4272 -5268 -5520
15204 -5520 4340 3555 -6622 -8129 -8213 -5918 2514 -1849 -4930 -8383 -12365 -26923 -41087 -40543 -14175
15189 -14175 -3250 -1898 -1278 -3626 -6882 -12100 -7388 -8336 -10085 -9554 -4991 -1651 7627 2492 -12877
15174 -12877 -19397 -17690 -9597 2135 -5713 -12760 -14604 -12951 -6139 4867 -1253 5729 17916 24324
15160 24324 18018 1 -10840 -18636 -14306 -14283 -11386 836 -2490 -7666 -1012 -1413 -2262 515 -4527
15145 -4527 -13436 -23356 -18638 -11488 -6940 -10400 -6338 -5818 -509 -7601 -9764 -8740 -8747 -4693 -3716 -6375
15129 -6375 -7661 -11663 -13087 -10008 -9405 -13782 -11791 -5756 -12713 -8636 -5374 -8274 -8534 -15501 -15475 -10231
15113 -10231 -9615 -18175 -21193 -21872 -14706 -9104 -7537 -2677 -6025 -12222 -11781 -15519 -5279 3844 -760
15098 -760 5878 7890 2534 -3235 -3896 -429 -11535 -18205 -28064 -22779 -19286 -26796 -24062 -20235 -18143
15083 -18143 -10607 -3737 -1667 -388 4742 -5250 -9316 -5137 6348 1708 -2317 -12751 -22126 -22626
15069 -22626 -19635 -8121 -11084 -20532 -28697 -22662 -21098 -19031 -11669 -1050 -981 -11053 -31919 -37302
15055 -37302 -31069 -23557 -20859 -26665 -35809 -29157 -15987 -13135 -14837 -11965 -9936 -5843 -656 3183
15041 3183 3069 -7388 -15273 -17152 -15722 -12193 -11803 -14267 -20125 -21291 -21513 -10647 -11094 -22972 -29173
15026 -29173 -27181 -30600 -34949 -34613 -29931 -31624 -31260 -24636 -11837 -4745 -9136 -13056 -20295 -22287 -19360
15011 -19360 -18719 -15675 -12872 -14729 -12930 -14013 -22983 -15888 -14156 -13735 -4525 -7459 -12173 -12678 -6405
14996 -6405 -12823 -14815 -6722 -18969 -25065 -32378 -30218 -27714 -28523 -31994 -29429 -29954 -24078 -16289 -23698
14981 -23698 -31762 -33433 -37092 -41922 -38255 -31597 -27831 -27700 -24915 -23699 -16729 -29297 -44936 -45724
14967 -45724 -28984 -17785 -15554 -9487 -10957 -18056 -18690 -10694 -13063 -11264 -7790 -10157 -15151 -10127
14953 -10127 -6698 -11060 -16498 -22646 -30156 -29868 -20748 -10736 3368 11323 8937 3394 -2044 9895
14939 9895 11761 2202 -6285 -9017 -10744 -2721 -1588 -6435 -156 8814 9902 16055 10910 6587 2182
14924 2182 1185 -1416 -9085 -17896 -22054 -26648 -22662 -19999 -29210 -31873 -26328 -27325 -34129 -29821 -24604
14909 -24604 -20936 -18386 -8866 -2433 3353 7859 2788 -3867 -4382 -8182 -7808 -10624 -13953 -20934 -26362
14894 -26362 -27596 -26842 -18576 -12075 -18634 -24212 -19502 -18927 -17230 -14891 -15485 -11191 -1828 -7109 -15463
14879 -15463 -15047 -14851 -24582 -40110 -39305 -37029 -25688 -21586 -24832 -10762 -8490 -12282 -14413 -8640
14865 -8640 -69 -18353 -33082 -28428 -31764 -26746 -16463 -8460 -2809 1191 10779 14047 14743 13059
14851 13059 5488 35 3614 -1066 -13599 -14907 -23816 -39606 -49728 -43217 -37554 -32816 -29905 -34240
14837 -34240 -26411 -13061 -5654 -6232 -9683 -15178 -19643 -15039 -23105 -22450 -24719 -28012 -26903 -24346 -23097
14822 -23097 -19500 -26010 -25352 -20176 -12941 -18051 -15730 -7855 -6150 -4125 -3606 -10945 -17406 -21369 -21263
14807 -21263 -22044 -9776 -5608 -15604 -18008 -9775 -13466 -9708 -13506 -8984 2633 1999 674 -4207
14793 -4207 -7768 -10800 -20992 -26418 -20755 -11368 -11987 -2006 -1514 -142 -8233 -3989 1783 5150 4400
14778 4400 2368 -1553 -7934 -4288 10442 14534 6942 5750 13539 19033 8535 -2357 -10654 -6450
14764 -6450 -8792 -6601 492 701 4854 3855 -8512 -3751 466 -5766 -14082 -25548 -23461 -12701
14750 -12701 1067 -3768 -3107 8951 10164 3662 -3050 -2519 -5351 -3423 -1591 -9347 -11883 -14193
14736 -14193 -18367 -13159 -6133 -436 -305 88 -4917 -6996 -11496 -7840 1940 11966 5180 -2529 -1006
14721 -1006 -7086 -13289 -7201 -4701 5684 2404 -10959 -16785 -18709 -23510 -24622 -21502 -6236 4545
14707 4545 8822 4453 -11261 -15425 -14370 -15783 -14846 -4816 -4431 -3977 -5682 -13012 -15625 -13933 -16686
14692 -16686 -16551 -15251 -19115 -22956 -9791 -10707 -17483 -9962 -10160 -4020 4165 27 -719 -12932 -20964
14677 -20964 -16618 -12859 -18467 -6741 522 1391 1847 3971 -1465 -247 2528 -12839 -18861 -25240
14663 -25240 -28953 -23589 -21193 -23257 -20016 -20489 -7813 1171 -5390 -4967 -8051 -14306 -12512 -10418 -5430
14648 -5430 -1461 7894 15754 13148 11666 6246 -2704 -14173 -26837 -20416 -9407 -10093 -13700 -17721
14634 -17721 -14009 -9692 -9854 -15094 -12407 -8026 -4202 -528 7964 -413 -8837 -13235 -422 10886
14620 10886 29427 35279 26113 13241 13036 14842 12634 -1065 -12351 -6712 1112 -12220 -24959
14607 -24959 -28649 -36228 -39503 -41231 -32386 -27039 -17067 -18319 -21396 -18958 -782 -1997 -7884 -1698
14593 -1698 -2332 -700 586 -580 -1893 -10367 -16414 -20627 -23873 -22484 -18116 -9311 -8309 -4741 -6797
14578 -6797 -13946 -7971 -5147 -6611 -3930 -307 4300 6897 7890 2378 -4192 -3979 -12227 -15563 -20463
14563 -20463 -19838 -18316 -14760 -13281 -12007 -7642 -2332 14642 13565 4961 -10072 -10695 -3199 -2511 -3964
14548 -3964 -5777 3848 7466 3361 -9172 -12160 -6901 502 6932 15673 13074 5864 -4864 -964
14534 -964 895 -10163 -12673 -13272 -10112 3539 1781 6709 3991 -2420 884 -8707 -20254 -14894
14520 -14894 -5332 -273 -321 -2339 -7806 -7713 2073 8897 18093 12054 1462 -3505 -2869 2857 -3435
14505 -3435 -11236 -6273 469 9159 2162 -3223 1593 -2122 -3582 2145 -2412 -11115 -17940 -22304 -21434
14490 -21434 -10585 1555 5477 -2207 -6247 -2169 8860 14647 6055 1359 -6406 -6870 -4111 -5859
14476 -5859 -7884 -9993 -8770 -6081 -5267 -8155 -11966 -15551 -16767 -11127 -7417 -2016 1606 -314 2917
14461 2917 -3339 -14872 -12806 -2345 -1735 -8641 -11947 -10448 -5733 778 -8105 -18092 -28345 -22940
14447 -22940 -18290 -7699 -469 634 -3666 3204 9882 11323 8086 4548 8649 12675 2111 -2922
14433 -2922 -3375 -1773 -948 994 -1698 -4229 -7691 -14345 -18490 -19995 -8139 -3962 -16265 -10139 -6459
14418 -6459 -12721 -17119 -21290 -19421 -8004 1119 4822 -5562 -9349 -15896 -9555 -12391 -19764 -13162
14404 -13162 -7970 -18045 -14807 -11632 -4552 -11887 -9253 -1258 -7640 -13563 -15462 -4530 4956 7465
14390 7465 1775 4014 -871 -6881 -11684 -6334 -2088 2599 3597 -1094 1221 -6940 -7123 790 1328
14375 1328 502 -7458 -17738 -22098 -21635 -20223 -21091 -17746 -18569 -14577 -13295 -18615 -15195 -10732 -13508
14360 -13508 -16471 -23750 -15255 -5553 -6387 -10161 -8274 -15433 -17730 -12346 -12090 -11984 -10736 -13396 -5683
14345 -5683 -4423 -8307 -18982 -17578 -12326 -12629 -16424 -11650 -13705 -17931 -17260 -12337 -3842 -729 -5069
14330 -5069 -9005 -5353 -6580 -10801 -18205 -14957 -11236 -10466 -3872 -6133 -9723 -6180 -5917 2017 5098
14315 5098 938 -1793 2075 9632 16197 13217 6022 9199 5242 999 270 -5961 220 -5599 -4943
14300 -4943 -4116 -9034 -23531 -27278 -24516 -31003 -40962 -46026 -34200 -24201 -12083 -10903 -6479 -2036
14286 -2036 2435 -1043 1214 -1160 -2753 7016 7409 -10472 -14914 -14499 -12771 -8180 -8064 -16858 -14561
14271 -14561 -11236 -14144 -15895 -18126 -19327 -14071 -12591 -11271 -11780 -9674 -7500 -9964 -8080 -2760 -4564
14256 -4564 602 1014 -5324 -7489 -3762 2837 4699 12380 2876 -2805 -5254 -16291 -21913 -21054 -16764
14241 -16764 -21594 -22289 -17601 -20193 -22388 -23128 -13304 -9429 -16622 -19472 -19606 -14632 -10986 -10570 -12997
14226 -12997 -16254 -12651 -12521 -15691 -9463 -17107 -22314 -19335 -8211 -7936 -15915 -5517 10943 9481
14212 9481 8096 16789 14482 -3666 -18999 -16646 -4085 2102 -8608 -14778 -16002 -16317 -14800 -1814
14198 -1814 6591 9686 8374 11812 7346 -3880 -17793 -15832 -16298 -16937 -8066 -2977 -1538 -1084 7070
14183 7070 8659 -5673 -14611 -9576 -2563 -1675 9412 18703 20505 4595 -4799 -6583 -2410 4803
14169 4803 6379 1949 -8049 -4125 -1604 -3422 -7766 141 63 -4484 -6554 -12474 -12187 -7746 -1017
14154 -1017 7794 5175 400 -2427 -2253 -4629 1882 8284 -5082 1334 -1300 -2311 1281 3491 281
14139 281 -8604 -6735 -1588 5204 5338 -3990 -10530 1101 4855 -336 -7276 -6713 -6279 -1754 -3690
14124 -3690 -5902 -3485 -5231 -5065 -8723 -3118 -4101 -11545 -14931 -18658 -14859 -7423 -7963 -13772 -4841
14109 -4841 -8555 -21856 -20601 -13637 -10992 -17110 -31446 -29759 -25120 -25806 -19139 -12402 -9328 -14426
14095 -14426 -14564 -7115 -8281 -7046 7203 3778 5723 906 -9951 -5887 -6802 3144 495 -1418
14081 -1418 -1001 -6114 -6252 9734 18375 5756 2921 7531 4120 -2844 -6891 -2245 1289 -5165 -7385
14066 -7385 -229 1640 5668 2871 -3204 -7355 -4403 -4502 -8895 -11398 -10139 -10254 -5239 1687 -5057
14051 -5057 -9370 -7530 -6871 -1276 -1476 -7923 -10392 -17052 -22905 -17684 -7973 -6716 3177 3353 -9666
14036 -9666 -17202 -25047 -30495 -21639 -13980 -10476 -11085 -17346 -22567 -18434 -19994 -21547 -20708 -21425 -14052
14021 -14052 -11307 -9338 2344 6664 8309 4667 -1460 -1940 -5233 -8072 -3362 -211 952 -10720
14007 -10720 -17830 -20604 -17855 -21154 -24792 -14188 -1976 -6245 -10985 -9919 -10639 -1259 7698 8488
13993 8488 3519 -2701 -3273 -7632 6056 9380 15079 18583 14109 4323 -6299 -5247 -8355 -14090
13979 -14090 -16208 -9838 -117 -5289 -5173 -14897 -19960 -16721 -2444 -644 -10648 -7762 -2739 -1288
13965 -1288 398 -4288 -11999 -16875 -9955 -7200 -5773 -5848 -6166 -6061 -3555 -2273 -17335 -21571 -18819
13950 -18819 -5162 1364 -1516 -7491 -7647 -3046 -3871 -5809 -11276 -8341 -4360 5764 1853 -470
13936 -470 -3962 -16276 -9017 8666 17476 2219 -6206 -12903 -6424 -2841 -923 7763 3504 -10109
13922 -10109 -8207 -8461 -6167 -7795 -6564 -601 4595 2614 -7697 -6595 -2585 8832 2106 -1413
13908 -1413 -1607 -6805 -3566 -2972 7552 7322 -445 8829 14919 15485 7708 7832 11862 12428 3938 -3968
13892 -3968 -13718 -16992 -16891 -8342 -4691 -6696 -6430 2076 5943 -942 -11937 -13957 -22375 -19909 -22642
13877 -22642 -18583 -14045 -14507 -19176 -20032 -15348 -10099 -8000 -11906 -597 7069 9208 2719 -3303 -6761
13862 -6761 -11609 -7060 -4750 -4973 -5258 -3164 -5779 -4903 -139 -3717 -14278 -18710 -17316 -15396 -13313
13847 -13313 -10325 1125 10654 7229 -1704 -4018 2175 8179 18261 9305 1638 -7419 -9601 -17446
13833 -17446 -24498 -26058 -14754 -12289 -2994 14760 15503 13519 6794 6195 3480 12376 15025 14773 6101
13818 6101 9337 11821 18561 14482 5176 2144 -497 8689 3535 -12698 -9140 -2632 -6982 -11476
13804 -11476 -14362 -21312 -16376 -4288 11109 11389 3426 2149 -2082 -3615 -3137 -7504 -1334 -946 -2889
13789 -2889 -1884 -2700 1550 -10759 -17284 -10683 -6561 -12824 -8562 -11612 -11794 -6459 -16853 -17317 -11942
13774 -11942 -5410 -2850 6112 1583 6749 9888 -2761 -2078 5296 -4494 -24062 -23869 -2267 12701
13760 12701 12159 6589 -2690 -3982 -8353 -12691 -8131 -5520 -8986 -713 5031 -1769 -3857 -5144 -18222
13745 -18222 -30913 -21368 -3323 -515 -7714 -14056 -6550 -18786 -26057 -20816 -11708 -7093 1870 5697
13731 5697 -2396 -5962 -6555 -4974 893 8036 7293 10418 18941 12773 2717 2049 6201 4517 13400
13716 13400 17823 12232 6130 803 -1529 2141 5595 6222 3158 -7448 -9328 -7051 -7483 -15599 -11589
13701 -11589 -3277 -3029 -13060 -10555 -3839 -5683 -6809 -7395 -5055 -2590 -9859 -2210 -3290 -6491 -8591
13686 -8591 966 14796 18170 13220 11041 12421 10370 -7128 -14967 -9911 1117 1300 -9022 -10027
13672 -10027 -6007 -5701 -12693 -17065 -8434 -3072 -3547 248 -3872 -6364 -6077 -8206 -7486 -13815 -14118 -5158
13656 -5158 9453 -5386 -23625 -16976 -6216 -3663 -1074 3433 6289 5821 20943 18950 4243
13643 4243 399 1755 -6891 533 9172 9378 10686 14342 22975 13210 11444 15073 11096 11530 12416
13628 12416 8536 5317 -2298 -7894 -8655 -5919 -4098 -3562 -3585 -419 4681 -1065 4020 8100 6141
13613 6141 4623 3593 -4407 -7449 -7265 6003 11600 12888 22726 26612 16555 9195 9521 4855 -2046
13598 -2046 1465 -5222 -8313 -9236 -11714 -8227 -617 5397 6732 1066 -2326 1107 -3244 -6166 1262
13583 1262 3949 1952 3758 9933 5945 -539 -8463 -7985 2568 11227 895 -628 5531 10502
13569 10502 11350 -1455 1310 6353 3405 -5612 -3735 -2354 -10175 -6716 9199 7721 8142 3816
13555 3816 1898 -3755 -2165 853 5913 6251 3796 2233 -538 6748 10717 15210 8730 4549 5492
13540 5492 -2454 -9779 -6646 -6153 -6142 -3633 -12233 -9693 1363 2641 6889 17349 10562 497 -334
13525 -334 -319 3085 15362 17420 17149 15530 6956 6096 8025 9302 11860 5614 2282 -4875 -9190 -1709
13509 -1709 2908 5476 6218 9662 10294 13334 11055 3496 4686 1035 -8085 -1567 -16 4780 12827
13494 12827 21068 23082 13227 596 -10099 -3040 13093 18430 22170 16765 12787 12884 20046 30039
13480 30039 30923 30563 27891 26469 27306 24568 15236 10025 13704 16204 16295 17972 23417 24827 12039
13465 12039 4411 5256 6276 15818 23673 31069 30073 23763 25589 29052 20704 14181 14785 12280 2330
13450 2330 -2818 -8006 -2228 4954 10696 7167 11956 12276 5557 -9087 -6715 -3994 5299 13527 17203
13435 17203 15105 16967 23710 31433 35655 37372 33332 20663 10844 10824 5761 7731 14858 12324 16889
13420 16889 22815 17344 17467 22065 19004 7072 2575 6563 5329 4824 -2471 -3427 9251 13632 11969
13405 11969 6654 10546 17184 15349 16818 21179 24265 21575 21048 21063 21369 17974 9452 7340 9644
13390 9644 11531 5974 18527 31914 23855 20099 27020 26609 16909 16069 24317 22033 18563 16888 12004
13375 12004 16388 10375 4025 8790 9977 7479 4250 489 -9271 -11670 -6831 -2467 -2699 -89 15886
13360 15886 21576 16555 10784 14754 9187 14340 8411 11282 11659 22852 23767 12535 5488 -8656
13346 -8656 -9888 -6699 -5351 2898 2865 1234 6008 6755 4200 7052 4445 5663 12947 11413 11781 9044
13330 9044 15496 17884 18992 20330 11418 6813 12243 17353 16166 20669 24802 32038 38212 34646 30516
13315 30516 29496 22926 11122 4655 5971 10216 16737 11706 4260 12800 19257 3266 5578 7530
13301 7530 17370 31425 43077 38870 34917 36536 40362 44354 35529 30103 21305 11781 24397 30881
13287 30881 26404 12502 13337 32404 29165 33292 37170 30144 19387 16876 21699 22357 23586 20319
13273 20319 16793 14796 28238 23735 10911 13057 28884 32618 19798 8617 4677 12621 23332
13260 23332 26087 31173 28166 17888 18059 19995 17929 11386 16966 28594 26781 30241 35616 38492
13246 38492 33699 20576 14031 22023 24659 22457 12234 10368 12493 14175 23346 23111 18097 19902
13232 19902 20579 18364 21844 28188 41730 46894 45595 38071 17141 2745 -3667 388 22840 20899
13218 20899 19669 17361 8292 4371 9313 30331 39595 40087 28361 25902 25031 23223 20485 28218
13204 28218 29967 31818 38135 45546 51808 49611 43412 34970 25866 17064 18693 18680 22584 19389 15521
13189 15521 23563 28888 23736 27883 32054 21093 21787 32024 45867 47979 40107 30813 28082 31822
13175 31822 40677 41386 42001 46838 52984 58473 56870 51483 50141 34266 34785 36473 43231 40451 39045
13160 39045 32098 27717 27356 35928 38652 36466 38052 43818 44375 44177 31629 36300 39192 30513 23437
13145 23437 22828 26083 32053 30387 32338 29366 25803 26842 24101 19679 18053 14813 17109 20130 19174
13130 19174 27512 32250 40909 52759 60221 49519 41995 47586 42379 33693 38449 46627 53166 48493
13116 48493 44083 41513 42306 30044 25860 21983 26073 35123 40195 52839 61211 51304 47067 39309
13102 39309 36134 42597 40936 39679 46977 40170 40903 46462 44096 42719 51223 42282 37086 41081 43401
13087 43401 51337 50047 43563 40594 48234 46680 51276 47960 48231 45320 38212 38909 46407 49518 42830
13072 42830 47612 49342 59946 67350 75609 67532 53194 48626 46040 39834 38504 40580 44523 49835
13058 49835 52586 60566 66654 70367 67743 70524 71643 67997 52913 52238 55498 61792 73798 73128
13044 73128 68974 69564 58444 59221 58867 51312 44153 49723 57120 54646 50290 54273 51902 57812 61394
13029 61394 58325 58797 70036 74597 73021 74363 61248 55891 63913 71759 67965 74875 79183 78971
13015 78971 81493 84398 84982 79547 74800 71227 63391 66903 70753 60848 52985 42227 35796 36530 38444
13000 38444 34352 25229 26055 30154 33654 33121 35835 36249 40499 45625 53674 75041 80112 77141 80986
12985 80986 86461 82136 83865 89652 99806 106187 107278 112429 107773 112516 119208 129435 141078 148875
12971 148875 166136 183263 198134 217801 229684 251428 286582 330560 373543 427350 503014
12960 503014 613698 750413 901684 1073419 1262889 1438139 1598492 1734154 1815668 1832641
12950 1832641 1792955 1690882 1532001 1347119 1149332 959067 799061 661496 548023 473748
12940 473748 407615 354531 310120 290749 278973 261092 241261 215943 198129 198216 194281 176193
12928 176193 161548 164370 163455 139571 117422 109712 115580 115698 116804 116569 101895 97420 100511 98580
12914 98580 101438 98898 102477 101999 99427 98165 88563 85584 90469 85927 84446 93470 104636 107490
12900 107490 103546 104360 110858 107706 103159 97901 102154 100743 93149 100002 101304 97275 90548 93323
12886 93323 101594 104844 110015 105822 108937 107557 103940 105269 107064 108492 102257 89531 84626 81554
12872 81554 75108 60862 66377 75758 73551 60665 63511 62477 48609 46278 53966 61287 56236 47198
12858 47198 36181 26682 22002 15557 -794 -8799 -11131 -6391 -843 6027 20670 33032 52169
12845 52169 77949 92244 102494 118784 134911 150901 162599 159397 166549 154313 148274 147269
12833 147269 143623 140878 135657 128646 136187 133360 143567 151837 152720 151221 160870 173076 168641 163501
12819 163501 157273 158850 162414 163614 163017 165338 173944 179365 182721 192137 197117 202563 213847 218655
12805 218655 221560 221199 231357 248090 263900 276351 292245 315957 348107 384230 429355 464306
12793 464306 501064 522915 540375 553196 537217 520655 489595 447371 403335 364182 332956
12782 332956 317114 295222 265314 244110 229345 223260 219724 228183 224923 217892 203141 200650 204182
12769 204182 212476 216469 220645 223085 219083 210049 224584 227986 234451 240659 244933 246665 250899 251212
12755 251212 247531 251079 249425 246819 247905 248581 260007 265703 264394 257680 244906 243398 242489 225614
12741 225614 215489 206791 185358 167137 162085 178663 184586 175015 168537 178703 195782 212732
12729 212732 239400 268803 288670 306685 335037 357664 361173 350694 348268 342213 332218 323677
12717 323677 311274 304361 295788 288091 277435 286499 298797 304993 315319 333565 354663 363772 362689
12704 362689 359922 362449 366426 373908 389911 403431 437574 470265 486514 500711 525525 542412
12692 542412 558674 583139 607212 616583 607209 597183 598770 582260 569407 557185 548071 559416
12680 559416 559920 562220 572804 576276 596884 608480 625719 657061 692798 724942 744913 769424
12668 769424 796603 816021 819466 805267 775980 740774 695529 642720 599062 572261 553669 531168
12656 531168 512308 509760 511619 512204 512067 517701 535924 547899 556743 573137 586852 606729 627791
12643 627791 646031 672691 689360 698912 710871 728205 757895 803493 838803 869597 885746 900915
12631 900915 918583 935800 951837 963024 971455 986983 1007239 1020418 1030713 1051585 1079222 1107339
12619 1107339 1137129 1160084 1198817 1230529 1268662 1311499 1357687 1420538 1482857 1532219 1580434
12608 1580434 1639211 1696902 1749358 1779941 1818591 1864272 1914380 1973164 2028679 2096789 2173908
12597 2173908 2239664 2316514 2409148 2482895 2548101 2619398 2697216 2772956 2848359 2932317 3036944
12586 3036944 3130669 3222674 3339163 3468356 3597247 3734727 3874918 4021685 4179319 4350901
12576 4350901 4525856 4712726 4904379 5122719 5362471 5624212 5909832 6231447 6605811
12567 6605811 7030642 7518796 8073794 8716679 9450921 10297921 11290299 12484024 13928384
12558 13928384 15640790 17659035 20007888 22691152 25734851 29199959 33188399 37894866
12550 37894866 43708645 51239528 61440142 75455235 94334691 118744643 148675477
12543 148675477 182986302 219205931 254554341 286742717 313119338 330237922 335464289
12536 335464289 328451355 310569860 283785661 250871976 215148135 179650944 146641875
12529 146641875 117789315 94455986 77029694 64642761 55790242 49174665 43953508
12522 43953508 39580436 35747720 32315107 29212994 26405789 23890586 21653887 19698863
12514 19698863 18028374 16604023 15393986 14355554 13464498 12688462 11996328 11368705 10800138
12505 10800138 10281682 9798654 9341398 8917324 8514603 8145737 7812644 7490660 7199548
12496 7199548 6926698 6681160 6454602 6254065 6060116 5896189 5738090 5583833 5431966
12487 5431966 5270233 5117146 4978256 4843829 4712665 4593164 4478990 4355460 4256889 4183571
12477 4183571 4128140 4070397 4004958 3898004 3771767 3642043 3511766 3381750 3265282 3146480
12467 3146480 3055151 2970505 2892864 2825662 2751694 2694943 2643375 2571668 2508428 2462215 2404380
12456 2404380 2343910 2281299 2215534 2153945 2104364 2057107 2004226 1943129 1887863 1838848 1797153
12445 1797153 1745633 1711123 1679869 1651135 1621326 1587330 1565685 1545671 1523157 1511079 1501911
12434 1501911 1479953 1458104 1440482 1413675 1391292 1377324 1356740 1329263 1308609 1287903 1254580
12423 1254580 1238659 1234044 1221076 1216084 1212546 1213296 1217145 1211874 1208537 1207750 1202753 1178937 1167455
12410 1167455 1138994 1099549 1059421 1016013 976144 939518 903793 867904 829349 807123 798211
12399 798211 794025 785433 763356 748784 739761 721856 697675 663686 624097 593190 565790 533862
12387 533862 520880 505068 482439 463713 465610 492425 511908 522065 526539 536405 552341 553381
12375 553381 554835 558675 554543 542761 544263 555966 556555 551313 556222 559930 555476 548443 529945 516491
12361 516491 513157 495084 479823 462174 456465 446558 431308 419067 401837 390324 391352 383964
12349 383964 388319 401158 413422 430898 457353 488269 508171 525315 527111 522103 505069 495242
12337 495242 482317 465906 448420 427949 416963 410782 402062 390838 396274 399705 392065 393197 401677
12324 401677 402692 405655 406835 401779 397502 397380 405137 415481 425913 426615 432288 440732 434373 436343
12310 436343 443135 451009 463172 458374 456220 457201 461779 470937 477204 475826 474167 477300 491976 497701
12296 497701 499094 505190 511258 518406 530388 546102 545392 546122 554364 567593 567559 567318 573424 571294 566633
12281 566633 573171 577725 575853 579127 577372 585010 587676 596237 596765 593239 588230 585735 590859 606797
12267 606797 628418 641962 643550 652327 657978 661632 684524 705215 714181 722787 735610 751847 774752
12254 774752 792601 818006 841694 859263 880532 911510 943751 969394 990151 1012999 1045398
12243 1045398 1067555 1081548 1101230 1131399 1161168 1189704 1209567 1226640 1271230 1309468 1327608
12232 1327608 1360165 1397118 1442595 1495090 1538736 1592580 1640178 1675780 1701982 1725969 1745420
12221 1745420 1770568 1783119 1796233 1819169 1851445 1881650 1902288 1926546 1965591 2018584 2089501
12210 2089501 2189919 2292657 2390319 2495980 2617676 2749233 2890925 3042750 3209852 3390938
12200 3390938 3591965 3811883 4042356 4286847 4536261 4785097 5028981 5252020 5474083
12191 5474083 5749946 6090136 6514697 7020882 7590421 8210330 8901885 9710145 10742083
12182 10742083 12112216 13921523 16153152 18684254 21265297 23503823 24984906 25756272
12174 25756272 26248840 26727833 27373767 28313672 29533336 30905092 32220871 33308123 34127271
12165 34127271 34842702 35810977 37384848 39695353 42604017 45744627 48620891 50782141
12157 50782141 51982358 52394640 52412612 52422296 52729318 53502153 54808263 56619951 58835224
12148 58835224 61324745 63856079 66157380 68000068 69220377 69824693 70049998 70277503
12140 70277503 70911248 72193441 74174163 76739357 79687156 82680357 85443173 87629108
12132 87629108 88314370 86970933 84835077 83011689 81435394 79928008 78521205 77342842
12124 77342842 76438446 75712091 75016405 74314314 73759397 73550754 73752536 74153787 74402651
12115 74402651 74130857 73040882 71073692 68446430 65599464 62964786 60846609 59398529
12107 59398529 58585971 58255421 58233508 58284933 58087590 57352852 55899514 53691626 50943293
12098 50943293 48090941 45611280 43866375 42973706 42855408 43337638 44165935 44990549 45466749
12089 45466749 45467409 44509075 41812062 37938167 34398623 31370655 28445040 25496767 22647882
12080 22647882 20098794 17969124 16286089 14964801 13912222 13058218 12337353 11684599
12072 11684599 11062655 10454472 9893075 9389702 8936739 8529233 8161639 7832380 7529023
12063 7529023 7238153 6967722 6706531 6444130 6177792 5920871 5683359 5454368 5254199
12054 5254199 5096423 4982616 4909658 4893627 4956046 5181346 5607139 6171517 6758408 7233472
12044 7233472 7398463 6981281 6072176 5152798 4494190 4064526 3776907 3570571 3427412
12035 3427412 3305868 3211697 3137775 3058718 2992253 2910915 2825103 2752004 2685701 2617072 2532109
12024 2532109 2457017 2402872 2337042 2271062 2224914 2171025 2102078 2034218 1969908 1905200 1835947
12013 1835947 1772056 1717133 1672475 1614934 1555766 1498857 1453631 1404768 1352291 1289883 1237789
12002 1237789 1200981 1163282 1122098 1080293 1055566 1033396 1007037 981009 952461 923278 899400
11991 899400 871140 855752 839970 818187 796320 777000 751335 721335 686553 675494 660068
11980 660068 650262 635460 621091 609897 601509 603630 599131 586551 568677 549682 529535 512892
11968 512892 506970 491778 482069 474389 473889 470228 451870 433590 418622 405720 396901 397493 388728
11955 388728 380264 368777 348551 340675 338000 337804 331981 320211 304781 303911 301279 294788 281651
11942 281651 270200 265659 258056 265022 268200 266299 260672 256595 238696 224264 219573 216044 209044
11929 209044 209906 206435 212155 212035 219224 213602 199215 181445 176273 183201 184127 179544 167651 164838
11915 164838 164107 154535 150449 153432 159211 159496 165008 168805 156502 141146 151820 160004 147863 146886
11901 146886 149820 152789 157603 161758 161789 152479 148102 149887 153563 146532 146315 140524 139151 129056 120799
11886 120799 127872 130878 125752 130909 141192 139575 139504 128519 113439 109732 112120 116749 113729 100717
11872 100717 96446 94606 97515 103990 113563 123722 125697 117512 109363 113775 117275 100541 99899 103323
11858 103323 103482 108691 109910 98628 96376 93589 94941 97376 92248 92267 82218 74047 74870 77272 83046
11843 83046 87383 91601 87555 89348 95423 99042 96433 93100 94878 92641 85730 84307 86239 86396 93125
11828 93125 89297 99259 97115 97102 107215 107911 112984 125283 122999 116963 107309 105071 100846 99489 114497
11813 114497 114328 108923 113831 116437 110744 93820 83677 91400 107438 122205 120344 117451 115854
11800 115854 115976 117804 108860 100722 91146 93027 90870 89168 106608 119638 114194 113451 119866 121105
11786 121105 117874 117454 123439 139391 152600 152313 148123 141577 132471 129091 118429 110546 114116 124630
11772 124630 121111 115370 111675 101906 99450 108942 106753 96995 98870 92654 93571 85393 83381 85815
11758 85815 84509 77160 74719 76818 91861 94545 87816 86485 86154 80474 79010 89645 99132 100813
11744 100813 95152 89677 90028 91981 89859 96169 101781 102692 96892 92398 96186 109949 104978 104684 105349
11729 105349 106885 108496 110336 116541 108382 109078 118354 117891 117200 125590 134660 139441 153437 162001 168415
11714 168415 162337 163157 168091 159705 164971 183475 204648 220841 229123 242759 258435 262753 264137
11701 264137 277931 284019 281056 290815 309038 319080 340829 371519 398822 413214 423306 438780
11689 438780 454102 462537 457372 449028 438215 438164 438730 433233 432117 431842 431958 430775 427676 423053 428740
11674 428740 431699 431142 435096 442179 443056 451053 452188 449190 453256 462773 478337 489819 491119 499099
11660 499099 509690 515976 513119 506005 508778 497673 484556 460294 441170 424051 413011 407975
11648 407975 406871 414764 427543 438937 443987 441633 444159 438264 407107 369580 347899 333690 333754
11635 333754 323909 314434 313830 309507 306741 300191 286680 273723 263414 254437 247171 236781 228438
11622 228438 230245 224393 224338 235949 227665 217518 199694 177237 166909 165717 158911 147872 143725
11609 143725 146345 140725 138615 129286 123306 130368 129340 131905 120427 111103 117993 117683 119335 131249
11595 131249 131447 122661 112968 101683 95150 89771 96621 110474 110918 109805 101046 111113 109485 108308
11581 108308 112330 113453 112582 112172 109748 104534 111967 120390 126929 127688 119356 115131 118093 114171 109501
11566 109501 109128 104652 103027 106221 104082 104027 103543 111385 118019 116704 116603 114086 106856 110835 112350
11551 112350 108499 115061 115245 110392 111844 112961 109006 108062 101509 91449 90459 103874 105522 103735
11537 103735 108557 113134 111323 115370 113705 112920 107150 101661 93464 92145 93400 101128 110544 99888
11523 99888 94310 96140 91333 84792 85580 78505 72473 66411 70246 72215 78889 85593 86903 75750
11509 75750 76637 67031 70561 76132 67203 61632 63200 65162 66632 58935 46803 48769 69846 77303
11495 77303 77503 75972 62919 61982 73081 73969 66242 67435 68889 59884 52253 52160 62889 73956 73625
11480 73625 72286 82535 70714 67303 67956 75419 86396 83867 77623 74532 71933 79101 92590 96799
11466 96799 89618 90651 85697 77976 81567 80295 73631 77709 87745 81228 66187 61462 69291 68421
11452 68421 73750 78740 82516 79295 71407 72511 63800 62809 72543 76194 70080 65315 64403 65073 57695
11437 57695 50067 52018 56494 56112 65619 72480 79946 74579 75922 77453 75634 75456 74859 80315 74090
11422 74090 73657 72396 71496 68795 65391 61886 67728 63880 62839 73094 66629 60911 62769 62290 65243
11407 65243 70021 66532 63469 65545 74009 79057 77357 70129 71525 64314 53576 56409 51312 53732
11393 53732 57580 62866 54764 51703 49398 41760 45671 52042 50785 52352 60988 61783 59767 60547 60786
11378 60786 53286 52246 60219 60096 53329 57639 68013 64029 58038 67774 64024 64756 74642 75224 63206
11363 63206 62918 65737 68348 75000 81200 83920 84800 81842 79561 78689 90838 100076 110260 117968 127071
11348 127071 143027 136429 134767 134172 119599 109753 105793 107857 104951 107944 110947 118443 132415 146114
11334 146114 155708 171905 190101 213009 228721 240686 252911 260835 281577 302083 317505 323122
11322 323122 320125 329291 332955 324249 322235 317060 303344 283657 280445 272791 260107 254627 245948
11309 245948 242256 244780 244746 240480 235786 239882 245330 255020 266400 280568 281256 279143 290136 304399
11295 304399 301463 297320 313593 327655 326701 329744 329409 312682 297590 277628 253625 242121 232066
11282 232066 233523 223287 213190 197840 191618 181641 169583 158888 148386 139269 131227 126696 125462
11269 125462 122007 117776 107303 106883 107714 107035 99358 93059 94649 90845 91396 89704 88929 101364 109792
11254 109792 105987 98767 91077 93587 94312 90504 77839 72310 80752 88503 90806 93582 103470 118776
11240 118776 124645 140898 153505 160598 165449 178896 204701 225341 251534 270161 285793 304504
11228 304504 320905 323630 332496 350711 369881 371969 389462 409782 406773 398610 398543 394799 384955
11215 384955 377749 365826 355507 351822 349307 343583 332320 327366 325537 325898 322612 331565 348169
11202 348169 359085 371247 376635 396396 411218 422719 429157 436337 440342 450563 459753 465052 462128
11189 462128 461811 463390 446803 433440 421650 401286 377777 360591 341540 319814 305960 289754
11177 289754 278854 267156 261621 246695 229648 216120 209487 204192 195205 202813 211297 210059 192917
11164 192917 189693 196014 187213 187790 193302 187466 181104 182019 182442 179094 176814 180516 179513 166979 168519
11149 168519 178507 177072 178380 179331 175105 157978 153627 156541 155721 151677 146167 159307 162359 165595
11135 165595 172324 170951 162712 155229 154869 158718 150202 148604 153556 155224 156220 159916 167377 166882 171356
11120 171356 169937 162048 151750 156599 165861 170762 167005 172747 169785 157405 156893 174026 181015 181424
11106 181424 194734 210872 214991 204070 208937 220518 226377 226899 223551 219918 225457 236720 232227
11093 232227 235420 246769 256006 264252 282028 295622 310065 320460 326563 338249 347672 356865 355940
11080 355940 358544 364696 363002 356277 354574 358065 354981 349237 357578 361470 348595 342352 352378 369915
11066 369915 376978 380898 380353 368135 370929 382911 395201 403600 399062 392760 402923 416016 419044
11053 419044 426301 421969 418420 412747 411836 408251 403976 397380 397823 396645 398952 394838 392995 384875 386506
11038 386506 393744 400028 400536 395479 395223 404810 406562 398400 393155 394577 404314 417178 424549 420788
11024 420788 424204 426515 428565 435007 440211 436077 434891 434092 437014 441595 443368 451325 480615 486688
11010 486688 498704 503109 511888 519359 525182 528812 538081 549445 570351 578169 580403 585865 598703
10997 598703 614409 636706 648856 678596 697231 714176 718989 744406 773809 798758 824958 847825
10985 847825 870999 902813 929862 955879 983659 1019403 1052373 1091176 1126620 1169093 1221223
10974 1221223 1277104 1330884 1379698 1433795 1497470 1561444 1619069 1695157 1780516 1858333 1949765
10963 1949765 2056168 2180321 2322820 2471386 2642866 2839927 3055332 3298356 3563003
10954 3563003 3849255 4168588 4536352 4980557 5489569 6079585 6761326 7529497 8400635
10945 8400635 9390330 10540982 11911323 13544718 15522097 17854038 20538172 23525590
10937 23525590 26697309 29931317 33072229 35996913 38646275 40983740 42942081 44490620
10929 44490620 45570229 46203842 46445420 46343357 45942604 45286256 44428458 43401197 42206768
10920 42206768 40909805 39650986 38561944 37722283 37070891 36501361 35977412 35551888 35342185
10911 35342185 35427195 35860170 36647741 37729968 39016230 40377760 41722031 43020144 44244770
10902 44244770 45319400 46145316 46632922 46744576 46449854 45724257 44576943 43034667 41157291
10893 41157291 39015519 36675868 34213901 31741139 29372527 27145578 25078686 23162175
10885 23162175 21350638 19639122 18025563 16499987 15083277 13763181 12541787 11421266
10877 11421266 10409858 9515488 8745187 8103789 7565683 7118110 6745535 6441148 6200248
10868 6200248 6016704 5876177 5764464 5678252 5619438 5583962 5580075 5611388 5684626 5788395 5925974
10857 5925974 6108085 6351024 6644508 7018086 7479395 8056349 8768679 9620553 10628302
10848 10628302 11801570 13119196 14580404 16165539 17868255 19707787 21681221 23804721
10840 23804721 26079533 28500795 31084248 33875691 36889159 40118474 43495442 46907325
10832 46907325 50216725 53259840 55910325 58128476 59855484 61027909 61599222 61586664
10824 61586664 61044626 60055050 58717364 57143587 55432914 53658902 51877798 50122427
10816 50122427 48490236 47135849 46226053 45821420 45867885 46216216 46728578 47353260 48089010
10807 48089010 49000382 50160103 51618002 53274479 54912304 56357669 57522941 58464855
10799 58464855 59180705 59562208 59494776 58888695 57700110 55925720 53581676 50749222 47530942
10790 47530942 43975712 40162757 36174089 32177269 28400882 24993249 22025561 19507440
10782 19507440 17404405 15655868 14172661 12884953 11757799 10755314 9868741 9086585
10774 9086585 8403561 7815840 7296724 6833059 6424669 6055953 5716677 5394211 5089433
10765 5089433 4807230 4556605 4338633 4130759 3952901 3798347 3657299 3518852 3389110
10756 3389110 3272291 3152024 3027963 2918155 2810586 2705406 2603179 2513716 2431008 2364589
10746 2364589 2301458 2228145 2163056 2103052 2044388 1999661 1937268 1886118 1842552 1794319 1744223
10735 1744223 1688981 1644434 1612106 1573980 1533905 1498320 1458643 1419688 1396270 1368578 1338064
10724 1338064 1310148 1288930 1263242 1243262 1220058 1198492 1167000 1141765 1110047 1078538 1058331
10713 1058331 1038676 1028621 1019386 999021 986264 969447 956815 941036 916065 890853 869657
10702 869657 854753 837821 818402 802032 785696 763893 732125 706685 690766 682789 666794 650127
10690 650127 635608 626285 616206 598127 582593 575606 557784 542805 530846 515514 504761 501429
10678 501429 501086 490944 479412 476925 467401 461328 446162 426078 422894 426840 423542 416584 397471
10665 397471 387393 385052 379619 362415 350198 341582 340403 346286 358022 356779 347511 345785 341348
10652 341348 340079 332708 330431 313436 298624 282680 271550 259915 246628 241243 244433 232188
10640 232188 223653 227300 223032 235702 245448 239530 227629 232789 240757 245648 239327 244293 252599 272070
10626 272070 267543 274864 275014 256538 241416 241111 234637 237643 233681 228264 227435 224943 225113 219219 208487
10611 208487 203952 201157 204576 202868 192060 199559 201937 205063 206251 209901 215247 214917 214992 215408 207484
10596 207484 202931 212046 213674 217887 227401 232398 234617 233850 231905 233814 236460 240705 248040 238727
10582 238727 238109 241361 250868 273779 303554 339172 368919 394333 429887 470545 507160 521368
10570 521368 529123 551230 552866 552673 552618 545074 548479 567134 603360 649264 695919 736790 778031
10557 778031 807083 831354 829058 803385 767812 736549 701356 659484 633796 625274 634971 639479
10545 639479 644677 653533 655866 637088 611528 577155 538271 513998 505763 503989 488777 479019 477063
10532 477063 491462 497773 497975 495870 501564 508581 516509 519571 521683 518753 521005 519551 510595 493807
10518 493807 478470 446230 424828 410695 399405 396487 392092 386691 392675 403469 413599 415866
10506 415866 414355 413559 421810 417899 425628 438882 435417 433496 446626 463580 469233 457378 450055
10493 450055 441017 422348 409542 402667 380964 369250 361876 357576 354864 351490 345084 342197 339710
10480 339710 337362 337785 346041 357404 361943 381137 411451 443067 465569 477903 494839 497296 505804
10467 505804 505278 495535 499471 498021 504995 544859 585963 626007 651852 672374 687740 677133 658723
10454 658723 644020 633554 615692 599618 592874 588738 588398 589492 584979 587968 592309 602340 604846
10441 604846 597713 582754 572920 577581 579486 579642 591415 603985 611773 612736 618730 631694 647394
10428 647394 659851 653106 654533 663207 675890 683334 677372 669155 654542 649164 653737 651343 650835 634579
10414 634579 618025 607014 601063 595549 613039 633721 644308 662467 681793 709855 745846 779606
10402 779606 789204 785491 780777 782719 775939 772587 759852 750874 735485 720421 705957 701898 684166
10389 684166 675145 667755 649905 628539 594901 556598 530416 504684 502924 508475 508406 503425 512053
10376 512053 534038 556460 576345 603021 618633 614724 593543 566533 543138 505498 466789 448197
10364 448197 439885 431206 419979 419675 422219 432158 437085 432633 417387 387217 367697 371079 367835
10351 367835 360865 368333 378902 385528 381095 378971 399528 420212 445105 463228 475515 489159
10339 489159 500186 506762 503409 495779 497568 506765 505425 499220 516061 540936 552250 564430 576019
10326 576019 580281 583849 573164 568964 563692 558652 561928 559257 558875 552547 550448 548480 542683 534933
10312 534933 523534 520243 521589 529088 544854 559525 570984 587574 599540 606876 613061 614182 621232
10299 621232 628380 629947 648504 668252 678380 693762 705734 714473 721655 723802 715130 703386 698889
10286 698889 699888 697610 699610 697479 695213 692205 692555 698590 689116 675587 669425 666166 678509 682986
10272 682986 691094 707722 714368 726111 713228 688476 669315 664449 670729 671218 674884 675852 666153
10259 666153 662748 663198 663564 660701 656252 647800 652484 662653 675165 675413 673531 686117 695266 700862
10245 700862 706906 700824 691348 689896 687205 683626 686106 703837 714632 724960 737580 750673 763530
10232 763530 769582 775819 785191 792630 797343 799776 815167 829072 855656 879783 902972 928442 956069
10219 956069 978770 1004994 1031633 1053587 1081836 1112890 1143986 1180419 1216343 1239158 1253934
10208 1253934 1273492 1302705 1323283 1350059 1387222 1425472 1465957 1508072 1550190 1597049 1650906
10197 1650906 1691991 1740607 1791932 1847721 1915530 1978656 2049693 2115779 2183895 2272739 2361197
10186 2361197 2455944 2548880 2647664 2760590 2894367 3036800 3179177 3332949 3513931 3720978
10176 3720978 3969512 4246202 4554960 4907524 5318488 5785601 6305660 6885804 7535030
10167 7535030 8279054 9131446 10131288 11368675 12935711 14941734 17408577 20290524 23584332
10158 23584332 27302521 31690908 37393272 45222680 55342965 66760849 77828094 86608393
10150 86608393 90775842 89644410 86591176 85705155 88119937 92911464 98571849 103723219
10142 103723219 107557863 109693326 109972352 108887800 107024235 104208290 100406500 96094686
10134 96094686 90645899 82554257 72821082 64830957 59970044 57223710 54879550 51367015
10126 51367015 46363789 41096429 36776652 33587919 31064748 28498755 25427850 22135966
10118 22135966 19202796 16842370 14968097 13473644 12282333 11340233 10576472 9929566
10110 9929566 9358718 8849795 8417243 8045707 7705740 7408131 7137481 6905235 6705628
10101 6705628 6537679 6401290 6299821 6220233 6163061 6123956 6095063 6046038 5976875 5911193 5839017
10090 5839017 5773216 5741502 5749098 5791372 5868283 5985845 6135611 6297669 6482969 6669959
10080 6669959 6836004 6993412 7146643 7304617 7483526 7691338 7942427 8244399 8600337
10071 8600337 9009807 9481271 10040637 10704190 11505139 12464244 13668531 15228615 17191464
10062 17191464 19526364 22158699 25006370 27909102 30800264 33945846 37620892 41656817
10054 41656817 45518214 48585896 50913902 53816697 58455858 64750300 71880641 78365761
10046 78365761 82518331 84658555 86800027 89417001 91101506 90870338 89089600 86372547
10038 86372547 83154299 79795067 76683487 74631497 74286003 75145019 76041782 75291572 70837255
10029 70837255 62421823 52867421 44951740 39265642 35324634 32521558 30258331 28237262
10021 28237262 26406086 24840314 23611728 22636008 21787206 21034036 20406310 19977787 19902186
10012 19902186 20286651 21194547 22605385 24400046 26420337 28514330 30597853 32671506
10004 32671506 34763445 36866880 38852556 40392525 41110335 40949624 40353334 39908128 39836845
9995 39836845 39955390 39960943 39725381 39402901 39297053 39579600 40149137 40755102 41215558 41476688
9985 41476688 41736855 42391403 43631509 45308980 47051937 48381063 48906992 48599013 47706476
9976 47706476 46425488 44879348 43398007 42400309 42125828 42600019 43622224 44809130 45717615
9967 45717615 46006931 45428455 43969294 42029790 40376995 39633331 39992382 41345805 43425708
9958 43425708 45896928 48409439 50582216 52132071 53029455 53453253 53523698 53101642 52054358
9949 52054358 50568008 49019364 47605406 46315695 45049467 43787931 42658160 41758507
9941 41758507 40951150 40001345 38828817 37590306 36613179 36183241 36494688 37557252 39154728
9932 39154728 41049345 43008341 44764189 46160199 47074989 47356352 47026327 46403370 45782636
9923 45782636 45347477 45230458 45408936 45765383 46323073 47256102 48593435 50103350 51405018
9914 51405018 52089291 52015599 51382550 50617719 50062926 49742067 49442807 48789932 47528120
9905 47528120 45826345 44037119 42272022 40331930 37926530 34977202 31750196 28703806
9897 28703806 26157809 24175355 22665722 21487587 20572035 19819036 19103557 18351850 17537676
9888 17537676 16699353 15925411 15305697 14858669 14463587 13953174 13238199 12418949 11721647
9879 11721647 11244805 10918435 10648949 10345990 9969458 9588247 9343518 9286569 9404072 9627257
9869 9627257 9861371 10019988 10066459 9974431 9687079 9232007 8724309 8269280 7925233 7685157
9859 7685157 7519877 7391058 7238210 7010145 6694952 6321189 5941074 5584759 5267108 5000942
9849 5000942 4790272 4627868 4530827 4485019 4478253 4497089 4543104 4591012 4605927 4606157 4573006 4529187
9837 4529187 4488885 4432440 4369515 4294202 4211115 4118034 4003412 3892362 3772251 3635816 3495575
9826 3495575 3347024 3204076 3086502 2995743 2932118 2880763 2840001 2824496 2815129 2783506 2723479
9815 2723479 2668870 2638136 2653154 2718316 2800462 2894640 2981076 3023692 3001848 2914580 2786543
9804 2786543 2637162 2460456 2271659 2088652 1943242 1834125 1740352 1666360 1624184 1616496
9794 1616496 1607260 1597683 1616618 1667031 1736382 1835034 1972194 2154416 2358547 2544058 2702189
9783 2702189 2809787 2831107 2765530 2648388 2523710 2416692 2374089 2393984 2455607 2543828 2646095
9772 2646095 2760973 2884389 3003386 3115508 3214994 3291646 3325664 3301111 3215102 3085565
9762 3085565 2922281 2758211 2608033 2476398 2402095 2380457 2366873 2343491 2301494 2201589 2003647
9751 2003647 1769985 1556291 1363916 1187456 1065606 984095 923287 872188 830518 813783
9741 813783 806429 814900 838641 863183 879092 894844 914214 931263 958748 972687 972359 973668 972210
9728 972210 957956 939845 933308 931320 947233 972688 994710 1027769 1059377 1069943 1044568 994935
9716 994935 945390 893895 839977 793566 755522 725335 712383 706067 706180 697548 681377 654856
9704 654856 622080 581915 531577 495618 476790 441374 411396 395034 394013 381226 381281 381968 381433
9691 381433 385936 389903 399143 399631 395146 403944 412799 431477 449784 463949 483436 501158 520696
9678 520696 534126 536524 532703 528986 515980 483632 453589 431820 410112 389152 372143 346335
9666 346335 329500 314384 300130 297261 300511 302452 303768 310053 322196 334353 353498 379738 398029
9653 398029 416659 420199 427258 437504 449284 465965 475757 481992 482837 480282 478346 488499 492571
9640 492571 500051 513470 529873 550628 557640 569104 584329 588599 595753 589720 571218 576338 608491
9627 608491 645273 692278 750433 818618 878453 933269 964599 981497 986236 970557 954048 926309
9615 926309 893199 853326 834960 815072 807049 814763 809650 787206 755190 723418 694879 665193
9603 665193 643427 629659 621879 616507 605100 607591 626703 642682 655079 663032 665420 677842 683726
9590 683726 688493 697037 705518 700724 680604 654606 629725 598853 572376 545538 530900 528941 528050
9577 528050 521211 524032 535179 539795 552268 552525 551798 545804 530487 533057 524658 524847 521659 512867
9563 512867 497617 481896 460412 454647 451317 435394 413912 390918 374243 370454 363151 347548
9551 347548 357466 370591 376761 366344 367506 390510 420868 455406 487308 502525 523551 548186
9539 548186 570793 586794 597641 602885 598797 591981 588723 581087 578202 573848 574131 564909 544460 513223
9525 513223 477704 448829 417367 397640 366837 349725 358349 361605 362537 366453 388794 403522 420308
9512 420308 439906 461329 468674 480247 488287 493123 487803 501962 518232 518160 521443 520459 525807 518986
9498 518986 492397 481354 462550 446241 435029 417636 395066 381786 382729 376230 362541 349834
9486 349834 359201 364518 358428 354754 353574 344692 339816 334157 330040 313998 297275 283792 273521
9473 273521 269072 256575 248302 249329 254768 258627 267506 280381 295416 306893 321762 344677 370814
9460 370814 385090 406060 414081 409611 407341 405877 404310 407023 411562 403387 393363 394695 384626
9447 384626 368083 361460 339017 314900 304110 286708 271589 272590 270445 267257 273846 273090 281243
9434 281243 290628 296545 288023 277653 279993 277424 275677 272118 274338 281616 290853 301171 310492 324719
9420 324719 347475 361902 372249 390686 404296 407892 402652 409013 409187 412123 409993 420997 428948
9407 428948 443148 451079 449977 444873 433375 423533 407100 389940 371849 354848 365495 364557 358378
9394 358378 372537 381913 388555 394431 398475 408090 411178 428768 433499 440600 447262 461282 487696
9381 487696 516529 543036 575464 613437 664433 720181 795017 862467 925376 970794 1004839 1023577
9369 1023577 1039306 1059246 1110773 1180002 1258603 1354919 1459736 1558427 1641136 1709473 1768083
9358 1768083 1824207 1877548 1933864 2021841 2142378 2284140 2458060 2659355 2908711 3189257
9348 3189257 3475186 3776850 4059538 4259853 4332728 4267660 4083818 3817290 3507112 3173192
9338 3173192 2850791 2558466 2286211 2032980 1822929 1666954 1532411 1409138 1314860 1248872
9328 1248872 1179889 1119783 1074421 1027786 998543 992385 1001872 1023879 1053661 1085093 1148123 1218529
9316 1218529 1286749 1359917 1444607 1526969 1610336 1694750 1787270 1885014 1993517 2086490 2156186
9305 2156186 2213156 2244750 2253996 2245706 2210341 2145920 2058089 1957396 1866334 1787619 1716483 1664323
9293 1664323 1624702 1583764 1561735 1556722 1558539 1579144 1611170 1658503 1709457 1766838 1828844 1894025
9281 1894025 1973133 2074093 2202899 2361648 2557373 2778877 3032460 3302739 3553367 3765664
9271 3765664 3953034 4109830 4225923 4326102 4408664 4480400 4559540 4666421 4813500 5000405
9261 5000405 5229985 5507679 5805066 6132700 6507053 6946681 7479415 8174394 9108355 10394068
9251 10394068 12189998 14624806 17674516 21086950 24409208 26999773 28279879 27992141
9243 27992141 26265992 23479830 20193925 16997990 14303473 12261324 10876100 10028080
9235 10028080 9592495 9513988 9744797 10266903 11070185 12134838 13430781 14913432 16512805
9226 16512805 18204930 19909810 21510808 22828100 23646449 23960637 23948315 23818845 23836091
9217 23836091 24335352 25541168 27515001 30380279 34414927 40008649 47504782 57136717
9209 57136717 68837463 82116195 96099030 109619397 121442823 130501875 135915657
9202 135915657 136967650 133251608 124854896 112468867 97499377 81730124 66928951
9195 66928951 54347540 44410846 36868918 31225277 26980916 23732679 21208775 19213546
9187 19213546 17620479 16321983 15263788 14398537 13679510 13091046 12625447 12274001 12024957
9178 12024957 11871414 11810082 11834958 11966524 12208109 12563195 13061038 13718842 14592597 15768143
9168 15768143 17335218 19417622 22165710 25762323 30383447 36194139 43192060 51236684
9160 51236684 60064310 69297439 78564137 87619513 96182669 103867557 110077612 113830737
9152 113830737 114005637 109914082 101647231 90208882 77294534 64600851 53359872 44210088
9144 44210088 37161211 31926385 28087119 25255043 23137465 21561859 20411767 19627567
9136 19627567 19165744 18972101 19015086 19271412 19680912 20050932 20094842 19669083 18840423 17691115
9126 17691115 16330443 14947645 13661412 12492950 11445511 10548831 9829798 9343919 9092089
9117 9092089 9073701 9330015 9893514 10820750 12166731 13945953 16046771 18242335 20170035
9108 20170035 21442896 21719414 20889841 19096043 16714376 14221363 12024468 10290114
9100 10290114 9032470 8160457 7538123 7069114 6661709 6313477 6012473 5737834 5499319
9091 5499319 5279077 5065123 4887321 4749980 4633857 4532823 4435209 4338411 4236172 4101761
9081 4101761 3946893 3793548 3625131 3429112 3231357 3041170 2860262 2708299 2560759 2433060
9071 2433060 2326733 2234113 2161773 2105099 2055429 2022721 2004378 1985290 1971032 1978704 1988732
9060 1988732 2002342 2027765 2042664 2064521 2068954 2052558 2006379 1944537 1875677 1802370 1736064 1668374
9048 1668374 1600745 1526725 1473814 1426326 1372337 1308285 1247263 1191641 1149072 1115311 1086103
9037 1086103 1063352 1054293 1042222 1037274 1043187 1037808 1041315 1041224 1056962 1078044 1107322 1140233 1193492
9024 1193492 1258832 1333002 1404682 1503059 1605790 1718906 1845164 1974191 2069344 2111635 2106598
9013 2106598 2051655 1934763 1777208 1632834 1505230 1393357 1292276 1201769 1131047 1064424
9003 1064424 1012600 972631 931216 905509 883698 854897 826573 798856 768380 720722 686615
8992 686615 653070 616585 605016 599591 596897 582357 563126 535604 511948 494487 473694 451835
8980 451835 425899 406858 391948 385414 373786 358736 339538 328651 329310 324550 310040 299769
8968 299769 300650 296671 299513 313341 317403 312254 317489 331775 338183 330742 318039 308427 293411 273391
8954 273391 265955 267543 267577 260171 249731 246127 244998 233570 222708 216084 214580 214117 202314 195305
8940 195305 189764 183921 184091 189416 188034 193539 191640 183298 175645 177157 178766 195823 200897 198050
8926 198050 200741 198336 192942 184749 191048 197096 220385 247674 268338 288384 302658 283072 246224
8913 246224 223395 214515 203878 195570 191537 191744 191273 182896 180312 167663 162543 170601 170626 164634 162419
8898 162419 159442 158526 160189 165064 181491 193384 196252 199074 205762 211979 217973 217423 210911 203993
8884 203993 195362 212016 229581 223032 226911 235160 235965 227273 215189 221143 225541 227924 229484 234923
8870 234923 220536 200512 190285 181059 174984 173733 171115 172160 178964 176401 175392 177316 177564 181478
8856 181478 173419 179510 199647 232985 263360 283994 312939 348001 378752 401695 411008 423517
8844 423517 427013 426337 417423 408282 398548 378412 350088 328854 312995 295139 282308 266302 262132
8831 262132 251553 252621 253188 257783 257360 252610 245229 243494 254488 266654 294438 320026 338588
8818 338588 355671 369207 386076 398223 400494 403766 391767 367694 355725 340274 312830 287343
8806 287343 263551 256717 247381 239690 249202 248850 243965 245171 245764 249237 253829 252237 249200 250024 257844
8791 257844 256295 269536 284774 308908 331633 354472 364217 359456 351799 346597 330237 311464 300701
8778 300701 300271 302401 287186 284112 292862 286203 287539 291314 301379 325843 352719 366309 385599
8765 385599 401753 420680 430634 437840 449956 457153 454594 439098 436327 440591 435975 427142 422585
8752 422585 416200 412158 403131 388776 358830 340612 322819 312135 304375 303373 297882 299007 307567
8739 307567 321770 332644 349342 360819 372698 372493 382107 386012 386647 363965 331381 317009 295601
8726 295601 279103 265826 251523 235299 227991 219911 200437 190118 186481 175114 175878 175858 182346
8713 182346 190443 193845 217822 237226 247352 257320 260955 278998 307972 332177 352608 359913 360564
8700 360564 354929 334973 318589 304489 287239 264800 241705 234960 226186 216336 214291 212539 198018
8687 198018 200949 203139 210339 220584 226104 225610 221015 222946 238351 259899 280299 294920 306436
8674 306436 322509 328319 335624 336025 334237 331674 325090 322122 309639 299607 297066 283634 266684
8661 266684 260468 257550 256485 256616 254927 254200 261163 270851 261406 251804 260581 266562 270146 269219 254608
8646 254608 240549 231607 233044 237942 241480 255186 267712 269819 270765 266330 270914 270983 271286 281362
8632 281362 301967 320521 342210 353443 367109 387357 399343 418128 436586 461804 483478 505974
8620 505974 541617 578109 624809 658282 695940 746547 802179 859536 915383 975564 1035512 1092389
8608 1092389 1141519 1172086 1164908 1114658 1014794 902304 809816 736177 685111 646845 620122
8597 620122 602187 589559 569587 553841 535444 511446 504193 504530 508236 503988 510109 526725 548165
8584 548165 562586 584394 621335 675469 718001 768587 835642 921895 1040399 1200465 1418932
8573 1418932 1753215 2273958 3089984 4376451 6230809 8443158 10596796 12284017 12657738
8564 12657738 10915978 7903990 5366694 3783456 2829750 2222049 1826688 1563001 1390047
8555 1390047 1269661 1202640 1169836 1145377 1128844 1108774 1063033 1000766 947963 909132 888557
8544 888557 877454 876329 885551 906760 941899 999794 1069545 1158849 1269299 1388941 1513001
8533 1513001 1642688 1818575 2073077 2442512 2971966 3764331 5033180 7096491 10303378
8524 10303378 14551326 18951968 22849742 25094870 23290115 17455257 11707011 7959693
8516 7959693 5722357 4338289 3435129 2831340 2406877 2105593 1903368 1762344 1650467
8507 1650467 1565621 1497888 1419488 1313312 1198610 1098353 1034842 993309 958024 935818 925050
8496 925050 919298 916462 926026 950822 968090 993895 1036100 1088034 1150743 1251553 1397164 1619910
8484 1619910 1951125 2455483 3278460 4574618 6413759 8516451 10482729 11935742 11990333
8475 11990333 9969875 7046780 4769150 3364050 2518397 1971599 1615038 1353596 1174435
8466 1174435 1049045 949570 881032 829961 777795 717843 671841 632551 593514 561191 540598
8455 540598 521873 498095 461893 436861 415616 406649 396175 378922 359886 340327 323755 312647
8443 312647 312207 310577 309988 304934 299645 294080 289410 267606 242028 233968 232761 233670 236657 232722 228443
8428 228443 220449 205281 203629 204603 196065 192036 196522 187181 172035 173788 171511 165959 154939 155923
8414 155923 151277 157824 151083 147470 152230 162913 155780 151157 147188 139287 135333 132533 128740 129199
8400 129199 129243 131970 136428 141657 134187 135799 135949 128537 118891 102567 95981 96181 106640 90895 78987
8385 78987 78986 73758 71171 77785 80100 76748 80028 80980 76506 70934 70591 70801 68313 58255 47158 52300
8369 52300 56583 60535 65690 62357 60512 70578 70312 66681 62685 59031 56400 70227 77287 70240
8355 70240 73367 73669 65647 57179 53108 53290 53015 56100 57019 59818 53588 50922 52396 58239 54824 56674
8339 56674 61202 70106 74897 73516 65621 45864 37395 41215 49920 56686 61875 62239 64658 53056
8325 53056 52532 49172 53702 51449 41398 40453 51967 54759 55985 57604 58665 43643 40061 40759 38002
8310 38002 37759 37472 41009 51323 48060 45699 40402 44571 43245 36131 27597 24977 16763 18881 28367
8295 28367 38697 30586 27961 51157 65039 64382 52481 55611 64344 61814 59290 64236 56849 55811
8281 55811 46598 43041 43098 40881 35054 39513 39186 40471 38747 42644 51939 56969 44004 28701 23494
8266 23494 24074 35323 34180 35118 35456 27923 29927 32752 31083 29261 33013 36743 29269 24140 24602
8251 24602 17514 20248 34595 32151 35489 41651 42037 43008 48734 40530 32698 34627 34060 23086 14936
8236 14936 25352 38222 36018 38524 40104 37382 36751 51948 51107 40216 36796 45763 45347 36888
8222 36888 26381 24466 27023 21289 23436 30002 22054 20762 26015 27874 27704 34277 40297 40843 37413
8207 37413 40229 36426 28595 24926 22655 27273 30397 28931 37683 42150 36801 22083 10262 14940
8193 14940 21596 26554 26480 31686 29217 29000 34176 30254 34100 39809 46811 48440 52462 48437 47036
8178 47036 46765 45238 53832 52249 49998 50135 48287 44561 58020 83367 109885 142528 166242 201727
8164 201727 218453 208571 172231 137875 108796 80591 65255 58613 57374 54972 51762 54007 48929
8151 48929 50293 55058 46722 48972 45094 41203 36070 36039 39485 40514 37953 43930 54478 53582 45764
8136 45764 49306 52827 58350 58184 66064 77866 76101 85950 99917 113142 130624 158125 192036
8123 192036 231685 254431 266713 255121 222088 177900 138805 106053 84413 69715 57122 57483
8111 57483 61384 69800 68521 59421 53457 56722 54039 48427 49249 47508 52359 54295 57622 54170 56404
8096 56404 49517 39319 39215 50657 44258 35797 42653 50743 46393 42909 50946 62574 65500 65341
8082 65341 76918 85151 102566 131830 139338 149617 164243 159749 143111 123184 118613 107263 95239
8069 95239 87299 86894 93057 91344 93901 89371 81411 75687 84950 99104 98347 104507 117604 122158 117083
8054 117083 116383 112856 106590 109791 111909 110862 110364 105696 104747 105876 100848 104958 112126 112901 106663
8039 106663 93555 90307 88633 91445 93701 103580 103274 101674 94896 99860 105208 101012 103860 122968
8025 122968 137271 131580 130668 141529 143179 141880 153783 167171 174543 184821 199813 219680 237656
8012 237656 240193 227664 221946 217429 200956 189117 170923 164606 161771 154147 151176 143358 139853
7999 139853 130301 116620 114889 106147 103675 107396 102832 91314 88683 94686 97111 99051 101667 105445
7985 105445 122427 137399 140428 142163 141286 143537 145356 156380 164549 167095 171731 175458 172879 169814
7971 169814 182104 197004 210323 214364 201079 195104 178755 163055 162929 163854 165040 152232 134447
7958 134447 124102 107649 101543 97480 97921 96397 102100 116924 111409 107989 102802 96447 100676 111547
7944 111547 105931 100088 94963 94924 90336 86415 86080 93676 99343 98212 92936 92255 101070 107113 111869
7929 111869 116642 117987 112515 106479 99888 101716 103415 95901 77122 64788 66836 67873 67018 57714
7915 57714 56140 55402 48160 37525 39304 42042 47342 47426 42946 38355 32023 32891 38914 39421 40233 41613
7899 41613 33999 29310 39578 43721 44042 41583 43465 48699 43362 45099 37447 18981 12084 20915
7885 20915 21118 24847 29539 34128 28757 26515 24549 16346 19503 29583 33652 30197 32321 26893 16239
7870 16239 17994 21162 20358 12975 17318 24137 34753 33419 14814 8188 12674 12565 14366 22869 16934
7855 16934 14982 13102 16141 19783 23379 16919 11274 13434 18981 22425 25392 16250 12987 16329 13724
7840 13724 12540 14019 9207 11463 13923 18446 25193 21738 24432 23031 17515 10162 6910 5915 7201
7825 7201 -1697 -6155 1739 11134 13105 10791 3069 -2238 -3438 -541 -7424 -13164 -14809 -7692 -6349
7810 -6349 803 6864 11462 26567 27341 13846 -3505 -55 13236 16182 20747 20912 16750 23907
7796 23907 16266 10202 12497 17527 20695 24176 20313 13269 24663 24136 16803 19472 33852 36334
7782 36334 32137 32272 27171 14213 17386 13184 14769 12055 -740 -4476 15881 24421 15886 3744
7768 3744 -3028 -2053 5370 16941 26425 23855 23288 13432 -856 -5914 -5522 -6605 5873 6678 9511
7753 9511 15088 13948 3899 13788 21957 24623 24881 21122 16206 2712 1734 305 -2856 338 -3507
7738 -3507 2444 3773 -607 8631 13157 13543 7604 10573 13988 10789 4655 23 -4452 -3054 9421
7723 9421 15736 11950 8962 1101 -1756 3397 -4649 -2009 5488 4446 6305 15639 15006 8770 17378
7708 17378 17812 8472 -1899 -10079 -4295 2541 3359 574 5335 287 999 14114 5855 -881 -6183
7693 -6183 75 -6000 -8743 -2164 2324 -4284 -113 836 6349 9896 1508 -5522 -3697 -4394 -5866
7678 -5866 -5052 -7012 -14544 -11677 -4168 -1111 -4579 -6785 1164 -5982 -10488 -9031 -7435 -3193 4139
7663 4139 11062 14763 6907 -2967 2082 8243 8447 3783 -2095 -3214 -1407 8955 -3072 -8845 -7168
7648 -7168 -11250 -13764 -11501 -14550 -14249 -11294 -6221 -9052 -15152 -17097 -19226 -19126 -13679 -10467 -7640
7633 -7640 2200 2081 -5940 -3088 -2562 -8122 -5489 -5026 -5904 -5667 -8213 -11049 -16510 -20748 -18627 -14913
7617 -14913 532 6507 -2929 -2768 3716 5153 2075 -3399 -6429 -11304 -13219 -11777 -16095 -11967 -227
7602 -227 846 1453 6089 12696 11793 10727 2578 5235 3339 -1507 2375 6827 13754 11251 6518 6738
7586 6738 -1091 -3064 -4668 -3817 -5832 1018 2359 5086 7287 4859 3373 3265 1205 1902 8890 7359
7570 7359 11768 13882 12262 15171 19174 25166 30631 28605 22580 18475 10521 10120 7639 506 -10941
7555 -10941 -2648 1134 -3459 -876 -2054 -374 -533 -2686 637 3689 8345 7817 11149 15926 24977
7540 24977 23791 15627 16393 7630 5582 -779 -3481 -1115 -3393 -3840 -8349 -15344 -8240 -1054 1985
7525 1985 -2873 6287 2912 2495 3003 2861 4313 -5592 -3980 5109 7387 -628 -417 -17318 -19510 -16375
7509 -16375 -22332 -19413 -15078 -6807 2411 5909 12161 9526 4556 10990 5956 -1723 5865 1819 2456
7494 2456 1712 6444 -874 -5324 7631 10910 13814 17191 5967 -1671 -4011 -5461 10278 10180 9295
7479 9295 8286 8447 4616 -4786 -2927 435 -1183 -2663 172 10928 15397 16218 14341 190 1405
7464 1405 1811 -3716 -680 -6476 -7605 -3928 6422 10500 5398 662 1322 -6350 -15960 -22937 -24250
7449 -24250 -28281 -24717 -11919 -2071 -6046 -7685 -6007 -4747 -2971 -732 500 -640 3250 -5652
7435 -5652 -6750 -1259 -6859 -7858 2827 10199 12619 10529 9343 4743 961 5454 1957 -5788 -3836
7420 -3836 3421 7429 -5418 -8968 -8695 -1241 -1528 531 -3079 -4831 2808 -3481 -11181 -7860 -8179
7405 -8179 -12614 -8772 -1619 1817 8384 -3654 -16411 -24168 -19394 -18192 -22983 -15581 -15769 -19303 -11769
7390 -11769 -8757 -8305 -7776 -15808 -19562 -13161 -12543 -30329 -26733 -23459 -22170 -23103 -29240 -30692 -22281
7375 -22281 -20393 -23794 -20101 -11398 -7002 -11939 -22261 -17618 -5218 -1910 -3943 -1487 -2555 -10432
7361 -10432 -169 6219 -434 -1014 -2001 4772 3773 2911 5757 7485 -1124 -8561 -7154 -9917 -22162
7346 -22162 -24557 -18582 -15311 -9975 -10730 -9599 -8017 -6624 -2973 -5387 -6496 -6774 -10925 -15500 -18125
7331 -18125 -8525 -14653 -21726 -20050 -13131 -16876 -19243 -10471 -6237 -5318 -11123 -16379 -17967 -18651 -24821
7316 -24821 -16887 -11070 -9384 -9853 -7120 -848 -4674 -8906 -6765 -7707 360 -1167 2508 7938 8809
7301 8809 11213 9020 2125 -9414 -12107 -6462 -16244 -21899 -18817 -6169 -4267 -11047 -15907 -10847
7287 -10847 -15755 -9631 -8544 -13392 -6873 531 -2729 -5888 -5595 -13804 -10192 -10922 -7278 -3778 -4722
7272 -4722 -1194 3845 6920 5378 -506 -7241 -17652 -11502 -11486 -19740 -19662 -6313 1295 2857 5417
7257 5417 3406 -1254 16 -2497 -2718 -6123 -10385 -12083 -7824 -5145 -184 7946 5355 7666 6600
7242 6600 3452 -99 -6844 -6072 -7278 4141 1660 -10087 -17126 -11742 -2280 -3482 -15288 -19139
7228 -19139 -6803 -584 -13866 -23037 -22533 -20645 -14075 -6105 -8165 -15090 -10969 -14660 -24330 -32728
7214 -32728 -35174 -25623 -13114 -8712 -10951 -12731 -10711 -5704 5613 12713 2490 131 2235 -208
7200 -208 -20 -3937 -13837 -17538 -8381 -3648 -5604 -204 5221 7783 7464 3869 -3687 -11108 -5295 -674
7184 -674 -3286 -1112 -14245 -14604 -7680 -4503 -4699 -15729 -10689 2396 1275 -5505 -7586 -2492 -11563
7169 -11563 -9289 -18676 -18202 -17365 -15338 -15773 -25880 -21382 -10347 -11022 -15020 -18801 -11720 -8302 -13224
7154 -13224 -10963 -20097 -22151 -9315 1077 8525 4151 6346 9307 8231 -4293 -14018 -12321 -8101
7140 -8101 -8077 -13397 -14723 -6403 -8045 -486 -3177 -8645 -16151 -22303 -26493 -21660 -17870 -18591 -23926 -22631
7124 -22631 -10594 -6997 -12976 -11931 -9374 -7521 -9392 -11769 -12011 -8142 -8847 -8950 -18592 -23657 -22146
7109 -22146 -14324 -4980 -203 -6359 -7994 -6787 -15642 -15935 -16368 -17024 -7689 730 4192 -5878 -16368
7094 -16368 -8847 -661 4046 4740 637 2851 10166 6945 -4386 -3858 -8640 -11031 -8394 -7323 -10975
7079 -10975 -13953 -22109 -24528 -21464 -20751 -11285 -9970 -16373 -11080 -14288 -22775 -20345 -17773 -18909 -13850
7064 -13850 -7610 -237 -1975 -6392 1029 -1856 -6549 -695 -4423 -12044 -18572 -9917 5423 12383
7050 12383 13306 13635 10632 5435 6723 7514 7123 4425 275 -3997 -9808 -5257 -985 -977 -2528 -4697
7034 -4697 -6784 -8804 -3921 6084 4289 -4516 -5490 -2133 -2302 7651 9414 217 -6640 -16737 -17180
7019 -17180 -8444 -4787 4366 5754 17269 11336 117 -12542 -10597 -10777 -14753 -11621 -6673 -9065
7005 -9065 -11488 -5879 -5653 1525 3225 -7756 -9739 -9373 -3883 -8333 -7144 -7525 -7297 1244 -3062 -2386
6989 -2386 -5618 -1193 5721 5601 11497 18132 6754 -13321 -22770 -10313 -2056 -11189 -19209 -18577 -15510
6974 -15510 -10287 -5502 -1235 10533 13163 5477 -620 -6300 -4696 5959 19361 12370 6316 5198
6960 5198 -2059 -8804 -8969 -8788 -5210 -7457 1866 9477 7403 3823 8726 10286 2491 4472 8156
6945 8156 9089 2045 -3122 -3915 -3964 -2686 -4188 -15886 -15184 -1932 -4101 -9213 -9340 -5816 3013 5619
6929 5619 5070 5596 11073 11334 14357 13418 13994 9987 8252 5739 14003 13380 12982 4977 5535 9189 5090
6912 5090 3089 -1431 -3525 -6126 -3389 4399 6487 10753 9526 9221 5040 -3166 -4140 -3572 133 -3844
6896 -3844 -7884 -12891 -2593 10539 12535 7600 13803 18054 6961 7149 13494 19113 21417 15688
6882 15688 15070 3672 -5647 -7918 -4935 -3960 -4947 -6267 -6843 -4017 1291 1018 -3201 -4670 -9889 -6974
6866 -6974 -11050 -28471 -36386 -27795 -21941 -14517 -12838 -21641 -14082 -1872 -3007 -3423 -4171 -11257 -19247
6851 -19247 -18715 -11641 -12216 -15132 -12527 -1631 3782 4748 8130 8753 14327 10683 15474 22193 28432
6836 28432 24356 19833 13874 4485 546 2300 -8155 -23689 -31448 -23160 -24468 -20123 -7087 -553
6822 -553 173 5875 9546 6940 2769 119 11810 13098 6691 -949 -8949 -7701 -3307 8953 9526
6807 9526 928 5134 15271 21038 16086 13978 13873 14566 9267 3770 -228 -769 -8239 -25776 -32690
6792 -32690 -41663 -33985 -18460 -4952 -11504 -10042 -12930 -11012 -13543 -16214 -14393 -22276 -23758 -15124
6778 -15124 -17144 -13354 -1371 10170 8121 -334 11941 6045 -13532 -18670 -9162 -6502 -4809 -6997
6764 -6997 -2591 8377 14017 11486 9447 16485 5639 -3790 -5205 -2097 -3791 1782 10458 31653
6750 31653 60700 78484 88496 101815 96790 74869 57203 44753 35994 26333 14935 7820 5598
6737 5598 9443 179 -1169 -8631 -810 513 -2030 -209 3579 8873 -1489 -10645 -13575 -13728 -7324
6722 -7324 -13622 -22455 -30469 -23953 -16431 -9699 -674 4326 2921 1168 -295 -5002 -7887 -12186 -6979
6707 -6979 -2427 -4207 3119 16642 23325 14492 -4094 -10392 -5604 -9251 -7089 -5642 -13761 -22675
6693 -22675 -17082 -1503 6608 1903 -5838 -12747 -20029 -18422 -5070 5370 -3623 -7100 785 822
6679 822 160 2907 106 -6587 -14795 -16703 -19096 -15987 -16831 -16313 -11724 -3688 -1979 -7429 -5667 -4640
6663 -4640 -5115 1113 3381 -7390 -5163 -3004 -5938 -11804 -292 2591 -5851 -13138 -14642 -16723 -12488
6648 -12488 2488 -3322 -15225 -18958 -10681 -11457 -1507 -4482 -6398 -1095 -3529 -7887 -1492 1826
6634 1826 -13097 -11956 -9221 -7672 -1285 5495 2221 -2759 -5616 2607 3792 1798 9134 11356 -1110
6619 -1110 -10176 -3225 10807 20031 18248 4573 -12029 -21256 -28960 -29440 -24524 -16113 -8623 -7849 -15219
6604 -15219 -15115 -7935 -11253 -7103 -11631 -2721 -1753 -10837 -16439 -19221 -16466 -8541 4220 588 -4672
6589 -4672 -1829 5285 8114 3797 11663 5045 -10326 -1516 10419 16140 17018 10166 1604 1107 1011
6574 1011 3302 4030 10585 8165 -1821 -2883 -2731 -5513 -13919 -12504 -13277 -11867 -6265 -8165 -17100 -31041
6558 -31041 -30434 -32913 -36436 -34367 -27678 -30385 -24317 -8020 -2640 828 8056 4051 -806 435 -5581
6543 -5581 -3136 2068 -2678 -4643 3002 -3175 -4783 -409 2901 1616 -10691 -9396 -11898 -7460 -7347
6528 -7347 -5383 -7231 -13059 -13347 -14481 -11999 -19048 -24841 -12089 -6654 -7099 -8076 -8095 -6149 -12330 -14347
6512 -14347 -17340 -8957 -13664 -11810 -13028 -2695 -8850 -14103 -15956 -21019 -29154 -25010 -12979 -20682
6498 -20682 -23721 -30038 -25483 -17846 -1889 9235 15210 21574 15185 9143 7160 13450 20592 20492
6484 20492 20994 16703 10918 140 -534 -7480 -6559 -13765 -21568 -18088 -7050 -6504 -5516 -4975 -4656 493
6468 493 7472 3592 -7844 -3974 -3290 -4252 5290 5071 2317 -4828 -11851 -8488 -1488 3489 -2248 -553
6452 -553 -3359 3876 -2995 -7938 -4888 5602 9547 -2640 -6908 -1706 -2652 -870 -364 4407 -792
6437 -792 -7448 -9967 275 7207 3785 3696 -4581 -12601 -5337 -11253 -22199 -16702 -9960 -13700 -8515
6422 -8515 -9253 -9664 -7001 -11969 -13273 -24207 -31928 -19960 -16039 -15441 -20285 -26437 -21652 -19519 -10149
6407 -10149 -8955 -3999 4492 5697 6261 2146 -3109 5911 2305 -14255 -14851 -1230 12775 12118 10457
6392 10457 4109 -588 -1491 319 -6155 -14091 -17411 -10147 -8392 -9234 -17993 -15094 -4926 -8007 -9969
6377 -9969 -13448 -11960 -12177 -12051 -18743 -27409 -24413 -12191 -6310 -6011 -11877 -13026 -12709 -5054 3601 3005
6361 3005 -1325 3734 2688 4804 5953 -499 114 12480 9501 -454 -633 -451 3141 -10102 -15740
6346 -15740 -14274 -10328 -15926 -13131 -7168 -5000 1238 9935 6433 5228 533 -11020 -20195 -5959
6332 -5959 748 -2881 -6584 -9237 -5836 -4345 -1541 898 -2232 -4989 -9661 -10149 -12213 -3033 3758
6317 3758 1562 -11995 -11444 -8353 356 14412 17264 11040 11667 18049 16537 8084 -3317 -5387 -2280
6302 -2280 -3661 -7402 908 5941 5493 12585 19364 10408 8130 10723 7557 1018 4031 -63 2663
6287 2663 11797 16341 13648 8827 -1291 -7437 -1884 7314 1782 -11793 -4647 5255 213 -6010
6273 -6010 -2709 3622 -762 -4180 -9687 -16591 -9392 -6492 -440 -6955 -6350 -9227 -8387 -9531 -12241
6258 -12241 -14073 -20288 -20629 -8859 4971 7638 3777 -4107 -4928 3321 7085 -5497 -16111 -8798
6244 -8798 -5192 -578 3731 -6437 -18828 -25763 -25821 -10933 -6750 -4905 -57 5350 4813 4182 -1743
6229 -1743 -12549 -11078 -8410 -14921 -20494 -17715 -9948 -11524 -18290 -28669 -26113 -13850 -10928 -5670
6215 -5670 612 802 -8185 -15949 -23030 -19119 -19378 -31774 -31422 -25169 -16392 -15184 -14341 -10684 -9350 -8501
6199 -8501 -7556 -7701 -8580 -6294 -12524 -11285 -5805 -12050 -18777 -22723 -21810 -13486 -6655 -7114 -6038 -13574
6183 -13574 -14646 -16425 -20676 -11855 -5136 -7123 -2234 -4936 -3679 -154 -4643 -3288 -6011 -1504 4240
6168 4240 2622 2058 -2456 -7413 -6029 -794 -7731 -16553 -26618 -21502 -25512 -23224 -14343 -14884 -16054
6153 -16054 -8242 1630 550 -215 -3098 12184 9870 2834 1064 5059 -2855 -4136 -4575 3390 9678
6138 9678 8533 4934 13802 25812 31548 25891 14147 5315 -5668 -5751 -3397 -3836 -6397 -7243 5039
6123 5039 4218 3 -1267 -811 -6568 -13032 -20325 -16485 -10591 -9652 -2921 4200 -7172 -8153 -1534 -3212
6107 -3212 2206 -4361 -1518 -4824 447 -1013 -3243 -2694 1637 2462 3180 3941 -5710 -9845 -17654 -16449
6091 -16449 -12717 -17998 -19161 -18171 -13618 -6539 4176 -1946 -3752 -8635 -14153 -10699 547 -4664
6077 -4664 -4003 770 -4547 -469 6652 1986 2448 551 3359 -10527 -19350 -18963 -10160 -9532 -6907 -2012
6061 -2012 -8440 -4755 -5713 -9523 -5524 5598 11339 -1418 -11225 -10861 -11880 -13278 -3591 2505 4073
6046 4073 1733 -3322 -7559 -2005 -3471 -2844 -5055 -6508 -10233 -15313 3454 17587 8143 6815 5210
6031 5210 8554 11703 16729 14331 11659 10417 6772 -4321 -10460 -7973 1223 -995 -7281 -2241 4073
6016 4073 10511 15171 16120 13220 3881 -2815 -3336 -11899 -21093 -9407 1153 5745 7465 8226 3001
6001 3001 9205 10974 8523 1254 -11 -1141 4185 9287 13717 16163 25426 19398 12767 15803 13719
5986 13719 -5081 -3717 -8590 -5714 2213 -1190 -8128 -11862 -10145 -10283 -2163 -3482 -10210 -10883 -10275
5971 -10275 -10943 -8944 1971 773 -10433 -9806 -5153 -7987 -13605 -20174 -18749 -17707 -10645 -6771 -4763
5956 -4763 -2094 -2353 -15390 -18752 -19804 -16015 -15985 -11570 -4655 -9739 -14135 -13240 -14222 -16380 -16097 -9308
5940 -9308 6707 2558 -6462 -5613 -1677 1281 -4129 -11027 -10146 -7685 2525 11539 9760 4056 3706
5925 3706 4594 8463 9467 1390 -492 -9655 -11301 -8916 -414 -1697 -6935 -3245 534 -9582 -4053
5910 -4053 5233 9144 869 -5131 -12325 -22017 -14490 -8891 -2347 -9838 -3251 993 -7713 -7875 -5698
5895 -5698 -1527 -2071 2460 13912 18573 11069 -306 -5248 -711 781 1168 9249 4815 -410 5328
5880 5328 11494 12805 6963 476 -589 6395 8743 2164 747 3875 1244 439 -796 7696 6180
5865 6180 5062 -5431 -16589 -20952 -8274 -5208 -9152 -4804 -1000 -9677 -10780 -7413 -4987 -18365
5851 -18365 -22687 -14542 -6446 -8680 -13993 -14073 2489 9398 4024 10970 4320 -3241 -11594 -4136 594
5836 594 -4760 -4215 -3985 -9989 -11004 -13224 -15000 -6954 -4851 11944 10142 3321 -8329 -1570 2200
5821 2200 -1851 -126 9603 15347 9844 -7433 -18566 -11651 -342 -1223 -7634 -8238 -499 3351 990
5806 990 -9516 -3127 1877 5897 5215 -7515 -6186 -9120 -5088 10484 10118 8881 9821 4584 -3286
5791 -3286 -12906 -15611 -5580 -2610 -7645 -2969 1122 -1582 1160 -93 587 1562 3908 6340 -2124
5776 -2124 -7711 -9362 -8914 -10468 -8829 -10584 -13334 -14004 -23735 -21736 -24593 -23267 -9653 -1642 1997
5761 1997 -2670 -6371 -4145 -3260 994 -3857 -9920 5230 6232 -2148 -8255 -1649 4134 1035 2852
5746 2852 1886 4176 -5307 -10841 -19625 -18931 -21210 -34869 -23762 -12779 -3290 5096 7660 4082 -1831
5731 -1831 -6728 -8637 4099 10483 15171 13032 6655 283 -1051 5198 2313 -357 11171 14465
5717 14465 1640 -7677 2633 5680 -353 -7530 -4359 3520 1446 355 -5224 -7939 -765 3532
5703 3532 2875 2870 220 2966 7139 8606 8059 3531 -959 -2701 2525 -2223 -7083 -15805 -4853 7335
5687 7335 10825 10926 1237 -11903 -10813 1036 2253 -2972 -10770 -5545 -2894 -815 -13635 -13415 -11378
5672 -11378 -9436 -9932 -9494 -3010 -6508 -18529 -23375 -14359 -5047 -1888 -5469 -9978 -6552 1102 272
5657 272 -4647 -8806 -1719 1877 312 -2439 -5981 -7735 -5099 -7983 -22777 -14998 -14904 -8797 -11595
5642 -11595 -12236 -4952 -5547 833 -2148 8184 13192 9385 4864 6789 7988 5162 5687 -518 358
5627 358 1891 -1337 -6775 -13443 -12464 -7458 4215 2368 6848 38 2843 -3422 -1084 -197 -2267
5612 -2267 -5021 -3104 948 5625 7580 7160 -1235 1680 13459 15186 -1337 -6103 -5355 -10669 -14444
5597 -14444 -20460 -16806 -11860 -8857 -3000 -5388 -6861 -5390 -16165 -12002 -8876 1848 5736 4545
5583 4545 3620 -223 5264 6590 -994 -2714 -9115 -11920 -12905 -17516 -10412 -1845 -11055 -10770 -2333 -246
5567 -246 7116 4181 1167 4251 8526 6862 -5346 -11409 -11962 -5523 -2931 -7160 -19386 -15708 -18045
5552 -18045 -20709 -16613 -1640 -717 -10206 -10590 -8460 -4530 418 11327 9231 6898 4326 3656 12346
5537 12346 13682 6385 107 1445 2214 7439 15797 13803 10648 2209 -7400 -10188 -22 1249 -4604
5522 -4604 -1275 -1484 -4429 3272 14550 17453 19314 6764 1763 -5044 2424 5624 6132 9811 13094
5507 13094 6031 9033 6773 12809 3404 -4712 -2836 -3741 -5700 -9634 -2529 -6187 -11847 -10281 -2099
5492 -2099 1677 153 2189 -1124 516 -7459 -13633 -2999 5112 6263 12308 15339 10265 12567 8493
5477 8493 7476 10008 13283 12084 -5023 550 10796 14311 8290 9204 14088 15218 11068 1463 -3015
5462 -3015 -7369 -14850 -24468 -33290 -30024 -10716 -1770 -9043 -22172 -19566 -8171 -6786 -11105 -13693
5448 -13693 -11099 -7479 -13572 -9689 -8631 -6341 -9674 -4095 -9222 -10928 -1168 -9083 -9791 -2098 -444
5433 -444 -11072 -12089 -4689 3572 17047 15777 10933 7138 -852 -4246 -10008 -19812 -22478 -15151 -7487
5418 -7487 5270 -716 -10244 -4328 -11584 -16391 -9452 -13889 -11177 -11437 -7039 -6315 -485 -7037 -9048
5403 -9048 -12332 -14250 -15982 -13305 -14281 -18103 -21118 -14579 -3864 9087 10049 4828 4009 1380 7214
5388 7214 12150 13058 13760 4392 -7641 -7676 2412 6581 11154 6416 2486 4710 5321 -2152 -10108 -1729
5372 -1729 3924 -2743 -3611 -1500 413 8426 7175 7467 2864 -2420 -3689 1699 3780 2210 7922
5357 7922 583 1693 8658 7798 6415 3158 -4252 -4981 2196 9721 12732 9638 7859 2654 -5060
5342 -5060 -8846 -1381 6561 12635 18963 16189 5004 -6186 -14983 -15076 -10703 -6292 -4468 -10776 -10213
5327 -10213 -16415 -16028 -13848 -12466 -1193 3775 -6271 -6766 5600 1645 -6242 -3071 -2820 2326 12650
5312 12650 8025 -4167 -270 13097 15478 1321 -2841 -1126 -444 13813 11502 9236 10274 9630
5298 9630 7418 11479 13127 9613 9690 10190 18190 17597 14214 13211 6267 2993 -2184 -13464 -23047 -17390
5282 -17390 -5414 4639 7 -716 6228 4118 -6793 -14211 -11436 -3792 -8184 -4325 7305 3299
5268 3299 -639 -8561 -8827 -7550 -5693 -5458 -7506 -3964 -5932 1169 -4092 -8453 -9161 835 2070 -5542
5252 -5542 -8708 521 12684 10106 6242 2091 -12309 -26516 -22699 -13141 -8760 -9422 -19497 -22972
5238 -22972 -16047 -7545 -10486 -9342 -2499 3815 12101 6334 3245 13621 14512 7899 -153 -5290 -11192
5223 -11192 -7065 -2636 -3115 -4391 -11137 -19978 -12453 -11423 -6698 -6910 -8253 -14424 -17860 -10344 -7833
5208 -7833 1882 1253 -9723 -15961 -16437 -20725 -21227 -15261 -7104 -6936 -6856 3403 7729 5421 4321 6296
5192 6296 8994 3959 -2053 1353 6709 8832 11334 9199 3197 -4902 983 5158 5172 268 -2194
5177 -2194 -2994 -585 -5320 -9447 -14084 -10464 -9760 -14764 -14941 -8247 -7457 -2404 -6695 -9964 -15665 -22427
5161 -22427 -23856 -17965 -8427 -1179 -6841 -2549 8820 15111 16518 9812 2996 -6226 -7937 -6528
5147 -6528 -8470 -6365 -8187 -8404 -9643 -14159 -9127 -4429 -502 2023 5577 -1460 2885 10627 7511
5132 7511 11779 13962 17646 10632 15031 18250 7792 -9607 -6757 -6398 -1948 -6483 -11025 -10839 -15707
5117 -15707 -4646 11140 10807 8735 5787 -143 -5304 -6660 -14945 -20322 -14539 -13592 -9426 -3246 823
5102 823 1830 -4912 -16330 -12469 -12340 -19959 -14662 -1629 12515 5321 -613 5121 -3769 -5576 2949
5087 2949 7434 8434 8189 3196 311 -4621 -4040 -6325 -11307 -14940 -13151 -20090 -16694 -14018 -11063
5072 -11063 -2693 -6613 -7138 -7612 -11270 -11352 -8218 -7620 -8428 -1850 -2154 -5091 -6138 -5472 -5726 -9267 -14173
5055 -14173 -7912 -2839 -1722 -8926 -13998 -7552 -4865 -8425 -9361 -10679 -3463 -2321 -5895 -5270 -4263
5040 -4263 -4843 -7436 -8346 -17269 -26388 -15272 -3988 1185 -4439 -3307 -3782 176 5491 17479 19580
5025 19580 11951 8910 4784 -840 -3156 8255 7111 3964 -598 -3323 -526 2701 8441 7239
5011 7239 3785 3306 1858 2250 -3788 90 -2565 -7265 -5021 -4737 -4425 4060 9283 5539 10446 12597
4995 12597 6312 8973 10524 5994 11653 15016 4524 514 4723 2967 983 4044 4221 -2080 2472
4980 2472 5961 -622 -1792 -150 -10265 -14358 -11853 -16950 -10962 -5289 1233 10616 15851 13549 3939
4965 3939 -1836 -10122 -12112 -4814 -2883 -4422 -2159 12328 21230 6441 -7988 -12431 2827 6321
4951 6321 7131 9617 3772 969 -1313 2739 -1431 1921 5955 8748 9950 8819 2833 -4297 -4435
4936 -4435 -10782 -6432 -1946 -1068 -6785 -4721 -1863 -5813 -6935 -2111 2124 -2108 -2422 -9423 -13665
4921 -13665 -7092 -3443 -7929 -3435 6146 2268 -7472 -11376 -13837 -13040 -7874 -7873 -6740 -2070 3142 -2822
4905 -2822 -3784 2522 9307 160 -11831 -16217 -14474 -17735 -10937 -19012 -20245 -11370 -4331 -3202 2021
4890 2021 10522 19270 10354 2356 1042 -8523 -15125 -11942 -6553 4187 15580 22385 24574 14078
4876 14078 4259 -8640 -14019 -10083 -14270 -19640 -20319 -15411 -6187 -5740 -13553 -23515 -20066 -8830 -5993
4861 -5993 -7615 -4994 -3587 -4559 -2122 -1821 3041 -477 -4268 -2306 -4007 -6302 1220 7283 10461
4846 10461 1300 -9351 -7798 -15398 -28241 -25157 -15624 -13577 -12822 -5481 3172 9103 18831 22005
4832 22005 21695 20775 13108 -1967 3933 7702 3759 2821 -433 2402 -2662 8254 14080 15369 17107
4817 17107 17991 15908 3157 8826 18231 15590 10886 10026 9459 4570 6225 6177 11699 13364 5556 -6266
4801 -6266 -16703 -16676 -9269 -6967 -8413 -7754 -2156 3374 6945 11886 2013 1285 -724 -1703 -11463 -12961
4785 -12961 2017 14658 9973 5453 4034 11160 3967 -3754 1587 5637 -4130 -10020 -6352 8849
4771 8849 6113 -7060 -13139 -16210 -16456 -1478 -14 -9916 -7563 -10069 -16042 -10414 -3697 4171 5427
4756 5427 7005 2688 -2056 -10217 -11155 -7880 -2028 4047 965 -851 1883 -7511 -11758 -5114 1454
4741 1454 3906 143 -1439 4393 7804 -13860 -8790 -2567 -11030 -7586 1631 6732 5665 -5672
4727 -5672 -6780 997 -9556 -10342 -8210 -1002 990 1203 1801 5820 8456 2409 4049 8908 2157
4712 2157 2487 5896 10523 -125 -9 8765 14203 11035 13839 18370 22857 27205 19644 13192 13484
4697 13484 21253 15259 10741 3470 1299 9129 9028 7018 -2980 -863 7816 5180 -238 -11415 -19002
4682 -19002 -20203 -11098 -11423 -4810 -5344 4843 13561 4484 -4332 4620 13555 7135 2841 -2410 -4843
4667 -4843 -2488 956 3420 -1832 -17994 -17012 -11400 -21356 -19994 -16383 243 6943 -3930 -13783
4653 -13783 -10290 4240 5855 4470 -1063 119 4428 -2402 -6626 -3798 1249 -5500 -12521 -2772
4639 -2772 -1658 -4216 1798 745 4358 4520 -6729 7410 12441 13592 9770 -5547 -6435 -3768 -7537
4624 -7537 -4797 6706 15638 7341 -4598 -4041 -4953 -10608 -3844 716 -2077 -5670 -7424 -8857 -12299
4609 -12299 -4915 3481 2580 -1618 -3531 249 -1607 -1180 -6043 -822 -1877 4477 7225 1444 3364
4594 3364 4983 1113 5082 3015 -5997 -831 12568 18331 14661 5197 8114 6167 140 6133 18485
4579 18485 16214 8691 1793 8480 15803 13521 93 -5344 -2069 4761 17212 10089 905 -5588
4565 -5588 -9079 -3048 4421 11426 7253 -5991 -3762 -5937 -5188 2728 11899 15569 16943 12067 10854
4550 10854 15281 14176 16784 8968 3723 -24 -10656 -907 -1770 -14374 -5394 6191 7606 2988
4536 2988 -4351 -13635 -10155 -2680 2314 -3276 -7532 -9577 -7546 -1361 -1411 -1810 -2118 1665 1372 -3362
4520 -3362 -10850 -14139 -11679 -1842 -308 -2554 -1880 -826 -7091 -4715 7315 1260 1228 9098 56
4505 56 9405 20593 20448 12249 7427 10943 14900 9958 8456 3801 7115 -4631 -7254 -8302 -4193
4490 -4193 9716 20035 16504 -1171 -7092 -4666 -6378 -5095 -2876 5173 -405 -5418 -11215 -13039
4476 -13039 -10171 -3726 3412 124 -1685 -10788 -8741 -456 3434 -390 -8132 -6273 -766 6017 1275
4461 1275 -8518 -7745 -2782 1404 8580 12631 5663 -11575 -6794 -4173 922 1762 1048 9503 11267
4446 11267 9019 8584 7507 3669 5642 -1825 -2183 -7253 1162 8327 1900 1974 3212 -3159 -10397 -3746
4430 -3746 2987 5224 1201 6465 12950 13429 7863 -11070 -25125 -21160 -16763 -10967 -5067 -5863 -5903
4415 -5903 1046 9070 9842 13257 13672 5299 7163 12851 16576 7351 -2745 1411 912 -2077 4711
4400 4711 -2482 -2947 -8573 -3979 -105 -9613 -14289 -15277 -4902 -6834 -8354 -7274 765 4846 1691
4385 1691 -7085 2872 -2413 -7912 -3282 3415 495 -1043 5279 5860 13355 13716 16049 10458 3035
4370 3035 10006 7904 13665 2379 -1344 5034 -4243 -11752 -10609 -10455 3370 12460 4382 1668 4321
4355 4321 3594 -830 1178 8716 10080 26680 30028 18045 12489 16516 12896 15159 19178 20865 23354
4340 23354 17423 27605 23290 13918 11167 14689 23593 25644 23530 16029 9632 9986 10849 3464 5446
4325 5446 -3100 -2183 -2079 1286 -88 -1203 -4924 -10939 -23150 -17760 -7567 -9518 -2852 2098 2936
4310 2936 2300 7715 5775 10891 15329 7320 -7998 -16468 -9349 -528 8355 7177 2538 -50 -1076
4295 -1076 2996 6646 20921 18055 9098 2215 5675 9100 3742 1474 -1527 -6601 -10712 -8453 1449
4280 1449 1448 -390 -5444 -4156 1185 13 -1527 -7321 -9666 -12074 -17680 -17291 -12719 -7225 -544 -5304
4264 -5304 -11838 -7028 3034 -2025 -8396 -9779 -7697 -438 -2740 5621 14615 14405 7183 1159 2464
4249 2464 847 2014 7156 9964 3098 -560 -857 -7211 -9770 -14746 -9148 -2852 7279 7996 11896
4234 11896 10527 6788 6362 8488 19036 14767 4826 -1872 11261 17161 12854 3629 -2571 -7239
4220 -7239 -6454 6352 16918 9746 15091 14684 3489 4428 3368 -2787 3988 14604 15125 20398 26153
4205 26153 27075 25728 22563 13427 1400 -1016 12202 13136 5162 -2007 -9018 -9290 662 -3038 -4705
4190 -4705 -227 11233 10298 13277 -3766 -12519 -1183 4452 5486 9033 6103 2097 146 -2 7827
4175 7827 1528 -6230 -3453 -8214 -13003 -12993 -7508 -1102 -6406 -14696 -11786 -4343 -3463 -18754 -23526
4160 -23526 -15878 -12239 -7681 -5708 -9656 -5650 1448 -85 1711 2642 7331 10812 1508 2403 18180
4145 18180 15050 15480 15049 12286 7127 -2389 -422 2105 17675 20522 10589 2439 -3200 -8168 -5407
4130 -5407 3098 6331 8809 2659 -8763 -16364 -17598 -20909 -15370 -9562 -7232 1544 4112 -1559 -7139
4115 -7139 -5578 250 6287 1619 -2467 -7662 -605 -7554 -9452 -1830 -2129 -475 1057 4498 1658
4100 1658 -176 -2024 -5978 -5702 685 2966 895 6072 6297 -1459 834 -5007 -9733 -7812 -309
4085 -309 910 -5413 -2038 -1308 5469 14535 13451 13166 9889 6254 -1676 -9096 -11899 -14495 -10804 -15227
4069 -15227 -18335 -9280 -4714 -1272 2256 -1664 -1734 44 7217 1105 -8757 -5021 4080 8867 19142
4054 19142 21822 17075 16402 10724 13601 23213 11504 -2490 -3220 -4478 -12834 -10733 -8101 -8425 -8971
4039 -8971 -18258 -17455 -9304 3315 11736 10240 -8396 -7314 -1439 7614 10584 -1323 -1634 2108 -2749
4024 -2749 4914 17425 21104 16355 7637 -2974 -2721 -1665 -1960 -3688 2962 8151 3037 2052 8379
4009 8379 14082 13676 3504 2642 13431 12294 8206 -2230 -14534 -16136 -13732 -8581 -5419 272
3995 272 9929 4989 2258 -8594 -18412 -9611 3020 5903 9720 12415 10514 16002 18069 16359 9909
3980 9909 2556 7188 6988 11501 1224 1687 4230 3123 -1904 -7337 -18154 -10987 2220 3111 -9073
3965 -9073 -3709 -2689 -10059 -12304 -2542 -2018 -4346 8117 11843 -568 -832 4412 6566 5387 4079
3950 4079 7476 13100 6462 -2736 1198 9770 16023 20499 23160 17353 16144 17827 16853 13427 1924
3935 1924 -3411 -8741 -18663 -14084 -1182 2747 3880 1243 -932 -9931 -12065 -12451 -9238 -5622 -1865
3920 -1865 -4888 -3977 9654 11101 433 -2194 385 3751 15108 12125 5789 -2996 262 23 -4706
3905 -4706 -2040 1962 223 3405 1047 1497 8099 9652 5403 457 811 20072 15866 8074 2260
3890 2260 4531 4029 4513 5774 9401 19197 24738 8609 -3476 3105 12474 12249 1193 -1159 763
3875 763 -4499 -13552 -14726 -7501 -13054 -3049 -4758 3677 5140 4186 1853 2463 3279 5835 5561 -6097
3859 -6097 -14151 -19093 -12294 -2299 2614 2464 2509 7233 5552 78 -9448 -12309 -9507 8216 14812
3844 14812 9846 7242 2930 8143 9831 14830 10286 1433 5546 10093 3720 2433 7902 11751 10378
3829 10378 8707 2670 5466 11271 9907 832 -968 -4461 -3848 8848 16304 13312 5868 677 -327
3814 -327 2607 9127 11747 7345 7115 7667 1248 -10334 -10016 -5315 3836 -336 -4120 -8164 -3881 -5747
3798 -5747 -10888 -12449 -13183 -12577 -3141 2796 -4498 -4834 -3933 3782 14236 515 -2307 3058 -3568
3783 -3568 -4158 8423 12300 8829 14796 11290 -3953 -8008 -5788 27 -3171 -9379 -11613 -3950 5817
3768 5817 -3583 -4673 -2667 -5887 141 5910 10132 -805 -529 -3560 -10346 -16490 -8837 -7025 -11411
3753 -11411 -11343 -10129 2574 8174 4742 -3406 -10461 -6442 2913 12029 7107 1246 674 4653 -1049
3738 -1049 -3172 -9360 -5919 -13404 -4545 4424 2993 3775 8684 2502 -2938 -5219 -8326 -15618 -18301
3723 -18301 -15491 -13776 -17169 -17820 -15767 -13431 -17990 -25916 -24632 -15640 4276 9515 1694 -8850
3709 -8850 -7045 -318 4809 12079 18227 10457 -7195 -8133 4165 7669 5185 626 -428 5686 10820
3694 10820 9974 6828 1599 377 10192 19551 18206 10067 2146 -2462 -903 -2591 -3760 -11067 -21726
3679 -21726 -15180 -6487 -1470 7803 5693 2243 2239 -9917 -10113 3508 11081 9359 5876 -1451 -16325
3664 -16325 -12687 -5093 -5405 -5024 -5988 -11163 -11097 -11580 -13500 -8380 2900 12594 10097 8646 2150 -10377
3648 -10377 -18325 -17024 -14487 -11101 -4986 -5658 -16636 -15456 -15976 -9059 -165 9443 7864 -1171 -3444
3633 -3444 -2039 2282 10398 10772 10621 12508 17722 10745 18354 21805 8703 2730 -8326 -9426 1223
3618 1223 6228 6701 10041 15329 5723 4008 5786 5892 7569 3344 714 -11766 -5641 -1050 -1127 -6170
3602 -6170 -19886 -14929 -10510 -7866 -585 3575 10452 5851 12149 14902 14886 12986 10232 6892 10083
3587 10083 17504 18748 25880 21614 7227 2550 4237 17642 15296 12381 13801 7032 7228 7808 135
3572 135 -6589 -3862 -10080 -13954 -7514 -5410 -14162 -17704 -15728 -9604 -3992 -6189 -7445 -12180 -11220
3557 -11220 2459 13088 6127 3225 2047 -1294 -5804 2277 8267 4880 3271 7099 64 -4146
3543 -4146 -1049 526 -1163 5001 4142 -207 3939 11258 17716 15180 9096 7287 6873 1054 -9079
3528 -9079 -11255 -4438 8803 8097 5713 14008 18226 16494 6385 8530 7268 1638 -4268 -10785 -15612
3513 -15612 -11707 -3808 -4024 -397 3817 13677 25412 26532 24073 23228 25535 28256 26356 22422 12981
3498 12981 2666 -1531 -4756 -1903 -8313 -4489 31 544 3081 8400 17102 11985 14436 12423 7108
3483 7108 2880 -5319 -2521 -1256 -6100 -11734 -14513 -11919 -2866 458 2570 -3942 -10255 -1649 1147
3468 1147 -3458 -3847 -201 -1474 3078 10727 14409 11493 17208 11390 10104 7755 4922 1499 11980
3453 11980 17988 9434 -4904 -7770 -3279 -4292 -9195 -4562 -9442 -13830 -4735 2683 11376 10735 1273
3438 1273 2012 -8042 -7429 -2791 4355 5801 10523 11728 5544 3898 6241 12803 15803 11075 -4551
3423 -4551 -22480 -17222 -8011 -3760 -998 1562 2300 1605 -4008 -5159 6991 18112 19722 18073 17415
3408 17415 9906 5508 10575 8241 5997 1899 4823 12455 5301 -1782 1081 4836 3143 1189 3520
3393 3520 3236 -2032 -12752 -11934 -4608 1416 -28 3400 4918 -233 -2599 1623 9891 5631 -1639
3378 -1639 -3073 -4308 -5562 3408 5671 -9768 -16672 -9301 4577 14328 14315 15047 8569 -2094 -493
3363 -493 4318 9374 18162 33175 28337 24375 20713 11617 6674 11526 5525 2422 -699 2430 4826
3348 4826 -9877 -16346 -7379 -3527 -8931 -13521 -14173 -13221 -14582 -12437 -4514 -1162 4763 3339 7882
3333 7882 2823 2431 -568 5810 -580 -4538 2908 4201 5390 13892 19348 19214 9407 6803 17824
3318 17824 10827 3838 -294 499 10891 7386 5752 -6766 -3988 -75 3324 10522 12061 11721 -458
3303 -458 -4541 -4030 -4229 -6598 240 -3837 -1988 465 773 672 1525 4581 3231 -1989 1195 -7419
3287 -7419 -6463 -11269 1788 13487 9956 6928 2291 6812 11314 10404 -2429 370 1923 -2263 -4385
3272 -4385 3405 6795 -291 5009 2724 6094 10697 6495 -7614 -7753 -3416 3990 -2281 -5615 -2744
3257 -2744 3398 8407 9322 8952 8055 2183 4764 18455 22217 13204 6195 -576 -4295 -4504 -4481 -5742
3241 -5742 -11362 -19557 -21354 -13393 -4456 -2054 -3947 2935 5001 7429 8376 11203 14079 4561 908
3226 908 -6373 -5780 -5305 1565 -1164 -8590 -5839 -2108 5149 14191 16573 8835 9933 15585 17168 7875
3210 7875 -6069 -5812 -1500 3622 4838 -3115 -1519 -10978 -11956 -10663 5074 10394 8111 14536 14085
3195 14085 5276 -1641 -4573 -9715 -13072 -12177 -7476 -2224 3369 1132 -3491 -9501 -10473 -12678 -12674 -2270
3179 -2270 8689 10993 16974 12436 6027 1801 -4384 -7117 -3600 -4748 146 3642 2976 1399 1017
3164 1017 -87 3615 8935 13306 17006 24624 22400 25609 26697 20190 8131 -1094 941 -2832 -1456
3149 -1456 6369 6281 9919 11029 13431 15174 20130 11197 -3185 -14341 -9504 -3189 -3358 -766 -8551
3134 -8551 -16451 -10530 -4823 1961 -3835 -2230 1945 -10357 -18647 -17408 -13435 -2299 -526 -956 -2247
3119 -2247 -8413 -4077 3221 10276 3495 -3035 -951 3758 6484 8902 6142 1825 4748 9942 11260
3104 11260 6260 5681 19796 24141 17638 2211 -2383 12408 18212 10430 -1626 -6969 6860 13636
3090 13636 9016 12091 15988 26581 26859 12643 5838 11406 10743 9579 10961 5350 10590 13068 10488
3075 10488 2790 -3481 -1640 -4259 1388 4790 -475 857 3182 5258 15732 11896 1885 5536
3061 5536 15070 15053 16862 14157 17944 26488 14771 7215 14555 9496 7046 12413 10051 12339 11096
3046 11096 13140 21775 14631 1653 -1319 -4180 6089 9474 11084 8909 11098 6033 10991 17641
3032 17641 20137 13516 13389 18079 17700 13026 16503 12786 7558 9800 -2115 -10991 -14592 -19383 -10344
3017 -10344 2224 5460 2515 1184 3865 9678 8276 5492 7122 10011 14579 10826 7882 -4208
3003 -4208 -2149 5652 1558 -851 -4846 -12191 -15078 -13425 -8511 5822 8987 8418 4467 5473 5955
2988 5955 15293 9698 8279 7450 5339 7255 6876 1165 2962 6516 12833 2370 1606 1903 -1155 -1285
2972 -1285 2544 9374 11315 6697 6003 7083 3081 -1497 3858 2801 4248 8998 4526 2243 1753
2957 1753 3754 8259 9752 5062 2387 6545 8732 7283 14003 13726 9944 10677 7746 12974 17296
2942 17296 7886 3874 11556 9862 7272 -449 2746 7336 14283 17997 19238 18034 12527 10272 10449
2927 10449 6161 12060 17426 7534 -7337 2978 4323 -26 11777 21396 9295 -798 6366
2914 6366 15754 29175 29162 18424 5001 13679 23631 19556 7117 -514 -3002 821 10035 9213 2167
2899 2167 -2548 -8671 -8663 -3365 2025 9389 11385 10475 -1623 -12370 -10050 1309 7006 11644 8476
2884 8476 1924 -4406 -1614 -4815 -3556 -10343 -12252 -7910 -7638 -5673 -3631 1764 3497 -1781 2196
2869 2196 5081 2175 12128 14378 10379 10299 7739 1510 -3714 7187 5362 422 9279 6326 10257
2854 10257 10735 5757 3881 6476 10089 11569 8887 7910 7480 -3788 4658 10559 7208 1457 -783
2839 -783 3060 15642 22469 7442 5469 4334 2143 -2416 6448 13522 13671 14453 6830 9343 8714
2824 8714 9954 7173 -1714 2401 -899 96 4135 1202 -1935 -3436 -11877 -18897 -21273 -14953 -15754
2809 -15754 -9955 -5067 302 -5673 -5560 -5862 -9009 -13112 -9313 -7969 122 -6772 -8896 -1509 2343
2794 2343 6169 5432 3446 -1684 -1247 -1399 -13906 -22060 -13047 2608 7078 9789 2899 -1542 1728
2779 1728 12652 12077 6904 161 -297 7442 6024 1280 -922 11106 9780 902 8994 11993 12791
2764 12791 13885 -5222 -18029 -16191 -16063 -10562 -1652 2544 -1847 -9377 -8199 -2783 4833 -63
2750 -63 1117 -574 5871 15444 15696 10336 22054 12020 7764 3545 -4551 -7014 -2899 1162 6126
2735 6126 -5201 -7542 -931 -3261 833 11706 17466 18563 12533 5594 2942 4449 7964 5719
2721 5719 -429 -3933 -8580 -11941 -4244 1463 9314 11374 13122 10089 3249 8340 5120 6471 12505
2706 12505 14738 12444 -10 -3744 -2283 -8472 -1094 3628 8103 4004 -1229 -5020 -8587 -1547
2692 -1547 4664 5969 7936 7065 6556 9677 15414 10801 9017 11514 7771 7712 10362 3348 -4942 5634
2676 5634 15513 20077 18820 19151 8707 4447 2339 10580 8670 -1841 -8065 -2757 2958 7671 2636
2661 2636 9321 23259 21152 10026 3929 7568 12426 12022 13034 17907 11682 6403 16697 13341
2647 13341 8465 10304 10685 9454 2805 1487 -904 863 15814 12942 9501 13770 8173 5081 9593
2632 9593 12088 10344 12192 9749 -187 608 6763 10040 8474 1769 900 10448 10712 9528 16655 18416
2616 18416 4380 -976 3772 8196 13749 20128 19184 6647 -2791 843 6764 15222 6989 586
2602 586 1439 10180 13374 14559 17582 17277 4777 6 5630 6493 5853 1192 4266 8942 16386 15171
2586 15171 11956 11318 7723 -1057 -1713 -357 -8414 -13037 -19710 -13746 -5992 7272 10982 3365 -4612
2571 -4612 -10125 -5861 603 6862 8912 6671 2731 -4760 -3579 -2709 -2217 1236 2122 -721 -1196 3899
2555 3899 11524 1210 -13745 -14224 -6511 -125 4523 4407 12530 14433 -1722 -2023 -2242 1927 -523
2540 -523 -8989 -6740 -12482 -6546 1941 -4122 -4959 6145 13489 17092 12450 5232 -3168 -2842 -5933
2525 -5933 -6219 -1120 5659 -1635 -608 10381 8159 4113 357 -6543 -2172 1805 5816 -445 -767
2510 -767 5004 7851 8444 11323 7250 9033 5594 739 7085 14271 16930 6012 -5093 -351 13493
2495 13493 15270 11784 14045 7043 1931 5338 6689 -4061 -1786 6772 10149 6217 9661 17218
2481 17218 13281 15799 11671 14 675 -2108 -9984 -11118 -60 -4741 7041 13811 8011 12943
2467 12943 4694 1336 1395 2449 1403 -3589 -3005 -4022 -10843 -12843 -7902 3665 16583 12151 13664
2452 13664 12104 7638 6198 7256 10671 18877 13927 8745 11956 16511 6699 -6125 -8702 10087
2438 10087 16757 13760 -1359 -8551 -5492 -963 -861 4193 16087 7100 2961 5597 9060 11189
2424 11189 7550 5211 9276 11006 11141 12502 12936 15203 13800 5943 14048 18733 14148 12703 9448
2409 9448 7648 7201 14916 13785 17952 16448 12104 3490 15502 16793 3274 -1120 -2163 -8072 -4364
2394 -4364 -10317 -11222 -10617 -3621 5764 11544 12537 -1808 -6249 -9811 -12676 -9872 -6389 -3022 -3722 -6952
2378 -6952 391 5816 9321 7593 2201 2046 4433 3407 16912 16153 12326 15307 16458 20770 16310
2363 16310 14405 12350 17631 19763 9629 3449 -5176 -14178 -12137 -11737 -4622 -5954 -15374 -3295
2349 -3295 1916 2886 568 1591 -2837 -3673 -4261 -306 6566 8098 10434 4792 -3722 6900 207
2334 207 -3395 5904 3841 7314 11679 14688 7427 9440 3902 2890 10216 10229 14089 17011 10560 -2671
2318 -2671 -10219 -7814 -4263 -8031 -2727 3254 2379 7364 6202 2241 -1394 3489 -2530 -3538 -269
2303 -269 -6410 -7986 2783 -4360 -2853 31 5954 6562 2361 10977 9054 4451 7134 11243 3708
2288 3708 -6305 -6148 -9051 -8078 -7828 -4280 -3061 -1725 -8476 -15333 -17809 -10907 -10314 -11187 -5299 -397
2272 -397 -1457 5194 12610 15708 15458 9465 2135 -5306 1337 8235 7353 1968 -3028 -5087 -14924 -8735
2256 -8735 -7684 -11123 -8134 -619 530 -11615 -1148 -5330 -8855 -2985 -3791 -8797 -6277 -4925 -3863
2241 -3863 -10555 -10196 -11144 -13184 -2585 -2713 -1459 8808 16248 10790 184 -1944 -4024 565 -8210
2226 -8210 -12226 -6213 -967 4288 -849 -6072 -3054 -401 -3888 -2000 -8279 -272 7418 3630 -3782
2211 -3782 -5033 -540 -4761 -12829 -8198 -232 6721 6963 17389 8240 5233 -2985 -14790 -12433 716
2196 716 10000 5655 -5943 -17158 -15438 -686 10790 15284 15846 3283 -4103 4724 3521 1532
2182 1532 -5512 3684 14403 10124 5139 -5378 -10751 -13169 -15105 -15530 -18075 -18671 -15189 -289 10518
2167 10518 15694 14225 11117 7512 6713 9857 10062 8733 2904 -6717 -10357 -484 -6034 -9531 -1228
2152 -1228 4907 -1759 -1411 553 -3504 -5806 -3140 3445 4588 -3483 -10372 -21053 -17995 -11151 -6545
2137 -6545 565 -6330 -12061 -13774 -5135 -2823 -645 -1554 -2443 -4784 -2648 -8915 -6815 430 4899
2122 4899 557 2661 5554 13299 11420 2018 -659 4257 8624 -1859 -10865 -9483 -9109 -928 -3362
2107 -3362 4358 5890 12730 20942 12363 11200 10156 370 1325 -904 -6788 2324 15963 15887 15172 12334
2091 12334 7734 1757 -1839 -12648 -19447 -17768 -11004 -11507 -11419 4810 3138 -5668 -5480 -4654 1464
2076 1464 -4019 -4044 3401 12634 9024 8336 2584 -547 492 1341 11925 11135 1126 2891 10461 13107
$$ [...]
##END NTUPLES=NMR SPECTRUM
##END=
