##TITLE=Analysis number 323164
Compound Code mo 07925
Project Code adrs
Chemist Name endeavour
##JCAMPDX= 6.0         $$ Bruker NMR JCAMP-DX V2.0
##DATA TYPE= NMR SPECTRUM
##DATA CLASS= NTUPLES
##ORIGIN= Bruker BioSpin GmbH
##OWNER= nmr
$$ XWIN-NMR		Version 3.5
$$ Tue Oct 17 19:11:36 2006 GMT Daylight Time (UT+1h)  MAYBRIDGE\nmr@NMR_250MHZ
##.OBSERVE FREQUENCY= 250.131544655141
##.OBSERVE NUCLEUS= ^1H
##.ACQUISITION MODE= SIMULTANEOUS (DQD)
##.ACQUISITION SCHEME= undefined
##.AVERAGES= 16
##.DIGITISER RES= 18
##SPECTROMETER/DATA SYSTEM= dpx250
##.PULSE SEQUENCE= zg30
##.SOLVENT NAME= DMSO
##.SHIFT REFERENCE= (INTERNAL, DMSO, 0, 16.522)
##AUDIT TRAIL= $$ (NUMBER, WHEN, WHO, WHERE, WHAT)
$$ ##TITLE= Audit trail, XWIN-NMR		Version 3.5
$$ ##JCAMPDX= 5.01
$$ ##ORIGIN= Bruker BioSpin GmbH
$$ ##OWNER= nmr
$$ C:\u/data/dgb/nmr/ADRS/770/pdata/1/auditp.txt
$$ ##AUDIT TRAIL=  $$ (NUMBER, WHEN, WHO, WHERE, WHAT)
(   1,<2006-10-17 19:11:15.01 +100>,<MAYBRIDGE\nmr>,<NMR_250MHZ>,
      <created by zg, POWCHK disabled, PULCHK disabled
       configuration hash MD5:
       49 4B E0 1D 92 C2 6B 37 9F E6 65 BC 52 41 86 1D
       data hash MD5: 64K
       15 7E B8 B0 BD 96 76 E8 E1 9D 4B D6 E2 85 17 D9>)
(   2,<2006-10-17 19:11:27.87 +100>,<MAYBRIDGE\nmr>,<NMR_250MHZ>,
      <Start of raw data processing
       ef LB = 0.3 FT_mod = 6 PKNL = 1 SI = 32K 
       data hash MD5: 32K
       D5 F6 7F B5 37 FC 3E 0A D4 12 0B 25 F7 7C BE BC>)
(   3,<2006-10-17 19:11:29.56 +100>,<MAYBRIDGE\nmr>,<NMR_250MHZ>,
      <apk 
       data hash MD5: 32K
       41 15 EA 0F E2 FD 88 EA 16 15 A0 65 96 E3 26 60>)
(   4,<2006-10-17 19:11:30.37 +100>,<MAYBRIDGE\nmr>,<NMR_250MHZ>,
      <abs ABSG = 5 
       data hash MD5: 32K
       1C 59 86 92 46 10 13 1B 90 90 54 C2 30 8E 6D DA>)
$$ ##END=
$$ 
$$ hash MD5
$$ 7D 3C 65 F4 8A 15 10 55 FA 03 BE D6 AC B8 6D B0
##$RELAX= 
##$RELAX= 
##$RELAX= 
##$RELAX= 
##$RELAX= 
##$RELAX= 
##$RELAX= 
$$ Bruker specific parameters
$$ --------------------------
##$DU= <C:\u>
##$EXPNO= 770
##$NAME= <ADRS>
##$PROCNO= 1
##$TYPE= <nmr>
##$USER= <dgb>
##$AMP= (0..31)
100 100 100 100 100 100 100 100 100 100 100 100 100 100 100 100 100 100 
100 100 100 100 100 100 100 100 100 100 100 100 100 100 
##$AQSEQ= 0
##$AQ_mod= 3
##$AUNM= <au_zg>
##$AUTOPOS= <25 >
##$BF1= 250.13
##$BF2= 250.13
##$BF3= 250.13
##$BF4= 250.13
##$BF5= 500.13
##$BF6= 500.13
##$BF7= 500.13
##$BF8= 500.13
##$BYTORDA= 1
##$CFDGTYP= 0
##$CFRGTYP= 5
##$CHEMSTR= <none>
##$CNST= (0..31)
1 1 145 1 1 1 1 1 1 1 1 1 1 1 1 1 1 1 1 1 1 1 1 1 1 1 1 1 1 1 1 1 
##$CPDPRG= <>
##$CPDPRG1= <>
##$CPDPRG2= <>
##$CPDPRG3= <>
##$CPDPRG4= <mlev>
##$CPDPRG5= <mlev>
##$CPDPRG6= <mlev>
##$CPDPRG7= <mlev>
##$CPDPRG8= <mlev>
##$CPDPRGB= <>
##$CPDPRGT= <>
##$D= (0..31)
0 1 0 0 0 0 0 0 0 0.06 0 0 0 0 0 0 0.0002 0 0 0 0 0 0 0 0 0 0 0 0 0 0 
0 
##$DATE= 1161108673
##$DBL= (0..7)
120 120 120 120 120 120 120 120 
##$DBP= (0..7)
150 150 150 150 150 150 150 150 
##$DBP07= 0
##$DBPNAM0= <>
##$DBPNAM1= <>
##$DBPNAM2= <>
$$ [...]
##$SUBNAM7= <"">
##$SUBNAM8= <"">
##$SUBNAM9= <"">
##$SW= 20.6930455092707
##$SWIBOX= (0..15)
0 0 3 0 0 0 0 0 0 0 0 0 0 0 0 0 
##$SW_h= 5175.983436853
##$TD= 65536
##$TD0= 1
##$TE= 683.16
##$TE2= 300
##$TE3= 300
##$TEG= 300
##$TL= (0..7)
0 120 120 120 120 120 120 120 
##$TP= (0..7)
150 150 150 150 150 150 150 150 
##$TP07= 0
##$TPNAME0= <>
##$TPNAME1= <>
##$TPNAME2= <>
##$TPNAME3= <>
##$TPNAME4= <>
##$TPNAME5= <>
##$TPNAME6= <>
##$TPNAME7= <>
##$TPOAL= (0..7)
0.5 0.5 0.5 0.5 0.5 0.5 0.5 0.5 
##$TPOFFS= (0..7)
0 0 0 0 0 0 0 0 
##$TUNHIN= 0
##$TUNHOUT= 0
##$TUNXOUT= 0
##$USERA1= <user>
##$USERA2= <user>
##$USERA3= <user>
##$USERA4= <user>
##$USERA5= <user>
##$V9= 5
##$VALIST= <valist>
##$VCLIST= <CCCCCCCCCCCCCCC>
##$VD= 0
##$VDLIST= <DDDDDDDDDDDDDDD>
##$VPLIST= <PPPPPPPPPPPPPPP>
##$VTLIST= <TTTTTTTTTTTTTTT>
##$WBST= 1024
##$WBSW= 4
##$XGAIN= (0..3)
0 0 0 0 
##$XL= 0
##$YL= 0
##$YMAX_a= 438781
##$YMIN_a= -450871
##$ZGOPTNS= <>
##$ZL1= 120
##$ZL2= 120
##$ZL3= 120
##$ZL4= 120
##$ABSF1= 16.522
##$ABSF2= -4.171173
##$ABSG= 5
##$ABSL= 3
##$ALPHA= 0
##$AQORDER= 0
##$ASSFAC= 0
##$ASSFACI= 0
##$ASSFACX= 0
##$ASSWID= 0
##$AUNMP= <proc_1d>
##$AZFE= 0.1
##$AZFW= 0.1
##$BCFW= 0
##$BC_mod= 0
##$BYTORDP= 0
##$COROFFS= 0
##$CY= 12.5
##$DATMOD= 1
##$DC= 0
##$DFILT= <>
##$DTYPP= 0
##$F1P= 14.0000005364418
##$F2P= -0.99999901652339
##$FCOR= 0.5
##$FTSIZE= 32768
##$FT_mod= 6
##$GAMMA= 0
##$GB= 0
##$INTBC= 1
##$INTSCL= 1
##$ISEN= 128
##$LB= 0.3
##$LEV0= 0
##$LPBIN= 0
##$MAXI= 10000
##$MC2= 0
##$MEAN= 0
##$ME_mod= 0
##$MI= 0
##$NCOEF= 0
##$NC_proc= -3
##$NLEV= 6
##$NOISF1= 0
##$NOISF2= 0
##$NSP= 0
##$NTH_PI= 0
##$NZP= 0
##$OFFSET= 16.522
##$PC= 1
##$PHC0= -55.49038
##$PHC1= 1.444117
##$PH_mod= 1
##$PKNL= yes
##$PPARMOD= 0
##$PSCAL= 4
##$PSIGN= 0
##$REVERSE= no
##$SF= 250.13
##$SI= 32768
##$SIGF1= 0
##$SIGF2= 0
##$SINO= 400
##$SIOLD= 32768
##$SREGLST= <1H.DMSO>
##$SSB= 0
##$STSI= 32768
##$STSR= 0
##$SW_p= 5175.98343685301
##$SYMM= 0
##$S_DEV= 0
##$TDeff= 65536
##$TDoff= 0
##$TI= <Analysis number 999999
Compound Code 99
Book Reference 9
Project Code 9>
##$TILT= no
##$TM1= 0
##$TM2= 0
##$TOPLEV= 0
##$USERP1= <user>
##$USERP2= <user>
##$USERP3= <user>
##$USERP4= <user>
##$USERP5= <user>
##$WDW= 1
##$XDIM= 32768
##$YMAX_p= 443735646
##$YMIN_p= -77946
$$ End of Bruker specific parameters
$$ ---------------------------------
##NTUPLES= NMR SPECTRUM
##VAR_NAME=  FREQUENCY,     SPECTRUM/REAL,   SPECTRUM/IMAG
##SYMBOL=    X,             R,               I
##VAR_TYPE=  INDEPENDENT,   DEPENDENT,       DEPENDENT
##VAR_FORM=  AFFN,          ASDF,            ASDF
##VAR_DIM=   32768,         32768,           32768
##UNITS=     HZ,            ARBITRARY UNITS, ARBITRARY UNITS
##FACTOR=    0.157963299565203, 1,           1
##FIRST=     4132.6476996994, 0,             0
##LAST=      -1043.33573715361, 0,           0
##MIN=       -1043.33573715361, -77946,      0
##MAX=       4132.6476996994, 443735646,     0
$$ Real data points
##PAGE= N=1
##DATA TABLE= (X++(R..R)), XYDATA
$$ [...]
14857b5503P896M109q29O650P240J804L211r010R046j4594l421p143j5963p896
$$ -25503 -17607 -13498 -14327 -7677 -437 1367 4578 -4432 4614 -9980 -13401 -20544 -36507 -44403
14843d4403l100J155J0776Q226j4817J5677P398k1993N33J3912J5489o251k927
$$ -44403 -47503 -46348 -35572 -27346 -42163 -26486 -19088 -41081 -40548 -26636 -11147 -17398 -20325
14830b0325l215J595j76k0476k5000O110J2018j0644J3114K4799K6838Q743j8235
$$ -20325 -23540 -21945 -22121 -42597 -67597 -61487 -49469 -60113 -46999 -22200 4638 13381 -4854
14817d854j4077j7141j8482j2941n443o03J7302R553k0096k237J3896J8874l953
$$ -4854 -18931 -36072 -54554 -67495 -72938 -73541 -56239 -46686 -66782 -69019 -55123 -36249 -40202
14804d0202J2734Q317j3104r140K9279O112j3281n456j4024r435J8492L0687n519
$$ -40202 -27468 -19151 -32255 -41395 -12116 -6004 -19285 -24741 -38765 -48200 -29708 979 -4540
14791d540k3486p544K43m181J8217J6070j3203j6035j1794M470J3991j1o95Q952
$$ -4540 -28026 -35570 -35327 -39508 -21291 -5221 -18424 -34459 -46253 -41783 -27792 -27803 -28498 -19546
14777a9546o252M156K119L792j1328j7633J3365Q099K752R883J3298k261k1139
$$ -19546 -25798 -21642 -19523 -15731 -27059 -44692 -31327 -23228 -20476 -10593 2705 444 -20695
14764b0695L595o683q798J0383M131j902n037J982o93J9339K7253k993j3078p369
$$ -20695 -17100 -23783 -32581 -22198 -18067 -19969 -25006 -23024 -23717 -4378 22875 19882 6804 -565
14750e65K321k0733j8074q413M885K5073K0138k4305J542P501N036m159M530l2221
$$ -565 1756 -18977 -37051 -45464 -40579 -15506 4632 -19673 -18131 -10630 -5594 -9753 -5223 -37444
14736c7444k0757o047m729J6299J0579k158M437J3987O060J3373P187j2795Q156
$$ -37444 -58201 -64248 -68977 -52678 -42099 -44257 -39820 -25833 -19773 -6400 787 -12008 -3852
14723c852J989K628k45p83P12j1501L111J8090r642k3160R561r331j5829N136
$$ -3852 -1863 765 520 -263 449 -11052 -7941 10149 507 -22653 -13092 -22423 -38252 -33116
14709c3116L971N04Q258O986j540l162k4310k0799K4347M1742j9051k1385L425
$$ -33116 -29145 -28641 -20383 -13397 -14937 -18099 -42409 -63208 -38861 2881 -16170 -37555 -34130
14696c4130N633P96J447p622p96J5077O385k41j1385P39L766J5060o773o602m331
$$ -34130 -28497 -27701 -26254 -33876 -34672 -19595 -13210 -13451 -24836 -24097 -20331 -5271 -12044 -18646 -22977
14681b2977j445m647J5199l84j0248p886j574j0512L932J694k968r01O395Q883
$$ -22977 -24422 -29069 -13870 -14254 -24502 -32388 -33962 -44474 -40542 -38848 -41816 -42717 -36322 -27439
14667b7439o293L374k960m732R209k217K787L757j0456J1829J428M495j3199L328
$$ -27439 -33732 -30358 -33318 -38050 -28841 -31058 -28271 -24514 -34970 -23141 -21713 -17218 -30417 -27089
14653b7089J4799j276j135l596j2555L215J0680k747J7482q229J646N628j1789
$$ -27089 -12290 -13566 -14701 -18297 -30852 -27637 -16957 -19704 -2222 -10451 -8805 -3177 -14966
14640a4966j2724k0627l400J382J1188p58R431K0736J0535j0849m274k4066k403
$$ -14966 -27690 -48317 -51717 -50335 -39147 -39905 -30474 -9738 797 -10052 -14326 -38392 -40795
14627d0795K5198m06j5253J0787j6766K072O522O881N336l434P883J903p36o189
$$ -40795 -15597 -16003 -31256 -20469 -37235 -35163 -28641 -21760 -16424 -19858 -11975 -10072 -10808 -16997
14613a6997j1011k868K0627J2063k1432j0444m917P972K662J1794J2615J3462
$$ -16997 -28008 -30876 -10249 1814 -19618 -30062 -34979 -27007 -24345 -12551 64 13526
14601A3526J134o39k5783j3217p283N979k3806j2460J3120J3342j2828Q59Q90
$$ 13526 14660 14021 -11762 -24979 -32262 -26283 -50089 -62549 -49429 -36087 -48915 -48056 -47166
14588d7166M234q703L336K1344R094Q977O98j7724k3595K44L4532K9118J3428
$$ -47166 -42932 -51635 -48299 -26955 -17861 -8884 -8186 -25910 -49505 -49261 -14729 14389 27817
14575B7817J373k3365l033O152j4164l762J3138j958l647k4987j5969K986J451
$$ 27817 29190 5825 2792 8944 -5220 -8982 4156 2198 -1449 -26436 -42405 -39419 -37968
14562c7968o809r616m055J3273N066J5654K6292j081j0574K313j5164o06M701
$$ -37968 -44777 -54393 -58448 -45175 -40109 -24455 1837 756 -9818 -7505 -22669 -23275 -18574
14549a8574N4J333Q211q87r742l722N338j9511J2757r772J2832O896J4502k2112
$$ -18574 -18520 -17187 -8976 -9863 -19605 -23327 -17989 -37500 -24743 -34515 -21683 -14787 -285 -22397
14535b2397j6772M10j524J121k920R71J6038Q111o012O666O220j8668J708o21
$$ -22397 -39169 -38759 -40283 -39162 -42082 -41111 -25073 -16962 -22974 -16308 -10088 -28756 -27048 -27669
14521b7669J8515R986j5466j7079r629K145j255q545J0683K0627o0j0813j1556
$$ -27669 -9154 832 -14634 -31713 -41342 -39197 -40452 -48997 -38314 -17687 -17747 -28560 -40116
14508d0116J8073J4674p737P739K541k895M08m416M741J1044k2193j1576o483
$$ -40116 -22043 -7369 -15106 -7367 -4826 -7721 -7313 -11729 -6988 4056 -18137 -29713 -36196
14495c6196K515J1682O735J5781P351n034l486j0232l144N375Q23k0930M82K0396
$$ -36196 -33681 -21999 -15264 517 7868 2834 -652 -10884 -14028 -8653 -7830 -28760 -28278 -7882
14481g882O219n243m305M709J2397k839l620P018N591k1074k317l275m253P17
$$ -7882 -1663 -6906 -11211 -6502 5895 3056 -564 6454 12045 -9029 -11346 -14621 -18874 -18157
14467a8157l814m627j018J1562k293j1854k85P730J539j0527j010j538K372M516
$$ -18157 -21971 -26598 -27616 -16054 -18347 -30201 -30486 -22756 -21217 -31744 -32754 -34292 -31920 -27404
14453b7404M442J4443J524k0223k534J0421k606J2354K6788L665q236k0669N41
$$ -27404 -22962 -8519 -6995 -27218 -29752 -19331 -21937 -9583 17205 20870 12634 -8035 -7494
14440g494k2586j490j473K152J8684Q614J6931J1370k0245r467l126M178J3999
$$ -7494 -30080 -31570 -33043 -30891 -12207 -3593 13338 24708 4463 -5004 -8130 -3952 10047
14427A0047j449j379Q420o067k7336N657P81m14j0036j544J4119m181m768j1299
$$ 10047 8598 7219 15639 9572 -17764 -12107 -11326 -11740 -21776 -23320 -9201 -13382 -18150 -29449
14413b9449n075K918J4174L614m07J1689N882m767j1205O095L436M201j2018l766
$$ -29449 -34524 -31606 -17432 -13818 -14225 -2536 3346 -1421 -12626 -6531 -3095 1106 -10912 -14678
14399a4678L690j2204p651K8207N335j1059L593N786n289j1612j4616Q244J0374
$$ -14678 -10988 -23192 -30843 -2636 2699 -8360 -4767 1019 -4270 -15882 -30498 -22254 -11880
14386a1880j3862m890K874J0467J9130j754q465j491j4112j1547k147J0300J415
$$ -11880 -25742 -30632 -27758 -17291 1839 85 -8380 -9871 -23983 -35530 -37677 -27377 -25962
14373b5962o950n46l580J1407Q088j8121L678M023n043J4790Q155k077J1513p408
$$ -25962 -32912 -33458 -37038 -25631 -17543 -35664 -31986 -27963 -33006 -18216 -10061 -12138 -625 -8033
14359h033q140o777J2654J0895N135O578q885j0192k805J2822P880Q706q023p821
$$ -8033 -16173 -22950 -10296 599 5734 12312 3427 -6765 -9570 3252 11132 19838 11815 3994
14345C994J241q98j1370k3712J6347J1231o965n655o045j6927n165k698Q780J646
$$ 3994 5235 4337 -7033 -30745 -14398 -3167 -10132 -15787 -21832 -38759 -43924 -46622 -37842 -36196
14331c6196p657j2738m665R935Q414P960o283j211R134L580J6597Q166M933o932
$$ -36196 -43853 -56591 -61256 -51321 -42907 -34947 -41230 -42441 -33307 -29727 -13130 -4964 -31 -6963
14317f963J343J09j8080j3815J1123j794l649R707J4168J443j1160Q454J5556
$$ -6963 -5620 -5511 -23591 -37406 -26283 -28077 -31726 -22019 -7851 -6408 -17568 -9114 6442
14304F442n39j5141j7239K540K09P484O317N625J242k2067j0858N879J4845K1754
$$ 6442 5903 -9238 -26477 -23937 -23728 -16244 -9927 -4302 -3060 -25127 -35985 -30106 -15261 6493
14290F493l169k4745R011P893j8845q533P725J6257P012J5012Q030r842l7286
$$ 6493 3324 -21421 -12410 -4517 -23362 -31895 -24170 -7913 -901 14111 22141 12299 -24987
14277b4987o849J6108l784j8611R56N413o279o413J758O423J1554J0795Q579K575
$$ -24987 -31836 -15728 -19512 -38123 -37167 -31754 -38033 -44446 -42688 -36265 -24711 -13916 -5337 -2762
14263b762p088o934K0986N98q345o581O901l838j6067o113l548Q319J2238J1315
$$ -2762 -9850 -16784 4202 4800 -3545 -10126 -3225 -7063 -23130 -29243 -32791 -24472 -12234 -919
14249i19m081j577q572j1033K484n556n500J7498L379p611K3494k198m680j6303
$$ -919 -5000 -6577 -15149 -26182 -23698 -29254 -34754 -17256 -13877 -21488 2006 -192 -4872 -21175
14235b1175j631j689K929K1731O420k912j4911l688Q101M734O000J2j2881j7973
$$ -21175 -22806 -24495 -21566 165 6585 3673 -11238 -14926 -6825 -2091 3909 3921 -8960 -26933
14221b6933l0J4496L118p732J5313J1180q988k5083K556n96m550j0873j626p977
$$ -26933 -26963 -12467 -9349 -17081 -1768 9412 424 -24659 -22103 -22699 -27249 -38122 -39748 -47725
14207d7725K4293M314j3629J147J2822R976r58j2713L669L918O152L226P751r377
$$ -47725 -23432 -19118 -32747 -31600 -18778 -8802 -9760 -22473 -18804 -14886 -8734 -5508 2243 -7134
14193g134R149k17j876q502l924Q892J0692O441j2394j1838j0504N565K3907K599
$$ -7134 2015 1798 -78 -8580 -12504 -3612 7080 13521 1127 -10711 -21215 -15650 8257 10856
14179A0856j0625j1501J3786O455k531m401L391Q266J107K0444J065r079J3229
$$ 10856 231 -11270 2516 8971 6440 2039 5430 13696 14803 35247 36312 27233 40462
14166D0462j3651j8872L671J5834L441m209p640o303r807J3104j2248k0188J8414
$$ 40462 26811 7939 11610 27444 30885 26676 19036 12733 2926 16030 3782 -16406 2008
14153B008N142k202j680j5767M007r463k1J412J602j1519o111L52r44n935k196
$$ 2008 7150 4948 3268 -12499 -8492 -17955 -17976 -16564 -14962 -26481 -32592 -32240 -33184 -39119 -41315
14138d1315K0979N108J4680J603o838m470R066n500j3420l035N185Q726l496K751
$$ -41315 -20336 -15228 -548 1055 -5783 -10253 -1187 -6687 -20107 -23142 -17957 -9231 -12727 -9976
14124i976k201o933k4401m747R628J9234J0258m93J2085m421j3014K1661J5634
$$ -9976 -12177 -19110 -43511 -48258 -38630 -19396 -9138 -9631 2454 -1967 -14981 6680 22314
14111B2314j6501j9649J3347o612j8044q387r200k859j645J2088K736M856P956
$$ 22314 5813 -13836 -489 -7101 -25145 -33532 -42732 -45591 -47236 -35148 -32412 -27556 -19600
14098a9600K748l851j467j2283l537J7458n275m049M824Q851J8831J6075j9783
$$ -19600 -16852 -20703 -22170 -34453 -37990 -20532 -25807 -29856 -25032 -16181 2650 18725 -1058
14085a058k810J6467p199j7055l956q274j868L853J179R581O833J7455L045k5797
$$ -1058 -3868 12599 5400 -11655 -15611 -23885 -25753 -21900 -20721 -11140 -4307 13148 16193 -9604
14071i604r219J4532l569j0208o265n702M674J3177L204J279O00j3429r013Q208
$$ -9604 -18823 -4291 -7860 -18068 -24333 -30035 -25361 -12184 -8980 -7701 -7101 -20530 -29543 -21335
14057b1335m899L396K709j279J1434L891l22p102L895r90Q461q968p009K533O533
$$ -21335 -26234 -22838 -20129 -21408 -9974 -6083 -6405 -13507 -9612 -10602 -2141 -11109 -18118 -15585 -9052
14042i052n777J0416J7246k600l369j0828J3688J797k344p718j7826j4292Q624
$$ -9052 -14829 -4413 12833 10233 6864 -3964 9724 11521 9177 1459 -16367 -30659 -22035
14029b2035J2480k265R583J50J459k231k1423j3348J3633k326Q514J9702o317
$$ -22035 -9555 -11820 -2237 -2087 -628 -2859 -24282 -37630 -23997 -26323 -17809 1893 -4424
14016d424K323K300N76J57N115M165j1278p375j2766o770j3637p720K4150K8618
$$ -4424 -2101 199 775 932 6047 10212 -1066 -8441 -21207 -27977 -41614 -49334 -25184 3434
14002C434o318L45j7728j1196N819J6728P367j4623p064J976K1732K28J6739M487
$$ 3434 -2884 -2539 -20267 -31463 -25644 -8916 -1549 -16172 -23236 -21260 472 700 17439 21926
13988B1926o976j220m22O532j0715j7586j178J3686p002j2428l050k971j3725
$$ 21926 14950 13730 13308 19840 9125 -8461 -9639 4047 -2955 -15383 -18433 -21404 -35129
13975c5129J158j827P537M528J101j2820q186J0789K9447J6908r861l1337k8575
$$ -35129 -33971 -35798 -28261 -23733 -22632 -35452 -43638 -32849 -3402 13506 3645 -27692 -56267
13962e6267n400j972J9863J2051L829K1679M86P303J9233j2671O939O866K595
$$ -56267 -61667 -63639 -43776 -31725 -27896 -6217 -5731 1572 20805 8134 15073 21939 24534
13949B4534k572j3195l63L313p431n958j9830q169N098J0693j7226N856J8879
$$ 24534 21962 8767 8404 11717 4286 -1672 -21502 -29671 -24573 -13880 -31106 -25250 -6371
13936f371J2653m198L73M264O197R270r812j1518o346J0341R051k7213n116j557
$$ -6371 6282 2084 2457 6721 12918 22188 12376 858 -5488 4853 13904 -13309 -18425 -19982
13922a9982L061l220j938J331j1168J9767p632j1788K8881K1599r079j2469P020
$$ -19982 -16921 -20141 -22079 -20748 -31916 -12149 -19781 -31569 -2688 18911 9832 -2637 4383
13909D383l905q633j156q974M320P409K457j0169N080L906J921p001k0389m361
$$ 4383 478 -8155 -9311 -18285 -13965 -6556 -4099 -14268 -9188 -5282 -3361 -10362 -30751 -35112
13895c5112J2562J6999k871L0416k581j3747K0258Q49j5031j9668j4489j3057
$$ -35112 -22550 -5551 -8422 21994 19413 5666 25924 26773 11742 -7926 -22415 -35472
13883c5472j2684J704J0107J1305J457J6794O986j8793p859J8480M21n296j6418
$$ -35472 -48156 -46452 -36345 -25040 -23583 -6789 197 -18596 -26455 -7975 -7554 -12850 -29268
13870b9268j1567l358P252K0499M669L419J7276j7584k3112J0153J7053K2554
$$ -29268 -40835 -44193 -36941 -16442 -11773 -8354 8922 -8662 -31774 -21621 -4568 17986
13858A7986P938p965o380N37m686k620j1653k783P295Q033J105l691o904r818
$$ 17986 25924 17959 11579 12116 7430 4810 -6843 -9626 -2331 5702 6807 3116 -3788 -13606
13844a3606O029L834j957k4075m315J5785k9074Q73J0399n834k281P10J0537J2704
$$ -13606 -7577 -3743 -5700 -29775 -34090 -18305 -47379 -46506 -36107 -41941 -44222 -43512 -32975 -20271
13830b0271q225P56j7814r00J9137Q435K9593O76K793M565M561j2387O393j1337
$$ -20271 -28496 -27740 -45554 -46454 -27317 -18882 10711 11387 14180 18745 23306 10919 17312 5975
13816E975k8094k118k556m492M74k375J4511J3063O05j0061j619j0053k517J582
$$ 5975 -22119 -24237 -26793 -31285 -30811 -33186 -18675 -5612 -5007 -15068 -16687 -26740 -29257 -27675
13802b7675Q036r430J0617M56l152j4435Q32J6821M207q165K034j339K1289R04
$$ -27675 -19639 -29069 -18452 -17996 -21148 -35583 -34751 -17930 -13723 -21888 -19854 -21193 96 1000
13788A000J4684o237j1397m492j0790m185j959J8340j5318j0599K2507J0379n688
$$ 1000 15684 9447 -1950 -6442 -17232 -21417 -23376 -5036 -20354 -30953 -8446 1933 -3755
13775c755k0314o580J4512J6002k750j4175K261j338l625k538J1703J7836j4950
$$ -3755 -24069 -30649 -16137 -135 -2885 -17060 -14799 -16137 -19762 -22300 -10597 7239 -7711
13762g711j7415K003K2667J6633m476j643k1919J2766k633K214J2821k2309j3540
$$ -7711 -25126 -23123 -456 16177 11701 10058 -11861 905 -1728 486 13307 -9002 -22542
13749b2542L695l565R828J88q255P69q432j8164M538P637J9001R765K16j0402
$$ -22542 -18847 -22412 -12584 -12396 -20651 -19882 -28314 -46478 -41940 -34303 -15302 -5537 -5321 -15723
13735a5723J2174Q254j601r03J8609n951m580J62J936M469r519j3309j0054j7257
$$ -15723 -3549 4705 3104 2201 20810 14859 10279 10441 12377 16846 7327 -5982 -16036 -33293
13721c3293O283N361p33Q183m650J4155K641p913K0797J2689q784P605N733j5053
$$ -33293 -27010 -21649 -22382 -14199 -18849 -4694 -2053 -9966 10831 23520 14736 22341 28074 13021
13707A3021l63j9551j6841J7928J4114J797N243l00j3859j5543j88P306oK339
$$ 13021 12658 -6893 -23734 -5806 8308 10105 15348 15048 1189 -14354 -14542 -7236 -7242 -4903
13693d903N912O974m149m306o84q012k399q847K093O87J0015J5084R175k8489
$$ -4903 1009 7983 3834 -472 -1156 -9168 -11567 -20414 -18321 -17634 -7619 7465 16640 -11849
13679a1849j6288N789J7886J2041k467n946O299j2895j2820J5788R652J2870j4896
$$ -11849 -28137 -22348 -4462 7579 5112 -834 5465 -7430 -20250 -4462 5190 18060 3164
13666C164q854r817O147N320J3395R76j0389q277J0835m190r31M665k398j5507
$$ 3164 -5690 -15507 -9360 -4040 9355 10331 -58 -8335 2500 -1690 -2621 2044 -354 -15861
13652a5861j1039J074M085K678Q975R979j3325k617P460M004p229O271J5607j5885
$$ -15861 -26900 -25826 -21741 -19063 -10088 -109 -13434 -16051 -8591 -4587 -11816 -5545 10062 -5823
13638e823r037p354L892J3444O060M151J6109j1152j7590j3242o909N096J7951
$$ -5823 -14860 -22214 -18322 -4878 1182 5333 21442 10290 -7300 -20542 -27451 -22355 -4404
13625d404j1523L633k410j195J4246P261q19p698k407Q745j2741J477J2580O41
$$ -4404 -15927 -12294 -14704 -15899 -1653 5608 4789 -2909 -5316 3429 -9312 -7835 4745 5386
13611E386m713l295L211j0270r577P775k482K5690J5087J4068L464j0258l56r79
$$ 5386 673 -2622 589 -9681 -19258 -11483 -13965 11725 26812 40880 44344 34086 33730 32751
13597C2751j3255Q610j5813r032J6833K527N958k546p106K645r101Q326j3350
$$ 32751 19496 28106 12293 3261 20094 22621 28579 26033 18927 21572 12471 20797 7447
13584G447j2851j1080N314K624J8020o43j2399j2985k115J6651K569R312P048
$$ 7447 -5404 -16484 -11170 -8546 9474 8831 -3568 -16553 -18668 -2017 552 9864 16912
13571A6912M795j6308j6370J2290J817M866P908K882j2652k724m694j0289r881
$$ 16912 21707 5399 -10971 1319 3136 8002 15910 18792 6140 3416 -1278 -11567 -21448
13558b1448K0343J3080L624J1715L062j4962j7855P231K6566L013k1249j2126
$$ -21448 -1105 11975 15599 27314 30376 15414 -2441 4790 31356 34369 13120 994
13546I94J3007J6844K6680p676j9914N790j1073k9163K130J9718j961k606N39
$$ 994 14001 30845 57525 49849 29935 35725 24652 -4511 -2381 17337 15376 12770 13309
13533A3309P693L06j0408j7121Q950O094J271j6972k0268M122K0247J1206r620
$$ 13309 21002 21308 10900 -6221 2729 8823 10094 -6878 -27146 -23024 -2777 8429 -1191
13520a191M158J3796K715M245q190J005r971j732Q047p50j9364p497M591j3258
$$ -1191 2967 16763 19478 23723 15533 16538 6567 4835 12882 12132 -7232 -14729 -10138 -23396
13506b3396J475K3484P330M136J560L19P301n468r755j0084P145M169o54K133
$$ -23396 -21921 1563 8893 13029 14589 14908 22209 16741 6986 -3098 4047 8216 7562 9695
13492I695L5448P978k09k9360l4023N475K962n772J026J6459j1357j5725L469
$$ 9695 45143 53121 52912 23552 -10471 -4996 -2034 -7806 -6780 9679 -1678 -17403 -13934
13479a3934K0773J2518N480J1623r239q280j6969k821O380K920L857r3J2468l080
$$ -13934 6839 19357 24837 36460 27221 18941 1972 -849 5531 8451 12308 12215 24683 21603
13465B1603j5194m316n064Q635J3125r8r509O655k1257j1193o617J2895O864P58
$$ 21603 6409 2093 -2971 5664 18789 18691 9182 15837 -5420 -16613 -23230 -10335 -3471 -2713
13451b713m436m989K723J9873M581J4702Q167j642j1682j1766m863j5249l726
$$ -2713 -7149 -12138 -9415 10458 15039 29741 37908 36266 24584 12818 7955 -7294 -11020
13438a1020J0450J1581J0682J6573L539p474j1202k9306J6695P00N244j080M710
$$ -11020 -570 11011 21693 38266 41805 34331 23129 -6177 10518 11218 16462 15382 20092
13425B0092r574n284j3713L544q741J1709Q555M125o211o493K1300P359j056j1640
$$ 20092 10518 5234 -8479 -4935 -13676 -1967 6588 10713 4502 -1991 19309 26668 25612 13972
13411A3972j0108l16L025Q748J518P636R18R108P437j441j788o467j9510N287
$$ 13972 3864 3548 6573 15321 16839 24475 25393 34501 41938 40497 38709 32242 12732 18019
13397A8019K282r79l585j4467J3623J2474k3618j6415R178J0585m334J7684K6025
$$ 18019 20301 19322 15737 1270 14893 27367 3749 -12666 -3488 7097 2763 20447 46472
13384D6472P208q345q284k541k1595j640j883m407R44J3812N714K0556K84j491
$$ 46472 53680 45335 37051 34510 12915 11275 9392 4985 5929 19741 25455 46011 46295 44804
13370D4804j1450j8553j171J1956j0203j5993k108O20J0967L670M553k328Q360
$$ 44804 33354 14801 13630 25586 15383 -610 -2718 -2098 8869 12539 17092 14764 23124
13357B3124j8267p855J6239K149j750j4349q662J537J9267l104R256J9163Q55
$$ 23124 4857 -2998 13241 15390 13640 -709 -9371 -7834 11433 8329 17585 36748 37603
13344C7603j0791L399J3030j0560n01p17O118j4071j7277P13M426J2347J8089
$$ 37603 26812 30211 43241 32681 32180 31463 37581 23510 6233 6946 11372 23719 41808
13331D1808O661j6099j6683j164J1561m889j3066J9933J366j1361N952N311K4072
$$ 41808 48469 32370 15687 14523 26084 21195 8129 28062 29428 18067 24019 29330 53402
13318E3402R131j2201p180q726J679L2489J659N583n111o511p516q784N70J20
$$ 53402 62533 50332 43152 34426 36105 68594 70253 75836 70725 64214 56698 47914 48484 48604
13304D8604N778k730J1805J1909j126J5702p693K510Q558j3573J4045K7303R002
$$ 48604 54382 51652 63457 75366 74240 89942 82249 84759 93317 79744 93789 121092 130094
13291A30094N201M880K5140L8232M0903K3479K3710O1244Q7747O1829O8577R3268
$$ 130094 135295 140175 165315 203547 244450 267929 291639 352883 440630 502459 571036 664304
13279F64304J36117J46839K11899K54192K53562K41087K28674J80289J34354J16310
$$ 664304 800421 947260 1159159 1413351 1666913 1908000 2136674 2316963 2451317 2567627
13269B567627K5203o1208j24466j16750j00667k8039O664K9977M9873Q8139J34240
$$ 2567627 2592830 2531622 2407156 2290406 2189739 2161700 2168364 2198341 2248214 2336353 2470593
13258B470593J30717P4596J049n7507r5868j27702j67184k47040l03860k82003
$$ 2470593 2601310 2675906 2676955 2619448 2523580 2395878 2228694 1981654 1677794 1395791
13248A395791k20609j70647j21541q4584p2537o7045o2656m8247n6004n4228l2301
$$ 1395791 1175182 1004535 882994 798410 725873 658828 596172 547925 491921 437693 405392
13237D05392m0839m5810l6675q292j1291k2546j3390k0616q502p676m070k331
$$ 405392 364553 318743 282068 273776 262485 239939 226549 205933 197431 189755 185685 183354
13225A83354j5332o59O782q926j8927P24l525l783j7239k0083n595J5399P641
$$ 183354 168022 167363 174145 165219 146292 147016 143491 139708 122469 102386 96791 112190 119831
13212A19831n897P45M27R36M164j1313j8507J5240j2836l801n237o71K4319m982
$$ 119831 113934 114679 115106 116042 120206 108893 90386 105626 92790 88989 83752 83081 107400 102418
13198A02418K178j2604J446J2307l032R994J069j5914K619k798J0527K8570J0196
$$ 102418 104596 91992 93438 105745 102713 112707 113776 97862 100481 97683 108210 136780 146976
13185A46976j4551n564p480n4J3851j0301K793O602J0423l1008j2117m399J133
$$ 146976 132425 126861 119381 119327 133178 122877 125670 132272 142695 111687 99570 95171 96304
13172I6304j7168q375o33R691j1134Q988k353j4722o27R988J4850J3627L898j1052
$$ 96304 79136 70761 70128 79819 68685 77673 75320 60598 59971 69959 84809 98436 102334 91282
13158I1282r100m436J4372J4510M33j4995k4178j79R737J0360J404q30K344j610
$$ 91282 82182 77746 92118 106628 107061 92066 67888 67709 77446 87806 89210 88380 90724 89114
13144H9114J2424j2074n19j1371J085J6323N177J1663J3565p125k479J5811j0880
$$ 89114 101538 89464 88945 77574 78659 94982 100159 111822 125387 118262 115783 131594 120714
13131A20714n383J8150J3945Q532l24j724Q164L9732N531K206L1894J5153J3090
$$ 120714 115331 133481 147426 155958 155634 153910 162074 201806 207337 209543 241437 256590 269680
13118B69680P488K293j5222k4018L383P045q645k6505j8338o135k7626n107M630
$$ 269680 277168 279461 264239 240221 243604 250649 242004 215499 197161 191026 163400 158293 162923
13105A62923j502q504Q554m337J6496J5730j2986j6023Q898N855J0993M89j9754
$$ 162923 161421 152917 161471 157134 173630 189360 176374 160351 169249 175104 186097 186586 166832
13092A66832M509R789k827m37O78l255l721j085J0628L4801K0611J3608J3525
$$ 166832 171341 181130 178303 177866 178544 175289 171568 170483 181111 215912 236523 250131 263656
13079B63656J7223m585k0565j967R333J1970J262L128m803p446k3830j8925P927
$$ 263656 280879 276294 255729 253762 263095 275065 276327 279455 274652 267206 243376 224451 232378
13066B32378j5564m3844k9139j3141k2616N827j2760P92o820J7389J0284q151
$$ 232378 216814 172970 143831 130690 108074 113901 101141 101933 95113 112502 122786 114635
13054A14635q480l0780J656J1611J3529k4012j2739q433K2780K2407r27j7423
$$ 114635 106155 75375 77031 88642 102171 78159 65420 56987 79767 102174 101247 83824
13042H3824o434M615J3018j6608K32J755j8801j6356J898J5791k559P159J0504
$$ 83824 77390 82005 95023 78415 78647 80402 61601 45245 47143 62934 60375 67534 78038
13029G8038r022n445l866O666N638J975o350J2752J9542m822k5183n564J5388
$$ 78038 69016 63571 59705 66371 72009 73984 67634 80386 99928 95106 69923 64359 79747
13016G9747J4317r423k0455o691J1991L215j648p686j5629j1250K002r262j7401
$$ 79747 94064 84641 64186 57495 69486 72701 71053 63367 47738 36488 38490 29228 11827
13003A1827K8045J9697J540P69J170k2057k982O995J34J7217J153n808m946k624
$$ 11827 39872 59569 61109 61878 63048 40991 38009 45004 45138 62355 63508 57700 52754 50130
12989E0130m507J165N872l60o359m995m312j2717J1313K5383J1921J604J0315
$$ 50130 45623 46788 52660 52300 45941 40946 36634 23917 35230 60613 72534 74138 84453
12976H4453J7893L055L698J3378m631l815J4487j0272N015J2299N650O556q51
$$ 84453 102346 105401 109099 122477 117846 114031 128518 118246 123261 135560 141210 147766 146915
12963A46915j9329R39j1706n206j838l08n960k6615N966O916J765J2116Q031J460
$$ 146915 127586 128525 116819 111613 109775 109467 103507 76892 82858 89774 91539 103655 111686 113146
12949A13146l538K2087J4407r149j6253m735j0784K1009J3581J4850J02K23M763
$$ 113146 109608 131695 146102 136953 120700 115965 105181 126190 139771 154621 154723 154946 159709
12936A59709J5194K3527j847k344K74k158J1981J5381j9136p200j715j0053Q239
$$ 159709 174903 198430 196583 194239 194513 192355 204336 219717 200581 193381 191666 181613 189852
12923A89852p682j8712k4218J3310Q455k2775o289n103K71j2107j1064O026j7983
$$ 189852 182170 163458 139240 152550 161005 138230 131941 126838 127109 115002 103938 109964 91981
12910I1981J154M256J881j9875l624M727J2100R713J9205n540p65j4226j4074
$$ 91981 93135 97391 99272 79397 75773 80500 92600 102313 121518 115978 115213 100987 86913
12897H6913J4946J5084l244K274J29o4k410J0389P551r300j3925J1106j6645n397
$$ 86913 101859 116943 113699 115973 116102 116038 113628 124017 131568 122268 108343 119449 102804 97407
12883I7407m716n872n574J1788M907q654j0979j7948J4746J0037j4917L228K9182
$$ 97407 92691 86819 81245 93033 97940 89286 78307 60359 75105 85142 70225 73453 102635
12870A02635L060j1496J9138o521o595R119p769j1852J0587n88j6222k022R293
$$ 102635 105695 94199 113337 106816 100221 109340 101571 89719 100306 99718 83496 81474 90767
12857I0767k0451j9157J533J0362J1726J807j1757k5864q585p7L347p59l509J1785
$$ 90767 70316 51159 52692 63054 74780 76587 64830 38966 30381 30304 33651 32892 29383 41168
12843D1168K2357Q842k716l892J3339Q353q316k222j433j0396j4338M705P453
$$ 41168 63525 72367 69651 65759 79098 87451 79135 76913 75480 65084 50746 55451 62904
12830F2904N119R972n484M266q62r526J575J675J0855l742k006N588k281R888
$$ 62904 68023 77995 72511 76777 75915 66389 67964 69639 80494 76752 74746 80334 78053 87941
12816H7941K901P044j5425Q969K2788J2867L97o050L638j1115q682J5257J7984
$$ 87941 90842 97886 82461 91430 114218 127085 127482 121432 125070 113955 105273 120530 138514
12803A38514j4531p976k509J4003J9425l82j2045j6134R613J7657J1505j1274
$$ 138514 123983 116007 113498 127501 146926 146544 134499 118365 127978 145635 157140 145866
12791A45866p77J3838J482j4992j379N087J4467J3516O184J2386O079j4599J93
$$ 145866 145089 158927 160409 145417 144038 149125 163592 177108 183292 195678 201757 187158 187351
12778A87351R250r9O390k5075r659K2170O159K0355K7328j665J2943K131O493
$$ 187351 196601 196502 202892 177817 168158 190328 196487 216842 244170 242505 255448 257579 264072
12765B64072M146P965J0673J8207J4156O210q934r857M164M778P448j585o342
$$ 264072 268218 276183 286856 305063 319219 325429 316495 306638 310802 315580 323028 321443 315101
12752C15101O086J8360K0624K0441m718J246L921K307j560J3383J7065J6852K5946
$$ 315101 321187 339547 360171 380612 375894 377140 381061 383368 381808 395191 412256 429108 455054
12739D55054J8207L635O485J56J3112L7722L9984M2207J8820J9269L030J3867
$$ 455054 473261 476896 483381 483537 496649 534371 574355 616562 635382 654651 657681 671548
12727F71548L9539L7267L7376K9906K5624M9224M2757L6324L5548M1850O2898
$$ 671548 711087 748354 785730 815636 841260 890484 933241 969565 1005113 1046963 1109861
12716A109861M1955N3978M3431O9072Q9035Q8885R4645J15828J17933J26251J48084
$$ 1109861 1151816 1205794 1249225 1318297 1407332 1496217 1590862 1706690 1824623 1950874 2098958
12705B098958J60855J46713J99793K30627K61995K98888L25924L58115M19443
$$ 2098958 2259813 2406526 2606319 2836946 3098941 3397829 3723753 4081868 4501311
12696D501311M82714N25508O02640P48396Q38473R63285J127365J327621J556529
$$ 4501311 4984025 5509533 6112173 6860569 7699042 8662327 9789692 11117313 12673842
12687A2673842J821127K132539K433728K718484K997645L239117L318799L254350
$$ 12673842 14494969 16627508 19061236 21779720 24777365 28016482 31335281 34589631
12679C4589631L012783K578350J952571J202082L99713m03277j167800j842475
$$ 34589631 37602414 40180764 42133335 43335417 43735130 43331853 42164053 40321578
12671D0321578k292967k592417k677546k588629k409604k167300j928951j655359
$$ 40321578 38028611 35436194 32758648 30170019 27760415 25593115 23664164 22008805
12663B2008805j431923j231953j032325q33269o75752n02334l66986j85671l3896
$$ 22008805 20576882 19344929 18312604 17479335 16803583 16301249 15934263 15748592 15714696
12654A5714696J17760K90150M78002O78130R22445J184528J483639J765040K088493
$$ 15714696 15832456 16122606 16600608 17278738 18201183 19385711 20869350 22634390 24722883
12645B4722883K417301K690314K876579K949094K824170K566454K115986J502185
$$ 24722883 27140184 29830498 32707077 35656171 38480341 41046795 43162781 44664966
12637D4664966P39111p2214q42154j568400k208336k631030k851114k871491k778756
$$ 44664966 45404077 45331863 44489709 42921309 40712973 38081943 35230829 32359338 29580582
12628B9580582k624373k392168k134104j911818j681229j520009j361578j211864
$$ 29580582 26956209 24564041 22429937 20518119 18836890 17316881 15955303 14743439
12620A4743439j081534r60278q65140q01286p31897o51495n65721n29717m92463
$$ 14743439 13661905 12701627 11836487 11035201 10303304 9651809 9086088 8556371 8063908
12611H063908m67806m09497l55392l19602k82251k69425k56086k65161k30061
$$ 8063908 7596102 7186605 6831213 6511611 6229360 5959935 5703849 5438688 5208627
12602E208627k05724j94890k03615j85179j70369j65589j54577j59255j62924
$$ 5208627 5002903 4808013 4604398 4419219 4248850 4083261 3928684 3769429 3606505
12593C606505j35088j28339r9683r0052j02101j30296r7860q4163q5987q4254
$$ 3606505 3471417 3343078 3243395 3153343 3051242 2920946 2823086 2738923 2652936 2568682
12583B568682j04582j01031n1712p4584r0059p0303o6010o4442n1363m8519o3725
$$ 2568682 2464100 2363069 2311357 2236773 2146714 2076411 2010401 1945959 1894596 1846077 1782352
12572A782352n9127o0897o5384n0720m3555l1943n1744o1227n0999n5161l7150
$$ 1782352 1723225 1662328 1596944 1546224 1502669 1470726 1418982 1357755 1306756 1251595 1214445
12561A214445l3946l4076l3274k1101k6103k0915k0564m8598l9002k3983j5484
$$ 1214445 1180499 1146423 1113149 1092048 1065945 1045030 1024466 975868 936866 912883 897399
12550H97399l2551k7470k7515k4855K509o724l1686j9398j4078j3796j7276k6154
$$ 897399 864848 837378 809863 785008 787517 780793 749107 729709 715631 701835 684559 658405
12538F58405j3771j4299j7138j0455k4332j5312k7262j3078J790j4466k1567j2438
$$ 658405 644634 630335 613197 602742 578410 563098 535836 522758 524548 510082 488515 476077
12526D76077j0460R178j0478k6638j3901q828r563J593M317r947j3542M456l508
$$ 476077 465617 474795 464317 437679 423778 414950 405387 406980 411297 401350 387808 392264 388756
12513C88756l2556j5150l363m483J2255o27J299q493q322l220j251j942k1624
$$ 388756 356200 341050 337687 333204 345459 344832 346131 337638 329316 326096 324845 322903 301279
12500C01279l1529k1290K8564K0933j4916j0031j6633J1501j5953j1775m286M74
$$ 301279 269750 248460 277024 297957 283041 273010 256377 267878 251925 240150 235864 236338
12488B36338O82P372l179j5769j8494k0323J3659n919q948n7M344l609j1500J1482
$$ 236338 237020 244392 241213 225444 206950 186627 200286 194367 185419 185362 189706 186097 174597 186079
12474A86079r691r621j434l217q059p76M688J4923p669j567o086j1916M056J2758
$$ 186079 176388 166767 165333 162116 154057 153281 157969 172892 165223 163656 157570 145654 149710 162468
12460A62468j5036P609J3960k3719o502J0624j868J7157k291j8419r533j5906
$$ 162468 147432 155041 169001 145282 138780 149404 147536 164693 162402 143983 134450 118544
12448A18544j7247R463K1202J4010j262l475R75Q130L204k2305r554J93p011R290
$$ 118544 101297 110760 131962 145972 144710 141235 142210 150340 153544 131239 121685 121878 114867 124157
12434A24157K82k7605O567J0840j0392q263n408p291J9369J3711l362j3088O217
$$ 124157 124439 96834 103401 114241 103849 95586 90178 82887 102256 115967 112605 99517 105734
12421A05734q965k337m785j0202L552q201j3328R706L420J6338P403K03q743j3744
$$ 105734 96769 94432 89647 79445 82997 74796 61468 71174 74594 90932 98335 98538 89795 76051
12407G6051k138M456k284O444J519P437J387L512l344m227k650p194k465L717
$$ 76051 73913 78369 76085 82529 84048 91485 92872 96384 93040 88813 86163 78969 76504 80221
12393H0221P877J3861k2334k3853J83J4567K5047n05j009j8052j9868o639j926
$$ 80221 88098 101959 79625 55772 55955 70522 95569 95064 94055 76003 56135 49496 47570
12380D7570J4225J3755n074j3386k1711k357J1834k0942l360J9666n351l531K1366
$$ 47570 61795 75550 70476 57090 35379 33022 44856 23914 20554 40220 34869 31338 52704
12367E2704L3j1403J7472N897j3281j2017m838l446J2893m903K928r1J995P318
$$ 52704 52737 41334 58806 64703 51422 39405 34567 31121 44014 39111 42039 41948 43943 51261
12353E1261j0975m807k838m929K3649J8048k1313r110Q300j0199l1625o533L3362
$$ 51261 40286 35479 32641 27712 51361 69409 48096 38986 47286 37087 5462 -1071 32291
12340C2291Q235k025J3702m029l898o959P575R388J8888j1793j2624j530L370
$$ 32291 40526 38501 52203 48174 44276 37317 44892 54280 73168 61375 48751 47221 50591
12327E0591J8521n785j4462Q65o076m587k124j3516J180l67J2045l816O297l382
$$ 50591 69112 63327 48865 49730 43654 39067 36943 23427 24607 24240 36285 32469 38766 35384
12313C5384r369k365r234J1966M628p483j765j0478n453J6074K2062J3484P92
$$ 35384 26015 23650 14416 26382 31010 23527 21762 11284 5831 21905 43967 57451 58243
12300E8243j4509j0379j0398M187J1657l224m354j4923p078J5388q82r067o599
$$ 58243 43734 33355 22957 27144 38801 35577 31223 16300 9222 24610 23728 14661 8062
12287H062L518K061J6016K1406j2035j858J7857J8414k1419k8088n461M554P089
$$ 8062 11580 13641 29657 51063 39028 37170 55027 73441 52022 23934 18473 23027 30116
12274C0116j6148J5980K1810m190m562J7406k285K874Q618Q638p734m0869j8656
$$ 30116 13968 29948 51758 47568 43006 60412 58127 61001 69619 78257 70523 29654 10998
12261A0998K0672J5711J5209l529Q433j022j5860l201m315K817K486J6556Q026
$$ 10998 31670 47381 62590 59061 67494 66472 50612 47411 43096 45913 48399 64955 72981
12248G2981r789q001J2379R19J769K1768Q962k83m858K0049L9236J2293l774K6588
$$ 72981 63192 55191 67570 68489 70258 92026 100988 100705 95847 115896 155132 167425 163651 190239
12234A90239J9976n943J157n115J1414J1266j5785Q131R224j3394j2638o636J0874
$$ 190239 210215 204272 205429 200314 211728 222994 207209 215340 224564 211170 198532 191896 202770
12221B02770J106k3948j6112j988p069o424N269J0057J1538j0419l849r207k0309
$$ 202770 203876 179928 163816 161828 154759 148335 153604 163661 175199 164780 160931 151724 131415
12208A31415r777l027Q323N850Q821P396J1564J1082K81k22K4727J4344R322k098
$$ 131415 121638 118611 126934 132784 141605 149001 160565 171647 171928 171706 196433 210777 220099 218001
12194B18001j4034m702K569N847k12Q884N256j3223j2982P96r139q935M527k6793
$$ 218001 203967 199265 201834 207681 207469 216353 221609 208386 195404 196200 187061 178126 182653 155860
12180A55860j4589J5649j1522l661Q485K0199N15l665P43k268n954j4351k6668
$$ 155860 141271 156920 145398 141737 150222 170421 170936 167271 168014 165746 159792 145441 118773
12167A18773j651M172O592o987j4649J3642j591j0241p545N820q844j7736k6898
$$ 118773 117122 121294 127886 120899 106250 119892 118301 108060 100515 106335 97491 79755 52857
12154E2857m682J6064m144p033l812Q138P52k5851n263L432J1895J167M900L438
$$ 52857 48175 64239 60095 53062 49250 57388 58140 32289 27026 30458 42353 43520 48420 51858
12140E1858j9689N876K1208P74M469P714J5874J095o588J9922K2408J6507P586
$$ 51858 32169 38045 59253 60027 64496 72210 88084 89179 82591 102513 124921 141428 149014
12127A49014j1181j2206r358K168r173j0153J1996K732j2471j6833L873r916m810
$$ 149014 137833 125627 116269 118437 109264 99111 111107 113839 101368 84535 88408 78492 73682
12114G3682j4267j4405q995J8841K5038p893j7446J154r513J4590J1328k970q009
$$ 73682 59415 45010 36015 54856 79894 72001 54555 55709 46196 60786 72114 69144 61135
12101F1135Q509Q328K1490M544L73P23j3668j1495R302L8242K3538n223o103p429
$$ 61135 69644 77972 99462 104006 104379 105102 91434 79939 89241 127483 151021 145798 139695 132266
12087A32266R792J291j5853j4652j6845j6642q068N840J537j7292J4908K7455
$$ 132266 142058 143349 127496 112844 95999 79357 71289 77129 78666 61374 76282 103737
12075A03737J1030q030q622j6587j1438K4240K3763J85p577k1681j1490m141J3448
$$ 103737 114767 106737 98115 81528 70090 94330 118093 118278 110701 89020 77530 73389 86837
12062H6837L8612m32k3028q127n574L906J8324J4173K1240J8016k1016k9296O462
$$ 86837 125449 125017 101989 93862 88288 92194 110518 124691 145931 163947 142931 113635 120097
12049A20097K809Q53J668O604R099j712M579J2279K0165j585k5546J9783M933
$$ 120097 122906 123759 125427 132031 141130 139418 143997 156276 176441 174856 149310 169093 174026
12036A74026k0780M757Q440K521P336N884Q68J3835O002n937k6366n655J5072
$$ 174026 153246 158003 166443 168964 176300 182184 183052 196887 202889 196952 170586 164931 180003
12023A80003J7571O631J311J3718r193m758r258l949K7216K5163Q944j582Q38
$$ 180003 197574 204205 205516 219234 210041 205283 196025 192076 219292 244455 253399 251817 252655
12010B52655R546n518l813l461m956J0251p525J9710L734j7202J2635K6365Q56
$$ 252655 262201 256683 252870 249409 244453 254704 247179 266889 270623 253421 266056 292421 293277
11997B93277j4347j8500J5356K5195J3703K6552j1106J0724L1752K7716j4181
$$ 293277 278930 260430 275786 300981 314684 341236 330130 340854 372606 400322 386141
11986C86141J0782K5126n785J7801K0622J3036R932J3748L8404K0826J1330L5457
$$ 386141 396923 422049 416264 434065 454687 467723 477655 491403 529807 550633 561963 597420
11974E97420J6643n90P478K7533K1299K6484J6872K1045M127L6596M0705K8923
$$ 597420 614063 613473 620951 648484 669783 696267 713139 734184 738311 774907 815612 844535
11962H44535M2014K7698N2904P5745O8292K3465J8419O2510P6942O0049Q5676
$$ 844535 886549 914247 967151 1042896 1111188 1134653 1153072 1215582 1292524 1352573 1438249
11951A438249R4637Q6191Q7788J15429J31927J30680J52156J50128J79530K09985
$$ 1438249 1532886 1619077 1706865 1822294 1954221 2084901 2237057 2387185 2566715 2776700
11941B776700K30416K57491K99846L38024L78806M17931M89719N78461O65006
$$ 2776700 3007116 3264607 3564453 3902477 4281283 4699214 5188933 5767394 6432400
11932F432400P89631R45698J143609J364034J644007K036029K497429L056131
$$ 6432400 7222031 8167729 9311338 10675372 12319379 14355408 16852837 19908968
11924A9908968L666987M332971M936958N233314N134878M632566L792265K641542
$$ 19908968 23575955 27908926 32845884 38079198 43214076 47846642 51638907 54280449
11916E4280449J279320k08928j789929l335520m519147n133011n126857m686735
$$ 54280449 55559769 55350841 53560912 50225392 45706245 40573234 35446377 30759642
11908C0759642m048408l429886k869855k411699k044683j722636j505953j277376
$$ 30759642 26711234 23281348 20411493 17999794 15955111 14232475 12726522 11449146
11900A1449146j112567r83918q56217p64731o36188n66435n40424m65762l90949
$$ 11449146 10336579 9352661 8496444 7731713 7095525 6529090 5988666 5522904 5131955
11891E131955l56303l04916k93086k45220k35865k27303j80803j72183j54554
$$ 5131955 4775652 4470736 4177650 3932430 3696565 3469262 3288459 3116276 2961722
11882B961722j72794j42242j16013j05125j10192j27176j11532r7666p2356o1840
$$ 2961722 2788928 2646686 2530673 2425548 2315356 2188180 2076648 1978982 1906626 1844786
11872A844786p8030q2614o4513o7497p5981l1001k8732k3586l6504n3903m7527
$$ 1844786 1766756 1684142 1619629 1552132 1476151 1445150 1416418 1392832 1356328 1302425 1254898
11861A254898n3652n3154m7442k6459k2757l7589m1969l9672l2069k3927l2064
$$ 1254898 1201246 1148092 1100650 1074191 1051434 1013845 971876 932204 900135 876208 844144
11850H44144j7197k7344l1029j7837j8242j7736k8583j4227j7086j8046j8625
$$ 844144 826947 799603 768574 750737 732495 714759 686176 671949 654863 636817 618192
11839F18192j2737k234R12n35j5773l4329j5958k6653k1023P14j5435N218n499
$$ 618192 605455 603221 604133 603598 587825 553496 537538 510885 489862 490576 475141 480359 474860
11826D74860r426l036j2797K886j3535k9191j4543r220j4075j3569j8604J7273
$$ 474860 465434 462398 449601 452487 438952 409761 395218 385998 371923 358354 339750 357023
11814C57023K2167l22m9300k9822j5212J1208j240r102j6407m931n256m394k968
$$ 357023 379190 378868 329568 299746 284534 295742 294502 285400 268993 264062 258806 254412 251444
11801B51444O926q56o131J64L880j2300K090m39k4900j995m422K8715J7048n885
$$ 251444 258370 257514 251383 251547 255427 243127 245217 244778 219878 217883 213461 242176 259224 253339
11787B53339O129k741j1158L229j9483j9941Q635O498m287j6794q28o946P796
$$ 253339 259468 256727 245569 248798 229315 209374 218009 224507 220220 203426 202598 195652 203448
11774B03448j6652j6767J768p351l62J462j2124K521n480j2576j3530m818J3784
$$ 203448 186796 170029 171797 164446 164084 165546 153422 155943 150463 137887 124357 119539 133323
11761A33323K787P935M503j1026p834j0601j807o985J5365k892j1322K207j147
$$ 133323 136110 144045 148548 137522 129688 119087 117280 110295 125660 122768 111446 113653 112506
11748A12506j0058j5970j1805q18M807K4085J0850m791k3596O906n187m335J707
$$ 112506 102448 86478 74673 73855 78662 102747 113597 108806 85210 92116 86929 82594 84301
11735H4301M198K573P252m160n51J752j5510K542M608r781J0297Q35p207j7566
$$ 84301 88499 91072 98324 94164 93613 95365 79855 82397 87005 77224 87521 88356 81149 63583
11721F3583l964J3089P674Q492R330n847j6581l061q340p357p096K1080m249j4634
$$ 63583 59619 72708 80382 88874 98204 92357 75776 72715 64375 57018 49922 71002 66753 52119
11707E2119L478K2008p814j7856j4112J2219J0163K3026l70j3868l593k0139o542
$$ 52119 55597 77605 69791 51935 37823 50042 60205 83231 82861 68993 65400 45261 38719
11694C8719n370j41J0525N125q893J962l27M088q7J6186j014j6352R318N203P615
$$ 38719 33349 33208 43733 48858 39965 41927 41600 45688 45601 61787 60773 44421 53739 58942 66557
11679F6557l585l2585k758p849J9807J6428o96j6635l902K831L499N74n831r490
$$ 66557 62972 30387 27629 19780 39587 56015 55319 38684 34782 37613 41112 41686 35855 26365
11665B6365J5935J8283J367j4609o606o445O056J1099j2344j4363j2202N995j3960
$$ 26365 42300 60583 61950 47341 40735 34290 40346 51445 39101 24738 12536 18531 4571
11652D571k125J0360K527o947O085K4435J947J4084N437p786j7677j0125n652
$$ 4571 2446 12806 15333 8386 14471 38906 40853 54937 60374 52588 34911 24786 19134
11639A9134N66J170n306R516j521o961Q707J418M909J0701J6211J566j9322k8696
$$ 19134 19700 20870 15564 25080 23559 16598 25305 26723 31632 42333 58544 60110 40788 12092
11625A2092j0779p513R892K2955l66R749n393k6896k033K57q967M128J9124J1071
$$ 12092 1313 -6200 3692 26647 26281 36030 30637 3741 1708 1965 -7002 -2874 16250 27321
11611B7321l552j2692K092O349k803j0075L190J589k411K613m975m815K1874L2251
$$ 27321 23769 11077 13169 19518 16715 6640 9830 11419 9008 11621 6646 1831 23705 55956
11597E5956n528j7400j3925k0370p625J881J7182p549J1689J5772M224J1085K032
$$ 55956 50428 33028 19103 -1267 -8892 -7011 10171 2622 14311 30083 34307 45392 47424
11584D7424J1838m079n212p988j0290O585j437j5417q184J3321N322k617j692
$$ 47424 59262 55183 49971 41983 31693 38278 36841 21424 13240 26561 31883 29266 27574
11571B7574K0283K92q700m720J8294L321j3369j5287R521J2916k778o198j3052
$$ 27574 47857 48149 39449 34729 53023 56344 42975 27688 37209 50125 47347 41149 28097
11558B8097q710n862p604r631k326Q241J6549J7247P0j4998j0518q455l741K414
$$ 28097 19387 13525 5921 -3710 -6036 2205 18754 36001 36071 21073 10555 2100 -1641 773
11544G73L078R331J4472O015m060J3498l2951j7680Q262J2293L904P508j450l129
$$ 773 3851 13182 27654 33669 29609 43107 10156 -7524 738 13031 16935 24443 22993 19864
11530A9864M01L693j743o490p891L635O695O681p678o398K1104j1412j0846o100
$$ 19864 20265 23958 22215 15725 7834 11469 18164 24845 17167 10769 31873 20461 9615 3515
11516C515N747j562J7384J5942J1034j6614j1020J177j2246K770j3455m262J5050
$$ 3515 9262 7700 25084 41026 52060 35446 24426 25603 13357 16127 2672 -1590 13460
11503A3460J634n709J612j3788J7958n586K188L247K290K206o953P053R705k923
$$ 13460 15094 9385 10997 -2791 15167 9581 11769 15016 17306 19512 12559 19612 29317 26394
11489B6394j6283j0327J5025J8057J894j8428N914J979j3884j2432J6134K191
$$ 26394 10111 -216 14809 32866 34760 16332 22246 24225 10341 -2091 14043 16234
11477A6234k0641r581j448N916K1035J1031J4381n084j8494q220p977q338J6917
$$ 16234 -4407 -13988 -15436 -9520 11515 22546 36927 31843 13349 5129 -2848 -11186 5731
11464E731K1675m932J189j5424m47n748K121J910J0913j1786o046l150J9539J2851
$$ 5731 27406 22474 23663 8239 7792 2044 4165 6075 16988 5202 -844 -3994 15545 28396
11450B8396k3404n71J5043J952O334R973m195p616j4123q036j8027k0774O685
$$ 28396 4992 4421 19464 21416 27750 37723 33528 25912 11789 3753 -14274 -35048 -28363
11437b8363J7022J684j0457l871K3005K5560o065p989r07j3284q428K2283j6096
$$ -28363 -11341 -9657 -20114 -23985 -980 24580 18515 10526 9619 -3665 -12093 10190 -5906
11424e906j9154J0138J343L019L203r436M638L638L763K8545m089j1758Q86j266
$$ -5906 -25060 -14922 -13579 -10560 -7357 -16793 -12155 -8517 -4754 23791 19702 7944 8830 7564
11410G564L716L812N982o021j8786n243K167r344L969P302L899O820J2496j558
$$ 7564 11280 15092 21074 15053 -3733 -8976 -6809 -16153 -12184 -4882 -983 5837 18333 16775
11396A6775N658J5862l413q549j7392N755Q594l540q594j5228j3952O322J3521
$$ 16775 22433 38295 34882 26333 8941 14696 23290 19750 11156 -4072 -18024 -11702 1819
11383A819K0945O704p078j5523j8668Q924O813P285M218j4084k157p201J4495
$$ 1819 22764 29468 22390 6867 -11801 -2877 3936 11221 15439 1355 -802 -8003 6492
11370F492J1223j1102L142m267j7901J6280O723j0622k473k692O640q269j1857
$$ 6492 17715 6613 9755 5488 -12413 3867 10590 -32 -2505 -5197 1443 -6826 -18683
11357a8683R244M982N250j4897k16M164J5729N300P142K987M283O095j456l626
$$ -18683 -9439 -4457 793 -14104 -14320 -10156 5573 10873 18015 21002 25285 31380 29924 26298
11343B6298J202L299k007P227J1657k8683k2682n751K4742O393r655n920k635
$$ 26298 27500 30799 28792 36019 47676 18993 -3689 -9440 15302 21695 12040 6120 3485
11330C485q444j400J844p726Q573M72K707K353N400j970k536k658n661Q20p916
$$ 3485 -4959 -6359 -4515 -12241 -3668 -3196 -489 1864 7264 5294 2758 100 -5561 -4741 -12657
11315a2657p951P158j827o27P962j0874k946L809J3075M539R278K879J5611P492
$$ -12657 -20608 -13450 -15277 -15904 -7942 -18816 -21762 -17953 -4878 -339 8939 11818 27429 34921
11301C4921J4725q17j3260l437j721j1282K408l773j2791J2441J0696R53j1740
$$ 34921 49646 48829 35569 32132 30411 19129 21537 17764 4973 17414 28110 29063 17323
11288A7323j2535J463L843j5308M581J7917L294J0004J7662l730n337p801j2328
$$ 17323 4788 6251 10094 -5214 -633 17284 20578 30582 48244 44514 39177 31376 19048
11275A9048j8961J337O21j2555k98J7604K0569k1147m463J4520P386j1606l027
$$ 19048 87 1424 2045 -10510 -10808 6796 27365 6218 1755 16275 23661 12055 9028
11262I028J352j6262p269Q769j2070k45R338p918k3075K0407K0365j665k705J875
$$ 9028 10380 -5882 -13151 -4382 -16452 -16697 -7359 -15277 -38352 -17945 2420 755 -1950 -75
11248g5o338M451J6948O650k610l003N667R987k680j6895j4572q388P020J474
$$ -75 -6413 -1962 14986 21636 19026 16023 21690 31677 28997 12102 -2470 -10858 -3838 -2364
11234b364J3428m190j7793j4555O57J519Q193O898K527p198l087J0580k327J1484
$$ -2364 11064 6874 -10919 -25474 -24817 -23298 -15105 -8207 -5680 -12878 -15965 -5385 -7712 3772
11220C772K473Q315J1754J0836K743n244J717j31J0655L1308K9373L2468L0578
$$ 3772 6245 14560 26314 37150 39893 34649 36366 36235 46890 78198 107571 140039 170617
11207A70617l76Q753J4828r051k3055k4322l3980k5797m0201l0310m552p930j6819
$$ 170617 170241 178994 193822 184771 161716 137394 103414 77617 37416 7106 2554 -5376 -22195
11194b2195J1851J7746j1337l894O512M034l093n795J1718l679P017j2069M946
$$ -22195 -10344 7402 -3935 -7829 -1317 2717 -376 -6171 5547 1868 8885 -3184 1762
11181A762J2300N013K071r224O854j9037m061k711j1529l077J9914K8966K4347
$$ 1762 14062 19075 21146 11922 18776 -261 -4322 -7033 -18562 -21639 -1725 27241 51588
11168E1588l710k6184m964n729O982J0463j5734O967P418j5278q21j3177l424
$$ 51588 47878 21694 16730 11001 17983 28446 12712 19679 27097 11819 10998 -2179 -5603
11155e603J7726J8726j7468n01j3671k1043j2499O038K7359K2940m161M289O843
$$ -5603 12123 30849 13381 12880 -791 -21834 -34333 -28295 -936 22004 17843 22132 28975
11142B8975p802o915K917j1308q238j3651j627k728J7484M310j1872M523R916
$$ 28975 21173 14258 17175 5867 -2371 -16022 -17649 -20377 -2893 1417 -10455 -5932 3984
11129C984Q594r31q48p539p708j5856j3454K155n57O953J9100J2594j2248r054
$$ 3984 12578 11647 10799 3260 -4448 -20304 -33758 -31603 -32160 -25207 -6107 6487 -5761 -14815
11115a4815J1181J7878N659q11L191J763j649k103j7635m681j1971Q909K0689
$$ -14815 -3634 14244 19903 19092 22283 24046 22397 20294 2659 -2022 -13993 -5084 15605
11102A5605R154j5366P20k625N846m280m553r379N954p25r703P500M486P5j2250
$$ 15605 24759 9393 10113 7488 13334 9054 4501 -4878 1076 351 -9352 -1852 2634 2709 -9541
11087i541o946J2540N046J325j3380l952k013J505M781m388j2147L178J5744R387
$$ -9541 -16487 -3947 1099 2424 -10956 -14908 -16921 -15416 -10635 -15023 -27170 -23992 -8248 1139
11073A139o268k078q37m971j0075o54k293J6552k89N315K404j0649O286r34K3807
$$ 1139 -5129 -7207 -8044 -13015 -23090 -23744 -26037 -9485 -9774 -4459 -2055 -12704 -6418 -7352 16455
11058A6455K2487o575j890j1874k1098J2838j652j921J1515l267n065Q620k5085
$$ 16455 38942 32367 30477 18603 -2495 10343 8691 6770 18285 15018 9953 18573 -6512
11045f512R793J6059l198J879n68J0998K0028N391o20K1560K2365J158l5067j5520
$$ -6512 3281 19340 16142 18021 17453 28451 48479 53870 53250 74810 97175 98333 63266 47746
11031D7746j0562l078Q245Q087K2457K5606R085J1895J4093k9902k2057l424Q715
$$ 47746 37184 34106 42351 50438 72895 98501 107586 119481 133574 103672 81615 78191 86906
11018H6906m914j5446r4K4680L8672j5692k135p850j0337p676K367J2866k0381
$$ 86906 81992 66546 66452 91132 129804 114112 111977 104127 93790 86114 88481 101347 80966
11005H0966l1593R240K1507q462l1255k7467j8141K35L097K1008J8938o157o847
$$ 80966 49373 58613 80120 71658 40403 12936 -5205 -4970 -1873 19135 38073 31916 25069
10992B5069K642n622N450J0704j7245m662p814n754O968k441Q090O336L132j6320
$$ 25069 27711 22089 27539 38243 20998 16336 8522 2768 9736 7295 15385 21721 24853 8533
10978H533o487l596N110K044J0113Q902j101l042J1901q464K891O507J7698j745
$$ 8533 2046 -1550 3560 5604 15717 24619 23518 20476 32377 23913 26804 33311 51009 49264
10964D9264j8713P427L0352J7070J125P758P126O486J9690K1849K4152M989j4390
$$ 49264 30551 37978 68330 85400 86525 94283 101409 107895 127585 149434 173586 178575 164185
10951A64185j9070m1204k6550k4852k0384j2452O735Q558J801k2752k4059J533
$$ 164185 145115 103911 77361 52509 32125 19673 26408 34966 36767 14015 -10044 -8511
10939h511k04Q29Q181j4839j9900J5833j738o464J7391L606n220j8245j7678P172
$$ -8511 -8715 -7886 295 -14544 -34444 -18611 -20349 -26813 -9422 -5816 -11036 -29281 -46959 -39787
10925c9787K5182Q747K254o042j0172p390K0840J5157J0810J4068j2494o046j3831
$$ -39787 -14605 -5858 -3604 -9646 -19818 -27208 -6368 8789 19599 33667 21173 15127 1296
10912A296j3719J396L2022l549N47m689p314j7906j142J7888l301m545j4004r666
$$ 1296 -12423 -11027 20995 17446 17993 13304 5990 -11916 -13058 4830 1529 -3016 -17020 -26686
10898b6686j652J9506J0125L497j0605J4861J6969j9990K911M591k2198j4698
$$ -26686 -28338 -8832 1293 4790 -5815 9046 26015 6025 8936 13527 -8671 -23369
10886b3369P733K2095p393O246j35l569p487L658K0881Q644P923r436j4490n803
$$ -23369 -15636 6459 -934 5312 5177 1608 -5879 -2221 18660 27304 35227 25791 11301 5498
10872E498L733r090J2636J2143J868j8058q767J2303J2362J3103j6397L233j9102
$$ 5498 9231 141 12777 24920 26788 8730 -37 12266 24628 37731 21334 24567 5465
10859E465j2830k658J8874J5854N243j574L877l447r27j9540J095J2149J4164
$$ 5465 -7365 -10023 8851 24705 29948 28374 32251 28804 27877 8337 9432 21581 35745
10846C5745j062M107l551k212j6259j7885J3424J2603l407q84k940r607P684K229
$$ 35745 34683 38790 35239 33027 16768 -1117 12307 24910 21503 20619 17679 8072 15756 17985
10832A7985m592k1004j2650m534L993J3527J5488P808q034J982N001j30j850q692
$$ 17985 13393 -7611 -20261 -24795 -20802 -7275 8213 16021 7987 9969 14970 14840 12990 4298
10818D298J676J492j1039j1410P495J7446J4833Q93j5916k43J9011K4279o200
$$ 4298 5974 7466 -3573 -14983 -7488 9958 24791 25684 9768 9525 28536 52815 46615
10805D6615k5123j7882J4786Q562p400O963J0677j6021j5177O363j4108O812J9361
$$ 46615 21492 3610 18396 26958 19558 26521 37198 21177 6000 12363 -1745 5067 24428
10792B4428J626M167j0101j9787r936j3362N282P219r459J6834O819j7242j758
$$ 24428 26054 30221 20120 333 -9603 -22965 -17683 -10464 -19923 -3089 3730 -13512 -15270
10779a5270J0760o67P679J1018L515r882J0259K3994K885j3486j4221M830J7497
$$ -15270 -4510 -5177 2502 13520 17035 7153 17412 41406 44291 30805 16584 21414 38911
10766C8911q868n078o484n44J0050r141j4122j254J4564M541j1039O395R922m017
$$ 38911 30043 24965 18481 17937 27987 18846 4724 3470 18034 22575 11536 17931 27853 23836
10752B3836J0570k468j3838k994O541L3j1609N41K6278Q440j8470j7972l698r128
$$ 23836 34406 31938 18100 15106 21647 21680 10071 10612 36890 45330 26860 8888 5190 -3938
10738c938r528k816K7820J7772J0419M297j1921l875j2661J2271J393j1044Q690
$$ -3938 -13466 -16282 11538 29310 39729 44026 32105 28230 15569 27840 29233 18189 26879
10725B6879p883J073k415k519J4030q90q41j2334q829k651J0193J2706R954R844
$$ 26879 18996 20069 17654 15135 29165 28275 27434 15100 6271 3620 13813 26519 36473 46317
10711D6317j663j3595L545K853Q825L838J587j0654m404J07J1364l302N72n883
$$ 46317 44654 31059 34604 37457 46282 50120 51707 41053 36649 36756 48120 44818 45390 39507
10697C9507k040K87J0620j3328O466J903j9462j9791j944R638J0328n842J1877
$$ 39507 37467 37754 48374 35046 41512 43415 23953 4162 2218 11856 22184 16342 28219
10684B8219p108K213J0645J0332m327k372N471r734p948K1255K2159r498k0342
$$ 28219 21111 23324 33969 44301 39974 37602 43073 33339 25391 46646 68805 59307 38965
10671C8965k3281K650J7255j0214l316K5913J2678J818j2485o767k479o219J8372
$$ 38965 15684 18334 35589 25375 22059 47972 60650 62468 49983 43216 40737 34518 52890
10658E2890k97J1778K0666m754l537k50N210J1454j1421q447j6819J3383K7004
$$ 52890 52593 64371 85037 80283 76746 76496 81706 93160 81739 73292 56473 69856 96860
10645I6860N685J3939l319l913J8250J7594K3524M0884J172K7845J1327L8074
$$ 96860 102545 116484 113165 109252 127502 145096 168620 209504 210676 238521 249848 287922
10633B87922M9796M4509N4456N2827N6251R1356J13134J94160K88495L54773M54810
$$ 287922 337718 382227 436683 489510 545761 637117 750251 944411 1232906 1587679 2042489
10622B042489N40860N91720N75948N08562M32929L60631K84492K11068J33311
$$ 2042489 2583349 3175069 3751017 4259579 4692508 5053139 5337631 5548699 5682010
10613E682010J69788L46210O25820Q65288R82544Q98280P30174N84294M67935
$$ 5682010 5851798 6198008 6823828 7689116 8671660 9569940 10300114 10884408 11352343
10604A1352343K99103P7484k37755k96516N938N04691R39850J099612R54986O55661
$$ 11352343 11651446 11728930 11491175 11194659 11200597 11705288 12645138 13744750 14699736 15355397
10594A5355397L95554J90478r0640n24912j051351j242311r23991l90626M0089
$$ 15355397 15750951 15941429 15850789 15325877 14274526 13032215 12108224 11717598 11757687
10585A1757687K35175K08360P6838p7231k28373m19890p33113j035587j116692
$$ 11757687 11992862 12201222 12278060 12200829 11972456 11552566 10819453 9783866 8667174
10576H667174r19931n91483l02904j52616j43360j88368k47271l10165m02740
$$ 8667174 7747243 7155760 6852856 6700240 6556880 6368512 6121241 5811076 5408336
10567E408336n19578o42712o85024n98076m89065l49977k64343k03125j66193
$$ 5408336 4888758 4246046 3561022 2962946 2473881 2123904 1859561 1656436 1490243
10558A490243j67211j31324j22471r4583o8347n3944m7162m4129n6682l8253k8837
$$ 1490243 1323032 1191708 1069237 974654 906307 852363 805201 761072 704390 666137 637300
10547F37300l0508l1041k9869k7218m1835k8228j2672p252k1307k2796k3850k6442
$$ 637300 606792 575751 545882 518664 476829 448601 435929 428677 407370 384574 360724 334282
10535C34282O560K645l1498q913n310j1128K461j0721k733j0930l1817k357R477
$$ 334282 340842 343487 311989 303076 297766 286638 289099 278378 275645 264715 232898 230541 240018
10522B40018l328k2038k8237j8252K2089J4356o314o344j9049j6457r90R590j0056
$$ 240018 236690 214652 186415 168163 190252 204608 198294 191950 172901 156444 155454 165044 154988
10509A54988p775N547j1090n419J708j5837q807J762J1369o147J3065M708r564
$$ 154988 147213 152760 141670 136251 137959 122122 113315 115077 126446 120299 133364 138072 128508
10496A28508o587j6902k4674m792K486j0378j0325P22N459J4051Q550j150k2491
$$ 128508 121921 105019 80345 75553 78039 67661 57336 58058 63517 77568 86118 84968 62477
10483F2477j7721N17J2257R375J9665M237j5690j5110q07J8196Q531r009K6912
$$ 62477 44756 45273 57530 66905 86570 90807 75117 60007 59200 77396 85927 76918 103830
10470A03830N822k3351q713j4220j8897j1410N31Q715J0163N610O345K004n665
$$ 103830 109652 86301 77588 63368 44471 33061 33592 42307 52470 58080 64425 66429 60764
10457F0764k491R346K424j5754J507K0589O863n746j5518j588n644k3557o60Q800
$$ 60764 58273 67619 70043 54289 55796 76385 83248 77502 61984 60396 54752 31195 30535 39335
10443C9335J0507J0484n643J3151j2036r605j7124J672Q300j2598J165Q899J878
$$ 39335 49842 60326 54683 67834 55798 46193 29069 30741 39041 26443 27608 36507 38385
10430C8385k2385o669O038l495J0193p27R06j019j3983j4950l752P837R117l158
$$ 38385 16000 9331 15369 11874 22067 21340 22246 21227 7244 -7706 -11458 -3621 5496 2338
10416B338l446q917K3408R682j3934l284r86l667K5637O019j2772n570j623p354
$$ 2338 -1108 -10025 13383 23065 9131 5847 4861 1194 26831 32850 20078 14508 12885 5531
10402E531Q013J9087j363j5997o067Q608J4871M859P517p099o108J1426Q173K174
$$ 5531 13544 32631 31268 15271 9204 17812 32683 37542 45059 37960 31852 43278 51451 53625
10388E3625j3000k0358j6041j3248K196J5251K3304J7063l121p996Q39r266j645
$$ 53625 40625 20267 4226 -9022 -6826 8425 31729 48792 45671 37675 38514 29248 27603
10375B7603O756j759m436N350P868j0909j9085j3772J3515K415P270R724q52o724
$$ 27603 34359 32600 28164 33514 41382 30473 11388 -2384 11131 13546 20816 30540 29688 22964
10361B2964l725p554j7856j213J9835j0609r62l382P138N721K2309L860O405q639
$$ 22964 19239 11685 -6171 -7384 12451 1842 880 -2502 4636 10357 32666 36526 42931 34292
10347C4292j874o489k2550j1661J8524k237k753K47M061r773O440K501J269r568
$$ 34292 32418 25929 3379 -8282 10242 8005 5252 5499 9560 -213 6227 8728 9997 429
10333D29R530j5498L934J1203M901q496j1301R117j2470Q804j242Q953j3730J614
$$ 429 9959 -5539 -1605 9598 14499 6003 -5298 3819 -8651 153 -1089 7864 -5866 -4252
10319d252K0614J1243j613p318j3706Q679J4063P339j4064j2051M801O149N010
$$ -4252 16362 27605 25992 18674 4968 13647 27710 35049 20985 8934 13735 19884 24894
10306B4894k4664l168J9474m998j0353P542P539J315m884n278N31l97L461K0486
$$ 24894 230 -2938 16536 11538 1185 8727 16266 17581 12697 7419 7950 7553 11014 31500
10292C1500j0611k016O395K002m109J052O42j9969j6956N926J1624k8894n901
$$ 31500 20889 18873 25268 27270 23161 24213 24855 4886 -12070 -6144 5480 -23414 -29315
10279b9315J0276K5103K1943O157O492J0131K226Q394L797K3925J6653j5902j4524
$$ -29315 -19039 6064 28007 34164 40656 50787 53013 61407 65204 89129 105782 89880 75356
10266G5356j8191k5526j0867J6893M020j3325j0034j923K290O523O036r510j3912
$$ 75356 57165 31639 20772 37665 41685 28360 18326 16403 18693 25216 31252 21742 7830
10253G830o480O223K2482j6486L632J2388n172j3269o89j8776j1254l677J3227
$$ 7830 1350 7573 30055 13569 17201 29589 24417 11148 10459 -8317 -19571 -23248 -10021
10240a0021K7725j726L780N68L978j0491k5571j4461o833J4933J2245j2356R851
$$ -10021 17704 15978 19758 20326 24304 13813 -11758 -26219 -33052 -18119 -5874 -18230 -8379
10227h379J5524M820o736J3388j2080M89j6200K380J183J7412J3144j1758j2179
$$ -8379 7145 11965 5229 18617 6537 7026 -9174 -6794 -5611 11801 24945 13187 1008
10214A008k540q391o230j1249k603L3028M725j7067j427k495R843J8243j600j5041
$$ 1008 -1532 -9923 -16153 -27402 -30005 3023 7748 -9319 -10746 -13241 -3398 14845 13245 -1796
10200a796K925m801J7959L491k1814j4218J3474k745J4621O628J3341N77l505
$$ -1796 1129 -3672 14287 17778 -4036 -18254 -4780 -7525 7096 13724 27065 27642 24137
10187B4137r499Q03K8144N040M153M391J8424j3633j026j2429j3894M850J2086
$$ 24137 14638 15441 43585 48625 52778 57169 75593 61960 60934 48505 34611 39461 51547
10174E1547J2932K1359j1422j5583k8311J2974J3201n653o534Q31Q292J8747j0059
$$ 51547 64479 85838 74416 58833 30522 43496 56697 51044 44510 45341 53633 72380 62321
10161F2321J0945J1931P738n211J0408P305K9346j641k3428k4559j7233q480n604
$$ 62321 73266 85197 92935 87724 98132 105437 134783 133142 109714 85155 67922 59442 53838
10148E3838P913J1030K1525q528j8386j106m281j4612j5174O867K4225p979j5294
$$ 53838 61751 72781 94306 85778 67392 66286 62005 47393 32219 39086 63311 55332 40038
10135D0038J3548l248p784j2910L0779J603k6322k1190J2601O363J5146r530j6964
$$ 40038 53586 50338 42554 29644 60423 62026 35704 14514 27115 33478 48624 39094 22130
10122B2130l599Q420j2861j3663k0127J4429J348m27L636j858K1448J4973Q192
$$ 22130 18531 26951 14090 427 -19700 -5271 -3923 -4350 -714 -2572 18876 33849 42041
10109D2041L969m31j2466j1073K175N17p09p616k6683O006J1710J4657k617r36
$$ 42041 46010 45579 33113 22040 24215 24732 24023 16407 -10276 -4270 7440 22097 19480 18544
10095A8544N406q295j2832P39j6759k0840l230R674J377J7650j655q479J2950
$$ 18544 23950 15655 2823 3562 -13197 -34037 -37267 -27593 -26216 -8566 -10221 -18700 -5750
10082e750O059M153K157K0158j041J12q780O011K576j3991r489l417K733J2399
$$ -5750 309 4462 6619 26777 25736 25848 17068 23079 25655 11664 2175 -1242 1491 13890
10068A3890j0951q210q400J4442J9301k750o836j3545K580J0904L678j0110j9347
$$ 13890 2939 -5271 -13671 771 20072 17322 10486 -3059 -479 10425 14103 3993 -15354
10055a5354o197k912j1652n928J2520K6454N152r779K3681K1131p388j5468P332
$$ -15354 -21551 -24463 -36115 -42043 -29523 -3069 2083 -7696 15985 37116 29728 14260 21592
10042B1592L879k0651l851J2215K631k1181r875J3696K0827m108K520q648Q460
$$ 21592 25471 4820 969 13184 15815 -5366 -15241 -1545 19282 15174 17694 9046 17506
10029A7506l245l682J1885Q929p058j7519m014j64J346J2629j853Q131m284J098
$$ 17506 14261 10579 22464 31393 24335 6816 2802 2638 3984 16613 14760 22891 18607 19705
10015A9705J583J206K852p345j0133R76O76q298k08J4158j3329k060K273O346
$$ 19705 21288 22494 25346 18001 7868 8844 9520 1222 1014 15172 1843 -217 2056 8402
10001H402K372K3524J875o645l272p319r56j2664p364k378j704L229J784k001
$$ 8402 10774 34298 36173 29528 26256 18937 17981 5317 -2047 -4425 -6129 -2900 -1116 -3117
9987c117Q539J2722n695m213j0768R268j340r76K6691L189p636j1081J900R974
$$ -3117 5422 18144 12449 8236 -2532 6736 5396 4420 31111 34300 26664 15583 17483 27457
9973B7457k568o595o07q846j943k46P158O285P198j407J4090p014r999P324j0463
$$ 27457 24889 18294 17687 8841 6898 6652 13810 20095 27293 25886 39976 32962 22963 30287 19824
9958A9824M354J7233n942p91R503n317j0529k7904k1269J4563P367P701K0873
$$ 19824 24178 41411 35469 34678 44181 38864 28335 431 -20838 -6275 1092 8793 29666
9945B9666J5445k1248j6197L217J0101J3249P401k3777j2806K0385J0104L107
$$ 29666 45111 23863 7666 10883 20984 34233 41634 17857 5051 25436 35540 38647
9933C8647j0575J3146P787j7141l1283l4537K807J5162o87O44J7175J7957J1396
$$ 38647 28072 41218 49005 31864 581 -33956 -31149 -15987 -16674 -16030 1145 19102 30498
9920C0498M117J3435m40n687k8870j0468J0376N657j659J1388J7887J4020p358
$$ 30498 34615 48050 47610 41923 13053 2585 12961 18618 16959 28347 46234 60254 52896
9907E2896k3022k0381p820J2354L1312M769k8027L535J0514n044j1652p62r399
$$ 52896 29874 9493 1673 14027 45339 50108 22081 25616 36130 31086 19434 18672 9273
9894I273r548R240k83r107j1890M077J5716J607m383L23k179M270k3018j2744
$$ 9273 -275 8965 8682 -425 -12315 -8238 7478 9085 4702 5025 2846 7116 -15902 -28646
9880b8646N906J978J8614L1788o758j3287r553j8373J2049J2388J4150l863J5459
$$ -28646 -22740 -20762 -2148 29640 22882 9595 42 -18331 -6282 6106 20256 16393 31852
9867C1852K1938l943j730j6632m0091j824J648j7249L386K9930N022J4477J6057
$$ 31852 53790 49847 48117 31485 -8606 -10430 -8782 -26031 -22645 7285 12307 26784 42841
9854D2841k553j0280L097n013m685j4468k5253N665O634k2474R868R294L0616
$$ 42841 40288 30008 33105 28092 23407 8939 -16314 -10649 -4015 -26489 -16621 -7327 23289
9841B3289O94j6564q402Q65r280J0918K0030n048J6247J655k1056r007p848M122
$$ 23289 23983 7419 -983 -118 -9398 1520 21550 16502 32749 34404 13348 4341 -3507 615
9827F15O621O946R940j303N196j2898J4875P2l279P431l013q581q278j155K1106
$$ 615 7236 14182 24122 22819 28015 15117 29992 30064 26785 34216 31203 22622 14344 13189 34295
9812C4295R651o8j6133j4821j2817n680Q180J7392P630K941Q617o555q075k683
$$ 34295 43946 43878 27745 12924 107 -5573 2607 19999 27629 30570 39187 32632 24557 21874
9798B1874j0203N970M148j6195q60K2586O831j6313j8207K35J2278O932r795K815
$$ 21874 11671 17641 21789 5594 4734 27320 34151 17838 -369 -134 12144 19076 9281 12096
9784A2096j9461j1702J9088J8605L42j2071j791o753k07R877K3907q424k851J5107
$$ 12096 -7365 -19067 21 18626 18968 6897 5106 -1647 -1854 8023 31930 23506 20655 35762
9770C5762k0453r008J4304K4875j309j0739k2858M439J1694j9541P869l500j1033
$$ 35762 15309 6301 20605 45480 44171 33432 10574 15013 26707 7166 15035 11535 502
9757E02M62j274R998J9263J3195l458j0577j8907M007J4246m742m735J059M863
$$ 502 964 -310 9688 28951 42146 38688 28111 9204 13211 27457 22715 17980 19039 23902
9743B3902R371L940p369m208J980j6153M291N158j8280j7339J1151J1665J677
$$ 23902 33273 37213 29844 25636 27616 11463 15754 20912 2632 -14707 -3556 8109 9786
9730I786K374l127J6062J4082J0094j395p608j9450l544q753J1442N16N915j8305
$$ 9786 12160 9033 25095 39177 49271 47876 40268 20818 17274 8521 19963 20479 26394 8089
9716H089j2589l663J1028K0886J0783Q053q350j1662L198q211j9897p693K8294
$$ 8089 -4500 -8163 2865 23751 34534 42587 34237 22575 25773 17562 -2335 -10028 18266
9703A8266J2792Q141n679O264K518k575J2445r01n08J0232q978M73o663J0686
$$ 18266 31058 39199 33520 39784 42302 39727 52172 51271 50763 60995 52017 52490 45827 56513
9689E6513O771J1006r0R930r179k0249r974n629m225j3997l998K1178o110o432
$$ 56513 63284 74290 74200 84130 74951 54702 44728 39099 34874 20877 16879 38057 31947 25515
9675B5515J5537j8083k0955R959K509N590O950M723j0917j113K4253o844j3053
$$ 25515 41052 22969 2014 11973 14482 20072 27022 31745 20828 19715 43968 37124 24071
9662B4071J0044j3927p74J5943l151J645L887k3764N30K5182K0720l491L962J013
$$ 24071 34115 20188 19414 35357 32206 33851 37738 13974 14504 39686 60406 56915 60877 61890
9648F1890j1705j9n640j3362j4468l697j145m790K472R734l010M891q21k058m195
$$ 61890 50185 50166 44526 31164 16696 12999 11854 7064 9536 19270 16260 21151 20330 18272 14077
9633A4077K4459J2688j0756l067R249J4470q13j4364J917j0738k0945j5162q501
$$ 14077 38536 51224 40468 37401 46650 61120 60307 45943 47860 37122 16177 1015 -7486
9620g486M123L3721J6940J6642j2312j6183J1598q350o744K910K011L873j530
$$ -7486 -3363 30358 47298 63940 51628 35445 47043 38693 31949 34859 36870 40743 39213
9607C9213K028J1905n83j0710J8310L1613Q82j8599j5290j8084j6116k040K7724
$$ 39213 41241 53146 52563 41853 60163 91776 92658 74059 58769 40685 24569 22529 50253
9594E0253R432k405j5294j3568R786K858n179R540j6535Q095Q3M468R031J2021
$$ 50253 59685 57280 41986 28418 38204 41062 35883 45423 28888 36983 37066 41534 50565 62586
9580F2586j718r656k553R272r744k7484q357O883O349J541M914Q636m470Q319
$$ 62586 60868 51212 48659 57931 48187 20703 12346 19229 25578 27119 32033 40669 36199 44518
9566D4518Q191m246q334j249Q29J011M318J96O927R479J9326Q430j512k1022n655
$$ 44518 52709 48463 40129 38880 39709 40720 45038 45234 52161 61640 80966 89396 87884 66862 61207
9551F1207K153J2970J3159J887k157n017P958j5676j4996j5160K098N31k470L222
$$ 61207 63360 76330 89489 91376 89219 84202 92160 76484 61488 46328 48426 48957 46487 49709
9537D9709j6953Q79m917K234J2007J0362P393j0369j4448K677l466j980n768j769
$$ 49709 32756 33635 28718 30952 42959 53321 60714 50345 35897 38574 35108 33128 27360 25591
9523B5591J4737J454j3948j920O361j982p97R759j965j2987j3834J1141M0435
$$ 25591 40328 41782 27834 25914 32275 30293 29496 39255 37290 24303 10469 21610 62045
9510F2045k404j0067j6191J7903K2864j7741j6321L4J2423J3925O306L710j001
$$ 62045 59641 49574 33383 51286 74150 56409 40088 40122 52545 66470 72776 76486 75485
9497G5485l694J6470N87j4936j6749J3115l066q134p296p026l4k632K1512K0594
$$ 75485 71791 88261 88848 73912 57163 70278 67212 59078 51782 44756 44722 42090 63602 84196
9483H4196j3392j1228r294L094O360O014p62j0748q454l947J9304K3609j3702
$$ 84196 70804 59576 50282 53376 59736 65750 64988 54240 45786 41839 61143 84752 71050
9470G1050K380j1177p084q659m637J1308O805o035k7115m787j178r163m681K1419
$$ 71050 73430 62253 55169 46510 41873 53181 59986 53951 26836 22049 20871 11708 7027 28446
9456B8446O48K2215P860K155o858k132l321J4153K183j1882J585K2076k724j1009
$$ 28446 29094 51309 59169 61324 54466 52334 49013 63166 65349 53467 55052 77128 74404 63395
9442F3395p948j874N797K9265L383l2712j5725n722K394N336K2843j1416j1984
$$ 63395 55447 53573 59370 88635 92018 59306 43581 37859 40253 45589 68432 57016 45032
9429D5032J4693k144q80M851n853j8530K4102L4206P745r033j5973k3058m058
$$ 45032 59725 57581 56701 61552 55699 37169 61271 95477 103222 94189 78216 55158 51100
9416E1100K158m443P029J2391R384m803j6097j4658J173N988J5634R44k1814m993
$$ 51100 53258 48815 55844 68235 77619 72816 56719 42061 43234 49222 64856 65800 43986 38993
9402C8993O461O362q871j187K6396R787m61J7260P739m559j5202n395l2184k114
$$ 38993 45454 51816 42945 41758 68154 77941 77480 94740 102479 97920 82718 77323 45139 43025
9388D3025P180J816K4308P550j8475q913M217J7231M964j948n586j8728R867J9151
$$ 43025 50205 52021 76329 83879 65404 56491 60708 77939 82903 80955 75369 56641 66508 85659
9374H5659K2045q947p241L50l06m846K319j853M025j1744k3452o298K1073M857
$$ 85659 107704 98757 91516 91866 91560 86714 89033 87180 91205 79461 56009 49711 70784 75641
9360G5641j2037O005J0252q068k472L147j1958m42J1253p199J5056J3742K78j7749
$$ 75641 63604 69609 79861 71793 69321 72468 60510 60068 71321 64122 79178 92920 93198 75449
9346G5449r18M17L669J1302L8030Q611j7077j2477J215Q630M233O246n502j6531
$$ 75449 74531 74948 78617 89919 127949 136560 119483 107006 108221 116851 121084 127330 121828 105297
9332A05297m151K902N409k654m920j720m637j3914j2065K4464J0986N055J71j9595
$$ 105297 101146 104048 109457 106803 101883 100163 95526 81612 69547 94011 104997 110052 110223 90628
9318I0628l350K8407M031r827R947Q242k0736k3699p073O675J8393N033M507J5193
$$ 90628 87278 115685 119716 109889 119836 128078 107342 83643 76570 83245 101638 106671 111178 126371
9304A26371J275n671O265n769k9988j041J4862J9954M308k781j9193j5696J6825
$$ 126371 127646 121975 128240 122471 92483 91442 106304 126258 130566 127785 108592 92896 109721
9291A09721L435j359M28L40k7137O655L4056L59j2844J5568K4554r686j8034k142
$$ 109721 113156 111797 112225 112565 85428 92083 126139 126498 113654 129222 153776 144090 126056 123914
9277A23914J5887p510q95m96j4008Q212M300R464K612o333j0391P804K6070K5463
$$ 123914 139801 132291 131396 130900 116892 125104 129404 138868 141480 135147 124756 132560 158630 184093
9263A84093m922j0825J1529K4183K476p861K3789K7826J1886q929n335k5834L138
$$ 184093 179171 168346 179875 204058 206534 198673 222462 250288 262174 253245 247910 222076 225214
9250B25214J4970J1891j5148M497J9111K2347K3447K4218K6549L231K0509M1486
$$ 225214 240184 252075 236927 241424 260535 282882 306329 330547 357096 360327 380836 422322
9238D22322N6040M0425M9408N8045N8357P0451R4263Q6072J11716J18542J45475
$$ 422322 478362 518787 568195 626240 684597 755048 849311 935383 1047099 1165641 1311116
9227A311116J44046J52609J48928J29134J03880Q8016M4826K1452j1457l2393
$$ 1311116 1455162 1607771 1756699 1885833 1989713 2077729 2122555 2144007 2132550 2100157
9217B100157n4934j25387j14541j17403j19522j18938j08338j25817j07382r0479
$$ 2100157 2045223 1919836 1805295 1687892 1568370 1449432 1341094 1215277 1107895 1017416
9207A017416o7181p1476m4653m7922n6519m1149l0051n2409l2790j2009k3810
$$ 1017416 950235 878759 834106 786184 729665 688516 658465 606056 573266 561257 537447
9196E37447m5878k6105k3284j8763M500p302j6055k0293j1715o407j9776n30j294
$$ 537447 491569 465464 442180 423417 427917 420615 404560 384267 372552 366145 346369 345839 344545
9183C44545j6067j6456j8302j0336J6474Q209j460n642j0376l030j2884j1621
$$ 344545 328478 312022 293720 283384 299858 308067 306607 300965 290589 287559 274675 263054
9171B63054j770L431L471n014k1381j2940r904j5Q410j2640p861L84P192k858
$$ 263054 261284 264715 268186 263172 241791 228851 218947 218932 227342 214702 206841 207225 214417 211559
9157B11559j2113M330m42M102Q142L960J973P01K6289r838k7903o978N453J600
$$ 211559 199446 203776 203334 207436 215578 219538 221511 222212 248501 238663 210760 203782 209235 210835
9143B10835j3230l693P031j1209m62j3705j7666J2995N205j1172r855r511j3124
$$ 210835 197605 193912 200943 189734 189272 175567 157901 170896 176101 164929 155074 145563 132439
9130A32439l881J5844K1482K0601N821j8525j6610M787P450K0422K2027N811l065
$$ 132439 128558 144402 165884 186485 192306 173781 157171 161958 169408 189830 211857 217668 214603
9117B14603n245P535J3350n672J0949R850j2902k8196j7882j6261q556J3114K5454
$$ 214603 209358 216893 230243 224571 235520 245370 232468 204272 186390 170129 161573 174687 200141
9104B00141O352Q269K660m39J009o877k285J4720J3224j2207M813J2234P158J6080
$$ 200141 206493 214762 217422 216983 217992 211115 208830 223550 236774 224567 229380 241614 248772 264852
9090B64852J5313J9588L4919L7586L1006L2113L5951N2265N8574J5757L5969L6544
$$ 264852 280165 299753 334672 372258 403264 435377 471328 523593 582167 597924 633893 670437
9078F70437J4960K181Q09K1670k8341n4480j7037j6194m0159n0572l7466n2466
$$ 670437 685397 687578 688387 710057 681716 627236 610199 594005 553846 503274 465808 413342
9066D13342m7483k0246p482k1334j5882K70J1962K3876O621j5117l9953j9650
$$ 413342 365859 345613 338131 316797 300915 301185 313147 337023 343644 328527 288574 268924
9054B68924L259j778k483M809j501J2221k088R002J7357N049l745J9648K1388
$$ 268924 272183 270405 267922 272731 271230 283451 281363 290365 307722 312771 309026 328674 350062
9041C50062r555k0005k980p156J6844O541J112j309J2176K795o750R37O335J9238
$$ 350062 340507 320502 317522 310366 327210 333751 334863 333554 345730 348525 341775 342712 349047 368285
9027C68285L857j3707L581p367p284r653k1380M898J0142L705K3687K1760J9125
$$ 368285 372142 358435 362016 354649 347365 337712 316332 321230 331372 335077 358764 380524 399649
9014C99649p34O3r092l980M364J0073k4217k0356R615R801Q30J0900R885P946
$$ 399649 398915 398978 389886 385906 390270 400343 376126 355770 365385 375186 376016 386916 396801 404747
9000D04747j7765J9883J6328N231J0512O437J1168L866l806q749j4465L822O246
$$ 404747 386982 406865 423193 428424 438936 445373 456541 460407 456601 447852 433387 437209 443455
8987D43455j542P191J337r127p235O824J9836J5787N180K0824J7895K1080J9344
$$ 443455 441913 449104 450441 441314 434079 440903 460739 476526 481706 502530 520425 541505 560849
8974E60849K2537L2854K8619J6179P245J2305O611J021K248J3124L660K6140K2474
$$ 560849 583386 616240 644859 661038 668283 680588 687199 688220 690468 703592 707252 733392 755866
8961G55866K7505K1032L2393J1186J6838K6457M0756M9641M0812R639K3934K9276
$$ 755866 783371 804403 836796 847982 864820 891277 932033 981674 1022486 1032125 1056059 1085335
8949A085335K6583K9137L9797Q831K8623J8398J7978N825J9378J658J4333n988
$$ 1085335 1111918 1141055 1180852 1189683 1218306 1236704 1254682 1260507 1279885 1281543 1295876 1289888
8937A289888J051j835n144j4011J3362P721M251J527Q501L3510J3030j6551K0500
$$ 1289888 1290939 1289104 1283960 1269949 1283311 1291032 1295283 1296810 1305311 1338821 1351851 1335300 1355800
8924A355800K6699K8930K0597K3449K4791K2425N1638K5414k67L3495M1798K4747
$$ 1355800 1382499 1411429 1432026 1455475 1480266 1502691 1554329 1579743 1579476 1612971 1654769 1679516
8912A679516L6890L7202M6923N5308L8920N4498N0691M3345L5332M9412O2159
$$ 1679516 1716406 1753608 1800531 1855839 1894759 1949257 1999948 2043293 2078625 2128037 2190196
8901B190196M2486M4463O8328P0446Q7363Q2259P6009Q6153P9471P2701R3926
$$ 2190196 2232682 2277145 2345473 2415919 2503282 2585541 2661550 2747703 2827174 2899875 2993801
8890B993801J18415J14843J13219J16966J10487R6696J34981J37778J13568J34883
$$ 2993801 3112216 3227059 3340278 3457244 3567731 3664427 3799408 3937186 4050754 4185637
8880D185637J67084J51318J55426J99673J95436J99128K25250K53348K80196K94365
$$ 4185637 4352721 4504039 4659465 4859138 5054574 5253702 5478952 5732300 6012496 6306861
8870F306861K83341L04914L48017L54882L59638M05853M49827N15713N35534O07520
$$ 6306861 6590202 6895116 7243133 7598015 7957653 8363506 8813333 9329046 9864580 10472100
8860A0472100O76984P47787Q13139Q72178R86161J096522J178859J277813J395249
$$ 10472100 11149084 11896871 12710010 13582188 14568349 15664871 16843730 18121543 19516792
8851A9516792J538457J698709J884727K111589K358918K687350L095008L565421
$$ 19516792 21055249 22753958 24638685 26750274 29109192 31796542 34891550 38456971
8843C8456971M158868M803340N530106O408081P486282Q762041J0325198J2302592
$$ 38456971 42615839 47419179 52949285 59357366 66843648 75605689 85930887 98233479
8835I8233479J4742584J7776195K1478586K5775133L0452294L4963170L8380024
$$ 98233479 112976063 130752258 152230844 178005977 208458271 243421441 281801465
8828B81801465L9651103L7952499L3278359K6161131J7418622P472467l317036
$$ 281801465 321452568 359405067 392683426 418844557 436263179 443735646 440418610
8821D40418610j4455569k4668120l2186393l5805962l5687573l2981003k9125768
$$ 440418610 425963041 401294921 369108528 333302566 297614993 264633990 235508222
8814B35508222k5110442k1488863j8430156j5947971j3903996j2249778j0922783
$$ 235508222 210397780 188908917 170478761 154530790 140626794 128377016 117454233
8807A17454233r757968q778937p912665p110365o393050n715948n104267m562387
$$ 117454233 107696265 98917328 91004663 83894298 77501248 71785300 66681033 62118646
8799F2118646m080054l630273l284705k940223k640213k433780k247547k057326
$$ 62118646 58038592 54408319 51123614 48183391 45543178 43109398 40861851 38804525
8791C8804525j888007j785723j665908j567722j476041j365508j282612j200540
$$ 38804525 36916518 35130795 33464887 31897165 30421124 29055616 27773004 26572464
8783B6572464j120642j063632j003952r67655r04769q51041q13558p81027p26816
$$ 26572464 25451822 24388190 23384238 22416583 21511814 20660773 19847215 19066188 18339372
8774A8339372p06708o91578o63332o30912o16996n78379n58730n18228m95066
$$ 18339372 17632664 16941086 16277754 15646842 15029846 14451467 13892737 13374509 12879443
8765A2879443m72955m44582m54026m41190m34874l95715l55141l45229l37426
$$ 12879443 12406488 11961906 11507880 11066690 10631816 10236101 9880960 9535731 9198305
8756I198305l15727l16056k81727k78068k74689k66234k50471k17133k19797k25954
$$ 9198305 8882578 8566522 8284795 8006727 7732038 7465804 7215333 6998200 6778403 6552449
8746F552449k06099k06897k17094j94026j73551j90088j76138j59051j60453j61635
$$ 6552449 6346350 6139453 5922359 5728333 5554782 5364694 5188556 5029505 4869052 4707417
8736D707417j39205j39688j39808j24292j09982j20171j16151j45544j13871q2663
$$ 4707417 4568212 4428524 4288716 4164424 4054442 3934271 3818120 3672576 3558705 3476042
8726C476042q5109p4230r0689r0208p2831p9348r1254q6402q9230q3929o8170
$$ 3476042 3390933 3316703 3226014 3135806 3062975 2983627 2892373 2805971 2716741 2632812 2564642
8715B564642m9903n0649o0759n1400o7462n7392m7518m7342k7191k3896m0008
$$ 2564642 2514739 2464090 2403331 2351931 2284469 2227077 2179559 2132217 2105026 2081130 2041122
8704B041122p821L298p340l3479m8569l1975j1910P338j3857k5797l4123l0861
$$ 2041122 2033301 2036599 2029259 1995780 1947211 1915236 1903326 1910664 1896807 1871010 1836887 1806026
8692A806026k2902k8954m2703l2877j7548j4422k4890k5782o0370n0039l8479
$$ 1806026 1783124 1754170 1711467 1678590 1661042 1646620 1621730 1595948 1535578 1485539 1447060
8681A447060j3717l3780j6462k8213n9307n6922n7677m0029j6476j3067k151k1154
$$ 1447060 1433343 1399563 1383101 1354888 1295581 1238659 1180982 1140953 1124477 1111410 1109259 1088105
8669A088105l8962l7689k8941j0288r04k0270k1097K219j0908j1408k2663l4975
$$ 1088105 1049143 1011454 982513 972225 971321 951051 929954 932173 921265 909857 887194 852219
8657H52219l942k8113l9291p576l849j1867j9859j2592k799j1497m637m744O589
$$ 852219 848277 820164 780873 773297 769448 757581 737722 725130 722331 710834 706197 701453 708042
8644G08042j2688k2430k3945k0250O932J2890k7977j8103p555r007J949j2479
$$ 708042 695354 672924 648979 628729 635661 648551 620574 602471 594916 585909 587858 575379
8632E75379n989j4684k2815l7581j2089J4515J7270J1562k2238r375p212l5003
$$ 575379 569390 554706 531891 494310 482221 496736 514006 525568 503330 493955 486743 451740
8620D51740k3982j3532N180j1253m447k0735j3973J7979j8256rJ7580N573k3705
$$ 451740 427758 414226 419406 408153 403706 382971 368998 386977 368721 368712 386292 391865 368160
8607C68160j9935p163J6179N499Q652L38m595r060N587J6243Q769R215Q93r07
$$ 368160 348225 341062 357241 362740 371392 371730 367135 358075 363662 379905 388674 397889 398782 397875
8593C97875j1593j3262L824j078j25j1583j5795j1125k1K186r407r374j067J276
$$ 397875 386282 373020 376844 375766 375641 364058 348263 337138 337117 339303 329896 320522 319455 320731
8579C20731n223k2719n135L316q814R172j2896k7826j4500M984l578J3409J0066
$$ 320731 315508 292789 287654 290970 282156 291328 278432 250606 236106 241090 237512 250921 260987
8566B60987p561q266J5231j2046j727p834j3926l65M806Q573J6060m946k221J0489
$$ 260987 253426 245160 260391 248345 246618 238784 224858 224493 229299 237872 253932 248986 246765 257254
8552B57254j108j0987J993l979K205p188j6654N320J1486p344j7531j5104J0980
$$ 257254 256146 245159 247152 243173 245378 238190 221536 226856 238342 230998 213467 198363 209343
8539B09343j2564j0837K281j0202O414k050k0430m12n239K1111j7999r152J7452
$$ 209343 196779 185942 188223 178021 184435 182385 161955 161543 156304 177415 159416 150264 167716
8526A67716Q500j7490j125M278P298J407Q026J6812L444k594k558N188m092j2715
$$ 167716 176216 158726 157601 161879 169177 170584 178610 195422 198866 196272 193714 198902 194810 182095
8512A82095L670Q691N908j0462M323l7J5922j1668j2257j6793j9689j2643k086
$$ 182095 185765 194456 200364 189902 194225 194188 210110 198442 186185 169392 149703 137060 134974
8499A34974R957Q960q103J481j5121L682p751n287m773J0805j0867K5j3032o847
$$ 134974 144931 153891 145788 147269 132148 135830 128079 122792 118019 128824 117957 117982 104950 98103
8485I8103N676j3875K887K320Q404J7701m902N187M101j4007M798j7641j4377
$$ 98103 103779 89904 92791 95111 103515 121216 116314 121501 125602 111595 116393 98752 84375
8472H4375J5284k650k670P823J1987K3219j6348o378J5507J9413O376l048R303
$$ 84375 99659 97009 94339 102162 114149 137368 121020 114642 130149 149562 155938 152890 162193
8459A62193j709k2368k225P671r124k0632o248J4787l234J507K1177L4096K6611
$$ 162193 160484 138116 135891 143562 134438 113806 107558 122345 119111 120618 141795 175891 202502
8446B02502K2717L270J8143L0559J7023L8619K1520K3700K2840K0882M8713P0498
$$ 202502 225219 228489 246632 277191 294214 332833 354353 378053 400893 421775 470488 540986
8434E40986O1166Q7764Q2122R3715J17022J28789J40977J46624J33883J20041
$$ 540986 602152 689916 772038 865753 982775 1111564 1252541 1399165 1533048 1653089
8424A653089J35464J22948R1437N1235K9674l869n1345q0555q1238q8294r9984
$$ 1653089 1788553 1911501 2002938 2054173 2083847 2079978 2028633 1948078 1866840 1778546 1678562
8413A678562j05119j26541j15002j27248r8066o7751q3974r5914p6344n5890o4150
$$ 1678562 1573443 1446902 1331900 1204652 1106586 1038835 954861 858947 782603 726713 662563
8402F62563n4108n2333n6490l7642l4743l5186k1664J2509r732J0226N036J497
$$ 662563 608455 556122 499632 461990 427247 392061 370397 382906 373174 383400 388436 389933
8390C89933J7676J2041J3781J133j7924r859P564k4142o5830o8022k8256r010
$$ 389933 407609 419650 433431 434564 416640 406781 414345 390203 324373 256351 228095 219085
8378B19085k6475k9468j4104n430j1612j7035M953N560J3944K1911Q36j7775r705
$$ 219085 192610 163142 149038 143608 131996 114961 119914 125474 139418 161329 162165 144390 134685
8365A34685q916k6574m106p63J8774L526Q068J42j9973l1942j0434l084J5058
$$ 134685 125769 99195 95089 94326 113100 116626 124694 124836 104863 72921 62487 59403 74461
8352G4461J4752J7232k224j6957m621l088J019j5672o25J5874R685p469Q91K2764
$$ 74461 89213 106445 104221 87264 82643 79555 80574 64902 64277 80151 89836 82367 83258 106022
8338A06022J3250j1894k1107n572k3867j0766k038J9658R661j2090K274q957j2876
$$ 106022 119272 107378 86271 80699 56832 46066 44028 63686 73347 61257 63531 54574 41698
8325D1698J2724L208K815j11q228k472o374o538J0600J3809K139j2917j5371R73
$$ 41698 54422 57630 60445 60334 52106 49634 43260 36722 47322 61131 63270 50353 34982 35955
8311C5955J5232j8044j3424j058J989N336J6874L916r440L282J294q797m365p855
$$ 35955 51187 33143 19719 18661 20650 25986 42860 46776 37336 40618 41912 33115 28750 20895
8297B0895J376J5202l260J6486n822Q49n859P528J0642q914j3941j4924j7673
$$ 20895 22271 37473 34213 50699 44877 45726 39867 47395 58037 49123 35182 20258 2585
8284B585J4022Q626K752R514o174P261J1549j1160j461j412J808J0238p127j8152
$$ 2585 16607 25233 27985 37499 31325 38586 50135 38975 37514 36102 37910 48148 41021 22869
8270B2869K018k282m502m253j2743O991J5999j0794j5487p12N410J2756k59J9442
$$ 22869 24887 22605 18103 13850 1107 8098 24097 13303 -2184 -2896 2514 15270 15011 34453
8256C4453K914O481J0973j6986j6647q778J2128k332j115k013M683O649m345q138
$$ 34453 37367 43848 54821 37835 21188 12410 24538 22206 21091 19078 23761 30410 26065 17927
8242A7927j7474O435K3360L2290q079k0852o285P440J4581n15j5607n777J924
$$ 17927 453 6888 30248 62538 54459 33607 27322 34762 49343 48828 33221 27444 29368
8229B9368r888P24J2036J0845j556j8425o136J3180n926N228O218q148j0922J1501
$$ 29368 19480 20204 32240 43085 41529 23104 16968 30148 24222 29450 35668 27520 16598 28099
8215B8099K7912N079K395K132j2173l132j2969J8047o832j5445P121j2700n107
$$ 28099 56011 61090 63485 65617 53444 50312 37343 55390 48558 33113 40234 27534 22427
8202B2427L034j0306m111l216L157p499n128M552J1885K1818j561k716J2329L566
$$ 22427 25461 15155 11044 7828 10985 3486 -1642 2910 14795 36613 35052 32336 44665 48231
8188D8231k895r934j3052l101r822p501J3922J710K370K418K744l0486r809o078
$$ 48231 45336 35402 22350 19249 9427 1926 15848 17558 19928 22346 25090 -5396 -15205 -21283
8174b1283J2220J0329J3273J7125Q825q668k496j540K25j3415j0910r889M954
$$ -21283 -9063 1266 14539 31664 40489 31821 29325 27785 28010 14595 3685 -6204 -1250
8161a250R453O593J052L390r289m342L73J4037J4994R358p176k957l579k698j3777
$$ -1250 8203 14796 15848 19238 9949 5607 5980 20017 35011 44369 37193 34236 30657 27959 14182
8146A4182r47n690M926p640l557m110n734K679J0617J0658r145j3582O389K0728
$$ 14182 13235 7545 12471 4831 1274 -2836 -8570 -5891 4726 15384 6239 -7343 -954 19774
8132A9774J7490r769k5324N58j0441N920J4627J2181Q428r677n509k452j6182
$$ 19774 37264 27495 2171 2729 -7712 -1792 12835 25016 33444 23767 18258 15806 -376
8119c76J1429R800r3n574Q960N408j4152j0726M407O587j5019k548O790N200R282
$$ -376 11053 20853 20760 15186 24146 29554 15402 4676 9083 15670 651 -1897 4893 10093 19375
8104A9375J0380Q968j5664l486j0333K825j0930j3822r499L910L735J0884K392
$$ 19375 29755 38723 23059 19573 9240 12065 1135 -12687 -22186 -18276 -14541 -3657 -1265
8091a265l916R908l00j8434o601o152M614r04p753n110j0124J9216J7733L212
$$ -1265 -5181 4727 4427 -14007 -20608 -26760 -22146 -23050 -30803 -35913 -46037 -26821 -9088 -5876
8077e876p366l188O045j625P62J2368m550o218O929K183O967p839j2696r804N834
$$ -5876 -13242 -16430 -10385 -12010 -11248 1120 -3430 -9648 -2719 -536 6431 -1408 -14104 -23908 -18074
8062a8074L023L620j954q705L030N539J362J3867l13J2848N468p210o083n746
$$ -18074 -15051 -11431 -13385 -22090 -19060 -13521 -12159 1708 1395 14243 19711 12501 6418 672
8048F72j1842j5523J054N145R130K4759J1102r976m096r337J1448M441k2098q772
$$ 672 -11170 -26693 -25639 -20494 -11364 13395 24497 14521 10425 1088 12536 16977 -5121 -13893
8034a3893J1383M870K463k462Q484M431L828p456L632K490p676j1226J836L918
$$ -13893 -2510 2360 4823 2361 10845 15276 19104 11648 15280 17770 10094 -1132 704 4622
8020D622o433n700r6K2115R873n042l525P76J0071o666L834N60o046L675J4803
$$ 4622 -1811 -7511 -7607 14508 24381 19339 15814 16590 26661 19995 23829 24389 18343 22018 36821
8005C6821J565j5116r806l633M115m69J668o143j0398J997l007M860J829J3524
$$ 36821 38386 23270 13464 9831 13946 13477 15145 9002 -1396 601 -2406 2454 4283 17807
7991A7807O151n69k850O709l304l4008l196J7990J1644J828K968k5954j2335P072
$$ 17807 23958 23389 20539 27248 23944 -10064 -13260 4730 16374 18202 21170 -4784 -17119 -10047
7977a0047r001O270L136q670M488J6279J933j7592p625m438L5875J7837j3928
$$ -10047 -19048 -12778 -9642 -18312 -13824 2455 4388 -13204 -20829 -25267 10608 28445 14517
7964A4517J051j7779J3920K4388j0285j5322k286L279q266O23p014q773n615J6785
$$ 14517 15568 -2211 11709 36097 25812 10490 8204 11483 3217 3840 -3174 -11947 -17562 -777
7950g77J8779n603J5321j4958j7278j1027m36J8162J0448n371m214j3859N319
$$ -777 18002 12399 27720 12762 -4516 -15543 -15979 2183 12631 7260 3046 -10813 -5494
7937e494M970J2517J3379J0430n224j1974n043R801j2344j48J746j5248N939k846
$$ -5494 -524 11993 25372 35802 30578 18604 13561 23362 11018 10870 12616 -2632 3307 461
7923D61O145m781j1529P252k712R429J4711N950k008j0508k2123j2093o3J4049
$$ 461 6606 1825 -9704 -2452 -5164 4265 18976 24926 22918 12410 -9713 -21806 -21869 -7820
7909g820K5144k025j5732j1086J2700K3265J0032j9130j8813J3007J1027J518
$$ -7820 17324 15299 -433 -11519 1181 24446 34478 15348 -3465 9542 20569 22087
7897B2087j2932m82j5844M045M261p187p313M688o441l2099M109m425L641K1261
$$ 22087 9155 8673 -7171 -3126 1135 -6052 -13365 -8677 -15118 -47217 -43108 -47533 -43892 -22631
7883b2631J7310M355M71M82J0566j373l651o480j5342n352J3276R54m406J2493
$$ -22631 -5321 -966 -495 -13 10553 9180 5529 -951 -16293 -21645 -8369 -7415 -11821 672
7869F72m86k7508M113K5888K495m988j3937n161Q81K2164L758j3228K423M665
$$ 672 186 -27322 -23209 2679 5174 186 -13751 -18912 -18031 4133 7891 -5337 -2914 1751
7855A751r753j0055q819k3077O255K2399J8719P539N69j0625N610q753R755J1494
$$ 1751 -8002 -18057 -26876 -49953 -43698 -21299 -2580 4959 5528 -5097 513 -8240 1515 13009
7841A3009j3366p048j5570K358J5448J4731j1193N004l871o540l0935k220K0934
$$ 13009 -357 -7405 -22975 -20617 -5169 9562 -1631 3373 -498 -7038 -37973 -40193 -19259
7828a9259R080M998J096N051K1094k018n297K4610j1241k3195j1121J6520R655
$$ -19259 -10179 -5181 -4085 966 22060 20042 14745 39355 28114 4919 -6202 10318 19973
7815A9973q054o530N726j044j4504k214M273K0376M710r479p767J4738q891J842
$$ 19973 11919 5389 11115 10071 -4433 -6647 -2374 18002 22712 13233 5466 20204 11313 13155
7801A3155k022o801j7483j75l028Q627P706j0046l356k912Q167j574j0719M049
$$ 13155 11133 4332 -13151 -13326 -16354 -7727 -21 -10067 -13423 -16335 -8168 -9742 -20461 -16412
7787a6412K2071P526m801j6070J8886J1013R679j4868q853M75l50j7471J0299
$$ -16412 5659 13185 8384 -7686 11200 22213 31892 17024 8171 8646 8296 -9175 1124
7774A124M299n95n965m883p130j3307j3746m919O023Q992P791J0595P476j0527
$$ 1124 5423 4828 -1137 -6020 -13150 -26457 -40203 -45122 -39099 -30107 -22316 -11721 -4245 -14772
7760a4772j170J307L531q778m411K3475J1799r756M925l22j7085k944M92r910
$$ -14772 -15942 -14635 -11104 -19882 -24293 -818 10981 1225 6150 5828 -11257 -14201 -13709 -23619
7746b3619J200J0786J3640J0096j5254l27J9620R066j1291N194j3734j1061J3807
$$ -23619 -22419 -11633 2007 12103 -3151 -3478 16142 25208 13917 19111 5377 -5684 8123
7733H123N235m343K697R395J1110j6907o712P349o156J9319Q936k183k8875r129
$$ 8123 13358 9015 11712 21107 32217 15310 8598 15947 9791 29110 38046 35863 6988 -2141
7719b141l233J0887J0696r682j356m194j4624O145M725k459p973K4624L840j8815
$$ -2141 -5374 5513 16209 6527 5171 977 -13647 -7502 -2777 -5236 -13209 11415 15255 -3560
7705c560K306J8563K935Q70r212p400j0624q095q222Q120o88M197P97J5915R234
$$ -3560 -1254 17309 20244 21114 11902 4502 -6122 -14217 -22439 -14319 -15007 -10810 -10013 5902 15136
7690A5136N246l976j0986j4396j7434j9165K7885K2095n54l151j3425j0333K495
$$ 15136 20382 16406 5420 -8976 -26410 -45575 -17690 4405 3851 700 -12725 -23058 -20563
7677b0563J1499k672r191o026Q315J9314m463J488n238k8944L524J1545J1951
$$ -20563 -9064 -11736 -20927 -26953 -18638 676 -3787 -2299 -7537 -36481 -32957 -21412 -9461
7664i461J0574j976l382J78J7550N829r447r721l894J1307R187M980J43j7617
$$ -9461 1113 -863 -4245 -4067 13483 19312 9865 144 -3750 7557 16744 21724 21867 4250
7650D250j2627P965R441j3607M327r260K155J2779m980K740J5563j2945j7186
$$ 4250 -8377 -412 9029 -4578 -251 -9511 -7356 5423 443 3183 18746 5801 -11385
7637a1385l430p037K894l341Q311p80k775N336n067j1220l498o484L942K0393
$$ -11385 -14815 -21852 -18958 -22299 -13988 -14768 -17543 -12207 -17274 -28494 -31992 -38476 -34534 -14141
7623a4141p362j0031j139k849j1395K2170l84n021N449R657j4259K1897L627n154
$$ -14141 -21503 -31534 -32673 -35522 -46917 -24747 -25131 -30152 -24703 -15046 -29305 -7408 -3781 -8935
7609h935q121j6847j6665J6101K6330J8044m06j7334l752R37m801J265J4286M235
$$ -8935 -17056 -33903 -50568 -34467 -8137 9907 9501 -7833 -11585 -10648 -15449 -14184 102 4337
7595D337L950J5003j9886j4308j3460j6161J1208J8280L193j0785J316p640P886
$$ 4337 8287 23290 3404 -10904 -24364 -40525 -29317 -11037 -7844 -18629 -17313 -24953 -17067
7582a7067K7408J1897n132j6246N146J1751o708j2105j97J9304J013l046r462
$$ -17067 10341 22238 17106 860 6006 17757 11049 -1056 -1253 18051 19064 16018 6556
7569F556j691j2263M394P881J7936j5026j5316j0643J3353R848R249n661j5177
$$ 6556 4865 -7398 -3004 4877 22813 7787 -7529 -18172 -4819 5029 14278 8617 -6560
7556f560k4589N725J2991k590k515o941l419L438P144k092O481n886r5J0111Q352
$$ -6560 -31149 -25424 -12433 -15023 -17538 -24479 -27898 -24460 -17316 -19408 -12927 -18813 -18908 -8797 -445
7541d45K25L064j73k1342o716J2945Q315K2873k840o162N366p604p574p74J5761
$$ -445 -220 2844 2671 -18671 -25387 -12442 -4127 18746 15906 9744 15110 7506 -68 -842 14919
7526A4919Q85o082n123P318l08K90m979M700n25n127p782j6785r56J5422J439
$$ 14919 15804 9722 4599 11917 11609 11899 6920 11620 11095 5968 -1814 -18599 -19555 -4133 -2694
7511b694k3850r588q59P104J5324j1473k371J6061n917j0005J1820l326L874J9324
$$ -2694 -26544 -36132 -36991 -29887 -14563 -26036 -28407 -12346 -18263 -28268 -16448 -19774 -15900 3424
7497C424p048k1366R769K6492J6861m882q693k767o110q902o903J579k433J4507
$$ 3424 -3624 -24990 -15221 11271 28132 23250 14557 11790 5680 -3222 -10125 -8546 -10979 3528
7483C528J4576o149j960q29r686j7085K926q771O7J5382o706Q830j0269j1498
$$ 3528 18104 11955 9995 9166 -520 -17605 -14679 -23450 -23383 -8001 -14707 -5877 -16146 -27644
7469b7644J5267L89j0173J1676k532j5559j9596l237k599K3296N567J5925J3376
$$ -27644 -12377 -11988 -22161 -10485 -13017 -28576 -48172 -51409 -54008 -30712 -25145 -9220 4156
7456D156n870L245k402j2704J1383j030k1765m115R559J6152K1814N189l1837
$$ 4156 -1714 1531 -871 -13575 -2192 -3222 -24987 -29102 -19543 -3391 18423 23612 -8225
7443h225m05J8339K542K035k5477j62K6481j0046j3316N709J4904r450M875j0399
$$ -8225 -8630 9709 12251 14286 -11191 -11353 15128 5082 -8234 -2525 12379 2929 7804 -2595
7429b595k390O33J0422j2517J1266j7631M234P865j5446L366M228m013O514k1719
$$ -2595 -4985 -4352 6070 -6447 4819 -12812 -8578 -713 -16159 -12793 -8565 -12578 -6064 -27783
7415b7783J228P275J707K860K344l592p398J7514J9032k4677j0736K1894k086
$$ -27783 -26555 -19280 -17573 -14713 -12369 -15961 -23359 -5845 13187 -11490 -22226 -332 -2418
7402b418J2163K712n431O061O663m750l807J6900J768j6278J5309P462q627p30
$$ -2418 9745 12457 7026 13087 19750 15000 11193 28093 29861 13583 28892 36354 27727 26997
7388B6997k2597k5728J0595Q398m232J770q609k2121j2399L199j843q940j23K9480
$$ 26997 4400 -21328 -10733 -2335 -6567 -4797 -13406 -35527 -47926 -44727 -46570 -55510 -55633 -26153
7374b6153K0165l998Q61q899L287r396o47r103m410Q574p280k548N412j313N530
$$ -26153 -5988 -9986 -9125 -18024 -14737 -24133 -24780 -33883 -38293 -29719 -36999 -39547 -34135 -35448 -29918
7359b9918N026j0893R201n13r646P95L884K8782J4384k20J552M407r302R01r481
$$ -29918 -24892 -35785 -26584 -27097 -36743 -35948 -32064 -3282 11102 10882 12434 16841 7539 8440 -1041
7344a041q904n457K1615P226l776j6557Q828J0564J4542j3520k2292Q742J5754
$$ -1041 -9945 -15402 6213 13439 9663 -6894 1934 12498 27040 13520 -8772 -30 15724
7331A5724j709K920k6845j7733Q654j5709l96J7781J2472L587Q636k1373j7137
$$ 15724 14015 16935 -9910 -27643 -18989 -34698 -35094 -17313 -4841 -1254 7382 -13991 -31128
7318c1128J2774O28k600K665p442K89n972P764J9642J4708P995J182j8597p603
$$ -31128 -18354 -17726 -20326 -17661 -25103 -24814 -30786 -23022 -3380 11328 19323 20505 1908 -5695
7304e695p137J1720m367M907K8711K4083J1384j7277k2823k2869k5779j9360J3936
$$ -5695 -12832 -1112 -5479 -572 28139 52222 63606 46329 23506 637 -25142 -44502 -30566
7291c0566J2114K018j2256O47J7360J4750j6780p579j2434J4812K3491P397K510
$$ -30566 -18452 -16434 -28690 -28043 -10683 4067 -12713 -20292 -32726 -17914 5577 12974 15484
7278A5484k642k3765j7322p62J6533J5440J4j1346m937Q238M268j9684j135J8195
$$ 15484 12842 -10923 -28245 -29007 -12474 2966 2980 -8366 -13303 -5065 -797 -20481 -21616 -3421
7264c421O599J686R447J1729j1319k6781j8127r866J305O942M618J1918k196j6632
$$ -3421 3178 4864 14311 26040 14721 -12060 -30187 -40053 -38748 -31806 -27188 -15270 -17466 -34098
7250c4098l936K6368J3988O121l011Q518j2362j6828k074N349O298O502j3777
$$ -34098 -38034 -11666 2322 8443 5432 13950 1588 -15240 -17314 -11965 -5667 835 -12942
7237a2942j2660P796N036L870M407j1618j6372q608q471J5038J2495m308l645
$$ -12942 -25602 -17806 -12770 -8900 -4493 -16111 -32483 -41091 -49562 -34524 -22029 -26337 -29982
7224b9982J8703m800n501J4224N013j6727n391J4850M788o516M162J5210j2820
$$ -29982 -11279 -16079 -21580 -7356 -2343 -19070 -24461 -9611 -4823 -11339 -7177 8033 -4787
7211d787k1013M526r122j0968j0705J3634K3101N283n57m163J520l296J769J2272
$$ -4787 -25800 -21274 -30396 -41364 -52069 -38435 -15334 -10051 -10608 -14771 -13251 -16547 -14778 -2506
7197b506o947j57J6746j0643j5571J861J9687J499K007r491O25r529p824p876
$$ -2506 -9453 -9610 7136 -3507 -19078 -17217 2470 3969 5976 -3515 -2890 -12419 -20243 -28119
7183b8119J1468J182N610j1522j5614O365j898N749p747J2805R060j7587n838
$$ -28119 -16651 -15469 -9859 -21381 -36995 -30630 -32528 -26779 -34526 -21721 -12661 -30248 -36086
7170c6086R846J7528P678PK988L10o022k2243m627m119R378n14L4J3452J4079
$$ -36086 -26240 -8712 -1034 -1027 1961 2271 -3751 -25994 -30621 -34740 -25362 -25876 -25842 -12390 1689
7155A689k981J1400n556j4988l343R291M617j7799j131P552p13J0712l307j877
$$ 1689 -1292 10108 4552 -10436 -13779 -4488 129 -17670 -18801 -11249 -11962 -1250 -4557 -6434
7141f434N368n581r608j2405j2099j51N863k942K697j107M397m005j3070J0394
$$ -6434 -1066 -6647 -16255 -28660 -40759 -40910 -35047 -37989 -35292 -36399 -32002 -36007 -49077 -38683
7127c8683L2365K0010j1105N055J0810K1891j2560l3463j6747Q070O499N595q239
$$ -38683 -6318 13692 2587 7642 18452 40343 27783 -5680 -22427 -14357 -7858 -2263 -10502
7114a0502l6587k7364R637L7550J8613J009O712j4100k5337L795J4869J138J553
$$ -10502 -47089 -74453 -64816 -27266 -8653 -7644 -932 -15032 -40369 -36574 -21705 -20567 -19014
7101a9014O365J1325N92j5769l082J0312j827M886j5787L687P718J6214j5906
$$ -19014 -12649 -1324 -732 -16501 -19583 -9271 -11098 -6212 -21999 -18312 -10594 5620 -10286
7088a0286J752m976r916O426p6l839J7251N520j1708j0040j0494N074J4473n600
$$ -10286 -8534 -13510 -23426 -17000 -17076 -20915 -3664 1856 -9852 -19892 -30386 -25312 -10839 -16439
7074a6439j620m288o819J6179L99n81N643j922o712j575J44K0020o975m483R16
$$ -16439 -18059 -22347 -29166 -12987 -12588 -13169 -7526 -9448 -16160 -17735 -17591 2429 -4546 -9029 -8113
7059h113K0035J0087j55j5759j1876q08j8627k02L4914P333j1613j1013k810L763
$$ -8113 11922 22009 21854 6095 -5781 -6589 -25216 -25418 9496 16829 5216 -5797 -8607 -4844
7045d844m815q098P909m935o622M944K2328K771j351j419q61m58M75m750o779
$$ -4844 -9659 -17757 -9848 -14783 -21405 -16461 5867 8638 7287 5868 5007 4549 5024 274 -6505
7030f505J2279k535j3248n294O706J1278P086m997j8357N467j4698j1760n349
$$ -6505 5774 3239 -10009 -15303 -8597 2681 9767 4770 -13587 -8120 -22818 -34578 -39927
7017c9927j0024P430N521L0364J7200l545N512k1251k0704k118K314K0233p45
$$ -39927 -49951 -42521 -37000 -6636 10564 7019 12531 -8720 -29424 -31542 -29228 -8995 -9740
7004i740J491j2049N540J4430J408Q440J1592j1421k0012j0545j0717n403K2754
$$ -9740 -8249 -20298 -14758 -328 1080 9520 21112 9691 -10321 -20866 -31583 -36986 -14232
6991a4232J6204o653M784M237n636j2785j881K0486R909j3589m415q845M49J1974
$$ -14232 1972 -4681 103 4340 -1296 -14081 -15962 4524 14433 844 -3571 -12416 -11967 7
6977GK0720j6935j9790j307J3949L159M421j0782l638j3785j1652L587j240K4462
$$ 7 20727 3792 -15998 -17305 -3356 -197 4224 -6558 -10196 -23981 -35633 -32046 -33286 -8824
6963h824P522L055o63j0045J039m814k702p553k267m235J723M407M649m014N355
$$ -8824 -1302 1753 1090 -8955 -7916 -12730 -15432 -22985 -25252 -29487 -27764 -23357 -18708 -22722 -17367
6948a7367O691j0568l615L566K0214o354J6196K391p870l645J063j322o79J485
$$ -17367 -10676 -21244 -24859 -21293 -1079 -7433 8763 11154 3284 -361 702 -620 -1299 186
6934A86J7144j1032m044k04l07l632j387K038k479r505N82K793J8740O236k8167
$$ 186 17330 6298 2254 2050 1743 -1889 -3276 -1238 -3717 -13222 -12640 -9847 8893 15129 -13038
6919a3038j2651m170l425O11J9826J2498N986j0168j2983n110j1957O186J5204
$$ -13038 -25689 -29859 -33284 -32673 -12847 -349 5637 -4531 -17514 -22624 -34581 -28395 -13191
6906a3191J3032j1232p906j102R02J9590K0439N998j1270r990Q723J922p765j7962
$$ -13191 -159 -11391 -19297 -20399 -19497 93 20532 26530 15260 5270 13993 15915 8150 -9812
6892i812j3605P584m304j148n53L111J111J30L614k967j9882n074p489L970p825
$$ -9812 -23417 -15833 -20137 -21285 -21838 -18727 -17616 -17486 -13872 -16839 -36721 -41795 -49284 -45314 -53139
6877e3139k978K1191N767J1134J8832K5899K788l1941n585J0009j573n570J668
$$ -53139 -56117 -34926 -29159 -18025 807 26706 29494 -2447 -8032 1977 404 -5166 -3498
6864c498j893l710r692R540O906N068J8556J937k1632n797j9934p370r835L805
$$ -3498 -5391 -9101 -18793 -9253 -2347 2721 21277 23214 1582 -4215 -24149 -31519 -41354 -37549
6850c7549P687j3224n838R886J4231L0216M010n50j7816Q359p381j541o649j3070
$$ -37549 -29862 -43086 -48924 -39038 -24807 5409 9419 8869 -8947 -588 -7969 -9510 -16159 -29229
6836b9229N126P749o95J2492j802J0288J1153R81j0644l586O592K484n43J4549
$$ -29229 -24103 -16354 -17049 -4557 -6359 3929 15082 16063 5419 1833 8425 10909 10366 24915
6822B4915j8685l0999l853J6055l134m613L039K311l458o504Q892J5101n915j2567
$$ 24915 6230 -24769 -28622 -12567 -15701 -20314 -17275 -14964 -18422 -24926 -16034 -933 -6848 -19415
6808a9415J2720K539N123p979j8640P646M733j3652p577R873M801P891Q773o05
$$ -19415 -6695 -4156 967 -7012 -25652 -18006 -13273 -26925 -34502 -24629 -19828 -11937 -3164 -3769
6794c769j1132q897o569l322J3977J723k362J0692o416j548k783j1348j6811r296
$$ -3769 -14901 -23798 -30367 -33689 -19712 -17989 -20351 -9659 -16075 -17623 -20406 -31754 -48565 -57861
6780e7861J9246M4010K2435j1040l9272K229J5981J2222j9847j1699j3120r222
$$ -57861 -38615 5395 27830 16790 -22482 -20253 -4272 7950 -11897 -23596 -36716 -45938
6768d5938j736K0192o069K710J7876K762j4503k6433M362J3670K0064J6561L790
$$ -45938 -47674 -27482 -33551 -30841 -12965 -10203 -24706 -51139 -46777 -33107 -13043 3518 7308
6755G308j4811p655r09J0045k566l682M520j1971N694j6434m711O926J0840q989
$$ 7308 -7503 -15158 -16067 -6022 -8588 -12270 -7750 -19721 -14027 -30461 -35172 -28246 -17406 -26395
6741b6395n53J0625l118M321J4753P862r914L689J1654j4121n997J2471K7864
$$ -26395 -26948 -16323 -19441 -15120 -367 7495 -2419 1270 12924 -1197 -7194 5277 33141
6728C3141k614j0343j7920J1224R261n30p772q971L415R775l059L696k1091j9236
$$ 33141 30527 20184 2264 13488 22749 22219 14447 5476 8891 18666 15607 19303 -1788 -21024
6714b1024K8757M111k417L383p99l040R379M165k3002j5296r000M945J4187k254
$$ -21024 7733 11844 9427 12810 12011 8971 18350 22515 -487 -15783 -24783 -19838 -5651 -7905
6700g905J4029j6464l047J6604j810j7501k0796j1224K5240J2158N126K1364k5875
$$ -7905 6124 -10340 -13387 3217 1407 -16094 -36890 -48114 -22874 -10716 -5590 15774 -10101
6687a0101j2611R083K559K5845O20N410j0740k6728l767P597j007j4139L352J2598
$$ -10101 -22712 -13629 -11070 14775 15395 20805 10065 -16663 -20430 -12833 -13840 -27979 -24627 -12029
6673a2029m746j2992j3966P187J4264J7260J8346m802k6934j7404K6518l83j1707
$$ -12029 -16775 -29767 -43733 -36546 -22282 -5022 13324 8522 -18412 -35816 -9298 -9681 -21388
6660b1388L00j4730j633J3002P344j962r155P800P882q951J3999j693m972k2207
$$ -21388 -21088 -35818 -37451 -24449 -17105 -19067 -28222 -20422 -12540 -21491 -7492 -9185 -14157 -36364
6646c6364p87L275j9459N717n90P149Q604J4697J9538O456o785k442r389N873
$$ -36364 -37151 -33876 -53335 -47618 -48208 -41059 -32455 -17758 1780 8236 1451 -991 -10380 -4507
6632d507n79o680Q628r989O496K4443P834j1197Q377q489k0588L093M380J1795
$$ -4507 -5086 -11766 -3138 -13127 -6631 17812 25646 14449 22826 14337 -6251 -3158 1222 13017
6618A3017K09o029j1328P108n001P578J107m046L274j4431m743Q701K1136L179
$$ 13017 13226 7197 -4131 2977 -2024 5554 6661 2615 5889 -8542 -13285 -4584 16552 19731
6604A9731j4102j4673j3214J5824K2107L727m01j7303j5741q825L38J2126K1336
$$ 19731 5629 -9044 -22258 -6434 15673 19400 18999 1696 -14045 -22870 -22532 -10406 10930
6591A0930P134j0785j3163j488j0721m41n010Q871O451Q61m511n000J0775m511
$$ 10930 18064 7279 -5884 -7372 -18093 -18534 -23544 -14673 -8222 -7361 -11872 -16872 -6097 -10608
6577a0608K79K0000J2307j3357j3105k2119q239J4691l585o367Q097P717L442
$$ -10608 -10329 9671 21978 8621 -4484 -26603 -34842 -20151 -23736 -30103 -22006 -14289 -10847
6564a0847k7k814K0454M404m95k369o488m222j1506j453O091M121J1636J013p253
$$ -10847 -10874 -13688 6766 11170 10675 8306 1818 -2404 -13910 -15363 -9272 -5151 6485 7498 245
6549B45L948J418j704J569j314j594P523j8077j8532m596J683P423J5214q84J0174
$$ 245 4193 5611 3907 5476 4162 2568 10091 -7986 -26518 -31114 -29431 -22008 -6794 -7678 2496
6534B496K672J5371p12k7164P315p766N565j7053k446J8495r450O513J2510R535
$$ 2496 5168 20539 19827 -7337 -22 -7788 -2223 -19276 -21722 -3227 -12677 -6164 6346 15881
6520A5881j1821P512P33J379l950j2491l034J4570P56j6942M596k333K129l740
$$ 15881 4060 11572 12305 13684 9734 -2757 -5791 8779 9535 -7407 -2811 -5144 -3015 -6755
6506f755K803l465J2014l869j0545m921L70m136q250L968L965J5289o218K327
$$ -6755 -3952 -7417 4597 728 -9817 -14738 -14368 -18504 -26754 -22786 -18821 -3532 -9750 -7423
6492g423K912k742m417k0967Q449R453m410m639m947K996J6659p277J051j7802
$$ -7423 -4511 -7253 -11670 -32637 -24188 -14735 -19145 -23784 -28731 -25735 -9076 -16353 -15302 -33104
6478c3104R628N271L242J007j9410O930p190q23J3806J7017m858M36o500r496
$$ -33104 -23476 -18205 -14963 -13956 -33366 -26436 -33626 -34449 -20643 -3626 -8484 -8048 -14548 -24044
6464b4044O306J076m774K665J5115Q273m69O890j009Q120l380J5462r00j9680
$$ -24044 -17738 -16662 -21436 -18771 -3656 4617 4148 11038 10029 18149 14769 30231 29331 9651
6450I651r134L907P979J273m675r379j1375k0166J775J4512J5421J2879q24q7
$$ 9651 517 4424 12403 13676 9001 -378 -11753 -31919 -30144 -15632 -211 12668 11844 11757
6436A1757n152j0597k085n998l776J0248m707J3516Q196q5L043j4136n578O059
$$ 11757 6605 -3992 -6077 -12075 -15851 -5603 -10310 3206 11402 11317 14360 224 -5354 705
6422G05j4296p172j0140P730j232K9216J6982k9675L188p666j6840O253o773k632
$$ 705 -13591 -20763 -30903 -23173 -24405 4811 21793 -7882 -4694 -12360 -29200 -22947 -29720 -32352
6408c2352K044R31J8773Q144J4337J5341N757j7715J352o227L838j0521l0735
$$ -32352 -30308 -29377 -10604 -2460 11877 27218 32975 15260 16612 10385 14223 3702 -27033
6395b7033j0352L884o887Q021j526J9290J9010Q003j2251j2359J5241j4620p700
$$ -27033 -37385 -33501 -40388 -32367 -33893 -14603 4407 12410 159 -12200 3041 -11579 -19279
6382a9279J4277J4936j4557k694P023j6615l169J9223K1032n485Q138p899j5289
$$ -19279 -5002 9934 -4623 -7317 -294 -16909 -20078 -855 20177 14692 22830 14931 -358
6369c58R35o553r979p658M739J285P071J1990m817q016J885J2496j0558J0068
$$ -358 577 -5976 -15955 -23613 -18874 -17589 -10518 1472 -3345 -11361 -9476 3020 -7538 2530
6355B530J142L227R425J3497l598k5998o858J1259J745l366k583r628K576P242
$$ 2530 3672 6899 16324 29821 26223 225 -6633 4626 6371 3005 422 -9206 -6630 612
6341F12L798m06K049j3563j2306l97n239n77K502J0243J7482p862J0508K5529
$$ 612 4410 4004 6053 -7510 -19816 -20213 -25452 -26029 -23527 -13284 4198 -3664 6844 32373
6327C2373j4519M544Q672L477M753m794k1669l6579j1339k68L762Q595J3781J9478
$$ 32373 17854 22398 31070 34547 39300 34506 12837 -23742 -35081 -35349 -31587 -22992 -9211 10267
6313A0267L201n871j9847j4805q618J7576J3690n884j6674k3036N40K0403K856
$$ 10267 13468 7597 -12250 -27055 -35673 -18097 -4407 -10291 -26965 -50001 -49461 -29058 -26202
6300b6202P162M503J5890K554m244J90J2538K086J3169l005k3923k4160j3927
$$ -26202 -19040 -14537 1353 3907 -337 -147 12391 14477 27646 24641 718 -23442 -37369
6287c7369P9O309K1026J4945L579j0528p887K0916K3782j1527j7728L938N782
$$ -37369 -37290 -30981 -9955 4990 8569 -1959 -9846 11070 34852 23325 5597 9535 15317
6274A5317l923j5526L28J6689K0943J931k7343j1432O193J2094P820r216m128
$$ 15317 11394 -4132 -3804 12885 33828 35759 8416 -3016 3177 15271 23091 13875 9747
6261I747j1310M470J4162O22j0854r130k0550j8916m687Q188J7198j0946Q426
$$ 9747 -1563 2907 17069 17691 6837 -2293 -22843 -41759 -46446 -38258 -21060 -32006 -23580
6248b3580N605L886J7251q009k8482n234R89J1659J3209n496J2171M399q16p557
$$ -23580 -17975 -14089 3162 -4847 -33329 -38563 -37574 -25915 -12706 -18202 -6031 -1632 -2448 -10005
6234a0005j1955j7850J3563K4326p378k0072J932m491k0160k79K0256R49M395
$$ -10005 -21960 -39810 -26247 -1921 -9299 -29371 -27439 -31930 -52090 -52369 -32113 -31164 -26769
6221b6769n135l162J2367j8010j286K2338P75j2318k758N990K581K0400L552N611
$$ -26769 -31904 -35066 -22699 -40709 -41995 -19657 -18882 -31200 -33958 -27968 -25387 -4987 -1435 4176
6207D176j0805j0750R665o199j0109l570R782K4401q375k827R297J3518N286j2659
$$ 4176 -6629 -17379 -7714 -13913 -24022 -27592 -17810 6591 -1784 -4611 4686 18204 23490 10831
6193A0831p422j1876j32K522M743J790n694j5965k342K9324K3861j6650j5990
$$ 10831 3409 -8467 -8599 -6077 -1334 456 -5238 -21203 -23545 5779 29640 12990 -3000
6180c000j1974j2563L4K692K1000J427O953J5225j8835j3545J6270k1381k6652
$$ -3000 -14974 -27537 -27503 -24811 -3811 -2384 4569 19794 959 -12586 3684 -17697 -44349
6167d4349N765J8249J405P932p357j9657Q909K1187J2000j3971k71J267j777j0665
$$ -44349 -38584 -20335 -18930 -10998 -18355 -38012 -29103 -7916 4084 -9887 -10158 -8891 -10668 -21333
6153b1333r392j880L764n392k0662K445n5J3573J7317m61j5638K6290P927j142
$$ -21333 -30725 -32605 -28841 -34233 -54895 -52450 -52505 -38932 -21615 -22076 -37714 -11424 -3497 -4639
6139d639J1813J0091r687k8898n563J2234k946L155J846p661j3583q87J9252J8725
$$ -4639 7174 17265 7578 -21320 -26883 -14649 -17595 -14440 -12594 -20255 -33838 -34725 -15473 3252
6125C252m057j0181l522n277j9527L054J0998Q667Q918K5M984p017j3718o63J5031
$$ 3252 -805 -10986 -14508 -19785 -39312 -36258 -25260 -16593 -7675 -7650 -2666 -9683 -23401 -24064 -9033
6110i033l39J2692Q739M393p57k7370J943J7189P446N201j4137j257m844r698
$$ -9033 -9372 3320 12059 16452 15695 -11675 -9732 7457 14903 20104 5967 4710 -134 -9832
6096i832J587J2094r283j603r613N735J817j4741j4768J7277J9256J5112k6776
$$ -9832 -8245 3849 -5434 -7037 -16650 -10915 -9098 -23839 -38607 -21330 -2074 13038 -13738
6083a3738k2380n132M398J9933Q063O579N371j746Q488p151o177M872L060j5029
$$ -13738 -36118 -41250 -36852 -16919 -8856 -2277 3094 1348 9836 2685 -3492 1380 4440 -10589
6069a0589M937J7653J821M56l896j2675K808o929j5219P030k374j2928L960P871
$$ -10589 -5652 12001 13822 14278 10382 -2293 515 -6414 -21633 -14603 -16977 -29905 -25945 -18074
6055a8074k0102R706P725Q222k3142m012L4K1502K8291J888l4243j3318P415O756
$$ -18074 -38176 -28470 -20745 -12523 -35665 -39677 -39643 -18141 10150 12038 -22205 -35523 -28108 -21352
6041b1352q99k853j209L758K8136K4125r7j1119J4160r074k863o872m555j3608
$$ -21352 -22251 -25104 -26313 -22555 5581 29706 29609 18490 32650 23576 20713 13841 9286 -4322
6027d322K485K296m447k7381p746J2665K5226M149j547j3261N349K0065J1634
$$ -4322 -1837 459 -3988 -31369 -39115 -26450 -1224 2925 1378 -11883 -6534 13531 25165
6014B5165k2443k2517j1184J5748O966K102R021J2715K149j4719j3623J8245m61
$$ 25165 2722 -19795 -30979 -15231 -8265 -6163 2858 15573 17722 3003 -10620 7625 7164
6001G164k2534j6887k299P922J1942R744n132q444r426J7968K0572j508J1003
$$ 7164 -15370 -32257 -34556 -26634 -14692 -4948 -10080 -18524 -27950 -9982 10590 9082 20085
5988B0085P928N124m592n676N335l946Q99k2806j6296n271M13l754J8362J8644
$$ 20085 28013 33137 28545 22869 28204 24258 25157 2351 -13945 -19216 -18803 -22557 -4195 14449
5974A4449k69K833j972k6544j2262k3110o828k603Q527J4741R955K1003j1j7598
$$ 14449 14180 17013 15041 -11503 -23765 -46875 -53703 -56306 -47779 -33038 -23083 -2080 -2091 -19689
5960a9689N656m329J542J6257p823Q206J5653M623L440J765n566O840J4166j5508
$$ -19689 -14033 -18362 -16820 -563 -8386 -180 15473 20096 23536 25301 19735 26575 40741 25233
5946B5233j9790k4048n473j5701J4189K7741l404k1369K905N81K2651K2428L815
$$ 25233 5443 -18605 -24078 -39779 -25590 2151 -1253 -22622 -19717 -19136 3515 25943 29758
5933B9758j0274K645M62r549r914m583K6031k833k9080o50j19J0028j283J0128
$$ 29758 19484 22129 22591 13042 3128 -1455 24576 21743 -7337 -7987 -8106 1922 639 10767
5919A0767k965l343n72L142j5435l105p241q859R055P801Q735J0029q470j7100
$$ 10767 7802 4459 3887 7029 -8406 -11511 -18752 -27611 -18556 -10755 -2020 8009 -461 -17561
5905a7561k1701J8525J6544k663L412O635k35N54R255R438J0897j5586l7533o478
$$ -17561 -39262 -20737 -4193 -6856 -3444 3191 2956 3510 12765 22203 33100 17514 -20019 -26497
5891b6497J0363J4950L6567k0231j404M817K253J0387k0973K700n237j0432O869
$$ -26497 -16134 -1184 35383 15152 13748 18565 20818 31205 10232 12932 7695 -2737 4132
5878D132Q200j1191j073L782O360j2087k3574M878l036O415q855J3701n183j483
$$ 4132 12332 1141 68 3850 10210 -1877 -25451 -20573 -23609 -17194 -26049 -12348 -17531 -19014
5864a9014K471K028K194j362o040J4082J4536J1046j2826m158q308M993P804L765
$$ -19014 -16543 -14515 -12321 -13683 -19723 -5641 8895 19941 7115 2957 -5351 -358 7446 11211
5850A1211M63M781n658j3396P64M741J1592N421l326j6717r53K334P020J773j1502
$$ 11211 11674 16455 10797 -2599 -1835 2906 14498 19919 16593 -124 -1077 1257 8277 10050 -1452
5835a452j4776j514M128O026R702j5697k0715n571J6869Q771j529O585j3358j337
$$ -1452 -16228 -17742 -13614 -7588 2114 -13583 -34298 -39869 -23000 -14229 -15758 -9173 -22531 -23868
5821b3868K601J0274j0029J512N043p496J6824p222R528O672N851K3428j3718
$$ -23868 -21267 -10993 -21022 -19510 -14467 -21963 -5139 -12361 -2833 3839 9690 33118 19400
5808A9400k4661J410L190Q285R152o033p906j906j5517n68J0014M44m92r310k685
$$ 19400 -5261 -3851 -661 7624 16776 10743 2837 931 -14586 -15154 -5140 -4696 -5188 -14498 -17183
5793a7183l773J9126J4191k49r564k356j2727L807M517k3871j0746Q398J9900
$$ -17183 -20956 -1830 12361 12112 2548 192 -12535 -8728 -4211 -28082 -38828 -30430 -10530
5780a0530J2427l445J5699J2030p151m350Q193m899j1319L081Q541m489j5825
$$ -10530 1897 -1548 14151 26181 19030 14680 22873 17974 6655 9736 18277 13788 -2037
5767b037j7442j844N893j0942n602m926r39O435J4589J5725q29J0808n014m118
$$ -2037 -19479 -21323 -15430 -26372 -31974 -36900 -37839 -31404 -16815 -1090 -1919 8889 3875 -243
5753b43R762J6396K780j3286k4580j6316J77L0809k694j7365j1214k330m903k787
$$ -243 9519 25915 28695 15409 -9171 -25487 -25310 5499 2805 -14560 -25774 -28104 -33007 -35794
5739c5794L187J0131J5074J8645J5422K858k836q669p728n754J2289l513j2142
$$ -35794 -32607 -22476 -7402 11243 26665 29523 26687 18018 10290 4536 16825 13312 1170
5726A170j1039k464K1721K218r703J0027n297j589k213R240O328p747n515r627
$$ 1170 -9869 -12333 9388 11606 1903 11930 6633 5044 2831 12071 18399 10652 5137 -4490
5712d490j0198J3265P600j4708P965M449j038j3512j317J5420K54J4638l052j9105
$$ -4490 -14688 -1423 6177 -8531 -566 3883 2845 -10667 -11984 3436 3690 18328 15276 -3829
5698c829L765k977l411k124M123L2k0274n27j036P567J1769J0091P475J8582j3491
$$ -3829 -64 -3041 -6452 -8576 -4453 -4421 -24695 -25222 -26258 -18691 -6922 3169 10644 29226 15735
5683A5735j1907j6422r924n942J116K5792J3740j590j2828J416k4970j5114K7046
$$ 15735 3828 -12594 -22518 -28460 -27344 -1552 12188 10598 -2230 -814 -25784 -40898 -13852
5670a3852J5535l062M235q575r729J618N389Q206J526N853j6826o121K336K5672
$$ -13852 1683 -1379 2856 -5719 -15448 -13830 -8441 -235 1291 7144 -9682 -15803 -13467 12205
5656A2205J7441j8510o951L954J8682n827J09j9108r799O985j1424o719Q685P656
$$ 12205 29646 11136 4185 8139 26821 20994 21103 1995 -7804 -819 -12243 -18962 -10277 -2621
5642b621p084Q865j5487k6052L308K1708K5151k988k8629q700P23K6239J3259
$$ -2621 -9705 -840 -16327 -42379 -39071 -17363 7788 4800 -23829 -32529 -31806 -5567 7692
5629G692j820j0804j1432J5571K26j4863K102K3508j0270l0919Q685Q935m333
$$ 7692 5872 -4932 -16364 -793 -567 -15430 -13328 10180 -90 -31009 -22324 -13389 -17722
5616a7722J5021M668R293k027j0182o264K213m602o929o753P475J455M118J0306
$$ -17722 -2701 1967 11260 9233 -949 -7213 -5000 -9602 -16531 -23284 -15809 -14354 -10236 70
5602G0k515J7569p00O125j0803m336J3533l601J1031r405j1439L251j0834m225
$$ 70 -2445 15124 14424 20549 9746 5410 18943 15342 26373 16968 5529 8780 -2054 -6279
5588f279j3552J4999j014J3543J2610p760j0702j5812j1177K739j0420Q280J9906
$$ -6279 -19831 -4832 -5846 7697 20307 12547 1845 -13967 -25144 -22405 -32825 -24545 -4639
5575d639J4305l933l879k748k1944j0729j309J6516J9676O862J1726n080m4389
$$ -4639 9666 5733 1854 -894 -22838 -33567 -34876 -18360 1316 8178 19904 14824 -29565
5562b9565K631K2792k091j447J5849Q524q562j6283l835O04J0266j5703P654k194
$$ -29565 -26934 -4142 -6233 -7680 8169 16693 8131 -8152 -11987 -11383 -1117 -16820 -9166 -11360
5548a1360o94O889j2944o671J2522l348J2210j98r092K937R37l169J4238J9616
$$ -11360 -12054 -5165 -18109 -24780 -12258 -15606 -3396 -3594 -12686 -9749 -8812 -11981 2257 21873
5534B1873K567L635p343j4551j0682L575J1809j3207m386M841J3923k4687J2020
$$ 21873 24440 28075 20732 6181 -4501 -926 10883 -2324 -6710 -1869 12054 -12633 -613
5521f13L486p576o184q376l214j3330K692J8416M193j1091L645J8826J6900J9466
$$ -613 2873 -4703 -10887 -19263 -22477 -35807 -33115 -14699 -10506 -21597 -17952 874 17774 37240
5507C7240k5023n467l627j654r845j7611q858J773K6446L1276o755j7056j942
$$ 37240 12217 6750 3123 1469 -8376 -25987 -34845 -33072 -6626 24650 17895 839 -1103
5494a103j2383j894J3395j5206j7979K988K265K556K7944J3335m297m477j160
$$ -1103 -13486 -15380 -1985 -17191 -35170 -32182 -29917 -27361 583 13918 9621 5144 3984
5481C984j286n197K875J704l750K975J7553J7176m846J716J483k7057k5790J63
$$ 3984 2698 -2499 376 2080 -1670 1305 18858 36034 31188 32904 34387 7330 -18460 -18297
5467a8297M072K0988J0641j4539K150j0851j3763r899R444K0198M093k0516N910
$$ -18297 -14225 6763 17404 2865 5015 -5836 -19599 -29498 -20054 144 4237 -16279 -10369
5454a0369L017n523j2008k994J7666K2965J0019p76j0519j542M21j5581o149R086
$$ -10369 -7352 -12875 -24883 -27877 -10211 12754 22773 21997 11478 9936 10357 -5224 -11373 -2287
5440b287M329p569Q401j837K1140K5209M271j6161j9596p383j1989j3000L966
$$ -2287 2042 -5527 2874 1037 22177 47386 51657 35496 15900 8517 -3472 -16472 -12506
5427a2506j0332J0524R654r83k9897r489J3544J9573m636r96J2597L1852J3961
$$ -12506 -22838 -12314 -2660 -3643 -33540 -43029 -29485 -9912 -14548 -15544 -2947 28905 42866
5414D2866j3706q214L874P031j3593n987l413k1963j0480N109M768P745J6784
$$ 42866 29160 20946 24820 31851 18258 12271 8858 -13105 -23585 -18476 -13708 -5963 10821
5401A0821Q731o187q002j50o248J303J737k5800j2392J5827K615J7936P20r205
$$ 10821 19552 13365 5363 5213 -1035 268 2005 -23795 -36187 -20360 -17745 191 911 -8294
5387h294J0799P793J0679k0078j2214J783l881o530J1614K0562L366j818q292
$$ -8294 2505 10298 20977 899 -11315 -9532 -13413 -19943 -8329 12233 15599 13781 5489
5374E489j5312j3433k333L738J1079Q263L143N98k683L444r605R480J0014N643
$$ 5489 -9823 -23256 -25589 -21851 -10772 -2509 634 1232 -1451 1993 -7612 1868 11882 17525
5360A7525O67J0200o90o795j3995J0482j2257j1875r375k0787q291J3590l547
$$ 17525 18192 28392 27702 20907 6912 17394 5137 -6738 -16113 -36900 -45191 -31601 -35148
5347c5148k946K0990K6749K4835j6565o5j2649q407k842q776J5449K7841M134
$$ -35148 -38094 -17104 9645 34480 17915 17850 5201 -3206 -6048 -14824 625 28466 32600
5334C2600k5299j3513K1561q683m286l732J7278J1601o571k2104j2881O387K489
$$ 32600 7301 -6212 15349 6666 2380 -1352 15926 27527 20956 -1148 -14029 -7642 -5153
5321e153j3478J571M457o741L636J3070J1170p490j1505K0111p7q87L978J7784
$$ -5153 -18631 -17060 -12603 -19344 -15708 -2638 8532 1042 -10463 9648 9571 8684 12662 30446
5307C0446m702j2882N80r016l875P69o355J7592J041n322j4454l032o527m470
$$ 30446 25744 12862 13442 4426 551 1320 -5035 12557 13598 8276 -6178 -9210 -15737 -20207
5293b0207n896j2126J0325Q27r794m126R791J0195J1010k1474k28K0907O926J199
$$ -20207 -26103 -38229 -27904 -27077 -36871 -40997 -31206 -21011 -10001 -31475 -31703 -10796 -3870 -2671
5279b671m836O803R34n855J3562J75j9079l575K737N825J1373j3923p463P165
$$ -2671 -7507 -704 230 -5625 7937 8112 -10967 -14542 -11805 -5980 5393 -8530 -15993 -8828
5265h828J3678l55j7594p512M174j5327o319J7540J9732J0877k734j6454p013
$$ -8828 4850 4495 -13099 -20611 -16437 -31764 -38083 -20543 -811 10066 7332 -9122 -16135
5252a6135m5j195N422m169n912J4697O048m263K29j6102j4360M356J1207J8074
$$ -16135 -16180 -17375 -11953 -16122 -22034 -7337 -1289 -5552 -5323 -21425 -35785 -31429 -20222 -2148
5238b148J668l337m626J2294J0873j0968r010q240j1719j185J6402J2472l115
$$ -2148 -480 -3817 -8443 3851 14724 3756 -5254 -13494 -25213 -26398 -9996 2476 -639
5225f39O083l039J1311R067J128q654q40j2606r364r33J1621J7999L806j0998
$$ -639 5444 2405 13716 22783 23911 15257 14417 1811 -7553 -8486 3135 21134 24940 13942
5211A3942j9586j3041l052k544R730J039l062j674L159r971J6708Q140j2130l340
$$ 13942 -5644 -18685 -21737 -24281 -14551 -13512 -16574 -18248 -15089 -25060 -8352 -212 -12342 -15682
5197a5682q601P732J465L19N467K945k965k789p062p813j7791O868R977K1878
$$ -15682 -24283 -16551 -15086 -14767 -9300 -6355 -9320 -12109 -19171 -26984 -44775 -37907 -27930 -6052
5183f052J2719q973k8723o764K7317L659j4937r704r202l868K9431J9309n565
$$ -6052 6667 -2306 -31029 -37793 -10476 -6817 -21754 -31458 -40660 -44528 -15097 4212 -1353
5170a353j945k284N207l173j252j2242M076K397J5912M115m370J5827J1542k111
$$ -1353 -3298 -5582 -375 -3548 -4800 -17042 -12966 -10569 5343 9458 5088 20915 32457 30346
5156C0346m489l3977j715J6486m723j5811P115o793K589J7883j658J0597K5263
$$ 30346 25857 -8120 -9835 6651 1928 -13883 -6768 -13561 -10972 6911 5253 15850 41113
5143D1113l684k4951j3580j9561J87L959K093r668R712Q499J7698O053m022j6355
$$ 41113 37429 12478 -1102 -20663 -20476 -16517 -14424 -24092 -14380 -5881 11817 17870 13848 -2507
5129b507q574Q606J8488p847K546J1851K111n202n761N425P872k6889l2103J0889
$$ -2507 -11081 -2475 16013 8166 10712 22563 24674 19472 13711 19136 27008 119 -31984 -21095
5115b1095K0726l107j485K749j1805O079K459m752L876P374j5579n120J2891L460
$$ -21095 -369 -3476 -4961 -2212 -14017 -7938 -5479 -10231 -6355 1019 -14560 -19680 -6789 -3329
5101c329n697L012j8112P355j4694K0569K1880J1353L512k128j95j4872j8573
$$ -3329 -9026 -6014 -24126 -16771 -31465 -10896 10984 22337 25849 23721 23526 8654 -9919
5088i919J370J4296J7964j731K841o09J11O210M003N133J589k0501q503J2N56
$$ -9919 -8549 5747 23711 21980 24821 24212 24323 30533 34536 39669 41258 20757 12254 12266 12822
5073A2822L331q777j476o20O186K749m688m017Q902m330j1991N887q024j0261
$$ 12822 16153 7376 5900 5280 11466 14215 9527 5510 14412 10082 -1909 3978 -4046 -14307
5059a4307R739J0830M260j3104r598n610m596l974L407N026Q422J2140n790q36
$$ -14307 -4568 6262 10522 -2582 -12180 -17790 -22386 -26360 -22953 -17927 -9505 2635 -3155 -3991
5045c991p490J9819r458Q541P154M813L742Q558l852K994L253j7082j2946k208
$$ -3991 -11481 8338 -1120 7421 14575 19388 23130 31688 27836 30830 34083 17001 4055 1847
5031A847p260N144J5064O207J6783L102L641m425o653j9512j1474q046J6384J5075
$$ 1847 -5413 -269 14795 21002 37785 40887 44528 40103 33450 13938 2464 -5582 10802 25877
5017B5877k030p467l0289k0477o10K5530J1687L79J1274M122j7868m156J676q65
$$ 25877 23847 16380 -13909 -34386 -34996 -9466 2221 2600 13874 17996 128 -4028 -2352 -3217
5003c217J294O190l707j252J6395r709r576J7037k451K565O405k031j3086J2901
$$ -3217 -1923 4267 560 -692 15703 5994 -3582 13455 11004 13569 19974 17943 4857 17758
4989A7758q895j8493n653j793P013J0134J9805P94k0640j0408j2196k1178J3909
$$ 17758 8863 -9630 -15283 -17076 -10063 71 19876 20670 30 -10378 -22574 -43752 -29843
4976b9843K5887J4926q129P619O34j3114O856L527j3173q176o901r796Q719r095
$$ -29843 -3956 10970 2841 10460 11094 -2020 4836 8363 -4810 -12986 -19887 -29683 -20964 -30059
4962c0059J64n213R649Q139Q831k32J2011j1645J3294r905k1789J3766K6603L487
$$ -30059 -29895 -35108 -25459 -17320 -8489 -8721 3290 -8355 4939 -4966 -26755 -12989 13614 17101
4948A7101k6367q954j0755J2135M490N005l39o076m655J4867M329p417j0662R602
$$ 17101 -9266 -18220 -28975 -16840 -12350 -7345 -7684 -13760 -18415 -3548 781 -6636 -17298 -7696
4934g696P808j6381K62M083q583J9265K2850L282k2767j0003o335m378J6728J8579
$$ -7696 112 -16269 -16007 -11924 -20507 -1242 21608 24890 2123 -7880 -14215 -18593 -1865 16714
4920A6714j0858j7560m314R512M531j8906j2884K0440o299l03L796o044j5757
$$ 16714 5856 -11704 -16018 -6506 -1975 -20881 -33765 -13325 -19624 -19927 -16131 -22175 -37932
4907c7932N86r09M648J8026K4336j0328r193j0334j6373K11J5596J2078r039j2663
$$ -37932 -37346 -38255 -33607 -15581 8755 -1573 -10766 -21100 -37473 -37262 -21666 -9588 -18627 -31290
4893c1290K321J3099j096o255O230K7351J1680j9425k4543N983P464o383o764
$$ -31290 -28969 -15870 -16966 -23221 -16991 10360 22040 2615 -21928 -15945 -8481 -14864 -21628
4880b1628M395O563Q694L387M656o935L279R262j096l402n174L412J694Q78m644
$$ -21628 -17233 -10670 -1976 1411 6067 -868 2411 11673 10577 7175 2001 5413 7107 7985 3341
4865C341J4373Q674n143k1881k0085j4780J0505N888k017L930J7147r17j4345
$$ 3341 17714 26388 21245 -636 -20721 -35501 -24996 -19108 -21125 -17195 -48 -965 -15310
4852a5310L903o305j4241J0777R032j7932m326M751K6491K5348O811j0852k0737
$$ -15310 -11407 -17712 -31953 -21176 -12144 -30076 -34402 -29651 -3160 22188 28999 18147 -2590
4839b590r047J666l074J0666K1632o839r35N403m85k6663j3109J1509J8785l884
$$ -2590 -11637 -9971 -13045 -2379 19253 12414 11479 16882 16397 -10266 -23375 -11866 6919 3035
4825C035r426L360K06J5921J5221m286k1137m870N239N104j7730R388M078j0911
$$ 3035 -6391 -3031 -2825 13096 28317 24031 2894 -1976 3263 8367 -9363 25 4103 -6808
4811f808j5501Q996R616J1010q156r553j0704M623O218O814P314m231j0064N17
$$ -6808 -22309 -13313 -3697 7313 -843 -10396 -21100 -16477 -10259 -3445 3869 -362 -10426 -9909
4797i909L285l997j2007r165K745N289Q090m168k900L234J702J802Q783m687p680
$$ -9909 -6624 -10621 -22628 -31793 -29048 -23759 -15669 -19837 -22737 -19503 -17801 -15999 -7216 -11903 -19583
4782a9583q399M09L141K440L340J7377N694o588k241J1938P751m846j3063J6828
$$ -19583 -27982 -27573 -24432 -21992 -18652 -1275 4419 -2169 -4410 7528 15279 10433 -2630 14198
4768A4198O651o193r323M563o0j3615p202k210P178m9n190k0402p052j3021N494
$$ 14198 20849 14656 5333 9896 9836 -3779 -10981 -13191 -6013 -6062 -11252 -31654 -38706 -51727 -46233
4753d6233N528n777N166J9713L3190K432J1998l0617j8788K6798R343k2727j2231
$$ -46233 -40705 -46482 -41316 -21603 11587 14019 26017 -4600 -23388 3410 12753 -9974 -22205
4740b2205m753K2290K4006M111r7l545k289k2770o806P174J024J4068m108k0163
$$ -22205 -26958 -4668 19338 23449 23352 19807 17518 -5252 -12058 -4884 -3860 10208 6100 -14063
4726a4063k291J8885q011k2887m701K010J1900J5534j090o378K1518l275r156
$$ -14063 -16354 2531 -5480 -28367 -33068 -31058 -19158 -3624 -4714 -11092 10426 7151 -2005
4713b005j1383J612k050l209k769o686o236J3394J6601J1307J8937J2703j5380
$$ -2005 -13388 -11776 -13826 -17035 -19804 -26490 -32726 -19332 -2731 8576 27513 40216 24836
4700B4836k4032j5407n728J1300p369j0651J2035J3525m801j3010K152J0716J0630
$$ 24836 804 -14603 -20331 -9031 -16400 -27051 -15016 -1491 -6292 -19302 -17150 -6434 4196
4687D196J0294P723l579j1177K1438P735j2748j1507k721j0556l043n268n240
$$ 4196 14490 22213 18634 7457 28895 36630 23882 12375 9654 -902 -3945 -9213 -14453
4674a4453K228K849N159J5508m98J5513o686l5278j3025J3230P618j7158o809
$$ -14453 -12225 -9376 -4217 11291 10793 26306 19620 -15658 -28683 -15453 -7835 -24993 -31802
4661c1802J3763K19J912K0847q347L74J1700J372L23O536q550o517r295N851o921
$$ -31802 -18039 -17820 -15908 4939 -3408 -3034 8666 10038 10361 16897 8347 1830 -7465 -1614 -8535
4646h535O512j107j4842K2179J2365j0600k231m539j4042L824M276l95J3219N273
$$ -8535 -2023 -3130 -17972 4207 16572 5972 3741 -798 -14840 -11016 -6740 -7135 6084 11357
4632A1357j2275J26J2823j1838k0743J128L977J4122p298k5484p481K1770Q003
$$ 11357 -918 -792 12031 193 -20550 -19422 -15445 -1323 -8621 -34105 -41586 -19816 -11813
4619a1813q363K543J4987M743j949J1450j1233J616j410J1603J1400o54j0978
$$ -11813 -20176 -17633 -2646 2097 148 11598 365 1981 571 12174 23574 22920 11942
4606A1942m244j325j491j81j1922j7138M569n356m820J3223J374r486O923J2562
$$ 11942 7698 6373 4882 4701 -7221 -24359 -19790 -25146 -29966 -16743 -15369 -24855 -17932 -5370
4592e370J9461j0396j9059n807K8973R225L511J3718J5054J9945L701j9850j1857
$$ -5370 14091 3695 -15364 -21171 7802 17027 20538 34256 49310 69255 72956 53106 41249
4579D1249Q069n520r980j5466k2647N093Q89J249L303p940j0127o654K577o888
$$ 41249 49318 43798 33818 18352 -4295 798 1687 2936 6239 -1701 -11828 -18482 -15905 -22793
4565b2793Q286K211m23J2560K5303p37q764J404q051n529M869n130J7181j226
$$ -22793 -14507 -12296 -12719 -159 25144 24407 15643 17047 8996 3467 8336 3206 20387 19161
4551A9161p505l082K134j0753j2073N708J4798j0509p250j4039o173J1454R864
$$ 19161 11656 8574 10708 -45 -12118 -6410 8388 -2121 -9371 -23410 -29583 -18129 -8265
4538h265J4007K5659K6472l737k3160n638k8247K042K155l644P342J1073l708
$$ -8265 5742 31401 57873 54136 30976 25338 -2909 -867 1288 -2356 4986 16059 12351
4525A2351M40j1038n408J6558j1803j1998N988K7629o821p843J1874M283j939
$$ 12351 12791 1753 -3655 12903 1100 -10898 -4910 22719 15898 8055 19929 24212 22273
4512B2273L849j0716j1917J8844k574r067L6r31O624P238l191j8429J435r238
$$ 22273 26122 15406 3489 22333 19759 10692 10728 9797 16421 23659 20468 2039 3474 -5764
4498e764P542R934j466p181J5779j4809k2297p619J2760K214K5237M942k1242
$$ -5764 1778 11712 10246 3065 18844 4035 -18262 -25881 -13121 -10907 14330 19272 -1970
4485a970k2124J8293K0277k618R256q780k48Q871n388L286N33p595j3983p934
$$ -1970 -24094 -5801 14476 11858 21114 12334 12086 20957 15569 18855 19388 11793 -2190 -10124
4471a0124k505l490l456J7368J588Q062p293j8870J7514K5624R520j6110k0481
$$ -10124 -12629 -16119 -19575 -2207 -619 7443 150 -18720 -1206 24418 33938 17828 -2653
4458b653p039O301m22J0392M186J1538k696k0988j9046J1263p415O877J487o53
$$ -2653 -9692 -3391 -3813 6579 10765 22303 19607 -1381 -20427 -9164 -16579 -9702 -8215 -8868
4444h868J8874j570m634j0255r677r622N814J090R504J627Q64p943Q564J0927
$$ -8868 10006 8436 3802 -6453 -16130 -25752 -19938 -18848 -9344 -7717 -6853 -14796 -6232 4695
4430D695m196r336J6800J6963j8202j7876r908K345J0237j0371L675J4816N337
$$ 4695 499 -8837 7963 24926 6724 -11152 -21060 -18715 -8478 -18849 -15174 -358 4979
4417D979Q651N635k65L521j3033k1808j2376o780K6688p639q567J5231K6305L596
$$ 4979 13630 19265 19000 22521 9488 -12320 -24696 -31476 -4788 -12427 -20994 -5763 20542 24138
4403B4138K991r632k1700P189K098J1572N620k0134r45L854j0938j03j7712n791
$$ 24138 27129 17497 -4203 2986 5084 16656 22276 2142 1197 5051 -5887 -5990 -23702 -29493
4389b9493J6133J9508O706k5224j2112R373J1154j0389Q754Q537N458J5723J1412
$$ -29493 -13360 6148 12854 -12370 -24482 -15109 -3955 -14344 -5590 2947 8405 24128 35540
4376C5540m847p24j4455o567k0223l113l523j955J7588J8255m265k7680p293J3280
$$ 35540 30693 29969 15514 8947 -11276 -14389 -17912 -19867 -2279 15976 11711 -15969 -23262 -9982
4362i982K3236R692j8931j2446J6358K887n313R209O194R397Q296j3609j6616
$$ -9982 13254 22946 4015 -8431 7927 10814 5501 14710 20904 30301 38597 24988 8372
4349H372Q114j7327m543j4985k769J8782J3375J5687p7N285j6592n916m334M315
$$ 8372 16486 -841 -5384 -20369 -23138 -4356 9019 24706 24629 29914 13322 7406 3072 7387
4335G387J7172N456o245j5830R273o078q55m236j4220M592k3240j2348J4261K5006
$$ 7387 24559 30015 23770 7940 17213 11135 10280 6044 -8176 -3584 -26824 -39172 -24911 95
4321I5K543o064K575N243o400j3974j3240M061k880j7443J0228J5178J7475k841
$$ 95 2638 -3426 -851 4392 -2008 -15982 -29222 -25161 -28041 -45484 -35256 -20078 -2603 -5444
4307e444J0400j2935m655L279J6048l355m002R953m435j5269J5811O014k37J4148
$$ -5444 4956 -7979 -12634 -9355 6693 3338 -664 9289 4854 -10415 5396 11410 11173 25321
4293B5321j3866j1483q317m668M716l012O856o888Q496J0550M556N716j2496k0711
$$ 25321 11455 -28 -8345 -13013 -8297 -11309 -4453 -11341 -2845 7705 12261 17977 5481 -15230
4279a5230j9049J0193J6311j2297m29n14n442J5536M328j1419m586p877J793O924
$$ -15230 -34279 -24086 -7775 -20072 -20501 -21015 -26457 -10921 -6593 -18012 -22598 -30475 -28682 -21758
4265b1758N587R570j0913j1688K2096L5054J0091j1268k6750l1439J5964K169
$$ -21758 -16171 -6601 -17514 -29202 -7106 27948 38039 26771 21 -31418 -15454 -13285
4253a3285k440J156R170K2588o34k199o170J70j1086o538k131j671J5183m107
$$ -13285 -15725 -14569 -5399 17189 16555 14356 8186 8356 -2730 -9268 -11399 -13070 2113 -1994
4239a994j3876K596J7837R975q731l766J0503j7862p867J041j56R292q32k26m676
$$ -1994 -15870 -13274 4563 14538 5807 2041 12544 -5318 -13185 -12144 -12300 -3008 -3840 -4066 -8742
4224h742J2331K0461j4387j3115j5297j245J2615R420J2070J3235j9134k1699
$$ -8742 3589 24050 9663 -3452 -18749 -19994 -7379 2041 14111 27346 8212 -13487
4212a3487j0744K0120M076J439J1356m43m813j1743m784M593J1337L604r358L543
$$ -13487 -24231 -4111 -35 1404 12760 12317 7504 -4239 -9023 -4430 6907 10511 1153 4696
4198D696R947R953K306n964J3726j2025j3088l556P336k0486j2258K7561J1850
$$ 4696 14643 24596 26902 20938 34664 22639 9551 5995 13331 -7155 -19413 8148 19998
4185A9998q425j5705j2982r932P756K634J2452j745J0691M875O765k900J4180
$$ 19998 11573 -4132 -17114 -27046 -19290 -16656 -4204 -5949 4742 9617 16382 13482 27662
4172B7662L805k1150M598k1225k328k70P947p266k3031j708P558R858p257q874
$$ 27662 31467 10317 14915 -6310 -8638 -8908 -961 -8227 -31258 -32966 -25408 -15550 -22807 -31681
4158c1681p262J4481K4812m406O347j5353p228R748M497K23r17j3497o682J9189
$$ -31681 -38943 -24462 350 -4056 2291 -13062 -20290 -10542 -6045 -5822 -6739 -20236 -26918 -7729
4144g729Q127n505o471K9140L85J464j455q094J0719n159j9842J0643r170j0051
$$ -7729 398 -5107 -11578 17562 17947 19411 17956 9862 20581 15422 -4420 6223 -2947 -12998
4130a2998j366K180J869j187j2253M678J7653Q791K0315j5700j1109p602J0483
$$ -12998 -14364 -12184 -10315 -11502 -23755 -19077 -1424 7367 27682 11982 873 -6729 3754
4117C754n661L138J1420l237j969O115k804k116J36r126J1422r649k5683J0212
$$ 3754 -1907 1231 12651 9414 7445 13560 10756 8640 8776 -350 11072 1423 -24260 -14048
4103a4048J0687j8052J721M560j0164r55K1668J1360j8452J7689j3929p635J0173
$$ -14048 -3361 -21413 -19692 -15132 -25296 -26251 -4583 6777 -11675 6014 -7915 -15550 -5377
4090e377J0246J7888m828o020k070q725j6101J0430J9055j6832m368J3574M440
$$ -5377 4869 22757 17929 11909 9839 1114 -14987 -4557 14498 -2334 -6702 6872 11312
4077A1312j0095m374J309l49j681P422k416m746M954j6545M888j376K1983P855
$$ 11312 1217 -3157 -1848 -2197 -3878 3544 1128 -3618 1336 -15209 -10321 -11697 10286 18141
4063A8141k1496j365J3358N289r735p411j0447k2238O344L0668P000n079k4480
$$ 18141 -3355 -4720 8638 13927 4192 -3219 -13666 -35904 -29560 1108 8108 3029 -21451
4050b1451j1354P456K4967k733P533N785L852j6748P450J2359n886j5156j6752
$$ -21451 -32805 -25349 -382 -3115 4418 10203 14055 -2693 4757 17116 11230 -3926 -20678
4037b0678p836J8084K2731J0592j5781p122O329nj816l972O078l267j1948k1338
$$ -20678 -28514 -10430 12301 22893 7112 -10 6319 6314 4498 526 6604 3337 -8611 -29949
4023b9949J4530N677p89j1103Q949K151P99R261n783K468K125j0420j8914j4613
$$ -29949 -15419 -9742 -10531 -21634 -12685 -10534 -9735 -474 -6257 -3789 -1664 -12084 -30998 -45611
4009d5611K5743K0039O347n632k945J9723n763j6359P850K0831L776j0528q783
$$ -45611 -19868 171 6518 886 -2059 17664 11901 -4458 3392 24223 27999 17471 8688
3996H688k7818k189k27K0436O750j8604j3773J0572L781l669j1375j2584K8649
$$ 8688 -19130 -21319 -21546 -1110 5640 -12964 -26737 -16165 -12384 -16053 -27428 -40012 -11363
3983a1363M005j3439J2523j3700L172O914j3371n120J2535K4408m81j2832j0467
$$ -11363 -7358 -20797 -8274 -21974 -18802 -11888 -25259 -30379 -17844 6564 6083 -6749 -17216
3970a7216J1780K8629p86q151j6059o012k507K126N902O59j2860j0658P92j5243
$$ -17216 -5436 23193 22407 14256 -1803 -7815 -10322 -8196 -2294 -1635 -14495 -25153 -24361 -39604
3956c9604K3059J7684j819j1348k509J2093K364m464j0152l731M005O547J7778
$$ -39604 -16545 1139 -680 -12028 -14537 -2444 -80 -4544 -14696 -18427 -14422 -7875 9903
3943I903J8303l002j6929k6475j4902o50K1989L0158N516j1164m762L664J2102
$$ 9903 28206 25204 8275 -18200 -33102 -33752 -11763 18395 23911 12747 7985 11649 23751
3930B3751q001k2029O003p114N545L009j4561j53l719o902N384R829P207L01j714
$$ 23751 15750 -6279 -276 -7390 -1845 1164 -13397 -13550 -17269 -24171 -18787 -8958 -1751 -1450 -3164
3915c164P170J256M85j66p160K428J2313j5017j1170N744k189j7274q390K4618
$$ -3164 4006 5262 5747 5581 -1579 849 13162 -1855 -13025 -7281 -9470 -26744 -35134 -10516
3901a0516J4670j88q185j545j1835p639J508P740P914K512J4619j8697o127R058
$$ -10516 4154 3966 -4219 -5764 -17599 -25238 -23730 -15990 -8076 -5564 9055 -9642 -15769 -6711
3887f711J3712J3080K48k744M991Q06q687j1602j4803j4172M896J3727j36j2643
$$ -6711 7001 20081 20329 17585 22576 23382 14695 3093 -11710 -25882 -20986 -7259 -7395 -20038
3873b0038o665K4373Q015j0824o43J8156K0151J9514q740l8798p86O853p098j3495
$$ -20038 -26703 -2330 5685 -5139 -5782 12374 32525 52039 43299 4501 3715 10568 3470 -10025
3859a0025m763J0488K2659J4285N49k2705r45R594K592j4988j4599J7518R184
$$ -10025 -14788 -4300 18359 32644 33193 10488 9543 19137 21729 6741 -7858 9660 18844
3846A8844o672j608n302j0129K399J3213l962j8486O203L54R621J4893r509p850
$$ 18844 12172 10564 5262 -4867 -2468 10745 6783 -11703 -5500 -5146 4475 19368 9859 2009
3832B009m945j7687Q782J8359r899k7601L306J3535Q809L765o679l033J2576M918
$$ 2009 -2936 -20623 -11841 6518 -3381 -30982 -27676 -14141 -5332 -1567 -8246 -11279 1297 6215
3818F215J2370J2934n562l437N629k257L835j2968L94R352q279k0418j5614n347
$$ 6215 18585 31519 25957 22520 28149 25892 29727 16759 17153 26505 18226 -2192 -17806 -23153
3804b3153N606n851j6314p902K8957J7005q156m015K2121n13J2951L030K822K255
$$ -23153 -17547 -23398 -39712 -47614 -18657 -1652 -9808 -13823 8298 7785 20736 23766 26588 28843
3790B8843r242j0426j0968L189k446m056r52l310j3940P033K3251J6572l679Q862
$$ 28843 19601 9175 -1793 1396 -1050 -5106 -6058 -9368 -23308 -16275 6976 23548 19869 28731
3776B8731j3242j5669l376n171q586n448L591K0769K3467O908k5578j7107m785
$$ 28731 15489 -180 -3556 -8727 -17313 -22761 -19170 1599 25066 31974 6396 -10711 -15496
3763a5496R527J7304L379j2848m508p193J0502P72j9074l880P371R330j0950j1130
$$ -15496 -5969 11335 14714 1866 -2642 -9835 667 1439 -17635 -21515 -14144 -4814 -15764 -26894
3749b6894J673J40K0497p673n735O327K0294J0966j3387q419J7405J628j6115
$$ -26894 -25221 -25081 -4584 -12257 -17992 -11665 8629 19595 6208 -2211 15194 16822 707
3736G07j0414j3284j2915K0095J9454k331j4979K772J8839p24n364j4138P21K5943
$$ 707 -9707 -22991 -35906 -15811 3643 1312 -13667 -10895 7944 7220 1856 -12282 -11561 14382
3722A4382J5775k762j0714o245m90J340r040L155m303o619k780q12O468j5921
$$ 14382 30157 27395 16681 10436 9946 11286 2246 5401 1098 -5521 -8301 -9113 -2645 -18566
3708a8566n848J1048P487r74j0879j7414p812K3796q65m644M316R655J734j2518
$$ -18566 -24414 -13366 -5879 -6853 -17732 -35146 -42958 -19162 -20027 -24671 -20355 -10700 -8966 -21484
3694b1484J6839r919j0419N863J5693M744m702K546j594k043L350k0023q947K0384
$$ -21484 -4645 -14564 -24983 -19120 -3427 1317 -3385 -839 -2433 -4476 -1126 -21149 -30096 -9712
3680i712q090j125l775p133Q412J0082Q401n696p760O397j004O870n415j3386
$$ -9712 -17802 -18927 -22702 -29835 -21423 -11341 -2940 -8636 -16396 -9999 -11003 -4133 -9548 -22934
3666b2934J276K211q560J815L890N367j3602L742J2825J1428p81K544J4689Q043
$$ -22934 -21658 -19447 -28007 -26192 -22302 -16935 -30537 -26795 -13970 -2542 -3323 -779 13910 21953
3652B1953k4117j7065j5293N308P21O327M958J4460n424L960J2859J5278O244
$$ 21953 -2164 -19229 -34522 -29214 -28493 -22166 -17208 -2748 -8172 -4212 8647 23925 30169
3639C0169r622j5362p436p423j1506l976J5984Q114n819q450j552j4663o637J915
$$ 30169 20547 5185 -2251 -9674 -21180 -25156 -9172 -1058 -6877 -15327 -16879 -31542 -38179 -36264
3625c6264k04J3613J5722l624P570j180k6499n359Q935R462M233J894J696j4034
$$ -36264 -36468 -22855 -7133 -10757 -3187 -4367 -30866 -36225 -27290 -17828 -13595 -11701 -10005 -24039
3611b4039J208K1579k908j703k4131j137q217p307K3804K3842P033P71o086K401
$$ -24039 -22831 -1252 -4160 -5863 -29994 -31131 -39348 -46655 -22851 991 8024 8795 2709 5110
3597E110N231j7639L594O126j8129N466J3061K757n877N032M713q5O984k874k813
$$ 5110 10341 -7298 -3704 2422 -15707 -10241 2820 5577 -300 4732 9445 9360 16344 13470 10657
3582A0657j0548j9793J7712N642q657p08l565Q893k112k782l551k1206N376O745
$$ 10657 109 -19684 -1972 3670 -4987 -5695 -9260 -367 -2479 -5261 -8812 -30018 -24642 -17897
3568a7897j3307n356J3101R405O546j4837K905J2414J8769M071O639l791j7975
$$ -17897 -31204 -36560 -23459 -14054 -7508 -22345 -19440 -7026 11743 15814 22453 18662 687
3555F87K076q16j1004o701J3374j547O177J4767n343p170r462L221P196N522J4180
$$ 687 2763 1947 -9057 -15758 -2384 -3931 2246 17013 11670 4500 -4962 -1741 5455 10977 25157
3540B5157l995j0232M004k5673j2862r181J2130K359L741J729l416Q104p75k505
$$ 25157 21162 10930 14934 -10739 -23601 -32782 -20652 -18293 -14552 -12823 -16239 -8135 -8910 -11415
3526a1415o659p845P775K2077R035N434j1505J199L648k6332j3630K823J573K103
$$ -11415 -18074 -25919 -18144 3933 12968 18402 6897 8096 11744 -14588 -28218 -25395 -23822 -21719
3512b1719J9258o476j3789m530K2731K92j8976K276n107L137N865j2511l425R567
$$ -21719 -2461 -8937 -22726 -27256 -4525 -4233 -23209 -20933 -26040 -22903 -17038 -29549 -32974 -23407
3498b3407J0498K54L966k77n717j8119l360J0356J2743M38O600o403o371q759
$$ -23407 -12909 -12655 -8689 -8966 -14683 -32802 -36162 -25806 -13063 -12625 -6025 -12428 -18799 -27558
3484b7558O81q873K0398J9873R54o219j0351J8489J4369l106O68J7478Q827n60
$$ -27558 -26877 -35750 -15352 4521 5475 -744 -11095 7394 21763 18657 19325 36803 45630 45070
3470D5070j2617j7771R784J7455j3943r071J756K099O8j1668k3875k6710k527
$$ 45070 32453 14682 24466 41921 27978 18907 20663 22762 22830 11162 -12713 -39423 -41950
3457d1950K8915J2417q124n91R096J238l8K250p150n230N351o610J0504J3972
$$ -41950 -13035 -618 -8742 -9333 -237 1001 963 3213 -3937 -9167 -3816 -10426 78 14050
3443A4050K96o532k6608N19J1608k776R688k877j3837R868J1981j931l676j7311
$$ 14050 14346 7814 -18794 -18275 -6667 -9443 245 -2632 -16469 -6601 5380 3449 -227 -17538
3429a7538Q249j7797j7684J0855K3447j0214l26O351N503K747L771L552J3725
$$ -17538 -9289 -27086 -44770 -33915 -10468 -20682 -21008 -14657 -9154 -6407 -2636 916 14641
3416A4641J1617Q120o856o284q508j1101j902Q813J6508j701q691j959k5222j1616
$$ 14641 26258 34378 27522 21238 12730 1629 -273 8540 25048 23347 14656 12697 -12525 -24141
3402b4141j770J2636L5318K0430l239j5649j5344k876j989p824J798K142M614
$$ -24141 -25911 -13275 22043 42473 39234 23585 8241 5365 3376 -4448 -2650 -508 4106
3389D106n224N103q767n909j957J1513N226P930K08o112k949K0205Q35j067K966
$$ 4106 -1118 3985 -4782 -10691 -12648 -1135 4091 12021 12229 6117 3168 23373 24208 23141 26107
3374B6107M097p336l379N291J0494j8371m062J809r594j5991J051K3654L0373
$$ 26107 30204 22868 19489 24780 35274 16903 12841 14650 5056 -10935 -9884 13770 44143
3361D4143j3541o500n969l176K93k4987J440J3573L314j3011K075J000r125N867
$$ 44143 30602 24102 18133 14957 15250 -9737 -8297 5276 8590 -4421 -2346 -1346 -10471 -4604
3347d604j5881j2513K0586K2811J593q298r75J7106m010M008p606o425j646p196
$$ -4604 -20485 -32998 -12412 10399 11992 3694 2719 19825 15815 19823 12217 5792 4146 -3050
3333c050Q346j5137k078N80R643J0264J2951K4534o255k7419j6439N049Q194r64
$$ -3050 5296 -9841 -11919 -11339 -1696 8568 21519 46053 39798 12379 -4060 989 9183 8219
3319H219k4237q465P282J2271O722j1217j1742N215M762R004K319O819l998j1006
$$ 8219 -16018 -24483 -17201 -4930 1792 -9425 -21167 -15952 -11190 -2186 133 6952 2954 -8052
3305h052q54m561q372K863J9961k401o027P36k072j1302m269R40q420M523J3927
$$ -8052 -8906 -13467 -21839 -18976 985 -1416 -7443 -6707 -8779 -20081 -24350 -23410 -31830 -27307 -13380
3290a3380J1579K812K745k129p820j9662j447L142O219J2971q261j1184k402Q736
$$ -13380 -1801 1011 3756 1627 -6193 -25855 -27302 -24160 -17941 -4970 -13231 -24415 -26817 -18081
3276a8081R104P121N107q847m403o132J8191J6528L60j9566j2400j5581j8807
$$ -18081 -8977 -1856 3251 -5596 -9999 -16131 2060 18588 18948 -618 -13018 -28599 -47406
3263d7406R547R046J4115N75J5672K4672l95p057P035j5374k1771j6067J5278
$$ -47406 -37859 -28813 -14698 -14123 1549 26221 25826 18769 25804 10430 -11341 -27408 -12130
3250a2130N017j3275O576K6542J380j0680l381Q192r71j0754R53L574O553j5626
$$ -12130 -7113 -20388 -13812 12730 14110 3430 49 8241 7270 -3484 -2531 1043 7596 -8030
3236h030k2942J1094K5390L350P16j106Q874n340l054j575j2744J457K461O442
$$ -8030 -30972 -19878 5512 8862 9578 8472 17346 12006 8952 7377 -5367 -3910 -1449 4993
3222D993j3667j0021L745o436K111P339K479L017l821K426K4983J4153Q852Q709
$$ 4993 -8674 -18695 -14950 -21386 -19275 -11936 -9457 -6440 -10261 -7835 17148 31301 40153 48862
3208D8862L185r491j339k2315j8728Q397O990m094p075n704j517L116j393o75
$$ 48862 52047 42556 41217 18902 174 8571 15561 11467 4392 -1312 -2829 287 -1106 -1781
3194a781J803L108m036o305o050j902j13R760L1533J2669j9327k0696N944r14
$$ -1781 22 3130 -906 -7211 -13261 -15163 -15276 -5516 26017 38686 19359 -1337 4607 3693
3180C693j6888P793L082P049l068R388m166j986j683P34J2243N267J053j6012
$$ 3693 -13195 -5402 -2320 4729 1661 11049 6883 4897 3214 3948 16191 21458 22511 6499
3166F499j2047l169J7381j5740J1598J3569P888p934r07k68j7480o931K058O124
$$ 6499 -5548 -8717 8664 -7076 4522 18091 25979 18045 17138 16870 -610 -7541 -5483 641
3152F41o37m018N891j1991Q347j230q232K112J242J4861j3586j2800j5850J3698
$$ 641 4 -4014 1877 -10114 -1767 -2997 -11229 -9117 -7875 6986 -6600 -19400 -35250 -21552
3138b1552O379J3912J0829K307r142p396Q120M935L299J476j2009o231k368n026
$$ -21552 -15173 -1261 9568 11875 2733 -4663 3457 8392 11691 13167 1158 -5073 -7441 -12467
3124a2467j2631m150J1261R676K1988j441q16O104q623j5137Q813J4525N852j1101
$$ -12467 -25098 -29248 -17987 -8311 13677 12236 11420 17524 8901 -6236 2577 17102 22954 11853
3110A1853j0255k3906j7638M693L290j2076M476J3131L8124K940j641j5566p685
$$ 11853 1598 -22308 -39946 -35253 -31963 -44039 -39563 -26432 11692 14632 12991 -2575 -10260
3097a0260J4098K919k5709m533J502J4444P508N586j281M217j2425M030j6159
$$ -10260 3838 6757 -18952 -23485 -21983 -7539 -31 5555 4274 8491 -3934 96 -16063
3084a6063j579K835K920J30J0374k165O205J6235n681M071m246k1674L932J0358
$$ -16063 -17642 -14807 -11887 -11757 -1383 -3548 2657 18892 13211 17282 13036 -8638 -4706 5652
3070E652q464j1634j1769n802J5478K3138n904q07j3106j0842K9812J0050l091
$$ 5652 -2812 -14446 -26215 -32017 -16539 6599 695 -112 -13218 -24060 5752 15802 12711
3057A2711J7571J021n260L254j1374j1165N320M717J0178J2307j1486j9281J1516
$$ 12711 30282 31303 26043 29297 17923 6758 12078 16795 26973 39280 27794 8513 20029
3044B0029J5541n505k3828k0970j1703k99J2748M606o525q497J0810K3268J2417
$$ 20029 35570 30065 6237 -14733 -26436 -26735 -13987 -9381 -15906 -24403 -13593 9675 22092
3031B2092J8220j0006n589N867l569l551k2769j0447J8970q315K0089N389J902
$$ 22092 40312 30306 24717 30584 27015 23464 695 -9752 9218 903 20992 26381 28283
3018B8283k1968o456J063N114q56M246J2235p932J193m20K7856k1658j1282K8652
$$ 28283 6315 -141 922 6036 5180 9426 21661 13729 14922 14502 42358 20700 9418 38070
3004C8070J7097j6719k5471j063M889L24K478M742Q930K899p117k7405l541K4299
$$ 38070 55167 38448 12977 11914 16803 17127 19605 24347 33277 36176 29059 1654 -1887 22412
2990B2412k664j8524j2196r189o758J8225K9937j4833O987p850j6930q830M061
$$ 22412 19748 1224 -10972 -20161 -26919 -8694 21243 6410 13397 5547 -11383 -20213 -16152
2977a6152K1830m665n806P977M78m767L851L175j3669j7557M179R240J0284l796
$$ -16152 5678 1013 -4793 3184 3662 -1105 2746 5921 -7748 -25305 -21126 -11886 -1602 -5398
2963e398k673k4218j7826P98J7327J6433J5316J5053n300l574J0861k2231r589
$$ -5398 -8071 -32289 -50115 -49317 -31990 -15557 -241 14812 9512 5938 16799 -5432 -15021
2950a5021K0096j0866o897O773K624j8598l582J4976J2223Q996m198o850L098
$$ -15021 5075 -5791 -12688 -5915 -3291 -21889 -25471 -10495 1728 10724 6526 -324 2774
2937B774J7697o236q737N945Q880j7214p344j6657j956N565O674R77K52O81R429
$$ 2774 20471 14235 5498 11443 20323 3109 -4235 -20892 -22848 -17283 -10609 -9632 -9380 -8699 730
2922G30J0806j7644O10L272r129J128k456j7954J1922M902J376Q156M069K0484
$$ 730 11536 -6108 -5498 -2226 -11355 -10227 -12683 -30637 -18715 -13813 -12437 -4281 -212 20272
2908B0272j3084j1916m807J4843K1583M330j5326j646N610P217o995k0269P213
$$ 20272 7188 -4728 -9535 5308 26891 31221 15895 14249 19859 27076 20081 -188 7025
2895G025L576J6097n891j4812N112J6002O506j6734l1288j7406J9351j349P811
$$ 7025 10601 26698 20807 5995 11107 27109 33615 16881 -14407 -31813 -12462 -13811 -6000
2882f000P718N670K646P172m607o072j4703K5783J5544q968j9277M34O904k3200
$$ -6000 1718 7388 10034 17206 12599 6527 -8176 17607 33151 24183 4906 5340 12244 -10956
2868a0956j1781p226J3124P654J714k66J1093R452L022k810o751n127j7k82J0578
$$ -10956 -22737 -29963 -16839 -9185 -7471 -7737 3356 12808 15830 13020 6269 1142 1125 843 11421
2853A1421R922k0650k0407J3644J3615k830n174q300j3445j6374n890n276o80
$$ 11421 21343 693 -19714 -6070 7545 4715 -459 -8759 -22204 -38578 -44468 -49744 -50424
2840e0424P488J3384k766P330K5424n95p847n462O670N962M468J1489n831p068
$$ -50424 -42936 -29552 -32318 -24988 436 -159 -8006 -13468 -6798 -836 3632 15121 9290 2222
2826B222j0259J7114J75J3042N673j2359p089j799K326m481j1796j5777R846K7953
$$ 2222 -8037 9077 9252 22294 27967 15608 8519 6720 9046 4565 -7231 -23008 -13162 14791
2812A4791K677l552j8721k6823J4061R355j7640j398R333O902J3204J6983J8466
$$ 14791 17468 13916 -4805 -31628 -17567 -8212 -25852 -27250 -17917 -11015 2189 19172 37638
2799C7638J0459o790q964l156l362j5443p564J2729K174j0574q278L766p328O074
$$ 37638 48097 41307 32343 29187 25825 10382 2818 15547 17721 7147 -1131 2635 -4693 1381
2785A381J2916K824j1966Q539N411l557K8R09m186J0067j171j919P866K544o842
$$ 1381 14297 17121 5155 13694 19105 15548 15576 16485 12299 22366 21195 19276 27142 29686 22844
2770B2844k2040j5454L58K4539J9101r152M051j4357K429Q340K568k540p060j3492
$$ 22844 804 -14650 -14292 10247 29348 20196 24247 9890 12319 20659 23227 20687 13627 135
2756A35j3813j2757P164l6P042J4133J459j154j5002n240M400K2349R603r160
$$ 135 -13678 -26435 -19271 -19307 -12265 1868 3327 2173 -12829 -18069 -13669 8680 18283 9123
2742I123M238R17j1852P578R27N131j3131r148J3776K2011l821o621J3552M381
$$ 9123 13361 14278 2426 10004 10931 16062 2931 -6217 7559 29570 25749 19128 32680 37061
2728C7061l4463k2962K7979P792J799k252p582j1309n114K916N378n507J050j0121
$$ 37061 2598 -20364 7615 15407 17206 14954 7372 -3937 -9051 -6135 -757 -6264 -5214 -15335
2714a5335n223j0554J7222J7451j143k2352j5642j0364J4034R21J0596P826n265
$$ -15335 -20558 -31112 -13890 3561 2418 -19934 -35576 -45940 -31906 -30985 -20389 -12563 -17828
2701a7828q645j1111J6760J1675Q834j8055k2652N879J4708J7436R768J0038j9393
$$ -17828 -26473 -37584 -20824 -9149 -315 -18370 -41022 -35143 -20435 -2999 6769 16807 -2586
2688b586j906J9057M837Q972j3908j5455j4062n120Q472K205N6Q98P750q991p431
$$ -2586 -4492 14565 19402 28374 14466 -989 -15051 -20171 -11699 -9494 -9438 -8540 -790 -9781 -17212
2673a7212O339J6792k027p052j5010k7011L911J3780p31K604p525J0847j619k636
$$ -17212 -10873 5919 3892 -3160 -18170 -45181 -41270 -27490 -28221 -25617 -33142 -22295 -23914 -26550
2659b6550Q495N722J3201J9371l991O518K874k3851j5158j0109m449J6930J738
$$ -26550 -18055 -12333 868 20239 16248 22766 25640 1789 -13369 -23478 -27927 -10997 -9259
2646i259q789r267K418k538L889J2463J172j5123j4263J3565O706j6469L8J1350
$$ -9259 -18048 -27315 -24897 -27435 -23546 -11083 -9911 -25034 -39297 -25732 -19026 -35495 -35457 -24107
2632b4107L499K5461O745k5256j9826J4445O536j5449q690P412K3936K4047j942
$$ -24107 -20608 4853 11598 -13658 -33484 -19039 -12503 -27952 -36642 -29230 -5294 18753 16811
2619A6811j0406K6093J3304j5377j597k1081l6875j0315J6134J7978R478N84j0764
$$ 16811 6405 32498 45802 30425 28828 7747 -29128 -39443 -23309 -5331 4147 4731 -6033
2606f033R461N973L461J0039N541j0074p832J216O235P450N484K966j359j6836
$$ -6033 3428 9401 12862 22901 28442 18368 10536 11752 17987 25437 30921 33887 32528 15692
2592A5692j6701q956j2408Q146J2565J5151J0518o990j6740J9098R335R409l71
$$ 15692 -1009 -9965 -22373 -14227 -1662 13489 24007 17017 277 19375 28710 38119 37748
2579C7748j2760k0929j1634P311J2687p486k9662q371J1418K062j2473o949r1
$$ 37748 24988 4059 -7575 -264 12423 4937 -24725 -33096 -21678 -19616 -32089 -39038 -39129
2566c9129J1178J7116J5541M505q240k4571J4510J1001K242j4578j9039M604K3100
$$ -39129 -27951 -10835 4706 9211 971 -23600 -9090 1911 4153 -10425 -29464 -24860 -1760
2553a760R442j1890l777P396L111O359n664Q885l6959j5775J4792J4335J3148
$$ -1760 7682 -4208 -7985 -589 2522 8881 3217 12102 -24857 -40632 -25840 -11505 1643
2540A643j201j9056j3173M310K947K357O267n632J525K8478l566K147O860n554
$$ 1643 442 -18614 -31787 -27477 -24530 -22173 -15906 -21538 -20013 8465 4899 7046 13906 8352
2526H352J177K799L201q055j5487R590Q254J524J147l383j1744n83n341k80M676
$$ 8352 9529 12328 15529 7474 -8013 1577 9831 11355 12502 9119 -2625 -3208 -8549 -8829 -4153
2511d153Q092j0441Q272j001l823N895J1055k4926k899J2780J1101J832j0975
$$ -4153 3939 -6502 1770 769 -3054 2841 13896 -11030 -13929 -1149 9952 11784 809
2498H09N465o05P274m991k4824J2251J4357o139j2326n083r407j4294K3692K7676
$$ 809 6274 5669 12943 7952 -16872 -4621 9736 3597 -8729 -13812 -23219 -37513 -13821 13855
2484A3855j3008K429j1620P45L043N877K0835P864J5188j4809j4675q141j6782
$$ 13855 847 3276 -8344 -7599 -4556 1321 22156 30020 45208 30399 15724 7583 -9199
$$ [...]
##END NTUPLES=NMR SPECTRUM
##END=
