##TITLE=Analysis number 322719
Compound Code rh 01288
Project Code adrs
Chemist Name fudan
##JCAMPDX= 6.0         $$ Bruker NMR JCAMP-DX V2.0
##DATA TYPE= NMR SPECTRUM
##DATA CLASS= NTUPLES
##ORIGIN= Bruker BioSpin GmbH
##OWNER= nmr
$$ XWIN-NMR		Version 3.5
$$ Fri Oct 13 15:23:28 2006 GMT Daylight Time (UT+1h)  MAYBRIDGE\nmr@NMR_250MHZ
##.OBSERVE FREQUENCY= 250.131544655141
##.OBSERVE NUCLEUS= ^1H
##.ACQUISITION MODE= SIMULTANEOUS (DQD)
##.ACQUISITION SCHEME= undefined
##.AVERAGES= 16
##.DIGITISER RES= 18
##SPECTROMETER/DATA SYSTEM= dpx250
##.PULSE SEQUENCE= zg30
##.SOLVENT NAME= CDCl3
##.SHIFT REFERENCE= (INTERNAL, CDCl3, 0, 16.522)
##AUDIT TRAIL= $$ (NUMBER, WHEN, WHO, WHERE, WHAT)
$$ ##TITLE= Audit trail, XWIN-NMR		Version 3.5
$$ ##JCAMPDX= 5.01
$$ ##ORIGIN= Bruker BioSpin GmbH
$$ ##OWNER= nmr
$$ C:\u/data/dgb/nmr/ADRS/250/pdata/1/auditp.txt
$$ ##AUDIT TRAIL=  $$ (NUMBER, WHEN, WHO, WHERE, WHAT)
(   1,<2006-10-13 15:23:04.12 +100>,<MAYBRIDGE\nmr>,<NMR_250MHZ>,
      <created by zg, POWCHK disabled, PULCHK disabled
       configuration hash MD5:
       49 4B E0 1D 92 C2 6B 37 9F E6 65 BC 52 41 86 1D
       data hash MD5: 64K
       06 11 41 AD ED 24 27 FC 70 8C 07 0C 94 75 15 26>)
(   2,<2006-10-13 15:23:18.24 +100>,<MAYBRIDGE\nmr>,<NMR_250MHZ>,
      <Start of raw data processing
       ef LB = 0.3 FT_mod = 6 PKNL = 1 SI = 32K 
       data hash MD5: 32K
       41 33 35 A0 92 F0 02 73 9A CB C9 9D 24 F8 CB 2E>)
(   3,<2006-10-13 15:23:20.46 +100>,<MAYBRIDGE\nmr>,<NMR_250MHZ>,
      <apk 
       data hash MD5: 32K
       55 2F A0 BE 70 0E 32 E0 5A 72 7C CA 6E D7 16 2C>)
(   4,<2006-10-13 15:23:21.56 +100>,<MAYBRIDGE\nmr>,<NMR_250MHZ>,
      <abs ABSG = 5 
       data hash MD5: 32K
       15 FA CD 59 F8 D0 F9 2C C1 C4 7B EB 0B 5C F1 F2>)
$$ ##END=
$$ 
$$ hash MD5
$$ 13 FB 46 C7 BE D1 35 82 59 C1 4F 2B 18 4E A1 D6
##$RELAX= 
##$RELAX= 
##$RELAX= 
##$RELAX= 
##$RELAX= 
##$RELAX= 
##$RELAX= 
$$ Bruker specific parameters
$$ --------------------------
##$DU= <C:\u>
##$EXPNO= 250
##$NAME= <ADRS>
##$PROCNO= 1
##$TYPE= <nmr>
##$USER= <dgb>
##$AMP= (0..31)
100 100 100 100 100 100 100 100 100 100 100 100 100 100 100 100 100 100 
100 100 100 100 100 100 100 100 100 100 100 100 100 100 
##$AQSEQ= 0
##$AQ_mod= 3
##$AUNM= <au_zg>
##$AUTOPOS= <45 >
##$BF1= 250.13
##$BF2= 250.13
##$BF3= 250.13
##$BF4= 250.13
##$BF5= 500.13
##$BF6= 500.13
##$BF7= 500.13
##$BF8= 500.13
##$BYTORDA= 1
##$CFDGTYP= 0
##$CFRGTYP= 5
##$CHEMSTR= <none>
##$CNST= (0..31)
1 1 145 1 1 1 1 1 1 1 1 1 1 1 1 1 1 1 1 1 1 1 1 1 1 1 1 1 1 1 1 1 
##$CPDPRG= <>
##$CPDPRG1= <>
##$CPDPRG2= <>
##$CPDPRG3= <>
##$CPDPRG4= <mlev>
##$CPDPRG5= <mlev>
##$CPDPRG6= <mlev>
##$CPDPRG7= <mlev>
##$CPDPRG8= <mlev>
##$CPDPRGB= <>
##$CPDPRGT= <>
##$D= (0..31)
0 1 0 0 0 0 0 0 0 0.06 0 0 0 0 0 0 0.0002 0 0 0 0 0 0 0 0 0 0 0 0 0 0 
0 
##$DATE= 1160749382
##$DBL= (0..7)
120 120 120 120 120 120 120 120 
##$DBP= (0..7)
150 150 150 150 150 150 150 150 
##$DBP07= 0
##$DBPNAM0= <>
##$DBPNAM1= <>
##$DBPNAM2= <>
##$DBPNAM3= <>
$$ [...]
##$SUBNAM7= <"">
##$SUBNAM8= <"">
##$SUBNAM9= <"">
##$SW= 20.6930455092707
##$SWIBOX= (0..15)
0 0 3 0 0 0 0 0 0 0 0 0 0 0 0 0 
##$SW_h= 5175.983436853
##$TD= 65536
##$TD0= 1
##$TE= 683.16
##$TE2= 300
##$TE3= 300
##$TEG= 300
##$TL= (0..7)
0 120 120 120 120 120 120 120 
##$TP= (0..7)
150 150 150 150 150 150 150 150 
##$TP07= 0
##$TPNAME0= <>
##$TPNAME1= <>
##$TPNAME2= <>
##$TPNAME3= <>
##$TPNAME4= <>
##$TPNAME5= <>
##$TPNAME6= <>
##$TPNAME7= <>
##$TPOAL= (0..7)
0.5 0.5 0.5 0.5 0.5 0.5 0.5 0.5 
##$TPOFFS= (0..7)
0 0 0 0 0 0 0 0 
##$TUNHIN= 0
##$TUNHOUT= 0
##$TUNXOUT= 0
##$USERA1= <user>
##$USERA2= <user>
##$USERA3= <user>
##$USERA4= <user>
##$USERA5= <user>
##$V9= 5
##$VALIST= <valist>
##$VCLIST= <CCCCCCCCCCCCCCC>
##$VD= 0
##$VDLIST= <DDDDDDDDDDDDDDD>
##$VPLIST= <PPPPPPPPPPPPPPP>
##$VTLIST= <TTTTTTTTTTTTTTT>
##$WBST= 1024
##$WBSW= 4
##$XGAIN= (0..3)
0 0 0 0 
##$XL= 0
##$YL= 0
##$YMAX_a= 698843
##$YMIN_a= -620884
##$ZGOPTNS= <>
##$ZL1= 120
##$ZL2= 120
##$ZL3= 120
##$ZL4= 120
##$ABSF1= 16.522
##$ABSF2= -4.171173
##$ABSG= 5
##$ABSL= 3
##$ALPHA= 0
##$AQORDER= 0
##$ASSFAC= 0
##$ASSFACI= 0
##$ASSFACX= 0
##$ASSWID= 0
##$AUNMP= <proc_1d>
##$AZFE= 0.1
##$AZFW= 0.1
##$BCFW= 0
##$BC_mod= 0
##$BYTORDP= 0
##$COROFFS= 0
##$CY= 12.5
##$DATMOD= 1
##$DC= 0
##$DFILT= <>
##$DTYPP= 0
##$F1P= 14.0000005364418
##$F2P= -0.99999901652339
##$FCOR= 0.5
##$FTSIZE= 32768
##$FT_mod= 6
##$GAMMA= 0
##$GB= 0
##$INTBC= 1
##$INTSCL= 1
##$ISEN= 128
##$LB= 0.3
##$LEV0= 0
##$LPBIN= 0
##$MAXI= 10000
##$MC2= 0
##$MEAN= 0
##$ME_mod= 0
##$MI= 0
##$NCOEF= 0
##$NC_proc= -5
##$NLEV= 6
##$NOISF1= 0
##$NOISF2= 0
##$NSP= 0
##$NTH_PI= 0
##$NZP= 0
##$OFFSET= 16.522
##$PC= 1
##$PHC0= 170.2417
##$PHC1= -10.5508
##$PH_mod= 1
##$PKNL= yes
##$PPARMOD= 0
##$PSCAL= 4
##$PSIGN= 0
##$REVERSE= no
##$SF= 250.13
##$SI= 32768
##$SIGF1= 0
##$SIGF2= 0
##$SINO= 400
##$SIOLD= 32768
##$SREGLST= <1H.CDCl3>
##$SSB= 0
##$STSI= 32768
##$STSR= 0
##$SW_p= 5175.98343685301
##$SYMM= 0
##$S_DEV= 0
##$TDeff= 65536
##$TDoff= 0
##$TI= <Analysis number 999999
Compound Code 99
Book Reference 9
Project Code 9>
##$TILT= no
##$TM1= 0
##$TM2= 0
##$TOPLEV= 0
##$USERP1= <user>
##$USERP2= <user>
##$USERP3= <user>
##$USERP4= <user>
##$USERP5= <user>
##$WDW= 1
##$XDIM= 32768
##$YMAX_p= 414888989
##$YMIN_p= -117210
$$ End of Bruker specific parameters
$$ ---------------------------------
##NTUPLES= NMR SPECTRUM
##VAR_NAME=  FREQUENCY,     SPECTRUM/REAL,   SPECTRUM/IMAG
##SYMBOL=    X,             R,               I
##VAR_TYPE=  INDEPENDENT,   DEPENDENT,       DEPENDENT
##VAR_FORM=  AFFN,          ASDF,            ASDF
##VAR_DIM=   32768,         32768,           32768
##UNITS=     HZ,            ARBITRARY UNITS, ARBITRARY UNITS
##FACTOR=    0.157963299565203, 1,           1
##FIRST=     4132.6476996994, 0,             0
##LAST=      -1043.33573715361, 0,           0
##MIN=       -1043.33573715361, -117210,     0
##MAX=       4132.6476996994, 414888989,     0
$$ Real data points
##PAGE= N=1
##DATA TABLE= (X++(R..R)), XYDATA
$$ [...]
15713d5540J7969K2614M5347P168j851o683l4393J5115J0907K629o903k0138j1725
15700e484m3896j3872j445l027L802J5492J6663J1976k304k4966j232M0754K5395
15687A7856J1580n74k3057k2770k9844j1115J0303R877O36M397O59j9388j4330
15674f5770l133P075J0636j460j9525K6330N1780K1648k0907l8458k6944J5560
15662d3168M5914K4861L541p785N674K08l20j0316O399o994l6211k5076K5215
15649a8058j633j8835J9644K9972J2138k8581k0124k029j1551j1101j7797k2539
15637i0494J763j800J3809J8181J2113K4199Q176j556l384P026q187J872M962
15624a3320n313Q30K1246J0693k0615J736k577J202J9123K3961R584K4653K3182
$$ y = [-45540, -27571, -4957, 40390, 47558, 45707, 39024, 4631, 19746, 30653, 33282, 26379, 6241, -5484, -49380, -63252, -64697, -67724, -63922, -48430, -31767, -19791, -22095, -47061, -48293, -7539, 17856, 29436, 28862, 5805, -16965, -46809, -57924, -47621, -37744, -37108, -32711, -32052, -51440, -65770, -68903, -61828, -51192, -52652, -72177, -45847, 5933, 27581, 6674, -31784, -58728, -43168, 2746, 27607, 31148, 23363, 29037, 29245, 28925, 18609, 25008, 18014, -18197, -43273, -18058, -19691, -38526, -18882, 11090, 23228, -5353, -25477, -27506, -39057, -50158, -67955, -90494, -88731, -90531, -76722, -58541, -46428, -22229, -14053, -15609, -18993, -11967, -20154, -18282, -13320, -18633, -17803, 3443, 14136, -6479, -4743, -7320, -6118, 13005, 36966, 46550, 71203, 94385]
15611I4385J8775n054k9744k7231O043L570k1856k2473N69M371J8152j7411j0923
15598A1173j6213j849K2367j4481j6977L5504J873L956k6811j8218j9525k3398
15586f2599L0571L314j6294q500j1831K5963R548R660L748m941k3058J0045J4287
15573b0087L11P908m614L356k5600m701p701R69j635K2717L41K2968K4514k2050
15559c304k9074n067m1298j3610J5088L5581L8232j0375k7229o776L1746J3730
15547b356K4558K7056j2346m2969j7690J9686J7899L5523K8488J4594J8369l3926
15535G6886m5898j9744p320l2583k5964k586J633P218L910K007J8412L1441L4094
15522D1506J8830k5366o492k2083l8284j6127J2034L2633J8282j6367K49k7189
$$ y = [94385, 113160, 108106, 78362, 51131, 57174, 60744, 38888, 16415, 16984, 21355, 39507, 22096, 11173, -5040, -6889, 15478, 997, -15980, 19524, 21397, 25353, -1458, -19676, -39201, -62599, -32028, -28714, -45008, -53508, -65339, -39376, -29828, -20168, -16420, -21361, -44419, -34374, -20087, -19776, -11868, -16482, -13126, -38726, -43427, -51128, -50159, -51794, -29077, -28736, -5768, 18746, -3304, -32378, -37445, -78743, -92353, -77265, -41684, -3452, -13827, -41056, -47832, -16086, -2356, 22202, 49258, 36912, -6057, -23747, -4061, 13838, 49361, 77849, 92443, 110812, 76886, 30988, 11244, 3924, -28659, -54623, -57209, -55576, -48358, -44448, -42441, -24029, 7412, 41506, 60336, 34970, 28478, 6395, -31889, -48016, -35982, -3349, 14933, -1434, -1185, -28374]
15510b8374k6761P833L1695M733m479J0637m784M84J0484L4730N6103p5j8433
15497G3793k733k7038k5870r276P824J0012k0310K758o954r8k1819k1945R108
15484c2548l3626l4291L0289J4847L9881L5111n622p460m3883j6008L7640J8328
15472B658m220j646j870q610J0987n669J172Q489P319j1009k5243j3211l0954
15459g1807k1347K5652N1560J2838j8698o346L880M776O580P63M159J821j9308
15446b5477j0785K425J1796k7085J9535K1228k942k5868O96K6745J9501r140l2161
15433c1532M431J399R950J0584m980K140K4202L2494L9477J4202k9713j8961m5821
15420G872j1138k1056l4197L9461K6152l859j8567J9837L8632k94m1136o68M804
$$ y = [-28374, -55135, -47302, -15607, -10874, -15353, -4716, -9500, -9016, 1468, 36198, 92301, 92226, 73793, 71060, 44022, 18152, 8876, 16700, 26712, 6402, 9160, 2206, 2108, -19711, -41656, -32548, -66174, -100465, -70176, -55329, -15448, 19663, 14041, 6581, -37302, -53310, -15670, 2658, -1562, -3208, -5078, -13688, -2701, -8370, -7198, 1291, 8610, -2399, -27642, -40853, -71807, -93154, -67502, -15942, -3104, -21802, -28148, -24268, -19492, -12912, -12149, -7990, -6169, -25477, -36262, -33837, -22041, -49126, -29591, -8363, -11305, -37173, -36477, -9732, 9769, 629, -31532, -27101, -25702, -15752, -5168, -10148, -8008, 16194, 48688, 88165, 102367, 72654, 53693, 7872, -3266, -24322, -58519, -19058, 7094, 3235, -15332, 4505, 43137, 42843, 1707, 1039, 5843]
15407E843N926l3352k4368j1944J1159J7072k3737k540K931L024l282P952K1853
15394b3463R168j2894l2295o503j1417r982J4020N248K2590q288j470K2164j2384
15381d5506J3342j0909r218N173r42m122J0989J5281K718n159K8432k402j5888
15368a8211j6512J902J9065j0852O091j0490k8876n095J0222M3751P147k2311
15356b4169j4014M491J0682k169K1170k4925k4145J0411J8674L827O010p288k482
15343b3927N656k5263m812K8825J3164Q684J6361J5190q168J100m428k1271k151
15330a040k1388O98j1117k7706K745J0525m928k0147j025J492K4171J4192j0995
15317d4523P890M163J0778K266J6241J5041n180j2930M323O121n097j6052J666
$$ y = [5843, 11769, -21583, -45951, -57895, -46736, -29664, -53401, -55941, -53010, -49986, -53268, -45316, -23463, -14295, -27189, -59484, -65987, -77404, -87386, -73366, -68118, -45528, -53816, -55286, -33122, -45506, -32164, -43073, -52291, -47118, -48060, -52182, -41193, -25912, -23194, -28353, 79, -2323, -18211, -34723, -32821, -13756, -24608, -18517, -29007, -57883, -62978, -52756, -9005, -1858, -24169, -38183, -33692, -23010, -25179, -4009, -28934, -53079, -42668, -23994, -20167, -14157, -21445, -23927, -18271, -43534, -48346, -19521, -6357, 2327, 18688, 33878, 25710, 26810, 22382, 1111, -1040, -22428, -21730, -32847, -60553, -57808, -47283, -52211, -72358, -73383, -71891, -47720, -33528, -44523, -36633, -32470, -21692, -19426, -3185, 11856, 6676, -6254, -1931, 4190, -907, -16959, -15293]
15304a5293M1798J2937o444l9157q427J8159K2131p88K606j7512Q382N048N09
15291B3949J828l119o969P196j164Q133j8435m9323j0451P773J2040P684j0647
15278c1505j6476K0527N0090O514j9771j0979j0420k7545k4161K5162K6814R493
15266b257N597M28l301j1511J1739l1304m243k786r460k8642J348L5771M9329
15253A0708P846l0791l2452J3940J8622j1300o081j701j859j084K2300j812k4015
15240c7679k264k5490l541N358L1783P884k916m0344M343L1297r915j5683n336
15227f2503K2821J5119M239L462K354j1244j4578n10K035K9408R066q838Q407
15214g62K2442J3328j8421m7080j3363R25K261N582q072m755L420p338o161l085
$$ y = [-15293, 26505, 39442, 32998, -6159, -14586, 3573, 25704, 24916, 27522, 10010, 18392, 23440, 23949, 25777, 22658, 15689, 22885, 21721, 29854, 11419, -37904, -48355, -40582, -28542, -20858, -31505, -47981, -27454, 22636, 29150, 9379, -1600, -12020, -39565, -63726, -38564, -11750, -2257, 3340, 3768, 467, -11044, 695, -30609, -34852, -37638, -47098, -75740, -74392, -38621, 10708, 18554, -12237, -44689, -30749, -12127, -23427, -29508, -31209, -33068, -34152, -11852, -13664, -37679, -39943, -65433, -68974, -63616, -31833, -23949, -26865, -67209, -62866, -31569, -41484, -57167, -62503, -39682, -24563, -20324, -16862, -14508, -25752, -40330, -40840, -38805, -9397, -331, -9169, -762, 21680, 35008, 16587, -30493, -43856, -42931, -40670, -35088, -43160, -47915, -44495, -51833, -57994, -61079]
15200f1079J0583J5311L302j6506j9600R330J9015P609j5782j9451j4171J3073
15188f8366K0554K8117K0986R747q695r805j653k2607k5788M291J9183K858l157
15175c4335J556K1648J2922J131J2122j5922k1064j7369J9829J1741K3439J3522
15163B9220p325K09j4860j4139k4546m386J1068J0035R04j3050J7486K2238N775
15150A8629m1144j0566L1155j7299q050n989j961J2185J341J1791l0841O227P674
15137b6848r478j2154L5444k173j9469k3839L0346J0467mm4953j9593O349N476
15124g0429O038J7533j0149L302K2790m55j3537J3647J3459r696j9305l238K2101
15111b7939J5152j963J3979J9034N358n004O342j1531M881j1634j3977P921R794
$$ y = [-61079, -50496, -35185, -31883, -48389, -67989, -58659, -39644, -32035, -47817, -67268, -81439, -68366, -47812, -19695, 1291, 11038, 2343, -7462, -9115, -31722, -57510, -53219, -34036, -31178, -34335, -32779, -11131, 1791, 2922, 15044, -878, -21942, -39311, -19482, -7741, 15698, 29220, 21895, 22104, 7244, -6895, -31441, -35827, -24759, -14724, -13820, -26870, -9384, 12854, 18629, -22515, -33081, -1926, -19225, -27275, -33264, -35225, -23040, -21699, -9908, -40749, -34522, -26848, -36326, -48480, -13036, -15209, -34678, -58517, -28171, -17704, -17708, -62661, -82254, -75905, -70429, -64391, -46858, -57007, -53705, -30915, -31370, -44907, -31260, -17801, -27497, -46802, -50040, -27939, -12787, -14750, -771, 18263, 23621, 18617, 24959, 13428, 18309, 6675, -7302, 619, 10413]
15098A0413j2321j1966j2852j8686j2717j2376J9591K1191J7879p828j4776J4440
15086b0008J1308j5267j6452j2748J7168J5574J9062K794n818l9040r616L39J0632
15073d2072j081j144L7333J9431O002M772j3214j8856L484j6585n162P795o56
15060a9953j9180k620L470R061p1l2309q721K8669o099J0198K9522P947j4624
15047a4710r688m1816j1417K9376J3351k331k5790J0551j01J3497q77N563K2109
15034a2283Q79N563L680j3255j5276J0515j7594J3189J7364p644l882O969K1602
15021I827L3167l177p403l0934m0469K037J3233R039J2836j0969k1414Q073P411
15008a8743q940k7491k4251J7539K1241J0803r874J6993j138K170J8333J3179
$$ y = [10413, -1908, -13874, -26726, -45412, -58129, -70505, -50914, -29723, -11844, -19672, -34448, -20008, -8700, -23967, -40419, -53167, -35999, -20425, -1363, 1431, -4387, -43427, -53043, -52704, -42072, -43153, -44297, -6964, 12467, 18469, 23241, 10027, -8829, -5345, -21930, -27092, -19297, -19953, -39133, -41753, -38283, -29222, -29293, -61602, -70323, -41654, -47753, -37555, -8033, -86, -14710, -24398, -66214, -77631, -48255, -34904, -37235, -63025, -52474, -52575, -39078, -39955, -34392, -12283, -11404, -5841, -2161, -15416, -30692, -20177, -37771, -24582, -7218, -14862, -18744, -11775, 9827, 42994, 39817, 32414, 1480, -38989, -36952, -23719, -14680, -1844, -12813, -34227, -26154, -18743, -27683, -55174, -79425, -61886, -40645, -29842, -39716, -22723, -23861, -21691, -3358, 9821]
14996I821l0936k2372k0304o447P752p601J337K3181K6065J9836J8570Q000j177
14983B5725p855r907P431l4467j2179K9668j856Q542P204j0368j8756l431j5458
14970c5707k4312K8985J4872j6453j7741N90P86J0612L2950K5866j0892k4851
14958a5295K151p950n688K1080k5910l638Q236n008j0167l0529O315J7698L1865
14945a6840O541k0772p164j40M950J206L4416J1786j3133k0269J0147J3149J4259
14932A8136J1596j7307m0779p095k696K1822K7282j822K1992J5273j769k5426
14920A9207k0834m8849o980J0819j4142m429J9763n124N865J2203J382k1079j8079
14907g0277J2681M2319J2228J8676J1663j2763p080m334O377k8757k9829R25m933
$$ y = [9821, -21115, -43487, -63791, -70238, -62486, -70087, -68750, -45569, -19504, 332, 18902, 26902, 25725, 17870, 7963, 15394, -19073, -31252, -1584, -3440, 5102, 12306, 1938, -16818, -20249, -35707, -60019, -31034, -16162, -32615, -50356, -49766, -48980, -38368, -5418, 20448, 9556, -15295, -13144, -21094, -26782, -5702, -31612, -35250, -27014, -32022, -42189, -72718, -66403, -48705, -16840, -10299, -31071, -38235, -38375, -33425, -32219, 2197, 13983, 850, -19419, -9272, 3877, 18136, 29732, 12425, -28354, -35449, -38145, -16323, 10959, 9137, 31129, 46402, 44633, 19207, -1627, -50476, -57456, -46637, -60779, -65208, -45445, -50569, -44704, -32501, -31119, -52198, -70277, -57596, -15277, -3049, 15627, 27290, 14527, 7447, 3113, 9490, -19267, -49096, -48171, -53104]
14894e3104J6009L1832J0961k174p863l7981l6794k263K8948L3044K3952P306
14882A1873k7352j2125R503j979o617l736K1261K4519M276P759r370n409j5029
14869b426q179k2817r53J5243o498r115J3319n011J8373R550n248j865n209k6677
14855c7513l286n783j4576n016L934N81n349J9416K3425j4940j4483K0093J2664
14842b0833J1852j3757j4203L442J4145P404J6340j3991q135m080J2287Q442R162
14829H075J8572o243n085j4103j1261k9349L740J1472p147O239J4801o53K085
14816h857J2178j3407j1848J6748p367j5381k4018K856L0650L0427o88k0029q432
14803a7168q704J525l655k2668P072L9207M0000j9196k9319k1798Q456J2205j2224
$$ y = [-53104, -37095, -5263, 5698, 3524, -4339, -42320, -79114, -81377, -52429, -19385, 4567, 11873, -15479, -27604, -18101, -20080, -26697, -30433, -9172, 15347, 19623, 27382, 18012, 12603, -2426, -10605, -33422, -34375, -19132, -25630, -34745, -21426, -26437, -8064, 1486, -3762, -5627, -10836, -37513, -40799, -46582, -61158, -66174, -62240, -61659, -67008, -47592, -24167, -39107, -53590, -33497, -20833, -8981, -22738, -36941, -33499, -19354, -11950, 4390, -9601, -17736, -21816, -9529, -1087, 8075, 26647, 20404, 15319, 1216, -10045, -39394, -35654, -24182, -31329, -25090, -10289, -10942, -8857, 3321, -10086, -21934, -5186, -12553, -27934, -51952, -49096, -18446, 11981, 11293, -8736, -17168, -25872, -24347, -28002, -50670, -43598, -4391, 35609, 16413, -12906, -34704, -26248, -14043, -26267]
14790b6267k0170N462j213j4569K2765J5247k656J2842J5952J0324k6379q708
14778a7370K3939J0499m510q878l8503q050j568P909J1314L6130n378R910M901
14765B0345K265j8936p304J659n698J1136J4873j3975n387m350j3876k6876q489
14752e4613j0817J7448K4816j1448m203J8353K3633J140k2275m3622q62J6141
14740d6309J5775K5472q945L4448Q304l6981m6594R777M1569l775j431J6777J2476
14727B0563r912l1855j1277K1879K5105j5179j6544j4147k6q971M12k0426p731
14714f8109J4336p267J2747K3958j9843p155K574J2099J2173l575n400j1384p727
14701e2573L157J0467K9759M455M2k8475K3296J0688l039O188R903M672k0092
$$ y = [-26267, -46437, -40975, -42188, -56757, -33992, -18745, -21401, -8559, 7393, 17717, -8662, -17370, 6569, 17068, 12558, 3680, -34823, -42873, -44441, -36532, -25218, 10912, 5534, 15444, 20345, 22610, 3674, -3630, -1971, -7669, 3467, 18340, 4365, -1022, -5372, -19248, -46124, -54613, -65430, -47982, -23166, -34614, -38817, -20464, 3169, 4309, -17966, -61588, -62450, -46309, -30534, -5062, -14007, 20441, 28745, -8236, -54830, -45053, -3484, -7259, -8690, 8087, 20563, 10651, -21204, -32481, -10602, 14503, -676, -17220, -31367, -31393, -40364, -39952, -60378, -68109, -53773, -61040, -48293, -24335, -44178, -51333, -48759, -36660, -24487, -28062, -33462, -44846, -52573, -49416, -38949, -9190, -4735, -4693, -33168, -9872, 816, -2223, 3965, 13868, 18540, -1552]
14688a552m535m353k0907j5592j4838K0314K0438J8244l807j9538k505K3172K1632
14675A6173j1306k4250n3253K438L7865J5347q296j4819p662K3148Q889n236K0044
14662i18r837J673j1343n460L2104J0119J3005m3219j2493o860Q021l120j1859
14649d0187J1769K575K6431J3207K571J058p255n654L756o626j443m112k8923
14636c2833k9258m176K7666K1073K4448j8166O810P845j9478r638R313L3434K1108
14623C8148j2772j3145j5567o297k0624P482j465L879N017Q516j860o105J4510
14610b83O49Q027o639m994k176l7609L134K8381p409N659J6688N949l57k2497
14596a3477j2598J0736r691j6213l982J5764J7658J1702K5449j424k1269l292
$$ y = [-1552, -6087, -10440, -31347, -46939, -61777, -41463, -21025, -2781, -6588, -26126, -28631, -5459, 16173, 4867, -19383, -72636, -70198, -32333, -16986, -25282, -40101, -47763, -24615, -15726, -20962, -918, -10755, -9082, -20425, -25885, 6219, 16338, 29343, -13876, -26369, -33229, -25208, -28328, -40187, -28418, -25843, 588, 13795, 16366, 17424, 10169, 4515, 8271, 1645, 202, -3910, -32833, -62091, -66267, -38601, -17528, 6920, -11246, -4436, 3409, -16069, -25707, -16394, 17040, 38148, 25376, 12231, -3336, -9633, -30257, -22775, -24240, -20361, -15344, -6828, -8688, -14793, -283, 366, 8393, 1754, -3240, -5416, -43025, -39891, -11510, -18919, -13260, 3428, 9377, 9020, -13477, -26075, -15339, -25030, -41243, -45225, -29461, -11803, -101, 25348, 23924, 2655, -637]
14584f37J4661j4650j3452j0188K6593J8293n713L676j0785j0874m628j078O583
14571b199k6913j7868JL0647J4585k4926m0263M69L1651M1293L5873m8408l2942
14558c9000N682J5909K094j3480p408P024L5007N865J1550M115k5775Q979m842
14545E720r934J6191O693j5517j0775P62J4463j1092J3723o960l78q19q964j4216
14531b1103j3289k877k5561j1717L3623J1523J4551J8243J6357k0527k0606J9587
14519a796j511p036j62n995P360Q831J1298k4528o826J1055m964l5267k2248j6440
14505h8229R353L7651J9153K6448J2499k5614l6182k2002N77j30r347K8554J6461
14492c0808L997k099P950k8664p942j2975j9350j1654m483J4209N362L439J0408
$$ y = [-637, 14024, -626, -14078, -24266, 2327, 20620, 14907, 18583, 7798, -3076, -7704, -8782, -2199, -29112, -46980, -46979, -16332, -1747, -26673, -66936, -66467, -34816, 6477, 42350, -6058, -39000, -33318, -17409, -15315, -28795, -36203, -29179, 5828, 11693, 23243, 27358, 1583, 10562, 5720, -4214, 11977, 18670, 3153, -7622, -6860, 7603, -3489, 10234, 3274, 2896, 2077, -6887, -21103, -34392, -37269, -62830, -74547, -40924, -29401, -14850, 3393, 19750, -777, -21383, -1796, -3307, -10343, -10505, -16500, -9140, -309, 10989, -13539, -20365, -9310, -14274, -49541, -71789, -88229, -78876, -41225, -22072, 4376, 16875, -8739, -44921, -66923, -66346, -66476, -75823, -47269, -30808, -26811, -28910, -20960, -49624, -57566, -70541, -89891, -101545, -106028, -91819, -86457, -83018, -72610]
14479g2610j0683j2892r384K3877J3210K717J8145r178J9973N174K0710K6199
14467A5258J4726k681j551M831j5307j2864l293m4763j4088K1597K1499J2665
14455c971p600o348K5981j5315k0784J1121J858k3573k9186Q693k466k3340L8297
14442d6633J1457J2188k803l267J1872J5217L5516J2547J3577Q960j6501j7024
14430C5106R759R549j9299r561o881L221J7221p696j6497k1543k544j6543J7511
14417h197L7525P355m6662j6862O30M248p952J3473J1532J9594J424j5505L558
14404D161r944l1287j127N676O208J5440K982r297j484J4091N46k2966j2695J00
14390c9596l3432k1480K169L4458J4590N018k1614J4035O476M390j4952O423K738
$$ y = [-72610, -83293, -96185, -105569, -81692, -68482, -65765, -47620, -56798, -36825, -31651, -10941, 15258, 29984, 27303, 25752, 30583, 15276, 2412, -881, -45644, -59732, -38135, -16636, -3971, -11571, -17919, 8062, -7253, -28037, -16916, -15058, -38631, -67817, -59124, -61590, -84930, -46633, -35176, -22988, -25791, -29058, -17186, -1969, 33547, 46094, 59671, 68631, 52130, 35106, 44865, 54414, 35115, 25554, 18673, 21894, 39115, 31419, 14922, -6621, -9165, -25708, -8197, 29328, 36683, -9979, -26841, -26211, -21963, -29915, -16442, -4910, 14684, 16108, 603, 4161, -5783, -37070, -38197, -32521, -26313, -10873, -7891, -17188, -18672, -4581, -4035, -27001, -39696, -39596, -73028, -94508, -92339, -57881, -43291, -38273, -59887, -45852, -39376, -34986, -49938, -43515, -40777]
14377d0777k4907k3459J6698L252N835Q829l652n285P945J0707J0541j0394j8060
14364f2727k8635J6574J6723J3642j589K0919k085j7739j0735j0019k0230J2489
14352g3412J8892K2438K8707L592l5618J3959J5231j5849n115j6491j6351N359
14340e4658k6593k389J2834L5591K5295J0304N618j5681J2293O001k2463l598
14328a7446j6363J4645l973K1737J3091k0901k5846j6442j7333M0283R925L952
14316a4671O887l894l2906k8663J5657L4635M8551n459j5381p970j2551n107P381
14303a3491O998N856l3220l7652J015K5810L4324J5963K9661R365K2805j2080
14291E5354m929j8692k9900j2006p219k0199p665J1840P031m503J704K4410j6023
$$ y = [-40777, -65684, -89143, -72445, -69193, -63358, -54529, -58181, -63466, -55521, -44814, -34273, -44667, -62727, -91362, -74788, -58065, -44423, -46012, -25093, -27178, -44917, -55652, -65671, -85901, -73412, -54520, -32082, -3375, 217, -35401, -21442, -6211, -22060, -27175, -43666, -60017, -54658, -81251, -83640, -70806, -35215, -9920, 384, 6002, -9679, 2614, 8615, -13848, -17446, -33809, -19164, -23137, -1400, 11691, -9210, -35056, -51498, -68831, -28548, -18623, -14671, -7784, -11678, -44584, -73247, -57590, -22955, 25596, 20137, 4756, -3214, -15765, -20872, -13491, -6493, -637, -33857, -71509, -70494, -44684, -10360, 5603, 35264, 44629, 67434, 55354, 50425, 31733, 1833, -10173, -17392, -37591, -45256, -33416, -26385, -30888, -29184, -4774, -20797]
14278b0797p604k796P930j1065j366j814J132P920l366k0427n483K1931K580j7535
14264e0760k6666j6245J2510j097l105K0992M749K3502J9444L65J1840J6398j6420
14251d493j459k854r402P541l17j047m594k152p349m2839l1613J5744p90L734
14237h1890M654J836K8575m157J070K1520J1847k2259l3408k1330K454L1132o269
14224f6225k6772L530K5617k227p07q568K7219J6170l727q396j2851J391r856
14211f5402K539K1192K948J6212m886J7592j172j0526p825j5172k214J7014L7289
14198G589M0329K6412K730l6672l2251O243J7533k6942j7289q316J3469K6995
14186A9830k794k0519m000J763J2667k7144k4605J2045K5564Q139j1622j4992
$$ y = [-20797, -28401, -31197, -23267, -34332, -35698, -37512, -36380, -28460, -31826, -52253, -57736, -35805, -33225, -50760, -77426, -93671, -81161, -82258, -85363, -64371, -59622, -36120, -16676, -16311, -4471, 11927, -4493, -5952, -8806, -18208, -10667, -10984, -12031, -16625, -18777, -26126, -68965, -100578, -84834, -85624, -81890, -77236, -75400, -46825, -50982, -49912, -28392, -16545, -38804, -72212, -93542, -91088, -59956, -66225, -92997, -89467, -63850, -66077, -66784, -75352, -48133, -31963, -35690, -44086, -56937, -55546, -65402, -62863, -41671, -38723, -22511, -27397, -9805, -10977, -21503, -29328, -44500, -46714, -29700, 7589, 47918, 74330, 77060, 40388, 8137, 14380, 31913, 4971, -12318, -20634, -7165, 19830, 17036, -3483, -7483, -5720, 6947, -20197, -44802, -32757, -7193, 946, -10676, -25668]
14174b5668n194P465j0905K0356O088R687L7296J6253l4565j9862k3758k5912
14162d8719K0330L0589L0201L294j20K329q229l9852j6687K0659J3799J2163j4405
14149E352j2111K3623K664j5856J1286r29J1627J8287j8238k5798k794J227k0443
14136b2103p305J2266Q695J5478M937r986j4710p25R743L46p211j2393l058j2490
14122c8516k509J1934j3480k407K9012J4444K3133L224N827k5133L749N35k157
14109G656N136j8717R503J5885k0761j2641J3313K9144K87M524k1374j9729J523
14096f251J0819j3583n426J2945J0641j235O031l4189q216J2812j0963l5266m554
14083f6435M998L351J0887J0508L139J8653j1851L364K837r158L876L382L776
$$ y = [-25668, -30862, -23397, -34302, -13946, -7858, 1829, 39125, 55378, 20813, 951, -22807, -48719, -28389, 2200, 32401, 35695, 35575, 37904, 29675, -10177, -26864, -6205, 7594, 19757, 5352, -6759, 16864, 19528, 3672, 14958, 14029, 25656, 43943, 25705, -93, -2887, -1660, -22103, -29408, -17142, -8447, 7031, 11968, 1982, -12728, -13453, -3710, -3364, -10575, -22968, -26026, -38516, -41025, -29091, -42571, -44978, -15966, -1522, 21611, 24835, 30662, 5529, 9278, 9813, 7656, 12792, -5925, 3578, 19463, -1298, -13939, -626, 28518, 28805, 33329, 11955, -7774, -6251, 4568, -9015, -14441, -1496, 9145, 7910, 13941, -20248, -28464, -15652, -26615, -61881, -66435, -61437, -58086, -47199, -36691, -33552, -14899, -26750, -23386, -20549, -29707, -25831, -22449, -18673]
14070a8673j0053n126Q896j7574O440J2358J172R928L0055J5338R823J1966l5238
14057A9312k4504L142n458L227J3060q315j5747k810J4428j4950k5774J945R169
14044c3275K5862Q876p958j3949J5175J0646Q072J0K342j0020m0079p421L259
14031c8460l257j3413J9281R471M592p955j3663J8451J1359l1167N584J7623K5250
14018C696j5696j7325j009R907m202j180J5948R637P927k2840m0655L8819J0319
14005f654j2080J2706n548M717m29j0593m2046K7457M3787n328J0295J2251K7635
13992E6170j5472k0245m867j2607k2833k8139J3522K5717K9396j687J358j3877
13980F436r924m098r527k4765Q832J8142j8209j0553J7220m317o529J3919K2959
$$ y = [-18673, -28726, -33852, -24956, -42530, -36090, -23732, -22560, -12632, 17423, 32761, 42584, 54550, 19312, -5192, -2050, -7508, -4281, 8779, 464, -15283, -18093, -3665, -18615, -44389, -42444, -33275, -7413, 1463, -6495, -20444, -5269, 5377, 13449, 13459, 15801, 5781, -34298, -41719, -38460, -41717, -55130, -35849, -26378, -21786, -29741, -43404, -24953, -13594, -44761, -39177, -21554, 3696, -12000, -29325, -30334, -20427, -24629, -25809, -9861, -224, 7703, -15137, -55792, -16973, -6654, -18734, -6028, -11576, -6859, -7288, -17881, -59927, -32470, 11317, 5989, 16284, 28535, 56170, 40698, 20453, 15586, 2979, -19854, -47993, -34471, -8754, 20642, 18955, 20313, 6436, -3488, -7586, -17113, -41878, -33046, -14904, -33113, -43666, -26446, -30763, -37292, -23373, -414]
13967d14J6524N116N6j6074j8635K3048K095k6015j6980J2686q755J8321K1118
13954A2091R534J2452j0950j682O40q425r444O644r411l535k3183n315K3319j7864
13940b5129k4607r396J6346K1060Q749k3M005J2763J8634k5330l0470M458K547
13927b6393J2959p445k7398j8104j615M130K5164K0083j59j0839N808M031K815
13914a6963J5527K07o667M73J0543K8859L331l579L481m231k5774j6533R789J6544
13900A5007r640j5681J4419J5874j5194J6530J0981k8095P246M413J2652j3142
13888A5370p996N508r903j2546J8445J1912L14j6148M14k6318N801n344j5593
13875c6084p585j4264J9347k319K3965J5466R824j0976j3998k591m276P826j0955
$$ y = [-414, 16110, 21226, 21282, 5208, -13427, 9621, 11716, -14299, -31279, -18593, -27348, -9027, 12091, 21625, 34077, 23127, 21445, 22085, 13660, 4216, 10860, 1449, -2086, -25269, -30584, -7265, -25129, -49736, -59132, -42786, -21726, -12977, -13000, -8995, 3768, 22402, -2928, -33398, -28940, -26393, -13434, -20879, -48277, -66381, -67996, -63866, -38702, -18619, -18778, -29617, -23809, -19778, -16963, -1436, -1229, -7896, -7423, 3120, 31979, 35310, 31731, 35212, 30981, 5207, -11326, -1537, 15007, 5367, -10314, 4105, 19979, 4785, 21315, 32296, 4201, 11447, 15860, 28512, 15370, 7374, 12882, 2979, -9567, 8878, 20790, 21104, 4956, 5370, -20948, -15147, -20491, -36084, -43669, -57933, -38586, -40905, -16940, -1474, 8350, -2626, -16624, -19215, -23491, -15665, -26620]
13862b6620J9518J5323j6661j1869k735r573R638J0544K8539k2431j6562P826
13850a5063k7357J2634J5467M687j4735J4692o859k474R24j1075J1410j064P014
13837a1799j596j2499l069M753j6859k6037L170J5065K8332O969L5290J2762j3984
13824B0498k7802k8807j9112P116k204M140K1686Q072K6726M768l0974p4J7525
13811A558J0909j3405n799O115J9014j1246r19m82O859l921k7456m469l6694j4630
13797g4566K4282L9723K3863L805N15J9966q635k0028J9421k832k5800j7846J6579
13784a553p402k5417j1944P390L1388K1980N105R404j8620j0524K9831J9369Q559
13771E7566k8193l1044O1L690R175R041q80j8237l283O314Q123L840J5556K1207
$$ y = [-26620, -7102, 8221, -8440, -20309, -23044, -32617, -22979, -12435, 16104, -6327, -22889, -15063, -42420, -29786, -14319, -9632, -24367, -9675, -16534, -19008, -18084, -29159, -17749, -18813, -11799, -13395, -25894, -28963, -24210, -41069, -67106, -63936, -48871, -20539, -13570, 21720, 34482, 20498, -7304, -36111, -55223, -48107, -50311, -46171, -24485, -16413, 10313, 15081, -15893, -15967, 1558, 12467, -938, -6737, -622, 18392, 7146, 6227, 5745, 12604, 8683, -18773, -23242, -59936, -74566, -50284, -10561, 13302, 17107, 17622, 37588, 28953, 8925, 28346, 25514, -286, -18132, -1553, -8955, -34372, -46316, -38926, -7538, 14442, 19547, 28951, 10331, -193, 29638, 49007, 57566, 29373, -1671, -1610, 2080, 11255, 20296, 19416, 1179, -2104, 4210, 12333, 16173, 31729, 52936]
13757E2936j2069m4834l882J8113J4547j9581m148k65j415k2677K3627j311J1385
13744A0426j4948k2383Q786J2961J401M393J241J8943J614J428N726Q995O57m174
13730C5066j5338M433J359k3543l4520m460k3312J638J2746O308r030j532K0671
13717b9514K8923q709k173j5465j2592k2377M165P683J2095J2090P771N507K668
13704i928R232k090j1094J8527L038M857J3655j5468l5478j3078j077M450J9362
13691a5092K7916J4350j9853r919J6164q793O006j2310J6006j2163m883J3656
13679A1085k404r65L0266M600l7035l1838J4946l097R734l650q18K8349O171Q495
13665C3839J3589k3458k278L3304J8120r683m035j8610p409m62k0940j633j4238
$$ y = [52936, 40867, -3967, -7849, 10264, 24811, 5230, 1082, 817, -598, -23275, 352, -959, 10426, -4522, -26905, -18119, -5158, -3757, 636, 1877, 20820, 22434, 23862, 29588, 38583, 39240, 35066, 19728, 24161, 25520, 1977, -32543, -37003, -60315, -58677, -45931, -39623, -48653, -50185, -29514, -591, -9300, -11473, -26938, -39530, -61907, -57742, -50059, -37964, -25874, -18103, -12596, -9928, -696, -2786, -13880, 4647, 7685, 12542, 26197, 10729, -24749, -37827, -38904, -34454, -15092, 12824, 27174, 7321, -2598, 13566, 4773, 10779, -1531, 14475, 2312, -2571, 11085, 8681, 7716, 37982, 42582, 5547, -26291, -11345, -14442, -4708, -8358, -9176, 19173, 25344, 33839, 47428, 23970, 21692, 54996, 73116, 63433, 59398, 40788, 33379, 32917, 11977, 10344, -3894]
13652c894j5305Q323J5025j1102j8583J7023J2257l0252k8780k512J0597K8538
13640a8665P119j193J111J1104J5110R855j6142k0869R849m92j8106j2529n560
13627c9408K4622j4964o860P669j3025j819K5715M4699k674k798J2355k8417k2079
13614a6984J413L1356j0382J5391j385j0267j7368j6039J1965j3561q585m219
13602c8665M803K0901J9390o506P706L1515l320j5055l667J4016k5171l9008j698
13589c4759J7462J7691n7K340L1559n012j8781K147K0966L69K2732j525n854j2086
13575C7192J497n443p618P340j0209l0044l151j0546J2564J7450M84j8556L498
13562e542J8801K303j5402k4696j0716J2941K4367K4279J2716p645k2421j8779
$$ y = [-3894, -19199, -10876, 4149, -6953, -25536, -8513, 3744, -26508, -55288, -57800, -47203, -18665, -11546, -12739, -11628, -524, 14586, 24441, 8299, -12570, -2721, -3213, -21319, -33848, -39408, -14786, -29750, -36610, -28941, -41966, -43785, -18070, 26629, 23955, 21157, 33512, 5095, -16984, -15571, 15785, 5403, 20794, 19409, 9142, -8226, -24265, -12300, -25861, -34446, -38665, -33862, -12961, 6429, -77, 7629, 39144, 35824, 20769, 17102, 31118, 5947, -33061, -34759, -17297, 394, 337, 2677, 34236, 29224, 10443, 12590, 33556, 33925, 56657, 55132, 49278, 37192, 38689, 33246, 25628, 32968, 22759, -7285, -10436, -20982, -8418, 9032, 9516, -9040, -5542, 13259, 15562, 160, -24536, -35252, -22311, 2056, 26335, 39051, 31406, 8985, -9794]
13550i794R585J8088q013j6410j4082J2216K6408M061p720J8639j6455j6152m854
13537d483K16K077n392j4646j6803k227j107o943q589j2227K0031Q292K5983P219
13523h599N592O81J2857J6630J2519l8673K1630J7975O847N3k4098k913K5045
13510D5546J6400q035k6371m794K4402J8077j0199J7755n382k2321m124j71m508
13497C6275O81n148k2431m1026J0773J9878j115J5831l9048k8577k0728k7269
13485a01904K1429J8507J8234J0108J8503N719k4009P040J8583J3542r838l888
13473g974M364K0857Q895M446P049j5895k6023K0061N279p37l765J2948N01m132
13459B5874J483N873j6429n254j6232k048N016M385k0336M897m714j1913J7512
$$ y = [-9794, -209, 17879, 9866, -6544, -20626, -8410, 17998, 22059, 14339, 32978, 16523, 371, -4483, -4267, -2190, -7582, -22228, -39031, -41258, -42365, -49308, -57897, -70124, -50093, -41801, -15818, -8599, -3007, -2326, 10531, 27161, 39680, 1007, 22637, 40612, 47459, 47512, 23414, 20501, 45546, 61946, 53911, 27540, 22746, 47148, 65225, 55026, 72781, 67399, 45078, 40954, 40783, 36275, 36956, 31808, 9377, -31649, -20876, -998, -2113, 13718, -25330, -53907, -74635, -101904, -80475, -61968, -43734, -33626, -15123, -9404, -33413, -26373, -7790, 5752, -4086, -7974, -3610, 17247, 26142, 30588, 37637, 21742, -4281, 15780, 21059, 20322, 16557, 29505, 30006, 25874, 27357, 33230, 16801, 11547, -4685, -6733, -1717, 2668, -17668, -12771, -17485, -29398, -11886]
13446a1886K2230J5096j5897j7881j2319o861L8361K3209j3250O290j5064k3789
13434a1761J9747k011k0435k4629Q091K3797Q470p06P715J7283N082J7668q163
13421D0148O770k6698j9381p176L5k526K0470j3475j0375k4916j8767K7186J3865
13408a4840M5R967K7910J6802j412k7961N499l3958r127K1475K0930j7695O427
13395D062J8865J5014k7828k5473o743K7J4815j0672K705K1462k934j9529J791
13382a4438K392L5981K2133j1388K6211M031J0749j6157l4315j242J9731k977
13370D0711M865k3163j821Q421J4546N869J0016q762l4063l757k4843K268J3402
13357C689N540J5416M558j8028o524Q342J0873M904P092m80J1399o040j1272o483
$$ y = [-11886, 10344, 25440, 9543, -8338, -20657, -27518, 10843, 34052, 20802, 27092, 12028, -11761, 7986, 5975, -14460, -39089, -30998, -7201, 1269, 563, 8278, 25561, 30643, 48311, 40148, 46918, 20220, 839, -6337, -6302, -8828, 11642, -1833, -12208, -37124, -55891, -28705, -14840, -14795, -4828, 23082, 39884, 38472, 10511, 16010, -17948, -27075, -5600, 15330, -2365, 4062, 22927, 37941, 10113, -15360, -22103, -22076, -7261, -17933, -15228, 6234, 3300, -16229, -14438, -12046, 23935, 46068, 34680, 60891, 64922, 75671, 59514, 25199, 23957, 43688, 40711, 45576, 22413, 20592, 29013, 43559, 49428, 59444, 50682, 16619, 12862, -11981, -9713, 3689, 9229, 24645, 29203, 11175, 4651, 12993, 23866, 28770, 35862, 35382, 46781, 40741, 29469, 22986]
13343B2986K6727n176j2040k0982m07J1226J529J9200J7986J0857j0732k8248
13331C2926l1204k0088K2253K250j9188j2257K8262J0661k2456J4037n063j5557
13319a5424p40J284R051k7230R310J2895P47L2194R352p564n193j76J9181Q526
13305D6213j7812Q146K1523k2763j5476j0901k720K4621J514l0718J1205J3880
13293B6712o707l119J2940J5674m548q751r569J099Q229l010J8038J0068p785
13280D9271L907K2831J509k7883m8481J4013J7987N588J5890j4675O13O149J5425
13267F2144J240l7110j2001l250m858K310O961m481j58j3848k0015K484N568J8158
13253C144J1864J8790L142J1169k4793j9193m83K4916J1506J4297j1977l524Q963
$$ y = [22986, 49713, 44537, 32497, 11515, 11108, 22334, 23863, 43063, 61049, 71906, 61174, 32926, 1722, -18366, 3887, 6137, -13051, -25308, 2954, 13615, -8841, 5196, 133, -15424, -16164, -14880, -5829, -33059, -23749, -10854, -10107, 22087, 31439, 23875, 18682, 18506, 37687, 46213, 28401, 36547, 58070, 35307, 19831, 8930, 6210, 30831, 32345, 1627, 12832, 26712, 20005, 16886, 29826, 45500, 40952, 32201, 22632, 23731, 31960, 28950, 46988, 57056, 49271, 53178, 76009, 77518, 49635, 1154, 15167, 33154, 38742, 54632, 39957, 40570, 46719, 62144, 63384, 26274, 14273, 11023, 6165, 8475, 15436, 10955, 10797, -3051, -23066, -20582, -15014, 3144, 15008, 33798, 36940, 48109, 23316, 4123, 3640, 28556, 40062, 54359, 42382, 38858, 47821]
13240D7821J0109m086J2277J7039q690j7990j0851J402k3210k7889j434Q035j4306
13227a1773m56L0779L1683j2471j0556m47k5851j7897N748J1899K0852P998R77
13214C0485j029K5812J5235o136m625J0619J6867j0579l3013k5087j7338P594
13202H805K1809J4023j037J568O750m650m5768o668L5736J3663n756o035O717
13189C9157J9336m523m392L75J444L71l2j6527k4167J4644L0168k7008P276M5953
13175H2075L9397P910k1212l2912j7853K4981n276n061j0053J91j2914j022k8698
13162A9553p722k446j237J9146l993j1009O965J0211M505k5893R777Q476L6357
13149F2690Q959k1334l2120M75K7409J9832j3310j689k940j9054k312j1919J4676
$$ y = [47821, 57930, 53844, 66121, 83160, 74470, 56480, 45629, 47031, 23821, -4068, -5502, 2533, -11773, -12229, 18550, 50233, 37762, 27206, 26759, 908, -16989, -11241, 658, 21510, 29508, 30485, 29456, 55268, 70503, 64367, 59742, 70361, 87228, 76649, 43636, 18549, 1211, 8805, 30614, 44637, 43600, 45168, 51918, 47268, 1500, -5168, 30568, 44231, 38475, 32440, 39157, 58493, 53970, 49578, 49953, 51397, 51768, 51736, 35209, 11042, 25686, 55854, 28846, 36122, 82075, 121472, 129382, 108170, 75258, 57405, 82386, 77110, 72049, 61996, 62187, 49273, 48251, 19553, 11831, 9385, 8148, 27294, 23301, 12292, 19257, 29468, 33973, 8080, 17857, 26333, 62690, 71649, 50315, 18195, 18670, 46079, 65911, 52601, 50912, 47972, 28918, 26606, 14687, 29363]
13136B9363J0929M1261k2181n8015k9027J6058L7015K3534K236J930J4085L3010
13124A00198K351k9829j5066k685l755M923R202n581q645j6373j4869M374j3644
13111A0601Q665N30L3570K3469j0763l0192l8596j2410N862J3780J3459M8297
13099F6272K3805j3786k8157p064j0928k4479M997M819o274J2969J1660K3295
13087E7129K0102J7243o877J0259k2063k2510N779R215L4489J213l0533n963p968
13074E9515p207j4322m56J6159M367M4427Q63L07q667r650p153K2P33j5526k0756
13059D2656m408n629n99Q019j5796Q641o645K4473J9876J5427K709m005k2742
13046F1977l6526n067M107J8570k258k2227L4144J6640N191l2565L739J1194P593
$$ y = [29363, 40292, 81553, 59372, 1357, -27670, -11612, 25403, 48937, 51173, 53103, 67188, 100198, 102549, 72720, 57654, 54969, 51214, 56137, 65339, 59758, 51113, 34740, 19871, 24245, 10601, 19266, 19796, 53366, 76835, 66072, 35880, -2716, -15126, -9264, 4516, 17975, 66272, 90077, 76291, 48134, 41070, 30142, 5663, 10660, 15479, 9205, 22174, 33834, 57129, 77231, 94474, 87597, 97856, 75793, 53283, 59062, 68277, 102766, 103979, 73446, 67483, 59515, 52308, 37986, 37530, 53689, 58056, 102483, 103346, 103653, 94986, 85336, 78183, 78205, 78938, 63412, 42656, 38248, 32619, 32020, 40039, 24243, 32884, 26239, 50712, 70588, 86015, 88724, 84719, 61977, 25451, 20384, 24491, 43061, 40803, 18576, 52720, 69360, 74551, 41986, 45725, 56919, 64512]
13033F4512j4635j2722l433M6j1577J5567L0876J1587L166K762p50J0913J4489
13020A10801j4139k8135r435n044j4065M252L745J9664p929K3241J4356L5252
13008A32564l02j9111r277k1344j555k3848r129R836M734j4433j6264j920J6797
12995D6748N0257l096k7770k2185J9964M3859M658j5967L328J8960M628l8281
12983H5103m5265P432k5092K6941j1376K365J7908K7898L0854N23j0972r560j1507
12970H5252N416m825O788L945N523K5031l69j2598J4793M944j9986k5694K6350
12957A14570K898j8682L301k070O250N948L530k4069k253K0031Q63j3017J3884
12944A11184R550J1512R951k279l5804l0722K5531K3102N040o211j1066J4278
$$ y = [64512, 49877, 37155, 33722, 33768, 22191, 37758, 68634, 80221, 83387, 86149, 85399, 96312, 110801, 96662, 68527, 59092, 54048, 39983, 44235, 47980, 67644, 59715, 82956, 97312, 132564, 132262, 113151, 103874, 82530, 80975, 57127, 47998, 57834, 62568, 48135, 31871, 29951, 46748, 97005, 93909, 66139, 43954, 63918, 107777, 112435, 96468, 99796, 118756, 123384, 85103, 39838, 47270, 22178, 49119, 37743, 40108, 58016, 85914, 116768, 117291, 106319, 96759, 85252, 90668, 85843, 92631, 96576, 102099, 127130, 126761, 114163, 128956, 133900, 113914, 88220, 114570, 117468, 98786, 102087, 100017, 106267, 112215, 115745, 91676, 89423, 109454, 110317, 97300, 111184, 120734, 132246, 142197, 139918, 104114, 73392, 98923, 122025, 127065, 120854, 109788, 124066]
12932A24066j4209k2634J6943L9084J3930j1242J1910L4867P093J34J8031n078
12920B12895j744J5145m373k0463j4766j5223r78M522K5742J5611K370q641K5597
12907B35694J7552j9021l57L4332J0356K1441O0224L9889L6498Q5007R5198J04889
12895G21702J26849J41692J89443K13444K19913J16862K1075o2379j40417j60452
12885A387732j50564j42239j19051r0664m0352l0337r088J5745K2108K5218L2237
12874I00745M4326K8411O1622N2035Q1332J20969J04556Q2739J13041J08584P5889
12863A774249R3061J05737O6058J2030j1388j4214m4660q2313j11352r7378q2583
12852A607247r2177j29835j16538p1866n4184m5633p3428l8551k6565O991r960
$$ y = [124066, 109857, 87223, 104166, 143250, 157180, 145938, 157848, 192715, 199808, 199942, 217973, 212895, 211151, 226296, 221923, 201460, 186694, 171471, 170493, 175015, 200757, 216368, 218738, 210097, 235694, 253246, 234225, 233868, 268200, 278556, 299997, 360221, 400110, 436608, 521615, 616813, 721702, 848551, 990243, 1179686, 1393130, 1613043, 1729905, 1750980, 1688601, 1548184, 1387732, 1237168, 1094929, 975878, 885214, 844862, 814525, 805437, 821182, 843290, 868508, 900745, 945071, 973482, 1035104, 1087139, 1168471, 1289440, 1393996, 1476735, 1589776, 1698360, 1774249, 1867310, 1973047, 2039105, 2051135, 2039747, 2025533, 1980873, 1898560, 1787208, 1689830, 1607247, 1515070, 1385235, 1268697, 1196831, 1142647, 1097014, 1023586, 985035, 958470, 965461, 955501]
12841I55501l4198k2208l074L6084N2764J05315J08700J06388J65520J58742J34068
12830A763602N2403l5845j03562j66928j95433j59822j39957j18551r4345p3516
12820G28046p8761k9455m6504r4799m1880k2557k18n906j7831j7171j9015j2738
12808C41211l0047k4366m4204k1922k704o499O550M0032p05j8713J070j2303J4065
12795B41465j3132J42l74L9265M2009l3601m1867k1887k7900q34L0590j940k0486
12782A91450j0937l8489j6464J3023M3381J7221J7932J9054J6642n312m2580l8198
12770A66723j0664J3985r330j4558K9011K7218P009k4654m531L5375n368j6790
12758A93426n816k0916K2503J7956J7147n501l6746k2267j916R098J8481q966
$$ y = [955501, 921303, 899095, 896021, 932105, 984869, 1090184, 1198884, 1305272, 1470792, 1629534, 1763602, 1816005, 1780160, 1676598, 1509670, 1314237, 1154415, 1014458, 895907, 801562, 728046, 649285, 619830, 573326, 478527, 436647, 414090, 413872, 407966, 390135, 372964, 353949, 341211, 311164, 286798, 242594, 220672, 217968, 211469, 218019, 258051, 257346, 238633, 239703, 227400, 241465, 228333, 228475, 228101, 267366, 309375, 275774, 233907, 212020, 184120, 183286, 213876, 211936, 191450, 180513, 142024, 125560, 138583, 181964, 199185, 217117, 236171, 252813, 247501, 204921, 166723, 156059, 170044, 160714, 146156, 175167, 202385, 209394, 184740, 180209, 215584, 210216, 193426, 187610, 166694, 189197, 207153, 224300, 218799, 182053, 159786, 157870, 166968, 185449, 176483]
12746A76483k3380N004J3943P947m196j8041J216r430j3033K0486K4510j1745
12734A69764n753L4309M4598K0266N593j915l162n0774m1026J5067K0104j075
12722B05996L992J416P326J9787J3617p965j0572k0905o636j8921l214R844K5880
12709B19645J5842k0110j2821N2666K9145M841j3644K7736M1674M0131J8355N6140
12697D59600O9657P2858N3477j3096k8516k5453K354j1699k1835l2546l2585l2986
12685D59230k5923n421L728Q066N507J5562J631J4070M197K6397J6094l437Q816
12672E28517J6602O7965O8442J8649o289N7189M2759J9771k0672j7239N765q178
12660G73281l2091k5920j8291Q378k1706l2826j7887n0239k8531m4441j9986R476
$$ y = [176483, 153103, 158107, 172050, 179997, 175801, 157760, 158976, 149546, 136513, 156999, 181509, 169764, 164011, 198320, 242918, 263184, 268777, 266862, 263700, 212926, 171900, 186967, 207071, 205996, 209988, 211404, 218730, 238517, 252134, 244169, 233597, 212692, 206056, 187135, 183921, 193765, 219645, 235487, 215377, 202556, 255222, 284367, 289208, 275564, 303300, 344974, 385105, 403460, 459600, 529257, 602115, 655592, 642496, 613980, 588527, 590881, 579182, 557347, 524801, 492216, 459230, 433307, 427886, 431614, 439680, 445187, 460749, 462380, 476450, 480647, 507044, 523138, 519701, 528517, 545119, 613084, 681526, 700175, 693886, 751075, 793834, 813605, 792933, 775694, 781459, 773281, 741190, 715270, 696979, 705357, 683651, 650825, 632938, 582699, 554168, 509727, 489741, 499217]
12648D99217o167j9506J4750L0304M4358J995k4750P101J7224M7486L4372j1827
12636F34557J9532N434m9208j6306j8719m7147k6597k5669J88M398P95j7018K1079
12623D85319K5538J5512R58k2108m1852J9668k134j8822K562q885K6883k0494
12611D62145k2400k980m756O255j5011k3798j3663K502o694O787M0821K3173L994
12598D56375K1906L5410L3784J0482K787J5452J2541N437K4818N8368N2408M0958
12586G70726K2846K4269M7719N8603J5410r936j4667j5840j0752R210K5770L7158
12574I60516K0331K0329J4905O1451P2540M3083M1018M0307M2802L2555L2411
12563A382248J3716K7104K1584K7487L4686L2643K4686J2652K8124M9908J9260
$$ y = [499217, 493050, 473544, 488294, 518598, 562956, 564951, 540201, 547302, 564526, 612012, 646384, 634557, 654089, 659523, 610315, 594009, 575290, 528143, 501546, 475877, 476065, 480463, 481258, 464240, 485319, 510857, 526369, 527327, 505219, 463367, 483035, 480901, 462079, 464641, 455756, 482639, 462145, 439745, 436765, 432009, 438264, 423253, 399455, 385792, 388294, 381600, 388387, 429208, 452381, 456375, 478281, 513691, 547475, 557957, 560744, 576196, 588737, 594174, 618992, 677360, 729768, 770726, 793572, 817841, 865560, 924163, 939573, 929637, 914970, 899130, 888378, 897588, 923358, 960516, 980847, 1001176, 1016081, 1077532, 1150072, 1193155, 1234173, 1274480, 1317282, 1349837, 1382248, 1395964, 1423068, 1444652, 1472139, 1506825, 1539468, 1564154, 1576806, 1604930, 1654838, 1674098]
12552A674098J9136K4671K8095R248J8087J6305K7711M4344L6141M5353L5176
12541A978365J1947L7510L2400n440p98L9113L6825P946l7498j3537J0993q78
12529B096948L074J9051M6949L8045K2692J8820M0167K4675L6392L7731L5494
12518B420038M1149L8376N0463N8427N3842L0830N9578N6459R1494Q6680O6529
12507C053865N1454M8807L6818N0609O2641N4076N0681O0559O1651Q7370R0468
12496C708999J27085R9835Q1932J07210J24281J53505J78267J78326K21931K09146
12486E190517K05968K45622J96829J99809K31539K26253K64337K59854K91700
12477G312428K86285L15571L69961M12985L99026M54939N20142N55530N90976
$$ y = [1674098, 1693234, 1717905, 1746000, 1755248, 1773335, 1789640, 1817351, 1861695, 1897836, 1943189, 1978365, 1990312, 2027822, 2060222, 2054782, 2053984, 2093097, 2129922, 2137868, 2100370, 2086833, 2097826, 2096948, 2100022, 2119073, 2166022, 2204067, 2226759, 2245579, 2285746, 2310421, 2346813, 2384544, 2420038, 2461187, 2499563, 2550026, 2608453, 2662295, 2693125, 2752703, 2809162, 2900656, 2987336, 3053865, 3105319, 3154126, 3190944, 3241553, 3304194, 3358270, 3408951, 3469510, 3531161, 3618531, 3708999, 3836084, 3935919, 4017851, 4125061, 4249342, 4402847, 4581114, 4759440, 4981371, 5190517, 5396485, 5642107, 5838936, 6038745, 6270284, 6496537, 6760874, 7020728, 7312428, 7598713, 7914284, 8284245, 8697230, 9096256, 9551195, 10071337, 10626867, 11217843]
12468A1217843O25138P27784Q04778Q93856R93228J187364J367427J572734J825386
12459B1215538K063670K324250K709427L087644L552872M216702N167532O373670
12451E0711305Q013822J0249882J3151703J7047130K2071167K8156789L4661432
12444A84063230L9909849M0835125L4278383J9376747p71708j9949797l1938158
12437B65803671l4905372l1477560k5360053j9059841j3528071r017845n274715
12430A27180214k173130N65693L035448N392703P603762R691537J1712709J3668624
12422A76677560J5526443J7307863J8883778K0243043K1143504K1375068K0759813
12415C11917072J9105639J6343655J2473383P759329K503630k906359p950402
$$ y = [11217843, 11842981, 12570765, 13375543, 14269399, 15262627, 16449991, 17817418, 19390152, 21215538, 23279208, 25603458, 28312885, 31400529, 34953401, 39170103, 44337635, 50711305, 58725127, 68975009, 82126712, 99173842, 121245009, 149401798, 184063230, 223973079, 264808204, 299086587, 318463334, 317691626, 297741829, 265803671, 230898299, 199420739, 174060686, 155000845, 141472774, 132454929, 127180214, 125007084, 125572777, 128608225, 134000928, 141604690, 151296227, 163008936, 176677560, 192204003, 209511866, 228395644, 248638687, 269782191, 291157259, 311917072, 331022711, 347366366, 359839749, 367599078, 370102708, 367196349, 359245947]
12408C59245947j2260188j5580847j7846297j9142229j9574092j9307803j8519876
12401B37014615j7385969j6000810j4430892j2763279j1049553r224271p325165
12394A48834676n291968l076846o23207K163534N494633R459650J4282754J9933903
12386A91177129K6066099L1471886L3990839L1041974K0736243M066477j4936252
12379C23614395l0663323l8701704l8883468l4376696k8386736k2768327j8066284
12372A11767857j4319074j1446364r238720p502003o203137n232104m436761l885853
12364D9503841l449092l079583k773246k502725k249223j998787j784176j617230
12356C0049779j513229j390999j250923j172986j103696j032602r59650q68198
$$ y = [359245947, 346985759, 331404912, 313558615, 294416386, 274842294, 255534491, 237014615, 219628646, 203627836, 189196944, 176433665, 165384112, 156159841, 148834676, 143542708, 140465862, 139842655, 142006189, 147500822, 156960472, 171243226, 191177129, 217243228, 248715114, 282705953, 313747927, 334484170, 338550647, 323614395, 292951072, 254249368, 215365900, 180989204, 152602468, 129834141, 111767857, 97448783, 86002419, 76763699, 69261696, 63058559, 57826455, 53389694, 49503841, 46054749, 42975166, 40201920, 37699195, 35449972, 33451185, 31667009, 30049779, 28536550, 27145551, 25894628, 24721642, 23617946, 22585344, 21625694, 20757496]
12348B0757496q01272p33996o66488o36281o23567n90031n55069n18952n10832
12339A5121008m66688m38100l97602l77329l86032l86859l70746l60974k99683
12330A1636995k82420k68416k47306k72097k63932k44694k29179k24761k22565
12321I381625k13644j99940j99167k00941j77325j68321j87940j77756j86026
12312G670565j78375j61970j53024j54789j62078j48920j63210j57189j44034
12303F246976j20811j46558j02695q0577p1984p7137q5770p4980q4109j12908
12293E289447q6556n6639n2645m1652p4199p3335r2759j08123j20789r8528o1372
12282D422850m6343k4390p7822r8704p4425n4157m2601n0412m7988l5194n6751
$$ y = [20757496, 19956224, 19222228, 18555740, 17919459, 17295892, 16705861, 16150792, 15631840, 15121008, 14654320, 14216220, 13818618, 13441289, 13055257, 12668398, 12297652, 11936678, 11636995, 11354575, 11086159, 10838853, 10566756, 10302824, 10058130, 9828951, 9604190, 9381625, 9167981, 8968041, 8768874, 8567933, 8390608, 8222287, 8034347, 7856591, 7670565, 7492190, 7330220, 7177196, 7022407, 6860329, 6711409, 6548199, 6391010, 6246976, 6126165, 5979607, 5876912, 5796335, 5724351, 5647214, 5561444, 5486464, 5402355, 5289447, 5202891, 5146252, 5093607, 5051955, 4977756, 4904421, 4811662, 4703539, 4582750, 4484222, 4422850, 4376507, 4352117, 4274295, 4175591, 4101166, 4047009, 4004408, 3953996, 3906008, 3870814, 3814063]
12271C814063n2201o4758m3610p8608q7349m6035m9719l3392k1335l9216l9439
12260C258401m2926k2982j516m5818m7136m2665n0769o8651o7049o8645q2551
12249B717693o8433o9470p1444q7909o4401l6508o3766p5909n0451L869j9807
12238B113464p987K5818j6071m2456K118k3875k0830k5488j4692R982k0061k5979
12226A953943j7091L3916J8615j7101m6927j9640J799l9281m0622j6653k6160
12215A784798j0630l3181l6391k8698j3620n2117j6136l9425l6517p887j0542
12204A499654L995j3533k3302j6355j1234p272J0347p196k7510k0233j3395M656
12192A378622K7951j3373j6525m5446m4767r567j3709j3461l2585l0515j7178
$$ y = [3814063, 3761862, 3697104, 3653494, 3574886, 3487537, 3441502, 3391783, 3358391, 3337056, 3297840, 3258401, 3215475, 3192493, 3190977, 3145159, 3098023, 3055358, 3004589, 2935938, 2868889, 2800244, 2717693, 2649260, 2579790, 2508346, 2420437, 2356036, 2319528, 2255762, 2179853, 2129402, 2133271, 2113464, 2105477, 2131295, 2115224, 2072768, 2074886, 2051011, 2030181, 2004693, 1990001, 1999983, 1979922, 1953943, 1936852, 1970768, 1989383, 1972282, 1925355, 1905715, 1907514, 1868233, 1827611, 1810958, 1784798, 1774168, 1740987, 1704596, 1675898, 1662278, 1610161, 1594025, 1554600, 1518083, 1510196, 1499654, 1503649, 1490116, 1466814, 1450459, 1439225, 1431953, 1442300, 1435104, 1407594, 1387361, 1373966, 1378622, 1406573, 1393200, 1376675, 1331229, 1286462, 1276895, 1263186, 1249725, 1217140, 1186625, 1169447]
12181A169447k406l4677l2468j6319n272k6020M545R764j5932k1779j7270k6925
12169I84688j945J0841l0838J7321Q823k6163m313j5863P774K3175J734m8749
12157I26485k9878l355k5017o704N501J3446J4722P167j0449K3793m6126j2892
12145H56693k0395j6510p037J557n641m0237M292K1427P669P560l496k8975k6456
12132G50451k4179q983O158J3745n88j8734k7786l023K7193L510k3215J531k074
12119F94006k4336j8549K6608M143J8916K042j6224j3431K0494J1854j0494K2418
12107G17447q953j4920j2491l1807J9585j994l3290l1414k00J9921P581k4133
12095F05332k40L3992K2716l2741q344J3517Q848n362m184j0960k598N307k468
$$ y = [1169447, 1167041, 1132364, 1099896, 1083577, 1078305, 1052285, 1056830, 1066594, 1050662, 1028883, 1011613, 984688, 982743, 993584, 962746, 980067, 988890, 962727, 958414, 942551, 950325, 973500, 975234, 926485, 896607, 893252, 868235, 861531, 867032, 880478, 895200, 902367, 891918, 915711, 869585, 856693, 836298, 819788, 812751, 814308, 808667, 768430, 772722, 794149, 801818, 809378, 805882, 776907, 750451, 726272, 717289, 723447, 737192, 736604, 717870, 690084, 687061, 714254, 717764, 694549, 696080, 694006, 669670, 651121, 677729, 681872, 700788, 702830, 686606, 673175, 693669, 705523, 695029, 717447, 708494, 693574, 681083, 649276, 668861, 666867, 633577, 602163, 601963, 621884, 629465, 605332, 605092, 639084, 661800, 629059, 620715, 634232, 643080, 637718, 633534, 622574, 619976, 625283, 622815]
12082F22815o538l357L070j174m223J6043j8571j1723M214K617K846k780j0872
12069E92367j7419n054O979j1951j1588p075K0073L8767P226K7560j7997l5188
12057E86700j346J468R74Q4o088l7899m2581n639Q789l1695J458L8299M460J0462
12043E27446J1180j7082R909N015j6410N148J5691k632k995L7783j340m6797j1622
12030E13294J3590L184j7333Q994K8212K9898p81k3605k917J6393k1962m762j0157
12017E32048K7736J6965j607j1190k0295J0103L0254O676k794O879J1267J6007
12005F22049P517P644n544r827o243m327K7532M2481N3295K4077K2992P0515R1444
11992I43605J13746J36016J46905J79880J71595J82446J34644M8854k2958r5647
$$ y = [622815, 616277, 612920, 615990, 614816, 610593, 626636, 608065, 596342, 600556, 603173, 606019, 603239, 592367, 574948, 569894, 576873, 564922, 553334, 546259, 566332, 605099, 612325, 639885, 621888, 586700, 585354, 586822, 587796, 587880, 581792, 543893, 501312, 495673, 504462, 472767, 474225, 512524, 516984, 527446, 538626, 521544, 531453, 536468, 520058, 525206, 540897, 538265, 535270, 573053, 571713, 524916, 513294, 526884, 530068, 512735, 521729, 549941, 579839, 579058, 555453, 552536, 568929, 546967, 542205, 532048, 559784, 576749, 575142, 563952, 543657, 553760, 584014, 590690, 587896, 594775, 606042, 622049, 629566, 637210, 631666, 621839, 615596, 611269, 638801, 681282, 734577, 758654, 781646, 852161, 943605, 1057351, 1193367, 1340272, 1520152, 1691747, 1874193, 2008837, 2057691, 2034733, 1939086]
11982A939086j55291j80840j54135o6202n1382p6183l9483l5717k7213p053J016
11971A146603J6018P4308Q0573R3567R2674J00408R7686J12257J08713R5629Q0381
11960B098817P7858P7919M2305P3955K1836K787n344n2126o9408p5371q5947r6434
11948B010847q6057r4312r7503r7767p3396p3389p2778m9949l8682n6865l5149
11937A235000k1670K0775J2504K5458M5378R4058J35281J27723J63287J61985
11927A999779J62580J09813L0198p1054j66557j97382k04143j58306j72574j34941
11917A197413j28647r9350n9977m4709n5004l7303k4468j3487j4669m2880l0313
11906F46606Q569j3419l7663k8392J6684l4707j6385K9894k2336L201J752k6080
$$ y = [1939086, 1783795, 1602955, 1448820, 1382618, 1331236, 1255053, 1215570, 1179853, 1152640, 1145587, 1146603, 1162621, 1236929, 1317502, 1411069, 1503743, 1604151, 1701837, 1814094, 1922807, 2018436, 2098817, 2176675, 2254594, 2296899, 2370854, 2392690, 2395477, 2390133, 2338007, 2268599, 2193228, 2107281, 2010847, 1924790, 1830478, 1732975, 1635208, 1561812, 1488423, 1415645, 1365696, 1327014, 1270149, 1235000, 1213330, 1234105, 1246609, 1272067, 1317445, 1411503, 1546784, 1674507, 1837794, 1999779, 2162359, 2272172, 2302370, 2231316, 2064759, 1867377, 1663234, 1504928, 1332354, 1197413, 1068766, 969416, 909439, 864730, 809726, 772423, 747955, 734468, 719799, 676919, 646606, 655175, 641756, 604093, 575701, 592385, 557678, 541293, 571187, 548851, 552052, 553804, 527724]
11894E27724j6186J4185n80L9840M0790J39k9844k5781j6745o59J3837N795j5208
11881E37307L3396K7429j1575m2402k5492j774N152P897K7843J7718J2642o1203
11869E26938l4362m032J8015N737l071j2932N223K5300K5276K75L229J2450q283
11856E59763k8718j9189O208m4038o3319j6169K0816p421l3943m774k089R711
11844C76838J6131O265J1203O486r833K841P430K0678K7550K1540l2264r430K496
11831D47931K452J6029k2590Q50Q381l8361j0824L8638L9733n833j8250p418K5454
11818D76192K9838l091K319j1029m5535o662j0286q687l0042j9560K0191j185
11806C92463K3308K2701J2259L5580J3428j025j4423J8864R382L012J517R127
$$ y = [527724, 511538, 525723, 525143, 564983, 605773, 605912, 576068, 550287, 533542, 532883, 546720, 552515, 537307, 570703, 598132, 586557, 544155, 518663, 516889, 522041, 529938, 557781, 575499, 588141, 526938, 492576, 488544, 506559, 512296, 509225, 496293, 501516, 526816, 552092, 552367, 555596, 568046, 559763, 531045, 511856, 518064, 474026, 410707, 394538, 415354, 407933, 373990, 369216, 367127, 376838, 392969, 399234, 410437, 416923, 407090, 409931, 417361, 438039, 465589, 487129, 454865, 445435, 447931, 450383, 466412, 443822, 444672, 453053, 414692, 403868, 442506, 482239, 476406, 458156, 450738, 476192, 506030, 502939, 505258, 494229, 448694, 442032, 431746, 423059, 393017, 373457, 393648, 392463, 415771, 438472, 450731, 486311, 499739, 498714, 484291, 503155, 512537, 515549, 517066, 526193]
11794E26193l3215n788J5141J167P316j6334L443k6948k6264N42R563Q889j7049
11781D46656N445J7198j9265l6424M791K0719K7335o178j2076j0023j3228k3208
11769D01742L323o550m538Q950K2837k389m214j991o600j8732K82o28J7823l985
11755D05330j1570O404o413n139j4196k023M986l589J5439K7542j3531J8718J1727
11742D33685j721L407j0786m923J3212j004N685L6669n975q769J2448N71j6317
11729D56182R614j7273j5865j7653j5584o69J949J4017K0557r959m466j291m228
11716D15331J2807K3063J2120L4110J475l9930j8420N241J1802K1474K310j9966
11704D61417m333M637j8290l0575l1417J5848k561o791K4638J2575n038J2242
$$ y = [526193, 492978, 487190, 502331, 503498, 510814, 494480, 497923, 470975, 444711, 445253, 454816, 463705, 446656, 452101, 469299, 450034, 413610, 418401, 439120, 466455, 460277, 448201, 438178, 424950, 401742, 405065, 398515, 393977, 402927, 425764, 423375, 419161, 417170, 410570, 391838, 392120, 391492, 409315, 405330, 393760, 400164, 393751, 388612, 374416, 372393, 377379, 373790, 389229, 416771, 403240, 421958, 433685, 431964, 435371, 424585, 419662, 432874, 431870, 437555, 474224, 468249, 459480, 471928, 472499, 456182, 465796, 448523, 432658, 415005, 399421, 398752, 400701, 414718, 435275, 425316, 420850, 419559, 415331, 428138, 451201, 463321, 497431, 498906, 458976, 440556, 445797, 457599, 479073, 481383, 461417, 457084, 461721, 443431, 412856, 381439, 397287, 394726, 387935, 412573, 425148, 420110, 432352]
11692D32352O127K2261Q45j9280R181J1143K751J360P906k5639q982J3159j6198
11679D36986k2029K2046q907L214J0607l677j0266Q20K2156K5697l79j4061J2135
11666D74342m216m537O92P323l77J1273P325Q978j1348j6591o092L1726P970J2920
11652E19388k059K8355O360j8879k074K2302J1857M737J8118M6592M1202m757
11640F71142P817L4626N1759O7116N2921Q8068J17861J04377N3296l772l9498
11629A205713r7573j02042r8147q3785m7299k8364m3109q271k0879l9867j1028
11618F25349J2121J0731J983M69P181M669k942O031q990k305O238K341R625Q460
11604F80961K3910K1412J7728M0539M7859N0585O5153O8773J00634J43815J86707
$$ y = [432352, 438479, 460740, 461585, 442305, 451486, 462629, 465380, 466740, 474646, 449007, 440025, 453184, 436986, 414957, 437003, 428096, 431310, 441917, 438240, 427974, 428794, 450950, 476647, 476268, 462207, 474342, 470126, 465589, 466281, 473604, 473227, 484500, 491825, 500803, 489455, 472864, 466772, 498498, 506468, 519388, 517329, 545684, 552044, 533165, 531091, 553393, 565250, 569987, 588105, 634697, 675899, 671142, 678959, 713585, 765344, 832460, 885381, 973449, 1091310, 1195687, 1248983, 1245211, 1205713, 1108140, 1006098, 907951, 824166, 776867, 748503, 705394, 697123, 676244, 636377, 625349, 637470, 648201, 650184, 650653, 657834, 662503, 659561, 665592, 656602, 654297, 660535, 662876, 672501, 680961, 704871, 726283, 744011, 784550, 832409, 882994, 948147, 1016920, 1117554, 1261369, 1448076]
11593A448076K34375K22522J59421O8921n6843k02004k22628k12474j81397j59845
11583A098124j00892p1251n0529n4741n7338j5826k524k0801k248J7280j3112
11572G26142J0031O724j8873l8041k6074l0886j6702J4479Q138r617J2153M6866
11560F84340M6724j1615p221M1673M1731O0521R3211Q5011O9384J08692J05764
11549A318215P7607j2589p2834j16725j18565j09468r2835o7542n0115j9031k2166
11538G13952j3692j5431l6487k6482m495K4008J6153k2286L819M311j8997m8278
11526E76095r964M719k1632J060j616n29K9626q54l6679j807r704p725L1025J6033
11512E68048R834k803k6339q331L616j7064k601J4154O903L112k4196m1969j0073
$$ y = [1448076, 1682451, 1904973, 2064394, 2133315, 2076472, 1874468, 1651840, 1439366, 1257969, 1098124, 997232, 925981, 875452, 820711, 763373, 747547, 745023, 724222, 721974, 739254, 726142, 736173, 742897, 724024, 685983, 659909, 629023, 612321, 626800, 634938, 625321, 637474, 684340, 731064, 719449, 712228, 753901, 795632, 856153, 949364, 1034375, 1103759, 1212451, 1318215, 1395822, 1383233, 1310399, 1193674, 1075109, 965641, 872806, 805264, 755149, 736118, 713952, 700260, 684829, 648342, 621860, 617365, 641373, 657526, 635240, 639059, 643370, 624373, 576095, 566131, 570850, 549218, 550278, 548662, 548133, 577759, 576905, 540226, 538419, 528715, 520990, 552015, 568048, 577882, 575079, 548740, 540409, 544025, 526961, 524360, 538514, 545417, 548529, 524333, 482364, 472291]
11499D72291K6750l0875j3719K4100M2120J0801O154K4947J2016r295j6314m764
11487E44212J7523L1679K0652L4p291k4206o870M271j996O589o695j6242K4543
11474E86203J7627N367k1731k0918r778O474K8176p613k8344p398K3621K0305
11462E91991J0412J2844j2520J8806K3677n074R504J8441K6589J4835j6934O355
11450F98926j3807j767K0789K9168l794l3507l4888K8201Q573J0811J9508J3201
11438G41414j3302o651P738q291j8517j6627j4138j1426o022n419P834k7376L0698
11425F59915L4939L8991J2803L674J7079J0177K6012M2657M8370L6828N2653O616
11413I90714J2150J0617o083k4121m4969k8261q465k1847k1924l5616k4241l3085
$$ y = [472291, 499041, 468166, 454447, 478547, 520667, 531468, 537622, 562569, 574585, 565290, 548976, 544212, 561735, 593414, 614066, 614100, 606809, 582603, 575733, 580004, 578008, 584597, 577902, 561660, 586203, 603830, 609197, 587466, 566548, 556770, 563244, 591420, 583807, 555463, 548065, 571686, 591991, 602403, 615247, 602727, 621533, 645210, 640136, 649640, 668081, 694670, 709505, 692571, 698926, 685119, 683352, 704141, 733309, 729515, 696008, 661120, 689321, 697894, 708705, 728213, 741414, 728112, 721461, 729199, 720908, 702391, 685764, 671626, 660200, 654178, 648759, 656593, 629217, 659915, 694854, 733845, 746648, 750322, 767401, 777578, 803590, 846247, 894617, 931445, 984098, 990714, 1002864, 1013481, 1007398, 983277, 938308, 910047, 901582, 879735, 857811, 822195, 797954, 764869]
11401G64869M041J8258J9632K0274N809k3529m9091K515Q43M072j8819j9483j5893
11388G13498o869l758M6364L1454J3708N51j7421r348J4659j2364K3002N8356
11376H51832K3408K9419K7540K8189L9297L6796r523m5826k0993K6483l4694k0664
11364I31264q037K1518K195j8818l638j2680l3082J80J1995o143j9181k4079j3817
11351H27677j095j8589p093N021J3844j3993Q219M8870N2948J2278M037J5745
11339I47869L898L9030M1493J7691k58N651J8257M6937O9329Q4838J5063j5376
11327A274422k052N413j8558m3299l2346J3592K5961K1764K6643L147J6843n010
11315A286520j6318j4323N302J1134J1594r530O794n291j440K0912M6648K8K0331
$$ y = [764869, 768910, 787168, 806800, 827074, 832883, 809354, 760263, 762778, 763621, 767693, 748874, 729391, 713498, 706629, 702871, 749235, 780689, 794397, 794948, 777527, 768179, 782838, 770474, 793476, 851832, 875240, 904659, 932199, 960388, 999685, 1036481, 1026958, 981132, 960139, 986622, 951928, 931264, 923227, 944745, 946940, 928122, 924484, 911804, 878722, 878902, 890897, 884754, 865573, 841494, 827677, 826582, 807993, 800900, 805921, 819765, 805772, 813991, 862861, 915809, 928087, 932124, 947869, 951767, 990797, 1032290, 1049981, 1049723, 1055374, 1073631, 1120568, 1189897, 1274735, 1289798, 1274422, 1272370, 1277783, 1259225, 1215926, 1183580, 1197172, 1223133, 1244897, 1271540, 1274687, 1291530, 1286520, 1270202, 1255879, 1261181, 1272315, 1283909, 1274379, 1281173, 1275882, 1274442, 1295354, 1342002, 1342030, 1362361]
11302A362361M4027L3707J3627K1584O40r491J9663L5688R4935O1288j989k540
11290A673500L1021N8312N7595P7002N6334N0768M5671k2585j6828Q725J5768
11279B035283M4589O6902O7238Q0114J38415J40237Q9848N3847M3010J4918k8878
11268B745523o2011n9083j9938k5762j9324n07K1078K9384K8985j793P615L2381
11256B676548N5813M7634N1751M1405K6129O6517O1884R6327Q2962J26233J44081
11245C477284J45642J38491J32758J26722J03967R7979J11350J69044J75269K33719
11235D912225K52341K82919L37807M02575L93261M10898L78609L09993K57504
11226G938132K27888K07127L01492L95923M64993N31878O06268O81462P60661
$$ y = [1362361, 1406388, 1440095, 1453722, 1475306, 1475946, 1466455, 1486118, 1521806, 1616741, 1678029, 1676040, 1673500, 1704521, 1762833, 1820428, 1897430, 1953764, 2004532, 2050203, 2027618, 2010790, 2019515, 2035283, 2079872, 2146774, 2214012, 2294126, 2432541, 2572778, 2662626, 2716473, 2759483, 2774401, 2745523, 2683512, 2624429, 2604491, 2578729, 2559405, 2558898, 2579976, 2609360, 2638345, 2636552, 2644167, 2676548, 2732361, 2779995, 2831746, 2873151, 2899280, 2965797, 3027681, 3124008, 3206970, 3333203, 3477284, 3622926, 3761417, 3894175, 4020897, 4124864, 4222843, 4334193, 4503237, 4678506, 4912225, 5164566, 5447485, 5785292, 6187867, 6581128, 6992026, 7370635, 7680628, 7938132, 8166020, 8373147, 8674639, 9070562, 9535555, 10067433, 10673701, 11355163, 12115824]
11217A2115824Q56984J070584J303973J586901J920116K340618K922318L701532
11209B7818850M760182O160957Q038516J0494296J3303313J5862983J7043998
11202A03483095J5665695J1212667M195226l692662j0447998j4852654j6251348
11195H9312021j4852344j2055177r226477o868941n105692l792848k768997k075644
11187C2565901j599484j256379r93949p36049m65062j76643J23011M10669O22723
11178B8494738Q04299R98447J266246J589442K037299K643547L380600M267035
11170D5481653N403664O895476Q872860J1556304J5193249J9937997K5738727
11163A39079930L1874836L6685693L7746680L3035316K1695812M739345j4091522
$$ y = [12115824, 12972808, 14043392, 15347365, 16934266, 18854382, 21195000, 24117318, 27818850, 32579032, 38739989, 46778505, 57272801, 70576114, 86439097, 103483095, 119148790, 130361457, 134556683, 130864021, 120416023, 105563369, 89312021, 74459677, 62404500, 53178023, 46309082, 41203390, 37410542, 34641545, 32565901, 30966417, 29710038, 28716089, 27980040, 27514978, 27338335, 27461346, 27872015, 28494738, 29299037, 30297484, 31563730, 33153172, 35190471, 37834018, 41214618, 45481653, 50885317, 57780793, 66653653, 78209957, 93403206, 113341203, 139079930, 170954766, 207640459, 245387139, 278422455, 300118267, 304857612, 290766090]
11156B90766090l0486757m0439344m0813137l4297019k6244894j9455767j4469723
11149H4559449j0916335q396450o640595n391074m451491l650079l006505k434259
11141C9672661j896884j442823j137097q71018o79410n43012l44703q3593K70969
11132C2945090P26404J177470J678707K220583K937867L874240N181384O997384
11124E7739129R423226J2606639J6408573K0191649K2417981K1279703J5514351
11117A75581251N485575o210581j6011668k1684123k2690088k0231228j6336468
11110G7902670j2608240r636653p430953n821353m632651l807117l189441k678699
11102B8097563k257824j940350j657685j429912j268199j146956j054573r98772
$$ y = [290766090, 260279333, 219839989, 179026852, 144729833, 118484939, 99029172, 84559449, 73643114, 65246664, 58606069, 53214995, 48763504, 45113425, 42106920, 39672661, 37775777, 36332954, 35195857, 34324839, 33645429, 33102417, 32757714, 32674121, 32945090, 33671494, 34848964, 36527671, 38748254, 41686121, 45560361, 50741745, 57739129, 67162355, 79768994, 96177567, 116369216, 138787197, 160066900, 175581251, 181066826, 174856245, 158844577, 137160454, 114470366, 94239138, 77902670, 65294430, 55657777, 48226824, 42405471, 37772820, 33965703, 30776262, 28097563, 25839739, 23899389, 22241704, 20811792, 19543593, 18396637, 17342064, 16343292]
11094A6343292q91306q06852p44260o46318n89140n48435n11918m86159m64686
11085A0654218m43692m20248l58254l45216k99194k86091k84359k59519k21202
11076G736443k00658k12973j98811j77404j80834j65468j61823j36198j16292
11067F185982j01357p4228q1711r5281j34298j58309j45465j19789j31764j51084
11057D992696j48011j09305o8821r3371p8157n0311k0245k11K7478K1668K4945
11046D498355R481r109R825n2222q4080j37043j87020j44434j16919j04441p9669
11035C602724p1706m5665m8544l3476l7380o7009o0517o4408l4505m3497m3201
11024C052816P741q703m2858l5364l6398k9145k7788k8883n6287l0036k7991k4418
$$ y = [16343292, 15451986, 14645134, 13900874, 13254556, 12665416, 12116981, 11605063, 11118904, 10654218, 10210526, 9790278, 9432024, 9086808, 8787614, 8501523, 8217164, 7957645, 7736443, 7535785, 7322812, 7124001, 6946597, 6765763, 6600295, 6438472, 6302274, 6185982, 6084625, 6010397, 5928686, 5833405, 5699107, 5540798, 5395333, 5275544, 5143780, 4992696, 4844685, 4735380, 4666559, 4573188, 4495031, 4444720, 4424475, 4424264, 4451742, 4473410, 4498355, 4507836, 4498727, 4508552, 4456330, 4372250, 4235207, 4048187, 3903753, 3786834, 3682393, 3602724, 3531018, 3485353, 3436809, 3403333, 3365953, 3298944, 3238427, 3174019, 3139514, 3096017, 3052816, 3060557, 3051854, 3008996, 2973632, 2937234, 2908089, 2880301, 2851418, 2795131, 2765095, 2737104, 2712686]
11012B712686m116q442Q447J10J2112M8496M8344K8822P7640J31490J59755J79240
11000C394584J41547L4987k158p4222r3322o1516j8895m4509l5959q8108j32175
10989C020254j18544r6236r6085p1464o5766j6822J5052J1171j6673j089J8984
10978B582782K4690L930j8593m382l8446l3677n697J8126P751J4480K4730L8114
10966B613808M0023O4119Q0300J56053J90710K09834J77212L7960r2795j36479
10956C340745j16100p1657l0012j6212p526J2898J8548M9841O9963Q1323J00043
10945C431854J03676J21170J62351J53253Q2833k1201r6954j48073j61933j28382
10935C498594q1978o4145r2480r0495j9022j6m661J1961J6866O773M6651O8772
$$ y = [2712686, 2708570, 2700128, 2708575, 2708685, 2720797, 2769293, 2817637, 2846459, 2924099, 3055589, 3215344, 3394584, 3536131, 3571118, 3568960, 3494738, 3401416, 3339900, 3321005, 3276496, 3240537, 3152429, 3020254, 2901710, 2805474, 2709389, 2637925, 2572159, 2555337, 2570389, 2581560, 2564887, 2563798, 2582782, 2607472, 2611402, 2592809, 2588427, 2549981, 2516304, 2510607, 2528733, 2536484, 2550964, 2575694, 2613808, 2653831, 2717950, 2798250, 2954303, 3145013, 3354847, 3532059, 3570019, 3477224, 3340745, 3224645, 3152988, 3122976, 3106764, 3099238, 3112136, 3130684, 3180525, 3250488, 3331811, 3431854, 3535530, 3656700, 3819051, 3972304, 4055137, 4033936, 3936982, 3788909, 3626976, 3498594, 3416616, 3352471, 3259991, 3169496, 3150474, 3150458, 3145797, 3157758, 3174624, 3181397, 3228048, 3296820]
10923C296820N5685Q3056N5946N9517K4783j7787j7184J4641J9910P2081R9145
10912C746613J33199J00920P0493M7914Q1340O3486P3321J38445K21792L04761
10902D982284L49176L97237M67842M15366L24789R9890j37182k45430k93523j87778
10892F172671j19631q3256l3279M2300J03496J22133J57544J74192J87202K20225
10882F943597K63039L14837L21422L44272M16778M86005N25343O63208P48383
10873A1026884Q68772J002208J149677J343694J541121J805210K113270K479455
10865B3330291K938401L548895M446741N604646P255749R472681J2218886J5257321
10857H4073611J7729603J8341224J5657405R151158J6071r059875j5310166j7421075
$$ y = [3296820, 3352505, 3435561, 3491507, 3551024, 3575807, 3558020, 3540836, 3555477, 3575387, 3647468, 3746613, 3879812, 3980732, 4051225, 4099139, 4180479, 4243965, 4317286, 4455731, 4677523, 4982284, 5331460, 5728697, 6196539, 6611905, 6936694, 7036584, 6899402, 6653972, 6360449, 6172671, 6053040, 5969784, 5936505, 5978805, 6082301, 6204434, 6361978, 6536170, 6723372, 6943597, 7206636, 7521473, 7842895, 8187167, 8603945, 9089950, 9615293, 10278501, 11026884, 11895656, 12897864, 14047541, 15391235, 16932356, 18737566, 20850836, 23330291, 26268692, 29817587, 34264328, 39868974, 47124723, 56597404, 68816290, 84073611, 101803214, 120144438, 135801843, 144953001, 144969072, 135909197, 120599031, 103177956]
10849A03177956j6249680j3536921j0620484q118845o144809m674964l583092
10842D0249161k795448k272156j877710j534299j242430r54252o29504l17484
10834B8625878o0631K66831N85529Q91646J202152J599243J984152K406940K876844
10825D0378584L368085L995522M799897N887196P313223R244224J1951527J5693068
10817A02631326K0582595K6637520L3174710L8289892L8887045L1895413J6328097
10810C08426598m547465k4452248l7058600m0043251l5952739k9095105k2371474
10803A14905716j6876794j2733258r772912p659040o190863n145805m442297l902869
10795D8181878l380674k900252k430524j975226j561076j186445q11459m89455
$$ y = [103177956, 86928276, 73391355, 62770871, 54652026, 48507217, 43832253, 40249161, 37453713, 35181557, 33303847, 31769548, 30527118, 29572866, 28943362, 28625878, 28565247, 28832078, 29417607, 30309253, 31511405, 33110648, 35094800, 37501740, 40378584, 43746669, 47742191, 52542088, 58429284, 65742507, 74986731, 86938258, 102631326, 123213921, 149851441, 183026151, 221316043, 260203088, 292098501, 308426598, 303879133, 279426885, 242368285, 202325034, 166372295, 137277190, 114905716, 98028922, 85295664, 75522752, 67863712, 61672849, 56527044, 52084747, 48181878, 44801204, 41900952, 39470428, 37495202, 35934126, 34747681, 33936222, 33446767]
10787C3446767j96328K5407K76911O05747R47121J322241J756935K233337K867402
10778D3285540L786805N022551O552903Q591986J1214533J4352195J7429291J9244505
10770A29480309J8142927J2981369M120628o284467j4944138j9440030j9716132
10763A04340466j7351393j4112432j1025655q488566o585586n220910m198425
10756C7357499l517953l009563k603974k287025k033290j778344j527113j343802
10748A9256435j152610r89993q80774q02917p08647o04552n47702n36859m88807
10739A2543574m92054m73644l81758l43576k84657k54437k44085l04811l14403
10730I450149k99257k28815k07641j69430j44285p3809l8039K999O0076J09669
$$ y = [33446767, 33250439, 33275846, 33552757, 34158504, 35105625, 36427866, 38184801, 40418138, 43285540, 47072345, 52094896, 58647799, 67239785, 78454318, 92806513, 110235804, 129480309, 147623236, 160604605, 164725233, 158440766, 143496628, 124056598, 104340466, 86989073, 72876641, 61850986, 53362420, 46776834, 41555924, 37357499, 33839546, 30829983, 28226009, 25938984, 23905694, 22127350, 20600237, 19256435, 18103825, 17113832, 16233058, 15430141, 14721494, 14116942, 13569240, 13032381, 12543574, 12051520, 11577876, 11196118, 10852542, 10567885, 10313448, 10069363, 9764552, 9450149, 9150892, 8922077, 8714436, 8545006, 8400721, 8326912, 8288873, 8291872, 8351948, 8461617]
10720H461617R0123L815j16575k76617l77183l85760l53625l23483k43830k14258
10710F264224j72666j27409j01955j03301r6373l9619n7057p0181n8185m5351
10700E392127q5288j05301r5838n5326o5520l4970m2625k0423K754K8607P2740
10689D990937Q5014R7331M6597K6439L0236L3510m342p943j5234o321M366n2580
10677E228010j14279j53652j50030j04833r0941q4546o5354o5457m0928n1592
10667D306398m6808k1381J9833N8257Q5352J10164L3933j6685m5550o3586o9050
10656D350877n6635L103J7498K3898L1493L5936K8954M8496J3859J5363L7508
10645D550350N933m87M0243N8600N8820O8536K8056l68J7660k804k3661j3181
$$ y = [8461617, 8551740, 8555555, 8438980, 8162363, 7785180, 7399420, 7045795, 6722312, 6478482, 6264224, 6091558, 5964149, 5862194, 5758893, 5662520, 5622901, 5565844, 5495663, 5437478, 5392127, 5306839, 5201538, 5105700, 5050374, 4984854, 4949884, 4907259, 4886836, 4889590, 4918197, 4990937, 5075951, 5173282, 5219879, 5246318, 5276554, 5310064, 5305722, 5297779, 5282545, 5276224, 5280590, 5228010, 5113731, 4960079, 4810049, 4705216, 4614275, 4529729, 4464375, 4398918, 4357990, 4306398, 4259590, 4238209, 4258042, 4316299, 4401651, 4511815, 4545748, 4529063, 4483513, 4419927, 4350877, 4294242, 4297345, 4314843, 4338741, 4370234, 4406170, 4435124, 4483620, 4497479, 4512842, 4550350, 4556283, 4555796, 4596039, 4654639, 4713459, 4781995, 4810051, 4809683, 4827343, 4824539, 4800878, 4787697]
10633D787697J6420Q54J7314L6660M7896N686J5446M8261R7736J31950J51883
10622E357803J23551J03026J08587Q4361P9690R2502P4013P3261R2239J23776
10612F312809J57170J94895K50766K88485L58916M15852M38578L43600K13467
10603H974538J46241R6116Q0154J56345K56025L22061M37820N72711O67902P54429
10593A2464342Q89463J027703J211379J439315J675442J963971K453999L199446
10585B6325060M271639N747463P848642J0910054J5460940K1992102K9571053
10578A22126953L4946772L4095974K5053075P465093j2501804k7107714l5435040
10571A48643309l4026810k5667785j7427182j1657412p964571n527726m020616
$$ y = [4787697, 4804117, 4804971, 4822285, 4858945, 4906841, 4912527, 4927973, 4976234, 5073970, 5205920, 5357803, 5481354, 5584380, 5692967, 5777328, 5857018, 5949520, 6023533, 6096794, 6189033, 6312809, 6469979, 6664874, 6915640, 7204125, 7563041, 7978893, 8417471, 8761071, 8974538, 9120779, 9216895, 9297049, 9453394, 9709419, 10031480, 10469300, 11042011, 11709913, 12464342, 13353805, 14381508, 15592887, 17032202, 18707644, 20671615, 23125614, 26325060, 30596699, 36344162, 44192804, 55102858, 70563798, 92555900, 122126953, 157073725, 191169699, 216222774, 223687867, 211186063, 184078349, 148643309, 114616499, 88948714, 71521532, 59864120, 51899549, 46371823, 42351207]
10564D2351207l117189k623155k321312j934791j523610j250648r63619o79646
10556B7937237l43928l9734K75068O29311R08545J152235J347558J566569J956472
10547C5389333K640409L466282M507887N898900P866796J0761050J5324352K2853866
10539A08708875L4892915N1787506O7457388O8600115N0338374J5770893k6801378
10532C70754688m8190344n3484448n4724970m7903265l5968016k5232266j7632286
10525H7619093j2634738r346152p109142n468435m261883l348382k726253k338280
10517D0385828k170748j968837j690384j281539r21589o14106l37866p4502K31161
10508C1557418N51170Q45578J060905J338776J662206K149341K802917L795170
$$ y = [42351207, 39234018, 36610863, 34289551, 32354760, 30831150, 29580502, 28616883, 27937237, 27593309, 27553575, 27828643, 28457954, 29366499, 30518734, 31866292, 33432861, 35389333, 38029742, 41496024, 46003911, 51902811, 59769607, 70530657, 85855009, 108708875, 143601790, 195389296, 262846684, 331446799, 381785173, 397556066, 370754688, 322564344, 269079896, 214354926, 166451661, 130483645, 105251379, 87619093, 74984355, 65638203, 58529061, 53060626, 48798743, 45450361, 42724108, 40385828, 38215080, 36246243, 34555859, 33274320, 32352731, 31738625, 31400759, 31326257, 31557418, 32108588, 32954166, 34015071, 35353847, 37016053, 39165394, 41968311, 45763481]
10500D5763481N391238P864226J1531900J6538054K1962171K5029685K3255145
10493A57335900J6156892L738695r428032j8918576k5671869k6509975k0899491
10486G5803544j4433994r752121o779490m834731l536964k661108k027254j527401
10478C0250481j179812r67428q75010q24028p13600n69871m66675k88904j44285
10469B4220868m6673N9607J58208K53224L03528L74128L58685L36118K92208K83733
10459B6593634L15320K99850L64420M73865N72516O70856Q17959R40846J066284
10450C2115550J179281J289806J428328J588587J791069J950096K161811K435996
10442D5940524K723864L072008L465670L839909M348065M905296N518645O237579
$$ y = [45763481, 51154719, 59018945, 70550845, 87088899, 109051070, 134080755, 157335900, 173492792, 177231487, 167803455, 148884879, 123213010, 96703035, 75803544, 61369550, 51617429, 44837939, 40003208, 36466244, 33805136, 31777882, 30250481, 29070669, 28103241, 27228231, 26404203, 25690603, 25120732, 24654057, 24365153, 24220868, 24174195, 24233802, 24392010, 24645234, 24948762, 25322890, 25681575, 26017693, 26309901, 26593634, 26908954, 27208804, 27573224, 28047089, 28619605, 29290461, 30108420, 31049266, 32115550, 33294831, 34584637, 36012965, 37601552, 39392621, 41342717, 43504528, 45940524, 48664388, 51736396, 55202066, 59041975, 63390040, 68295336, 73813981, 80051560]
10434H0051560P062139Q020111R052120J0177846J1281182J2361182J3218370
10427A51224510J3704256J3648728J2874479J1217615Q712880N561952K230826
10420B19175246r14150l492057n187808n962122n770716m904025l497253j772853
10412A87674262O9066J971645L718407N279993O630514P646452Q492054R197863
10404B30680256J0113500J1689044J4461481J8773452K4372976K9534569L1346808
10397C70972086K7008591J5926904R81408j2543706k0473900k2186495k0408643
10390C39276245j7883209j5720168j3979681j2436979j0830286r125053p477820
10383B51823049o192369n393761n214264n536126o035516o327989o185044n585621
$$ y = [80051560, 87113699, 95133810, 104185930, 114363776, 125644958, 138006140, 151224510, 164928766, 178577494, 191451973, 202669588, 211382468, 216944420, 219175246, 218261096, 214769039, 209581231, 203619109, 197848393, 192944368, 189447115, 187674262, 187743328, 189714973, 193433380, 198713373, 205343887, 212990339, 221482393, 230680256, 240793756, 252482800, 266944281, 285717733, 310090709, 339625278, 370972086, 397980677, 413907581, 414888989, 402345283, 381871383, 359684888, 339276245, 321393036, 305672868, 291693187, 279256208, 268425922, 259300869, 251823049, 245630680, 240236919, 235022655, 229486529, 223451013, 217123024, 210937980, 205352359]
10375B05352359m521981l150096j550173J99914J982904L744166N465500O921895
10367B14444488P930371Q436621Q345594P542177O010001L898814J847751Q17659
10359B59273476J948549N998967J3210329K2770328L1685371L4696248K7217166
10352C96800434R637007j2249215k9334126l6328240l6770001l5974478l4734364
10345B21047017l1099619k5112621j8514252j2717916q449419o098704n789723
10338A13264763o853155q290963q653947p679779o349165n238029m419466l720700
10330F2059559l048333k498325k010820j609241j290636r88945o82482l39130
10322D9591647k0715K72194N43582Q43628J247688J951871L007768M535211O690704
$$ y = [205352359, 200830378, 197680282, 196130109, 196330023, 198312927, 202057093, 207522593, 214444488, 222374859, 230811480, 239157074, 246699251, 252709252, 256608066, 258455817, 259273476, 261222025, 267220992, 280431321, 303201649, 334887020, 369583268, 396800434, 406437441, 394188226, 364854100, 328525860, 291755859, 255781381, 221047017, 189947398, 164834777, 146320525, 133602609, 125153190, 119054486, 113264763, 106411608, 98120645, 89466698, 81786919, 75437754, 70199725, 65780259, 62059559, 59011226, 56512901, 54502081, 52892840, 51602204, 50613259, 49930777, 49591647, 49570932, 49843126, 50386708, 51230336, 52478024, 54429895, 57437663, 61972874, 68663578]
10313F8663578R748488J4094803J9595207K5380970K8870675K6793640J7048635
10306B10195996J008831j6042078k7662435l0710282k7037474k0794745j5035363
10299G3922450j0781891p818680n778331m386983l440673k785715k428083k160751
10291C4341343j950652j785159j640814j525939j474260j412391j371586j311787
10283B1868755j152478j021283r14265p77848o71083o30701n67491n67905n62897
10274A5002804m75661m30159l53564l45690l26748l48965l41940l40335l10305
10265A1729437k78647k28279k43831k62098k54825k36944k30313k37969k22069
10256I534462j86731j77004j74443j56929j49411j56282j43192j30094j21052
$$ y = [68663578, 78412066, 92506869, 112102076, 137483046, 166353721, 193147361, 210195996, 211204827, 195162749, 167500314, 136790032, 109752558, 88957813, 73922450, 63140559, 55321879, 49543548, 45156565, 41715892, 38930177, 36502094, 34341343, 32390691, 30605532, 28964718, 27438779, 25964519, 24552128, 23180542, 21868755, 20716277, 19694994, 18780729, 18002881, 17331798, 16701097, 16133606, 15565701, 15002804, 14527143, 14096984, 13743420, 13397730, 13070982, 12722017, 12380077, 12039742, 11729437, 11450790, 11222511, 10978680, 10716582, 10461757, 10224813, 9994500, 9756531, 9534462, 9347731, 9170727, 8996284, 8839355, 8689944, 8533662, 8390470, 8260376, 8139324]
10247H139324j07293j27485j38118j38235j58170j75119j63663j37414j50808
10238F843019j42582j28707j08312j36322j38663j06148j31356j33990q9851o9335
10228E657753p6109q1577j24767j48095j34999j00977q9732r0504n0239n4233
10218D706521q7201j31724q5031o6694p8705n8371o7274p1028p6040o2418n4232
10207C867803n9742j3536k0875l1441l6449o4685n4565m5279p0430n0394n4607
10196C365800m2221m3850m3039l4473k5470l842K8313J0569j7001o7136n9218
10185C068432p9661p7671m3924j6685m8803m1760k7565n4462n4600n598k3550
10174B594153j3071j1272m2286n1183k2539r091j4901j5444r137j7013k2098l4847
$$ y = [8139324, 8032031, 7904546, 7766428, 7628193, 7470023, 7294904, 7131241, 6993827, 6843019, 6700437, 6571730, 6463418, 6327096, 6188433, 6082285, 5950929, 5816939, 5727088, 5657753, 5581644, 5500067, 5375300, 5227205, 5092206, 4991229, 4901497, 4810993, 4760754, 4706521, 4619320, 4487596, 4402565, 4335871, 4257166, 4198795, 4131521, 4060493, 3984453, 3922035, 3867803, 3808061, 3794525, 3773650, 3742209, 3705760, 3641075, 3586510, 3541231, 3470801, 3420407, 3365800, 3323579, 3279729, 3236690, 3202217, 3176747, 3172905, 3201218, 3211787, 3194786, 3127650, 3068432, 2988771, 2911100, 2867176, 2850491, 2801688, 2759928, 2732363, 2677901, 2623301, 2617703, 2594153, 2581082, 2569810, 2527524, 2476341, 2453802, 2444711, 2429810, 2414366, 2405229, 2388216, 2366118, 2331271]
10162B331271m3158k6438j3658Q742j7121l9583k5305l704P553q119K2908O8581
10150B261969R9928J37231J50597J76334J61392L7329r1153j59420j81112j51369
10140B441726j02479l4980J4497O0033J01835J34937J47586J06909K1708j14600
10130B777172j85066k16914j82372r6285r6478r0943p0817J6513J5350M107l4586
10119A839681k1253Q156k1055k636p046o031q179J415K3414R8697J55695K09923
10107B270781L06878L66643L54863J98990j7586k56097l75951l73116k83553j92708
10097A999144j48768j47922j35902o0046n2379m9021j2062k6186j0691j2843k3202
10086A320122l7962k6778J2051K6952j5057k605Q159K6449K4570O192j8892k5212
$$ y = [2331271, 2288113, 2261675, 2248017, 2256759, 2239638, 2200055, 2174750, 2171046, 2178599, 2170480, 2193388, 2261969, 2361897, 2499128, 2649725, 2826059, 2987451, 3024780, 2933627, 2774207, 2593095, 2441726, 2339247, 2304267, 2318764, 2378797, 2480632, 2615569, 2763155, 2870064, 2891772, 2777172, 2592106, 2375192, 2192820, 2096535, 2000057, 1909114, 1838297, 1854810, 1870160, 1874267, 1839681, 1818428, 1826584, 1805529, 1802893, 1795847, 1789816, 1781637, 1783052, 1806466, 1905163, 2060858, 2270781, 2577659, 2944302, 3299165, 3498155, 3480569, 3224472, 2848521, 2475405, 2191852, 1999144, 1850376, 1702454, 1566552, 1506506, 1454127, 1405106, 1393044, 1366858, 1356167, 1343324, 1320122, 1282160, 1255382, 1267433, 1294385, 1279328, 1276723, 1284882, 1311331, 1335901, 1342093, 1323201, 1297989]
10074A297989O398J4289K3894Q057O912J6193N2414Q7138P8186J26722J42447
10063A860639J11281P0354m9418j35016j68675j17607j16568j00724n5557l6457
10053A262252k6411k4293j9959l849j7607k5707p458j8169J5206j3513l3360j62
10041A086970J5559l5292j236Q24o715M3601K0962r177k0203J6925j313k5338
10029A085567r119o254m312j1796k3654M009N074R303J2647L626J0086K6450K3117
10016A124744K5399N3171J039j6208N7182O0079O8010M2521O3401P7602Q4267
10005A641207O4838Q2084N6643K1668J8569N0425M5759q893q919k1053j5714j3043
9993A913571k2770j1915j8949p338K809K3618P365Q657J7109O3806P9324J16396
$$ y = [1297989, 1304387, 1318676, 1342570, 1350627, 1357539, 1373732, 1426146, 1513284, 1591470, 1718192, 1860639, 1971920, 2042274, 1992856, 1857840, 1689165, 1571558, 1454990, 1354266, 1298709, 1262252, 1235841, 1211548, 1191589, 1187740, 1170133, 1144426, 1136968, 1118799, 1134005, 1120492, 1087132, 1086970, 1102529, 1067237, 1066001, 1066825, 1060110, 1103711, 1124673, 1115496, 1095293, 1112218, 1110905, 1085567, 1076448, 1070194, 1065882, 1054086, 1030432, 1034441, 1039515, 1048818, 1061465, 1065091, 1075177, 1101627, 1124744, 1150143, 1203314, 1204353, 1188145, 1245327, 1305406, 1373416, 1415937, 1479338, 1556940, 1641207, 1706045, 1788129, 1844772, 1866440, 1885009, 1935434, 1981193, 1972300, 1963381, 1942328, 1926614, 1913571, 1890801, 1878886, 1859937, 1852599, 1855408, 1879026, 1886391, 1895048, 1912157, 1975963, 2055287, 2171683]
9981B171683J72107J64607J19551N0300J0357R900j4226n4229m7427o2746m1766
9970B478111m1117l3035m0349j5576k7039m7688l2669j039m1741m4822m5723k8732
9958B078581q1691m4997R195p505j1074l0001j9890j4806q517J091l64K7431J2861
9945A910314K5704M7829O9446Q3544Q2746P1551R4366J27995J67041J14557J02623
9934B897716Q2718R42r6734j66496j78360j58475j43399j53243j92188j48692
9924A743789j17429p2558m1045q1346n5237m1434m4635m0924l7907k6501k3354
9913A161419l7505m8050o169m273N436J610k4204j8687l3264K1042j2522j5037
9901I89796l575K439J5892K4467O609J4864O6170Q7544P1240J08507J26128J26637
$$ y = [2171683, 2343790, 2508397, 2627948, 2678248, 2688605, 2698505, 2684279, 2630050, 2582623, 2519877, 2478111, 2436994, 2403959, 2363610, 2348034, 2320995, 2273307, 2240638, 2239599, 2197858, 2153036, 2107313, 2078581, 1996890, 1951893, 1961088, 1953583, 1942509, 1912508, 1892618, 1877812, 1869295, 1870386, 1870022, 1897453, 1910314, 1936018, 1983847, 2053293, 2136837, 2219583, 2291134, 2385500, 2513495, 2680536, 2795093, 2897716, 2980434, 2981376, 2884642, 2718146, 2539786, 2381311, 2237912, 2084669, 1892481, 1743789, 1626360, 1553802, 1512757, 1431411, 1376174, 1334740, 1290105, 1249181, 1211274, 1184773, 1161419, 1123914, 1075864, 1069695, 1065422, 1070858, 1072468, 1048264, 1029577, 996313, 1017355, 1004833, 989796, 986221, 988660, 1004552, 1029019, 1035628, 1050492, 1116662, 1204206, 1275446, 1383953, 1510081, 1636718]
9889A636718J18000N7337q212p6468j64386j67844j43707r1757n0437o6940n7026
9878I85278k5099l3172j5197k2230j8193q88j904j2678J0367m976l0793j6683
9866H13832j9462J3005K885k5352j4779J8638l31l9390k6185L947K3542R032M740
9853G64122P139L589K9418M5572Q538m118l2701n196j616j1861j7114k939J5400
9840G98233j2744j888o372p028K870R061o624J5673J7002j3139k9367N494J0891
9827G82062q033J9595K6824k352j1838j9554l016p335r158J995N646J6034K1150
9814H12020m3563J105j145j7593K6941J1208n649J040m425N757q632N41n699k2816
9800G49090q14j1831K0066J0461j3771M403L6986J7113j5239j1729O628J2757
$$ y = [1636718, 1754718, 1812055, 1803843, 1727375, 1562989, 1395145, 1251438, 1159681, 1109244, 1042304, 985278, 960179, 927007, 911810, 889580, 871387, 870499, 868595, 855917, 866284, 861308, 830515, 813832, 794370, 807375, 810260, 784908, 770129, 788767, 788436, 749046, 722861, 726808, 750350, 759382, 764122, 771261, 774850, 804268, 849840, 858378, 854260, 821559, 816363, 814747, 802886, 785772, 782833, 798233, 785489, 783601, 777229, 770201, 773071, 782132, 775508, 791181, 808183, 795044, 765677, 771171, 782062, 774029, 793624, 820448, 818096, 806258, 786704, 783688, 776353, 767195, 769190, 774836, 790870, 812020, 768457, 769562, 768417, 750824, 777765, 788973, 783324, 784364, 779939, 785696, 777064, 777605, 771906, 749090, 748276, 736445, 756511, 766972, 753201, 757604, 794590, 811703, 796464, 784735, 791363, 804120]
9788H04120j6276J4765M5878K4078n059j7174j2569J7281j0468l6535l2487P61
9776G76315P764j3634L0360L0929j5169k2454Q070M151n046K3327k946k0729j1041
9763G89897Q672J1917N93J7675Q592k2407j6270O600j7696j5424J8731L8610L2508
9750H61998j0890k6718o65o890j4027N558J8253K2220J739o978n85j9841J9262
9737H42436N125k255R196n604j554J057J040n1346j8863M9870N8980k1711l4983
9724H31388O672N414j1101J9417J969J1478J1088k1246j7850j7467R541J2020
9712H41323J5752p227j3773L367J6223j659M435R679J7150M4o960J8053K3237
9699I19644K4740O030r655m093j8914k3612K0483L012R751L4735K194q965O757
$$ y = [804120, 787844, 802609, 848487, 872565, 867506, 850332, 837763, 855044, 844576, 808041, 775554, 776315, 784079, 770445, 800805, 831734, 816565, 794111, 802181, 806332, 801286, 824613, 821667, 800938, 789897, 798569, 810486, 811079, 828754, 837346, 814939, 798669, 805269, 787573, 772149, 790880, 829490, 861998, 851108, 824390, 823725, 816835, 802808, 808366, 826619, 848839, 850578, 843600, 843015, 823174, 842436, 847561, 845306, 854502, 848898, 847344, 848401, 849441, 798095, 779232, 829102, 888082, 866371, 831388, 838060, 843474, 832373, 851790, 853759, 865237, 876325, 855079, 837229, 819762, 829303, 841323, 857075, 849848, 836075, 839442, 855665, 854006, 858441, 868120, 885270, 885314, 878354, 896407, 919644, 944384, 950414, 940759, 936666, 917752, 894140, 914623, 917635, 927386, 962121, 964315, 955350, 962107]
9686I62107L2862L8033L2834P844K8645K6837L0837j8974l3154M824J0702O589
9674A129986m3263o3154n5007J7818m986j7100l852J9351P969j3834L4613K9453
9662A037994K0267l91J0775o182l4862j5698q846J1045L4320J3908P522M763J0938
9649A085553K1615J8867K9374M8589M7540J3076L4486O7791O8494N8645J24569
9638A618599J19452O7715N5428L0869k0379o6240o7519o9544p6657r6750r2852
9627A402122q4140l8855l0138l6697K387J989J791j3414q642R428p022p431J5058
9614A206436J0875P845j6309m885p055L9822M5672K0511J7828Q935J5609j1623
9602A333661R897O8071M3505M8804M5515P4309R5026R8009J29398J09833M9944
$$ y = [962107, 994969, 1033002, 1065836, 1073680, 1102325, 1129162, 1159999, 1141025, 1107871, 1112695, 1123397, 1129986, 1086723, 1023569, 968562, 986380, 981394, 964294, 960442, 979793, 987762, 973928, 1008541, 1037994, 1058261, 1057870, 1068645, 1062463, 1027601, 1011903, 1003057, 1014102, 1048422, 1062330, 1069852, 1074615, 1085553, 1107168, 1126035, 1155409, 1203998, 1251538, 1264614, 1299100, 1366891, 1435385, 1494030, 1618599, 1738051, 1805766, 1861194, 1892063, 1871684, 1805444, 1737925, 1668381, 1591724, 1494974, 1402122, 1317982, 1279127, 1248989, 1212292, 1214679, 1216668, 1218459, 1205045, 1196403, 1205831, 1198809, 1191378, 1206436, 1217311, 1225156, 1208847, 1203962, 1196907, 1236729, 1282401, 1302912, 1320740, 1329675, 1345284, 1333661, 1343558, 1411629, 1455134, 1503938, 1549453, 1623762, 1718788, 1816797, 1946195, 2056028, 2105972]
9591B105972M8042J007o1619j06578j27862j32058j08341p9408m3830m5768l9026
9580A410531m6703m7813k420J5941K583J9140j8571n2845q044L7676L7599J1841
9568A358915J712k5220j3695J2599P081j0398M012j868K5262K1755K2386J614
9556A404155L8727L6180M0151M9612O7669P2951M6735O1965N7891L0351l540m2943
9544A859904p9864o8407o6726o8461m5531m2321j5064k7673j6686k0176j3224
9533A395771K3748K2336q305k770J642m8246l6385o39J8806K9860K1133o383j3440
9520A397128K2159J5543L064p447r707P414K167k0204K1136P401J7212L588K9679
9507A489133K6444J3322J3377j2257K7546J086R401K4964Q972N715J0622j4902
$$ y = [2105972, 2154014, 2155021, 2093402, 1986824, 1858962, 1726904, 1618563, 1539155, 1495325, 1449557, 1410531, 1363828, 1316015, 1313595, 1329536, 1332119, 1351259, 1332688, 1279843, 1271799, 1309475, 1347074, 1358915, 1360627, 1335407, 1321712, 1334311, 1341392, 1330994, 1335006, 1333138, 1358400, 1380155, 1402541, 1404155, 1442882, 1479062, 1519213, 1568825, 1636494, 1709445, 1756180, 1818145, 1876036, 1906387, 1902847, 1859904, 1780040, 1711633, 1644907, 1576446, 1530915, 1488594, 1473530, 1445857, 1429171, 1408995, 1395771, 1419519, 1441855, 1433550, 1430780, 1432422, 1384176, 1347791, 1347152, 1365958, 1395818, 1416951, 1410568, 1397128, 1419287, 1434830, 1437894, 1430447, 1420740, 1428154, 1430321, 1410117, 1431253, 1438654, 1455866, 1459454, 1489133, 1515577, 1528899, 1542276, 1530019, 1557565, 1558651, 1568052, 1593016, 1601988, 1607703, 1618325, 1603423]
9495A603423K786K1534j0053J2691k236O533j0621l1187k6805j0692j0440j5845
9483A529088Q654J1990j0480k3113r92L3220M3648K7858l669k1927J7108K0197
9471A631582N144K6029q065q949K2140m296R67J4133J7260J8898J6664p121r648
9458A714738m272J4514L8936N5211K6552J9621L7547L7875p464l7033k503L5763
9446A929485j8341l2477n260p106n956K058K2311p448K7252k966k1739P122j4605
9433A872330j5085N8j9007o170K9114J1545M2393K0851j2471K9298K1595j5875
9421A958576j8237L5374J1695L1025J1659O975L8260K8895J5165M0346K1597K5012
9409B206342K1523L2137J771J7057K9976k919j0349k3383r700Q290J3722K0356
$$ y = [1603423, 1606209, 1627743, 1617690, 1630381, 1628145, 1634678, 1624057, 1592870, 1566065, 1555373, 1544933, 1529088, 1537742, 1549732, 1539252, 1516139, 1515147, 1548367, 1592015, 1619873, 1616204, 1594277, 1611385, 1631582, 1636726, 1662755, 1654690, 1645741, 1667881, 1663585, 1664552, 1678685, 1695945, 1714843, 1731507, 1724386, 1714738, 1710466, 1724980, 1763916, 1819127, 1845679, 1865300, 1902847, 1940722, 1933258, 1896225, 1893722, 1929485, 1911144, 1878667, 1873407, 1866301, 1860345, 1862403, 1884714, 1877266, 1904518, 1901552, 1879813, 1886935, 1872330, 1857245, 1857303, 1838296, 1832126, 1861240, 1872785, 1915178, 1936029, 1923558, 1952856, 1974451, 1958576, 1940339, 1975713, 1987408, 2018433, 2030092, 2037067, 2075327, 2104222, 2119387, 2159733, 2181330, 2206342, 2227865, 2260002, 2261773, 2278830, 2308806, 2305887, 2295538, 2272155, 2262455, 2270745, 2284467, 2304823]
9397B304823K5216j210q763j7460j9093q273q349J1616o598J024M198L8192M2519
9384B357842L6724N330l498K3631J2563L2149P5235M1372j2484J0602M1041L4780
9372B655287J5595N8684M4123J2138M2240L1629P131K1042m918J3948O234L663
9360B906796M0330J6059J773N986j2564L0815M8879K4504n266K1641J0617r457
9348C080113L3345K3330K1349J7988K4982M8145L7328L9822L2477J6033J6701
9337C391613P5204L8762N7153M7824K5977O3026L8644P3103Q4393O2834Q6681
9326D045214O7249M8861O8439N1797K8772N6606M6584O1613N6067O1146R7517
9315D689865R9418R6302R1793R2391J04858J15173J18787J23570J59157K21747
$$ y = [2304823, 2330039, 2328829, 2320066, 2302606, 2283513, 2275240, 2266891, 2278507, 2271909, 2272933, 2277131, 2315323, 2357842, 2394566, 2399896, 2396398, 2420029, 2432592, 2464741, 2539976, 2581348, 2568864, 2579466, 2620507, 2655287, 2670882, 2729566, 2773689, 2785827, 2828067, 2859696, 2866827, 2887869, 2882951, 2896899, 2903133, 2906796, 2947126, 2963185, 2964958, 2970944, 2958380, 2989195, 3038074, 3062578, 3057312, 3078953, 3089570, 3080113, 3113458, 3136788, 3158137, 3176125, 3201107, 3249252, 3286580, 3326402, 3358879, 3374912, 3391613, 3466817, 3505579, 3562732, 3610556, 3636533, 3699559, 3738203, 3811306, 3895699, 3958533, 4045214, 4112463, 4161324, 4229763, 4281560, 4310332, 4366938, 4413522, 4475135, 4531202, 4592348, 4689865, 4789283, 4885585, 4977378, 5069769, 5174627, 5289800, 5408587, 5532157, 5691314, 5913061]
9305E913061K23202K38809K85263L29915L64806M31282M91644N50072O49493P82758
9295A0260305R31672J178074J518315K013667K654067L497326M496205N503891
9287C2053522O020861N648426M216059J827746r75499l471588n161011n691583
9279C4466933n160312m095179l086442k284351j689791j228740r06990o47130
9271A5367998m60826l07396k04152q2160k6732L7184J16596K09352L46837M86362
9261A5483063O54276Q19304J041101J302183J559981J841635K168000K520562
9253B7390105K884512L173528L468654M028676N152120P094445R996674J3758423
9245G6947137J7843655K0777816K0674671J6398959Q530804p04619q566995j3931675
$$ y = [5913061, 6136263, 6375072, 6660335, 6990250, 7355056, 7786338, 8277982, 8828054, 9477547, 10260305, 11191977, 12370051, 13888366, 15902033, 18556100, 22053426, 26549631, 32053522, 38074383, 43722809, 47938868, 49766614, 48791115, 45319527, 40158516, 34466933, 29306621, 25211442, 22125000, 19840649, 18150858, 16922118, 16015128, 15367998, 14907172, 14599776, 14395624, 14313464, 14286732, 14323916, 14440512, 14649864, 14996701, 15483063, 16137339, 16956643, 17997744, 19299927, 20859908, 22701543, 24869543, 27390105, 30274617, 33448145, 36916799, 40945475, 46097595, 53192040, 63188714, 76947137, 94790792, 115568608, 136243279, 152642238, 161173042, 160468423, 151901428, 137969753]
9237A37969753j7133721j8048054j6496619j3353340j0014028p221365n199659
9230E0502967l923225l199158k895976k732220k442218k018199j568046j206540
9222C0517385q92930n84068k88841K0682L22776O77768J035753J391564J829147
9213C4029236K301469K771754L195209L473709L602397L694085M151718N599262
9205F2818839Q182218J1714847J5952499J9985370K2597547K3028506K1138742
9198A85418568J7396780J1756135L329459p661616j8812214k6102349k7060100
9191A38264663k3401256j8133063j3260069r591072p180205n826689n157366m690910
9183E1024033m094224l487629k891674k354215j930169j577265j245295r20283
$$ y = [137969753, 120836032, 102787978, 86291359, 72938019, 62923991, 55702626, 50502967, 46579742, 43380584, 40484608, 37752388, 35310170, 33291971, 31723925, 30517385, 29624455, 29040387, 28751546, 28772228, 29095004, 29772772, 30808525, 32200089, 34029236, 36330705, 39102459, 42297668, 45771377, 49373774, 53067859, 57219577, 62818839, 71001057, 82715904, 98668403, 118653773, 141251320, 164279826, 185418568, 202815348, 214571483, 217900942, 210239326, 191427112, 165324763, 138264663, 114863407, 96730344, 83470275, 73879203, 66698998, 60872309, 55714943, 51024033, 46929809, 43442180, 40550506, 38196291, 36266122, 34688857, 33443562, 32523279]
9175C2523279n67190k86888k03K62143N15594P68397J076311J352471J497967
9166C7141881J501269J641610K085336K921659M226935N890413P758152R586075
9158G2753330J1212528J2671252J4018748J4819594J3835149R467785J375167
9151A50153553q255800j5973385j9254174j8106442j4650041j0961701p983788
9144E4968222n894315m549284l766820l249123k768244k244324j822044j450165
9136B9223903j235770j146817r50637q32503o84388n21516m14855k84512j65273
9127B2987632r3233N574P1804J13619J42199K05947L25427M58745O79692R46883
9117B5844289J336020J884221K545393L320492L985063M290391L925447K764984
$$ y = [32523279, 31956089, 31669201, 31668998, 31931141, 32446735, 33215132, 34291443, 35643914, 37141881, 38643150, 40284760, 42370096, 45291755, 49518690, 55409103, 63167255, 72753330, 83965858, 96637110, 110655858, 125475452, 139310601, 148778386, 150153553, 141897753, 125924368, 106670194, 88563752, 73913711, 62952010, 54968222, 49073907, 44524623, 40757803, 37508680, 34740436, 32496112, 30674068, 29223903, 27988133, 26841316, 25890679, 25058176, 24373788, 23852272, 23437417, 23152905, 22987632, 22894399, 22899973, 22971777, 23085396, 23227595, 23433542, 23758969, 24217714, 24897406, 25844289, 27180309, 29064530, 31609923, 34930415, 38915478, 43205869, 47131316, 49896300]
9109D9896300Q95661j286834l180366m397248m691357m164114l279740k424310
9101B7367992j751778j304048r60938p13545n64321m03092l20608k50344j87211
9092B0912107j75251j52287j17793r5534n6995k0249k5N4770J11771J25654J47035
9081B0733203J32347Q7109N8217q052k6087m2370n3483m0295K8680M9920L5755
9070B0954944N5257N0168N1160L5767K3622K3383N5145M2820Q6367O8466N7991
9059B1505090M8863L6197N8785P3151N7491Q0925N0109O2830M7167L8517L5210
9048B2094335J1072M515l300J7192K2897j0795O364J3565k210N1312O3510R004
9036B2277461l1102n4250n4149o0922p4475j15912j36561r6348r3194q8050o9914
$$ y = [49896300, 50791961, 49505127, 46324761, 41927513, 37236156, 33072042, 29792302, 27367992, 25616214, 24312166, 23351228, 22637683, 22073362, 21670270, 21349662, 21099318, 20912107, 20736856, 20584569, 20466776, 20371242, 20314247, 20293998, 20293973, 20348743, 20460514, 20586168, 20733203, 20865550, 20952659, 21010876, 21002824, 20976737, 20934367, 20880884, 20840589, 20869269, 20919189, 20954944, 21010201, 21060369, 21111529, 21147296, 21170918, 21194301, 21249446, 21292266, 21378633, 21447099, 21505090, 21553953, 21590150, 21648935, 21722086, 21779577, 21860502, 21910611, 21973441, 22020608, 22059125, 22094335, 22105407, 22109922, 22106622, 22123814, 22146711, 22135916, 22142280, 22155845, 22153635, 22204947, 22268457, 22277461, 22246359, 22192109, 22137960, 22077038, 22002563, 21886651, 21750090, 21653742, 21560548, 21472498, 21402584]
9025B1402584j05196j42421j32301j14800j06678j08556j26685j16243j28184
9016B0321520j27327j35585j20540j26439j46329j51753j52980j30741j51843
9007A9077983j83659j56355j65744j85466j60800j91983j96957k09599k02561
8998A7424859j66724j52951j57775k00429j75065j93842k04504j59472j81420
8989A5832677j66375j51455j81071j72210j67951j92476j97883j63868j57470
8980A4281918j61605j68183j74114j46939j34907j72353j79624j83747j93603
8971A2766843j75761j42650j19671j09321j45550j19473j27508j55078j47328
8962A1524503j77334j50195j22740j75754j60884j55512j65555j25444j14119
$$ y = [21402584, 21297388, 21154967, 21022666, 20907866, 20801188, 20692632, 20565947, 20449704, 20321520, 20194193, 20058608, 19938068, 19811629, 19665300, 19513547, 19360567, 19229826, 19077983, 18894324, 18737969, 18572225, 18386759, 18225959, 18033976, 17837019, 17627420, 17424859, 17258135, 17105184, 16947409, 16746980, 16571915, 16378073, 16173569, 16014097, 15832677, 15666302, 15514847, 15333776, 15161566, 14993615, 14801139, 14603256, 14439388, 14281918, 14120313, 13952130, 13778016, 13631077, 13496170, 13323817, 13144193, 12960446, 12766843, 12591082, 12448432, 12328761, 12219440, 12073890, 11954417, 11826909, 11671831, 11524503, 11347169, 11196974, 11074234, 10898480, 10737596, 10582084, 10416529, 10291085, 10176966]
8953A0176966j16430j27236j30171j02749r8617j31160j34188j29566j31925j08252
8943H966672r3157j39751j17586j08855r4790q9774r9346j30344j26030j18002
8933G849037q4105p7423r6825q6092r1661r2568o1654o3230j03318p3892r8772
8922F919497r8538q2857j07383j08222q1049j14649p8223p2612j08647r1712q2105
8911E893500j3119p092j7094p2296n0993m7596q0308r0717p9929p3551q0211o3376
8899E217218m9419l1116n0263q9868q7239m9931l8298m0243k0757o3916l8540
8888D657628l9384l9997k0563m8507m7571k8070l5949o7880q3310o6555q0176
8877D099666n7358k9214n6895o0211l7410o1273n4968m4697k4129q803m3972m3016
$$ y = [10176966, 10060536, 9933300, 9803129, 9700380, 9601763, 9470603, 9336415, 9206849, 9074924, 8966672, 8873515, 8733764, 8616178, 8507323, 8412533, 8322759, 8223413, 8093069, 7967039, 7849037, 7764932, 7687509, 7590684, 7504592, 7412931, 7320363, 7258709, 7195479, 7092161, 7018269, 6919497, 6820959, 6738102, 6630719, 6522497, 6441448, 6326799, 6248576, 6175964, 6067317, 5975605, 5893500, 5880381, 5873289, 5856195, 5783899, 5732906, 5685310, 5605002, 5514285, 5434356, 5360805, 5280594, 5217218, 5167799, 5136683, 5086420, 4996552, 4909313, 4859382, 4821084, 4780841, 4760084, 4696168, 4657628, 4618244, 4578247, 4557684, 4509177, 4461606, 4433536, 4397587, 4329707, 4246397, 4179842, 4099666, 4042308, 4013094, 3956199, 3895988, 3858578, 3797305, 3742337, 3697640, 3673511, 3664708, 3620736, 3577720]
8865C577720k1545j892l7710n8975m1397l6622m9934k0286l2234k1163j2454l4209
8853C209299N324l394j2333q399J6067n937j0307J2756K012K5729O1792N2578
8841C345187P5665J9407l7652r4387j05498j19784p4390q2358q2256l5421o5994
8830B742519j05189o0009k2466m5146l2363k5768l2960k4449L844l9075o0142
8819B298796p678j3800l6002j2451J2466j4570m641J2587j1007j8085P724K6115
8807B239454j8560j3756j3239J3276P6541R2117Q1065J06663Q8781P0752N3149
8796B776243L2220J560p2873j14359j68803j57825j08398o2428p0511q7631p4841
8785A892354n7439k9099m0016P469L487O334j8214k4808l3538m8480o7099l6373
$$ y = [3577720, 3556175, 3554283, 3516573, 3457598, 3416201, 3379579, 3329645, 3309359, 3277125, 3255962, 3243508, 3209299, 3214623, 3211229, 3198896, 3190497, 3206564, 3200627, 3190320, 3203076, 3205088, 3230817, 3292609, 3345187, 3420852, 3440259, 3402607, 3308220, 3202722, 3082938, 3008548, 2926190, 2843934, 2808513, 2742519, 2637330, 2577321, 2554855, 2509709, 2477346, 2451578, 2418618, 2394169, 2398013, 2358938, 2298796, 2291118, 2277318, 2241316, 2228865, 2241331, 2226761, 2222120, 2234707, 2223700, 2205615, 2213339, 2239454, 2220894, 2207138, 2193899, 2207175, 2283716, 2375833, 2456898, 2563561, 2652342, 2723094, 2776243, 2808463, 2810023, 2737150, 2622791, 2453988, 2296163, 2187765, 2125337, 2054826, 1967195, 1892354, 1834915, 1805816, 1765800, 1773269, 1776756, 1783090, 1764876, 1740068, 1706530, 1658050, 1590951, 1554578]
8773A554578m287j2224j6388l061m43p635Q832j5223k3628o038P061J3355K8157
8760A523056M4148L2884M8665K5286N6556P4772M4912L8487K9463j3566m0285
8749A864378r2334j26057j08889m8813m3221p6193m7500k4535l0854k0848k5667
8738A219467m9293k4985P994k7530J7118p31O809m6083n0877j1555j2227m128
8726A023979J0255J8296O667K662r399j3898m0456n3944J2962J2542j0475J366
8714I60557j9593r14J5791J5731J5043J7324J7800J0575j4935m2229o0664k5123
8702H89363j5422k6125k4926N848j0688j4334N993J4459J6455j1721l6232k110
8690G90560K0727o644o5388l1280r880r457L281J6105K7207l361j5661j1044J809
$$ y = [1554578, 1550291, 1538067, 1521679, 1518618, 1518175, 1510540, 1519372, 1504149, 1480521, 1474483, 1481544, 1494899, 1523056, 1567204, 1600088, 1648753, 1674039, 1730595, 1805367, 1850279, 1888766, 1918229, 1904663, 1864378, 1772044, 1645987, 1537098, 1488285, 1445064, 1368871, 1321371, 1296836, 1265982, 1245134, 1219467, 1170174, 1145189, 1153183, 1125653, 1142771, 1142040, 1148849, 1102766, 1051889, 1040334, 1028107, 1023979, 1034234, 1052530, 1059197, 1061859, 1052460, 1038562, 998106, 944162, 957124, 969666, 959191, 960557, 940964, 940050, 955841, 971572, 986615, 1003939, 1021739, 1032314, 1017379, 975150, 914486, 889363, 873941, 847816, 822890, 828738, 818050, 803716, 809709, 824168, 840623, 828902, 792670, 790560, 811287, 804643, 739255, 707975, 698095, 688638, 691919, 708024, 735231, 731870, 716209, 705165, 706974]
8677G06974j2868o010r611n677r962J2422l5625m2335l428p674k4991r020J5269
8664E67464j0978l417K7246P249p54K0151K8340M486l045k6871k3906J0238l08
8651E95895j2850K3689j3039k0107m669n978j0316q556p984j1303k1767j1283
8639D91732N40j2849k4453P206N942L3708L5869o751j8549j6906k1513j0831K3649
8626D86794R718k0951J2896j4447n9125j401R405j4767j0458Q082k208P803k1765
8613C89576m8587K6776K3095l985R265K3638m823j0248Q457j1016l3812l5427
8601C32909m538J3045K0991O159q574o258j4766m410J0985k840L919k862j3791
8588C29969L998J1206O942Q14k2612j8908J3715o569j300K176J8248J9299J0393
$$ y = [706974, 694106, 688096, 678485, 672808, 662846, 675268, 639643, 597308, 593880, 586206, 561215, 552195, 567464, 556486, 553069, 580315, 587564, 586810, 606961, 635301, 639787, 636742, 609871, 585965, 596203, 595895, 583045, 606734, 593695, 573588, 568919, 562941, 552625, 544069, 536085, 524782, 503015, 491732, 492272, 479423, 454970, 462176, 468118, 501826, 537695, 530944, 512395, 495489, 473976, 463145, 486794, 496512, 475561, 488457, 474010, 414885, 413484, 422889, 408122, 397664, 405746, 403538, 411341, 389576, 340989, 367765, 390860, 386875, 396140, 419778, 414955, 404707, 413164, 402148, 368336, 332909, 328371, 341416, 362407, 368566, 359992, 353734, 338968, 334558, 345543, 342703, 346622, 343760, 329969, 333967, 345173, 352115, 352929, 330317, 311409, 325124, 318555, 317255, 319431, 337679, 356978, 367371]
8575C67371K7173J9480K588j7395l8914k438k1449k2027n932J010K855q376Q573
8562C12519j1795J0779r283k1680K4500J2387j8629p707J6357n283J9087J8694
8550C39946J884L462j0600l653N080k5567l0570k4258q85j1685Q129R714m770
8537B56227j2327M835n888J2314J0118k3475O294R437J0688R160j3950o604K204
8524B59033K1449M016j2787M857j867N418n336P701j2830j2153q640N427j9607
8511B34681l4050J7294J8897p692L087K6144k06l1029j0025p298k470j8348j2209
8498A76776J129J6098J3424L4064j0002k132j4686j3143J0068k0428O151J0460
8486B07779j0031k257j6939J0269L209k082J5325J8764j3692Q806K6058N542j3221
$$ y = [367371, 394544, 414024, 416612, 399217, 360303, 357865, 336416, 314389, 308457, 309467, 312322, 303946, 312519, 300724, 311503, 302220, 280540, 305040, 317427, 298798, 291091, 307448, 302165, 321252, 339946, 341830, 345292, 334692, 331039, 336119, 310552, 279982, 255724, 254839, 243154, 251283, 260997, 256227, 243900, 248735, 242847, 255161, 265279, 241804, 248098, 257535, 268223, 277383, 263433, 256829, 259033, 280482, 284498, 271711, 276568, 274701, 280119, 274783, 282484, 269654, 257501, 248861, 254288, 234681, 200631, 217925, 236822, 229130, 232217, 258361, 258155, 227126, 217101, 209803, 207333, 188985, 176776, 177905, 194003, 207427, 241491, 231489, 229357, 214671, 201528, 211596, 191168, 197319, 207779, 197748, 195491, 178552, 188821, 192030, 189948, 205273, 224037, 210345, 219151, 245209, 250751, 237530]
8473B37530l288k9797k4462j469J1802k3858k1098p979K2032P86K2369k412L62
8460A80518N327j0390k5873l7263k3407L1718M7129J51k5321Q146L193O865N88
8447A61381K4753K733n864j7164K66j5523j904k4483L9K8172K4452k6936k3330
8434A26592J4453M573L082J8191O655l9954l1473O720q780k0552K2462K7677j0266
8421A19380P662J6254R526k1681k869j8133L1520J9625n150l6740p831j1415P455
8408A07603J463K384J7557K2536O700K183m091j1672k1118J3034R842J440j1505
8395A36356k7382j3156K4546J8449J8275J8666r626k1566j7324K774k0434J5305
8383A24883L322N549k5562j1102j0569J2876R361K3542J2042j9946k642r617M710
$$ y = [237530, 234242, 204445, 179983, 178514, 190316, 166458, 145360, 137381, 159413, 160199, 182568, 180156, 180518, 185845, 175455, 149582, 112319, 88912, 120630, 167759, 167910, 142589, 150735, 153928, 160793, 161381, 186134, 188867, 183003, 165839, 166105, 150582, 148678, 124195, 124234, 152406, 176858, 149922, 126592, 141045, 145618, 148700, 166891, 173546, 133592, 102119, 108839, 100059, 79507, 101969, 129646, 119380, 127042, 143296, 152822, 131141, 128272, 110139, 141659, 161284, 156134, 119394, 111563, 100148, 107603, 109066, 111450, 129007, 151543, 158243, 160426, 156335, 144663, 123545, 136579, 146421, 147861, 136356, 108974, 95818, 120364, 138813, 157088, 175754, 166128, 144562, 127238, 130012, 109578, 124883, 128205, 133754, 108192, 97090, 86521, 99397, 108758, 132300, 144342, 124396, 121754, 112137, 116847]
8370A16847n77J341J4575R0j0538j968k078k7798M096J5718K373p587o457J9181
8356A17218J2645j0890l9461l414J0508r629J4048P609j8064m782L9920Q989j2539
8343A12158k3922K057J3752R007r152j1955m0121j9917J7226K2368j1617l721
8331E6163N2141P429J4301q867j2938Q375L6521J6767k4059l9442j4931p176M885
8318H9169P660k42l6426k3050L5372J4947n218J2328K609j5752L8678K411j8746
8305A03740j1205j9370k2788K346K8418K3716j3011J1133p3l3219j3468K4613
8293H0832L8506j5832m3577j7583J7572j882j2449J7129p060j8015o400J6308
8281D7549J8291J1034o287J2051N209k4731q941J1466J1940Q618j0938n981j2258
$$ y = [116847, 116270, 117611, 132186, 132276, 121738, 119770, 117692, 89894, 93990, 109708, 112081, 104494, 98037, 117218, 129863, 118973, 79512, 76098, 86606, 76977, 91025, 98634, 80570, 75788, 115708, 124697, 112158, 88236, 90293, 104045, 113052, 103900, 91945, 51824, 31907, 49133, 71501, 59884, 56163, 108304, 115733, 130034, 121167, 108229, 116604, 153125, 169892, 145833, 106391, 91460, 84284, 89169, 96829, 96587, 60161, 37111, 72483, 87430, 82212, 94540, 97149, 81397, 120075, 122486, 103740, 92535, 73165, 50377, 52723, 81141, 104857, 91846, 102979, 102906, 69687, 56219, 80832, 119338, 103506, 59929, 42346, 59918, 58036, 45587, 62716, 55656, 37641, 31241, 47549, 65840, 76874, 70587, 82638, 87847, 63116, 54175, 65641, 77581, 86199, 75261, 69280, 57022]
8268E7022J3834k2564k4859o775q292Q80K4961J9610K5546k0957l3676K9472J8982
8255G3184K112k410J5027N8890j6562l6681j9344K881k9468j3940J9940j2354
8243D1275J0713l029j3443R70k8090j877L978l843j3957R460n05j548L292Q106
8229A1502l5787j5815J8367n086l276N741J7351L6510K9627j7695k855J657J3781
8216E4022J0120R850k4416j0273l2607l201k1469j2868L2553L0566L6066K5761
8204I4104p255l514p125p311r926j2415P410j025p762k4853J5503M6312j3104
8191F9039L891J9543q659l2964J403k1532j9742J267p816R304N793m963k3155
8178h591j6630r379K7985J8242J2785M516L779j4227L243J9965P69j8712p624
$$ y = [57022, 70856, 48292, 23433, 16658, 8366, 9246, 34207, 53817, 79363, 58406, 24730, 54202, 73184, 75296, 72886, 87913, 146803, 130241, 93560, 74216, 77097, 47629, 33689, 53629, 41275, 51988, 48959, 35516, 36486, 8396, 6519, 10497, 6654, -7303, 2157, 1652, 104, 3396, 11502, -24285, -40100, -21733, -26819, -30095, -24354, -7003, 29507, 59134, 41439, 38584, 40241, 54022, 64142, 73992, 49576, 39303, 6696, 3495, -17974, -30842, 1711, 32277, 68343, 94104, 86849, 83335, 76210, 68899, 58973, 46558, 53968, 52943, 45181, 20328, 35831, 82143, 69039, 72930, 92473, 83814, 50850, 52253, 30721, 10979, 12246, 4430, 13734, 19527, 14564, -8591, -25221, -34600, -6615, 11627, 24412, 28928, 32707, 18480, 21723, 41688, 42457, 23745, 16121]
8165A6121l967n479J5979K3897k5124j9143M515k2678k7648j4021L6221K2283
8153I56j7629J3349L4998J062j2859J0516J1899j7167N929j4723Q854j479R957
8140C3663P161j1301j659O929J5350J4748p205k0358k3328j88j245j3760j5036
8127a6229J25M2304K1519O428R770o82j5333K498Q37k4752m246q73j9470k6734
8113b4838J2475q903n253J409J7018J9028r092K3853J834J6175K0320j021K805
8100F5810n178Q400p781k6017K1896O530j1469j7431O638K1724j6363m7536j7288
8087a8065P387N555K9414J4758r198k5912J2664J8414n827o101l660J728m951
8074A6206r882m1057k4218J5960Q196J539J3581q622K600J6926M161l02j4188
$$ y = [16121, 12154, 6675, 22654, 46551, 21427, 2284, 6799, -15879, -43527, -57548, -21327, 956, -16673, -3324, 31674, 32736, 19877, 30393, 42292, 25125, 31054, 16331, 25185, 23706, 33663, 40824, 29523, 27864, 34793, 50143, 64891, 57686, 37328, 14000, 13812, 12567, -1193, -16229, -16104, 26200, 47719, 54147, 63917, 63235, 47902, 50400, 51237, 26485, 22239, 21366, 1896, -24838, -12363, -21266, -26519, -25110, -8092, 10936, 1844, 25697, 27531, 43706, 64026, 63005, 65810, 60632, 69032, 61251, 35234, 57130, 63660, 52191, 34760, 41398, 63122, 46759, -777, -18065, -10678, -5123, 24291, 39049, 29851, 3939, 16603, 35017, 29190, 23089, 19429, 21157, 16206, 6324, -34733, -58951, -42991, -34795, -33256, -19675, -28297, -25697, -8771, -4610, -4912, -19100]
8061a9100K4026O773k5862o582k911R273J1861Q063J3104l1929l3553j0682Q835
8048d8684l904Q546J6864j800P865K6106N154j7653j4393L519O505K0121M533
8035A2779M906l0467l8958O769J9543K0483K1507Q3j991n391j0544P762J6197
8022B2678j2167k0824j366j5672J9209K9106m828n591J1756J6114j9206j6070
8010C139O979J6157j6372l068J9110M487J1371m483O362j7100j0242J9042J9245
7997E4627j3333r865P613j3104K854k1391l4947r251L0392M0760K6167k0392j7094
7984B3036P553K4340l456k5729k2408j0039K420J0814Q478k2705j276J0209J5397
7971A6634j849j2409j6662K0104J9266M604p425m1197K5499j565j4762o977n38
$$ y = [-19100, 4926, 11699, -14163, -20745, -23656, -14383, -2522, 5541, 18645, -13284, -46837, -57519, -48684, -52588, -44042, -27178, -28978, -21113, 4993, 10147, -7506, -21899, -18380, -11875, 8246, 12779, 17685, -12782, -51740, -44971, -25428, -4945, 16562, 16645, 14654, 9263, -1281, 6481, 22678, 10511, -10313, -11679, -27351, -8142, 20964, 16136, 10545, 22301, 38415, 19209, 3139, 10118, 26275, 9903, 6835, 25945, 30432, 41803, 37320, 43682, 26582, 16340, 35382, 54627, 41294, 31429, 39042, 25938, 28792, 7401, -27546, -36797, -6405, 34355, 60522, 40130, 23036, 30589, 54929, 51473, 25744, 3336, -6703, -4283, 6531, 15009, -7696, -8972, 1237, 16634, 14785, 2376, -14286, 5818, 25084, 29688, 22263, -18934, 6565, 5000, -9762, -16739, -17277]
7958a7277R380j8385N92K1480L6512L5810j6355k7918k6795j1238L5903M354j8258
7945G805j3846q081J2840R80k7481P896M0026j490k5224J7517j6509M188J4513
7932A3134K271J6212l044j2313j1459j1113L643n552l4222j522K8002J1550K766
7919a647m820R205J4492o998p491J1784j3366J8439k0892k6448J5359O0414P570
7906E5601k3352o0032q627j5924N410q679J370Q166N926j0036L0954M5181j5434
7893A0524n269Q73N918m824j2324n732M757k8582o6j0591K5340J3212R251J5598
7879A8085j9386R440J1181L0042J9230L268k2656j4576k4207j8873L57J4443N147
7866A1495j5466K4355J3729j6540J3247k8149j9215l2817M195L7998J6387o579
$$ y = [-17277, -7897, -26282, -25690, -4210, 32302, 68112, 51757, 23839, -2956, -14194, 21709, 26063, 7805, -6041, -14122, -1282, -302, -27783, -19887, 20139, 18649, -6575, 10942, -5567, -1379, 13134, 15405, 31617, 28573, 16260, 4801, -6312, -2669, -8221, -42443, -43965, -15963, -4413, -1647, -6467, 2738, 17230, 10232, 2741, 14525, 1159, 19598, -1294, -27742, -12383, 48031, 55601, 32249, -27783, -36410, -52334, -46924, -55603, -54233, -46067, -40141, -50177, -19223, 25958, 10524, 5255, 6128, 12046, 7222, -5102, -10834, -6077, -34659, -34725, -45316, -19976, -6764, 2487, 18085, -1301, 8139, 19320, 49362, 68592, 71860, 49204, 34628, 10421, -8452, -8095, 6348, 11495, -3971, 20384, 34113, 17573, 30820, 2671, -16544, -49361, -45166, -7168, 9219, 2640]
7854B640k7486j9277p37J8387K7364O730n194K6911K8353Q203k6833j0117j0831
7841A8113k7695k4855l888L3302K3906o838j2873J5988J5215K4144K857l7741
7829A9635Q85L496k0809K943K8573J3322q131k9676j109r53K5298J9751j8299
7816C4926L190J9479m7363k8017l527J049J6334j6919O492J0727Q586k321j3715
7803a1079J0904L0006Q513q981n902j6911m074j2059m124n027J024J4391J4921
7790A1602q985m9496l4762L030N044J4752L6655K3039o303k3130J4952J9369J6372
7777B2139N750j7951M953K4759j0979l9324k92K1537n93r491m134p878J2560R927
7763A0983P600m723k9310J9782O815j6720k2549J183j2145m024j613n374j48N97
$$ y = [2640, -24846, -44123, -44860, -26473, 891, 7621, 2427, 29338, 57691, 65894, 39061, 28944, 18113, -9582, -34437, -38325, -5023, 18883, 12045, -828, 15160, 30375, 54519, 57376, 19635, 20520, 24016, 3207, 6150, 34723, 48045, 39914, 10238, 9129, 8176, 33474, 53225, 34926, 38116, 57595, 10232, -17785, -21312, -20263, -3929, -20848, -14356, -3629, 4957, 2636, -11079, -175, 29831, 38344, 29363, 23461, 6550, 2476, -9583, -13707, -18734, -17710, -3319, 11602, 2617, -46879, -81641, -78611, -73567, -58815, -22160, 879, -5424, -28554, -13602, 5767, 22139, 27889, 9938, 14891, 39650, 28671, -10653, -10945, 10592, 9999, 508, -3626, -11504, 1056, 10983, 18583, 13860, -15450, 4332, 11147, -5573, -28122, -26939, -39084, -43108, -44721, -50095, -50243, -49646]
7749d9646J3431l803j4847k7772L3040K1407O155J1886j5815m368N57L692j4791
7736d0874J2578P119J2619J6747p777k6084k9905j3998L0843L838k33p075l408
7723d5610o627R042M0269j273l4564j2280J892Q074M689Q450R641M7061J4021
7710D2785l3773k3909k638m158K8392K0116m0932j3045J0754k1785j8509L556
7698e3146O01P190k3269R467K1957j1984j5431J75j6130Q677P599k233L6500R884
7684b0143k5490J2081J9073J852P890j7289k3362J787l5052M050L7250M2919J4664
7671B0230q822p948k5202n443M995O194j1905k1002P616J7459J589K3622j96m666
7657c479j8971J4452N37J3688R146k3226k3537o148Q437K753J8133m109j1602
$$ y = [-49646, -36215, -40018, -54865, -82637, -49597, -28190, -22035, -10149, -25964, -30332, -29775, -26083, -40874, -28296, -21177, -8558, 8189, 412, -25672, -55577, -69575, -38732, -34894, -35127, -42202, -45610, -52237, -43195, -2926, -4199, -38763, -51043, -49151, -41077, -36388, -27938, -18297, 28764, 42785, 9012, -14897, -17535, -21693, 6699, 26815, -14117, -27162, -16408, -38193, -56702, -53146, -52545, -45355, -68624, -59157, -37200, -49184, -64615, -64440, -80570, -71893, -64294, -66527, -30027, -20143, -45633, -33552, -14479, -12627, -4737, -22026, -45388, -43601, -78653, -74603, -37353, 5566, 20230, 11408, 3460, -21742, -27185, -22190, -15996, -27901, -48903, -41287, -23828, -22239, 1383, 1187, -3479, -22450, -7998, -7461, 6227, 15373, -7853, -31390, -37538, -29101, -26348, -8215, -12324, -23926]
7644b3926L407j7562k3235k2969Q558K0495j6674J6623L1189j531K432M599J4623
7631c971Q436j6862N053J0504j614J1221r207O43P192j3228o332n489L508k521
7617a2667N656k0521J3105M6954J2395k1477k1499j9236K0615L364j1927j9321
7605b4559n979L931J5428m608J7733q837J4384Q620j1840l862J0194k7023j3592
7592c0010N468j2690k826L6484j0327K728J6754k658j9418q501J497L444n626
7579b5681l2211K433J5156Q449j4728K2424Q37P528j6400n241j600k403J8768
7566b2669j5165l8593o179O766j6569j5298K8103L2900M5894j0663l9792r989
7554f1254j5643j1238J9703R481J7339p326q990k0127M417L3072j7852J2622Q521
$$ y = [-23926, -20519, -38081, -61316, -84285, -75727, -55232, -71906, -55283, -24094, -25625, -23193, -18594, -3971, 4465, -12397, -7344, 3160, 1546, 12767, 3560, 4203, 11395, -1833, -8165, -13654, -10146, -12667, -7011, -27532, -14427, 32527, 44922, 23445, 1946, -17290, 3325, 6689, -5238, -24559, -30538, -26607, -11179, -15787, 1946, -6891, 7493, 16113, 4273, 411, 10605, -16418, -30010, -24542, -37232, -40058, -3574, -13901, -11173, 5581, 2923, -16495, -24996, -23499, -20055, -25681, -57892, -55459, -40303, -31854, -46582, -24158, -23321, -15793, -32193, -37434, -39034, -41437, -22669, -37834, -76427, -82606, -75840, -92409, -107707, -79604, -46704, -810, -11473, -51265, -61254, -76897, -88135, -68432, -58951, -41612, -48938, -57928, -78055, -73638, -40566, -58418, -45796, -37275]
7541c7275J0652k1771k377M293J806J2552n015o4K0476r457o943n193j150J3504
7527b5962Q864k3412L490j5753j5908J4565o908j3713J2885K6231J0792l8501
7515f3330j7999j201N390K9283M129J0534L3648k4237j6554K444l631J2939J6819
7502a1766q150j7868p998n639J0175K7065j5520N360J492j8906M641m983Q246
7489c3851J0811L588k6271k1784J0213L0527j0330k3892L0379L2312j2165j6493
7477b6956j3733J0081N019O652J0724K3530k1747j9506j0396j9701K744M896L6182
7464a2211j3805k2775Q623K337r778J3158M0965J0149o182P223J3432j5897k9424
7451a4185J951m847J7213K0005n363m654J3861j0018k7416J990M143j3357l886
$$ y = [-37275, -26623, -48394, -50771, -46478, -44672, -32120, -37135, -37199, -16723, -26180, -33123, -38316, -39466, -25962, -17098, -40510, -37020, -52773, -68681, -54116, -61024, -74737, -61852, -35621, -24829, -63330, -81329, -82530, -77140, -47857, -43728, -33194, 454, -23783, -40337, -37893, -41524, -28585, -11766, -19916, -37784, -45782, -51421, -41246, -14181, -29701, -24341, -22849, -41755, -37114, -42097, -33851, -23040, -19452, -45723, -67507, -57294, -26767, -37097, -60989, -30610, 1702, -10463, -26956, -40689, -30608, -25589, -18937, -8213, 15317, -6430, -25936, -36332, -56033, -53289, -48393, -12211, -26016, -48791, -40168, -37831, -47609, -34451, 6514, 16663, 10481, 17704, 31136, 15239, -14185, -12234, -17081, 132, 20137, 14774, 10120, 23981, 13963, -13453, -11463, -7320, -20677, -24563]
7438b4563J3324K1055p144j202m687j4144J6236K0660j6713o0028n039L9654J7455
7425e136k2413n09o533o449O531K3187J0163j1618K2273L564l5722p190J6928
7412a2924J85j9676n990J8191J4076O36j2151K710L1424J0714n019n729M395J7859
7398C8701j3471l7970J4023R154J2564j1021J316r454j3810l394k1897L0161j9376
7385b4474l7481J6246l796k3134N010L05K9250O469J116L0814K1723m62k7344
7372e758l380M4013j7289l865K8668n869l3613j3837L033j2545j2164K0822P618
7359d166m118j3472l3855K3979M1137J4855r098j2627j196p84n604Q456Q539j2359
7345c13K683L992j1664k2071l0479q737J1704K3702m452j232J8058l111N854J269
$$ y = [-24563, -11239, 9816, 2672, 1470, -3217, -17361, -1125, 19535, 2822, -57206, -62245, -22591, -5136, -27549, -28058, -34591, -41040, -34509, -11322, -1159, -12777, 9496, 13060, -22662, -29852, -12924, -12739, -32415, -38405, -20214, -6138, -5502, -17653, -14943, 16481, 27195, 22176, 16447, 20842, 38701, 25230, -12740, 1283, 10437, 23001, 11980, 13296, 3842, -9968, -13362, -35259, -5098, -24474, -61955, -45709, -49505, -72639, -67629, -67324, -38074, -31605, -30489, 325, 22048, 21586, -5758, -9138, 34875, 17586, 13721, 42389, 36520, 2907, -10930, -7897, -20442, -32606, -11784, -4166, -8284, -21756, -55611, -31632, 9505, 24360, 15262, 2635, 1439, 655, -4949, 3507, 12046, -313, 2370, 6362, -5302, -27373, -57852, -66589, -54885, -31183, -35635, -36867, -18809, -21920, -16066, -14797]
7331a4797m59J3587p740L21J1471k576J1147J7477P242m93k0499j0219j0581J546
7317d573N854j6136q39K5949R177k5477j2823o06K7130O987L09l7193l4313J041
7303e5513O163L0517L216J1903J0532j9042o2154O785J9803L0202J6596K673j5158
7290a3477K6925R329k81k616o446N795j4073m3264q844K0559P267O30o550j8378
7276d3424j2203j4772N806j8674p806K2428J4290k4392K1264M5451J9447r614
7264b199p913j9459k9757k6497N979J9705J4988J3262R76M826k1308Q376q685
7251d7706k3320K877J1408k8554M6730L6027j3705k9939j742R477N774J0132q432
7238c0973K845J2789j0008j7210J0554L151K0191Q469P498k60l2906k6538N604
$$ y = [-14797, -15256, -1669, -9409, -9088, 2383, -193, 10954, 28431, 35673, 35180, 14681, 4462, -6119, -4573, 1281, -14855, -15694, 10255, 19432, -6045, -18868, -19474, 7656, 14643, 14952, -22241, -56554, -55513, -49350, -18833, -15617, -3714, 6818, -12224, -74378, -67593, -47790, -17588, -992, 1681, -13477, 13448, 22777, 22496, 19880, 13434, 19229, 5156, -38108, -46952, -26393, -19126, -18496, -25046, -43424, -55627, -70399, -64593, -83267, -91073, -68645, -54355, -78747, -57483, -12032, 7415, -2199, -10112, -29571, -59328, -85825, -79846, -60141, -45153, -31891, -30915, -26089, -47397, -39021, -47706, -71026, -68149, -56741, -85295, -38565, -2538, -16243, -46182, -47924, -38447, -32673, -22541, -30973, -28128, -15339, -25347, -42557, -32003, -28852, -8661, -192, 7306, 7046, -25860, -52398, -46794]
7225d6794J2739J1532R212o097j699j2446R499L0467J1109J6637k82r988j3663
7212A0226J7233N193j6638j8406N711j4807O190j154l0628M52o931J3218K0830
7199i511r027j3302J4892J7216j3013j0876J0806J8086j047m0042P985L5282P551
7186A5000l38P35k4546n52K65R916J220j5913j9006L403j0296j5029r076J5609
7172d8608L0296P002j1508j9286q953L0079J9535O5j3368J1031n25m41j30N587
7158G76Q981j8345j5773j774J986L149J7920k0348k3834j0729R031L6008o48O916
7144f684m76o78l0710k5483L7208L3593r218j1982j2414J6310P244j1501l1995
7131d6786j2495R829l1692P091L6449o962j2264K2737j4746N430M4514j2683j4363
$$ y = [-46794, -34055, -22523, -13311, -19408, -21107, -33553, -24054, 6413, 17522, 34159, 33877, 23889, 10226, 27459, 32652, 16014, -2392, 3319, -11488, -5298, -6452, -37080, -36628, -43559, -30341, -9511, -18538, -31840, -16948, 268, -12745, -23621, -12815, 5271, 4224, -35818, -27833, 7449, 15000, 14662, 15397, -9149, -9701, -9436, 480, 1700, -14213, -33219, -29816, -40112, -55141, -64217, -48608, -18312, -11310, -22818, -42104, -51057, -20978, -1443, -1378, -14746, -3715, -4240, -4681, -4811, 776, 9757, -8588, -24361, -26135, -24149, -21000, -3080, -23428, -47262, -57991, -48960, -12952, -13600, -6684, -7160, -7838, -38548, -64031, -26823, 6770, -2448, -14430, -26844, -10534, -3290, -14791, -46786, -59281, -49452, -81144, -74053, -37604, -44566, -56830, -34093, -48839, -43409, 1105, -11578, -25941]
7118b5941j3001k8900J2828L2421K1917J0042L144N165j2211p434l0039P096L2393
7105G480R706j4488l9637k4297j8832J9683J6216j65O510J1935L5228M150k0040
7092f551j0625J2594m242k9299q645k86L333k385J1072L8777J5775o546p319J0379
7078A6032q570j990J4449o050j1966l5930n4013O148K0587K2441K5579J786M179
7065g318J7641j1861J3601j6325j6037J5021J2644n134j2997o089j6549l208K258
7052c4353O609J7100M769p830k1043l1073R049K8773J8165P323k1404J4817J203
7039g895J3101J9866R44j0069J1413j9629K4210J3401k2771k9039k187n835N222
7026i268J243k7416j4433l125J4509O974n12J746Q057J7623l550p174l1870k1640
$$ y = [-25941, -38942, -67842, -55014, -22593, -676, 9366, 12510, 17675, 5464, -1970, -32009, -24913, 7480, 17186, 2698, -36939, -61236, -80068, -60385, -44169, -44334, -37824, -25889, 9339, 13489, -6551, -17176, -4582, -8824, -38123, -46768, -47054, -43721, -46106, -35034, 3743, 19518, 12972, 5653, 16032, 7462, 5472, 19921, 13871, 1905, -34025, -88038, -81890, -61303, -38862, -13283, -11497, -7318, 10323, -1538, 12063, -4262, -20299, -5278, 7366, 2232, -10765, -16854, -33403, -36611, -34353, -27744, -10644, -5875, -13705, -34748, -65821, -56772, -27999, -9834, -2511, -23915, -9098, -7895, 5206, 25072, 26016, 15947, 27360, 7731, 31941, 45342, 22571, -6468, -8655, -14490, -9268, -8025, -35441, -49874, -52999, -38490, -31516, -32028, -30282, -22225, -4602, -8152, -15326, -47196, -68836]
7012f8836J8212J5448k0378J0414K3945q861O086J6731o566r351j256l927J4809
6999a3530K1160p183J3337J4614k0106j321j2444j0617J0833q083j0934P656R974
6986f644J708j0181K0450j5374O29L2797m967j7434J1079K4868n2125k6362R835
6973c1721P435m059L1065R574M97p76Q422J5064j5891n0070q218J1644L0629J6488
6959B0083j3791Q344j1062p504R802J0161L710o448k0269j1986j3512n304N968
6946c1808K9930P396k1229j0534R98M318n568k4109J9554O097J6390J7086K447
6933A0968k3805n261M300N39L4980K9724l0659k2576N793M373j9164j3896q670
6920c3354p739j9603j3075K0877R188J2849K7270L8721o91k2740j4931k596k2755
$$ y = [-68836, -50624, -35176, -55554, -45140, -21195, -30056, -23970, -7239, -13805, -23156, -24412, -28339, -13530, 7630, 447, 13784, 28398, 8292, 6971, -5473, -16090, -5257, -13340, -24274, -16618, -6644, -4936, -15117, 5333, -10041, -9412, 23385, 18418, 984, 12063, 36931, -15194, -41556, -31721, -24286, -28345, 2720, 12294, 12791, 12015, 20437, 35501, 19610, -30460, -38678, -27034, 3595, 20083, 6292, 14636, 3574, -3930, 5872, 16033, 19743, 13295, -6974, -18960, -32472, -37776, -31808, -1878, 5518, -15711, -26245, -25247, -20929, -26497, -50606, -31052, -24955, -8565, 8521, 10968, -12837, -18098, -13798, -13259, 21721, 51445, 20786, -1790, 4003, 8376, -10788, -24684, -33354, -41093, -60696, -73771, -52894, -43706, -30857, -3587, 35134, 34443, 11703, -3228, -5824, -28579]
6907b8579k4207K8181K6119N284j3750k0788k2285p093Q64J1644Q802k229O568
6894c1469K111j302k3203J4922J9699k1930m5698l0340K846R467K6999O911J4027
6881e6960N577J1128J0393J6874R27R047p637k1073m448o871q949o419M041J2681
6867d1689K710O458r395K4K193J3555O086o289q865m131J9412K2886J7785k4432
6853c692j3833m894M896J4809l449j3016j0645J5809l728j2373j8657j4133J7707
6840d5199K0041J2642k1291k3755M503K5804K4633j0910j2406J4959J7575j1250
6828d654j1495q0k984J1794L1778K8938J3753l2874j8197j6860l7174k7759J2456
6815e3358K6649K300n735j2984J8544P869O419L4280L7822J4788m3185l2189k0859
$$ y = [-28579, -52786, -24605, 1514, 6798, -6952, -27740, -50025, -57118, -56254, -44610, -35808, -38037, -31469, -29358, -30660, -53863, -38941, -19242, -41172, -86870, -117210, -114364, -104897, -77898, -70987, -56960, -51383, -40255, -29862, -12988, -12061, -3014, -10651, -31724, -36172, -43043, -51992, -58411, -54370, -41689, -38979, -32521, -41916, -41892, -39699, -26144, -20058, -26347, -35212, -39343, -19931, 2955, 20740, -3692, -17525, -22419, -17523, -2714, -6163, -19179, -29824, -14015, -17743, -30116, -48773, -62906, -45199, -25158, -12516, -33807, -57562, -53059, -27255, -2622, -13532, -25938, -10979, 6596, -4654, -16149, -16229, -19213, -7419, 24359, 53297, 67050, 34176, 15979, -881, -38055, -65814, -53358, -26709, -24409, -30144, -43128, -24584, -16715, -10296, 23984, 61806, 76594, 33409, 1220, -19639]
6802a9639J1606K0642j5683M613L4654M535k3933j6306K1912Q687k939k224j3807
6789A2118k1939p675j7368l9694j4507K9978O0365j7089j5258J6438J1299J6297
6777A2965J297k2674j5025J076N341J0533J7853k2382n0206j3643m72J4829J8912
6764d1596r241j1256k0150J0651J9267J8223J6487K8739r328L217l1690k5912
6752e2589J3944j513L175K6198P722j1206R557J3745l0972j3841K0413K8643k302
6739A0974j2600J48L0124J1826Q924k6876j5035O044r422l4878Q984L9956P01
6726A8870l7651k6999J5896K5171K1174j0542l088j6819k7714j8020K0200K6048
6714a3474m357k4673J3804j9497J5719R546K973K558K1468L1477k1516o959m41
$$ y = [-19639, -8033, 12609, -3074, 1539, 36193, 40728, 16795, 489, 22401, 31088, 28149, 25925, 12118, -9821, -17496, -34864, -74558, -89065, -59087, 1278, -15811, -31069, -14631, -3332, 12965, 14262, -8412, -23437, -22361, -17020, -6487, 11366, -11016, -61222, -74865, -75337, -60508, -41596, -50837, -62093, -82243, -71592, -52325, -34102, -17615, 11124, 1796, 5013, -26677, -52589, -38645, -40158, -36983, -10785, -3063, -14269, -4712, 9033, -21939, -35780, -15367, 13276, 10974, -1626, -1478, 28646, 40472, 49396, 22520, 7485, 13529, 4107, -30771, -21787, 18169, 18870, -18781, -45780, -29884, -4713, 16461, 5919, 2831, -13988, -41702, -59722, -39522, -13474, -17831, -42504, -28700, -48197, -32478, -22932, -19959, -17401, 4067, 35544, 14028, 7069, 6628]
6701F628k5431N250N077j1587L920P988k0326K9123K1119M285j2163J4782K167
6688C0832q485j1180n389J2781J1000p068j8706j1764j1694o295q47m064N251
6675b5628J6226O797J3553o17j1188k4090j6793L827J0108J7995j086p541k258
6662b0695L196k78J2875j4250j6861L5476N985p397j2524k942j3979Q253l830
6649b6971M768J2085j5240l1985k2295J1859K6474j2230L939K6520K7311j0677
6637f442L327p459M498l157j1874q790p777n132J6714l519l016k8792j5287J5117
6623f1589Q735K0924q945m036J5031q360n945K2839Q764m222j934Q644k942j0579
6609b3615m0195J4607K0832R17J7030R622N003J7324K562p44q036K257M702j6132
$$ y = [6628, -18803, -13553, -8476, -20063, -16143, -8155, -28481, 642, 21761, 26046, 13883, 28665, 30832, 22347, 11167, 5778, 18559, 29559, 22491, 3785, -7979, -19673, -25968, -26815, -30879, -25628, -9402, -2605, 10948, 10331, -857, -24947, -41740, -37913, -27805, -9810, -10896, -18437, -20695, -17499, -17777, -4902, -19152, -36013, -537, 5448, -1949, -14473, -17415, -31394, -23141, -26971, -22203, -10118, -25358, -57343, -79638, -67779, -41305, -53535, -49596, -23076, 4235, -6442, -3115, -10574, -6076, -9233, -21107, -29897, -37674, -42806, -26092, -29611, -32627, -61419, -76706, -61589, -52854, -31930, -40875, -44911, -29880, -38240, -44185, -21346, -12582, -16804, -18738, -10094, -13036, -23615, -63810, -49203, -28371, -27454, -10424, -802, 4201, 21525, 24087, 23343, 15307, 17564, 22266, 6134]
6595F134n617M408l8656j0312K3094m265K1043j8625r124r130j9036K1646J7067
6582b1373J4020m773m803l7114j3657Q568M1326R015o149M750l336j2783R916
6569a6393K9418j605q507l866L4623J3503j494k6374j8401l2496j8033j2273J4839
6556d7059L1126L2019j035j0176k4291L837M29l3319J8180J0116L009J376n449
6543b1237r756M636R187r473Q795o357P1R30J522J0930n579j5288M223J5942j8744
6528c0198K4119K3410j174m3114k4627K8129J4472N238O179o694j9741K3119K5850
6515B4968m890k6424k2041Q908r940o563k0237N967P282J6414L809l647K2491
6502c903J0934J114k7456L496J1671k2471q957M666L105J195k108J1388J8264
$$ y = [6134, 517, 4925, -33731, -44043, -20949, -25214, -4171, -22796, -31920, -41050, -60086, -38440, -21373, -7353, -12126, -16929, -54043, -67700, -59132, -17806, -8791, -14940, -10190, -13526, -26309, -16393, 13025, 11420, 2913, -953, 33670, 47173, 45679, 19305, 904, -31592, -49625, -61898, -47059, -15933, 16086, 15051, 4875, -19416, -15579, -15150, -48469, -30289, -20173, -17164, -15788, -21237, -30993, -26357, -17170, -26643, -17848, -24205, -24134, -23204, -21682, -10752, -16331, -31619, -27396, -11454, -30198, -6079, 17331, 16157, -26957, -51584, -23455, -8983, -3745, 2434, -4260, -24001, -882, 24968, 20078, -6346, -28387, -19479, -29419, -35982, -56219, -50252, -42970, -26556, -22747, -26394, -3903, 7031, 8145, -19311, -15815, -4144, -26615, -35572, -30906, -27801, -26606, -28714, -17326, 938]
6489I38J8884k7235l1278l0780m793J4320J375J2741J0072k3656L541M011r915
6476f1775n759M349J2524l783j1502K0734L8294J7842o543J3222n028j0026k2962
6463b0413o147j389K545M279p50J0144l572j524p088q989J32K2421L381k3873
6449c0843J164l2098O013P077m928K2303p506j2636J3846K012o944K0570Q512
6436a3458k1497O808J7339q680j267l955j9191J7986K4794k5168j3462m938p112
6423e1801L164M1143M372p978M829k751k5575n1413J524J5623L9510L4351k4951
6410a9953n487N418M883K766K0946J1730J519J6101k1793Q092l1178k7682P979
6397b6659K507k9257l489J1497l419M822L5898K8241J6511N458j8011l437k1161
$$ y = [938, 19822, -7413, -38691, -69471, -74264, -59944, -58569, -45828, -35756, -59412, -55871, -51860, -61775, -67534, -63185, -50661, -54444, -65946, -45212, -6918, 10924, 4381, 17603, 12575, 2549, -20413, -26560, -27949, -25404, -21125, -21875, -11731, -15303, -16827, -23915, -32904, -32772, -10351, -6970, -30843, -29679, -61777, -55764, -48687, -53615, -31312, -38818, -51454, -37608, -35596, -42540, -21970, -13458, -34955, -28147, -10808, -19488, -20755, -24710, -43901, -25915, -1121, -26289, -39751, -44689, -51801, -48637, -7494, -3122, -11100, -6271, -9022, -34597, -86010, -84486, -68863, -29353, 4998, -19953, -25440, -20022, -15139, -12373, 8573, 20303, 21822, 37923, 16130, 24222, -6956, -34638, -26659, -24152, -53409, -56898, -45401, -48820, -43998, -8100, 20141, 36652, 42110, 24099, 20662, -499]
6384d99n447k8567l2099J841R972J2580P999j3864J3338Q228j3992K4816j041
6371a6735J2006J9059J0308k5220j3985J9699P024j1476K7996J8045k7896n5315
6359c6490J5948L6645l462j9049l2240j8595J5675K7163N060j4395Q209J0858
6347d673M537K54M716j2679j8171J602J4004j3440o518J3935r094M304K482k160
6333b0901j1638J1093l809j2526J8669k4999k8418Q390N458K1179K5025R410q21
6320c888R62l0799J4830K1031J7165q071q779k7974j0627K8171m577m0478q017
6307f1051p182L038K0426l92J209L1711J8164K69O295j0450K941R002n461k3655
6293a5136N362P279r433P041J2095q492k0837j3535J7313L512J6364J0612k6645
$$ y = [-499, -5946, -34513, -66612, -64771, -54799, -42219, -34220, -48084, -34746, -26518, -40510, -15694, -16735, -4729, 14330, 24638, -582, -14567, 5132, 12156, 680, 28676, 46721, 18825, -36490, -20542, 16103, 12641, -6408, -38648, -57243, -41568, -14405, -9345, -23740, -15531, -4673, -136, 118, 4834, -7845, -26016, -24414, -10410, -23850, -30368, -16433, -25527, -21223, -18741, -20901, -32539, -21446, -25255, -37781, -19112, -44111, -72529, -64139, -58681, -37502, -12477, -3067, -3888, -2926, -33725, -18895, 2136, 19301, 11230, 2451, -25523, -36150, -7979, -12556, -53034, -61051, -68233, -65195, -44769, -45161, -43952, -12241, 5923, 6192, 12487, 2037, 4978, 13980, 8519, -15136, -9774, -2495, -11928, -4887, 7208, -1284, -22121, -35656, -18343, -14831, 1533, 12145, -14500]
6280a4500j8022J519Q737J066q526r772P351J0125n832j5708j2663K8642L2407
6267D824j7397Q010J4097r72K958J1428j5562m2222j2345R66J769J2196R826j2444
6253c4868L152K1079L2001J7737q148j5567N69k2025l5572k929M4547J7442j7545
6240a27p741L511J6132J9537j6820M816K034j0858j8224o953N017m722n923j0573
6226c0894J1381J3362r083j6057p6J0936q155J6099R074K3490O884J0808q597
6213B9172j469j1707r819K3990M696j0421j2654N155j363M392K1326r12j7690
6200B2696m118M1799N525k1420k8889j3594J1724R245o55j534j9264k5580M123
6187a9942O945K4772L715j9658l2519J6243K9281N312N638J226P928J2217L381
$$ y = [-14500, -32522, -31003, -22266, -21200, -29726, -39498, -32147, -22022, -27854, -43562, -56225, -27583, 4824, -12573, -4563, 9534, 8562, 11520, 22948, 7386, -34836, -47181, -46215, -44446, -32250, -22424, -34868, -31716, -10637, 21364, 39101, 30953, 15386, 15955, -6070, -41642, -44571, -24, 17418, -127, -7868, -4357, 11775, 31312, 14492, 19308, 21342, 10484, -7740, -14693, -9676, -14398, -20321, -30894, -19513, -6151, -15234, -31291, -31367, -20431, -28586, -12487, -3413, 20077, 26961, 37769, 29172, 27703, 15996, 6177, 30167, 34863, 24442, 11788, 16943, 15580, 19972, 41298, 40386, 22696, 18578, 60377, 65902, 44482, 15593, 1999, 13723, 22968, 22313, 20779, 1515, -24065, -19942, -12997, 11775, 15490, -4168, -36687, -20444, 8837, 14149, 19787, 21013, 28941, 41158, 44539]
6174D4539k0169j4561j9164j699j9299k6741q450J1839K3375N210K5266O753P108
6161A4007R390n731l0958l14L1870K1399O620O547p531R730J6374j4931j6168
6148D0304n423J979j9495P405l4287j2882J274P865L4814N1124j7914l2056k634
6135B0074l084p276k618k8009k7337M0294J2864k738j5116K377J330j0807J4916
6122e130L0473P283j5081p026k2440n874Q844K6330N071j317L247n422k0630k759
6108d431j599K6241P156o960l6786n981K1373J9009p808k5706j8472k082m329
6095d0375j8694K236K5516P209k7945J7735J8445J1090j2984k292J949J3239j1754
6082a6625k4637j351j0494k5247K3411m057j633J4775L1603J9583k682j3521j4667
$$ y = [44539, 24370, 9809, -9355, -11054, -30353, -57094, -65544, -53705, -30330, -25120, 146, 6899, 14007, 23397, 17666, -13292, -13606, 18264, 39663, 46283, 52830, 45299, 55029, 71403, 56472, 40304, 34881, 36860, 17365, 24770, -9517, -22399, -21125, -13260, 21554, 72678, 54764, 22708, 20074, 16990, 9714, 7096, -20913, -48250, -7956, 4908, 2170, -12946, -10569, -9239, -20046, -5130, 25343, 32626, 17545, 10519, -11921, -17795, -8951, 17379, 22450, 21133, 24380, 18958, -1672, -4431, -6030, 20211, 27367, 20407, -16379, -22360, -987, 18022, 10214, -15492, -33964, -36046, -40375, -59069, -56833, -31317, -24108, -52053, -34318, -15873, -4783, -17767, -20059, -18110, -4871, -16625, -41262, -42613, -53107, -78354, -54943, -59000, -60633, -45858, -14255, 5328, 2646, -10875, -25542]
6069b5542j3155L0185J4163k091n133J2549J5155o640k9335j7942m108K4023K0763
6056A2892j444k4423j5258o119J1230r183o377J8087k117J8527L1774J1023l0649
6043G963j4696Q252M367j2489j640j4740J6981L875M66K320j4654J8352J2674
6030A7031l341N051N3j1243j604L623k389K4239J174j6474M672k9466L4934J1025
6016C7285k2667q125j8451o738J0631R922K860j0464J0694J3486j7198J140q267
6003e892k9546k0787J2350J959K834o928m753J7305L3932k4757k9123J3206K3074
5990a7126j0355N898J1729J4037J4505j5150n431J8802O83k3878j44j0554m787
5977b1771M89k2572o444P158K6186L0961K4380j1119l6898p819N074J5384N174
$$ y = [-25542, -38697, -8512, 5651, 3560, -1573, 10976, 26131, 19491, -9844, -27786, -31894, -7871, 12892, 11448, -12975, -28233, -34352, -23122, -32305, -38682, -20595, -22712, -4185, 27589, 38612, 7963, -6733, 1519, 5886, -6603, -8243, -22983, -6002, -2127, -1661, 659, -13995, 4357, 17031, 13690, 18741, 18794, 7551, 5947, 9570, 7181, 31420, 32594, 16120, 20792, -8674, 26260, 37285, 14618, 6493, -11958, -18696, -8065, 1857, 4717, -5747, 4947, 18433, 1235, 2375, -5892, -35438, -56225, -43875, -41916, -39082, -46010, -50763, -33458, 474, -24283, -53406, -40200, -17126, -27481, -21583, -9854, 4183, 18688, 3538, -1893, 16909, 17592, -6286, -6430, -16984, -21771, -21282, -43854, -50298, -43140, -16954, 14007, 38387, 27268, -9630, -17449, -12375, 3009, 8183]
5964H183J7930n831j9770J1079J0150j0994k3405M11r362J324q010M946J8944
5951d405L184j2089J6841k683j5536j4963o114M627O017k020J7313J4978n555
5938d05j8911l544J4158K6161L1490L261j9354n112l5771q47K763O047o529J6465
5924I872N382Q282j1136K6236M2285l809o589j2981p713m674J3020n936l2787
5911A9452l387J2164l383j8425P621q65N637j0968P286J4109L0241j7425p412
5898C4645k4260l7755r166K4519Q091r064Q400K1408J4055L192l44m847k2503
5885F371N99j9950n68r574j3254p270K1275K7096k087j9724K9101K4967q564j0144
5871A8274K0208j907o226k8037j250j7496R374L6528K2332q398k1771k0595J2379
$$ y = [8183, 26113, 20282, 512, 11591, 21741, 10747, -12658, -12247, -21609, -20285, -28295, -23349, -4405, -1221, -13310, 3531, 848, -14688, -29651, -35765, -31138, -25121, -27141, -9828, 5150, -405, -19316, -22860, -8702, 17459, 48949, 52210, 32856, 27744, -8027, -8874, -6111, -64, -6593, 9872, 15254, 23536, 12400, 38636, 80921, 77112, 70523, 57542, 49829, 45155, 58175, 52239, 19452, 16065, 28229, 24846, 6421, 14042, 13177, 18814, 7846, 15132, 29241, 59482, 42057, 34645, 10385, -27370, -36536, -12017, -3926, -12990, -4590, 16818, 30873, 34065, 33721, 28874, 6371, 6970, -12980, -13548, -23122, -36376, -43646, -22371, 4725, 2638, -17086, 12015, 36982, 28418, 18274, 38482, 36575, 30349, 2312, 1062, -16434, -7060, 29468, 51800, 43402, 21631, 1036, 13415]
5858A3415M123M120p433k3252K9099Q981m599J302q366m679j5878K858l7865k8421
5844f6595J5898j5598n427K0813K4867M6130L458j7166m365p77M033j1980k029
5831h738R098J3076j3961j8342N34J113L993j882J4756J9958k6918J3481J893
5818H061J4931J521j8144m248j0373j9238k3602J0660K4017J9387n549O125R785
5805A3333j4198j9226k0258J1209o000j335J4544P212K0310J6884l747J0921m865
5792B4784j1140j1275j872K5536P719m3070N682J6856J1982K9428J0526j9950
5780D5206m2274l4307j591J6830J9149J8120J167j9992r69n907J5540J0382Q49
5767B2203J933q461j7188k4865O340J1838K9082K2529k1078j751k2454j7121l4900
$$ y = [13415, 17538, 21658, 14225, -9027, 20072, 29053, 24454, 25756, 17390, 12711, -3167, -309, -38174, -66595, -50697, -66295, -71722, -50909, -26042, 20088, 23546, 6380, 2015, 1238, 5271, -6709, -8738, 360, 13436, -525, -18867, -18333, -17220, -13227, -15109, -353, 19605, -7313, 6168, 8061, 22992, 24513, 6369, 2121, -8252, -27490, -51092, -40432, -16415, 2972, -2577, 3548, 13333, -865, -20091, -40349, -29140, -35140, -36475, -21931, -14719, 5591, 22475, 18728, 29649, 24784, 13644, 2369, 497, 26033, 33752, -9318, -3636, 13220, 25202, 54630, 65156, 45206, 2932, -31375, -32966, -16136, 3013, 21133, 22300, 2308, 1339, -4568, 10972, 21354, 22203, 24136, 15675, -1513, -26378, -20038, -8200, 20882, 43411, 22333, 20582, -1872, -18993, -53893]
5754e3893J0873J9634J7132M2842K3293k1834k4181q9L670K670l780k3735o672
5741a4070R971L1501l182j916r035j1945j0780N905M924k4983R922N1774k8335
5728I751j9661k878J4585M80p790K3897L887l5389p534L984K7279P780Q74j6309
5714B956k9461j3478M140n643j880K0506j982j621K2273K6969k5697m0551j92
5701d3661K3911J3914k0049m0637N968M3079O452J5709N975k4921j0175J3109
5689a1326j4198j9424k929M3402J0347j380L514k6135p114P592J3133P729k4995
5676b1784k9135j2133J2275M1125j3406k6803l906L6526J4300k174j0902j5335
5664c1352J448k179K0885J2473K0427j8115l5079j641L425j0893j4092K8888K5931
$$ y = [-53893, -43020, -23386, -6254, 36588, 59881, 38047, 13866, 13777, 17447, 20117, 16337, -7398, -14070, -4099, 27402, 24220, 22304, 13269, 1324, -9456, -3551, 1373, -23610, -13688, 38086, 9751, -9910, -12788, 1797, 2277, -5513, 18384, 22271, -13118, -20652, -16668, 10611, 18391, 19265, 2956, -26505, -39983, -35843, -41486, -43366, -22860, -24842, -26463, -4190, 22779, -2918, -43469, -43661, -19750, -5836, -25885, -66522, -60554, -17475, -11023, 4686, 10661, -14260, -24435, -11326, -25524, -44948, -47877, -4475, 5872, 4492, 8006, -18129, -25243, -17651, -4518, 3211, -21784, -50919, -63052, -50777, -9652, -23058, -49861, -53767, -17241, -2941, -5115, -16017, -31352, -29904, -32083, -11198, 1275, 21702, 3587, -31492, -33133, -29708, -40601, -54693, -25805, 126]
5651A26l064q955j496j1876m798J076J6034o67J0896m884k206J3253j693j5505
5637a3759k1643M693K3876J6798L289O369k971m599J3334j2009j7055J6558M965
5624A7846k1848j1588j8225j1489J2761K3945o445Q852o080k3018K314N636k836
5611c0175K8225R157J0154R147j5526J2274k7348m6843q728L1915J3625r885O848
5598a7160J1912R560j1368R680J8317N048m695P833r217k0015K782Q029m457q439
5584b190k850l4589P967K1759K894k6570J2742J9215j3987j9261k5404l802L1410
5571c2666N7901J7099m7599l3244P996K324k429J2592P868j6636N993M2884K5311
5558D7394k9902k6587j7291j4905n456J0247J8752L0969j4308k8525J4271K585
$$ y = [126, -2938, -11893, -13389, -25265, -30063, -28987, -12953, -13620, -2724, -7608, -9814, 3439, 1746, -13759, -35402, -30709, -6833, 9965, 13254, 19623, 16652, 12053, 25387, 13378, -3677, 12881, 17846, -4002, -15590, -33815, -45304, -32543, -8598, -15043, -6191, -12271, -35289, -32975, -27339, -30175, -1950, 7207, 17361, 26508, 10982, 23256, -4092, -50935, -59663, -27748, -14123, -24008, -17160, -5248, 4312, -7056, 2624, 20941, 25989, 21294, 29127, 19910, -105, 2677, 10706, 6249, -2190, -5040, -39629, -31662, -9903, -7009, -33579, -20837, -1622, -15609, -34870, -60274, -64076, -32666, 25235, 42334, -5265, -38509, -30513, -28189, -30618, -18026, -10158, -26794, -20801, 22083, 47394, 17492, -9095, -26386, -41291, -46747, -36500, -17748, 13221, -1087, -29612, -15341, -12756]
5546a2756L866J3755P798j3318k4701L742K8724K8651n028j7263J4062R063k652
5533C3943k803j9894N973r122j7914O643J0053J1400M126j6213j2756J0578J2774
5520A6788r137J9417k5064k3078j0997J8584L0740k00l7819k5337J292K3100r54
5507b2665j7369J8816K1649J4146M246j0823j8301j2392J1475K6225o570j7702
5495i265M829M2838J3480r405j4258o70j9740j5075q010N685k32K2244J018J1183
5481B4622j371k4020M773q030j2070K5184J0955j3856q349j4890J376J5522J9895
5468A9741k0352k6195j7037j6926J1420K7971J3840m659k480r534J0928K016O076
5455e191p441J4719J1839N943j4500j1664j3923m80p476K861K8985J0094K481
$$ y = [-12756, -8890, 4865, 12663, -655, -25356, -21614, 7110, 35761, 30733, 13470, 27532, 36595, 33943, 31140, 11246, 17219, 8097, -9817, -3174, 6879, 18279, 22405, 6192, -6564, 4014, 16788, 7651, 27068, 2004, -21074, -32071, -13487, 17253, 17053, -20766, -46103, -44811, -21711, -22665, -40034, -21218, 431, 14577, 18823, 8000, -10301, -22693, -11218, 15007, 8437, -9265, -4436, 38402, 51882, 42477, 28219, 27549, 7809, -7266, -15276, -9591, -9823, 12421, 13439, 24622, 23251, -769, 4004, -4026, -16096, 9088, 20043, 6187, -2162, -17052, -15676, -154, 19741, -611, -26806, -43843, -60769, -49349, -21378, -7538, -12197, -14677, -24211, -13283, -11267, -5191, -12632, 2087, 13926, 19869, 5369, -6295, -20218, -20698, -28174, -25313, 3672, 13766, 16247]
5442A6247N832n011Q688j4462k8503j6739n457J5150K1488k2511n723J9985J8806
5429G790K0972O655j5635L476K0714k4049l5969M048J4656j7264o869J7789J2538
5416H852m26J2460m161j548J4263L289J9593K4794j6446m9455k9995n222J9576
5403d426j0162J7451O94k1198N221R562J4204k785Q122R521j5417J4015j1207
5390A3595m3836j1959J5757J3200o794J9443K939M2520k912L106J0972k8478k652
5377B4901m321r82j2606j2393K460p214K554K7129J0056l826k1487j6193l706
5364a5628k1538p439M029O672l840L1226K4077Q994j157P142k060k4122J3422
5351A9778M7768J1206k1084k6432M593j2012j8576m334K6326j1877k7356m771
$$ y = [16247, 22079, 17068, 25756, 11294, -17209, -33948, -39405, -24255, -2767, -25278, -31001, -11016, 7790, 28762, 35417, 19782, 23258, 43972, 19923, -16046, -11998, 2658, -14606, -21475, -3686, 8852, 8426, 20886, 16725, 15177, 29440, 32729, 52322, 77116, 60670, 11215, -18780, -24002, -4426, -14588, 2863, 3557, -17641, -12420, -2858, 11346, 8561, 16683, 26204, 10787, 24802, 13595, -30241, -42200, -26443, -13243, -20037, -594, 2345, 44865, 41953, 45059, 56031, 27553, 24901, 20580, 19598, 6992, -5401, -2941, -10155, -7601, 19528, 29584, 25758, 4271, -11922, -15628, -37166, -44605, -40576, -33904, -37744, -6518, 17559, 26553, 25396, 32538, 30478, 6356, 19778, 67546, 78752, 57668, 31236, 35829, 23817, 5241, 907, 27233, 15356, -12000, -16771]
5339a6771j0170Q052m364J6207l245Q719q389k67J2105k2726j0049k002K3575
5326i325r389J1057J1947L359J9753j9338k3679Q652j6050K0429J9435J594K7382
5313D5827J564r329k8146l4238J2068m447j4011J1687O426j0720j9957M033J7530
5300b1713J5477J5503k76k6673N361K4621o366j8342j6571J9356L4423J8379l644
5287C9535k733q971q866J6633p545m158J5741l449o72K2041k1620k6614r131j897
5273a706p249J9018k1773k8933K5311l108m734J0340K3730K0040J2326j9520j5315
5260H427N066J6284j6319j8355j2696k82J4898j5804J7698p77p052J7500J773
5247A0361K2974K8532j9942l7567l3031K4524J7333J4857R389r316k6846j161
$$ y = [-16771, -26941, -18889, -23253, -7046, -10291, -1572, -9961, -10228, 1877, -20849, -30898, -32900, -9325, -18714, -7657, 4290, 7649, 27402, 8064, -15615, -6963, -23013, -2584, 16851, 18445, 45827, 47391, 38062, 9916, -24322, -12254, -16701, -30712, -19025, -12599, -23319, -43276, -39243, -21713, -6236, 9267, 8991, -17682, -12321, 12300, 5934, -12408, -28979, -9623, 24800, 43179, 39535, 36802, 27831, 18965, 35598, 28053, 23895, 39636, 36187, 35515, 57556, 35936, 9322, 191, -1706, -8955, 10063, -11710, -40643, -15332, -18440, -23174, -12834, 10896, 30936, 43262, 23742, 8427, 13493, 29777, 13458, -4897, -17593, -17875, -2977, -18781, -1083, -1860, -8912, 8588, 10361, 33335, 61867, 41925, 4358, -28673, -4149, 13184, 28041, 37430, 28114, 1268, 107]
5235A07P446N737J8053M395O39j5943k921M579K47m002M728oj7623J0775O716
5220B2927n016n763p656j7636j0373K9162L0529p334l368K1060P872j4345j4625
5207B5434K916N974j3254O636R825P079q721L3348L252p946k9413l0183r756j8674
5193b3483r757r304j4307K3350K3387m6m027k1284Q476K4392k0505o04J0954O383
5179f375J1511M73J4378M255k2429j6000k283j6617J2656J9353K974P305K8494
5166C7695j5342j3728K5651p659j8424k1270O388J910J3688j2251r848j457M6446
5153C1799O823l3776l6619K9265J7174k8471j3186P576J5147j1710n364n685O785
5140b0242L5490L6068p512J76L881l9467L190o994k054n696j3534K789K1927l668
$$ y = [107, 7553, 13290, 31343, 35738, 36377, 20434, 17513, 22092, 22339, 18337, 23065, 23059, 5436, 16211, 22927, 17911, 12148, 4492, -13144, -23517, 5645, 36174, 28840, 25472, 46532, 54404, 40059, 25434, 28350, 34324, 21070, 27706, 37531, 44610, 35889, 69237, 72489, 64543, 35130, 4947, -4809, -23483, -33240, -42544, -56851, -33501, -10114, -10160, -14187, -35471, -26995, -2603, -23108, -23712, -12758, -6375, 5136, 5609, 19987, 24242, 1813, -14187, -16470, -33087, -20431, -1078, 1896, 9201, 37695, 22353, 8625, 34276, 26617, 8193, -13077, -6689, -4779, 8909, -3342, -13190, -14647, 31799, 38622, 4846, -31773, -2508, 14666, -13805, -26991, -19415, -4268, -15978, -21342, -27027, -20242, 15248, 51316, 43804, 43980, 47861, 8394, 11584, 4590, 2536, -3160, -16694, -13905, 8022, 4354]
5126D354k8405j6125K3565J6200k897J9344p630M288p637M59J3711O044J0327
5113C5598k1884m676K1153K526J2286k7139j4988M898o171r297k866P93P818j3514
5099a5463j5450r971J1943J7012O481M0983Q183j1817r783j0343n990M377Q123
5086A8285N123M241p405j5645j1725r846j1176O296J6009k504r108K1276J1653
5073A5474K48p714K468J6622j5802l1929p077p892K4068L5727P185L771p0J0446
5059D5525j3327k5451j0029M006M136j2877L858J3029L351P618j6488n701j5570
5046a7920j4232J2306J5822o179j0869P174Q478L1994R852m192J7140k789m144
5033D2441k8082j6358J6387L8099M568j1826n089n701j9473M023p317J5983K1157
$$ y = [4354, -24051, -40176, -16611, -411, -3308, 16036, 8406, 12694, 5057, 5516, 19227, 25271, 35598, 13714, 9038, 30191, 32717, 45003, 17864, 2876, 7774, 1603, -7694, -10560, -9767, -1949, -15463, -30913, -40884, -28941, -11929, -5448, 35535, 43718, 31901, 22118, 11775, 5785, 10162, 18285, 23408, 27649, 20244, 4599, -7126, -16972, -28148, -21852, -5843, -8347, -17455, 3821, 15474, 15722, 8008, 10476, 27098, 11296, -20633, -27710, -35602, -11534, 24193, 31378, 35149, 35079, 45525, 32198, 6747, -3282, 724, 4860, -8017, -4159, 8870, 12221, 19839, 3351, -2350, -17920, -32152, -19846, -4024, -10203, -21072, -13898, -5420, 26574, 36426, 32234, 49374, 46585, 42441, 14359, -1999, 14388, 52487, 57055, 45229, 40140, 34439, 14966, 18989, 11672, 27655, 48812]
5020D8812q578k0781Q517P938k0985k3042l0311J5961J8490M507J4006J2727N082
5007C2343p739l3216j2307r411J4035r022R068L2976P718P537j2639L714J848
4994B4905K908j0698j4138J2683J0685l453j0481J006j0952j7701j9694L0688
4982d242J0488j3111j576p825j2992k2756K857J1308L0915K7383o458J7947l0431
4969A507O635K1775J8195j2288j7752p579l9572j5974P565j0135P865J9261K0969
4956D72K3378j1965j1361k1096L532K9012k3547m144L5787J0983O808J0469j2341
4943C5987r709j8227J5314Q398m1982k4072J8302L429l0017J880J108J734K4015
4930a3840J8179K057K2426o314m196q657k469J8283l07j5623N250J6816K0365
$$ y = [48812, 40234, 19453, 27970, 35908, 14923, -8119, -38430, -22469, -3979, 528, 14534, 27261, 32343, 24604, -8612, -20919, -30330, -16295, -25317, -16249, 16727, 24445, 31982, 19343, 23057, 24905, 27813, 17115, 2977, 15660, 26345, 22892, 12411, 13417, 2465, -15236, -34930, -4242, 6246, -6865, -8441, -16266, -29258, -52014, -49157, -37849, -6934, 20449, 13991, 31938, 1507, 8142, 29917, 48112, 35824, 18072, 10493, -29079, -45053, -37488, -47623, -39758, -20497, 472, 23850, 11885, 524, -20572, -17040, 11972, -11575, -15719, 20068, 31051, 37859, 48328, 35987, 26278, 8051, 23365, 31763, -10219, -34291, -15989, -12560, -42577, -40697, -39589, -37855, -13840, 4339, 6396, 28822, 22508, 18312, 9655, 7186, 25469, 25162, 9539, 14789, 31605, 51970]
4917E1970k2918k6098j6950J2244O225Q797J1521j1522k3126l0799l4642J0586
4905f4712J9316L8378j6794r282K7994K1212p682r490K2690J3334q118k0185J6135
4892B2796N774m779k2868q978j5332o87L2878M2568j5771l1154q398L544O100
4879E693K6206j0320l3231k3344Q445K2177J7761N339L1533J3176n5616j6441
4867h622N555J0641J0261m246j1245j6165N886j6766J0398j6659j8888N069J5946
4854b8835o661J1846J7486j743m236j768j5464J0697K4406J1353k8747Q777n81
4841c470n16j2589j3425n966q183l850l49L1322K2536Q662k5282k6552J5943J313
4827b0406j2390J6245J5204J2258N310j8197J9559M483o84j3312m2847m78J6719
$$ y = [51970, 29052, 2954, -13996, -1752, 4473, 13270, 24791, 13269, -9857, -40656, -75298, -64712, -45396, -7018, -23812, -33094, -5100, 16112, 8430, -1060, 21630, 34964, 26846, 6661, 22796, 28570, 23791, 923, -8055, -23387, -24074, 8804, 51372, 35601, 4447, -3951, -407, 5693, 31899, 21579, -11652, -34996, -26551, -4374, 13387, 18726, 50259, 63435, 7819, -8622, -3067, 7574, 17835, 13589, 2344, -13821, -7935, -24701, -14303, -30962, -49850, -44781, -28835, -35496, -23650, -6164, -7907, -12143, -13911, -29375, -18678, 5728, 17081, -11666, -2889, -3470, -3986, -16575, -30000, -35966, -44149, -47999, -48348, -17026, 5510, 14172, -11110, -37662, -21719, -20406, -32796, -16551, -1347, 10911, 16221, -1976, 17583, 22066, 21382, 8070, -34777, -35255, -18536]
4814a8536l995Q13M768M259j3259P348L4696j915Q761L1665j1127k1867K527l8871
4800a4733j5999K0913N478j4087J0576n408o20p633l746J4066M688N787J1443
4787A0725j4624K009K8649j853k9583j063J3402M410j0241j461j1987M839O911
4774A33N46o740N868R115J0533j725O45k0240r28R381J8606l414j5477k7643L0837
4759I497J7793j3398j4791P025j3133J2952J9401N965O586Q598J106J1202J6583
4746G5386j6199l1435m4696j321J6175J0331k7081k6317L176L581K198J5474K9748
4733I020K0138O14j9067O798J2474O069k1701p816j634J6818j4040j9403K123
4720i607j7227J0721K2847J8967j8519k0561l8289j4037L1867J3608Q288K0534
$$ y = [-18536, -22531, -21718, -16950, -12691, -25950, -18602, 16094, 14179, 22940, 54605, 43478, 21611, 24138, -14733, -30732, -9819, -4341, -18428, -7852, -13260, -13880, -21513, -25259, -11193, -6505, -718, 10725, -3899, -1890, 26759, 24906, -4677, -5740, 7662, 12072, 1831, 370, -11617, -6778, 133, 679, -6061, -193, 8922, 19455, 17730, 18375, -1865, -2793, 6588, 25194, 21780, 6303, -21340, 9497, 27290, 13892, -899, 6126, -7007, 5945, 25346, 31311, 37897, 46495, 47601, 58803, 75386, 59187, 27752, -16944, -18265, -2090, 8241, -18840, -45157, -41981, -38400, -36202, -20728, 9020, 29158, 29772, 10705, 17503, 29977, 36046, 14345, 6529, 4895, 21713, 7673, -11730, -9607, -26834, -16113, 6734, 25701, 7182, -13379, -51668, -65705, -33838, -20230, -11942, 8592]
4708H592O648J047j214R480R515m418n854r426K0123J609k2776j7288p334K391
4694h905p855k108J137p207J1394Q965K4336L338K568Q734r19K0069l555j7391
4680C2601l780q686J3753p876k5473j4273l41J1193j665j4180q039Q164K2131
4667C529J4586J449j2992r914O665J0610Q370J4177M299j6802k2261m556R360
4654F520M009j0204j4110R949L1170l252K0809R569J54l7058k6384K827Q598J0871
4640A3468L3303K653j4583l3326r453P109J9613P377P968J7176j384k7581L951
4627B6291j0287k064J4500j7304m1142K059L9152j335l0975j2661K6170K7835
$$ y = [8592, 15240, 16287, 15073, 24553, 34068, 29650, 23796, 14370, 34493, 36102, 13326, -3962, -11296, -8905, -16760, -18868, -17731, -24938, -13544, -4579, 19757, 23095, 25663, 34397, 33478, 53547, 49992, 32601, 28821, 20135, 33888, 26012, 539, -13734, -14075, -2882, -4547, -18727, -26766, -18602, 3529, 18115, 19564, 6572, -3342, 3323, 13933, 22303, 36480, 40779, 23977, 1716, -2840, 6520, 10529, 325, -13785, -3836, 27334, 24082, 44891, 54460, 54614, 17556, -8828, -6001, 2597, 13468, 46771, 49424, 34841, 1515, -7938, -829, 18784, 26161, 34129, 51305, 49921, 22340, 26291, 16004, 13940, 28440, 11136, -30006, -27947, 11205, 9870, -21105, -33766, -7596, 20239]
$$ [...]
##END NTUPLES=NMR SPECTRUM
##END=
