##TITLE=Analysis number 323402
Compound Code sb 01965
Book Reference 461/198/11
Project Code adrs
Chemist Name stevem
##JCAMPDX= 6.0         $$ Bruker NMR JCAMP-DX V2.0
##DATA TYPE= NMR SPECTRUM
##DATA CLASS= NTUPLES
##ORIGIN= Bruker BioSpin GmbH
##OWNER= nmr
$$ XWIN-NMR		Version 3.5
$$ Tue Oct 24 10:48:48 2006 GMT Daylight Time (UT+1h)  MAYBRIDGE\nmr@NMR_250MHZ
##.OBSERVE FREQUENCY= 250.131544655141
##.OBSERVE NUCLEUS= ^1H
##.ACQUISITION MODE= SIMULTANEOUS (DQD)
##.ACQUISITION SCHEME= undefined
##.AVERAGES= 16
##.DIGITISER RES= 18
##SPECTROMETER/DATA SYSTEM= dpx250
##.PULSE SEQUENCE= zg30
##.SOLVENT NAME= DMSO
##.SHIFT REFERENCE= (INTERNAL, DMSO, 0, 16.522)
##AUDIT TRAIL= $$ (NUMBER, WHEN, WHO, WHERE, WHAT)
$$ ##TITLE= Audit trail, XWIN-NMR		Version 3.5
$$ ##JCAMPDX= 5.01
$$ ##ORIGIN= Bruker BioSpin GmbH
$$ ##OWNER= nmr
$$ C:\u/data/dgb/nmr/ADRS/1150/pdata/1/auditp.txt
$$ ##AUDIT TRAIL=  $$ (NUMBER, WHEN, WHO, WHERE, WHAT)
(   1,<2006-10-24 10:48:24.42 +100>,<MAYBRIDGE\nmr>,<NMR_250MHZ>,
      <created by zg, POWCHK disabled, PULCHK disabled
       configuration hash MD5:
       49 4B E0 1D 92 C2 6B 37 9F E6 65 BC 52 41 86 1D
       data hash MD5: 64K
       15 8C 7A F9 D8 22 50 94 9E 0E 74 D4 C8 E2 5D 1B>)
(   2,<2006-10-24 10:48:38.06 +100>,<MAYBRIDGE\nmr>,<NMR_250MHZ>,
      <Start of raw data processing
       ef LB = 0.3 FT_mod = 6 PKNL = 1 SI = 32K 
       data hash MD5: 32K
       13 6B 6D 1A 27 36 3D 8C 7B 33 CA 1F 3C 95 98 FF>)
(   3,<2006-10-24 10:48:39.73 +100>,<MAYBRIDGE\nmr>,<NMR_250MHZ>,
      <apk 
       data hash MD5: 32K
       34 35 38 43 1E 66 C7 6B 92 95 BB 58 45 0D F0 8F>)
(   4,<2006-10-24 10:48:40.53 +100>,<MAYBRIDGE\nmr>,<NMR_250MHZ>,
      <abs ABSG = 5 
       data hash MD5: 32K
       7A 66 D7 CA A9 A3 A4 DB C8 9E 64 39 09 9C DB 70>)
$$ ##END=
$$ 
$$ hash MD5
$$ 91 C8 14 B1 77 89 AC 5F 22 73 D0 22 9A D8 94 31
##$RELAX= 
##$RELAX= 
##$RELAX= 
##$RELAX= 
##$RELAX= 
##$RELAX= 
##$RELAX= 
$$ Bruker specific parameters
$$ --------------------------
##$DU= <C:\u>
##$EXPNO= 1150
##$NAME= <ADRS>
##$PROCNO= 1
##$TYPE= <nmr>
##$USER= <dgb>
##$AMP= (0..31)
100 100 100 100 100 100 100 100 100 100 100 100 100 100 100 100 100 100 
100 100 100 100 100 100 100 100 100 100 100 100 100 100 
##$AQSEQ= 0
##$AQ_mod= 3
##$AUNM= <au_zg>
##$AUTOPOS= <14 >
##$BF1= 250.13
##$BF2= 250.13
##$BF3= 250.13
##$BF4= 250.13
##$BF5= 500.13
##$BF6= 500.13
##$BF7= 500.13
##$BF8= 500.13
##$BYTORDA= 1
##$CFDGTYP= 0
##$CFRGTYP= 5
##$CHEMSTR= <none>
##$CNST= (0..31)
1 1 145 1 1 1 1 1 1 1 1 1 1 1 1 1 1 1 1 1 1 1 1 1 1 1 1 1 1 1 1 1 
##$CPDPRG= <>
##$CPDPRG1= <>
##$CPDPRG2= <>
##$CPDPRG3= <>
##$CPDPRG4= <mlev>
##$CPDPRG5= <mlev>
##$CPDPRG6= <mlev>
##$CPDPRG7= <mlev>
##$CPDPRG8= <mlev>
##$CPDPRGB= <>
##$CPDPRGT= <>
##$D= (0..31)
0 1 0 0 0 0 0 0 0 0.06 0 0 0 0 0 0 0.0002 0 0 0 0 0 0 0 0 0 0 0 0 0 0 
0 
##$DATE= 1161683303
##$DBL= (0..7)
120 120 120 120 120 120 120 120 
##$DBP= (0..7)
150 150 150 150 150 150 150 150 
##$DBP07= 0
##$DBPNAM0= <>
##$DBPNAM1= <>
$$ [...]
##$SUBNAM7= <"">
##$SUBNAM8= <"">
##$SUBNAM9= <"">
##$SW= 20.6930455092707
##$SWIBOX= (0..15)
0 0 3 0 0 0 0 0 0 0 0 0 0 0 0 0 
##$SW_h= 5175.983436853
##$TD= 65536
##$TD0= 1
##$TE= 683.16
##$TE2= 300
##$TE3= 300
##$TEG= 300
##$TL= (0..7)
0 120 120 120 120 120 120 120 
##$TP= (0..7)
150 150 150 150 150 150 150 150 
##$TP07= 0
##$TPNAME0= <>
##$TPNAME1= <>
##$TPNAME2= <>
##$TPNAME3= <>
##$TPNAME4= <>
##$TPNAME5= <>
##$TPNAME6= <>
##$TPNAME7= <>
##$TPOAL= (0..7)
0.5 0.5 0.5 0.5 0.5 0.5 0.5 0.5 
##$TPOFFS= (0..7)
0 0 0 0 0 0 0 0 
##$TUNHIN= 0
##$TUNHOUT= 0
##$TUNXOUT= 0
##$USERA1= <user>
##$USERA2= <user>
##$USERA3= <user>
##$USERA4= <user>
##$USERA5= <user>
##$V9= 5
##$VALIST= <valist>
##$VCLIST= <CCCCCCCCCCCCCCC>
##$VD= 0
##$VDLIST= <DDDDDDDDDDDDDDD>
##$VPLIST= <PPPPPPPPPPPPPPP>
##$VTLIST= <TTTTTTTTTTTTTTT>
##$WBST= 1024
##$WBSW= 4
##$XGAIN= (0..3)
0 0 0 0 
##$XL= 0
##$YL= 0
##$YMAX_a= 438981
##$YMIN_a= -425600
##$ZGOPTNS= <>
##$ZL1= 120
##$ZL2= 120
##$ZL3= 120
##$ZL4= 120
##$ABSF1= 16.522
##$ABSF2= -4.171173
##$ABSG= 5
##$ABSL= 3
##$ALPHA= 0
##$AQORDER= 0
##$ASSFAC= 0
##$ASSFACI= 0
##$ASSFACX= 0
##$ASSWID= 0
##$AUNMP= <proc_1d>
##$AZFE= 0.1
##$AZFW= 0.1
##$BCFW= 0
##$BC_mod= 0
##$BYTORDP= 0
##$COROFFS= 0
##$CY= 12.5
##$DATMOD= 1
##$DC= 0
##$DFILT= <>
##$DTYPP= 0
##$F1P= 14.0000005364418
##$F2P= -0.99999901652339
##$FCOR= 0.5
##$FTSIZE= 32768
##$FT_mod= 6
##$GAMMA= 0
##$GB= 0
##$INTBC= 1
##$INTSCL= 1
##$ISEN= 128
##$LB= 0.3
##$LEV0= 0
##$LPBIN= 0
##$MAXI= 10000
##$MC2= 0
##$MEAN= 0
##$ME_mod= 0
##$MI= 0
##$NCOEF= 0
##$NC_proc= -4
##$NLEV= 6
##$NOISF1= 0
##$NOISF2= 0
##$NSP= 0
##$NTH_PI= 0
##$NZP= 0
##$OFFSET= 16.522
##$PC= 1
##$PHC0= -51.46137
##$PHC1= 8.105254
##$PH_mod= 1
##$PKNL= yes
##$PPARMOD= 0
##$PSCAL= 4
##$PSIGN= 0
##$REVERSE= no
##$SF= 250.13
##$SI= 32768
##$SIGF1= 0
##$SIGF2= 0
##$SINO= 400
##$SIOLD= 32768
##$SREGLST= <1H.DMSO>
##$SSB= 0
##$STSI= 32768
##$STSR= 0
##$SW_p= 5175.98343685301
##$SYMM= 0
##$S_DEV= 0
##$TDeff= 65536
##$TDoff= 0
##$TI= <Analysis number 999999
Compound Code 99
Book Reference 9
Project Code 9>
##$TILT= no
##$TM1= 0
##$TM2= 0
##$TOPLEV= 0
##$USERP1= <user>
##$USERP2= <user>
##$USERP3= <user>
##$USERP4= <user>
##$USERP5= <user>
##$WDW= 1
##$XDIM= 32768
##$YMAX_p= 372972448
##$YMIN_p= -654330
$$ End of Bruker specific parameters
$$ ---------------------------------
##NTUPLES= NMR SPECTRUM
##VAR_NAME=  FREQUENCY,     SPECTRUM/REAL,   SPECTRUM/IMAG
##SYMBOL=    X,             R,               I
##VAR_TYPE=  INDEPENDENT,   DEPENDENT,       DEPENDENT
##VAR_FORM=  AFFN,          ASDF,            ASDF
##VAR_DIM=   32768,         32768,           32768
##UNITS=     HZ,            ARBITRARY UNITS, ARBITRARY UNITS
##FACTOR=    0.157963299565203, 1,           1
##FIRST=     4132.6476996994, 0,             0
##LAST=      -1043.33573715361, 0,           0
##MIN=       -1043.33573715361, -654330,     0
##MAX=       4132.6476996994, 372972448,     0
$$ Real data points
##PAGE= N=1
##DATA TABLE= (X++(R..R)), XYDATA
$$ [...]
$$ plain form
17212 45154 -132214 -288364 -350895 -133909 -97427 -198406 -91274 39382 158468 -82141
17202 -82141 -201323 -158160 -65487 -45707 -298737 -383024 -302958 -129002 -159107 19041 191322
17191 191322 86514 83193 100906 142883 111868 75020 140562 8223 -137907 -21911 189416
17180 189416 170159 248307 229721 189578 22856 -45379 -244327 -277749 -228123 -174579 -177015
17169 -177015 -66745 -28534 -24726 -25696 118948 234877 257692 136937 -49753 -145912 -18871
17158 -18871 -72481 42367 -96495 -104942 44261 173276 110256 -4851 -92261 65540 89594
17147 89594 81444 -14931 -96076 -134449 25512 173485 112420 60157 90622 319032 190099
17136 190099 -37660 -139425 -49156 52840 -3460 14229 -69143 -77451 199700 132113 37481
$$ packed form
17212D5154j77368j56150o2531K16986L6482j00979J07132J30656J19086k40609
17202h2141j19182M3163R2673J9780k53030q4287Q0066J73956l0105J78148J72281
17191A91322j04808l321J7713M1977l1015l6848O5542j32339j46130J15996K11327
17180A89416j9257P8148j8586m0143j66722o8235j98948l3422M9626N3544k436
17169a77015J10270L8211L808r70J44644J15929K2815j20755j86690r6159J27041
17158a8871n3610J14848j38862q447J49203J29015o3020j15107q7410J57801K4054
17147H9594q150r6375q1145l8373J59961J47973o1065n2263L0465K28410j28933
17136A90099k27759j01765R0269J01996n6300J7689q3372q308K77151o7587r4632
$$ plain form
17125 37481 -167843 -272129 -213887 -60716 38158 39337 23085 124763 16896 -40791 6890
17114 6890 187372 309112 68117 -147454 -239054 -63883 -90914 -105272 7970 140988
17104 140988 256205 177746 19582 7613 128718 278777 172030 44811 59416 -20761
17094 -20761 -163376 -303519 -404695 -358739 -157953 -72453 -110122 -296401 -292793 -192024 -160836
17083 -160836 -236893 -167554 71983 176371 320622 436561 505349 471659 315258 290835
17073 290835 287688 363476 348585 58881 31235 -53288 -12187 -71305 -141700 -237176 -248624
17062 -248624 -177972 -268878 -190682 -175356 -228141 -136308 -38851 -66694 -43998 46032 50814 -121798
17050 -121798 -35007 -99776 -51847 51150 30574 58596 28849 95694 209399 124589 -9015
$$ packed form
17125C7481k05324j04286N8242J53171R8874J179j6252J01678j07867n7687M7681
17114F890J80482J21740k40995k15571r1600J75171k7031j4358J13242J33018
17104A40988J15217p8459j58164j1969J21105J50059j06747j27219J4605q0177
17094b0761j42615j40143j01176M5956K00786Q5500l7669j86279L608J00769L1188
17083a60836p6057O9339K39537J04388J44251J15939O8788l3690j56401k4423
17073B90835l147P5788j4891k89704k7646q4523M1101n9118p0395r5476j1448
17062b48624P0652r0906P8196J5326n2785R1833R7457k7843K2696R0030M782j72612
17050a21798Q6791o4769M7929J02997k0576K8022k9747O6845J13705q4810j33604
$$ plain form
17039 -9015 14326 34326 81895 90684 143899 73643 -104003 -88994 -59582 -49116 -57685 -37861
17027 -37861 -74383 -170383 -158814 -153453 -258659 -218530 -163627 -144475 -305913 -350236 -216286
17016 -216286 -136536 -1254 75344 135807 236219 226793 118619 27374 40745 62481 56308
17005 56308 39072 43126 102245 -3679 -56044 -96224 -254813 -174995 -290625 -205419 -123997
16994 -123997 -134202 -190005 -156749 -205511 -252057 -387855 -359546 -229214 -191126 -226483 -208026
16983 -208026 -166651 -68677 -133659 -314874 -435591 -290810 -258995 -245312 -319665 -329663 -136783
16972 -136783 -47011 -51871 -126837 -268183 -298259 -201633 -165663 -199635 -171817 -140107 -104835
16961 -104835 -198165 -207899 -207766 -225753 8242 125468 -7839 -93089 -81949 -19557 -64104
$$ packed form
17039i015K3341K0000M7569Q789N3215p0256j77646J5009K9412J0466q569J9824
17027c7861l6522r6000J1569N361j05206M0129N4903J9152j61438m4323J33950
17016b16286P9750J35282P6598O0463J00412r426j08174r1245J3371K1736o173
17005E6308j7236M054N9119j05924n2365m0180j58589P9818j15630Q5206Q1422
16994a23997j0205n5803L3256m8762m6546j35798K8309J30332L8088l5357J8457
16983b08026M1375R7974o4982j81215j20717J44781L1815J3683p4353r998J92880
16972a36783Q9772m860p4966j41346l0076R6626L5970l3972K7818L1710L5272
16961a04835r3330r734J33j7987K33995J17226j33307q5250J1140O2392m4547
$$ plain form
16950 -64104 24159 134086 230978 191398 121452 133413 81034 125419 209650 222113 331052
16939 331052 222652 101836 -26498 -37223 -41267 -129304 -51834 -231 -11378 -99261 -69267
16928 -69267 -34327 99179 98230 37265 -60348 -73181 81413 -11074 -55397 22418 26096 -105458
16916 -105458 -316545 -189640 47449 -87083 -225844 -320275 -368726 -349792 -352299 -316404 -160854
16905 -160854 117913 92684 57685 12949 -106686 -197552 -295423 -107537 11938 27933 -147227
16894 -147227 -138069 -127498 -22613 -246382 -212631 -37285 36135 5109 -15587 29582 40466
16883 40466 71268 -18760 -24814 9052 -220507 -307522 -296622 -356517 -393507 -235632 -22230
16872 -22230 150850 248743 84429 -1760 66704 92922 102486 127981 122819 112504 -23953
$$ packed form
16950f4104Q8263J09927R6892l9580o9946J1961n2379M4385Q4231J2463J08939
16939C31052j08400j20816j28334j0725m044q8037P7470N1603j1147q7883K9994
16928f9267L4940J33506r49o0965r7613j2833J54594r2487m4323P7815L678j31554
16916a05458k11087J26905K37089j34532j38761r4431m8451J8934k507L5895J55550
16905a60854K78767k5229l4999m4736j19635r0866r7871J87886J19475J5995j75160
16894a47227R158J0571J04885k23769L3751J75346P3420l1026k0696M5169J0884
16883D0466L0802r0028o054L3866k29559q7015J0900n9895l6990J57875K13402
16872b2230J73080R7893j64314q6189O8464K6218R564K5495n162j0315j36457
$$ plain form
16861 -23953 -298427 -152791 1807 -30743 -139973 -299252 -245292 -343895 -427197 -265365
16851 -265365 38042 181401 239569 277889 328856 153120 18803 49425 148390 301042
16841 301042 302622 332429 279885 171456 -36198 -58932 -111152 -128479 -134693 -169688 -118134
16830 -118134 -59310 -145976 -230378 -233579 -246695 -220526 -275419 -180310 -276606 -407200 -295867
16819 -295867 -221969 -210326 -160667 -41573 -87440 -229361 -210204 -189463 -30458 52054 27179
16808 27179 32465 -2090 -77623 -247348 -254689 -160166 43696 68821 1720 -23116 -11322 218486
16796 218486 330980 229983 246695 59596 80460 -104894 -282183 -294765 -322774 -297850
16786 -297850 -301798 -391070 -327055 -75921 -2661 -12759 -63891 -170910 -173254 -11812 16333
$$ packed form
16861b3953k74474J45636J54598l2550j09230j59279N3960r8603q3302J61832
16851b65365L03407J43359N8168L8320N0967j75736j34317L0622R8965J52652
16841C01042J580K9807n2544j08429k07654k2734n2220j7327o214l4995N1554
16830a18134N8824q6666q4402l201j3116K6169n4893R5109r6296j30594J11333
16819b95867P3898J1643M9659J19094m5867j41921J9157K0741J59005Q2512k4875
16808B7179N286l4555p5533j69725p341R4523K03862K5125o7101k4836J1794K29808
16796B18486J12494j00997J6712j87099K0864j85354j77289j2582k8009K4924
16786b97850l948q9272O4015K51134P3260j0098n1132j07019k344J61442K8145
$$ plain form
16775 16333 102753 137017 95925 76263 -145904 -283316 -167315 -123368 -1494 25630 85795
16764 85795 90920 -3808 52380 -27875 -104303 18708 123447 145980 117124 -61498 -163986
16753 -163986 -117903 -90772 -74709 -169063 -96021 13344 -24897 -174734 -179424 -254025 -104715
16742 -104715 -11328 -175624 -152428 -128847 -197756 -245083 -293330 -339610 -336538 -442777 -382510
16731 -382510 -370426 -259440 -65341 -144696 -180033 -174039 -158923 -213251 -131370 3432 106452
16720 106452 17386 86968 64734 -84403 -71605 21561 11595 -9215 -75318 -174846 -207605
16709 -207605 -47407 43650 43779 -133248 -133054 51544 202247 168935 87326 138286 232141
16698 232141 50296 15545 231804 321972 240640 96776 53566 -16099 101477 167205 151556
$$ packed form
16775A6333Q6420L4264m1092j9662k22167j37412J16001M3947J21874K7124O0165
16764H5795N125r4728N6188q0255p6428J23011J04739K2533k8856j78622j02488
16753a63986M6083K7131J6063r4354P3042J09365l8241j49837m690p4601J49310
16742a04715R3387j64296K3196K3581o8909m7327m8247m6280L072j06239O0267
16731c82510J2084J10986J94099p9355l5337N994J5116n4328Q1881J34802J03020
16720A06452q9066O9582k2234j49137J2798R3166r966k0810o6103r9528l2759
16709b07605J60198R1057J29j77027J94J84598J50703l3312q1609N0960R3855
16698B32141j81845l4751K16259R0168q1332j43864m3210o9665J17576O5728j5649
$$ plain form
16687 151556 8430 21239 91195 44401 78090 -33701 -209522 -88264 -58359 -43023 -165448
16676 -165448 -231261 -206507 -152864 -82305 -63145 -291655 -271560 -259702 -307321 -103293 -68820
16665 -68820 -70064 72628 -80345 -110367 -179274 -141625 -113954 -81565 -99904 -203140 -92392
16654 -92392 55094 89658 31891 -173001 -177039 3157 -63163 -257160 -304296 -131795 64077
16643 64077 79151 -39958 -124289 -175541 -88002 -82580 -131878 26519 149811 147704 235687
16632 235687 214402 -10951 -167598 -238635 -248017 -280519 -320431 -158709 -49439 46937 128188
16621 128188 -82750 18892 -39462 -217568 -121130 246315 363039 438052 421413 293696
16611 293696 145 -119099 -66532 -55040 -53605 -63279 -87660 46510 71973 87889 66389
$$ packed form
16687A51556j43126J2809O9956m6794L3689j11791j75821J21258K9905J5336j22425
16676a65448o5813K4754N3643P0559J9160k28510K0095J1858m7619K04028L4473
16665f8820j244J42692j52973l0022o8907L7649K7671L2389j8339j03236J10748
16654i2392J47486L4564n7767k04892m038J80196o6320j93997m7136J72501J95872
16643F4077J5074j19109q4331n1252Q7539N422m9298J58397J23292k107Q7983
16632B35687k1285k25353j56647p1037r382l2502l9912J61722J09270R6376Q1251
16621A28188k10938J01642n8354j78106R6438L67445J16724P5013j6639j27717
16611B93696k93551j19244N2567J1492J435r674k4381J34170K5463J5916k1500
$$ plain form
16600 66389 -46687 4288 -18184 53142 60157 -128811 -183471 -94930 -33266 -26415 -56834 21546
16588 21546 67347 1507 154286 306499 137085 -201573 -295673 -248163 -180247 -264374 -211082
16577 -211082 -52050 40828 175359 64219 -154222 -225718 -83920 38321 10455 80327
16567 80327 73682 214659 204281 283186 368644 259705 126989 139966 120961 66377 103703
16556 103703 -162562 -176684 -22920 934 -126036 -272644 -446564 -408115 -328170 -311616
16546 -311616 -142285 29833 86475 12900 19445 -5591 -91248 -123211 -260880 -178558 -113905
16535 -113905 -36531 -113366 -274601 -219293 93483 74750 -13703 81915 249861 274857 200464
16524 200464 243173 219373 -2056 -54416 -78306 -39183 97370 22572 -223673 -110219 -24
$$ packed form
16600F6389j13076N0975k2472P1326P015j88968n4660Q8541O1664O851l0419P8380
16588B1546M5801o5840J52779J52213j69414l38658r4100M7510O7916q4127N3292
16577b11082J59032R2878J34531j11140k18441p1496J41798J22241k7866O9872
16567H0327o645J40977j0378P8905Q5458j08939j32716J2977j9005n4584L7326
16556A03703k66265j4122J53764K3854j26970j46608j73920L8449P9945J6554
16546c11616J69331J72118N6642p3575O545k5036q5657l1963j37669Q2322O4653
16535a13905P7374p6835j61235N5308L12776j8733q8453R5618J67946K4996p4393
16524B00464M2709k3800k21429n2360k3890L9123J36553p4798k46245J13454J10195
$$ plain form
16513 -24 -89047 -14827 -553 41855 35426 -4616 -5735 7540 -21952 -100497 -238264 -401258
16501 -401258 -285747 -109138 40164 69942 -12772 5173 121731 -44664 -219682 -293507
16491 -293507 -150690 -9002 -162541 -132691 10689 40197 2983 23136 -33792 -84824 -229561
16480 -229561 -207671 -306594 -270974 -226601 -334698 -377955 -317712 -183162 -110410 -149135 3925
16469 3925 136451 170363 114984 80400 44967 -81964 -179863 -70611 144548 283081 220079
16458 220079 101546 -58997 99657 109200 -120989 -220600 -234136 -187628 -271599 -347751 -366470
16447 -366470 -298320 -120204 -128979 -199962 -277318 -326029 -283910 -57726 50204 -195615 -337392
16436 -337392 -431758 -378317 -282707 -121537 115214 110698 74736 130889 59826 104952 -32068
$$ packed form
16513b4q9023P4220J4274M2408o429m0042j119J3275k9492p8545j37767j62994
16501d01258J15511J76609J49302K9778q2714J7945J16558j66395j75018p3825
16491b93507J42817J41688j53539K9850J43380K9508l7214K0153n6928n1032j44737
16480b29561K1890r8923L5620M4373j08097m3257O0243J34550P2752l8725J53060
16469C925J32526L3912n5379l4584l5433j26931r7899J09252K15159J38533o3002
16458B20079j18533j60543J58654R543k30189r9611j3536M6508q3971p6152j8719
16447c66470O8150J78116q775p0983p7356m8711M2119K26184J07930k45819j41777
16436c37392r4366N3441R5610J61170K36751m516l5962N6153p1063M5126j37020
$$ plain form
16425 -32068 -95978 -154411 -315228 -369875 -338858 -182605 -217110 -316235 -34914 16893 11088
16414 11088 -863 14785 63225 -175497 -282811 -153775 -229087 -100482 -23757 24987 -11817
16403 -11817 -47449 -76866 -78739 -105075 -375238 -462152 -247168 -115595 -173942 -133598 -137415
16392 -137415 -207798 -105775 -65354 -70833 -36236 -47267 -61739 -179921 -128027 -108374 -163643
16381 -163643 -44424 45648 -22879 -51403 -85630 -105943 130901 199215 28434 160157 231807
16370 231807 225611 265761 236087 79157 88866 234267 275488 235487 103942 71178 99129
16359 99129 45458 -6012 -80289 -81208 -54358 22183 41002 -13340 14032 -87687 -82280 -181651
16347 -181651 -177859 -64081 -28950 -196545 -301640 -155996 -97413 -166705 -113703 73119 165637
$$ packed form
16425c2068o3910n8433j60817n4647L1017J56253l4505r9125K81321N1807n805
16414A1088j1951J5648M8440k38722j07314J29036p5312J28605P6725M8744l6804
16403a1817l5632k9417j873k6336k70163q6914K14984J31573n8347M0344l817
16392a37415p0383J02023M0421n479L4597j1031j4472j18182N1894J9653n5269
16381a63643J19219R0072o8527k8524l4227k0313K36844O8314j70781J31723P1650
16370B31807o196M0150k9674j56930R709J45401M1221m0001j31545l2764K7951
16359I9129n3671n1470p4277r19K6850P6541J8819n4342K7372j01719N407r9371
16347a81651L792J13778L5131j67595j05095J45644N8583o9292N3002J86822R2518
$$ plain form
16336 165637 149473 50369 -101886 -153671 -66984 -94654 17271 -28304 -262863 -319281 -63734
16325 -63734 16414 50696 31313 44464 -52343 -125402 -48942 1236 210999 339041 297751
16314 297751 180517 148679 91503 -13272 -38466 -95305 -181617 -254633 -344825 -312704 -202210
16303 -202210 -52044 -126300 -276788 -255250 -40363 -57502 -52761 -195161 -154588 -184577 -201417
16292 -201417 -210072 -71276 -77043 -160148 -191467 -62062 102482 -36857 -189800 -185490 -229078
16281 -229078 -459774 -300426 -117255 -155700 -324214 -342243 -174829 35010 -76322 -64029
16271 -64029 9675 -10357 27304 138801 119119 117928 74344 152741 243497 194429 16206
16260 16206 60853 104882 51314 99852 221449 239333 200622 114188 98825 155689 245859
$$ packed form
16336A65637j6164r9104j52255n1785Q6687k7670J11925m5575k34559n6418K55547
16325f3734Q0148L4282j9383J3151r6807p3059P6460N0178K09763J28042m1290
16314B97751j17234l1838n7176j04775k5194n6839q6312p3016r0192L2121J10494
16303b02210J50166p4256j50488K1538K14887j7139M741j42400M0573k9989j6840
16292b01417q655J38796n767q3105l1319J29405J64544j39339j52943M310m3588
16281b29078k30696J59348J83171l8445j68514j8029J67414K09839j11332J2293
16271f4029P3704k0032L7661J11497j9682j191m3584P8397R0756m9068j78223
16260A6206M4647M4029n3568M8538J21597J7884l8711q6434j5363N6864R0170
$$ plain form
16249 245859 97486 -37290 7623 73319 -68320 -157122 20290 100670 107179 77642 -33844
16238 -33844 16384 -31438 -191322 -180378 -103717 25983 71914 73361 108808 179652 267943
16227 267943 421973 370687 302578 51451 -17792 -105978 -239747 -164089 -80449 34426 100769
16216 100769 139903 85504 -56926 -100956 -18455 90345 154087 117483 -6395 -289001 -365532
16205 -365532 -208230 -73262 -55368 -79268 -133966 -107567 -43401 47897 164297 119780 169619
16194 169619 183809 246133 256220 181582 52232 -35957 -111900 -107489 -56108 -16128 59234
16183 59234 85164 60468 -80005 -1330 -186173 -459834 -445413 -241638 26330 126451
16173 126451 124334 23435 -214847 -323818 -334492 -162864 -52070 -64422 -48305 -45793 -50553
$$ packed form
16249B45859j48373j34776M4913O5696j41639q8802J77412Q0380O509k9537j11486
16238c3844N0228m7822j59884J0944P6661J29700M5931J447L5447P0844Q8291
16227B67943J54030n1286o8109k51127o9243q8186j33769P5658Q3640J14875O6343
16216A00769L9134n4399j42430m4030Q2501J08800O3742l6604j23878k82606p6531
16205c65532J57302J34968J7894k3900n4698K6399O4166R1298J16400m4517M9839
16194A69619J4190O2324J0087p4638j29350q8189p5943M411N1381L9980P5362
16183E9234K5930k4696j40473P8675j84843k73661J4421K03775K67968J00121
16173A26451k117j00899k38282j08971j0674J71628J10794j2352J6117K512m760
$$ plain form
16162 -50553 -29780 -32791 -102406 -114540 -180805 -260799 -234246 6170 11645 -52250 -86722 -141105
16150 -141105 -88581 -163812 -210390 -283662 -211442 -151408 -138664 -134584 -218178 -148661 -51268 -24906
16138 -24906 -70069 5041 -32035 -135446 -7224 284544 216776 -119287 47210 -25698 -275862
16127 -275862 -382522 -218165 -81900 -49823 -99098 -117393 -10768 79635 49217 32333 -16389
16116 -16389 -141181 -95894 120680 146937 99497 45010 -40007 8883 26722 37006 12680
16105 12680 -83512 -243876 -135654 -106786 -121598 -55100 70143 -101939 -197307 -6610 27745
16094 27745 -45836 -74596 -22439 -117305 86710 176340 44992 -166984 -14079 103160 38016
16083 38016 -48733 -162742 -468911 -579959 -561628 -448952 -288657 -27111 35039 -42868
$$ packed form
16162e0553K0773l011o9615j2134o6265p9994K6553K40416N475o3895l4472n4383
16150a41105N2524p5231m6578p3272P2220O0034J2744M080q3594O9517R7393K6362
16138b4906m5163P5110l7076j03411J28222K91768o7768l36063J66497p2908k50164
16127b75862j06660J64357J36265L2077m9275j8295J06625R0403l0418j6884m8722
16116a6389j24792M5287K16574K6257m7440n4487q5017M8890J7839J0284k4326
16105A2680r6192j60364J08222K8868j4812O6498J25243j72082r5368J90697L4355
16094B7745p3581k8760N2157r4866K04015Q9630j31348k11976J52905J17239o5144
16083C8016q6749j14009l06169j11048J8331J12676J60295K61546O2150p7907
$$ plain form
16073 -42868 -24450 -11521 -96290 -325016 -309428 -282157 -351030 -283149 -157509 -183443 -181885
16062 -181885 -165913 -58088 -29444 -208262 -112040 -5087 -6431 -96789 -189465 -28981 17386
16051 17386 -52193 -34945 -120859 -5576 57481 18123 -50068 -123635 -119161 -199930 -74293
16040 -74293 164384 83647 49420 4498 -18289 -65496 -103416 -96481 -146127 -13244 50107
16029 50107 176833 18447 -101816 46745 161407 206828 253472 112053 -48092 -115887
16019 -115887 -47411 27312 43614 -50015 -77142 -244931 -198754 -128410 -84477 -54343 -183984
16008 -183984 -125025 -23574 -8813 -53621 -116468 -127397 -245576 -27213 -43829 -58134 -117931
15997 -117931 -127820 -2866 117464 120320 103863 8978 73829 101783 -190868 -348180 -258578
$$ packed form
16073d2868J8418J2929q4769k28726J5588K7271o8873O7881J25640k5934J558
16062a81885J5972J07825K8644j78818R6222J06953j344r0358r2676J60484M6367
16051A7386o9579J7248q5914J15283O3057l9358o8191p3567M474q0769J25637
16040g4293K38677q0737l4227m4922k2787m7207l7920O935m9646J32883O3351
16029E0107J26726j58386j20263J48561J14662M5421M6644j41419j60145o7795
16019a15887O8476P4723J6302r3629k7127j67789M6177P0344M3933L0134j29641
16008a83984N8959J01451J4761m4808o2847j0929j18179K18363j6616j4305n9797
15997a17931r889J24954J20330K856j6457r4885O4851K7954k92651j57312Q9602
$$ plain form
15986 -258578 -183196 -95006 -96432 8376 27890 31153 178041 211709 135683 125554 154043
15975 154043 245416 254294 215332 266314 181956 165303 117809 143125 115369 3051 71704
15964 71704 169936 -12001 -107849 42287 83248 -185117 -226012 -135861 -116807 -46417 61998
15953 61998 -23521 -31857 -160746 -284024 -244223 -134145 -166504 -218845 -315392 -228153 -178332
15942 -178332 -261443 -244706 -194463 -209912 -220914 -125883 -139087 -253273 -168029 -69609 -168376
15931 -168376 -282963 -17184 77122 135047 94617 -135579 -383909 -376122 -233502 -118671
15921 -118671 9765 128890 261056 239606 220363 51957 11136 -3924 -65958 -61004 -138257
15910 -138257 -178494 -229555 -181823 -110370 -158897 -206434 -134507 -147310 -166209 -329190 -388125
$$ packed form
15986b58578P5382Q8190j426J04808J9514L263J46888L3668p6026j0129K8489
15975A54043R1373Q878l8962N0982q4358j6653m7494K5316k7756j12318O8653
15964G1704R8232j81937r5848J50136M0961k68365m0895R0151J9054P0390J08415
15953F1998q5519q336j28889j23278L9801J10078l2359n2341r6547Q7239M9821
15942a78332q3111J6737N0243j5449j1002R5031j3204j14186Q5244R8420r8767
15931a68376j14587K65779R4306N7925m0430k30196k48330P787J42620J14831
15921a18671J28436J19125J32166k1450j9243j68406m0821j5060o2034M954p7253
15910a38257m0237n1061M7732P1453m8527m7537P1927j2803j8899j62981n8935
$$ plain form
15899 -388125 -412342 -362790 -161290 -67099 -27416 68963 -26410 -108228 -132986 -149210 -164924
15888 -164924 -107587 132521 193847 80080 120526 104229 -8878 1150 -50473 14792 44767
15877 44767 56711 62763 -19396 -212467 -237459 -49757 -33741 -195 99439 53278 46699 46145
15865 46145 -133460 -206866 -60552 92232 111434 72530 41323 -30601 22745 131495 109276
15854 109276 72658 -2169 -14039 130128 124616 226783 73540 142262 179771 201798 383392
15843 383392 431926 434514 177744 7605 22211 209016 206590 28193 -30804 -57622 -195979
15832 -195979 -142511 -123741 -43261 188653 198993 98139 -5233 -43043 -112978 -111694 -123422
15821 -123422 -22722 115014 48727 -83386 -57119 -119150 -206399 -161511 11704 144491
$$ packed form
15899c88125k4217M9552K01500R4191L9683R6379r5373q1818k4758j6224j5714
15888a64924N7337K40108O1326j13767M0446j6297j13107J0028n1623O5265K9975
15877D4767J1944O052q2159j93071k4992J87702J6016L3546R9634m6161o579n54
15865D6145j79605p3406J46314J52784J9202l8904l1207p1924N3346J08750k2219
15854A09276l6618p4827j1870J44167n512J02167j53243O8722L7509K2027J81594
15843C83392M8534K588k56770j70139J4606J86805k426j78397n8997k6818j38357
15832a95979N3468J8770Q0480K31914J0340j00854j03372l7810o9935J284j1728
15821a23422J00700J37736o6287j32113K6267o2031q7249M4888J73215J32787
$$ plain form
15811 144491 -89456 -179614 -195309 -94099 -2144 131735 75511 30276 -88941 -94743 33045
15800 33045 141445 172517 46072 231955 316935 146992 185870 190773 48353 -8931 -88540
15789 -88540 -94381 -91543 -87840 -179148 -280635 -213785 -278504 -164663 146370 149944 -74539 46537
15777 46537 170835 162825 -13961 -151502 -241690 -199060 -233013 -242427 -262855 -284491 -281081 -110640
15765 -110640 8848 -9543 -171016 -229247 -402917 -351117 -207096 -77941 -99568 -178704
15755 -178704 -188666 -102239 -92845 16538 -32484 -82287 -40014 35866 22106 -162357 -206551
15744 -206551 -109097 -20998 -55448 -304576 -311918 -166056 -88247 -137926 -140881 -194420 -199937 -160506
15732 -160506 -180839 -240410 -226671 -232835 -269850 -195914 -56453 52083 17465 -135583 -188490
$$ packed form
15811A44491k33947r0158j5695J01210R1955J33879n6224m5235j19217n802J27788
15800C3045J08400L1072j26445J85883Q4980j69943L8878M903j42420n7284p9609
15789h8540n841K838L703r1308j01487O6850o4719J13841L11033L574k24483J21076
15777D6537J24298q010j76786j37541r0188M2630l3953r414k0428k1636L410J70441
15765a10640J19488j8391j61473n8231j73670N1800J44021J29155k1627p9136
15755a78704r962Q6427R394J09383m9022m9803M2273P5880j3760j84463m4194
15744b06551R7454Q8099l4450k49128p342J45862P7809m9679k955n3539n517L9431
15732a60506k0333n9571J3739o164l7015P3936J39461J08536l4618j53048n2907
$$ plain form
15721 -188490 -220809 -259909 -414278 -439855 -308108 -325310 -6440 171644 53174 -69306
15711 -69306 -143987 -117310 -8591 20630 128739 422531 360917 300806 297612 105043 -57448
15700 -57448 -65869 -96460 -216834 -354221 -247779 -50917 65854 -13384 1685 79138 12022
15689 12022 -36884 36619 35037 -9728 -13005 72289 -183878 -175363 -106648 -86866 -185482 -247036
15677 -247036 -351436 -327771 -232447 -329454 -223656 -169833 -320310 -315907 -317805 -285710 -105174
15666 -105174 -34653 -92890 -157438 -342640 -388870 -306317 -165502 -173328 -126529 -191965 -85202
15655 -85202 42487 -123595 -284605 -279527 -11712 36304 -22298 -46420 -1745 -28518 -28978
15644 -28978 93380 179999 188109 -8081 20067 -128920 -78402 -133345 -176945 -25441 9912
$$ packed form
15721a88490l2319l9100j54369k5577J31747j7202L18870J78084j18470j22480
15711f9306p4681K6677J08719K9221J08109K93792o1614o0111l194j92569j62491
15700e7448q421l0591j20374j37387J06442J96862J16771p9238J5069P7453o7116
15689A2022m8906P3503j582m4765l277Q5294k56167Q515O8715J9782r8616o1554
15677b47036j04400K3665R5324r7007J05798N3823j50477M403j898L2095J80536
15666a05174P0521n8237o4548j85202m6230Q2553J40815p826M6799o5436J06763
15655h5202J27689j66082j61010N078K67815M8016n8602k4122M4675k6773m60
15644b8978J22358Q6619Q110j96190K8148j48987N0518n4943m3600J51504L5353
$$ plain form
15633 9912 -2538 -28557 -164341 -217906 -5471 54686 34611 98622 175486 138763 124169
15622 124169 31310 66810 173065 475664 580909 374397 270869 144604 -179175 -383972
15612 -383972 -326518 -148506 -159128 -189214 -115428 -163329 -158659 -241506 -78236 53120 32971
15601 32971 -70473 -213049 -308486 -474982 -293063 -283245 -119325 -38481 -68343 97210 -66768
15590 -66768 -142756 -173858 -114429 -28201 -56981 -29477 37326 -18209 -119856 -38513 115163
15579 115163 -21128 -273116 -308636 -184780 -43627 46957 -40003 -179907 -170663 -102958 -251593
15568 -251593 -313375 -206806 -71048 -41101 -90948 -25023 47765 4560 52809 173119 115821
15557 115821 -33263 49555 123262 251157 79509 -52693 -353913 -417429 -276072 -238335
$$ packed form
15633I912j2450k6019j35784n3565K12435O0157k0075O4011P6864l6723j4594
15622A24169r2859L5500J06255L02599J05245k06512j03528j26265l23779k04797
15612c83972N7454J78012j0622l0086P3786m7901M670q2847J63270J31356k0149
15601C2971j03444j42576r5437j66496J81919R818J63920Q0844k9862J65553j63978
15590f6768p5988l1102N9429Q6228k8780K7504O6803n5535j01647Q1343J53676
15579A15163j36291k51988l5520J23856J41153R0584q6960j39904R244O7705j48635
15568b51593o1782J06569J35758K9947m9847O5925P2788m3205M8249J20310n7298
15557A15821j49084Q2818P3707J27895j71648j32202l01220o3516J41357L7737
$$ plain form
15547 -238335 -242244 -130854 -97509 -36643 -90810 -1203 84505 66746 68615 -29443 11539 -6173
15535 -6173 -99428 -126648 1548 4425 -12152 29524 -34466 9305 65933 87971 -43250 58708
15523 58708 -130768 -272370 -345581 -334919 -234245 -241016 -319119 -273841 -189973 44760 -25410
15512 -25410 4215 -31118 -100421 -194871 -229783 -134395 -13839 31573 45507 14795 85937
15501 85937 -5905 -23479 84624 -117337 -80091 18609 66953 -26450 36737 14423 -53280
15490 -53280 -269030 -144773 -187625 -272883 -330479 -377204 -235517 72358 144600 174436 105301
15479 105301 54862 -50529 -195659 -208778 -110021 10113 58164 22153 -26843 -71272 -86691
15468 -86691 -157877 -145310 -124692 -2726 19756 -50054 -91574 -64708 72668 271799 411924
$$ packed form
15547b38335l909J11390L3345O0866n4167Q9607Q5708j7759J869r8058M0982j7712
15535f173r3255k7220J28196K877j6577M1676o3990M3771N6628K2038j31221J01958
15523E8708j89476j41602p3211J0662J00674o771p8103M5278Q3868K34733p0170
15512b5410K9625l5333o9303r4450l4912R5388J20556M5412J3934l0712P1142
15501H5937r1842j7574J08103k01961L7246R8700M8344r3403O3187k2314o7703
15490e3280k15750J24257m2852q5258n7596m6725J41687L07875P2242K9836o9135
15479A05301n0439j05391j45130j3119R8757J20134M8051l6011m8996m4429j5419
15468h6691p1186J2567K0618J21966K2482o9810m1520K6866J37376J99131J40125
$$ plain form
15457 411924 311174 212761 325745 356180 203909 20462 109250 178184 100488 109380 105859
15446 105859 31676 117144 95959 17275 -61813 -142568 -123631 -162161 -130925 -145779 -208046
15435 -208046 -140956 111827 205650 143991 30250 -48232 27429 -20034 -91135 -16563 87098
15424 87098 14572 -8390 108023 46204 -7442 -16643 20204 15141 -144162 -78246 -49740 -187085
15412 -187085 -126502 -139175 15208 77697 21188 -167240 -296857 -357230 -315217 -200850 -125348
15401 -125348 -161773 -282297 -269310 -263486 -249301 -380272 -389953 -316285 -248354 -213004 -183451
15390 -183451 -191210 -169046 -31851 -94575 -102804 -133816 -143447 -119635 -46729 -165437 -73468 19776
15378 19776 90483 8203 -12072 33057 122728 152292 233109 124125 -10499 47093 107927
$$ packed form
15457D11924j00750r8413J12984L0435j52271j83447Q8788O8934p7696Q892l521
15446A05859p4183Q5468k1185p8684p9088q0755J8937l8530L1236j4854o2267
15435b08046O7090K52783R3823o1659j13741p8482P5661m7463p1101P4572J03661
15424H7098p2526k2962J16413o1819n3646r201L6847n063j59303O5916K8506j37345
15412a87085O0583j2673J54383O2489n6509j88428j29617o0373M2013J14367P5502
15401a25348l6425j20524J2987N824J4185j30971r681P3668O7931L5350K9553
15390a83451p759K2164J37195o2724q229l1012r631K3812P2906j18708R1969R3244
15378A9776P0707q2280k0275M5129Q9671K9564Q0817j08984j34624N7592O0834
$$ plain form
15367 107927 20091 -147555 -120899 -11646 221399 269339 -3720 -192831 -127160 -153418
15357 -153418 -279023 -261260 -266268 -267777 -256035 -254653 -126045 -218470 -167610 29144 -95541
15346 -95541 -121105 -157226 -167810 -247516 -357018 -381416 -405230 -237023 -194416 -103942 -224881
15335 -224881 -260156 32552 140511 243624 5997 -44628 92331 61233 134658 319662
15325 319662 451345 331840 235440 119185 -70926 -160857 103319 173236 -143680 -323704
15315 -323704 -348743 -317286 -199159 -127873 -184027 -262803 -205287 -90040 -7268 -15789 2645
15304 2645 121189 54449 -232934 -360386 -211441 -3729 134536 145278 145130 50755 -119345
15293 -119345 -51766 126781 58246 -120497 -66368 24830 -21215 -112429 -38659 -64772 -87964
$$ packed form
15367A07927q7836j67646K6656J09253K33045M7940k73059j89111O5671k6258
15357a53418j25605J7763n008j509J1742J382J28608r2425N0860J96754j24685
15346i5541k5564l6121j0584p9706j09502k4398k3814J68207M2607R0474j20939
15335b24881l5275K92708J07959J03113k37627n0625J36959l1098P3425J85004
15325C19662J31683j19505r6400j16255j90111q9931K64176O9917l16916j80024
15315c23704k5039L1457J18127P1286n6154p8776N7516J15247Q2772q521J8434
15304B645J18544o6740k87383j27452J48945K07712J38265J0742j48r4375j70100
15293a19345O7579J78547o8535j78743N4129R1198m6045r1214P3770k6113k3192
$$ plain form
15282 -87964 -145949 -159308 -131223 -78760 -50582 63141 138167 163505 167157 41538 156016
15271 156016 308741 249101 82947 -13258 -38280 -43680 35718 3943 -156153 -235160 -158211
15260 -158211 -47049 7215 -15726 144291 174550 155082 266411 292308 142641 21616
15250 21616 -88800 -239957 -276432 19730 212201 175127 41521 -93145 -214400 -260031
15240 -260031 -90146 20478 63869 -170401 -264619 -220522 -166767 -159835 -165876 -124513 -184469
15229 -184469 -156551 -217912 -134081 -53499 -60034 -167751 -267447 -102477 -3740 -56895 -64914
15218 -64914 -21461 109639 33965 -113428 -103136 -48029 55359 15568 -229453 -308295 -225400
15207 -225400 -75100 -106574 -34031 -2256 -152805 -217776 -116474 -231894 -55437 -35204
$$ packed form
15282h7964n7985j3359K8085N2463K8178J13723P5026K5338L652j25619J14478
15271A56016J52725n9640j66154r6205k5022n400P9398l1775j60096p9007P6949
15260a58211J11162N4264k2941J60017L0259j9468J11329K5897j49667j21025
15250B1616j10416j51157l6475K96162J92471l7074j33606j34666j21255m5631
15240b60031J69885J10624M3391k34270r4218M4097N3755O932o041M1363n9956
15229a84469K7918o1361Q3831Q0582o535j07717r9696J64970R8737n3155q019
15218f4914M3453J31100p5674j47393J0292N5107J03388l9791k45021p8842Q2895
15207b25400J50300l1474P2543L1775j50549o4971J01302j15420J76457K0233
$$ plain form
15197 -35204 -107513 -123314 29515 41029 -96120 -117531 -240562 -323793 -328225 -170009 54703
15186 54703 168208 256938 192633 35237 -67361 -29667 31218 136274 -97641 -230466
15176 -230466 -176097 -33109 170829 223211 252679 166866 135934 117174 132077 196896 10390
15165 10390 -143162 -80760 -32921 -91839 -91400 -91935 -211220 22166 157922 157247 44695 -20628
15153 -20628 25504 -188402 -341241 -180704 -141207 -176370 -86592 81868 -27088 -163574
15143 -163574 25459 88535 -11311 -74917 -143113 -38465 100135 -104116 -63585 -49006 -146491
15132 -146491 -168965 -79296 138466 178550 271182 69052 -209752 -222125 102527 79128 80493
15121 80493 19696 -56117 30272 129041 -19090 -57281 -133758 -97570 -136516 -142120 55175
$$ packed form
15197c5204p2309j5801J52829J1514j37149k1411j23031q3231m432J58216K24712
15186E4703J13505Q8730o4305j57396j02598L7694O0885J05056k33915j32825
15176b30466N4369J42988K03938N2382K9468q5813l0932j8760J4903O4819j86506
15165A0390j53552O2402M7839n8918M39n35j19285K33386J35756o75j12552o5323
15153b0628M6132k13906j52839J60537L9497l5163Q9778J68460j08956j36486
15143a63574J89033O3076r9846o3606o8196J04648J38600k04251M0531J4579r7485
15132a46491k2474Q9669K17762M0084R2632k02130k78804j2373L24652k3399J365
15121H0493o0797p5813Q6389R8769j48131l8191p6477L6188l8946n604J97295
$$ plain form
15110 55175 130971 34614 46024 -25293 -141888 -244532 -388267 -329855 -232269 -327583 -388411
15099 -388411 -361497 -239830 -199620 -71782 -140347 -137229 97634 59738 -102206 -15550 -21577
15088 -21577 -239288 -193793 -337594 -331394 -113436 -106005 -149416 -96437 -14962 -114137 -139994
15077 -139994 94812 161764 276844 183073 -18056 -106349 -131195 -128814 -177445 -115504 -220104
15066 -220104 -212211 -272389 -273297 -315254 -189084 -124680 -202905 -57401 -87839 76187 30534
15055 30534 41411 14802 -137373 -85274 -67618 -158701 2654 130074 -60839 -111314 -154855
15044 -154855 -234112 -132419 -67877 41530 72844 -83989 -94720 -120571 -177430 -398132 -515076
15033 -515076 -449344 -330554 50927 188155 135709 -1917 -147417 -79352 -34377 66883
$$ packed form
15110E5175P5796r6357J1410p1317j16595j02644j43735N8412R7586r5314o0828
15099c88411K6914J21667M0210J27838o8565L118K34863l7896j61944Q6656o027
15088b1577k17711M5495j43801O200K17958P431m3411N2979Q1475r9175k5857
15077a39994K34806O6952J15080r3771k01129q8293k4846K381m8631O1941j04600
15066b20104P893o0178r08m1957J26170O4404p8225J45504l0438J64026m5653
15055C0534J0877k6609j52175N2099J7656r1083J61355J27420j90913n0475m3541
15044a54855p9257J01693O4542J09407L1314j56833j0731k5851n6859k20702j16944
15033e15076O5732J18790L81481J37228n2446j37626j45500O8065M4975J01260
$$ plain form
15023 66883 172748 219125 179825 -115243 -130848 47196 126999 37455 -24038 -53158 -201000
15012 -201000 -230640 -275767 -217600 -179152 -241027 -242306 -52873 10788 9784 -2282 161062
15001 161062 213875 175236 94158 63706 98035 179694 -69668 -249269 -230137 -82670 -34788
14990 -34788 55174 31325 -34136 -179860 -165074 -121223 -41053 -1175 16046 8480 37974 106129
14978 106129 159336 30571 -19143 -118846 -88729 -121928 29796 85686 121804 82691 110463
14967 110463 177465 78627 -56823 -208852 -220714 -149725 -66649 -93998 -102249 -159439 -15272
14956 -15272 164646 170549 155446 90414 46320 122389 70328 66459 -35629 -11361 77175 -40366
14944 -40366 -57765 -2743 129735 71772 -98582 -245154 -300031 -181251 -125867 -240943 -424013
$$ packed form
15023F6883J05865M6377l9300k95068j5605J78044P9803q9544o1493k9120j47842
15012b01000k9640m5127N8167L8448o1875j279J89433O3661j004j2066J63344
15001A61062N2813l8639q1078l0452L4329Q1659k49362j79601J9132J47467M7882
14990c4788Q9962k3849o5461j45724J4786M3851Q0170L9878J7221p566K9494O8155
14978A06129N3207j28765m9714r9703L0117l3199J51724N5890L6118l9113K7772
14967A10463O7002r8838j35450j52029j1862P0989Q3076k7349q251n7190J44167
14956a5272J79918N903j5103o5032m4094P6069n2061l869j02088K4268Q8536j17541
14944d0366j7399N5022J32478n7963j70354j46572n4877J18780N5384j15076j83070
$$ plain form
14933 -424013 -467032 -213109 110661 194035 229455 222277 144595 -3583 68749 200585 292047
14922 292047 78953 -256333 -381283 -200065 -3014 -6325 -130212 -16366 310157 263652
14912 263652 89634 -22390 -61644 -158268 -244336 -208223 -85377 -170271 -335271 -428228 -492009
14901 -492009 -344999 -429241 -337297 -309827 -235905 -392340 -342869 -248091 -187249 -79087 -21089
14890 -21089 -124030 -262226 -91846 58253 -54126 -89742 -100285 -275022 -247725 -232267
14880 -232267 -104625 -17526 -28575 -51984 82477 53385 86486 184434 36481 -187238 -280697
14869 -280697 -41669 83089 -13751 -88426 -215266 -154432 -153876 -255382 -195597 -222625 -112146
14858 -112146 194487 63426 -202038 -266403 -139951 35795 38981 87229 135841 87050 62833
$$ packed form
14933d24013m3019K53923L23770Q3374L5420p178p7682j48178P2332J31836R1462
14922B92047k13094l35286j24950J81218J97051l311j23887J13846L26523m6505
14912B63652j74018j12024l9254r6624q6068L6113J22846q4894j65000r2957o3781
14901d92009J47010q4242R1944K7470P3922j56435M9471R4778O0842J08162N7998
14890b1089j02941j38196J70380J50099j12379l5616j0543j74737K7297J5458
14880b32267J27642Q7099j1049k3409J34461k9092L3101R7948j47953k23719r3459
14869b80697K39028J24758r6840p4675j26840O0834N56j01506N9785k7028J10479
14858a12146L06633j31061k65464o4365J26452J75746L186M8248M8612m8791k4217
$$ plain form
14847 62833 -45350 -82918 -45711 4865 113404 187526 232444 55032 -128264 -217545 -134094
14836 -134094 -37816 117251 27071 -69101 123983 265352 189937 -75386 -6259 65461 29961
14825 29961 113176 172083 -17991 -138570 -225199 -264576 -251699 -255072 -189976 13260 151969
14814 151969 19449 -91662 -114762 -229904 -173716 -398658 -483359 -402184 -271812 -106821
14804 -106821 -92622 -191482 -149746 -140506 -193280 -12527 7890 -131186 -56107 -79826 -209178
14793 -209178 -340142 -373254 -219144 -100004 -47026 -50028 -61484 32118 -59423 -92108 -311134
14782 -311134 -547724 -493287 -307487 -164906 -58715 138310 216391 97312 -122577 -22504
14772 -22504 26885 -27500 -101760 -246880 -174515 -33946 -22522 -21675 11820 -196845 -86359
$$ packed form
14847F2833j08183l7568L7207N0576J08539P4122M4918j77412j83296q9281Q3451
14836a34094R6278J55067r0180r6172J93084J41369p5415k65323O9127P1720l5500
14825B9961Q3215N8907j90074j20579q6629l9377J2877l373O5096K03236J38709
14814A51969j32520j11111k3100j15142N6188k24942q4701Q1175J30372J64991
14804a06821J4199r8860M1736R240n2774J80753K0417j39076P5079k3719j29352
14793b09178j30964l3112J54110J19140N2978l002j1456R3602r1541l2685k19026
14782c11134k36590N4437J85800J42581J06191J97025P8081j19079k19889J00073
14772b2504M9389n4385p4260j45120P2365J40569J1424Q47L3495k08665J10486
$$ plain form
14761 -86359 110805 -13148 -290115 -323899 -180941 -216711 -271146 -137430 -112723 -177357 -182393
14750 -182393 52489 198403 64935 38451 60728 -95025 -94154 -21350 19969 -91207 -235155
14739 -235155 -191850 -42056 50826 123571 22468 78748 81792 165583 215260 185195 -35201
14728 -35201 -162160 -203877 -70997 -17557 -95968 -105425 -155712 -200064 -131415 28234 148365
14717 148365 136388 263644 235998 117978 123560 46548 124307 127145 -20088 -9139 77784
14706 77784 149497 192395 50696 37792 -36668 62380 -41969 -36508 -120136 -24722 127854
14695 127854 -12673 -65103 -120769 -146086 -205483 -163413 -64885 -13672 -129165 -197306 -29302
14684 -29302 100430 77197 -145425 -152556 -131622 -103910 -42537 45858 82760 111251 219275
$$ packed form
14761h6359J97164j23953k76967l3784J42958l5770n4435J33716K4707o4634n036
14750a82393K34882J45914j33468k6484K2277j55753Q71P2804M1319j11176j43948
14739b35155M3305J49794R2882P2745j01103N6280L044Q3791M9677l0065k20396
14728c5201j26959m1717J32880N3440p8411r457n0287m4352O8649J59649J20131
14717A48365j1977J27256k7646j18020N582p7012P7759K838j47233J0949Q6923
14706G7784P1713M2898j41699j2904p4460R9048j04349N461q3628R5414J52576
14695A27854j40527n2430n5666k5317n9397M2070R8528N1213j15493o8141J68004
14684b9302J29732k3233k22622p131K0934K7712O1373Q8395L6902K8491J08024
$$ plain form
14673 219275 215459 206633 245034 124083 87387 58907 53182 -118768 -257704 -101221 146590
14662 146590 175249 154784 77157 -67174 -115609 67080 102485 2768 15440 44936 53823
14651 53823 -24656 -80686 -192776 4970 16044 -199038 -105559 -98907 -138891 -270799 -327670
14640 -327670 -228881 -78320 -115943 -256584 -227916 -358364 -479180 -394457 -419469 -181231
14630 -181231 -141309 -67977 -123736 -27386 87526 1150 -50864 -166912 -134426 -57884 -115127
14619 -115127 -56666 35649 -120513 -309746 -291001 -393639 -442340 -409882 -230660 -201509 -248658
14608 -248658 -275808 -291599 -307578 -116977 68349 161964 173347 170533 21153 -42374 -67771
14597 -67771 -13579 200398 199302 77156 88099 -15673 -142749 -171324 -216625 -228591 -284338
$$ packed form
14673B19275l816q826L8401j20951l6696k8480n725j71950j38936J56483K47811
14662A46590K8659k0465p7627j44331m8435J82689L5405r9717J2672K9496Q887
14651E3823p8479n6030j12090J97746J1074k15082R3479O652l9984j31908n6871
14640c27670R8789J50561l7623j40641K8668j30448j20816Q4723k5012K38238
14630a81231L9922P3332n5759R6350J14912q6376n2014j16048L2486P6542n7243
14619a15127N8461R2315j56162j89233J8745j02638m8701L2458J79222K9151m7149
14608b48658k7150j5791j5979J90601J85326R3615J1383k814j49380o3527k5397
14597f7771N4192K13977j096j22146J0943j03772j27076k8575m5301j1966n5747
$$ plain form
14586 -284338 -9392 147029 113670 107284 145784 302666 455006 350165 216361 264461
14576 264461 145283 -55125 -116514 -139834 -31499 -29892 -45038 -120795 -112412 -1978 -44432
14565 -44432 -8461 -64067 -71262 -69961 -78249 21639 140511 138928 -7969 -128884 -56165 -1642
14553 -1642 -39170 -39776 -101247 62071 75402 74428 52229 -58227 -14881 -5244 8102 -51821
14541 -51821 87529 196453 109895 -132741 -161745 28764 168818 227963 209300 23572
14531 23572 -108937 -17310 -41973 34657 130210 103254 140192 68303 125628 134421 -44026
14520 -44026 -17005 191294 257548 146159 233020 165347 132090 135987 18461 -12264 -142833
14509 -142833 -210824 -132501 53342 158519 -15545 -45004 -98896 -92726 -199464 -191853 -364193
$$ packed form
14586b84338K74946J56421l3359o386L8500J56882J52340j04841j33804M8100
14576B64461j19178k00408o1389k3320J08335J607j5146p5757Q383J10434m2454
14565d4432L5971n5606p195J301q288R9888J18872j583j46897j20915P2719N4523
14553a642l7528o06o1471J63318J3331r74k2199j10456M3346R637J3346n9923
14541e1821J39350J08924q6558k42636k9004J90509J40054N9145j8663j85728
14531B3572j32509R1627k4663P6630R5553k6956L6938p1889N7325Q793j78447
14520d4026K7021K08299O6254j11389Q6861o7673l3257L897j17526l0725j30569
14509a42833o7991P8323J85843J05177j74064k9459n3892O170j06738P611j72340
$$ plain form
14498 -364193 -545651 -523589 -342645 -36388 -96894 -303029 -356688 -362643 -194691 -82788
14488 -82788 -85399 -140627 -139905 -191979 -221460 -158506 -28558 -84064 -91559 -100645 42683 -109397
14476 -109397 -233801 -225359 -96354 -103279 -177752 -132636 -199862 -214024 -176949 -34713 102738
14465 102738 -35614 -89133 -107059 92722 154382 202515 140279 84662 110843 -7363 44678
14454 44678 -31487 -39274 -119742 -76832 -67151 -91684 -74853 -184794 -85814 -79001 -24681 -114662
14442 -114662 -48212 31468 184691 376144 262769 155719 211017 294226 129094 -25729
14432 -25729 -78549 -141235 -150764 -151073 -118766 -60584 3289 133479 -96679 -133809 -130035 -73891
14420 -73891 -44308 40731 162298 155260 -21347 -74913 -244505 -261240 -173115 11602 2083
$$ packed form
14498c64193j81458K2062J80944L06257o0506k06135n3659n955J67952J11903
14488h2788k611n5228P22n2074k9481O2954J29948n5506p495r086J43328j52080
14476a09397j24404Q442J29005o925p4473M5116o7226j4162L7075J42236J37451
14465A02738j38352n3519j7926J99781O1660M8133o2236n5617K6181j18206N2041
14454D4678p6165p787q0468M2910R681k4533J6831j09941R8980O813N4320q9981
14442a14662O6450P9680J53223J91453j13375j07050N5298Q3209j65132j54823
14432b5729n2820o2686r529l09L2307N8182O3873J30190k30158l7130L774N6144
14420g3891K9583Q5039J21567p038j76607n3566j69592j6735Q8125J84717r519
$$ plain form
14409 2083 -212981 -184436 30428 12512 -36931 -24308 32995 120467 32448 26277 154469
14398 154469 81216 -60392 -123110 16443 18643 135117 133006 59843 5679 129540 107626
14387 107626 309735 338679 319876 213799 179262 219820 332628 262466 164819 103704 80249
14376 80249 221636 208701 -54866 -125272 -197144 -259907 -252735 -139949 59908 50454 -130823
14365 -130823 -245246 -249190 35240 18494 -81103 -157950 -237499 -328551 -255705 -153623 -139302
14354 -139302 -28489 101924 6405 -60585 -164203 -166306 -132772 -227003 -312941 -375561 -415610
14343 -415610 -493495 -289814 -75105 9918 36145 171812 228262 80774 -141229 -90049
14333 -90049 10527 9442 -137192 -61949 -46600 -113260 19036 33348 22329 -65103 -66625
$$ packed form
14409B083k15064K8545K14864j7916m9443J2623N7303Q7472q8019o171J28192
14398A54469p3253j41608o2718J39553K200J16474k111p3163n4164J23861k1914
14387A07626K02109K8944j8803j06077l4537M0558J12808p0162r7647o1115k3455
14376H0249J41387j2935k63567p0406p1872o2763P172J12786J99857r454j81277
14365a30823j14423l944K84430j6746r9597p6847p9549r1052P2846J02082J4321
14354a39302J10813J30413r5519o6990j03618k103L3534r4231q5938o2620m0049
14343d15610p7885K03681K14709Q5023K6227J35667N6450j47488k22003N1180
14333i0049J00576j085j46634P5243J5349o6660J32296J4312j1019q7432j522
$$ plain form
14322 -66625 7735 140113 172693 75387 -92746 -33861 124384 189454 70172 211753 289580
14311 289580 256730 276227 354034 321847 298888 189780 223261 147045 -135943 -275760 -86314
14300 -86314 -66243 -168187 -128648 -200071 -195905 -215547 -94845 -33492 31895 225656 112885
14289 112885 -77470 -48395 71624 119590 12639 -74199 -111988 -169947 -62583 -156102 -257330
14278 -257330 -341040 -240946 -210309 -278968 -224169 -189268 -236033 -91846 13957 165773 99248
14267 99248 -61700 -118321 -100986 -85087 -159885 -155555 -246654 -99462 -30362 -89269 -104764
14256 -104764 -131437 -134692 -257649 -377395 -247568 -80475 -63089 -40326 -93717 -97471 61148
14245 61148 -3598 66264 21596 -93821 99609 101074 -74666 -192946 -190341 -101956 12488
$$ packed form
14322f6625P4360J32378L2580r7306j68133N8885J58245O5070j19282J41581P7827
14311B89580l2850J9497P7807l2187k2959j09108L3481p6216k82988j39817J89446
14300h6314K0071j01944L9539p1423M166j9642J20702O1353O5387J93761j12771
14289A12885j90355K9075J20019M7966j06951q6838l7789n7959J07364r3519j01228
14278b57330q3710J00094L0637o8659N4799L4901m6765J44187J05803J51816o6525
14267I9248j60948n6621J7335J5899p4798M330r1099J47192O9100n8907j5495
14256a04764k6673l255j22957j19746J29827J67093J7386K2763n3391l754J58619
14245F1148o4746O9862m4668j15417J93430J465j75740j18280K605Q8385J14444
$$ plain form
14234 12488 57611 -55763 -188130 -232185 -140600 -186322 -172178 42550 23244 64807 -40643
14223 -40643 95653 258919 86506 -82971 -131845 -152019 -14417 -149642 -210314 -138235
14213 -138235 -72426 -44644 -8537 34479 -151349 -200887 -177743 -190737 -20906 -225368 -263521
14202 -263521 -157842 -137660 -36705 -37405 -114820 -96955 -75687 -146592 -314075 -171343 -30737
14191 -30737 -138471 -203409 55811 129819 69980 -47760 -111905 -118090 -98334 59746 129883
14180 129883 71622 -100373 -22217 90988 41898 -78435 -27050 20438 -19910 128991 124768
14169 124768 48078 60780 120315 72047 29878 -13818 25891 7872 -111887 -180039 -134233
14158 -134233 -130533 -191405 -275286 -289600 -352820 -348185 -355391 -372212 -315872 -269463 -323980 -278260
$$ packed form
14234A2488M5123j13374j32367m4055R1585m5722J4144K14728j9306M1563j05450
14223d0643J36296J63266j72413j69477m8874k0174J37602j35225o0672P2079
14213a38235O5809K7782L6107M3016j85828m9538K3144j2994J69831k04462l8153
14202b63521J05679K0182J00955p00p7415J7865K1268p0905j67483J42732J40606
14191c0737j07734o4938K59220P4008n9839j17740o4145o185J9756J58080P0137
14180A29883n8261j71995P8156J13205m9090j20333N1385M7488m0348J48901m223
14169A24768p6690J2702N9535m8268m2169m3696L9709j8019j19759o8152M5806
14158a34233L700o0872q3881j4314o3220M635p206j6821N6340M6409n4517M5720
$$ plain form
14146 -278260 -11258 181612 149702 133461 42880 53615 67103 214193 143636 -67482 -62665
14135 -62665 72984 104887 194119 314735 440441 246501 13263 -47532 110190 167603
14125 167603 77943 -95595 -104263 -60356 -51838 -32099 99291 78351 -57446 -109970 -272288
14114 -272288 -205967 -61422 17949 66482 -39843 -24490 -13532 31059 -21641 -19592 14021
14103 14021 2792 32439 124080 -72059 -206586 -126884 -137433 -164509 -104614 -76866 -88189
14092 -88189 6656 38557 111223 137039 218567 306444 269882 106396 -67966 -110443 -69450
14081 -69450 -40364 48313 13257 -63579 -88491 -115234 78989 147269 182453 127003 26695
14070 26695 -93600 -162064 -230590 -57811 116070 197301 146156 186445 24062 -33956 10381
$$ packed form
14146b78260K67002J92870l1910j6241r0581J0735J3488J47090p0557k11118M817
14135f2665J35649L1903Q9232J20616J25706j93940k33238o0795J57722N7413
14125A67603q9660j73538q668M3907Q518J9739J31390k0940j35797n2524j62318
14114b72288O6321J44545P9371M8533j06325J5353J0958M4591n2700K049L3613
14103A4021j1229K9647R1641j96139j34527P9702j0549k7076N9895K7748j1323
14092h8189R4845L1901P2666K5816Q1528Q7877l6562j63486j74362m2477M0993
14081f9450K9086Q8677l5056p6836k4912k6743J94223O8280L5184n5450j00308
14070B6695j20295o8464o8526J72779J73881Q1231n1145M0289j62383n8018M4337
$$ plain form
14059 10381 54489 65612 100908 188034 62510 57951 131544 7145 -44884 -126703 -23299
14048 -23299 191899 135261 -90091 -208333 -373320 -390747 -304556 -281476 -273991 -336926 -105422
14037 -105422 22075 126875 77179 -57788 -6673 154898 11094 164 -32744 -138099
14027 -138099 -66401 -27495 66974 -51469 -16998 -16147 -1066 86952 216972 227613 244036
14016 244036 228482 404284 358497 187601 107284 201116 177749 44910 143571 277728 264970
14005 264970 249941 157785 69945 -104563 -78681 166776 243393 243173 227328 72039 -15520
13994 -15520 12645 62326 150571 340220 364429 214314 163544 122016 98030 7354 -58069
13983 -58069 -46833 -130636 -57394 62746 158256 270997 213223 102580 105610 -32922 -212839
$$ packed form
14059A0381M4108J1123L5296Q7126j25524m559P3593j24399n2029q1819J03404
14048b3299K15198n6638k25352j18242j64987j7427Q6191K3080P485o2935K31504
14037a05422J27497J04800m9696j34967N1115J61571j43804j0930l2908j05355
14027a38099P1698L8906R4469j18443L4471Q51J5081Q8018J30020J0641J6423
14016B44036j5554J75802m5787j70896q0317R3832k3367j32839R8661J34157j2758
14005B64970j5029r2156q7840j74508K5882K45457P6617k20j5845j55289q7559
13994a5520K8165M9681Q8245J89649K4209j50115n0770m1528k3986r0676o5423
13983e8069J1236q3803P3242J20140R5510J12741n7774j10643L030j38532j79917
$$ plain form
13972 -212839 -383023 -349189 -256519 -134852 -41291 -19450 39751 50158 -160238 -374795 -361128
13961 -361128 -93749 151749 119065 97658 130206 151415 143034 108529 54355 -33926 -179149
13950 -179149 -23311 -120613 -200220 -292709 -127164 54723 46334 54078 38572 33552 106280
13939 106280 106595 90427 171493 214624 240008 175793 205829 179036 170613 260537 86329 44889
13927 44889 135135 245904 87790 -64471 -135133 2341 229727 374240 383084 310832 272937
13916 272937 158804 89206 4402 38934 45021 -65990 51230 294155 358445 140233 -21925
13905 -21925 -76564 24392 335448 494141 383853 167736 142049 151922 214177 320169 340184
13894 340184 135908 29967 53389 101246 79388 -213274 -398387 -420571 -404100 -315836 -159168
$$ packed form
13972b12839j70184L3834R2670J21667R3561K1841N9201J0407k10396k14557J3667
13961c61128K67379K45498l2684k1407L2548K1209q381l4505n4174q8281j45223
13950a79149J55838r7302p9607r2489J65545J81887q389P744j5506n020P2728
13939A06280L15j6168Q1066M3131K5384o4215L0036k6793q423Q9924j74208m1440
13927D4889R0246J10769j58114j52261p0662J37474K27386J44513Q844p2252l7895
13916B72937j14133o9598q4804L4532O087j11011J17220K42925O4290k18212j62158
13905b1925n4639J00956L11056J58693j10288k16117k5687R873O2255J05992K0015
13894C40184k04276j05941K3422M7857k1858k92662j85113k2184J6471Q8264J56668
$$ plain form
13883 -159168 99326 155575 176863 137623 138931 154875 85586 -139148 -182390 -167180 -151694
13872 -151694 -204266 -268879 -360303 -451929 -482275 -366023 -189253 -172784 -263218 -314827 -117993
13861 -117993 -14867 -73641 -83214 -92986 -181790 -228704 -215867 -113837 -151018 -308801 -271889
13850 -271889 -163533 -92837 16905 120457 83953 10136 -73428 -181517 -8395 84303
13840 84303 46909 -106115 -88829 -2130 108538 33701 -84215 2691 249748 216260 82783
13829 82783 43298 -200279 -158300 7480 99910 -3096 -11879 -69707 -129128 -83027 -39360
13818 -39360 -89550 -150888 -133158 -191323 -257709 -232317 -186171 -50087 -120053 -272148 -347204
13807 -347204 -200702 -89161 -12151 -31942 -85461 39134 127042 -12879 -161110 -219529
$$ packed form
13883a59168K58494N6249K1288l9240J308J5944o9289k24734m3242J5210J5486
13872a51694n2572o4613r1424r1626l0346J16252J76770J6469r0434n1609J96834
13861a17993J03126n8774r573r772q8804m6914J2837J02030l7181j57783L6912
13850b71889J08356P0696J09742J03552l6504p3817q3564j08089J73122R2698
13840H4303l7394j53024J7286Q6699J10668p4837j17916Q6906K47057l3488j33477
13829H2783l9485k43577M1979J65780R2430j03006q783n7828n9421M6101M3667
13818c9360n0190o1338J7730n8165o6386K5392M6146J36084o9966j52095p5056
13807c47204J46502J11541P7010j9791n3519J24595Q7908j39921j48231n8419
$$ plain form
13797 -219529 -218726 -63571 7957 92177 -3649 -60236 1168 72480 70951 55949 21298 -106828
13785 -106828 -82616 -25884 -6716 21630 -117455 -228061 -189556 19130 109101 101226 114115
13774 114115 192265 -36235 -80489 -193797 -166025 -62706 -22864 -88285 -190947 -217903 -312779
13763 -312779 -346633 -342974 -282002 -209141 -190691 -86993 -12943 50838 -20027 -96674 -127243
13752 -127243 154276 354043 246177 136447 92796 -63392 -22370 78552 121428 210168
13742 210168 116583 138387 163256 1559 -120393 -277744 -277600 -127168 -152188 -154008 -157052
13731 -157052 -204193 -144188 5288 164676 118404 189104 302782 315927 171826 144391 154889
13720 154889 226950 158644 102836 -152924 -294240 -79715 69348 60172 40187 -15729 -171873
$$ packed form
13797b19529Q03J55155P1528Q4220r5826n6587O1404P1312j529j5002l4651j28126
13785a06828K4212N6732J9168K8346j39085j10606L8505K08686Q9971p875J2889
13774A14115P8150k28500m4254j13308K7772J03319L9842o5421j02662k6956r4876
13763c12779l3854L659O0972P2861J8450J03698P4050O3781p0865p6647l0569
13752a27243K81519J99767j07866j09730m3651j56188M1022J00922M2876Q8740
13742B10168r3585K1804K4869j61697j21952j57351J44J50432k5020j820l044
13731a57052m7141O0005J49476J59388m6272P0700J13678J3145j44101k7435J0498
13720A54889P2061o8306n5808k55760j41316K14525J49063r176j9985n5916j56144
$$ plain form
13709 -171873 -326213 -274231 -256200 -205155 -223532 -240293 -137587 -157467 -203629 -126632 -102918
13698 -102918 -104430 -167603 -20047 97211 133512 180958 201586 370507 324881 178670 97840
13687 97840 -31182 -263019 -299095 -207142 -216515 -141366 -89589 -23713 -117517 27241 45470
13676 45470 -132446 -237325 -84948 -9229 -64377 -106211 -23161 52456 23095 51567 104231
13665 104231 69544 5047 75832 161393 69153 -135591 -157409 -162123 67762 112044 70119
13654 70119 71569 -116193 -153310 -19990 -64441 -187706 -222239 -108179 -55620 -182260 -299881
13643 -299881 -220397 -41185 122649 55503 -975 -37724 129712 158841 40212 46513 41684
13632 41684 -135207 -180753 -28051 104572 53860 -40315 -117167 -36965 -89398 -69574 -44828
$$ packed form
13709a71873j54340N1982J8031N1045j8377j6761J02706j9880m6162P6997K3714
13698a02918j512o3173J47556J17258L6301M7446K0628J68921m5626j46211q0830
13687I7840j29022k31837l6076R1953r373P5149N1777O5876r3804J44758J8229
13676D5470j77916j04879J52377P5719n5148m1834Q3050P5617k9361K8472N2664
13665A04231l4687o4497P0785Q5561r2240k04744k1818m714K29885M4282m1925
13654G0119J450j87762l7117J33320m4451j23265l4533J14060N2559j26640j17621
13643b99881P9484J79212J63834o7146n6478l6749J67436K9129j18629O301m829
13632D1684j76891m5546J52702J32623n0712r4175p6852Q0202n2433J9824K4746
$$ plain form
13621 -44828 -32585 34251 16193 -93862 -290650 -361708 -151758 -146593 -83840 -35085 -104798
13610 -104798 -213216 -145055 -11762 30385 -29468 10679 124821 116342 25815 -66347 -11151
13599 -11151 -125286 -207958 -276550 -176375 -93203 55002 199702 63293 -216713 -65832
13589 -65832 -38816 -106051 -108637 -108814 -11089 84846 45527 61927 -104940 -223186 -218523 -114893
13577 -114893 9064 18540 -65734 -32086 -55131 -57002 -152938 -82282 34982 -51634 -82195
13566 -82195 -77656 -919 4454 -95559 -135075 -103056 -194539 -152001 -33862 -47811 -8987 1262
13554 1262 10417 51943 35523 12329 -119796 -45810 47828 145575 357 23227 -36428 968
13542 968 -45363 -240826 -263604 -293142 -313066 -283423 -351304 -128623 43311 13107 210229
$$ packed form
13621d4828J2243O6836j8058j10055j96788p1058K09950N165O2753M8755o9713
13610a04798j08418O8161J33293M2147n9853M0147J14142q479r0527r2162N5196
13599a1151j14135q2672o8592J00175Q3172J48205J44700j36409k80006J50881
13589f5832K7016o7235k586j77R7725R5935l9319J6400j66867j18246M663J03630
13577a14893J23957R476q4274L3648k3045j871r5936P0656J17264q6616l0561
13566h2195M539P6737N373j00013l9516L2019r1483M2538J18139j3949L8824J0249
13554A262R155M1526j6420k3194j32125P3986R3638R7747j45218K2870n9655L7396
13542I68m6331j95463k2778k9538j9924K9643o7881K22681J71934l0204J97122
$$ plain form
13531 210229 281789 283602 204954 -18972 15168 101619 47347 214670 153586 -12678 -182510
13520 -182510 -216453 -278049 -324318 -247145 -92926 -67600 84629 203847 170776 -16966 -94063
13509 -94063 -80380 65314 22825 -143164 105170 123125 58193 -9148 3946 -88981 -235888
13498 -235888 -55173 20968 -163045 -166242 -50377 21199 67078 31208 121218 54681 5665
13487 5665 15332 52388 72262 152649 194136 197582 323135 245345 111771 -95491 -154606 35194
13475 35194 94234 81525 -186844 -391118 -314914 -275082 -142886 -74979 -66918 -60087 -76526
13464 -76526 -39052 157200 206118 33767 30305 107209 -52400 96727 127404 96752 124686
13453 124686 112340 59997 11427 42270 -156133 -57738 8967 -68744 -210036 -244909 -298311
$$ packed form
13531B10229P1560J813p8648k23926L4140Q6451n4272J67323o1084j66264j69832
13520a82510l3943o1596m6269P7173J54219K5326J52229J19218l3071j87742p7097
13509i4063J3683J45694m2489j65989K48334J7955o4932o7341J3094r2927j46907
13498b35888J80715P6141j84013l197J15865P1576M5879l5870R0010o6537m9016
13487E665R667L7056J9874Q0387M1487L446J25553p7790j33574k07262n9115J89800
13475C5194N9040j2709k68369k04274P6204L9832J32196O7907Q061O831j6439
13464g6526L7474J96252M8918j72351l462P6904j59609J49127L0677l0652K7934
13453A24686j2346n2343m8570L0843j98403R8395O6705p7711j41292l4873n3402
$$ plain form
13442 -298311 -255965 -272566 -275675 -291997 -383123 -231789 33611 62144 -69781 -245468 -248330
13431 -248330 -130331 -58232 -180652 -209414 -85071 29691 5811 15806 79271 106726 73298
13420 73298 112688 207731 139022 73373 112876 138343 32739 51019 53487 79889 -189575
13409 -189575 -208217 -218574 -160643 -63570 23348 50668 18406 84300 36310 -2994 -81261
13398 -81261 -235039 -379699 -309275 -206391 -167250 -397215 -451594 -333991 -264750 -155321
13388 -155321 -40131 29626 78083 52679 -220199 -334266 -315798 -183030 -88562 -86372 711
13377 711 26765 5545 -33793 88029 308688 344621 293142 28159 -13963 30422 216383
13366 216383 332860 351386 219840 134052 97038 156363 240871 350310 400162 419663 311382
$$ packed form
13442b98311M2346j6601l109j6322r1126J51334K65400K8533j31925j75687k862
13431b48330J17999P2099j22420k8762J24343J14762k3880R995O3465K7455l3428
13420G3298L9390R5043o8709o5649L9503K5467j05604J8280K468K6402k69464
13409a89575j8642j0357N7931R7073Q6918K7320l2262O5894m7990l9304p8267
13398h1261j53778j44660P0424J02884L9141k29965n4379J17603O9241J09429
13388a55321J15190O9757M8457k5404k72878j14067J8468J32768R4468K190Q7083
13377G11K6054k1220l9338J21822K20659L5933n1479k64983m2122M4385J85961
13366B16383J16477J8526j31546q5788l7014N9325Q4508J09439M9852J9501j08281
$$ plain form
13355 311382 175714 159735 130617 121283 114493 142467 121032 83506 -2243 -265219 -411040
13344 -411040 -360821 -213543 -67656 1889 -20126 -204432 -295925 -232031 -182188 -142502 -77423
13333 -77423 -220482 -207348 -120998 -60224 31515 35993 175126 283112 323984 245749 100845
13322 100845 -114987 -206450 -45856 -34271 -10454 45110 -22539 -107411 -169424 -130669 -323040
13311 -323040 -284640 30404 216205 84694 85152 -90183 -426631 -333569 -284933 -245172 -23914
13300 -23914 126252 -55608 -106400 -153328 -24568 107518 62908 47641 130848 281483 33433
13289 33433 -15579 156048 154792 91262 128580 259208 151255 -67406 -123676 -63591 -81610
13278 -81610 -132772 -63930 -61585 -24652 -6517 -45997 -100319 -151734 -308216 -363028 -134681
$$ packed form
13355C11382j35668j5979k9118r334o790K7974k1435l7526q5749k62976j45821
13344d11040N0219J47278J45887O9545k2015j84306r1493O3894M9843L9686O5079
13333g7423j43059J3134Q6350O0774R1739M478J39133J07986M0872p8235j44904
13322A00845k15832r1463J60594J1585K3817N5564o7649q4872o2013L8755j92371
13311c23040L8400L15044J85801j31511M58j75335l36448R3062M8636L9761K21258
13300b3914J50166j81860n0792m6928J28760J32086m4610j5267Q3207J50635k48050
13289C3433m9012J71627j256o3530L7318J30628j07953k18661n6270O0085j8019
13278h1610n1162O8842K345L6933J8135l9480n4322n1415j56482n4812K28347
$$ plain form
13267 -134681 -149052 -357821 -200771 63285 361770 331686 74958 -120042 121778 223283
13257 223283 174040 131292 278653 228487 40598 13225 51168 149812 62319 -88757 -311612
13246 -311612 -285640 -104237 -10453 -106139 -67651 20755 -62619 -340574 -388807 -275066 -224381
13235 -224381 -225426 -247469 -184815 -36181 45886 39262 -110056 -100263 -80402 -66281 -40617 -190752
13223 -190752 -117308 67232 153483 -76483 -190897 -266160 -185794 134362 270479 261288 -12563
13212 -12563 -128264 10175 58044 89288 369067 357483 164745 -35523 -79583 -138912 -260984
13201 -260984 -91408 -60735 -28652 56489 13385 -2851 144363 244741 130820 90847 160186
13190 160186 -90052 -217866 -255596 -280938 -149971 -93232 9320 97788 97426 125138 62280
$$ packed form
13267a34681j4371k08769J57050K64056K98485l0084k56728j95000K41820J01505
13257B23283m9243m2748J47361n0166j87889k7373L7943R8644q7493j51076k22855
13246c11612K5972J81403R3784r5686L8488Q8406q3374k77955m8233J13741N0685
13235b24381j045k2043O2654J48634Q2067o624j49318R793J9861J4121K5664j50135
13223a90752P3444J84540Q6251k29966j14414p5263Q0366L20156J36117r191k73851
13212a2563j15701J38439M7869L1244K79779j1584j92738k00268m4060n9329j22072
13201b60984J69576L0673L2083Q5141m3104j6236J47214J00378j13921l9973O9339
13190A60186k50238j27814l7730k5342J30967N6739J02552Q8468l62K7712o2858
$$ plain form
13179 62280 -14560 40222 103272 -19674 -47176 -116433 -49184 103086 220160 137327 99722
13168 99722 58978 195961 110351 52724 -34935 -42906 125374 101104 41061 -113459 -88416
13157 -88416 -120340 -52337 -12807 -10994 -133809 -77215 -25254 101747 188916 241213 81411
13146 81411 84849 105144 93607 21179 27507 148158 292895 237341 250264 311532 68991
13135 68991 -130704 -150366 -28292 89689 -78183 -179681 -55724 28052 26843 -45765 13960
13124 13960 64658 49218 -23481 -130770 -57001 12793 59995 55619 207804 240137 171900
13113 171900 58488 -130362 -298516 -260589 -145191 -32890 64858 116514 208773 249015
13103 249015 347595 223264 9243 -255559 -119376 78126 29957 140145 211599 196982
$$ packed form
13179F2280p6840N4782O3050j22946k7502o9257O7249J52270J17074q2833l7605
13168I9722m0744J36983q5610n7627q7659p971J68280k4270o0043j54520K5043
13157h8416l1924O8003L9530J813j22815N6594N1961J27001Q7169N2297j59802
13146H1411L438K0295j1537p2428O328J20651J44737n5554J2923O1268k42541
13135F8991j99695j9662J22074J17981j67872j01498J23957Q3776j209p2608N9725
13124A3960N0698j5440p2699j07289P3769O9794M7202m376J52185L2333o8237
13113A71900j13412j88850j68154L7927J15398J12301R7748N1656R2259M0242
13103B49015R8580j24331k14021k64802J36183J97502m8169J10188P1454j4617
$$ plain form
13093 196982 -33086 -164911 -129170 -89400 162458 151246 -42175 -87132 50033 -120538
13083 -120538 -134428 -101121 -45283 -28131 -76098 -156714 -208125 -202644 -210102 -151741 -109002 -165703
13071 -165703 -181215 -129112 -147764 -38788 -86004 -16559 34721 150530 220307 218210 34986
13060 34986 -172604 -155520 28417 56602 84469 111150 211825 256425 48525 -50476 56348
13049 56348 -183691 -149189 -100138 -80903 -190212 -184952 72299 159619 169585 59079 97230
13038 97230 58634 -19369 -41353 -204296 -351206 -290084 -149423 -161997 -51983 32571 -50897
13027 -50897 -170977 -139944 -108516 -130280 -110693 -74826 -89566 -72464 -36697 61420 82541
13016 82541 81415 75258 15177 104752 194129 39262 -126553 78654 232738 -7175 -229039
$$ packed form
13093A96982k30068j31825L5741L9770K51858j1212j93421m4957J37165j70571
13083a20538j3890L3307N5838J7152m7967q0616n1411N481p458N8361M2739n6701
13071a65703j5512N2103j8652J08976m7216O9445N1280J15809O9777k097j83224
13060C4986k07590J7084J83937K8185K7867K6681J00675M4600k07900r9001J06824
13049E6348k40039L4502M9051J9235j09309N260K57251Q7320R966j10506L8151
13038I7230l8596p8003k1984j62943j46910O1122J40661j2574J10014Q4554q3468
13027e0897j20080L1033L1428k1764J9587L5867j4740J7102L5767R8117K1121
13016H2541j126o157o0081Q9575Q9377j54867j65815K05207J54084k39913k21864
$$ plain form
13005 -229039 -176784 26687 2882 -66348 -134605 -180190 2192 101692 325289 364466 224185
12994 224185 49309 166742 268942 262251 397848 296501 237459 65543 -46488 -53725
12984 -53725 40092 124596 163261 166966 175176 249505 181621 179873 272800 167983 75340 116342
12972 116342 206819 170844 208736 136614 -7466 -89655 -177793 -97416 13457 39893 -42067
12961 -42067 -85091 -144388 48109 158128 283188 135777 33850 96325 140746 118737 100139
12950 100139 85350 37785 -99399 -50459 124386 116318 125226 89672 179274 247123 190707
12939 190707 145214 56264 94570 78549 114405 77898 8439 -90012 -110431 -31072 -112286
12928 -112286 -205069 -92624 -138144 -173925 -20738 70771 91902 -96547 -58667 -172724 -260143
$$ packed form
13005b29039N2255K03471k3805o9230o8257m5585J82382R9500K23597L9177j40281
12994B24185j74876J17433J02200o691J35597j01347n9042j71916j12031p237
12984e3725R3817Q4504L8665L705Q210P4329o7884j748R2927j04817r2643M1002
12972A16342R0477l5975L7892p2122j44080q2189q8138Q0377J10873K6436q1960
12961d2067m3024n9297J92497J10019J25060j47411j01927O2475M4421k2009j8598
12950A00139j4789m7565j37184M8940J74845q068Q908l5554Q9602O7849n6416
12939A90707m5493q8950L8306j6021L5856l6507o9459r8451k0419P9359q1214
12928a12286r2783J12445m5520l5781J53187R1509K1131j88449L7880j14057q7419
$$ plain form
12917 -260143 -220144 -323742 -247837 -4768 -41659 -184668 -258844 -7101 85362 71887 289122
12906 289122 116372 -74306 -58867 -29718 -195807 -264448 -164171 -6982 13225 82899
12896 82899 95914 -66330 -76211 -180761 -320052 -251992 -182874 -162323 -231448 -186058 -51253
12885 -51253 -134908 -85236 56656 156747 193976 77026 3545 -13271 -80829 -211446 -275669
12874 -275669 -161388 -173226 23966 66035 24358 102107 176590 103067 72721 -25218 28483
12863 28483 -126235 -149146 -141254 -243302 -115692 1547 20627 -63691 -25437 86143 66372
12852 66372 15243 -85173 -78542 -152428 -203921 -22181 49598 -49625 57700 261274 228210
12841 228210 54523 -63382 3250 -12011 -22447 9540 6631 69744 -46212 -143080 -81767
$$ packed form
12917b60143L9999j03598P5905K43069l6891j43009p4176K51743R2463j3475K17235
12906B89122j72750j90678J5439K9149j66089o8641J00277J57189K0207O9674
12896H2899J3015j62244r881j04550j39291O8060O9118K0551o9125M5390J34805
12885e1253q3655M9672J41892J00091L7229j16950p3481j6816o7558j30617o4223
12874b75669J14281j1838J97192M2069m1677P7749P4483p3523l0346r7939N3701
12863B8483j54718k2911P892j02048J27610J17239J9080q4318L8254J11580j9771
12852F6372n1129j00416O631p3886n1493J81740P1779r9223J07325K03574l3064
12841B28210j73687j17905O6632j5261j0436L1987k909O3113j15956r6868O1313
$$ plain form
12830 -81767 -149967 -148363 -39735 -178892 -278237 -146285 -99015 -84156 -130279 -89077 -765
12819 -765 24856 -60616 89668 40849 74024 48729 5412 817 -114100 -170944 -148485 -121966
12807 -121966 52638 239455 185950 140346 62584 39397 126058 97396 -34482 -19063 -17566
12796 -17566 112614 138556 163100 280344 240141 210643 152087 56351 -99390 -170821 19101
12785 19101 228082 43339 -91244 -165793 -103824 -52433 30866 183115 -39163 47718 254349
12774 254349 167534 67646 -75510 -275528 -126711 65120 51597 28990 119734 137667 48585
12763 48585 -604 -117041 -68984 -130947 -97172 102833 159318 126869 52102 -111291 -57320
12752 -57320 6922 103317 139476 125223 67357 -92556 -130439 -16767 85990 118783 26988
$$ packed form
12830h1767o8200J604J08628j39157r9345J31952M7270J4859m6123M1202Q8312
12819g65K5621q5472J50284m8819L3175k5295m3317m595j14917n6844K2459K6519
12807a21966J74604J86817n3505m5604p7762k3187Q6661k8662j31878J5419J497
12796a7566J30180K5942K4544J17244m0203k9498n8556r5736j55741p1431J89922
12785A9101K08981j84743j34583p4549O1969N1391Q3299J52249k22278Q6881K06631
12774B54349q6815r9888j43156k00018J48817J91831j3523k2607R0744J7933q9082
12763D8585m9189j16437M8057o1963L3775K00005N6485l2449p4767j63393N3971
12752e7320O4242R6395L6159j4253n7866j59913l7883J13672J02757L2793r1795
$$ plain form
12741 26988 -94471 24571 186335 152036 -14399 -123348 -182770 -52314 -4614 -8179 54645
12730 54645 1568 -73975 -89941 -15034 -125163 -209794 -130920 -177304 -158358 -40062 27134
12719 27134 180438 236547 148053 -119623 10321 198473 93760 -135938 -310717 -173360
12709 -173360 -84342 -99639 61549 117804 134554 -43668 -104916 -65699 -9848 60944 134324
12698 134324 186202 275012 96814 13451 -98734 -105681 -152803 -155833 -195746 -25106 -47749
12687 -47749 -131929 -246037 -183749 7770 237795 62114 -81138 -109701 -42098 70626
12677 70626 95625 -47693 96764 162375 -5258 19373 60169 96358 99971 35534 110962
12666 110962 118394 9805 -107383 -162992 -160633 -319043 -288645 -166622 25403 98152 214126
$$ packed form
12741B6988j21459J19042J61764l4299j66435j08949n9422J30456M7700l565O2824
12730E4645n3077p5543j5966P4907j10129q4631P8874m6384J8946J18296O7196
12719B7134J53304N6109q8494k67676J29944J88152j04713k29698j74779J37357
12709a73360Q9018j5297J61188N6255J6750j78222o1248L9217N5851P0792P3380
12698A34324N1878Q8810j78198q3363j12185o947m7122l030l9913J70640k2643
12687d7749q4180j14108O2288J91519K30025j75681j43252k8563O7603J12724
12677G0626K4999j43318J44457O5611j67633K4631M0796L6189L613o4437P5428
12666A10962P432j08589j17188n5609K359j58410L0398J22023J92025P2749J15974
$$ plain form
12655 214126 236883 50359 -69966 -123929 -62511 -114645 37901 222752 237603 175313 170717
12644 170717 48202 -55641 80184 43942 -125316 -270377 -199077 -198929 -292871 -102750 2445
12633 2445 -46562 -84380 54480 61674 88062 10554 18211 19746 -4041 -95806 26964 38296
12621 38296 -8493 89000 69948 150219 105946 56925 152520 186925 62698 -99469 -136553
12610 -136553 -120058 55181 89121 191077 281152 180120 -57548 24161 66295 67589 19055
12599 19055 109146 138143 130153 101289 134854 -1761 -200019 -258195 -102831 -86708 -85895 -59373
12587 -59373 -81082 -256052 -52670 107915 268611 351325 346771 194679 251367 423543 298791
12576 298791 273600 144140 37197 -130526 -213375 -151558 15095 94294 241068 279315
$$ packed form
12655B14126K2757j86524j20325n3963O1418n2134J52546J84851J4851o2290m596
12644A70717j22515j03843J35825l6242j69258j45061P1300J48r3942J90121J05195
12633B445m9007l7818J38860P194K6388p7508P657J535k3787r1765J22770J1332
12621C8296m6789R7493j9052Q0271m4273m9021R5595L4405j24227j62167l7084
12610a36553J6495J75239L3940J01956R0075j01032k37668Q1709M2134J294m8534
12599A9055R0091K8997p990k8864L3565j36615j98258n8176J55364J6123Q13K6522
12587e9373k1709j74970K03382J60585J60696Q2714m554j52092N6688J72176j24752
12576B98791k5191j29460j06943j67723q2849O1817J66653P9199J46774L8247
$$ plain form
12566 279315 213363 325012 206649 165153 247854 215354 101787 12314 -173928 -134284 6853
12555 6853 62981 121211 175794 184838 185748 181009 -44630 -217266 -188792 -196515 -237191 -32522
12543 -32522 -22593 33215 199908 102488 81692 129486 292748 401985 396265 310191 233653
12532 233653 139457 21446 20279 29151 -160273 -145529 100214 62061 -26541 98508 108921
12521 108921 -54956 -260277 -126767 -15904 77511 149381 43575 -12002 71191 312236
12511 312236 276230 -62941 54777 172920 86871 96424 183000 157895 -38330 -188597 -144307
12500 -144307 -114154 -91090 -195826 -78854 76514 221607 252831 97685 140099 71885
12490 71885 -211292 -396199 -277752 -63903 67346 154615 190476 130992 1800 55565
$$ packed form
12566B79315o5952J11649j18363m1496Q2701l2500j13567q9473j86242L9644J41137
12555F853N6128N8230N4583R044R10m739k25639j72636K8474p723m0676K04669
12543c2522R929N5808J66693r7420k0796M7794J63262J09237n720q6074p6538
12532B33653r4196j18011j167Q872j89424J4744K45743l8153q8602J25049J0413
12521A08921j63877k05321J33510J10863R3415P1870j05806n5577Q3193K41045
12511C12236l6006l39171J17718J18143q6049R553Q6576k5105j96225j50267M4290
12500a44307L0153K3064j04736J16972J55368J45093L1224j55146M2414o8214
12490G1885k83177j84907J18447K13849J31249Q7269L5861n9484j29192N3765
$$ plain form
12480 55565 178849 64785 95493 153135 291290 244361 -20605 21655 -33990 -124206 -7959
12469 -7959 101598 -13970 -94518 -81633 41053 -36247 -142892 -91810 -82660 123759 133439
12458 133439 194920 79099 -12908 58529 135712 6778 89409 111091 93135 28988 -15371
12447 -15371 192453 317707 214412 161038 265219 178929 120396 95637 265111 212617 244502
12436 244502 195301 112154 -68364 -46905 -14820 71300 113753 84662 32040 -53130 -20689
12425 -20689 -27179 27206 71411 39596 107598 122585 111423 67983 9179 47009 185098 162022
12413 162022 78878 -14477 91980 30712 -49358 -35191 -159573 -285126 -140793 17226
12403 17226 45062 140354 -29117 -191480 -104838 -175934 -88487 -128312 -177698 -141543 -86912
$$ packed form
12480E5565J23284j14064L0708N7642J38155m6929k64966M2260n5645r0216J16247
12469g959J09557j15568q0548J2885J22686p7300j06645N1082R150K06419R680
12458A33439O1481j15821r2007P1437P7183j28934Q2631K1682j7956o4147m4359
12447a5371K07824J25254j03295n3374J04181q6290n8533k4759J69474n2494L1885
12436B44502m9201q3147j80518K1459L2085Q6120M2453k9091n2622q5170L2441
12425b0689o490N4385M4205l1815O8002J4987j1162m3440n8804L7830J38089k3076
12413A62022q3144r3355J06457o1268q0070J4167j24382j25553J44333J58019
12403A7226K7836R5292j69471j62363Q6642p1096Q7447l9825m9386L6155N4631
$$ plain form
12392 -86912 -41842 60201 -8676 137624 163348 -16336 -82617 -45687 -21002 149117 118935
12381 118935 -7000 -60213 -165032 -94518 91616 244838 76949 27094 131126 82581
12371 82581 28534 40744 -3439 -116036 -103135 -217237 -120022 -21768 125715 146152 103834
12360 103834 123427 161039 187376 184680 241584 78989 -108527 -10416 -42580 90489 106656
12349 106656 -47927 -3719 138876 148554 242499 302889 309263 164435 100197 32131 -64562
12338 -64562 -125977 -156004 -152689 -37219 -120349 -275261 -84184 99738 -123287 47066 172583
12327 172583 271757 252094 187317 48160 -81793 51927 242961 271995 66538 238
12317 238 36054 97923 259810 269372 177649 126740 73119 17755 184685 236942 357090 331754
$$ packed form
12392h6912M5070J02043o8877J46300K5724j79684o6281L6930K4685J70119l0182
12381A18935j25935n3213j04819P0514J86134J53222j67889m9855J04032m8545
12371H2581n4047J2210m4183j12597J2901j14102R7215R8254J47483K0437m2318
12360A03834J9593L7612K6337k696N6904j62595j87516R8111l2164J33069J6167
12349A06656j54583M4208J42595R678R3945O0390O374j44828o4238o8066r6693
12338f4562o1415l0027L315J15470q3130j54912J91077J83922k23025J70353J25517
12327A72583R9174j9663o4777j39157j29953J33720J91034K9034k05457o6300
12317B38L5816O1869J61887R562r1723n0909n3621n5364J66930N2257J20148k5336
$$ plain form
12305 331754 236613 319370 320398 266114 296528 532634 683025 734322 699341 524859 302863
12294 302863 202300 231053 399232 490399 344569 308996 299259 292323 288192 195776 455110
12283 455110 342115 187807 260794 332226 324084 213211 106517 195586 215018 130441 144414
12272 144414 218738 361218 473107 398406 117650 -233681 -288900 1941 269522 315607
12262 315607 303713 481323 552432 560798 421365 232998 370471 533412 496181 297239
12252 297239 306813 456670 368911 401637 412327 381496 349404 461329 344712 168891 172813
12241 172813 285559 245849 370439 356542 238793 265417 449143 357771 378059 542097
12231 542097 540275 445524 401049 299745 274444 241833 270036 310705 371825 360956 405463
$$ packed form
12305C31754r5141Q2757J028n4284L0414K36106J50391N1297l4981j74482k21996
12294C02863j00563K8753J68179R1167j45830l5573r737o936m131r2416K59334
12283D55110j12995j54308P2987P1432q142j10873j06694Q9069J9432q4577J3973
12272A44414P4324J42480J11889p4701k80756l51331n5219K90841K67581M6085
12262C15607j1894J77610P1109Q366j39433j88367J37473J62941l7231j98942
12252B97239R574J49857q7759L2726J0690l0831l2092J11925j16617j75821L922
12241A72813J12746l9710J24590j3897j17749K6624J83726r1372K0288J64038
12231E42097j822r4751m4475j01304k5301l2611K8203M0669O1120j0869M4507
$$ plain form
12220 405463 338958 364178 537332 598571 552002 427485 461621 382661 445910 379861 307666
12209 307666 397545 403273 593815 744469 1003042 1007477 701382 524742 497414 500108 616752
12198 616752 563320 850460 902671 897112 817466 753619 731328 640677 683695 504230 422756
12187 422756 557228 665361 828661 775392 552370 417503 443893 363385 273031 274013 453256
12176 453256 471894 475250 458197 514803 688938 644194 712392 625431 534934 517205 632561
12165 632561 526064 484609 648201 635275 577366 576754 636192 603384 439554 336065 371200
12154 371200 474486 463731 550951 662170 646850 640462 673465 628083 648385 753425 746624
12143 746624 811347 834831 728231 671382 598911 548559 508423 607574 709632 557377 499615
$$ packed form
12220D05463o6505K5220J73154O1239m6569j24517L4136p8960O3249o6049p2195
12209C07666Q9879N728J90542J50654K58573M435l06095j76640k7328K694J16644
12198F16752n3432K87140N2211n559p9646o3847k2291r0651M3018j79465q1474
12187D22756J34472J08133J63300n3269k23022j34867K6390q0508r0354R82J79243
12176D53256J8638L356j7053N6606J74135m4744O8198q6961r0497j7729J15356
12165F32561j06497m1455J63592j2926n7909o12N9438l2808j63830j03489L5135
12154C71200J03286j0755Q7220J11219j5320o388L3003m5382K0302J05040o801
12143G46624O4723K3484j06600n6849p2471n0352m0136R9151J02058j52255n7762
$$ plain form
12132 499615 445209 399056 367805 348119 339727 401445 472308 696633 782303 601208 444892
12121 444892 486551 552851 546742 449580 562000 754046 687808 753431 707845 614786 580303
12110 580303 644052 825906 922606 975373 1121648 1196127 1152851 1074075 973183 1013744 1270525
12099 1270525 1188943 1090539 1167929 1469682 1689342 1728946 1682267 1712887 1658258 1566244 1607717
12088 1607717 1560359 1508958 1484663 1335291 1306190 1399021 1490977 1547156 1495033 1448839 1456369
12077 1456369 1445609 1487635 1641082 1708739 1757198 1865022 1775968 1761482 1884603 1915456 1901410
12066 1901410 2050279 2093079 2104184 2118706 2015409 2037312 2000612 1997191 1930039 2135610 2287069
12055 2287069 2500611 2599115 2638370 2686248 2754199 2433741 2398067 2527205 2610260 2662143 2729784
$$ packed form
12132D99615n4406m6153l1251j9686q392O1718P0863K24325Q5670j81095j56316
12121D44892M1659O6300o109r7162J12420J92046o6238O5623m5586r3059l4483
12110E80303O3749J81854R6700N2767J46275P4479m3276p8776j00892M0561K56781
12099A270525q1582r8404P7390L01753K19660L9604m6679L0620n4629r2014M1473
12088A607717m7358n1401k4295j49372k9101R2831R1956N6179n2123m6194P530
12077A456369j0760M2026J53447O7657M8459J07824q9054j4486J23121L0853j4046
12066A901410J48869M2800J1105J4522j03297K1903l6700l421o7152K05571J51459
12055B287069K13542R8504L9255M7878O7951l20458l5674J29138Q3055N1883O7641
$$ plain form
12044 2729784 2839447 3012232 2922323 2810790 2866548 2982289 2980555 3113652 3111086 3030901 3103427
12033 3103427 3262569 3294453 3310486 3388481 3414038 3487698 3484635 3638410 3951930 4100437 4139510
12022 4139510 4274915 4196098 4058442 4146105 4480225 4786207 4811848 4870552 5066121 5266394
12012 5266394 5325064 5573031 5817548 6027074 6174346 6371192 6557277 6700974 6829304 6936421
12002 6936421 6993707 7297214 7724939 8105706 8372620 8798582 9030138 9194970 9587845 9799061
11992 9799061 9980878 10495773 11311822 11904072 12309712 12861078 13650602 14248259 14938123
11983 14938123 15797802 16734717 17574533 18575241 19562033 20512645 21711130 23139686 24534722
11974 24534722 26183847 27931425 29710815 31829853 34357608 37096757 40108261 43397527
$$ packed form
12044B729784J09663J72785q9909j11533N5758J15741j734J33097k566q0185P2526
12033C103427J59142L1884J6033P7995K5557P3660l063J53775L13520J48507L9073
12022D139510J35405p8817j37656Q7663L34120L05982K5641N8704J95569K00273
12012E266394N8670K47967K44517K09526J47272J96846J86085J43697J28330J07117
12002F936421N7286L03507M27725L80767K66914M25962K31556J64832L92875K11216
11992I799061J81817N14895Q16049N92250M05640N51366P89524N97657O89864
11983A4938123Q59679R36915Q39816J000708R86792R50612J198485J428556J395036
11974B4534722J649125J747578J779390K119038K527755K739149L011504L289266
$$ plain form
11966 43397527 46930914 50904903 55476303 60633785 66725578 73573995 81022397 89366311
11958 89366311 98921757 109949076 122418456 136553539 152728516 170782357 190855538
11951 190855538 212685980 236213665 260940970 285827754 309720929 331361707 349611739
11944 349611739 363316806 371271411 372972448 368286242 357127564 340105473 318750686
11937 318750686 294449921 269293842 244211656 220192948 197985766 177812720 159633815
11930 159633815 143553199 129542758 117222511 106301584 96878154 88402195 80942201
11923 80942201 74237716 68304504 63022953 58352729 54151693 50446731 47047896 44064722
11915 44064722 41202559 38518801 36196904 34204116 32411918 30609256 28747727 27210053
$$ packed form
11966D3397527L533387L973989M571400N157482O091793O848417P448402Q343914
11958H9366311R555446J1027319J2469380J4135083J6174977J8053841K0073181
11951A90855538K1830442K3527685K4727305K4886784K3893175K1640778J8250032
11944C49611739J3705067P954605J701037m686206j1158678j7022091k1354787
11937C18750686k4300765k5156079k5082186k4018708k2207182k0173046j8178905
11930A59633815j6080616j4010441j2320247j0920927r423430q475959p459994
11923H0942201o704485n933212n281551m670224m201036l704962l398835k983174
11915D4064722k862163k683758k321897j992788j792198j802662j861529j537674
$$ plain form
11907 27210053 25712917 24215897 23095542 22208181 21227007 20222788 19398346 18674804 17914944
11898 17914944 17181348 16250200 15392528 14951570 14632324 13991702 13363691 13076534 12541164
11889 12541164 12071580 11565213 11153623 10745295 10445363 10010385 9677777 9440379 9070258
11880 9070258 8597835 8282730 8051781 7879781 7682031 7633179 7400331 7203249 6890270 6428230
11870 6428230 6148951 6141346 6085392 5882075 5713946 5681515 5474309 5273818 5212219 5180548
11860 5180548 4964938 4877453 4670160 4502509 4386432 4331622 4289865 4329822 4172074 4088934
11850 4088934 4022770 3937547 3781056 3845548 3738495 3469756 3294753 3342245 3394310 3356632
11840 3356632 3384526 3315400 3126613 2982506 2989962 2981520 3001171 3100947 3185030 3135099 2991749
$$ packed form
11907B7210053j497136j497020j120355q87361r81174j004219q24442p23542p59860
11898A7914944p33596r31148q57672m40958l19246o40622o28011k87157n35370
11889A2541164m69584n06367m11590m08328k99932m34978l32608k37398l70121
11880I070258m72423l15105k30949j72000j97750m8852k32848j97082l12979m62040
11870F428230k79279p605n5954k03317j68129l2431k07206k00491o1599l1671
11860E180548k15610q7485k07293j67651j16077n4810m1757L9957j57748q3140
11850D088934o6164q5223j56491O4492j07053k68739j75003M7492N2065l7678
11840C356632K7894o9126j88787j44107P456q442J9651R9776Q4083m9931j43350
$$ plain form
11829 2991749 2778761 2624443 2644799 2698836 2630535 2616205 2604792 2525289 2429321 2495849 2527123
11818 2527123 2593780 2587537 2417839 2315742 2337773 2129975 2204690 2368859 2509106 2381599
11808 2381599 2293451 2283214 2252482 2212740 2109527 1951063 2136308 2299860 2168683 1933519
11798 1933519 2062988 2158023 2024891 1936008 1871181 1766961 1760216 1765489 1641311 1476534 1339557
11787 1339557 1304075 1339149 1181541 1320458 1492617 1374615 1341079 1565926 1613781 1471418
11777 1471418 1408917 1461535 1521568 1422625 1320148 1465355 1651911 1632276 1359482 1233096
11767 1233096 1155561 1321711 1233223 1275819 1190941 1077352 1125453 1101267 1001252 996452 941341
11756 941341 958203 978547 877306 804814 913914 903921 732975 824052 1030453 1065852 1053551
$$ packed form
11829B991749k12988j54318K0356N4037o8301j4330j1413p9503r5968O6528L1274
11818B527123O6657o243j69698j02097K2031k07798P4715J64169J40247j27507
11808B381599q8148j0237l0732l9742j03213j58464J85245J63552j31177k35164
11798A933519J29469R5035j33132q8883o4827j04220o745N273j24178j64777j36977
11787A339557l5482L5074j57608J38917J72159j18002l3536K24847M7855j42363
11777A471418o2501N2618O0033r8943j02477J45207J86556j9635k72794j26386
11767A233096p7535J66150q8488M2596q4878j13589M8101k4186j00015m800n5111
11756I41341J6862K0344j01241p2492J09100r993j70946R1077K06401L5399j2301
$$ plain form
11745 1053551 1011950 796285 726465 850589 938858 856156 818958 825255 795846 755038 850186
11734 850186 869589 1016015 1031253 952830 944366 1122422 1058481 1038574 1010031 929324 923227
11723 923227 859958 718734 619615 523606 556857 695333 799724 819700 701258 636770 458374
11712 458374 524703 627481 640646 609278 620006 503846 453942 487691 628532 710415 687266
11701 687266 738154 775480 738493 746691 652118 511202 530438 589303 525336 443608 499741
11690 499741 578454 542729 408437 400350 380421 483611 437539 454260 381994 483667 724531
11679 724531 731849 545777 493003 500134 324523 129776 216657 320810 262765 77813 49225
11668 49225 161610 460134 593106 440811 383425 387631 267745 358355 508661 470577 276297
$$ packed form
11745A053551m1601k15665o9820J24124Q8269q2702l7198O297k9409m0808R5148
11734H50186J9403J46426J5238p8423q464J78056o3941j9907k8543q0707o097
11723I23227o3269j41224r9119r6009L3251J38476J04391J9976j18442o4488j78396
11712D58374O6329J02778J3165l1368J0728j16160m9904L3749J40841Q1883k3149
11701F87266N0888L7326l6987Q198r4573j40916J9236N8865o3967q1728N6133
11690D99741P8713l5725j34292q087j9929J03190m6072J6721p2266J01673K40864
11679G24531P318j86072n2774P131j75611j94747Q6881J04153n8045j84952k8588
11668D9225J12385K98524J32972j52295n7386M206j19886R0610J50306l8084j94280
$$ plain form
11657 276297 86474 143636 160824 325237 331790 321896 238791 141100 207809 163906 194241
11646 194241 259315 366124 314475 189245 132636 25704 -101595 -139856 2563 143012
11636 143012 322888 368129 275486 290647 384099 407404 490695 467279 374488 357772 484923
11625 484923 497113 444471 507503 503677 537320 583081 608997 671010 730509 727647 651114 509984
11613 509984 562103 609308 556602 516842 478552 259316 114823 194653 385198 432483 509829
11602 509829 462579 425993 343228 438900 501314 508919 588735 611327 531159 354400 301561
11591 301561 178734 -9245 77899 190243 330015 363047 382477 421005 356308 412927 273754
11580 273754 263356 196816 99103 95052 126896 328145 343102 233245 85744 191532 170670
$$ packed form
11657B76297j89823N7162J7188J64413O553r894q3105r7691O6709m3903L0335
11646A94241O5074J06809n1649j25230n6609j06932j27299l8261J42419J40449
11636A43012J79876M5241r2643J5161R3452K3305Q3291k3416r2791j6716J27151
11625D84923J2190n2642O3032l826L3643M5761K5916O2013N9499k862p6533j41130
11613E09984N2119M7205n2706l9760l8290k19236j44493P9830J90545M7285P7346
11602E09829m7250l6586q2765R5672O2414P605P9816K2592q0168j76759n2839
11591C01561j22827j87979Q7144J12344J39772L3032J9430L8528o4697N6619j39173
11580B73754j0398o6540r7713m051L1844K01249J4957j09857j47501J05788k0862
$$ plain form
11569 170670 260081 336931 348331 326303 353734 244584 119652 295957 585893 580937 359545
11558 359545 409085 248253 63355 112966 175435 260527 184370 214368 240728 221889 56732
11547 56732 -13638 98082 234180 345227 164943 -30645 -99585 -95282 27598 82331 170881
11536 170881 293011 237173 210871 92914 53098 247573 142804 187833 222297 263870 357993
11525 357993 344300 404265 230902 270021 391024 310059 179856 84701 108582 56464 75934
11514 75934 228459 295293 286096 274449 238387 174528 281229 436903 366440 423986 412344
11503 412344 312888 162768 50462 123771 174626 25749 -67550 96402 164903 219550 39500
11492 39500 -73990 26803 267349 281251 343479 303497 306695 359140 291647 236313 159989
$$ packed form
11569A70670Q9411P6850J1400k2028K7431j09150j24932J76305K89936m956k21392
11558C59545M9540j60832j84898M9611O2469Q5092p6157K9998K6360j8839j65157
11547E6732p0370J11720J36098J11047j80284j95588o8940M303J22880N4733Q8550
11536A70881J22130n5838k6302j17957l9816J94475j04769M5029L4464M1573R4123
11525C57993j3693N9965j73363L9119J21003q0965j30203r5155K3881n2118J9470
11514G5934J52525O6834r197j1647l6062o3859J06701J55674p0463N7546j1642
11503D12344r9456j50120j12306P3309N0855j48877r3299J63952O8501N4647j80050
11492C9500j13490J00793K40546J3902O2228l9982L198N2445o7493n5334p6324
$$ plain form
11481 159989 204434 213118 113876 85679 58716 54149 4319 -126607 -42735 -28882 115734
11470 115734 233985 350849 347571 451016 405732 224558 142813 12218 21368 -68510 -138641
11459 -138641 -189831 -106337 -228246 -208060 68003 135047 144374 178103 251167 294060 490405
11448 490405 757125 719607 473041 322597 218552 160082 281152 298215 28378 -180290
11438 -180290 -157871 -187210 -49578 87770 151765 102872 29407 -166320 -139773 -83280 63412
11427 63412 167275 214960 285842 333621 258403 186774 110150 47625 -39830 -82729 49393
11416 49393 192703 151728 110968 124684 113731 207634 245351 247594 175458 214037 22390
11405 22390 -174141 -229115 9609 161688 94223 14691 -44363 160349 171261 -17989 -126028
$$ packed form
11481A59989M4445Q684r9242k8197k6963m567m9830j30926Q3872J3853J44616
11470A15734J18251J16864l278J03445m5284j81174q1745j30595R150q9878p0131
11459a38641n1190Q3494j21909K0186K76063O7044R327L3729P3064M2893J96345
11448D90405K66720l7518k46566j50444j04045n8470J21070J7063k69837k08668
11438a80290K2419k9339J37632J37348O3995m8893p3465j95727K6547N6493J46692
11427F3412J03863M7685P0882M7779p5218p1629p6624o2525q7455m2899J32122
11416D9393J43310m0975m0760J3716j0953R3903L7717K243p2136L8579j91647
11405B2390j96531n4974K38724J52079o7465p9532n9054K04712J0912j89250j08039
$$ plain form
11394 -126028 -96976 -20783 142269 240466 143106 109793 201616 322821 246633 235654 227076
11383 227076 162644 230527 141337 87662 70830 -29397 -41438 -94452 -114115 61518 195763
11372 195763 200806 152809 -46948 -137323 -150697 -103476 -296250 -329973 -132658 -68989 -54124
11361 -54124 34443 166639 287020 263118 229949 264732 240473 196078 104558 298775 280087
11350 280087 261536 264599 258594 329655 327892 132544 34137 -50350 -94593 40838 293366
11339 293366 265116 260008 428167 383322 245723 189059 224170 239848 174075 146273 161122
11328 161122 352858 418463 410881 378563 257284 147052 120908 85474 134630 5892 183122
11317 183122 177292 123673 17735 -120566 -235430 -196914 -20028 59931 242971 178800 99590
$$ packed form
11394a26028K9052P6193J63052R8197r7360l3313R1823J21205p6188j0979q578
11383B27076o4432O7883q9190n3675j6832j00227j2041n3014j9663J75633J34245
11372A95763N043m7997j99757r0375j3374M7221j92774l3723J97315O3669J4865
11361e4124Q8567J32196J20381k3902l3169L4783k4259m4395r1520J94217j8688
11350B80087j8551L063o005P1061j763j95348r8407q4487m4243J35431K52528
11339B93366k8250n108J68159m4845j37599n6664L5111J5678o5773k7802J4849
11328A61122J91736O5605p582l2318j21279j10232k6144l5434M9156j28738J77230
11317A83122n830n3619j05938j38301j14864L8516J76886P9959J83040o4171p9210
$$ plain form
11306 99590 128242 149810 91288 83132 56064 -15861 26399 19670 -24488 -73598 -150282 -156723
11294 -156723 -42325 -64346 -54025 -49616 -22394 130374 103312 -24 107180 114347 31040
11283 31040 21238 35285 84553 157790 87289 21152 100460 205186 185209 243747 316686 166552
11271 166552 112752 136161 183123 218314 115508 -61803 214861 237630 123822 60793 -64470
11260 -64470 -247458 -201077 -13288 -110901 -259894 -113665 -45 -103677 14992 39337
11250 39337 26464 100492 65328 46676 94688 -45758 -235217 -103872 117298 25968 -136319
11239 -136319 -189214 -33737 614 -179224 -461088 -394977 -253586 -223059 -39497 161532
11229 161532 140250 73849 179818 351447 238609 162263 162892 61437 19722 149706 77977
$$ packed form
11306I9590K8652K1568n8522q156k7068p1925M2260o729m4158m9110p6684o441
11294a56723J14398k2021J0321M409K7222J52768k7062j03336J07204P167q3307
11283C1040r802J4047M9268P3237p0501o6137P9308J04726j9977N8538P2939j50134
11271A66552n3800K3409M6962L5191j02806j77311K76664K2769j13808o3029j25263
11260f4470j82988M6381J87789r7613j48993J46229J13620j03632J18669K4345
11250C9337j2873P4028l5164j8652M8012j40446j89459J31345K21170r1330j62287
11239a36319n2895J55477L4351j79838k81864O6111J41391L0527J83562K01029
11229A61532k1282o6401J05969J71629j12838p6346O29j01455m1715J29984p1729
$$ plain form
11218 77977 43647 -10833 -60255 -83849 -208471 -228717 -233325 -51089 139277 111489 59578
11207 59578 222043 141626 63541 147921 117628 -631 44982 -15435 -28423 -204971 -134111
11196 -134111 21938 126375 165779 268668 233875 -15154 -234366 -235057 -57212 96770
11186 96770 99651 26574 194016 354962 233850 17921 4071 24144 126707 185535 217900
11175 217900 204612 64781 75267 81388 16768 -43277 87258 69142 7238 186111 181235
11164 181235 161420 173837 221254 151423 -17941 55664 206719 169869 118541 -15591 73732
11153 73732 446106 390393 263283 76622 133727 166198 175480 132757 -6616 51387 157448
11142 157448 -42939 -127683 -47171 90741 139970 213840 203468 79808 188783 124718 -160551
$$ packed form
11218G7977l4330n4480m9422k3594j24622k0246m608J82236J90366k7788n1911
11207E9578J62465q0417p8085Q4380l0293j18259M5613o0417j2988j76548P0860
11196a34111J56049J04437L9404J02889l4793k49029k19212o91J77845J53982
11186I6770K881p3077J67442J60946j21112k15929j3850K0073J02563N8828L2365
11175B17900j3288j39831J0486O121o4620o0045J30535j8116o1904J78873m876
11164A81235j9815J2417M7417o9831j69364P3605J51055l6850n1328j34132Q9323
11153G3732L72374n5713j27110j86661N7105L2471R282m2723j39373N8003J06061
11142A57448k00387q4744Q0512J37912M9229P3870j0372j23660J08975o4065k85269
$$ plain form
11131 -160551 -189998 -278023 -77434 194993 251919 273622 321695 352950 351817 223704 138818
11120 138818 131673 92568 92977 -61787 -11514 161598 171743 136522 208545 140274 -21920
11109 -21920 -128811 -191975 -34347 61922 112651 61330 79280 202666 206689 129837 39280
11098 39280 -63245 -148523 -22033 16089 132937 316766 138425 20712 -8711 100742
11088 100742 202301 52171 35766 33158 -60850 -5357 41145 -59255 44967 261482 265300
11077 265300 204572 303102 432147 329230 215986 229427 323533 189900 85200 -2458
11067 -2458 49938 311530 328299 295664 145015 197320 186047 138449 130565 139210 92170 215862
11055 215862 149582 321824 455491 313265 284070 297339 227279 320224 566577 592044 625365
$$ packed form
11131a60551k9447q8025K00589K72427N6926K1703M8073L1255j133j28113q4886
11120A38818p145l9105M09j54764N0273J73112J0145l5221P2023o8271j62194
11109b1920j06891o3164J57628R6269N0729n1321J7950J23386M023p6852r0557
11098C9280j02525q5278J26490L8122J16848J83829j78341j17713k9423J09453
11088A00742J01559j50130j6405k608r4008N5493M6502j00400J04222K16515L818
11077B65300o0728R8530J29045j02917j13244J3441R4106j33633j04700q7658
11067b458N2396K61592J6769l2635j50649N2305j1273m7598p884Q645m7040J23692
11055B15862o6280J72242J33667j42226k9195J3269p0060R2945K46353K5467L3321
$$ plain form
11044 625365 750999 708459 712083 513407 419247 528233 478434 538252 630708 859313 894324
11033 894324 860869 770798 694263 650968 569087 581022 718604 914624 1049501 909601 755820
11022 755820 731297 713587 696948 734771 892542 741501 614018 848816 873759 733908
11012 733908 762711 796269 883223 915174 858159 708161 659246 824714 658840 706861 717498
11001 717498 590295 468957 455426 461008 418562 373612 151515 -15912 -31219 -23404 138866
10990 138866 62847 40201 8134 109455 52618 -16674 -144004 -116728 -101646 -46792 -232
10979 -232 -73638 61279 250966 193846 16632 79589 330041 429035 295341 240420 249710
10968 249710 4658 -99776 63310 218626 75589 27884 -143233 -267075 -288709 -147601
$$ packed form
11044F25365J25634m2540L624j98676r4160J08986m9799N9818R2456K28605L5011
11033H94324l3455r0071p6535m3295q1881J1935J37582J96020J34877j39900j53781
11022G55820k4523j7710j6639L7823J57771j51041j27483K34798K4943j39851
11012G33908K8803L3558Q6954L1951n7015j49998m8915J65468j65874M8021J0637
11001G17498j27203j21338j3531N582m2446m4950k22097j67427j5307P815J62270
10990A38866p6019k2646l2067J01321n6837o9292j27330K7276J5082N4854M6560
10979b32p3406J34917J89687n7120j77214O2957K50452R8994j33694n4921R290
10968B49710k45052j04434J63086J55316j43037m7705j71117j23842k1634J41108
$$ plain form
10958 -147601 -53748 283995 418138 352861 409485 311549 42761 96908 159461 159976 214962
10947 214962 214423 172346 149667 147765 109245 143570 63019 79812 157191 131853 -9678 -56838
10935 -56838 24434 143854 82624 80293 85321 86391 -2269 -115604 45531 250572 208906
10924 208906 79722 59486 98665 75570 102095 54021 91222 112220 -64267 61225 163126
10913 163126 259368 56742 -25241 54720 71756 3954 67475 99914 258496 431190 388844
10902 388844 409286 481887 353177 128058 212752 79692 -57553 -129248 23212 239760
10892 239760 229800 197363 100177 158341 245528 259806 332975 373228 336792 154084 44246
10881 44246 -16031 55826 184573 166866 119512 87037 28934 -90344 -118460 20553 69755
$$ packed form
10958a47601R3853L37743J34143o5277N6624r7936k68788N4147O2553N15N4986
10947B14962n39m2077k2679j902l8520L4325q0551J6793P7379k5338j41531m7160
10935e6838Q1272J19420o1230k331N028J070q8660j13335J61135K05041m1666
10924B08906j29184k0236L9179k3095K6525m8074L7201K0998j76487J25492J01901
10913A63126R6242k02626q1983P9961J7036o7802O3521L2439J58582J72694m2346
10902C88844K0442P2601j28710k25119Q4694j33060j37245p1695J52460K16548
10892B39760r960l2437r7186N8164Q7187J4278P3169M0253l6436j82708j09838
10881D4246o0277P1857J28747j7707m7354l2475n8103j19278k8116J39013M9202
$$ plain form
10870 69755 164565 216442 141224 96377 -4779 63358 149261 291819 293182 139695 -7054
10859 -7054 -51424 -21487 163051 135724 194515 294155 348697 246084 135905 166532 85368
10848 85368 114329 568 94466 273294 262409 41937 -15853 -6825 -3671 -227898 -230031
10837 -230031 -75709 90553 80758 -15918 -25551 41105 172506 202168 188096 185987 172945
10826 172945 140208 -16747 13279 151888 229580 284559 207008 142285 283127 313843 179659
10815 179659 247459 172919 -94802 -209244 -196447 -94865 -110424 -27424 -192209 -212787 -126212
10804 -126212 -108693 -67833 -82984 -59312 55220 127267 19709 156645 104998 50737 251927
10793 251927 289579 261281 127094 135581 176702 149404 137042 256474 269208 130464 26081
$$ packed form
10870F9755R4810N1877p5218m4847j01156O8137Q5903J42558J363j53487j46749
10859g054m4370K9937J84538k7327N8791R9640N4542j02613j10179L0627q1164
10848H5368K8961j13761R3898J78828j0885k20472n7790R028L154k24227k133
10837b30031J54322J66262r795r6676r633O6656J31401K9662j4072k109j3042
10826A72945l2737j56955L0026J38609P7692N4979p7551o4723J40842L0716j34184
10815A79659O7800p4540k67721j14442J2797J01582j5559Q3000j64785k0578Q6575
10804a26212J7519M0860j5151K3672J14532P2047j07558J36936n1647n4261K01190
10793B51927L7652k8298j34187Q487M1121k7298j2362J19432J2734j38744j04383
$$ plain form
10782 26081 -41763 19795 197073 179216 129773 22703 7434 -112050 -188772 -329088 -255883
10771 -255883 -109817 17860 9820 98041 25520 -96326 -162526 -272764 -295693 -136448 -122826
10760 -122826 -43320 -103662 -103889 -65749 -175941 -328913 -259977 -74380 -112435 -148079 -52519
10749 -52519 7276 28046 -29555 23933 -96357 -29666 -96106 -147307 -220731 -170490 -30063
10738 -30063 96066 130565 48840 146821 317450 228209 204431 162317 227845 298174 207522
10727 207522 90762 55743 -7930 68115 145948 264477 364336 247976 297273 419845 542872
10716 542872 556392 419959 562540 615225 440715 378003 348453 334307 450684 480784 592158
10705 592158 567263 688137 639482 566598 442826 381500 324005 427483 459624 350715 299098
$$ packed form
10782B6081o7844O1558J77278j7857m9443j07070j5269j19484p6722j40316P3205
10771b55883J46066J27677q040Q8221p2521j21846o6200j10238k2929J59245J3622
10760a22826P9506o0342k27L8140j10192j52972O8936J85597l8055l5644R5560
10749e2519N9795K0770n7601N3488j20290O6691o6440n1201p3424N0241J40427
10738c0063J26129L4499q1725R7981J70629q9241k3778m2114O5528P0329r0652
10727B07522j16760l5019o3673P6045P7833J18529R9859j16360M9297J22572J23027
10716E42872J3520j36433J42581N2685j74510o2712k9550j4146J16377L0100J11374
10705E92158k4895J20874m8655p2884j23772o1326n7495J03478L2141j08909n1617
$$ plain form
10694 299098 450698 619190 758851 811498 781132 597635 350942 347887 544154 548895 562607
10683 562607 719409 492022 304343 218252 113323 190484 407583 484642 710876 779301
10673 779301 593880 454450 452017 493078 668789 739660 773770 935963 883115 780606 943212
10662 943212 904025 904996 1039838 1119096 1157275 1182650 1356652 1531736 1445452 1483444 1777053
10651 1777053 1846590 1742242 1728734 1883726 2031755 2091483 2260187 2344940 2395581 2416660
10641 2416660 2612703 2839762 3095896 3475643 4058721 4625730 5206747 5889604 6456360
10632 6456360 7284093 8375495 9501130 10727696 12438293 14481026 16895852 19856564
10624 19856564 23820181 28499525 33786172 39772533 45925928 52071864 57888619 63355469
$$ packed form
10694B99098J51600J68492J39661N2647l0366j83497k46693l055J96267M741J3712
10683E62607J56802k27387j87679q6091j04929P7161K17099P7059K26234O8425
10673G79301j85421j39430k433M1061J75711P0871L4110J62193n2848j02509J62606
10662I43212l9187R71J34842P9258L8179K5375J74002J75084q6284L7992K93609
10651A777053O9537j04348j3508J54992J48029N9728J68704Q4753N0641K1079
10641B416660J96043K27059K56134L79747N83078N67009N81017O82857N66756
10632F456360Q27733J091402J125635J226566J710597K042733K414826K960712
10624A9856564L963617M679344N286647N986361O153395O145936N816755N466850
$$ plain form
10616 63355469 68196274 72333364 75930048 79202595 82922259 88059533 95291644 103876083
10608 103876083 113053099 121809933 129462536 135941040 141280627 145127450 146593988 146412451
10600 146412451 146618117 148692661 153566678 161045024 169220123 176490572 181915824 185453957
10592 185453957 186507912 184447903 178191675 168651781 158628778 150799193 146278784 144387128
10584 144387128 143751951 143201698 141873681 139646420 136003315 130311416 121948281 111616118
10576 111616118 101421543 92921318 86335508 81681854 78061598 74835779 71551652 67889736
10568 67889736 63743816 58506642 52341734 45649096 39063890 33248314 28296349 24276635
10560 24276635 21068805 18356895 16214289 14592391 13219481 11966275 10949993 9956505
$$ packed form
10616F3355469M840805M137090L596684L272547L719664N137274P232111Q584439
10608A03876083R177016Q756834P652603O478504N339587L846823J466538j81537
10600A46412451K05666K074544M874017P478346Q175099P270449N425252L538133
10592A85453957J053955k060009o256228r539894j0023003p829585m520409j891656
10584A44387128o35177n50253j328017k227261l643105n691899q363135j0332163
10576A11616118j0194575q500225o585810m653654l620256l225819l284127l661916
10568F7889736m145920n237174o164908o692638o585206n815576m951965m019714
10560B4276635l207830k711910k142606j621898j372910j253206j016282r93488
$$ plain form
10552 9956505 9097657 8293040 7610938 7002971 6508184 6140665 5769332 5358341 5250031
10543 5250031 5124374 4921462 4800359 4706448 4374403 4082455 3802961 3551818 3375819 3259296
10533 3259296 3235471 3084886 3110718 3114102 2935005 2795982 2819887 2742844 2520255 2379687
10523 2379687 2353522 2374817 2314499 2153402 2221564 2194511 2083139 2026315 2030665 1821347 1602172
10512 1602172 1610305 1657649 1479521 1454952 1599641 1540075 1571085 1547463 1400753 1165957 1168103
10501 1168103 1260777 1402104 1180396 1120733 1096021 944571 930092 930105 892951 897086 965867
10490 965867 1128896 1026296 918947 972821 990917 1046816 1096481 1041601 1087082 1056325 1008841
10479 1008841 945630 1051744 1248318 1386384 1119210 937014 985341 1015838 1028767 939668
$$ packed form
10552I956505q58848q04617o82102o07967m94787l67519l71333m10991j08310
10543E250031j25657k02912j21103r3911l32045k91948k79494k51143j75999j16523
10533C259296k3825j50585K5832L384j79097j39023K3905p7043k22589j40568
10523B379687k6165K1295o0318j61097O8162k7053j11372n6824M350k09318k19175
10512A602172Q133M7344j78128k4569J44689n9566L1010k3622j46710k34796K146
10501A168103R2674J41327k21708n9663k4712j51450j4479J3l7154M135O8781
10490I65867J63029j02600j07349N3874J8096N5899M9665n4880M5481l0757m7484
10479A008841o3211J06114J96574J38066k67174j82196M8327L0497J2929q9099
$$ plain form
10469 939668 767986 632710 746800 933811 1005466 972712 887019 787599 738204 623090
10459 623090 572662 469090 518887 578912 627855 632120 543651 501237 429737 334889 447760
10448 447760 529745 589527 582363 631582 689145 747100 737338 744856 721470 751644 727792 731270
10436 731270 637869 750887 779298 744017 629032 879432 951905 827976 644667 540458
10426 540458 602003 762800 663046 639049 685244 593013 595767 510367 492279 468427 454312
10415 454312 660262 663889 379472 272487 474027 602315 443174 375236 337787 286252
10405 286252 223668 350722 324108 353011 210778 265716 357193 375863 205116 152927 323205
10394 323205 422882 498295 481603 470206 471319 394493 410978 378077 420092 444881 464754 625469
$$ packed form
10469I39668j71682j35276J14090J87011P1655l2754q5693r9420m9395j15114
10459F23090n0428j03572M9797O0025M8943M265q8469m2414p1500r4848J12871
10448D47760Q1985N9782p164M9219N7563N7955r762P518k3386L0174k3852L478
10436G31270r3401J13018K8411l5281j14985K50400P2473j23929j83309j04209
10426E40458O1545J60797r9754k3997M6195r2231K754q5400j8088k3852j4115
10415D54312K05950L627k84417j06985K01540J28288j59141o7938l7449n1535
10405B86252o2584J27054k6614K8903j42233N4938R1477J8670j70747n2189J70278
10394C23205R9677P5413j6692j1397J113p6826J6485l2901M2015K4789J9873J60715
$$ plain form
10382 625469 578988 419801 419433 611267 645143 701017 647566 613792 519554 596304 593369 523841
10370 523841 260684 51325 85690 89679 35484 214070 321248 300822 211817 -8305 -109529
10359 -109529 -132740 -68060 224324 139511 -54682 -139217 -76634 11581 96408 193961 301116
10348 301116 210637 272798 298363 326414 311369 227878 123260 77146 211094 161389 -114820
10337 -114820 -199638 -92072 207625 268759 105156 140002 195912 345118 327476 25004
10327 25004 -8003 4126 -47485 119951 145504 222635 225914 190687 250383 404202 334954
10316 334954 206576 80276 -17758 -107535 61422 31647 -55561 -7461 146931 251734
10306 251734 234118 77236 46577 155028 237902 169324 155364 358852 392210 333140 269343
$$ packed form
10382F25469m6481j59187l68J91834L3876N5874n3451l3774r4238P6750k935o9528
10370E23841k63157k09359L4365L989n4195J78586J07178k0426q9005k20122j01224
10359a09529k3211O4680K92384q4813j94193q4535O2583Q8215Q4827R7553J07155
10348C01116r0479O2161K5565K8051j5045q3491j04618m6114J33948m9705k76209
10337a14820q4818J07566K99697O1134j63603L4846N5910J49206j7642l02472
10327B5004l3007J2129n1611J67436K5553P7131L279l5227N9696J53819o9248
10316C34954j28378j26300r8034q9777J68957k9775q7208M8100J54392J04803
10306B51734j7616j56882l0659J08451Q2874o8578j3960K03488L3358n9070o3797
$$ plain form
10295 269343 229140 435283 461243 330055 225257 103316 90740 -15810 -22388 -30097 8408
10284 8408 -21897 -12803 -32817 -16689 -69466 -144560 -330186 -421098 -199596 -87687 -60124
10273 -60124 69132 106443 120025 313154 337280 321260 234456 160006 110090 -60881 -97762
10262 -97762 -125363 34253 124051 149901 186115 87828 25311 15052 26472 292592 446486
10251 446486 296288 50714 -245110 -163072 66685 30021 44002 149679 98421 -35967
10241 -35967 -25762 -43124 -160307 -5925 23479 206901 83340 -128127 -114376 25731
10231 25731 13198 123124 236356 37805 -9922 156666 270947 139349 167031 176977 43909
10220 43909 62372 94301 184048 74079 -45476 80674 136988 224302 341563 311671 325482
$$ packed form
10295B69343m0203K06143K5960j31188j04798j21941j2576j06550o578p709L8505
10284H408l0305R094k0014J6128n2777p5094j85626r0912K21502J11909K7563
10273f0124J29256L7311J3582J93129K4126j6020q6804p4450m9916j70971l6881
10262i7762k7601J59616Q9798K5850L6214r8287o2517j0259J1420K66120J53894
10251D46486j50198k45574k95824Q2038K29757l6664J3981J05677n1258j34388
10241c5967J0205j7362j17183J54382K9404J83422j23561k11467J3751J40107
10231B5731j2533J09926J13232j98551m7727J66588J14281j31598K7682R946j33068
10220D3909J8463L1929Q9747j09969j19555J26150N6314Q7314J17261k9892J3811
$$ plain form
10209 325482 181260 34167 -15410 -18455 -102088 42623 63521 -46936 -8007 234517 294719
10198 294719 101512 94708 223962 84458 88457 151852 94405 121291 122467 100618 199816
10187 199816 350122 274635 346889 473265 484081 499701 504764 569050 551243 633963 661989
10176 661989 633277 576494 587562 470146 394715 367854 500470 627267 739954 698223 803123
10165 803123 865423 926859 867681 826301 758105 684401 795516 837345 882107 1030707 938853
10154 938853 937371 1064401 1021221 773286 718095 748752 780337 897238 1026221 1020720 990477
10143 990477 874307 687871 641099 749504 777730 677114 704389 706286 626322 634580 650274
10132 650274 550043 428008 425440 329717 289570 315591 242823 77645 35840 67603 188547
$$ packed form
10209C25482j44222j47093m9577l045q3633J44711K0898j10457L8929K42524O0202
10198B94719j93207o804J29254j39504L999O3395n7447K6886J176k1849R9198
10187A99816J50306p5487P2254J26376J0816J5620N063O4286j7807Q2720K8026
10176F61989k8712n6783J1068j17416p5431k6861J32616J26797J12687m1731J04900
10165H03123O2300O1436n9178m1380o8196p3704J11115M1829M4762J48600r1854
10154I38853j482J27030m3180k47935n5191L0657L1585J16901J28983n501l0243
10143I90477j16170j86436m6772J08405K8226j00616K7275J897p9964Q258J5694
10132F50274j00231j22035k568r5723m0147K6021p2768j65178m1805L1763J20944
$$ plain form
10121 188547 160320 136498 -1520 135816 317089 403204 177102 142266 252307 181167
10111 181167 159897 178070 150871 195276 -66716 -65394 -183195 -172506 65020 195537 115721
10100 115721 -56707 -227677 -290732 -123671 -40108 -16076 60330 143180 63993 -14066 55592
10089 55592 87496 52502 57719 60234 36887 174779 332283 392643 411318 292980 83112
10078 83112 44148 120004 -48793 9331 86860 -39089 -68435 -95222 -80152 -72423 -247526
10067 -247526 -326487 -114629 -55601 -31732 -80288 -35572 27149 -50086 -69437 -9405 58280
10056 58280 82087 -88976 -63444 -110182 -59701 -189014 -308100 -141963 -19398 -9901 -102190
10045 -102190 -87033 -43509 -99809 -231421 -270323 -416748 -504052 -430927 -448843 -432461 -216751
$$ packed form
10121A88547k8227k3822j38018J37336J81273Q6115k26102l4836J10041p1140
10111A81167k1270J8173k7199M4405k61992J322j17801J0689K37526J30517p9816
10100A15721j72428j70970o3055J67061Q3563K4032P6406Q2850p9187p8059O9658
10089E5592L1904l4994N217K515k3347J37892J57504O0360J8675j18338k09868
10078H3112l8964P5856j68797N8124P7529j25949k9346k6787J5070P729j75103
10067b47526p8961K11858N9028K3869m8556M4716O2721p7235j9351O0032O7685
10056E8280K3807j71063K5532m6738N0481j29313j19086J66137J22565R497r2289
10045a02190J5157M3524n6300j31612l8902j46425q7304P3125j7916J6382K15710
$$ plain form
10034 -216751 -83582 108918 156274 184308 259377 262861 137951 -158119 -65887 -162147 -123795
10023 -123795 107563 150289 -85183 -30935 97207 175099 89858 21102 -142165 -273707
10013 -273707 -205756 -81921 -146734 -328785 -255975 -25329 -47948 -257715 -277070 -159238
10003 -159238 -209608 -263283 -111116 -247617 -308200 -269114 -222910 -131761 -135742 -114346 -59458
9992 -59458 -159091 -200788 -116653 -55189 -178176 -212362 -192057 -221910 -145642 -9845 -34062
9981 -34062 -101266 -46228 123683 64866 -182220 -129179 -175027 -214255 -119120 32466 107268
9970 107268 190511 287942 308498 338387 296762 411568 268345 53362 -83083 -1652 67948
9959 67948 -41785 36312 116333 261402 309122 24279 -257310 -253489 -142190 -92998 108553
$$ packed form
10034b16751J33169J92500M7356K8034P5069L484j24910k96070R2232r6260L8352
10023a23795K31358M2726k35472N4248J28142P7892q5241o8756j63267j31542
10013b73707O7951J23835o4813j82051P2810K30646k2619k09767j9355J17832
10003a59238n0370n3675J52167j36501o0583L9086M6204R1149l981K1396N4888
9992e9458r9633m1697Q4135O1464j22987l4186K0305k9853P6268J35797k4217
9981c4062o7204N5038J69911n8817k47086N3041m5848l9228R5135J51586P4802
9970A07268Q3243R7431K0556K9889m1625J14806j43223k14983j36445Q1431O9600
9959F7948j09733P8097Q0021J45069M7720k84843k81589L821J11299M9192K01551
$$ plain form
9948 108553 209542 194011 4239 -11442 197420 315501 134858 112060 307889 443311
9938 443311 367360 364745 298884 324694 337452 501123 501130 580715 479020 244687 186295 69436
9926 69436 39166 194311 224213 348545 464098 518371 385880 334175 354771 409157 379280
9915 379280 412692 327542 240142 259178 301900 242222 241180 166177 360816 340964 303512 379833
9903 379833 389622 289718 239643 215544 134859 43754 -129069 44154 234033 256621 109054
9892 109054 18311 60134 32271 -96289 -46128 -150366 -87629 -53063 1459 1031 -154959
9881 -154959 -114349 116408 83182 22729 143920 238814 270005 184391 170687 230718 120262
9870 120262 -26580 -197055 -209845 -108667 -81187 2285 -113503 -152763 -178140 -160466 -125855
$$ packed form
9948A08553J00989j5531j89772j5681K08862J18081j80643k2798J95829J35422
9938D43311p5951k615o5861K5810J2758J63671PP9585j01695k34333n8392j16859
9926F9436l0270J55145K9902J24332J15553N4273j32491n1705K0596N4386k9877
9915C79280L3412q5150q7400J9036M2722n9678j042p5003J94639j9852l7452P6321
9903C79833R789r9904n0075k4099q0685r1105j72823J73223J89879K2588j47567
9892A09054r0743M1823k7863j28560N0161j04238O2737L4566N4522m28j55990
9881a54959M0610K30757l3226o0453J21191R4894L1191q5614j3704O0031j10456
9870A20262j46842j70475j2790J01178K7480Q3472j15788l9260k5377J7674L4611
$$ plain form
9859 -125855 -4308 18901 -86740 -23916 54178 16407 21266 58441 6577 -53819 -191570
9848 -191570 -281343 -67845 92662 170805 120327 -3118 -5037 3872 -20992 -42457 -136834
9837 -136834 -34958 -51554 -139983 -223792 -133178 139707 140963 -26262 60542 187816 245344
9826 245344 248477 253729 309105 265167 235686 84167 -28450 -36190 20169 164641 -1440
9815 -1440 -276385 -354590 -235028 -115530 -179690 -245894 -203161 -77195 6376 226393 145064
9804 145064 -29085 -144783 -84394 -83498 -30852 -247456 -257960 -146251 -8498 -7416 -2854
9793 -2854 21942 239737 311209 262783 -34011 -242521 -327169 -249456 -104084 128473 78098
9782 78098 22477 -20089 -107209 -261897 -159446 -11373 -47161 -135499 -75157 41609 -11091
$$ packed form
9859a25855J21547K3209j05641O2824P8094l7771M859L7175n1864o0396j37751
9848a91570q9773K13498J60507P8143n0478j23445j919Q909k4864k1465r4377
9837a36834J01876j6596q8429q3809R0614K72885J256j67225Q6804J27274N7528
9826B45344L133N252N5376m3938k9481j51519j12617p740N6359J44472j66081
9815a440k74945p8205J19562J19498o4160o6204M2733J25966Q3571K20017q1329
9804A45064j74149j15698O0389Q96N2646k16604j0504J11709J37753J082M562
9793b854K4796K17795P1472m8426k96794k08510q4648P7713J45372K32557n0375
9782G8098n5621m2566q7120j54688J02451J48073l5788q8338O0342J16766n2700
$$ plain form
9771 -11091 121699 214751 288810 281361 -108377 -166131 -176450 -289206 -222546 -108708 -41262
9760 -41262 -7565 85711 32094 -54894 -22091 57620 7983 -47871 9747 122713 15304
9749 15304 -20772 -2177 -92960 -108605 -17967 265334 116679 -60343 31553 30020 -30779
9738 -30779 -84523 -110301 -40462 137846 71973 134893 169776 212978 100341 135028 219973
9727 219973 220110 136218 163870 192223 185507 83490 -26510 -211023 -363080 -282724 -77785
9716 -77785 -148061 -303791 -253602 -237504 -172412 24915 344 -16590 5403 36958 50199
9705 50199 86673 40055 -6521 87725 162329 50567 -67803 -81203 -256685 -482693 -465037
9694 -465037 -416069 -314443 -297287 -157814 -85370 -102951 34638 40690 22134 82598 116607
$$ packed form
9771a1091J32790R3052P4059p449l89738n7754j0319j12756O6660J13838O7446
9760d1262L3697R3276n3617q6988L2803P9711m9637n5854N7618J12966j07409
9749A5304l6076J8595r0783j5645R0638K83301j48655j77022R1896j533o0799
9738c0779n3744k5778O9839J78308o5873O2920L4883M3202j12637L4687Q4945
9727B19973J37q3892K7652K8353o716j02017j10000j84513j52057Q0356K04939
9716g7785p0276j55730N0189J6098O5092J97327k4571j6934K1993L1555J3241
9705E0199L6474m6618m6576R4246P4604j11762j18370j3400j75482k26008J7656
9694d65037M8968J01626J7156J39473P2444j7581J37589O052j8556O0464L4009
$$ plain form
9683 116607 151348 245753 273116 241261 320019 212278 152361 83245 31171 -118435 -223074
9672 -223074 -113721 96240 98828 155942 -14377 -200364 -40227 179549 287869 331896
9662 331896 430819 364104 378207 358703 389057 466759 521064 536184 482709 534422 605171 688947
9650 688947 649418 442984 398427 435872 335946 310108 331849 300426 277092 478335 525689
9639 525689 418718 273752 216415 257524 235064 210506 111339 32839 187129 239485 67224
9628 67224 195993 242711 164348 132553 264341 188929 113947 249861 205735 158868 -73926
9617 -73926 -87471 -21140 -93456 -5270 107016 198081 307912 121426 -41547 -61787 23299
9606 23299 160707 256558 306069 232666 207885 75210 38020 40559 203416 227625 197454
$$ packed form
9683A16607L4741R4405K7363l1855P8758j07741n9917o9116n2074j49606j04639
9672b23074J09353K09961K588N7114j70319j85987J60137K19776J08320M4027
9662C31896R8923o6715J4103j9504L0354P7702N4305J5120n3475N1713P0749Q3776
9650F88947l9529k06434m4557L7445r9926k5838K1741l1423k3334K01243M7354
9639E25689j06971j44966n7337M1109k2460k4558r9167p8500J54290N2356j72261
9628F7224J28769M6718p8363l1795J31788p5412p4982J35914m4126m6867k32794
9617g3926j3545O6331p2316Q8186J12286R1065J09831j86486j62973k0240Q5086
9606B3299J37408R5851M9511p3403k4781j32675l7190K539J62857K4209l0171
$$ plain form
9595 197454 122564 41729 -68548 -104187 55880 98094 65666 -84138 -252699 -165267 -39367
9584 -39367 45181 86078 30302 -96246 74355 236474 235254 179444 -624 -61941 -141838
9573 -141838 -113557 -30044 137196 90508 -92984 -113880 -161951 -356709 -317064 -137269 18385
9562 18385 81602 136117 56013 88355 151295 283422 169425 171455 99843 1504 6825 7737
9550 7737 -70976 17561 162824 197662 169496 -92899 -15913 157766 125707 58410 200758
9539 200758 243462 170153 99526 92917 44093 100296 104551 168397 144229 195255 184609 -137964
9527 -137964 -235639 -24835 139198 159690 134108 81361 121430 61971 89666 41194 27923
9516 27923 -50779 -24463 47360 20899 27989 103517 102146 -15220 -163074 -180051 -40454 14867
$$ packed form
9595A97454p4890q0835j10277l5639J60067M2214l2428j49804j68561Q7432J25900
9584c9367Q4548M0897n5776j26548J70601J62119j220n5810j80068o1317p9897
9573a41838K8281Q3513J67240m6688j83492k0896m8071j94758L9645J79795J55654
9562A8385O3217N4515q0104L2342O2940J32127j13997K030p1612r8339N321R12
9550G737p8713Q8537J45263L4838k8166k62395P6986J73679l2059o7297J42348
9539B00758M2704p3309p0627o609m8824N6203M255O3846k4168N1026j0646l22573
9527a37964r7675K10804J64033K0492k5582n2747M0069n9459K7695m8472j3271
9516B7923p8702K6316P1823k6461P090P5528j371j17366j47854j6977J39597N5321
$$ plain form
9504 14867 216857 18254 -46863 -10519 -67708 -47079 128758 142849 13981 6725 832
9493 832 14976 -8096 131451 220906 328495 266665 335921 437087 379930 320665 257014 95403
9481 95403 -37844 8475 9173 946 23505 152957 102109 18962 181800 221122 135402 12888
9469 12888 109057 323919 220704 -57982 -44318 -12571 -65980 -91953 -129928 -28310 -73422
9458 -73422 -93216 1864 42077 11736 59465 62225 48898 62402 -26022 -188784 -115648 -43977
9446 -43977 -123982 -70071 -208579 -356706 -441935 -350152 -181872 -194605 -245725 -312868 -184317
9435 -184317 92210 147078 -38708 -314434 -507413 -400328 -194045 -59226 -218964 -352502
9425 -352502 -417452 -277456 -160441 -217511 -139672 -92515 -139059 -153773 -128812 -164966 -68115
$$ packed form
9504A4867K01990j98603o5117L6344n7189K0629J75837J4091j28868p256n893
9493H32J4144k3072J39547Q9455J07589o1830O9256J01166n7157n9265o3651j61611
9481I5403j33247M6319O98q227K2559J29452n0848q3147J62838L9322q5720j22514
9469A2888R6169K14862j03215k78686J3664L1747n3409k5973l7975J01618m5112
9458g3422j9794R5080M0213l0341M7729K760j3327J3504q8424j62762P3136P1671
9446d3977q0005N3911j38508j48127q5229R1783J68280j2733n1120o7143J28551
9435a84317K76527N4868j85786k75726j92979J07085K06283J34819j59738j33538
9425c52502o4950J39996J17015n7070P7839M7157m6544j4714K4961l6154R6851
$$ plain form
9414 -68115 -65540 -26893 40380 221560 375551 295001 209458 163089 91901 -31679 -113274
9403 -113274 -209073 33423 247767 178193 -76723 -107943 -106649 -84081 73730 185297 85154
9392 85154 18619 83264 131906 34667 87333 157330 -76830 -128577 -132462 -133277 -244181 -207452
9380 -207452 -198796 -251891 -293108 -179140 -128231 -79875 -77050 -139337 -228083 -253230 -116679 -1654
9368 -1654 -133471 -165825 -178755 -324946 -305720 -377984 -259863 -108192 -188649 -85694 33921
9357 33921 -158 -26159 9903 -31330 -88916 -149766 -160089 -56070 -19065 -31903 -1825 5373
9345 5373 86785 247652 226598 148148 57937 -17405 -99399 -218312 -309227 -144269 -44149
9334 -44149 -62370 49786 -107246 -255372 -194139 -88452 -38048 -3386 -44332 -104644 37006
$$ packed form
9414f8115K575L8647O7273J81180J53991q0550q5543m6369p1188j23580q1595
9403a13274r5799K42496K14344o9574k54916l1220J294K2568J57811J11567j00143
9392H5154o6535O4645M8642r7239N2666O9997k34160n1747l885q15j10904L6729
9380b07452Q656n3095m1217J13968N0909M8356K825o2287q8746k5147J36551J15025
9368a654j31817l2354j2930j46191J9226p2264J18121J51671q0457J02955J19615
9357C3921l4079k6001L6062m1233n7586o0850j0323J04019L7005j2838L0078P198
9345E373Q1412J60867k1054p8450r0211p5342q1994j18913r0915J64958J00120
9334d4149j8221J12156j57032j48126O1233J05687N0404L4662m0946o0312J41650
$$ plain form
9323 37006 23360 -10711 -149523 -142149 5657 214965 267337 143954 -22971 -183256 -99032
9312 -99032 25144 228040 296842 417159 387186 212967 197366 232728 313931 543550 561623
9301 561623 456316 461497 367521 213609 229854 346504 327800 395724 339107 333108 211164
9290 211164 158546 263363 277049 91566 116602 135482 191348 203431 81854 58092 -6920
9279 -6920 -102728 42405 86815 -149053 -190001 -12811 -30037 -10894 100179 104102 53879
9268 53879 -18559 139765 133316 50037 -64766 -185345 -147410 100734 95613 -7173 25745
9257 25745 -18225 -233191 -201601 19137 173787 317930 194840 1080 -27746 -63359 -98607
9246 -98607 -162751 -261637 -366425 -401347 -227823 -187695 -92045 -86153 -85331 159491 242073 97588
$$ packed form
9323C7006j3646l4071j38812P374J47806K09308N2372j23383j66925j60285Q4224
9312i9032J24176K02896O8802J20317k9973j74219j5601L5362Q1203K29619J8073
9301E61623j05307N181r3976j53912J6245J16650j8704O7924n6617n999j21944
9290B11164n2618J04817J3686j85483K5036J8880N5866J2083j21577k3762o5012
9279f920r5808J45133M4410k35868m0948J77190j7226J9143J11073L923n0223
9268E3879p2438J58324o449q3279j14803j20579L7935K48144n121j02786L2918
9257B5745m3970k14966L1590K20738J54650J44143j23090j93760k8826l5613l5248
9246i8607o4144r8886j04788l4922J73524M0128R5650N892Q22K44822Q2582j44485
$$ plain form
9234 97588 -95986 -151093 -86056 -53865 109995 157826 241834 318433 416109 340906 296804
9223 296804 388470 272237 275926 239794 194639 240768 222182 40593 -64489 -63261 -218631
9212 -218631 -267307 -59017 -67158 -149987 1616 58166 23201 12633 22755 -32528 -31363 -12190
9200 -12190 264800 307540 184391 8327 34376 221740 310036 225753 129551 105367 20275
9189 20275 43512 37687 20023 177349 150176 -16626 -90628 -137798 -179222 -106011 -99762 -140417
9177 -140417 -160924 -116114 -87923 -36239 111472 103539 29359 114024 48441 -67881 74260
9166 74260 235547 193005 209066 72771 -3525 153887 244968 98138 40741 15997 270714
9155 270714 350237 242570 53298 254 -99038 -86476 -97986 -144471 -157552 -138179 -167435
$$ packed form
9234I7588j93574n5107O5037L2191J63860M7831Q4008P6599R7676p5203m4102
9223B96804R1666j16233L689l6132m5155M6129j8586j81589j05082J228j55370
9212b18631m8676K08290q141q2829J51603N6550l4965j0568J0122n5283J165J9173
9200a2190K76990M2740j23149j76064K6049J87364Q8296q4283r6202k4184q5092
9189B0275K3237n825j7664J57326k7173j66802p4002m7170m1424P3211O249m0655
9177a40417k0507M4810K8191N1684J47711p933p4180Q4665o5583j16322J42141
9166G4260J61287m2542J6061j36295p6296J57412R1081j46830n7397k4744K54717
9155B70714P9523j07667j89272n3044r9292J2562j1510m6485j3081J9373k9256
$$ plain form
9144 -167435 -2458 79522 104940 -40025 11494 112861 189141 103790 102413 89763 203261
9133 203261 175147 -4890 52637 84890 59698 8336 -64661 -44498 -181277 -177318 -182033 -285438
9121 -285438 -276821 -132646 -63754 -90063 -117304 -141587 -144108 -27855 30321 -24738 -138939
9110 -138939 -123513 -224788 -224410 -72786 -53154 28671 -83505 -174167 -127062 14842 160668
9099 160668 179792 226944 190024 79675 26054 57402 -55476 -123977 -68717 -209626 -321317
9088 -321317 -291270 -185194 -154178 -132379 99696 254882 212849 159918 203031 209164 300724
9077 300724 25326 -108037 -123004 -130917 76731 203953 172765 79339 74474 -13809 222
9066 222 -180835 -274274 -258263 -244085 -231437 -241963 -145851 -57473 26967 220124 276770 136721
$$ packed form
9144a67435J64977Q1980K5418j44965N1519J01367P6280q5351j377j2650J13498
9133B03261k8114j80037N7527L2253k5192n1362p2997K0163j36779L959m715j03405
9121b85438Q617J44175O8892k6309k7241k4283k521J16253N8176n5059j14201
9110a38939J5426j01275L78J51624J9632Q1825j12176r0662M7105J41904J45826
9099A60668J9124M7152l6920j10349n3621L1348j12878o8501N5260j40909j11691
9088c21317L0047J06076L1016K1799K32075J55186m2033n2931M3113O133R1560
9077C00724k75398j33363j4967p913K07648J27222l1188r3426m865q8283J4031
9066B22j81057r3439J6011J4178J2648j0526R6112Q8378Q4440J93157N6646j40049
$$ plain form
9054 136721 5709 4059 72559 -77777 -123533 -84744 -70468 4367 48427 -18557 -134558
9043 -134558 -229666 -191263 -186104 -155688 2793 115272 150362 226786 289408 315109 275989
9032 275989 -52098 -214408 -81945 74765 170007 217353 121951 73769 59485 -54405 -159783
9021 -159783 -190134 -176803 -60528 -118374 -84331 47908 -136309 -326505 -175978 -331610
9011 -331610 -392559 -418881 -134771 66216 146027 187714 142617 91380 47765 59033 -5774
9000 -5774 -187272 -69472 112160 139630 23477 -8805 103849 245625 277074 237937 97740
8989 97740 4785 106277 17180 61824 170591 -30106 -91038 106743 75753 80435 123982
8978 123982 50370 216406 330576 279084 190847 127740 74518 -10346 -47848 15355 169081
$$ packed form
9054A36721j31012j650O8500j50336m5756L8789J4276P4835M4060o6984j16001
9043a34558r5108L8403N159L0416J58481J12479L5090P6424O2622K5701l9120
9032B75989l28087j62310J32463J56710R5242M7346r5402m8182j4284j13890j05378
9021a59783l0351J3331J16275n7846L4043J32239j84217j90196J50527j55632
9011c31610o0949k6322K84110K00987P9811M1687m5097n1237m3615J1268o4807
9000e774j81498J17800J81632K7470j16153l2282J12654J41776L1449l9137j40197
8989I7740r2955J01492q9097M4644J08767k00697o0932J97781l0990M682M3547
8978A23982p3612J66036J14170n1492q8237o3107n3222q4864l7502O3203J53726
$$ plain form
8967 169081 265765 279769 119838 174598 199516 219543 150699 72833 30424 130409 -8730
8956 -8730 22637 98682 256986 149828 12359 -72339 -65923 -85179 -31046 -148100 -268766
8945 -268766 -84871 -58850 -85139 -252768 -184496 -162500 -216204 -61725 -3155 -166838 -410167
8934 -410167 -287513 16995 121843 149756 170682 118244 206731 355749 431122 285660 172114
8923 172114 -21867 -108419 -100942 23235 39445 116517 11143 3120 -135590 -256163 -183686
8912 -183686 -256795 -359368 -248237 -48961 -71051 -10540 34754 -34629 21026 -24956 -179399
8901 -179399 -162350 -44815 26079 8968 212835 357070 206107 18729 43883 69111 191473
8890 191473 155232 -2708 -106598 -193705 -305211 -309892 -289523 -422067 -384201 -323252 -168698
$$ packed form
8967A69081R6684J4004j59931N4760K4918K0027o8844p7866m2409R9985j39139
8956h730L1367P6045J58304j07158j37469q4698O416j9256N4133j17054j20666
8945b68766J83895K6021k6289j67629O8272K1996n3704J54479N8570j63683k43329
8934d10167J22654L04508J04848K7913K0926n2438Q8487J49018P5373j45462j13546
8923A72114j93981q6552P477J24177J6210P7072j05374q023j38710j20573P2477
8912a83686p3109j02573J11131J99276k2090O0511M5294o9383N5655m5982j54443
8901a79399J7049J17535P0894j7111K03867J44235j50963j87378K5154K5228J22362
8890A91473l6241j57940j03890q7107j11506m681K0369j32544L7866O0949J54554
$$ plain form
8879 -168698 -81252 -57972 41610 -103680 -222782 -10386 169160 205319 295264 242572 107021
8868 107021 11739 35061 -28555 -34490 17231 -23149 46638 222344 267867 119080 93111
8857 93111 54927 -27802 39557 114813 98363 37125 56712 234802 355154 461957 288043
8846 288043 129368 50755 129077 252102 226067 118344 194641 68048 -188605 -143551 103182
8835 103182 290774 132972 209993 210787 197657 36707 258433 334999 194533 137248 79035
8824 79035 25416 104258 310568 316854 239755 131522 7901 -117535 -129440 -145511 -76097
8813 -76097 -14307 119896 104187 83812 230717 108076 -31318 -6703 -79084 -197541 -240062
8802 -240062 -149067 -153951 -66047 71535 94218 -112712 -110601 26052 133723 313570 310408
$$ packed form
8879a68698Q7446K3280R9582j45290j19102K12396J79546L6159Q9945n2692j35551
8868A07021r5282K3322o3616n935N1721m0380O9787J75706M5523j48787k5969
8857I3111l8184q2729O7359P5256j6450o1238J9587J78090J20352J06803j73914
8846B88043j58675p8613P8322J23025k6035j07723P6297j26593k56653M5054K46733
8835A03182J87592j57802P7021P94j3130j60950K21726P6566j40466n7285n8213
8824G9035n3619P8842K06310O286p7099j08233j23621j25436j1905j6071O9414
8813g6097O1790J34203j5709k0375J46905j22641j39394K4615p2381j18457m2521
8802b40062R0995m884Q7904J37582K2683k06930K111J36653J07671J79847l162
$$ plain form
8791 310408 231366 292375 241028 99912 -65003 -12615 -28818 -135046 -98594 -71975 -38089
8780 -38089 97501 148356 4920 -21388 46710 131266 -13944 -77487 -173569 -309422 -132158
8769 -132158 78940 53894 -27632 -100977 -63861 -52715 -12774 -88065 -60293 73477 75047
8758 75047 -40377 68688 11564 -6940 -12094 127003 135113 152496 149703 66041 184867 291544
8746 291544 250189 88655 8657 -48612 -126 26958 76591 148898 84590 -17710 -159812
8735 -159812 -202411 -211856 -200834 -81441 43371 -3644 47288 17992 53876 151618 263856
8724 263856 220254 20923 -14206 39878 167780 299076 184957 194993 235597 130542 173012
8713 173012 80447 30216 104000 305496 281931 428730 557287 503555 413234 558008 449335
$$ packed form
8791C10408p9042O1009n1347j41116j64915N2388j6203j06228L6452K6619L3886
8780c8089J35590N0855j43436k6308O8098Q4556j45210o3543r6082j35853J77264
8769a32158K11098k5046q1526p3345L7116J1146L9941p5291K7772J33770J570
8758G5047j15424J09065n7124j8504n154J39097Q110J7383k793q3662J18826J06677
8746B91544m1355j61534p9998n7269M8486K7084M9633P2307o4308j02300j42102
8735a59812m2599r445J1022J19393J24812m7015N0932k9296L5884R7742J12238
8724B63856m3602j99331l5129N4084J27902J31296j14119J0036M0604j05055M2470
8713A73012r2565n0231P3784K01496k3565J46799J28557n3732r0321J44774j08673
$$ plain form
8702 449335 229141 213201 263970 186588 106635 85137 127994 42865 83880 -3181 -25029
8691 -25029 -91615 -142294 -70817 -5527 -74672 -104301 -7044 163362 68849 -81615 -63874
8680 -63874 30892 37208 163629 65242 43122 315175 502950 468960 409678 275296 23845
8669 23845 -105286 -158820 36974 -37219 -94800 -11116 108260 18243 24885 140540 8039
8658 8039 -47721 13567 11185 -121078 -282403 -193544 -72496 11027 9408 157111 187586 214012
8646 214012 190910 255919 275611 271937 472039 483390 258689 119416 48242 -151663 -132597
8635 -132597 12576 100647 103545 237396 215323 125173 -17010 114681 -53699 -63720 138812
8624 138812 176865 -39044 -65832 -28822 120858 175454 184103 218085 226756 111390 12039
$$ packed form
8702D49335k20194j5940N0769p7382p9953k1498M2857q5129M1015q7061k1848
8691b5029o6586n0679P1477O5290o9145k9629R7257J70406r4513j50464J7741
8680f3874R4766O316J26421r8387k2120K72053J87775l3990n9282j34382k51451
8669B3845j29131n3534J95794p4193n7581Q3684J19376r0017O642J15655j32501
8658H039n5760O1288k382j32263j61325Q8859J21048Q3523j619J47703L0475K6426
8646B14012k3102O5009J9692l674K00102J1351k24701j39273p1174j99905J9066
8635a32597J45173Q8071K898J33851k2073r0150j42183J31691j68380j0021K02532
8624A38812L8053k15909k6788L7010J49680N4596Q649L3982Q671j15366r9351
$$ plain form
8613 12039 140077 196526 115067 -57866 -54207 76906 131822 54876 35664 181020 263498
8602 263498 245172 340064 507121 374688 280794 168394 213957 113490 145350 226205 254719
8591 254719 92984 -51953 -183989 -63052 122452 182821 148703 104383 124094 209847 7094
8580 7094 -85256 95516 -16274 -1317 107736 3718 -43923 76012 93742 147809 172699
8569 172699 218115 210744 83415 -84096 -62161 59959 117339 250524 175771 657 31049
8558 31049 24868 85648 126144 67750 9101 12003 -124859 -166092 -85626 -37725 122395 87161
8546 87161 -137904 -271535 -343605 -254496 -182937 -329163 -326330 -265663 -243401 -275628 -149061
8535 -149061 -149864 -70628 29779 6721 -43397 -81482 -50266 -75841 152019 277849 304460
$$ packed form
8613A2039J28038N6449q1459j72933L659J31113N4916p6946j9212J45356Q2478
8602B63498j8326R4892J67057j32433r3894j12400M5563j00467L1860Q0855K8514
8591B54719j61735j44937j32036J20937J85504O0369l4118m4320J9711Q5753k02753
8580G094r2350J80772j11790J4957J09053j04018m7641J19935J7730N4067K4890
8569A72699M5416p371j27329j67511K1935J22120N7380J33185p4753j75114L0392
8558C1049o181O0780M0496n8394n8649K902j36862m1233Q0466M7901J60120l5234
8546H7161k25065j33631p2070Q9109P1559j46226K833O0667K2262l2227J26567
8535a49061q03P9236J00407k3058n0118l8085L1216k5575K27860J25830K6611
$$ plain form
8524 304460 232079 209838 139831 206727 -33727 -31655 -6294 -67924 -103055 -41302 24915 -3816
8512 -3816 20571 72442 34499 -10698 -114210 146790 203779 111097 57375 -26436 -142443
8501 -142443 -189499 -109329 -208084 -202623 -165340 -144731 -266705 -222399 -96104 38002 6975
8490 6975 -95761 -182652 -101662 -80877 -55450 -31723 -140742 -167768 -313940 -294350 -88012
8479 -88012 -8571 70472 173156 119194 144680 173961 77339 -141498 -206958 -142692 -52212
8468 -52212 20811 -11097 38194 102139 57287 45908 121151 62009 70958 20708 39804 32768
8456 32768 20345 -3142 71787 119798 110718 29205 29002 53028 -27275 80877 4331 82599
8444 82599 391917 429011 304867 192251 10748 -55736 185545 141128 13279 49822 68942
$$ packed form
8524C04460p2381k2241p0007O6896k40454K072K5361o1630l5131O1753O6217k8731
8512c816K4387N1871l7943m5197j03512K61000N6989r2682n3722q3811j16007
8501a42443m7056Q0170r8755N461L7283K0609j21974M4306J26295J34106l1027
8490F975j02736q6891Q0990K0785K5427K3727j09019k7026j46172J9590K06338
8479h8012P9441P9043J02684n3962K5486K9281r6622k18837o5460O4266R0480
8468e2212P3023l1908M9291O3945m4852j1379P5243n9142Q949n0250J9096p036
8456C2768j2423k3487P4929M8011r080q1513k03K4026q0303J08152p6546P8268
8444H2599L09318L7094j24144j12616j81503o6484K41281m4417j27849L6543J9120
$$ plain form
8433 68942 226161 173155 99437 -84340 -98324 -36469 -79116 -64157 -16320 -4906 33460
8422 33460 2385 221 98738 -29487 46029 292892 309374 207310 202718 170421 96521 156004
8410 156004 301953 110979 38955 99400 49136 -32279 31986 16923 -6526 -5121 -87836
8399 -87836 93023 200138 113589 63693 142564 278964 369511 358315 315761 203985 179586
8388 179586 155289 150634 658 -65363 -202812 -167190 -52700 -35404 42136 -33554 -72776
8377 -72776 8211 32094 514 -132724 -350246 -386077 -267400 -280201 -48876 24943 -130469
8366 -130469 -128929 -11261 125929 -2434 -139597 -86204 -213564 -89372 -15140 126304
8356 126304 210723 164056 214573 107592 -59046 -52449 218107 487001 489706 447367 254785
$$ packed form
8433F8942J57219n3006p3718j83777j3984O1855m2647J4959M7837J1414L8366
8422C3460l1075k164R8517j28225P5516K46863J6482j02064m592l2297p3900N9483
8410A56004J45949j90974p2024O0445n0264q1415O4265j5063k3449J405q2715
8399h7836J80859J07115q6549m9896P8871J36400R0547j1196m2554j11776k4399
8388A79586k4297m655j49976o6021j37449L5622J14490J7296P7540p5690l9222
8377g2776Q0987K3883l1580j33238k17522l5831J18677j2801K31325P3819j55412
8366a30469J540J17668J37190j28363j37163N3393j27360J24192P4232J41444
8356A26304Q4419m6667N0517j06981j66638O597K70556K68894K705m2339j92582
$$ plain form
8345 254785 347867 602266 652162 658611 536884 364557 246424 241629 223254 286536 490667
8334 490667 452405 156114 49749 -43874 -192404 -225091 -204581 -214627 -200113 -199497 -66812
8323 -66812 -14721 -131513 -198941 -152499 14089 208177 259565 267878 352404 357872 442880 437660
8311 437660 338495 352130 410009 366328 178621 188021 247677 433273 688599 921768 837340
8300 837340 667569 716150 747190 945686 826903 786279 703215 656072 520525 210264 92541
8289 92541 196800 117481 159803 173267 137054 150064 166384 138709 66136 -56455 -81651
8278 -81651 -124573 -195493 68341 258689 186268 155096 236270 98546 112078 196680 382103
8267 382103 366223 249512 240639 221954 360055 408758 261435 115684 77208 220721 380241
$$ packed form
8345B54785R3082K54399M9896O449j21727j72327j18133m795j8375O3282K04131
8334D90667l8262k96291j06365r3623j48530l2687K0510j0046J4514O16J32685
8323f6812N2091j16792o7428M6442J66588J94088N1388Q313Q4526N468Q5008n220
8311D37660r9165J3635N7879m3681j87707R400N9656J85596K55326K33169q4428
8300H37340j69771M8581L1040J98496j18783m0624q3064m7143j35547l10261j17723
8289I2541J04259p9319M2322J3464l6213J3010J6320k7675p2573j22591k5196
8278h1651m2922p0920K63834J90348p2421l1172Q1174j37724J3532Q4602J85423
8267C82103j5880j16711q873j8685J38101M8703j47323j45751l8476J43513J59520
$$ plain form
8256 380241 430624 437501 326756 298117 317237 325336 289521 245400 262656 248254 242182 298777
8244 298777 324665 146540 102899 -54584 -333984 -303310 -327937 -358991 -190853 -155506 -78586
8233 -78586 -34408 115649 99675 89123 138833 65137 -39989 123447 144889 221636 109260
8222 109260 17626 -20950 62294 77659 -1624 109602 123575 119974 118249 39176 -87332 -53242
8210 -53242 -181694 -319893 -183708 11469 -2404 -264517 -235693 -176843 -199815 -153184 -269867
8199 -269867 -167932 -172474 -149619 -93713 3221 121212 165852 138083 77723 33513 -79371
8188 -79371 -105488 -46678 3768 -53308 -155751 -63875 76378 185760 99221 104843 244923
8177 244923 301563 123940 -9901 -40237 -88191 -27962 -40301 -172492 -350126 -512485 -482964
$$ packed form
8256C80241N0383O877j10745k8639J9120Q099l5815m4121J7256j4402o072N6595
8244B98777K5888j78125m3641j57483k79400L0674k4627l1054J68138L5347P6920
8233g8586M4178J50057j5974j0552M9710p3696j05126J63436K1442P6747j12376
8222A09260r1634l8576Q3244J5365p9283J11226J3973l601j725p9073j26508L4090
8210e3242j28452j38199J36185J95177j3873k62113K8824N8850k2972M6631j16683
8199b69867J01935m542K2855N5906R6934J17991M4640k7769o0360m4210j12884
8188g9371k6117N8810N0446n7076j02443R1876J40253J09382q6539N622J40080
8177B44923N6640j77623j33841l0336m7954O0229j2339j32191j77634j62359K9521
$$ plain form
8166 -482964 -273283 -81466 -20119 18443 -263345 -321377 -248495 -174058 -156875 -77676 -68188
8155 -68188 -97911 -191430 -199927 -41999 -76538 -145523 -191456 -72260 191440 313356 217342
8144 217342 25052 -61492 -193459 -221287 -197852 -232201 -240320 -203619 -196211 -102599 -127755 -263058
8132 -263058 -233061 -61522 63445 84061 126748 349933 369274 181524 2908 -7724 96886
8121 96886 44066 121653 227722 178488 99338 289525 346163 227515 151791 237505 108793
8110 108793 109388 64386 -212768 -366736 -342705 -167593 -156272 -179060 -214171 -210681 -117703 65909
8098 65909 149221 121533 181011 294949 285938 54494 -34684 -7046 107998 154162 -73469
8087 -73469 -156483 21526 39644 -151951 3382 236262 190108 136908 -18823 -115658 -135743
$$ packed form
8166d82964K09681J91817O1347L8562k81788n8032P2882P4437J7183P9199R488
8155f8188k9723r3519q497J57928l4539o8985m5933J19196K63700J21916r6014
8144B17342j92290q6544j31967k7828K3435l4349q119L6701P408R3612k5156j35303
8132b63058K9997J71539J24967K0616M2687K23185J9341j87750j78616j0632J04610
8121I6886n2820P7587J06069m9234p9150J90187N6638j18648p5724Q5714j28712
8110A08793N95m5002k77154j53968K4031J75112J1321k2788l5111L490R2978J83612
8098F5909Q3312k7688N9478J13938r011k31444q9178K7638J15044M6164k27631
8087g3469q3014J78009J8118j91595J55333K32880m6154n3200j55731r6835k0085
$$ plain form
8076 -135743 30697 32852 138281 110122 115308 110223 222667 313053 398700 318103 185759
8065 185759 1579 -228270 -142917 -99137 -137490 16006 107789 62015 278284 284135 119915
8054 119915 166219 170317 69449 -24640 11054 -69815 76994 55909 -2995 -57994 -106465
8043 -106465 26142 -27588 -156510 -149379 -154811 -120769 -31453 -163869 -157043 -258317 -203513
8032 -203513 -310159 -276281 -154065 -82995 107075 95887 11472 66351 45085 2879 -118673
8021 -118673 -108245 -123604 -130458 -110486 75269 298346 208505 44187 100930 142731 167154
8010 167154 168439 -47688 -4599 135638 182554 89766 6657 -65065 -136715 -161896 -183423
7999 -183423 -154053 -112135 -139553 -91437 -8554 -145753 -212138 -29450 10177 -9417 20583
$$ packed form
8076a35743J66440K155J05429k8159N186n085J12444R0386Q5647q0597j32344
8065A85759j84180k29849Q5353M3780l8353J53496R1783m5774K16269N851j64220
8054A19915M6304M098j00868r4089L5694q0869J46809k1085n8904n4999m8471
8043a06465J32607n3730j28922P131n432L4042Q9316j32416O826j01274N4804
8032b03513j06646L3878J22216P1070J90070j1188q4415N4879k1266m2206j21552
8021a18673J0428j5359o854J9972J85755K23077q9841j64318N6743M1801K4423
8010A67154J285k16127M3089J40237M6916r2788q3109p1722p1650k5181k1527
7999a83423K9370M1918k7418M8116Q2883j37199o6385J82688L9627j9594L0000
$$ plain form
7988 20583 -13838 99202 92599 6887 -62567 55385 277399 370640 248946 131223 -86097
7977 -86097 -300197 -200041 -162301 -117028 -30048 150361 110887 -55559 29653 52120 63435
7966 63435 62941 5830 -16647 62654 162886 52300 -1635 -4974 -12917 -19702 190825 231910
7954 231910 145617 61315 82344 141422 171362 143053 14006 -127572 -61741 -33968 -128633
7943 -128633 -140051 -24609 55442 149527 -6271 -15775 -32138 8881 -4276 5854 23271
7932 23271 9886 -123368 -315671 -278030 -167452 -126396 -243346 -280952 -162018 -200934 -233977
7921 -233977 -38158 122112 62645 6443 28676 18841 63614 -4836 -7389 40149 -175818
7910 -175818 -139232 17945 74623 -194734 -352246 -335181 -381627 -311758 -176973 -13874 3921
$$ packed form
7988B0583l4421J13040o603q5712o9454J17952K22014R3241j21694j17723k17320
7977h6097k14100J00156L7740M5273Q6980J80409l9474j66446Q5212K2467J1315
7966F3435m94n7111k2477P9301J00232j10586n3935l339p943o785K10527M1085
7954B31910q6293q4302K1029N9078K9940k8309j29047j41578O5831K7773r4665
7943a28633j1418J15442Q0051R4085j55798r504j6363M1019j3157J0130J7417
7932B3271j3385j33254j92303L7641J10578M1056j16950l7606J18934l8916l3043
7921b33977J95819J60270n9467n6202K2233r835M4773o8450k553M7538k15967
7910a75818L6586J57177N6678k69357j57512J7065m6446O9869J34785J63099J7795
$$ plain form
7899 3921 117113 9410 698 116363 12031 -101609 -36942 10495 48303 71663 -30316
7888 -30316 -17027 -144451 -153417 -212799 -137173 -18480 23691 -88193 -8711 144188 215349
7877 215349 146560 -41783 -37120 26603 -78998 55624 124701 -108684 -93515 34099 95897
7866 95897 35572 30979 25290 -52891 -14812 158797 154627 52181 -14267 39355 -81884 -182555
7854 -182555 -230122 -116016 -79161 -133925 -279436 -198052 -182812 1748 -19087 -84649 -152000
7843 -152000 -204263 -227365 -209849 -298206 -234592 -124733 -299426 -300644 -307374 -235285 -248421 -177317
7831 -177317 -234820 -237820 -194939 -196007 -163013 -51967 177704 262902 160016 161517 -734
7820 -734 -119897 -97250 -132720 -203789 -94676 19930 -82971 -99790 -191793 -425400 -263091
$$ packed form
7899C921J13192j07703q712J15665j04332j13640O4667M7437L7808K3360j01979
7888c0316J3289j27424q966n9382P5626J18693M2171j11884P9482J52899P1161
7877B15349o8789j88343M663O3723j05601J34622O9077k33385J5169J27614O1798
7866I5897o0325m593n689p8181L8079J73609m170j02446o6448N3622j21239j00671
7854a82555m7567J14106L6855n4764j45511Q1384J5240J84560k0835o5562o7351
7843a52000n2263k3102J7516q8357O3614J09859j74693j218o730P2089j3136P1104
7831a77317n7503l000M2881j068L2994J11046K29671Q5198j02886J501j62251
7820g34j19163K2647l5470p1069J09113J14606j02901j6819r2003k33607J62309
$$ plain form
7809 -263091 -39463 -14781 -18825 19076 133635 81891 -5878 -31127 138330 8999 -302878
7798 -302878 -364116 -129875 -2754 156008 179559 168551 337645 372000 404227 267044 217181
7787 217181 230986 39675 -144968 -392019 -263339 -13678 36399 93153 136314 71239 -106025
7776 -106025 -165446 -78179 -26931 -66238 -18546 -10268 52916 221499 214566 82487 103146 -3208
7764 -3208 1164 149492 161360 140536 173360 245131 217188 278793 280323 147724 74603 135405
7752 135405 247862 283407 215963 194918 115569 87549 199127 338489 193973 93743 -7385
7741 -7385 -82147 19273 65716 15526 61959 23875 67097 96557 -236691 -576161 -572071 -271183
7729 -271183 -161168 -160663 72782 190466 166628 120540 87984 32267 -20611 -64701 -84066
$$ packed form
7809b63091K23628K4682m044L7901J14559n1744q7769k5249J69457j29331l11877
7798c02878o1238K34241J27121J58762K3551j1008J69094L4355L2227j37183m9863
7787B17181J3805j91311j84643k47051J28680K49661N0077N6754M3161o5075j77264
7776a06025n9421Q7267N1248l9307M7692Q278O3184J68583o933j32079K0659j06354
7764c208M372J48328J1868k0824L2824P1771k7943O1605J530j32599p3121O0802
7752A35405J12457L5545o7444k1045p9349k8020J11578J39362j44516j00230j01128
7741g385p4762J01420M6443n0190M6433l8084M3222K9460l33248l39470M090L00888
7729b71183J10015N05K33445J17684k3838m6088l2556n5717n2878m4090j9365
$$ plain form
7718 -84066 3162 81233 42825 95045 224370 296103 192786 14466 -20301 -59954 -139960
7707 -139960 -140544 27907 53271 114459 167705 236704 228807 38317 -129824 -64956 47952
7696 47952 138369 4529 -64820 -66562 -26419 79948 30620 -93081 -275255 -449172 -357730
7685 -357730 -195959 -47766 101870 138032 297669 347879 380505 382129 226160 -40342 -178981
7674 -178981 -113279 60304 -38209 -208001 -129273 -133002 -5031 41215 99346 101343 188102
7663 188102 124029 103936 225108 287183 174686 32671 45452 2146 -117746 34325 226018
7652 226018 117689 -41472 -141670 -102096 50551 130998 51308 -123184 -112687 71690
7642 71690 66244 63214 -113652 -93869 -63266 128808 211576 -13743 -144842 -126388 7366
$$ packed form
7718h4066Q7228P8071l8408N2220J29325P1733j03317j78320l4767l9653q0006
7707a39960n84J68451K5364O1188N3246O8999p897j90490j68141O4868J12908
7696D7952R0417j33840o9349j742M0143J06367m9328j23701j82174j73917R1442
7685c57730J61771J48193J49636L6162J59637N0210L2626J624j55969k66502j38639
7674a78981O5702J73583r8513j69792P8728l729J27971M6246N8131J997Q6759
7663A88102o4073k0093J21172O2075j12497j42015J2781m3306j19892J52071J91693
7652B26018j08329j59161j00198L9574J52647Q0447p9690j74492J0497J84377
7642G1690n446l030j76866J9783L0603J92074Q2768k25319j31099J8454J33754
$$ plain form
7631 7366 222167 205940 33626 -112198 -222890 -180647 -88581 59627 -9799 -14420 17343
7620 17343 172389 221595 155576 72404 -5936 -141652 -264150 -114000 53803 153278 46877
7609 46877 -188382 -150568 5121 131560 82885 99158 350968 307273 209590 -14052 26380
7598 26380 163757 -9272 -129320 -166812 -130124 74768 65756 95507 113943 90152 -51845
7587 -51845 -69544 241742 306915 265000 124354 56433 102717 152996 161501 110221 40492 -1047
7575 -1047 16544 61096 101937 -4114 -22465 75213 110242 57347 61648 165356 187635 31194
7563 31194 85393 39979 -95239 -136091 -30642 -115447 -186059 -231879 -183524 -63554 -229131
7552 -229131 -300823 -263958 -136946 -193979 -286465 -335540 -304375 -298323 -255519 -261510 -341328 -184358
$$ packed form
7631G366K14801j6227j72314j45824j10692M2243R2066J48208o9426m621L1763
7620A7343J55046M9206o6019q3172p8340j35716j22498J50150J67803R9475j06401
7609D6877k35259L7814J55689J26439m8675J6273K51810m3695r7683k23642M0432
7598B6380J37377j73029j20048l7492L6688K04892r012K9751J8436k3791j41997
7587e1845j7699L11286O5173m1915j40646o7921M6284N0279Q505n1280o9729m1539
7575a047J7591M4552M0841j06051j8351R7678L5029n2895M301J03708K2279j56441
7563C1194N4199m5414j35218m0852J05449q4805p0612m5820M8355J19970j65577
7552b29131p1692L6865J27012n7033r2486m9075L1165O052M2804n991p9818J56970
$$ plain form
7540 -184358 -18455 73585 180033 21171 -94693 85039 86556 97607 31440 152287 95000
7529 95000 109283 43399 -49585 -26155 -80415 -93342 -276626 -349620 -427305 -325483 -235661
7518 -235661 -218043 -201326 -200703 -187851 16579 153465 17609 -52031 49947 30035 -44163
7507 -44163 55183 252593 237936 109268 -117711 -295520 -365429 -265378 -48106 -36804 57218
7496 57218 45392 7977 86015 63650 -13464 -140485 -189981 -97853 -59046 185887 282710
7485 282710 207827 153465 219017 148490 75927 67353 17777 108816 138201 156882 170022 19441
7473 19441 -107027 -207784 -146442 -145251 -211573 -185691 -311976 -187090 11763 -49006 -59156
7462 -59156 69224 114505 71488 140784 296684 298210 187480 251802 163936 -168625 -215159
$$ packed form
7540a84358J65903R2040J06448j58862j15864J79732J517J1051o6167J20847n7287
7529I5000J4283o5884r2984K3430n4260j2927j83284p2994p7685J01822Q9822
7518b35661J7618J6717O23J2852K04430J36886j35856o9640J01978j9912p4198
7507d4163R9346J97410j4657j28668k26979j77809o9909J00051K17272J1302R4022
7496E7218j1826l7415P8038k2365p7114j27021m9496R2128L8807K44933R6823
7485B82710p4883n4362O5552p0527p2563q574m9576R1039K9385J8681J3140j50581
7473A9441j26468j00757O1342J191o6322K5882j26285J24886J98853o0769j0150
7462e9156J28380M5281m3017O9296J55900J526j10730O4322q7866l32561m6534
$$ plain form
7451 -215159 -178929 -61742 57 151606 122671 64292 82913 -228 -249542 -382531 -389306
7440 -389306 -167298 -137623 -38938 -35223 26117 145028 114401 40323 31006 226240 274286
7429 274286 305165 318360 228015 59443 -38024 16778 -2968 -270897 -238325 -91544 33032
7418 33032 104230 -13567 44105 197491 229658 192956 -104130 -243485 -267142 -193176 -44655
7407 -44655 -133105 -169016 -141168 -36005 -127778 -140023 -166833 -267303 -195924 -136697 -286517
7396 -286517 -238297 -141779 -133406 -156773 -148123 -136020 16831 -10028 -132714 -47741 79021
7385 79021 112456 73705 128754 90121 202371 209782 10165 61461 124469 57977 -57734
7374 -57734 3358 -20755 -144948 -120325 47621 141887 91614 32201 -98595 -100788 -15719
$$ packed form
7451b15159L6230J17187O1799J51549k8935n8379J8621q3141k49314j32989o775
7440c89306K22008K9675R8685L715O1340J18911l0627p4078r317J95234M8046
7429B74286L0879J3195r0345j68572r7467N4802j9746k67929L2572J46781J24576
7418C3032P1198j17797N7672J53386L2167l6702k97086j39355k3657P3966J48521
7407d4655q8450l5911K7848J05163r1773j2245k6810j00470P1379N9227j49820
7396b86517M8220R6518Q373k3367Q650J2103J52851k6859j22686Q4973J26762
7385G9021L3435l8751N5049l8633J12250P411j99617N1296O3008o6492j15711
7374e7734O1092k4113j24193K4623J67946R4266n0273n9413j30796k193Q5069
$$ plain form
7363 -15719 193917 285612 299070 285789 274907 35258 -70629 -165279 -367533 -530867 -349135
7352 -349135 -176511 -143957 59221 -9343 -21404 10039 -6479 -13703 23696 119149 68417
7341 68417 -145615 -271983 -187585 -193448 -330820 -311560 -243897 -161243 -51066 96533 293083
7330 293083 252725 -25083 -31429 -39027 -162642 -430013 -304726 -129352 -129758 -58397 -51842 46710
7318 46710 -114391 -259014 -250219 -191626 -190517 -296751 -374155 -205025 -10946 -105799 -74829
7307 -74829 -124267 -106267 -185088 -137794 46839 -31250 -139088 -185966 -106306 -315329 -203668
7296 -203668 -39943 79985 -97093 -134285 64340 254798 264773 112164 -5962 -100186
7286 -100186 -87656 -126258 60495 231832 318993 324018 267957 6260 -135110 -23694 31905
$$ packed form
7363a5719K09636R1695J3458j3281j0882k39649j05887r4650k02254j63334J81732
7352c49135J72624L2554K03178o8564j2061L1443j6518p224L7399R5453n0732
7341F8417k14032j26368Q4398n863j37372J9260O7663Q2654J10177J47599J96550
7330B93083m0358k77808o346p598j23615k67371J25287J75374m06P1361O555R8552
7318D6710j61101j44623Q795N8593J109j06234p7404J69130J94079r4853L0970
7307g4829m9438J8000p8821M7294J84633p8089j07838m6878P9660k09023J11661
7296b03668J63725J19928j77078l7192J98625J90458R975j52609j18126r4224
7286a00186J2530l8602J86753J71337Q7161N025n6061k61697j41370J11416N5599
$$ plain form
7275 31905 17769 -29158 -39400 -33071 -80267 -224783 -136152 31743 184340 225580 16707
7264 16707 -140838 -222716 -261234 -206434 -94876 52703 192689 60221 65052 -88956 -243551
7253 -243551 -216103 -167231 -10901 91529 -22498 -88843 -81294 -7138 -87148 -227385 -335544
7242 -335544 -409054 -239880 -105021 -66961 99201 240356 100178 -127638 -233990 -175218
7232 -175218 -375096 -468898 -460117 -479370 -456108 -364151 -108686 114191 73434 -166007 -84224
7221 -84224 111559 -12029 -85498 -140487 -92459 -69127 -196789 -137503 -136464 8205 -94761
7210 -94761 -251866 -216745 -240653 -161527 -33116 -6631 -164630 -56214 -121660 -180619 -273273
7199 -273273 -277432 -254067 -206785 -211644 -203038 -191302 -40861 124618 40544 143528 223273 -80102
$$ packed form
7275C1905j4136m6927j0242O329m7196j44516Q8631J67895J52597M1240k08873
7264A6707j57545q1878l8518N4800J11558J47579J39986j32468M831j54008j54595
7253b43551K7448M8872J56330J02430j14027o6345P549P4156q0010j40237j08159
7242c35544p3510J69174J34859L8060J66162J41155j40178k27816j06352N8772
7232a75218j99878r3802Q781j9253K3262R1957K55465K22877m0757k39441Q1783
7221h4224J95783j23588p3469n4989M8028K3332j27662N9286J039J44669j02966
7210i4761j57105L5121k3908P9126J28411K6485j57999J08416o5446n8959r2654
7199b73273m159K3365M7282m859Q606J1736J50441J65479q4074J02984P9745l03375
$$ plain form
7187 -80102 -314110 -225020 -112094 -6964 -17771 75246 335126 178025 195715 220694 153604
7176 153604 85667 127585 44181 -93475 8052 154065 189197 254997 65494 39729 195344
7165 195344 259618 183134 -112994 -181381 -163835 -200585 -99286 39407 22352 62332 221615
7154 221615 70663 -114656 -167609 -121106 -86961 -61091 -122164 -76074 52255 87518 -2020
7143 -2020 -51940 -15425 -7986 -317958 -251440 -213421 -132498 -186030 -156554 -176569 -249098 -108018
7131 -108018 9150 79166 58367 -8287 63685 135408 119695 17854 31739 51123 -82464
7120 -82464 34693 176234 117499 131442 -99761 -175674 -154181 -39852 -128046 -225217 -237394
7109 -237394 -160792 -132534 -201917 -255766 -181520 -309335 -318101 -415106 -297470 -170125 -92368
$$ packed form
7187h0102k34008Q9090J12926J05130j0807R3017K59880j57101J7690K4979o7090
7176A53604o7937M1918q3404j37656J01527J46013L5132O5800j89503k5765J55615
7165A95344O4274p6484k96128o8387J7546l6750J01299J38693j7055L9980J59283
7154B21615j50952j85319n2953M6503L4145K5870o1073M6090J28329L5263q9538
7143b020m9920L6515P439l09972O6518L8019Q0923n3532K9476k0015p2529J41080
7131a08018J17168P0016k0799o6654P1972P1723j5713j01841J3885J9384j33587
7120h2464J17157J41541n8735J3943k31203p5913K1493J14329q8194r7171j2177
7109b37394P6602K8258o9383n3849P4246j27815q766r7005J17636J27345P7757
$$ plain form
7098 -92368 -54060 -52185 -58984 -90169 -5722 71573 90468 200078 268403 237704 164549 11206
7086 11206 17551 -56794 -170200 -305749 -217555 -145235 -162248 -178299 -59137 -96681 -186299
7075 -186299 -219327 -150518 -160783 -141675 -19105 187156 326156 262767 86301 42796 10871
7064 10871 92503 111345 25661 20765 -119180 -115360 -47716 30794 58600 75844 82008 -29002
7052 -29002 -93007 -138306 -107726 -91662 -28370 -20368 -194908 -230026 -81826 -37368 -115719 61802
7040 61802 126164 -5357 -186146 -216144 -170792 -10741 47761 75621 131198 -8756 -166343
7029 -166343 -251217 -81336 42002 -76218 -115780 4920 161966 156517 161412 -7363 -135889
7018 -135889 -116181 -191865 -193133 -95836 81823 165242 -23070 -171555 -80866 -102063 -50589
$$ packed form
7098i2368L8308J875o799l1185Q4447P7295J8895J09610O8325l0699p3155j53343
7086A1206O345p4345j13406j35549Q8194P2320j7013j6051J19162l7544q9618
7075a86299l3028O8809j0265J9108J22570K06261J39000o3389j76466m3505l1925
7064A0871Q1632J8842q5684m896j39945L820O7644P8510K7806J7244O164j11010
7052b9002o4005m5299L0580J6064O3292Q002j74540l5118J48200M4458p8351J77521
7040F1802O4362j31521j80789k9998M5352J60051N8502K7860N5577j39954j57587
7029a66343q4874J69881J23338j18220l9562J20700J57046n449M895j68775j28526
7018a35889J9708p5684j268R7297J77659Q3419j88312j48485R0689k1197N1474
$$ plain form
7007 -50589 -125455 -89787 -41140 108363 104012 17509 -48851 -81295 -24640 -39720 -63354 -82383
6995 -82383 -121519 -174056 -304088 -320934 -93200 30391 102506 91407 80672 -81106 -251840
6984 -251840 -262824 -137895 -30100 14058 57318 192996 194598 270663 222683 331354 417749
6973 417749 189729 54308 77511 94419 34195 69772 63946 67802 -59222 -184130 -88134
6962 -88134 50251 245938 138026 -34896 -116383 50624 186318 135197 -24877 -13700
6952 -13700 32173 -117348 -17882 16161 -32867 -171863 -211524 -75376 -74760 -106767 -51869 -53373
6940 -53373 33344 -15878 -4005 25382 46340 -31419 -85767 -75230 -237584 -195687 -244188 -272685
6928 -272685 -106737 -55092 -166438 -202961 -217987 -306780 -228842 51873 19218 -35130 -128616
$$ packed form
7007e0589p4866L5668M8647J49503m351q6503o6360l2444N6655j5080k3634j9029
6995h2383l9136n2537j30032j6846K27734J23591P2115j1099j0735j61778j70734
6984b51840j0984J24929J07795M4158M3260J35678J602P6065m7980J08671Q6395
6973D17749k28020j35421K3203J6908o0224L5577n826L856j27024j24908R5996
6962h8134J38385J95687j07912j72922q1487J67007J35694n1121j60074J1177
6952a3700M5873j49521R9466L4043m9028j38996l9661J36148O16l2007N4898j504
6940e3373Q6717m9222J1873K9387K0958p7759n4348J0537j62354M1897m8501k8497
6928b72685J65948N1645j11346l6523j5026q8793P7938K80715l2655n4348r3486
$$ plain form
6917 -128616 -52220 7550 137530 166516 169151 144990 137756 13572 6961 187410 57460
6906 57460 -19435 -62274 117305 224746 143702 -21916 24181 51749 165190 121953 40448
6895 40448 80553 161470 142116 94378 222840 379444 349741 190897 4984 55396 56386
6884 56386 -149142 -193867 -216464 -205029 -178988 -84695 108872 159173 -4757 -163062 -158232
6873 -158232 -116043 10727 154980 140375 -66756 82957 142953 249621 172349 121501 3595
6862 3595 6186 37407 -73757 -111592 64949 226701 103699 3993 77627 -73182 -239516
6851 -239516 -270954 -273226 -143166 28180 -6724 -123499 -55049 -80666 -138453 -189039 -194819
6840 -194819 -149078 -134317 -93205 -172998 -304525 -210454 -56210 -284739 -335635 -167821 -172390
$$ packed form
6917a28616P6396N9770J29980K8986K635k4161p234j24184o611J80449j29950
6906E7460p6895m2839J79579J07441q1044j65618M6097K7568J13441m3237q1505
6895D0448M0105Q0917j9354m7738J28462J56604k9703j58844j85913N0412R90
6884E6386k05528m4725k2597J1435K6041R4293J93567N0301j63930j58305M830
6873a58232M2189J26770J44253j4605k07131J49713N9996J06668p7272n0848j17906
6862C595K591L1221j11164l7835J76541J61752j23002r9706P3634j50809j66334
6851b39516l1438k272J30060J71346l4904j16775O8450k5617n7787n0586n780
6840a94819M5741J4761M1112p9793j31527R4071J54244k28529n0896J67814m569
$$ plain form
6829 -172390 -182609 -308869 -239566 -195496 -92801 67286 79921 90407 129883 210170 275473
6818 275473 322178 310849 192450 78898 270046 507440 439645 241041 -4769 -80917
6808 -80917 -110305 -109851 -191529 -206372 -199831 -178791 -91741 -123847 47223 194261 109374 27537
6796 27537 132910 179502 93725 65482 101034 255495 307239 465239 347971 175816 1902
6785 1902 -133016 -155047 -64443 -45608 -149087 -329121 -164416 18747 135137 190285 148064
6774 148064 264717 348924 194206 140002 200117 53597 -138513 -75198 78599 231914
6764 231914 138837 67296 -81768 -157610 -14497 -90589 -243388 -338519 -329163 -199013 -193860
6753 -193860 -217899 -182914 -225633 -141689 83299 35599 26631 130879 179585 83873 147066
$$ packed form
6829a72390j0219j26260O9303M4070J02695J60087J2635J0486L9476Q0287O5303
6818B75473M6705j1329j18399j13552J91148K37394o7795j98604k45810p6148
6808h0917k9388M54q1678j4843O541K1040Q7050l2106J71070J47038q4887q1837
6796B7537J05373M6592q5777k8243L5552J54461N1744J58000j17268j72155j73914
6785A902j34918k2031R0604J8835j03479j80034J64705J83163J16390N5148m2221
6774A48064J16653Q4207j54718n4204O0115j46520j92110O3315J53797J53315
6764B31914r3077p1541j49064p5842J43113p6092j52799r5131R356J30150N153
6753a93860k4039L4985m2719Q3944K24988m7700q968J04248M8706r5712O3193
$$ plain form
6742 147066 84373 -7826 115717 174610 99737 33236 6138 -189697 -400392 -304442 -260021
6731 -260021 -294683 -98054 69016 82000 162858 180661 133413 -128401 -114638 138834 344726
6720 344726 357070 201064 124385 127454 174736 34546 -67257 45327 117415 105258 -171851
6709 -171851 -178537 -118394 -264765 -188419 -94475 -116393 -175510 -259041 -243683 -232353 -303652 -191788
6697 -191788 -91216 92499 -26995 -168845 -239725 -77873 -96442 -176450 -211863 -142748 -74049
6686 -74049 16435 23194 -62663 96146 39132 -41892 -158698 -170385 25560 14920 5308 15912
6674 15912 38521 82905 29467 -56564 -28639 -5803 148735 261235 365934 318998 236992
$$ packed form
6742A47066o2693r2199J23543N8893p4873o6501k7098j95835k10695R5950M4421
6731b60021l4662J96629J67070J2984Q0858J7803m7248k61814J3763K53472K05892
6720C44726J2344j56006p6679L069M7282j40190j01803J12584P2088j2157k77109
6709a71851o686O0143j46371P6346R3944k1918n9117q3531J5358J1330p1299J11864
6697a91788J00572J83715j19494j41850p0880J61852j8569q0008l5413O9115O8699
6686g4049R0484O759q5857J58809n7014q1024j16806j1687J95945j0640r612J0604
6674A5912K2609M4384n3438q6031K7925K2836J54538J12500J04699m6936q2006
$$ [...]
##END NTUPLES=NMR SPECTRUM
##END=
