##TITLE=Analysis number 322819
Compound Code sb 02041
Project Code adrs
Chemist Name avocado
##JCAMPDX= 6.0         $$ Bruker NMR JCAMP-DX V2.0
##DATA TYPE= NMR SPECTRUM
##DATA CLASS= NTUPLES
##ORIGIN= Bruker BioSpin GmbH
##OWNER= nmr
$$ XWIN-NMR		Version 3.5
$$ Mon Oct 16 09:44:07 2006 GMT Daylight Time (UT+1h)  MAYBRIDGE\nmr@NMR_250MHZ
##.OBSERVE FREQUENCY= 250.131544655141
##.OBSERVE NUCLEUS= ^1H
##.ACQUISITION MODE= SIMULTANEOUS (DQD)
##.ACQUISITION SCHEME= undefined
##.AVERAGES= 16
##.DIGITISER RES= 18
##SPECTROMETER/DATA SYSTEM= dpx250
##.PULSE SEQUENCE= zg30
##.SOLVENT NAME= CDCl3
##.SHIFT REFERENCE= (INTERNAL, CDCl3, 0, 16.522)
##AUDIT TRAIL= $$ (NUMBER, WHEN, WHO, WHERE, WHAT)
$$ ##TITLE= Audit trail, XWIN-NMR		Version 3.5
$$ ##JCAMPDX= 5.01
$$ ##ORIGIN= Bruker BioSpin GmbH
$$ ##OWNER= nmr
$$ C:\u/data/dgb/nmr/ADRS/440/pdata/1/auditp.txt
$$ ##AUDIT TRAIL=  $$ (NUMBER, WHEN, WHO, WHERE, WHAT)
(   1,<2006-10-16 09:43:48.27 +100>,<MAYBRIDGE\nmr>,<NMR_250MHZ>,
      <created by zg, POWCHK disabled, PULCHK disabled
       configuration hash MD5:
       49 4B E0 1D 92 C2 6B 37 9F E6 65 BC 52 41 86 1D
       data hash MD5: 64K
       87 B3 80 BE BE 48 7E 86 D9 E4 07 B4 2E 21 FD 09>)
(   2,<2006-10-16 09:44:00.05 +100>,<MAYBRIDGE\nmr>,<NMR_250MHZ>,
      <Start of raw data processing
       ef LB = 0.3 FT_mod = 6 PKNL = 1 SI = 32K 
       data hash MD5: 32K
       E2 F0 08 E6 94 4D C6 E4 FA 2E A3 2B 1C C6 4D 8B>)
(   3,<2006-10-16 09:44:01.66 +100>,<MAYBRIDGE\nmr>,<NMR_250MHZ>,
      <apk 
       data hash MD5: 32K
       5B 34 ED BB 2D 30 65 B9 4C B9 1F 20 68 AA 7C FA>)
(   4,<2006-10-16 09:44:02.63 +100>,<MAYBRIDGE\nmr>,<NMR_250MHZ>,
      <abs ABSG = 5 
       data hash MD5: 32K
       E3 99 C3 26 BF 6C C6 A0 3E B9 A4 56 96 BB A1 75>)
$$ ##END=
$$ 
$$ hash MD5
$$ 7A 61 4C 32 3B 89 74 53 87 00 21 93 E8 CD 83 BA
##$RELAX= 
##$RELAX= 
##$RELAX= 
##$RELAX= 
##$RELAX= 
##$RELAX= 
##$RELAX= 
$$ Bruker specific parameters
$$ --------------------------
##$DU= <C:\u>
##$EXPNO= 440
##$NAME= <ADRS>
##$PROCNO= 1
##$TYPE= <nmr>
##$USER= <dgb>
##$AMP= (0..31)
100 100 100 100 100 100 100 100 100 100 100 100 100 100 100 100 100 100 
100 100 100 100 100 100 100 100 100 100 100 100 100 100 
##$AQSEQ= 0
##$AQ_mod= 3
##$AUNM= <au_zg>
##$AUTOPOS= <30 >
##$BF1= 250.13
##$BF2= 250.13
##$BF3= 250.13
##$BF4= 250.13
##$BF5= 500.13
##$BF6= 500.13
##$BF7= 500.13
##$BF8= 500.13
##$BYTORDA= 1
##$CFDGTYP= 0
##$CFRGTYP= 5
##$CHEMSTR= <none>
##$CNST= (0..31)
1 1 145 1 1 1 1 1 1 1 1 1 1 1 1 1 1 1 1 1 1 1 1 1 1 1 1 1 1 1 1 1 
##$CPDPRG= <>
##$CPDPRG1= <>
##$CPDPRG2= <>
##$CPDPRG3= <>
##$CPDPRG4= <mlev>
##$CPDPRG5= <mlev>
##$CPDPRG6= <mlev>
##$CPDPRG7= <mlev>
##$CPDPRG8= <mlev>
##$CPDPRGB= <>
##$CPDPRGT= <>
##$D= (0..31)
0 1 0 0 0 0 0 0 0 0.06 0 0 0 0 0 0 0.0002 0 0 0 0 0 0 0 0 0 0 0 0 0 0 
0 
##$DATE= 1160988227
##$DBL= (0..7)
120 120 120 120 120 120 120 120 
##$DBP= (0..7)
150 150 150 150 150 150 150 150 
##$DBP07= 0
##$DBPNAM0= <>
##$DBPNAM1= <>
##$DBPNAM2= <>
$$ [...]
##$SUBNAM7= <"">
##$SUBNAM8= <"">
##$SUBNAM9= <"">
##$SW= 20.6930455092707
##$SWIBOX= (0..15)
0 0 3 0 0 0 0 0 0 0 0 0 0 0 0 0 
##$SW_h= 5175.983436853
##$TD= 65536
##$TD0= 1
##$TE= 683.16
##$TE2= 300
##$TE3= 300
##$TEG= 300
##$TL= (0..7)
0 120 120 120 120 120 120 120 
##$TP= (0..7)
150 150 150 150 150 150 150 150 
##$TP07= 0
##$TPNAME0= <>
##$TPNAME1= <>
##$TPNAME2= <>
##$TPNAME3= <>
##$TPNAME4= <>
##$TPNAME5= <>
##$TPNAME6= <>
##$TPNAME7= <>
##$TPOAL= (0..7)
0.5 0.5 0.5 0.5 0.5 0.5 0.5 0.5 
##$TPOFFS= (0..7)
0 0 0 0 0 0 0 0 
##$TUNHIN= 0
##$TUNHOUT= 0
##$TUNXOUT= 0
##$USERA1= <user>
##$USERA2= <user>
##$USERA3= <user>
##$USERA4= <user>
##$USERA5= <user>
##$V9= 5
##$VALIST= <valist>
##$VCLIST= <CCCCCCCCCCCCCCC>
##$VD= 0
##$VDLIST= <DDDDDDDDDDDDDDD>
##$VPLIST= <PPPPPPPPPPPPPPP>
##$VTLIST= <TTTTTTTTTTTTTTT>
##$WBST= 1024
##$WBSW= 4
##$XGAIN= (0..3)
0 0 0 0 
##$XL= 0
##$YL= 0
##$YMAX_a= 333398
##$YMIN_a= -372314
##$ZGOPTNS= <>
##$ZL1= 120
##$ZL2= 120
##$ZL3= 120
##$ZL4= 120
##$ABSF1= 16.522
##$ABSF2= -4.171173
##$ABSG= 5
##$ABSL= 3
##$ALPHA= 0
##$AQORDER= 0
##$ASSFAC= 0
##$ASSFACI= 0
##$ASSFACX= 0
##$ASSWID= 0
##$AUNMP= <proc_1d>
##$AZFE= 0.1
##$AZFW= 0.1
##$BCFW= 0
##$BC_mod= 0
##$BYTORDP= 0
##$COROFFS= 0
##$CY= 12.5
##$DATMOD= 1
##$DC= 0
##$DFILT= <>
##$DTYPP= 0
##$F1P= 14.0000005364418
##$F2P= -0.99999901652339
##$FCOR= 0.5
##$FTSIZE= 32768
##$FT_mod= 6
##$GAMMA= 0
##$GB= 0
##$INTBC= 1
##$INTSCL= 1
##$ISEN= 128
##$LB= 0.3
##$LEV0= 0
##$LPBIN= 0
##$MAXI= 10000
##$MC2= 0
##$MEAN= 0
##$ME_mod= 0
##$MI= 0
##$NCOEF= 0
##$NC_proc= -4
##$NLEV= 6
##$NOISF1= 0
##$NOISF2= 0
##$NSP= 0
##$NTH_PI= 0
##$NZP= 0
##$OFFSET= 16.522
##$PC= 1
##$PHC0= -49.52076
##$PHC1= 5.586756
##$PH_mod= 1
##$PKNL= yes
##$PPARMOD= 0
##$PSCAL= 4
##$PSIGN= 0
##$REVERSE= no
##$SF= 250.13
##$SI= 32768
##$SIGF1= 0
##$SIGF2= 0
##$SINO= 400
##$SIOLD= 32768
##$SREGLST= <1H.CDCl3>
##$SSB= 0
##$STSI= 32768
##$STSR= 0
##$SW_p= 5175.98343685301
##$SYMM= 0
##$S_DEV= 0
##$TDeff= 65536
##$TDoff= 0
##$TI= <Analysis number 999999
Compound Code 99
Book Reference 9
Project Code 9>
##$TILT= no
##$TM1= 0
##$TM2= 0
##$TOPLEV= 0
##$USERP1= <user>
##$USERP2= <user>
##$USERP3= <user>
##$USERP4= <user>
##$USERP5= <user>
##$WDW= 1
##$XDIM= 32768
##$YMAX_p= 502036273
##$YMIN_p= -401269
$$ End of Bruker specific parameters
$$ ---------------------------------
##NTUPLES= NMR SPECTRUM
##VAR_NAME=  FREQUENCY,     SPECTRUM/REAL,   SPECTRUM/IMAG
##SYMBOL=    X,             R,               I
##VAR_TYPE=  INDEPENDENT,   DEPENDENT,       DEPENDENT
##VAR_FORM=  AFFN,          ASDF,            ASDF
##VAR_DIM=   32768,         32768,           32768
##UNITS=     HZ,            ARBITRARY UNITS, ARBITRARY UNITS
##FACTOR=    0.157963299565203, 1,           1
##FIRST=     4132.6476996994, 0,             0
##LAST=      -1043.33573715361, 0,           0
##MIN=       -1043.33573715361, -401269,     0
##MAX=       4132.6476996994, 502036273,     0
$$ Real data points
##PAGE= N=1
##DATA TABLE= (X++(R..R)), XYDATA
$$ [...]
14654c6989L6314K8944j5812j0676L2895N824k1338l858K132j502Q62o372j9524
14641i100l4060J7794J0783n424J1908p527l009p886R257k1991J189K4804J0897
14628b365J746K6048J0425m897R901J5844j5089j8856k0053K548j9790j6403m406
14615c5347k4110R042J3571j1093m777j2608J0078k49J6824L3828j4411k0003
14603c9255N328j2989l7903m774O7R130K1400L7232N502J1056n16j1764j4411
14590c1897k7880J1501M1326J6990Q160j7437j2534k1434K1898L3961Q552k5657
14578E549o09k0986J2486k1223O646L3098o266j1651m150p702j8689K4910N1033
14565D2446q736l171m246j8235J1344j0006n6n603J0400K5794q503l0053k6227
$$ plain form
14654 -36989 -675 28269 12457 1781 34676 40500 19162 15304 17436 15934 16796 10424 -9100
14641 -9100 -43160 -25366 -14583 -20007 -8099 -15626 -18635 -26521 -17264 -39255 -38066 -13262 -2365
14628 -2365 -619 25429 35854 30957 40858 56702 41613 22757 2704 5252 -14538 -30941 -35347
14615 -35347 -59457 -50415 -36844 -47937 -52714 -65322 -55244 -55493 -38669 -4841 -19252 -39255
14603 -39255 -33927 -46916 -84819 -89593 -89526 -80396 -58996 -21764 -16262 -5206 -5722 -17486 -31897
14590 -31897 -59777 -48276 -6950 10040 18200 763 -11771 -33205 -11307 22654 31206 5549
14578 5549 4940 -16046 -3560 -24783 -18137 14961 8695 -2956 -7106 -14808 -33497 -8587 42446
14565 42446 33710 30539 26293 8058 19402 9396 9340 3737 14137 39931 31428 1375 -24852
14552b4852L039j6054j7030O691M364l212J2859n873l7312j0915Q496K7177K1966
14539c0656K3602k04j0807K4222K518K439J878J3980J303o697j8023j2626m413
14526a3484R22k792K6614M560j2469l331m173m089o609j2395p765K060K9983j3545
14512a6513j9291N042k218K7057q634k9103m425K856L8503J9257j9466j6090j0326
14499c3351j0926K3495K1807l9351j3822K8309P187q313n196j2377J0468J1733
14487b0337o164J3934J8290K6495J3200q002l3915J842n076j4207j4756K783J40
14474b5773p811L2731K857N02r68J7777k036q117k1222k0661J1993K132l377j8263
14460d0236k3663K6307L747r3k9632N88K0082L4736K7353K1228j1458k563J0455
$$ plain form
14552 -24852 -21813 -37867 -54897 -48206 -43842 -47054 -34195 -40068 -77380 -88295 -79799 -52622 -30656
14539 -30656 -7054 -7258 -18065 6157 8675 11114 12992 26972 28275 21578 3555 -9071 -13484
14526 -13484 -12562 -15354 11260 15820 3351 20 -4153 -8242 -14851 -27246 -35011 -32951 -2968 -16513
14512 -16513 -35804 -30762 -32980 -5923 -14557 -43660 -48085 -45229 -6726 12531 -6935 -23025 -33351
14499 -33351 -44277 -20782 1025 -38326 -52148 -23839 -16652 -24965 -30161 -42538 -32070 -20337
14487 -20337 -26501 -12567 5723 32218 45418 37416 3501 5343 267 -13940 -28696 -25913 -25773
14474 -25773 -33584 -853 2004 2506 1538 19315 17279 9162 -12060 -32721 -20728 -18596 -21973 -40236
14460 -40236 -63899 -37592 -33845 -33938 -63570 -62982 -42900 -8164 19189 40417 28959 26396 36851
14447C6851Q121k0817l9024j7035J0978J6873n109m595R489j0935J2461R854k7846
14434b0734j0739K848K4083K4102R050j7359J1803J166j3937q804j451J1132j503
14421I657J8503O769K2791N645j9789l0389k1691q916j5717r593l618K1947O445
14408a7956L602R174j7452j8834J1098Q35R078K6508N504P783k9317r107K4941
14395E857P655k626j5173l4451l3897j8840j41K8731L0870p378j9070j6329l246
14382g8038K7303M3321R717J5850m700P417P683j1900J7384k5998j1143L0031
14370B6927K5965l276j3929l7153O117L8422j2682j7543k0857k0324m631j7860
14358e0824J766N449n59J9183o065L6595K1953j0568k3518O055J5070k1608J1232
$$ plain form
14447 36851 44972 24155 -14869 -31904 -20926 -4053 -9162 -13757 -4268 -15203 -2742 7112 -20734
14434 -20734 -31473 -28625 -4542 19560 28610 11251 23054 24220 10283 1479 28 11160 9657
14421 9657 28160 34929 57720 63365 43576 13187 -8504 -17420 -33137 -42730 -46348 -24401 -17956
14408 -17956 -14354 -5180 -22632 -41466 -30368 -29533 -20455 6053 11557 19340 -9977 -19084 5857
14395 5857 13512 10886 -4287 -38738 -72635 -91475 -91616 -62885 -32015 -39393 -58463 -74792 -78038
14382 -78038 -50735 -7414 2303 18153 13453 20870 28553 16653 34037 8039 -3104 26927
14370 26927 52892 49616 35687 -1466 4651 43073 30391 12848 -8009 -28333 -32964 -50824
14358 -50824 -49058 -43609 -44168 -24985 -31050 5545 27498 16930 -6588 -533 14537 -7071 4161
14345D161k8332j320R083k0417j842K7744J1q721k1265J6881K5898K282j7433
14332a3270J6455P865r374k9052j2398J6490j3778K2852J5167L49j0716L835P971
14319B396J4673L650k5092l277n201k2903q263Q809K9102p175R905p684k7392
14306c8452q37k8629j4215K8471J1505L7096o484Q877l7482l5072k2429J8660
14294g8991K9769k2084l952L1460J5672n165j6700J4922J3281j158p159K2157
14282g948M4998k1689j1626M534j5911p310k252K3454J0310m0808M32J9365K1704
14269A7253K84j5478p844R700J6084L75m81j8930j7777P03p521k484P296J6688
14255b132j4682l594o678j6514j1847L126J0033M451J4596N727K5830N221k669
$$ plain form
14345 4161 -24171 -25491 -16408 -36825 -38667 -10923 -10912 -19633 -40898 -24017 1881 4163 -13270
14332 -13270 3185 11050 1676 -27376 -39774 -23284 -37062 -14210 957 1306 -9410 -5575 2396
14319 2396 17069 20719 -4373 -7650 -12851 -35754 -44017 -35208 -6106 -13281 -3376 -11060 -38452
14306 -38452 -39289 -67918 -82133 -53662 -42157 -5061 -11545 -2668 -40150 -75222 -97651 -78991
14294 -78991 -49222 -71306 -75258 -43798 -28126 -33291 -49991 -35069 -21788 -22946 -30105 -7948
14282 -7948 37050 15361 3735 8269 -7642 -14952 -17204 6250 16560 -24248 -23816 -4451 17253
14269 17253 17537 2059 -5785 3915 19999 20374 19893 963 -16814 -16111 -23632 -26116 -18820 -2132
14255 -2132 -16814 -20408 -27086 -43600 -55447 -52321 -42288 -37837 -23241 -17514 8316 13537 10868
14242A0868L819k1555j4460J0380N019l1991n191K4426n439j1303P034J5566j403
14229a4230j6599r925L730j852J8166j5410j6474N512Q309L3171k0518r226m415
14216c9761N198j2576M799J3693o462J1636J5959R488J2033j8685K5265J1108
14204C1695k3399J5051K3475j8947m6122k90J4305l975J4078J2227j0990K227
14192I335j5577j9885J5257K9462r027o865j8951K2467J4032n190j6457j2996
14180a4395Q349k693o720L9L4743k9212k8240J0445J0527l222K5889P743p768
14167E485j8159r589L2002l1165j8387J7724K0790j9606j9639m090J3592J8705
14155a2337j1324k1702j637J6855R305M972k0826k4947k0758K1644J8670m522
$$ plain form
14242 10868 14687 -6868 -21328 -10948 -5929 -37920 -43111 -18685 -24124 -35427 -28393 -12827 -14230
14229 -14230 -30829 -40754 -37024 -38876 -20710 -36120 -52594 -47082 -38773 -5602 -26120 -35346 -39761
14216 -39761 -34563 -47139 -42340 -28647 -35109 -23473 -7514 1974 14007 -4678 20587 31695
14204 31695 8296 23347 46822 27875 -18247 -18537 -4232 -8207 5871 18098 7108 9335
14192 9335 -6242 -26127 -10870 18592 9565 2700 -16251 6216 20248 15058 -1399 -14395
14180 -14395 -6046 -8739 -15459 -15420 19323 -9889 -38129 -27684 -17157 -20379 5510 13253 5485
14167 5485 -12674 -22263 9739 -21426 -39813 -22089 -1299 -20905 -40544 -44634 -31042 -12337
14155 -12337 -23661 -45363 -47000 -30145 -20840 -15868 -36694 -61641 -82399 -60755 -42085 -46607
14143d6607j0258J7083J373k6052o112M3859O4594M967l156j3570L811j0440K20
14130A9712J7903J2615L717j6880K6548L3484L6132P0008P9905O8797N2134M1706
14118D45781r364m4724m2742q2308j01754p0467m0861k6251n941K7435o424q215
14106C4165J3573k7356j8423q883M1243j040m699k938k1804k5598L3203J3161
14094B4604M581k4618J4378J3088q373l0444M905n377L2799P0772N0172L0527
14082A77014L1617M2032N1684J21967J61706J89176K54691J80350N7814j821l2844
14071A233386j73411k63949k25883j55455r5400l7259m8543l6732l1899L587l21
14060A68121k9752k6947l8404k8442j268m134k6452k3947j391J864R173O201K4845
$$ plain form
14143 -46607 -56865 -39782 -38409 -64461 -70573 -26714 37880 42847 39691 26121 29932 19492 19712
14130 19712 37615 50230 53947 37067 63615 97099 133231 203239 283144 351941 404075 445781
14118 445781 436417 391693 348951 266643 164889 94422 53561 27310 21369 48804 42380 34165
14106 34165 47738 20382 1959 -6924 34319 33279 28580 25642 3838 -21760 11443 24604
14094 24604 29185 4567 18945 32033 23660 -6784 -1879 -7256 25543 96315 146487 177014
14082 177014 208631 250663 302347 424314 586020 775196 1029887 1210237 1268051 1266230 1233386
14071 1233386 1059975 796026 570143 414688 319288 282029 233486 196754 164855 168442 168121
14060 168121 138369 111422 73018 44576 43308 39174 12722 -11225 -12616 -10752 -1579 4622 29467
14047B9467j4984p863K047p508K5828K2182M066K3248K6292L2826L7914O1284
14035B34799R4851J21912J47567K22357K28412J85880Q7396P984o1183j70494
14025A099481k83775k65646j99769j01362k4937l8451m9059m2903j1136o446M126
14014H0123j8951k1800L6014J8162k9428k9210J2536J9144p431j1253K0290J2194
14002H0390K796j1202j3429j7037K1171O403j1450j4884k8856l2567M0706K7047
13990D9088M5708N6271M6291O6999O4216P4092L5391J6635j2026r4467r6033q9893
13978A62272l3981m3817R98m488j7632K7461J6713k7361k5410k7546j2217J861
13966A6853j8543Q398N334J9111O724k2346k1824R240Q646l976k5117Q695M366
$$ plain form
14047 29467 14483 6620 8667 1159 26987 49169 53235 76483 102775 135601 173515 234799
14035 234799 329650 451562 599129 821486 1049898 1235778 1323174 1331158 1269975 1099481
14025 1099481 815706 550060 350291 248929 223992 185541 136482 93579 82443 75997 80123
14014 80123 61172 39372 75386 93548 64120 34910 47446 66590 59159 47906 68196 80390
14002 80390 83186 71984 58555 41518 62689 69092 57642 42758 13902 -18665 22041 49088
13990 49088 94796 151067 197358 264357 328573 402665 438056 454691 442665 348198 252165 162272
13978 162272 128291 84474 85472 80984 63352 90813 107526 80165 54755 27209 14992 16853
13966 16853 -1690 6708 12042 31153 37877 15531 -6293 2947 11593 7617 -17500 -8805 -4439
13953d439l0745J2767k155J4381l828P894J8992j5536j6981k0462j0069J1793
13941c8388q133L1101L2191K6039J6980j1459J366k7283q854J1098j2602K4079
13929C6135k933l0188j389j495k0587M725K0191L644N075o445j02M0114M6109
13916I2854P565j3535L0633M759o785N084P439p582k1198j9201K172J8167j783
13903I8589j2632M10n5903l0199j191K2030q790o078L158j6523j2074J2959L8143
13890C1899M1311K488j2907j4758j4556j0062j6804L995J2242J5848K1809k4780
13878C5725m683K8306L564O379J7237Q015J378J1562J6010K245K5388K893J1974
13865A65993K0809M3510K4122L530Q67j3005q229l9959m5875n2618k3100P38N49
$$ plain form
13953 -4439 -35184 -22417 -24572 -10191 -14019 -6125 12867 -2669 -19650 -40112 -50181 -38388
13941 -38388 -46521 -15420 16771 42810 59790 48331 49697 22414 13560 24658 12056 36135
13929 36135 33202 3014 1625 130 -20457 -15732 4459 8103 13178 6733 6631 46745 92854
13916 92854 100419 86884 117517 122276 115491 120575 128014 120432 99234 80033 82205 100372 98589
13903 98589 85957 86367 30464 265 -926 21104 12314 6236 9394 -7129 -19203 -6244 31899
13890 31899 73210 75698 62791 48033 33477 23415 6611 10606 22848 38696 60505 35725
13878 35725 31042 59348 62912 69291 86528 94543 95921 107483 123493 125738 151126 154019 165993
13865 165993 186802 230312 254434 257964 258831 245826 237597 197638 151763 99145 76045 76783 77332
13852G7332m654k7997N222j1999M5946J7022j9168J3327K8747j3409n2664j4455
13840D3250P634M338M835q69J695K0395Q818k288M0760J6500n5002j6941O835
13827G9960L4522J6591j8890M1666K6765q226n602J8934K9623L5380M9526K4393
13815C24642n083l0927m0024k6943l1389n9771m5130j2397J7237m720J2292Q459
13803A06246N99K1368K3661N952k3817R124K952n2705n0020l0020L1678o616O646
13790D5048K3783l901R476l1k1435j0241q999j420r914q901J3881J8898J6201
13777F2445K9830L0485R099J4290O361n35K5554m303m4757q864K0736J3659j7703
13764A36297n143J1095J1974Q689P31P187k891p600k888n042k5036j1514M5903
$$ plain form
13852 77332 72678 44681 49903 37904 83850 100872 81704 95031 123778 110369 57705 43250
13840 43250 50884 55222 60057 59188 60883 81278 90096 87808 128568 145068 90066 73125 79960
13827 79960 114482 131073 112183 153849 180614 172388 166786 185720 215343 250723 300249 324642
13815 324642 319559 288632 248608 221665 190276 130505 85375 72978 90215 85495 97787 106246
13803 106246 106845 128213 151874 157826 134009 143133 146085 93380 43360 13340 45018 38402 45048
13790 45048 68831 64930 74406 74375 52940 42699 33700 32280 22366 13465 27346 46244 62445
13777 62445 92275 122760 131859 146149 152510 151975 177529 173226 128469 119605 140341 154000 136297
13764 136297 131154 142249 154223 162912 163643 170830 167939 160339 157451 152409 127373 115859 161762
13751A61762J2544m6266l7904O171L6308k3932l236J8236J7698k7289j8205j7213
13739G8674k0245m361n166K0313O4032M7658N5207R4441M4908p733l4581n3350
13727B79797k942l235k4960j0213L297K7249K0010J4510j7400l934l2023j200
13715B48956J1325j647j1610M35L9261K3829R392J0255J953j4718J009J139p427
13702C12152J8676L4094O3873J6179J8908J5116K1463J1461K8751o087R096N3818
13690E97500J02191Q3727M8251L8506O9669K5307K0979P2975O8511N1542R0102
13679A269260Q3142K9855O6082Q7840J15825J34148J35310J63565K10738K57437
13669B553202L62120M57345N77489P15701Q60403J096093J465756K030058K921419
$$ plain form
13751 161762 174306 128040 90136 96307 132615 108683 105447 123683 141381 114092 95887 78674
13739 78674 58429 54068 48902 69215 133247 180905 236112 330553 375461 367728 333147 279797
13727 279797 276855 273620 248660 238447 241744 268993 289003 303513 286113 282179 250156 248956
13715 248956 260281 258634 247024 247459 286720 310549 319941 330196 332149 317431 318440 319579 312152
13702 312152 330828 364922 428795 444974 463882 478998 500461 511922 540673 534586 543682 597500
13690 597500 699691 783418 831669 870175 939844 965151 986130 1059105 1127616 1179158 1269260
13679 1269260 1352402 1382257 1448339 1536179 1652004 1786152 1921462 2085027 2295765 2553202
13669 2553202 2915322 3372667 3950156 4665857 5526260 6622353 8088109 10118167 13039586
13660A3039586M430588O989068J0626509J4043092J4393144J0186046M489793
13653G8197826N94937l913361j2005278j6198816j3206913q782250n529753l518984
13645A5637408k325483j604925j193968j002522q52061o83491n38182m05514k92192
13636F739070j84719j22212p2437M2828R9186J13782J48403K11929L02042M24182
13626G702054N44568O88055Q81500J131962J545152J992876K512289L167803M072330
13617B4238589N522443P938303J2037011J9093992K9788215M1672747M6428954
13610A86720254L5980370J6663628L003856p202245l0513352n2319897m5768569
13603A06564045l0279065j8744260j1696827p659857n314299m023426l188841
$$ plain form
13660 13039586 17470174 24459242 35085751 49128843 63521987 73708033 78197826
13653 78197826 78792763 74879402 62874124 46675308 33468395 24686145 19156392 15637408
13645 15637408 13311925 11707000 10513032 9510510 8658449 7974958 7436776 7031262 6739070
13636 6739070 6554351 6432139 6359702 6402530 6501716 6615498 6763901 6975830 7277872 7702054
13626 7702054 8246622 8934677 9816177 10948139 12493291 14486167 16998456 20166259 24238589
13617 24238589 29761032 37699335 49736346 68830338 98618553 140291300 186720254
13610 186720254 222700624 239364252 242368108 235165863 204652511 152332614 106564045
13603 106564045 76284980 57540720 45843893 38184036 32869737 28846311 25657470
13596B5657470k725473k384213j921971j471667j174467r46537p44387o36604
13588A3652151n24978m05278k42561j29484o1053L4215J18482K75024M94594P07509
13578A3918621R63861J325463J762749K337041K931753L796001N165049P410054
13570C9610592J1135834J7544806K7678181L9980957M7256724L9924948K0645401
13563B43777443M758439m943340k4962826n1449509m9995027l4114442k1157728
13556F1913010j3099814q486437n880657m388622l453014k928297k604710k162629
13548A8908830j693554j329733j137455r72626q60879p24238o11430n37513m27948
13539A0613454l19467k50653j98333j49270q2632k6819R3465K68401L99852N80696
$$ plain form
13596 25657470 22931997 20547784 18625813 17154146 15979679 15033142 14288755 13652151
13588 13652151 13127173 12721895 12479334 12349850 12288797 12323012 12441494 12716518 13211112 13918621
13578 13918621 14882482 16207945 17970694 20307735 23239488 27035489 32200538 39610592
13570 39610592 50746426 68291232 95969413 135950370 183207094 223132042 243777443
13563 243777443 248535882 243592542 218629716 167180207 117185180 83070738 61913010
13556 61913010 48813196 40326759 34446102 30057480 26604466 23676169 21071459 18908830
13548 18908830 17215276 15885543 14748088 13775462 12914583 12190345 11578915 11041402 10613454
13539 10613454 10293987 10043334 9845001 9695731 9613099 9586280 9679745 9948146 10347998 10928694
13529A0928694Q20789J110010J542306K230333L433487N415277Q574518J2545486
13521D6600900J5308629J3743880Q034245K462778j219664p457719j5890784j6913665
13513D4668600j2387452p962455m993629l230107k199529j626585j297736j113046
13505I858061r85909q08479o43136n37798m71933m17536l82857l39692l05674
13496D965047k69420k41455k07209j52238j60042j35513j07184j40559j08067
13487C443360q9650j14939j16061o7527n5720q8674q0958o5396j17570j52380
13477B494485j07575q2679o6341p2790q6419n3508o9225l0646m1380n3359n4721
13466A775842o1357k7869l1529k4635m8853l3646k3754l3561k9249l5693k3641
$$ plain form
13529 10928694 11749483 12859493 14401799 16632132 20065619 25480896 34055414 46600900
13521 46600900 61909529 75653409 83687654 86150432 84930768 77473049 61582265 44668600
13513 44668600 32281148 24318693 19325064 16094957 13895428 12268843 10971107 9858061
13505 9858061 8872152 8063673 7420537 6882739 6410806 5993270 5610413 5270721 4965047
13496 4965047 4695627 4454172 4246963 4094725 3934683 3799170 3691986 3551427 3443360
13487 3443360 3353710 3238771 3122710 3055183 2999463 2910789 2829831 2764435 2646865 2494485
13477 2494485 2386910 2304231 2237890 2165100 2078681 2025173 1955948 1925302 1883922 1830563 1775842
13466 1775842 1714485 1686616 1655087 1630452 1581599 1547953 1524199 1490638 1461389 1425696 1402055
13455A402055k7084m5551n5774l5601j7404k1620P31L0008l0550o1939k2144J2242
13443A127369K8981L4587K3585l445j2724R926K5933J1099R8m4711j07045q0793
13431A012860o0791n1957k3647m4410j6159k7014n3915k3711j8182k3833l821
13420F65420m5742n9778k0961j8872j561L632j152j0342K0915L4065L1063k0644
13408E76043k8280k7234k5426j3043k3722j3602L232o770o848J7911K1606K8195
13396E02062L8663K2772m6090k2115Q834K0111N57m794k2252j378j0088o9531
13384D16751l9761j1138l590M864R326m5635l0867j5738q885k3400j9124l5590
13372A97213N905K010l145j2408k3969Q443K2640K4138m664K0149J5975Q128j0637
$$ plain form
13455 1402055 1374971 1329420 1273646 1238045 1220641 1199021 1199752 1229760 1199210 1137271 1115127 1127369
13443 1127369 1156350 1190937 1214522 1211077 1198353 1208279 1234212 1245311 1245409 1200698 1093653 1012860
13431 1012860 952069 900112 876465 832055 815896 788882 734967 711256 693074 669241 665420
13420 665420 619678 559900 538939 520067 518506 522138 520986 510644 531559 565624 596687 576043
13408 576043 547763 520529 495103 482060 458338 444736 447968 441198 434350 452261 473867 502062
13396 502062 540725 563497 517407 495292 504126 524237 524794 520000 497748 496370 486282 416751
13384 416751 376990 365852 362262 367126 376452 330817 299950 284212 275327 251927 232803 197213
13372 197213 203118 205128 201983 189575 165606 174049 196689 220827 216163 236312 252287 260415 249778
13359B49778n227k0093k6334j3508M513J1240L7122k575l3702l7703M23r257L063
13346A57740Q658O5k0632J5470L7138j5101k2771k9405j4753L2016K3888P776
13334A80089j1751k4568j1544k3839j3978K3032K810k4759j1185k369j314K3361
13322A03985O654p238l5731J0463J6255L702k98k0714L0250R426J6727K7918p126
13309A54273k1346j6982K3075P500m0659m7992N047j974J6116P285j1426J4839
13297H7756O235j1788l211r594J1884K5416j0583l9031J455J0484L0189J9787
13285A18999o166p329j7283j7828j857L04M345k216J7775l244L1221n027k2157
13272H9537m809j4470j3059J1847R466K2464N587j3412K0207j4702k2645J468
$$ plain form
13359 249778 244551 224458 198124 184616 189129 200369 237491 234916 201214 163511 163934 154677 157740
13346 157740 166398 166463 145831 161301 198439 183338 160567 131162 116409 148425 172313 180089
13334 180089 168338 143770 132226 108387 94409 117441 120251 95492 84307 81938 80624 103985
13322 103985 110639 103401 67670 78133 94388 98090 97792 77078 107328 116754 133481 161399 154273
13309 154273 132927 115945 139020 146520 105861 57869 62916 60942 77058 84343 72917 87756
13297 87756 93991 82203 78992 69398 81282 106698 96115 57084 58539 69023 99212 118999
13285 118999 112833 105504 88221 70393 68536 68840 73185 70969 88744 85500 116721 111694 89537
13272 89537 84728 70258 57199 69046 78512 100976 106563 93151 113358 98656 76011 77479
13260G7479m401j9876o550j0135J6218L0338K796M631J0552J573n385r973k5690
13247F1577q873J7975q926O866j788J5727K013j2691q064R891L297m785m797j042
13233F6380q51l60M700j3662N654K7951K8155M960J002j5931k5646j5046j2819
13220E4487j0447L3312J8604l2043k4035j2823J964l089M818K5214J2752j1414
13208E7300K2685L2120Q522j4384j6073K1676j6048j0297L5094j6354n0783q550
13196D4908R69M5039J3918j4626r224j283J7504k0R704K0181L9068L6029P5459
13183B77626Q6695O4011N0217M1619Q365l0089r3557p3210n1387p2796n0121j8094
13171A39279j6606j9332J6345N627k2191k748J4489O918l898r946j9364k93K2673
$$ plain form
13260 77479 73078 53202 46652 36517 52735 83073 85869 90500 101052 102625 97240 87267 61577
13247 61577 52704 70679 61753 68619 66831 82558 84571 71880 63816 73707 77004 72219 67422 66380
13233 66380 65529 65169 69869 56207 61861 89812 117967 122927 123929 107998 82352 67306 54487
13220 54487 44040 77352 95956 63913 39878 27055 29019 25930 30748 55962 68714 57300
13208 57300 79985 112105 120627 106243 90170 111846 95798 85501 120595 104241 53458 44908
13196 44908 45877 90916 104834 90208 80984 79701 97205 97185 106889 127070 166138 202167 277626
13183 277626 364321 428332 478549 520168 528533 498444 404887 331677 280290 207494 157373 139279
13171 139279 122673 103341 119686 125313 103122 100374 114863 121781 117883 107937 88573 88280 110953
13158A10953J5519J4633q564m56Q547j3720q722q469J1325l047N904K200J6702
13145A42805Q166K0794L8846L9841P9556J05190J65639K34067K36931J58262Q0288
13134A310385L7489n0503j53549k51591k66386j63099j14922p7934l7969J957
13124B33878P963k3258j2902Q070J0257K1292K212J057k9701k4719k0533m4734
13112A28882k1465K2884P397J1848J0256k6764k8766P388M845K2359J4280J752
13100A54896L6197J1749R543M7707N4687P9214J31915K19588K38633J85454J24372
13089A293955L9158m8011j30079k05617k20576j78237j38610r5737o2752m8753
13079B04741p918J2782j4561J8949J9744k755q720n905r823m2890j7139O592j9655
$$ plain form
13158 110953 126472 141105 132541 132085 140632 126912 118190 109721 121046 117999 123903 126103 142805
13145 142805 150971 171765 210611 250452 330008 435198 600837 834904 1071835 1230097 1310385
13134 1310385 1347874 1297371 1143822 892231 625845 462746 347824 269890 231921 233878
13124 233878 241841 218583 205681 213751 224008 245300 247512 248569 218868 194149 173616 128882
13112 128882 107417 130301 137698 149546 159802 133038 104272 111660 116505 138864 153144 154896
13100 154896 191093 202842 212385 260092 314779 393993 525908 745496 984129 1169583 1293955
13089 1293955 1333113 1285102 1155023 949406 728830 550593 411983 316246 253494 204741
13079 204741 196823 209605 195044 213993 233737 230982 222262 216357 206534 163644 146505 153097 133442
13066A33442l5227o102J7290K008l2481j9713K0636M465j6204j3316q705K455
13054D8548J1440K8573K7379m30L3381N5357N7923Q3516Q1262L5358J0247R404
13042D81958n2267p7731o6922n8100l4667l2958l3061K2424L367j9353j2717R013
13030A28986k2019o191l1375r978J0968L690J8958l4818n766R423q367n487M838
13017E2862r82J0052k8197o901L0721K6620j2216J2398J5513j6639l1661j6042
13005C5528J7138o938j6307p372J0633J2464l008k0315j6201K04r361K2565K2202
12992D1232j5197j1458N263J6393J8770K9283k824k92M994Q703N447p153j9129
12979G4032l2991j8535k2547K0365J7356J6919P099j5947P187K4339r815l3155
$$ plain form
13066 133442 98215 92113 109403 111411 78930 59217 79853 84318 68114 54798 46093 48548
13054 48548 59988 88561 115940 115510 148891 204248 262171 345687 426949 462307 472554 481958
13042 481958 429691 351960 285038 226938 192271 159313 126252 148676 152043 132690 119973 128986
13030 128986 106967 100776 69401 59423 70391 74081 93039 58221 52455 61878 53511 48024 52862
13017 52862 51880 61932 33735 26834 57555 84175 71959 84357 99870 83231 51570 35528
13005 35528 52666 45728 29421 22049 32682 45146 42138 21823 5622 5826 -3535 19030 41232
12992 41232 26035 14577 19840 36233 55003 84286 81462 81170 86164 94867 100314 93161 74032
12979 74032 41041 22506 -41 20324 37680 54599 61698 45751 52938 77277 67462 34307
12967C4307k3448n701P888J2859J3788p274L502L7978L982m2839j9440J1897r890
12954A7609N719J9991L929j9442k2562L183K6042R346r445l4426k711J5767n046
12941G954L3859J1798o272j5385k2743O705J0744N198j4764j3531j1688J6064
12929G939K9700j5064p730q240k2165r18M247J8490M6593K96r452K2031L0813
12916I6540k3446l0928R64L871K6411j2230k7581O48N757j6748k36J7298M579
12903D4899k1434M410m799k6159j1235m2270M069M7050J4102p959J6355l40J7005
12890C3694K8254q34n0888j4213J0264N97l922j7382n04K9678j0261J2931O790
12877B4204R317L477l668j8680k1753j4802R042P204k6762k0396J305L1299k466
$$ plain form
12967 34307 10859 5158 13046 25905 39693 32419 35921 73899 77881 35042 15602 27499 17609
12954 17609 23328 43319 47248 27806 5244 8427 34469 43815 34370 -56 -2767 13000 7954
12941 7954 41813 53611 47339 31954 9211 15916 26660 31858 17094 3563 -8125 7939
12929 7939 37639 22575 14845 6605 -15560 -16478 -12231 6259 52852 53148 43696 65727 96540
12916 96540 73094 42166 43130 47001 73412 61182 33601 34249 40006 23258 23022 40320 44899
12903 44899 23465 27875 23076 -3083 -14318 -56588 -52519 -5469 8633 674 17029 16689 33694
12890 33694 61948 61114 10226 -3987 6277 6874 2952 -14430 -14934 14744 4483 17414 24204
12877 24204 33521 36998 33330 14650 -7103 -21905 -12863 -5659 -32421 -52817 -51512 -20213 -22679
12864b2679j9561L795K2695P011N158K0631J0329k017q708J3073L2514l431k3329
12851C5481r445r910p311j526j0346O224J7443N464k0555l4001n973K6934J2251
12838D730j5432R995p251L866j2843k4416O823K2098j601j2675J0424M8205n251
12825B6672k6834J0574K1299P705L829q956j6597j2879q127R752k5261j2503n226
12812c6552L3623k266o373K18J6487j5169N855k202J36K0664r534j8808q317J5677
12798f561L953j0963N964J6677p636j628K0836K9720N911l3008j0562m853L20
12785H170k3087k7967r495K741R175K9592K5311K209R903K1910P552n106n244
12772D5664M111L148l03J6883j4596j3718O52J9040P399k684j8592P264R40M731
$$ plain form
12864 -22679 -42240 -38445 -15750 -8739 -3581 17050 27379 25362 16654 29727 62241 58810 35481
12851 35481 26036 16126 8815 7289 -3057 3167 20610 26074 5519 -28482 -34455 -7521 4730
12838 4730 -10702 -707 -7958 -4092 -16935 -41351 -34528 -12430 -14031 -26706 -16282 31923 26672
12825 26672 -162 10412 31711 39416 43245 34289 17692 4813 -3314 6438 -18823 -31326 -36552
12812 -36552 -2929 -5195 -11568 -11350 5137 -10032 -4177 -6379 -6243 14421 4887 -13921 -22238 -6561
12798 -6561 -2608 -13571 -7607 9070 1434 -194 20642 50362 56273 23265 12703 7850 8170
12785 8170 -14917 -42884 -52379 -49638 -40463 -10871 14440 16649 26552 48462 56014 50908 45664
12772 45664 49775 52923 52620 69503 54907 41189 41841 60881 68280 65596 47004 54268 55208 59939
12758E9939j1248l6908j60N701K32Q874j3968q923j0051n814J6238K8336K7768
12745F0016j9563k8829j6794N65P772K74J234K600j8640j131K2273J253l829k2368
12731a5167K876J2291J1903j6373l290K7908j9838P309j7904j5952J1544K938
12719a1755j2971k9228k9709j8531K0880J4162N042J1430N081J4748M5313j0976
12707C486l4374l744j6596N154L2149K7097j5095l9109j968K1581J7385j6150
12695b0184o382K7688j5496q278M066P482K7436O884N63R088Q358N436k517l1740
12681A2404o900J9243j92M158P379j5218j7186n097R223L234J1200j1817P212
12668A7643J1480m877l1208K1169R596j1799R229p027j6899M209K8746K4181m809
$$ plain form
12758 59939 48691 11783 11623 17324 17556 26430 12462 3539 -6512 -12326 3912 32248 60016
12745 60016 40453 11624 -5170 -4605 3167 3441 4675 7275 -11365 -12496 9777 11030 7201 -15167
12731 -15167 -12291 0 11903 -4470 -7760 20148 310 7619 -10285 -26237 -14693 -11755
12719 -11755 -24726 -53954 -83663 -102194 -81314 -67152 -62110 -50680 -45599 -30851 14462 3486
12707 3486 -30888 -34632 -51228 -46074 -13925 13172 -1923 -41032 -43000 -21419 -4034 -20184
12695 -20184 -26566 1122 -14374 -22652 -18586 -11104 16332 23216 23779 32867 41225 46661 44144 12404
12681 12404 5504 24747 24555 28713 36092 20874 3688 -1409 7814 11048 22248 10431 17643
12668 17643 29123 24246 -6962 14207 23803 12004 21233 14206 -2693 1516 30262 54443 49634
12655D9634k9553q969J2206j7686k204J0160k6294O159j0785l348J7910o59K4159
12642B0730L6282j3269n133m989k0849J5311P135m771q718j4873j2518J554J2124
12629H016j259l2311j1722J8090J2859K918j777j383M185K004l79O055K2347j2554
12615A5089k5664k1770L7081L5607r781j8133j0274o303j856j1023J771K611j0385
12602b3030Q333K4598J2525J7150j0664j5550j5795l477K2112l021m4173k440
12590c3432J6355L3606j1621j5993L473n887j3110N777J5582J42l243n693n090
12577a9134j4656j563K6447J0409l407j6411n356k31J2783J5007Q245K882K253
12564A7268l911j113j0768j95j8902j6964K0362J6711p107o624R257j4681j3043
$$ plain form
12655 49634 20081 11112 23318 5632 3428 13588 -12706 -6547 -17332 -20680 -2770 -3429 20730
12642 20730 57012 43743 38610 33621 12772 28083 35218 30447 21729 6856 -5662 -4108 8016
12629 8016 6757 -25554 -37276 -19186 -6327 -3409 -5186 -6569 -2384 -380 -759 5296 27643 15089
12615 15089 -10575 -32345 4736 40343 30562 12429 2155 -4148 -6004 -17027 -15256 -12645 -23030
12602 -23030 -14697 9901 22426 39576 28912 13362 -2433 -5910 16202 13181 -30992 -33432
12590 -33432 -17077 16529 4908 -11085 -7612 -13499 -26609 -20832 -5250 -5108 -8351 -14044 -19134
12577 -19134 -33790 -35353 -8906 1503 -1904 -18315 -23671 -23902 -11119 3888 12133 15015 17268
12564 17268 13357 12244 1476 1281 -17621 -34585 -14223 2488 -4619 -11243 -1986 -16667 -29710
12551b9710K3631Q041P33L0772K0400q770l811P303K3163R220o924k2772j1079
12538D0197L673M3j5648Q490J0249j0447k2973J487n152j9287o209J167P55P224
12524f431Q167L674p416J3753l17j3798j634J1596q534j3055J33r570K5549j92
12510A925j5796q517m169j9743J9357M0947j1466N359N047K4027q485k809K0812
12497D6489J7002K5581L3898M8898k970k384j5326l0821j1514j9888l0764j4793
12485D3408l497l72l3843k2937k255m858J4654L4271J2139j1207m979j683L174
12472B2015M882j8274K600j1131J3419K5396j4409n986J3130j3319j7110K4742
12460B5955r632P86J2308r568K8780J0264J5086M7629j1900j5983M462K3259K6708
$$ plain form
12551 -29710 -6079 1962 2695 33467 53867 45097 41286 48589 71752 80972 74048 51276 40197
12538 40197 43870 43913 28265 36755 47004 36557 13584 15071 9919 -9368 -15577 -14410 -13655 -6431
12524 -6431 1736 5410 -2006 11747 11430 -2368 -4002 7594 -940 -13995 -13862 -23432 2117 1925
12510 1925 -13871 -22388 -26557 -46300 -26943 14004 2538 7897 12944 36971 28486 25677 46489
12497 46489 63491 89072 122970 171868 168898 166514 151188 120367 108853 88965 58201 43408
12485 43408 39911 39539 5696 -17241 -19496 -24354 -9700 24571 36710 25503 20524 18841 22015
12472 22015 26897 8623 11223 92 13511 38907 24498 18512 31642 18323 1213 25955
12460 25955 16323 17109 29417 19849 48629 58893 73979 121608 109708 93725 98187 121446 148154
12447A48154O674k22o605J466L803m3995k3106l4325k0747j6957J255J6724m825
12434B7294Q052k925j5373K1191R904j4293k0339j4272m439k118K3433J7838j4014
12421A9939j1376k2008k2597q469l545K0995O304j079K5354K7253l3292m3178
12409d5699J8058K7995k031K7308O306K2850R305k5920j5762N086J0108N068j4603
12396B8069k8955j3678P942J7495P454p480P688K3481r252N271j500k6680k5357
12383a5502j7097K3825K7994K6210R824k3962n1333j9882K0081j4658K401k328
12371c4427L764J6200K1206l332j5605J606j8183J2241j992j7695j3475r199Q107
12358e0784L8187J1769r76j2973j0912K235k2063j142L092J8287j9600l455J0328
$$ plain form
12447 148154 154828 154606 148001 149467 153270 109275 86169 51844 31097 14140 15395 32119 27294
12434 27294 35346 32421 17048 38239 48143 33850 13511 -761 -5200 -7318 16115 33953 19939
12421 19939 8563 -13445 -36042 -44511 -48056 -27061 -20757 -21836 3518 30771 -2521 -45699
12409 -45699 -27641 354 -1677 25631 31937 54787 64092 38172 22410 27496 37604 42672 28069
12396 28069 -886 -14564 -6622 10873 18327 10847 18535 42016 32764 38035 36535 9855 -15502
12383 -15502 -32599 -8774 19220 45430 55254 31292 -20041 -39923 -19842 -34500 -32099 -34427
12371 -34427 -30663 -14463 6743 3411 -12194 -10588 -28771 -16530 -18522 -36217 -49692 -58891 -50784
12358 -50784 -12597 -828 -1804 -14777 -25689 -23454 -45517 -46659 -43567 -25280 -44880 -48335 -38007
12345c8007J4094p595j5299m023J5041N910O94J8275P994J1853N33k3304k2248
12332c6082R491L8154K390Q32O056m495J1775o911k671k8652p802P142N656J3768
12318H651j9625l1491J2953L1195j4284j825J7635L763l162o574Q195j6041J297
12305i313M1776k6657L26R486k711J6550O783J593k7127j8571k5084Q683J6822
12292g444P742K8487q904m526N950q538P851k3258j1045n950l3795J311K113O033
12278d3973L8280J1855j1602L2998O71k2387l2220J8751J5103J6927J0399j2070
12266B2732l059J848P998k585J7074j6472k4750k4388j7484J4332j7946k495L212
12253d1983j7944q443J8882K6483K2252Q531P516J2522j4524k7698j2508R815
$$ plain form
12345 -38007 -23913 -31508 -46807 -50830 -35789 -29879 -29185 -10910 -2916 8937 9470 -13834 -36082
12332 -36082 -26591 11563 13953 14785 20841 16346 28121 21210 18539 -10113 -17915 -10773 -5117 8651
12318 8651 -10974 -42465 -29512 1683 -12601 -14426 3209 6972 3810 -2764 5431 -10610 -9313
12305 -9313 32463 5806 6132 15618 12907 29457 36240 37833 10706 -7865 -32949 -24266 -7444
12292 -7444 298 28785 19881 15355 21305 12767 20618 -2640 -13685 -19635 -53430 -52119 -50006 -43973
12278 -43973 -5693 6162 -5440 27558 28229 5842 -26378 -7627 7476 24403 34802 22732
12266 22732 19673 21521 29519 26934 44008 27536 2786 -21602 -39086 -24754 -42700 -45195 -41983
12253 -41983 -59927 -68370 -49488 -23005 -753 7778 15294 27816 13292 -14406 -26914 -17099
12241a7099J2063Q549K765J99L3577k1319J1611J081k7263M074J0439j9807J3243
12228A2113J8577R996j6870n441J0735n39j9919j2039j2626N979J4060J0659j7582
12215b897P717m874j5335M616p115j4818P055J1930M000N666J2959O881m748L542
12201A4579J8894k5308l2072J06K9381K5672j5958r625m220k8902j0625n540N610
12188c8008J0449J5788J3013q946j0164j2713j4805L861J0395K7627n655k5758
12176c4916K367K1265J9437K381J6552L2457m516n499k9980J1655k1967j9641
12164a0405O737K9712J3074l806J3020n569k5913j0362L898m17J4885N51K870
12151B8275J681l7478r086M2935K0324p399j976J1849M357j7927j7845k3528n305
$$ plain form
12241 -17099 -5036 3513 6278 6477 40054 18735 30346 31427 4164 8238 18677 -1130 12113
12228 12113 30690 40686 23816 18375 29110 28571 8652 -3387 -16013 -10034 4026 14685 -2897
12215 -2897 4820 -54 -15389 -10773 -17888 -32706 -25651 -13721 -9721 -4055 8904 15785 11037 14579
12201 14579 33473 8165 -23907 -23801 5580 31252 15294 5669 1449 -27453 -38078 -43618 -38008
12188 -38008 -27559 -11771 1242 -7704 -17868 -30581 -45386 -41525 -31130 -3503 -9158 -34916
12176 -34916 -32549 -11284 8153 10534 27086 59543 55027 49528 19548 31203 9236 -10405
12164 -10405 -3668 26044 39118 35312 48332 42763 16850 6488 10386 9969 24854 25405 28275
12151 28275 29956 -7522 -16608 26327 46651 39252 37276 49125 53482 35555 17710 -5818 -11123
12138a1123L893O247j2629n378n858k764J2092q674K0560n461p245P808j392r085
12124a9009n98j3265q759j6427K7693l441K0725K4367r950N680J8735m510k6152
12111d911j0262P707R996k1232L7111N5377L1730j7916j4365k0325K9108K7181
12099A09199N283Q970k0145K880L887l8390j9529j932m111k3208m7154q076p485
12086c9811r100l642P828J6919j1931R056l927O649p463J9245j9384p202L0427
12073a2336K3318M8017J980o7879m4605J2953L0097R281j5906j8283N721J9232
12061h410R87K1079J1917j8403j0863j5505J1522R309l643J3080q534J5074j8181
12048e71j3157N162J3818k386k1417M651k3969l905l3235J6481K7224J0052k7992
$$ plain form
12138 -11123 -7230 -983 -13612 -18990 -24848 -27612 -15520 -24194 -3634 -9095 -16340 -8532 -9924 -19009
12124 -19009 -19607 -32872 -41631 -58058 -30365 -33806 -13081 11286 1336 7016 25751 21241 -4911
12111 -4911 -15173 -7466 2530 -18702 18409 73786 105516 87600 73235 52910 82018 109199
12099 109199 114482 123452 103307 106187 110074 71684 52155 50223 46112 22904 -24250 -32326 -39811
12086 -39811 -48911 -52553 -44725 -27806 -39737 -30681 -34608 -27959 -35422 -16177 -35561 -42763 -12336
12073 -12336 10982 58999 60979 -6900 -51505 -38552 -8455 826 -15080 -33363 -27642 -8410
12061 -8410 -7423 13656 25573 7170 -3693 -19198 -7676 1633 -2010 11070 2536 17610 -571
12048 -571 -13728 -8566 5252 2866 -18551 -13900 -37869 -41774 -75009 -58528 -31304 -21252 -49244
12035d9244k1731L1446K3377K7912J1268k2239q167j6565q066K9085K0184m593
12023A2667k5332m6721J2586J6738K1755J3025J1558j0515k3384L955j3326r864
12011c6858j9483J4261k617j031L02R118l2081Q848J8869J2054j2967K2697l536
11998b2424j2928q783j73J019J2084J583j4066J909l87n531J7899K9111O443k5019
11984a9263k6345j530K2617L0793J1702K0218L60k7404P425k0918j4577K2018
11972E096l1352m0895L1992K3089J0597N912R043K9393k433j6502R169m482j9639
11959H988j1105N579j680k8060k1008J5235n980Q278M131R697L109M221J1038
11946B443p414j3387J6N311k076O812j6004k4822J1725j1195J2079O377K1681
$$ plain form
12035 -49244 -70975 -39529 -16152 11760 23028 789 -7378 -23943 -32009 -2924 17260 12667
12023 12667 -12665 -59386 -46800 -30062 -8307 4718 16276 5761 -17623 -13668 -26994 -36858
12011 -36858 -56341 -42080 -44697 -45728 -45426 -36308 -68389 -59541 -40672 -28618 -41585 -18888 -22424
11998 -22424 -35352 -44135 -44308 -43289 -31205 -29622 -43688 -41779 -42166 -47697 -29798 -687 5756 -19263
11984 -19263 -45608 -47138 -24521 6272 17974 38192 38552 11148 18573 -2345 -16922 5096
11972 5096 -26256 -67151 -35159 -12070 -1473 4439 13482 42875 40442 23940 33109 28627 8988
11959 8988 -2117 3462 1782 -26278 -47286 -32051 -38031 -29753 -25622 -15925 -12816 -8595 2443
11946 2443 -4971 -18358 -18342 -13031 -15107 -8295 -24299 -49121 -37396 -48591 -36512 -30135 -8454
11933h454m85J3310l755j0501L370j7039P708j6762O655K2411J5781k0289l0927
11920c8977k4763K4484K5934M555K4825k2669j938N17r758J3897o640j4752j3472
11907c8757j0237J093J6904K0252O190q303O311m858k4977J372Q900P110K6453
11894G453L904k5847j9257K1123K850m0159N21K0603m508K4568j722N016L3351
11881B7896K1193k8675k9641j7401M760L433l5180Q259J4331J202L826J1970K3126
11868I099Q523Q464J0307k5293j120L009j7179l4477j7857J7638J1702K8759K1411
11855B2986L6935P330l8788k9556j9764q93J1446Q789j066J565J0616P378q63
11842A6115k1074J2179J8783n161Q218q469l9598k2850M347L3481J9791R237k9480
$$ plain form
11933 -8454 -8939 4371 616 -9885 -6515 -23554 -15846 -32608 -25953 -3542 12239 -8050 -38977
11920 -38977 -63740 -39256 -13322 -8767 16058 -6611 -8549 -8032 -17790 -3893 -10533 -25285 -38757
11907 -38757 -48994 -47901 -30997 -10745 -4555 -12858 -6547 -11405 -36382 -35010 -26110 -19000 7453
11894 7453 11357 -14490 -33747 -12624 -9774 -49933 -49412 -28809 -33317 -8749 -10471 -5455 27896
11881 27896 49089 20414 -9227 -26628 -21868 -18435 -53615 -45356 -31025 -29823 -25997 -14027 9099
11868 9099 17622 26086 36393 11100 9980 12989 -4190 -38667 -56524 -38886 -27184 1575 22986
11855 22986 59921 67251 28463 -1093 -20857 -21750 -10304 -1515 -2581 -1016 9600 16978 16115
11842 16115 -4959 7220 26003 20842 29060 20591 -19007 -41857 -37510 -4029 15762 24999 -4481
11829d481p434k596P602j7499q972K2321k302n180J7442L251j6578J7949J5492
11816A9015j5162j8467p823J2426l168k4313J9678L3227O733j3006k7586j3422
11804c1868K5811J9483p83p91J9234j158l2791l3481m061K6760L33P107j7347
11791b3552k4229O425k812J0613K0582J6422o527J4483j7316l2334J4351M749
11779a9145l267Q256L1167J470k3248j235J3282P755j4520l3430j2067l643P661
11766d0964J6286N821L6164j5039O209Q546k6774j2133J5957J3631r8l9655k4965
11753e7014j258N2143L8532O628n8947j0742K8911K3964j8395j9171j0774k3531
11741d9654J0878J9868L5273k3673l9129l887K3672M993K6590O099l3195q606
$$ plain form
11829 -4481 -11915 -14511 -6909 -24408 -33380 -11059 -13361 -18541 -1099 2152 -14426 3523 19015
11816 19015 3853 -14614 -22437 -10011 -13179 -37492 -17814 15413 22146 9140 -18446 -31868
11804 -31868 -6057 13426 12643 11852 31086 29928 -2863 -36344 -40405 -13645 -13312 -6205 -23552
11791 -23552 -47781 -41356 -44168 -33555 -12973 3449 -3078 11405 -5911 -38245 -23894 -19145
11779 -19145 -22412 -14156 17011 18481 -4767 -6002 7280 15035 515 -32915 -44982 -48625 -40964
11766 -40964 -24678 -18857 17307 2268 8477 17023 -9751 -21884 -5927 7704 7606 -32049 -57014
11753 -57014 -58272 -6129 32403 39031 -19916 -30658 -1747 22217 3822 -15349 -26123 -49654
11741 -49654 -38776 -18908 16365 -7308 -46437 -50324 -26652 -21659 4931 11030 -22165 -30771
11729c0771J5927n309l437k0895l594J1173J9076R685K0893j0466J4985M40j5315
11716B392Q770j8962k2272k2164k0540K4468N672M507k564K5337J7335r403O466
11703i58r281r573J154L4665k2916n39J81j6599j011K0062K4115M745L1790j6514
11689C9321k2741j2013j5091N842j4655j0075K0130K225J0212J6847k0158k7026
11677b7182j2673j820k978K6567r234J8151J4638l0197o619Q492J5371J4022q185
11664a647k239J7482K7109k7718l3166l864n815L708O050l4346J2388L9947j957
11651d068N719J968j0973k6042K2060J9721j363j5404j3608n050L741j6662j3475
11638e3436L6919L7240k961O938J1104k6652J2188J1539o804N13k808l8982k3778
$$ plain form
11729 -30771 -14844 -20153 -23590 -44485 -48079 -36906 -17830 -8145 12748 2282 17267 17707 2392
11716 2392 11162 -7800 -30072 -52236 -72776 -48308 -42636 -38129 -40693 -15356 1979 -7424 -958
11703 -958 -10239 -19812 -18658 16007 -6909 -7448 -7267 -23866 -24877 -4815 19300 24045 55835 39321
11689 39321 16580 4567 -10524 -4682 -19337 -29412 -9282 -7057 3155 20002 -156 -27182
11677 -27182 -39855 -41675 -44653 -18086 -27320 -9169 5469 -24728 -31347 -22855 -7484 6538 -1647
11664 -1647 -3886 13596 40705 12987 -20179 -24043 -29858 -26150 -20100 -54446 -42058 -2111 -4068
11651 -4068 1651 3619 -7354 -33396 -11336 8385 7022 -8382 -21990 -27040 -23299 -39961 -53436
11638 -53436 -16517 20723 17762 24700 35804 9152 21340 32879 26075 26588 23780 -15202 -38980
11625c8980K688q859K5457N1365r945J698L0473j8338j2803m480k1515J0637J4848
11612B2246o299k594j7974n724K120J420p457l7118N2836O975j5254r278j709
11599a7810J1646O769j1082Q095R162o982j32K0761o538k9078P003O531P808j284
11585D869p029K7828J4232j5167n99K2844J5877K1018Q4292P3257J50279K08172
11573E99873K09616J57160Q7888J948o4593j97640k27620j77522j34213p0241
11563A84656o0929n0558J0040l485m851K0933J3059j8380k1418k4226q190o720
11551B9931j0437j1279r318J1448Q230r531p734r970k260N635j2201K1393O18
11538D525N306J4207j0937q057j9135j3883R613O023M3493N778Q101j141j1093
$$ plain form
11625 -38980 -36292 -45151 -19694 31671 21726 23424 53897 35559 22756 18276 -3239 7398 22246
11612 22246 15947 13353 -4621 -10345 -8225 -6805 -14262 -51380 1456 8431 -6823 -16101 -17810
11599 -17810 -6164 605 -10477 -2382 6780 -202 -334 20427 13889 -15189 -8186 -1655 6153 4869
11585 4869 -2160 25668 39900 24733 24134 46978 62855 83873 168165 241422 391701 599873
11573 599873 809489 966649 1054537 1056485 991892 794252 566632 389110 254897 184656
11563 184656 123727 73169 83209 79724 74873 95806 108865 90485 69067 44841 36651 29931
11551 29931 19494 8215 -1103 10345 18575 9044 1310 -8660 -10920 -5285 -17486 3907 4525
11538 4525 9831 24038 13101 5044 -14091 -27974 -18361 -12338 31155 36933 45034 43893 32800
11525C2800J3352J3807n806n143m0175j825r305k7080m8740j6770R056J8679N384
11512f1766J7213M2185J3441J74j6622k2729J7207J8202J935p865r212M028o05
11499d414k936j3692j2069l224K8601l114L392j9218P507J2488L5641q567k8651
11486h256j8990K4525J3379j7659k77L34m1000k5327J1922n713J4923J2333R300
11473c0506J6410J1708n30k2340o909L2741j2280N120p979r378k4726K3247L3023
11460G601K028j1834j3025J1768K3507j6163j989Q161L334j9043j5277O304k0168
11447c4796M175K678J2237J3168j343N967j7080k975L161O937K2910n574j5808
11434f343r631j4298K955j6682J382K1360O717p648q240o158q631K0307K2143
$$ plain form
11525 32800 46152 59959 54153 49010 8835 7010 -2295 -29375 -78115 -94885 -85829 -67150 -61766
11512 -61766 -44553 -2368 11073 11247 -5375 -28104 -10897 7305 9240 1375 -7837 -3809 -4414
11499 -4414 -7350 -21042 -33111 -36335 -7734 -10848 -7456 -26674 -19167 -6679 28962 20395 -8256
11486 -8256 -27246 -2721 10658 -7001 -7278 -6944 -47944 -73271 -61349 -67062 -52139 -39806 -30506
11473 -30506 -14096 -2388 -2918 -25258 -32167 574 -11706 -6586 -14565 -23943 -48669 -25422 7601
11460 7601 9629 -2205 -15230 -3462 20045 3882 1893 10054 13388 -5655 -20932 -14628 -34796
11447 -34796 -30621 -27943 -15706 -2538 -3881 2086 -14994 -17969 -14808 -7871 15039 9465 -6343
11434 -6343 -15974 -30272 -27317 -43999 -42617 -21257 -14540 -22188 -30428 -36586 -45217 -24910 -2767
11421b767N839K2n504N165j5653K663L541q06o207j901q135j6433K220N98K3728
11406a3630j00l653J8753K1560R129j6503M536R691k4057j5798K298l400j2480
11393b3654Q571K2412O055J4841M977j294q380m0726j2180Q855J4994j867q047
11380a5443q969J4899J1657J1713K6460K005k0429K06o776N921q734L8963J9795
11367G1268K8835N2200R9804N3105r077j4221m6122m2230m6693k1847j5349k0242
11355H9431j8142o839j8715J1849j2217k7679j4065m630K0109O97j4719l008k018
11342E4j6854l2089Q987O1338J2718n721l4588j9170L1785j78k4004k0450J3309
11329b4863J3415l3844k0966M346K3206J9227K369P88k7738k2776Q842N257o395
$$ plain form
11421 -2767 3072 3094 -2410 2755 -12898 -10235 -6694 -7500 -13707 -15608 -23743 -40176 -37956 -37358 -13630
11406 -13630 -13730 -17383 1370 22930 32059 15556 20092 29783 5726 -10072 -7774 -11174 -23654
11393 -23654 -15083 7329 13384 28225 33202 31908 23528 -17198 -29378 -20523 -5529 -7396 -15443
11380 -15443 -24412 -9513 2144 13857 40317 42322 21893 22099 15323 21244 12510 51473 71268
11367 71268 100103 152303 252107 305212 296135 281914 235792 193562 146869 125022 109673 89431
11355 89431 71289 64450 45735 57584 45367 17688 3623 -1007 19102 19799 5080 2072 54
11342 54 -16800 -48889 -39902 21436 34154 28433 -6155 -25325 6460 6282 -17722 -38172 -24863
11329 -24863 -11448 -45292 -66258 -61912 -38706 -19479 -17110 -16322 -44060 -66836 -57994 -52737 -59132
11316e9132J1208k904Q436K0995K2194l615j4932Q024j0738k233K5292J0395o482
11303F508j706r806L6515L4574n025k5614k3021j3558k860j6631j2803q51Q271
11290b6007m799k3755J5863J3781J2853n696J5210J5048m314P653K6877k3188
11278A9526l1245j6512j2554L3036N701O596N192l234R088k3292J6587L1565j0447
11265C0007J6357L706M1816J3766J7457l2617k0225K4860K334l3214n5403k5546
11253a6702L414J3776M842r522l3041j9449K0575J5169j2962k0704K4061K7206
11241c337J1893k7215o11n509l4706J543K0190K3228l93k2037l6969O526M6312
11228b1085L3507P090j4960k6928n903K4748J4343J5100j258k422p348N346j5514
$$ plain form
11316 -59132 -47924 -50828 -42392 -21397 797 -2818 -17750 -9726 -20464 -22697 2595 12990 6508
11303 6508 4802 -5004 31511 66085 61060 35446 12425 -1133 -3993 -20624 -33427 -34278 -26007
11290 -26007 -30806 -54561 -38698 -24917 -12064 -17760 -2550 12498 8184 15837 42714 19526
11278 19526 -11719 -28231 -40785 -7749 -2048 4548 9740 6506 15594 -7698 8889 40454 30007
11265 30007 46364 50070 91886 105652 123109 90492 70267 95127 97461 64247 8844 -16702
11253 -16702 -13288 488 5330 -4192 -37233 -56682 -36107 -20938 -33900 -54604 -30543 -3337
11241 -3337 8556 -18659 -19270 -24779 -59485 -57942 -37752 -14524 -14917 -36954 -73923 -67397 -21085
11228 -21085 12422 19512 4552 -22376 -28279 -3531 10812 25912 24654 22232 14884 20230 4716
11215D716j4395j1319k389K0623J2813l152j7173n530J2095j3070j3497K5374
11203d904O235l90K2123J4828j7617m587J3001P281R727J9076K6648K7260M5234
11190A63915L6362O3128J14042J72670K04232J76385J33236N1105k1314j27214
11180I66547k37958k32122j29892q3065q8105n7335l6452j0485L447k0776N46
11169G4350K6188k53n7925j9265J3056J2400j2290J0406J8460l1729k267j794
11157B9337k529J7991N905j4203j6702j6020J137k6253j6542n19K5244K6719O299
11144A9864L3913K0043J6041J118l630l387K308L8731K3578k1118m3129m6332
11132C8000p077k7111k5795m841k19L0430K3844J8458j4519j8502N032o526k153
$$ plain form
11215 4716 -9679 -20998 -23387 -2764 10049 6897 -10276 -15806 -3711 -16781 -30278 -4904
11203 -4904 1331 941 23064 37892 20275 15688 28689 35970 45697 64773 91421 118681 163915
11190 163915 200277 263405 377447 550117 754349 930734 1063970 1115075 1093761 966547
11180 966547 728589 496467 366575 283510 195405 138070 101618 91133 94580 73804 74350
11169 74350 100538 100285 42360 23095 36151 48551 36261 46667 65127 33398 31131 29337
11157 29337 26808 44799 50704 36501 19799 3779 4916 -21337 -37879 -38398 -13154 13565 19864
11144 19864 53777 73820 89861 90979 87349 83962 86270 125001 148579 127461 84332 38000
11132 38000 30923 3812 -21983 -26824 -27043 3387 27231 45689 31170 12668 17700 11174 9021
11119I021l163l222j9859l6670J2365j456J0921K2526L163j0141J395j5430n580
11106c6130K6955o453J4822L4380n171j6577k1343j1958k3J4344j375J3923j5698
11093a0304k0264K1144j47k21o639J2988J090q635J4973k5815k7321P541o127
11080d7737k0522q014P059M125j482J8128J0371L2789K3403j7357J2267p308j0405
11067d683j5802J7936J0325L354K2289m289J202O229j7698l3893j9614q463J7506
11054b5601M748j0772j2484j3331m164R439L9833L621j5830j6507J4571K7828
11042A351J8613J5903j040P63k8274l0200K3416n135j108M754k2740l8907J8451
11029d4153K3623J592K88J957P516J5890L5019O847j579k1901l8995O882L2345
$$ plain form
11119 9021 5858 2636 -17223 -53893 -41528 -42984 -32063 -9537 -6374 -16515 -15120 -30550 -36130
11106 -36130 -9175 -15628 -806 33574 28403 11826 -9517 -21475 -21498 -7154 -8529 5394 -10304
11093 -10304 -30568 -9424 -9571 -9792 -16431 -3443 -2353 -10988 3985 -21830 -49151 -41610 -47737
11080 -47737 -68259 -76273 -69214 -65089 -66571 -48443 -38072 -5283 18120 763 13030 5722 -4683
11067 -4683 -20485 -2549 7776 11130 33419 29130 30332 36561 18863 -15030 -34644 -43107 -25601
11054 -25601 -20853 -31625 -44109 -57440 -61604 -52165 -12332 -8711 -24541 -41048 -26477 1351
11042 1351 19964 35867 34827 35590 7316 -22884 532 -4603 -5711 -957 -23697 -62604 -44153
11029 -44153 -20530 -18938 -18650 -16693 -9177 6713 41732 48579 47000 25099 -13896 -7014 25331
11016B5331p847k8549K0838j3546l2972K508K4220m155J0670k6358l2121j7552
11004g9533J7230m007J6974J2009j081K841J4229J3644m290k0131j990m726n928
10991d4759J475J4120l1633j4353J6795k73J0196n10K3827J8112j3013K5325J9547
10978B4856k4706o27J6918M200M126r704k1422k8380J1027O65J0720Q570J3945
10965A0188k9654j4670q902l0552J742M9902M3556m576M565K995k2347l404k3392
10952b4549N98N5J4924k812k0620K854K771j2104m582K6641j1749Q05k1734k4462
10938g3964L130L1710r915j4355n420J0610L5971L3513k4978J2468K624j4676
10926a3282m4983j634L0711L2663k407j5622J181k122P563o694n996j9847q552
$$ plain form
11016 25331 17484 -11065 9773 -3773 -36745 -34237 -10017 -14172 -3502 -29860 -61981 -79533
11004 -79533 -62303 -66310 -49336 -37327 -38408 -35567 -21338 -7694 -11984 -32115 -34105 -38831 -44759
10991 -44759 -43284 -29164 -60797 -75150 -58355 -58628 -48432 -48942 -25115 -7003 -20016 5309 24856
10978 24856 150 -477 16441 20641 24767 15063 -6359 -34739 -23712 -23047 -12327 -3757 10188
10965 10188 -19466 -34136 -43038 -73590 -71848 -21946 21610 17034 21599 24594 2247 -1157 -24549
10952 -24549 -23951 -23896 -8972 -11784 -32404 -29550 -26779 -38883 -43465 -16824 -28573 -27768 -49502 -73964
10938 -73964 -70834 -39124 -49039 -63394 -68814 -58204 -22233 11280 -13698 -1230 1394 -13282
10926 -13282 -58265 -59899 -29188 3475 1068 -14554 -13373 -15495 -7932 -14626 -20622 -40469 -49021
10913d9021J3776l952l6816L720k800K5917J2807o013J6085L9236R761n1399k6811
10900e5510j1000n389M458M1264M1119k3624j0479m716j7882J6372j981o13J1874
10887a6107J7643j181p652k3822l165R626J725J4130p800j0610N248J6094N835
10874c6r566p759j8886K996K8881R286N785l1966j4965K2411K344K3162J4852
10861B6539k5061J584p10l0680k9673j5499j1801L3776J2137Q829j2385k3072
10849f6016J8807J2055O105r877l402L9504L4992r169k9259k2006j8294k1683
10837f8243K928N8267K0819O19j6827q879J6769j4006k8985J6037M56k5008j4429
10824f0482J2375J9131K1274J2974J6507j8908k0599j4483P820j0844J1770K7046
$$ plain form
10913 -49021 -35245 -39197 -76013 -72293 -75093 -49176 -36369 -42382 -26297 12939 22700 -28699 -55510
10900 -55510 -66510 -71899 -67441 -26177 14942 -8682 -19161 -23877 -41759 -25387 -27368 -27981 -16107
10887 -16107 1536 355 -7297 -31119 -34284 -24658 -22933 -8803 -16603 -27213 -21965 -5871 -36
10874 -36 -9602 -17361 -36247 -33251 -4370 4916 10701 -21265 -36230 -13819 -11475 11687 26539
10861 26539 1478 3062 2352 -28328 -58001 -73500 -85301 -51525 -39388 -30559 -42944 -66016
10849 -66016 -47209 -35154 -29049 -38926 -42328 -2824 32168 22999 -6260 -28266 -46560 -68243
10837 -68243 -65315 -7048 13771 14390 -2437 -11316 5453 -8553 -37538 -21501 -21045 -46053 -60482
10824 -60482 -48107 -28976 -7702 5272 21779 2871 -17728 -32211 -24391 -35235 -23465 3581
10812C581K139K482j5322j2182k3028l135K0136n575O641p778K5784J0804K5541
10799C0088K1278k0506k4560k864M937p542M073P124j2078J781l323j6059J4344
10786c307L1172j4330l5754k8671K97j4373L1897L6619k0881l4865K535K0409
10774b9252m421m50M006R201k846O260J7480R112k6479Q129J3376j9767J7514
10761A863J0429o432l1405q602q003Q821J2793K489j308K7062J7859j9406J4748
10748B0908P947J776j772J1853J5036k5856k5617j0841J3425J1184J6501m007
10736C0537k3260n085m494j6473k7024q576J6052J4369k2508k1884K114K6337
10724c9895R769j8225J4238r506j0231J7781K6150k4427k3696J7049P07M352J5070
$$ plain form
10812 3581 5720 8202 -7120 -19302 -42330 -45465 -25329 -30904 -24263 -32041 -6257 4547 30088
10799 30088 51366 30860 6300 3436 8373 831 4904 12028 -50 1731 -1592 -17651 -3307
10786 -3307 27865 13535 -22219 -50890 -50593 -64966 -33069 3550 -17331 -52196 -49661 -29252
10774 -29252 -33673 -34123 -30117 -20916 -23762 -17502 -22 9090 -17389 -9260 4116 -15651 1863
10761 1863 12292 5860 -25545 -34147 -42150 -33329 -20536 -18047 -19355 7707 25566 6160 20908
10748 20908 28855 30631 28859 40712 55748 29892 4275 -6566 6859 18043 34544 30537
10736 30537 7277 2192 -2302 -18775 -45799 -54375 -38323 -23954 -46462 -68346 -66232 -39895
10724 -39895 -30126 -48351 -34113 -43619 -53850 -36069 -9919 -34346 -58042 -40993 -40286 -35934 -20864
10711b0864j3038j7268O049L2146p136j1833J0039j2903p364J9350J7136P237
10699A551j1662l1634m046j2579L1219J0043J950K3226o193R688j8677k2273M537
10686b4850K6543Q019k4207O400O377l0043m675J1417j4749j6995j577j1440K5525
10673d4255J5261K6796J6431q459p28N981K098J3900j3859l9617k5322O354k567
10660d7986K802J8507L0694o017j8372J2494j077N678l46O681j2766j1222j0820
10647c1750J4298J9091K172o880k810j5137j0286M542K7798k378N910J7872k2263
10634A79p005j8100k3296P900J2700j0926j4415J8450J0164K379m859j0767K9039
10621h557L0821J495k3107O281J0361j1135j4104M437k252O451m69K1768J8380
$$ plain form
10711 -20864 -33902 -51170 -45121 -12975 -20111 -31944 -21905 -34808 -42172 -22822 -5686 1551
10699 1551 -10111 -41745 -45791 -58370 -27151 -17108 -15158 8068 1875 11563 -7114 -29387 -24850
10686 -24850 1693 9712 -14495 -8095 -1718 -31761 -36436 -25019 -39768 -56763 -58340 -69780 -44255
10673 -44255 -28994 -2198 14233 5774 5046 11027 13125 27025 13166 -26451 -51773 -45419 -47986
10660 -47986 -45184 -26677 4017 -2000 -20372 -7878 -8955 -3277 -3623 3058 -9708 -20930 -31750
10647 -31750 -17452 1639 3811 -3069 -5879 -21016 -31302 -26760 1038 -1340 4570 22442 179
10634 179 -6826 -24926 -48222 -40322 -27622 -38548 -52963 -34513 -24349 -21970 -26829 -37596 -8557
10621 -8557 22264 23759 652 6933 17294 6159 -7945 -3508 -5760 691 222 21990 40370
10608D0370r461j8468R981J8941k2476l2623n293L167L707l083L184J4187M687
10595F820N528n807n077O575K0410l7599k4941K2160K5925j9806O933O359j1247
10582c767k5368J1832j3448n554Q704K652K0567k2478J327K5913k2557m4696J107
10569f5766O478Q6l331J1167J3947K6214L212J3089J4258j0687R383m0460j6879
10556c9289p556L306P242O457K2562J266O94j0170j5822j0621O757L322L3822
10543A970K7188K184k2451l107N977j6004N231J2070j7468N078Q215M354j4856
10530a619p946n148l0779l407K2720J7392K9584k7465K253K1270l1589j8003p754
10517d0491k550k244j4360M380k311l3844l159N813J2270o80J4168J839K8867
$$ plain form
10608 40370 30909 12441 22422 41363 18887 -13736 -19029 -15862 -12155 -15238 -12054 2133 6820
10595 6820 12348 6541 1464 8039 28449 -9150 -34091 -11931 13994 -5812 1121 7480 -3767
10582 -3767 -29135 -17303 -30751 -36305 -27601 -24949 -4382 -26860 -25533 380 -22177 -66873 -65766
10569 -65766 -59288 -59202 -62533 -51366 -37419 -11205 -7993 5096 19354 8667 18050 -22410 -39289
10556 -39289 -46845 -43539 -36297 -29840 -7278 -6012 -5318 -15488 -31310 -41931 -35174 -31852 1970
10543 1970 29158 31342 8891 5784 11761 -4243 988 13058 -4410 668 8883 13237 -1619
10530 -1619 -9565 -14713 -45492 -48899 -26179 -8787 20797 -6668 -4415 16855 -14734 -32737 -40491
10517 -40491 -43041 -45285 -59645 -55265 -57576 -91420 -94579 -88766 -76496 -77176 -63008 -61169 -32302
10504c2302p80M357J4505K3073l251q205K4518O603k2078N573O745k8536l4803
10491d4581j517J5568l6265N033J4425L4582J1524N213n127r616l3632k3206L5078
10478c2521K9207J5593O76j7504k5394j7313j334Q248J2260p51J3347Q697m099
10465a0888j2790J4488R31k5199L347O992J1829J1323j2041l0567p441J8153J3414
10452a8449q646j0234Q592L601K0803J7654k5615j5038r2L8590n319l5768O859
10439b3062l739L01N276l668J1607R821n9718j9617O687R869L4609M17l452L138
10425c1531l5552j1939K4944L3719l19k82l01r406J663J699J2980O946n858Q905
10411d332m296l1824j9427j2494r900N7173J4749j2440J3879J9094k1456J3313
$$ plain form
10504 -32302 -33082 -28725 -14220 8853 5602 -2603 21915 28518 6440 12013 18758 -9778 -44581
10491 -44581 -46098 -30530 -66795 -61762 -47337 -12755 -1231 3982 -1145 -10761 -44393 -67599 -32521
10478 -32521 -3314 12279 12955 -4549 -29943 -47256 -48590 -40342 -28082 -28833 -15486 -6789 -10888
10465 -10888 -23678 -9190 -8259 -33458 -30111 -23119 -11290 33 -12008 -42575 -50016 -31863 -18449
10452 -18449 -27095 -37329 -28737 -25136 -4333 13321 -12294 -27332 -27424 11166 5847 -29921 -23062
10439 -23062 -26801 -26500 -21224 -24892 -13285 -3464 -63182 -82799 -76112 -66243 -31634 -31217 -34669 -31531
10425 -31531 -67083 -79022 -54078 -20359 -20678 -20960 -21261 -30667 -29004 -27305 -14325 -7379 -13237 -4332
10411 -4332 -8628 -40452 -59879 -72373 -82273 -25100 -10351 -22791 -8912 10182 -11274 2039
10399B039q152k8144K4764r302j345l412J6165Q521o047l705J3489L244l0572
10386b2457j5689J2567J6573L284J135J7088j3790k0922j3869P724K6926k6596
10374b8026l7351O543l521K7719K1774p947N500K9260l882j5404L422j2109k029
10361a6051K3806L3645P929l254k2797k1379J714J0030j951j1221j2692K9118
10349A6897j0630j9942K6577K2807m4732j4310L7441N584l0980l3035O282K3889
10337a4152o261o564j8726j2532k4252l455L2368M4714K6172O172k7631j9585
10325b3732o145J4716r438l010Q995q05n301m473p517j2637m056J0946K1743L1343
10311A0629J0569j6322j2525K13K1100M552n494k4053m738j216m70N042j0089
$$ plain form
10399 2039 -6113 -34257 -9493 -18795 -20140 -23552 -7387 1134 -4913 -8618 4871 8115 -22457
10386 -22457 -38146 -25579 -9006 -5722 -4587 12501 -1289 -22211 -36080 -28356 -1430 -28026
10374 -28026 -65377 -58834 -62355 -34636 -12862 -20809 -15309 13951 10069 -5335 -1913 -14022 -16051
10361 -16051 7755 41400 49329 46075 23278 1899 3613 13643 11692 471 -12221 16897
10349 16897 6267 -13675 12902 35709 -9023 -23333 14108 19692 -11288 -44323 -38041 -14152
10337 -14152 -20413 -26977 -45703 -58235 -82487 -85942 -53574 -8860 17312 23484 -4147 -23732
10325 -23732 -29877 -15161 -24599 -27609 -18614 -19419 -24720 -29193 -36710 -49347 -53403 -42457 -20714 10629
10311 10629 21198 4876 -7649 -7436 13664 18216 12722 -11331 -16069 -17285 -17755 -12713 -22802
10298b2802m095r583j7145J2388M373J8873J351J5979J5912j033Q683k5598p003
10285i700L4586j9171k2184q373J1302J8698j0135n683k754j1187k1038L364J590
10272d0685j0093N41L730N226K2941J9535o711j3477j8127L1971J3509j6304J1906
10259C962n450r156m424j1661J8114J9071j3677J137J7584j7215k611k328q928
10246a5582K5931O192j8969j6194J5682k4585m343K741J008O012K2892L0626r300
10233B2111l3974k39Q750j3389r97J6213K636M600L85J9162O909p848p362l9129
10219b2172k109J9680K5530K3770k9162q392j4190l3601j4078N576L5178J2560
10207a410j6976K764K8826L266j5154j1240o947j7445k0788j0534L0618L0872
$$ plain form
10298 -22802 -26897 -36480 -53625 -41237 -36864 -17991 -16640 -661 15251 14218 22901 -2697 -9700
10285 -9700 24886 5715 -16469 -24842 -13540 5158 -4977 -10660 -13414 -24601 -45639 -42275 -40685
10272 -40685 -50778 -50237 -46507 -41281 -18340 1195 -5516 -18993 -37120 -5149 8360 -7944 3962
10259 3962 -1488 -10644 -15068 -26729 -8615 10456 -3221 -2084 15500 -1715 -4326 -6654 -15582
10246 -15582 10349 16541 -2428 -18622 -2940 -27525 -31868 -29127 -28119 -22107 785 31411 22111
10233 22111 -11863 -12102 -3352 -16741 -17738 -1525 1111 5711 6096 25258 32167 24319 16957 -22172
10219 -22172 -24281 -4601 20929 44699 15537 7145 -7045 -40646 -54724 -49148 -13970 -1410
10207 -1410 -18386 -15622 13204 16470 1316 -9924 -16871 -34316 -55104 -65638 -35020 -4148
10195d148P471n055k1272j5601m64j182J1564K177L505r62m739o961N500M548
10181b5619P169J8563K5765L630m1562p417Q618J6234Q669O899J428p666k6820
10168a2109j3123j6015j4013k0748J030J253K245J0997n053J9066M422Q696J7465
10155a5887j4220j2984k778K8100P379l0826L646J7947J3116M574k1030Q486L4703
10142B0226R94l1177k1479J0064r537J5912j6184r975J6545L30K6m541R447j393
10128b0742J5889J7545n381M510j2155k548O036j596J1119J9424J740o015M563
10115C2389l6683k4207q51K1386K0412r66M433j0888k0495J6255R533j1830k2417
10102b3929l4419j9265Q240O773O44m638K004J9381K2227K8171l561J004P866
$$ plain form
10195 -4148 3323 -1732 -23004 -38605 -39069 -40251 -28687 -26510 -23005 -23967 -28706 -35667 -30167 -25619
10181 -25619 -18450 113 25878 29508 -12054 -19471 -10853 5381 14050 20949 22377 14711 -12109
10168 -12109 -25232 -41247 -55260 -76008 -74978 -73725 -71480 -60483 -65536 -46470 -42048 -33352 -15887
10155 -15887 -30107 -43091 -45869 -17769 -10390 -41216 -37570 -19623 -6507 -1933 -22963 -14477 20226
10142 20226 21220 -9957 -31436 -21372 -30909 -14997 -31181 -41156 -24611 -24281 -24255 -28796 -19349 -20742
10128 -20742 -4853 12692 7311 11821 -334 -2882 3154 1558 12677 32101 33841 27826 32389
10115 32389 -4294 -28501 -29352 -7966 12446 11480 15913 5025 -15470 785 10318 -1512 -23929
10102 -23929 -58348 -77613 -69373 -62600 -61956 -66594 -64590 -45209 -22982 5189 1628 2632 10498
10089A0498j1805j702J0613o906j2824j0834k2464J2764Q956P650J5654q364l8426
10076d7190n881j4069J0382J0012M623K6353K5840j6204l87J4506j2038l7763
10064d1816p817K6412K2373J9442p907J8498j9277j1497P07j1404M806K234q101
10051a3347j577K246j6397J5910L783L590J8932O269j5319o644n695q275p678
10038b4202J363J8250Q064l0830k8331o287J8617L5132o87j6173J0350k539J6333
10025i40j6102K1797L3626K3329J2507J6551P3812R3118J33306J07066M9504j4962
10013E32612k6969m9862j55843j13054m0230k2323j9719j8677l252o888j6229
10002E9566k2628j8492K6155j3226j5978N197J225j0033k1602j13j6052O639R129
$$ plain form
10089 10498 -1307 -3009 7604 698 -12126 -22960 -45424 -32660 -23704 -16054 -400 -8764 -47190
10076 -47190 -53071 -67140 -56758 -46746 -42123 -15770 10070 -6134 -6521 7985 -4053 -41816
10064 -41816 -49633 -23221 -848 18594 10687 29185 9908 -1589 -882 -12286 -7480 -5246 -13347
10051 -13347 -14924 -12678 -29075 -13165 -9382 -5792 13140 19409 4090 -2554 -8249 -16524 -24202
10038 -24202 -22839 -4589 3475 -27355 -55686 -61973 -43356 -8224 -8911 -25084 -14734 -17273 -940
10025 -940 -17042 4755 38381 61710 74217 90768 164580 257698 391004 498070 547574 532612
10013 532612 505643 455781 299938 186884 146654 124331 104612 85935 82683 75795 59566
10002 59566 36938 18446 44601 31375 15397 20594 21819 11786 -9816 -9929 -25981 -19342 -10213
9989a0213J2629P970J381j3201Q866j5392l5714P317k265K4806K0274M31l1559
9976b4670J5139J8856l0336j1412j1539j8102l0983J5266K0734J741P312J8634
9964b9360J0517J9220j0672k4356r464O856N45J3009r037L495L155j3414j882
9951d1388Q444R045J5105J3822j3799o063k860N454j5391k867p885J0384J9890
9938h109P161m189L765k0587j0159L8966m899m289P752K549J1369J4014p810k2138
9924C396q884K1961L155K26q862o13q335Q138J4090P511K1513j0318J4444R998
9910F7420J4454Q666K4799O1081J05343J44806K27364K34211J67875O6238M3836
9899A166093k1545j76198k86283k33216j78524r6577l909k5542n0898k3313l4757
$$ plain form
9989 -10213 2416 10386 11767 -1434 7432 -7960 -43674 -36357 -38622 -13816 6458 6889 -24670
9976 -24670 -9531 9325 -21011 -32423 -43962 -62064 -93047 -77781 -57047 -55306 -47994 -29360
9964 -29360 -18843 377 -10295 -34651 -44115 -37259 -36714 -23705 -32742 -29247 -26092 -39506 -41388
9951 -41388 -32944 -23899 -8794 5028 -8771 -14834 -17694 -12240 -27631 -30498 -38383 -27999 -8109
9938 -8109 -948 -5137 -1372 -21959 -32118 6848 1949 -2340 5412 7961 19330 33344 25534 3396
9924 3396 -5488 16473 19628 19854 10992 10379 2044 10182 24272 31783 53296 42978 57422 67420
9910 67420 81874 90540 115339 176420 281763 426569 653933 888144 1056019 1122257 1166093
9899 1166093 1144548 968350 682067 448851 270327 173750 169841 144299 93401 70088 35331
9888C5331N724L4141j753k9030J0615O123j0928k6251K1466J6286k541k9532j3098
9875A6553R680J5816R002p113L578p865o000l0049j9418J8127q568L9780n500
9862B8023j0499N348j3697k710j97p234R813J6017p953m1624K3925J2159j763
9849I608K2201L059j1082k082k9483k6890K3154M380K2777l3442j8278L3395J3674
9836A0991Q138l458o472N967j2449R777K1846j4267K915p222O320m97J3054N770
9822D0413J3948p259Q460P827K4258M9748P2701J04879P0818K5832Q510k2259
9810C97876o3383o4370j10922m7046P330j5150M273k2186m0523l011k724J1409
9798E1573J909J5454k34k94k7044j9691L650J6274P209j1949O431J6104k2914
$$ plain form
9888 35331 41055 75196 73443 44413 55028 61151 50223 23972 45438 61724 59183 29651 16553
9875 16553 26233 42049 51051 43938 47516 39651 33651 3602 -15816 2311 -6257 33523 28023
9862 28023 17524 22872 9175 6465 6268 -966 8847 24864 16911 -24713 -788 11371 9608
9849 9608 31809 34868 23786 21704 -7779 -34669 -11515 -7135 15642 -17800 -36078 -2683 10991
9836 10991 19129 15671 9199 15166 2717 12494 34340 20073 22988 15766 22086 21589 34643 40413
9822 40413 54361 47102 55562 63389 87647 137395 210096 314975 385793 411625 420135 397876
9810 397876 334493 270123 159201 112155 119485 104335 108608 86422 45899 42888 40164 51573
9798 51573 53482 68936 68702 68408 41364 21673 25323 41597 48806 36857 43288 59392 36478
9785C6478j5482J3669K907j7175R316K2518r256o115K1315P344j7109j5719o538
9772B6153K1675o733j3519K7065O664j3871K972l0388l5411J0344K1055K0081
9760C6087J451k095l745j0976k4393r777o596O637M602M886N198M4367K8702k2472
9746E1876o306k784l8342l2554K635K7247l658j3254o853L669L1966P918J3067
9733C4627m298n402K9863j4749J5664n292j6752j5324N930J1951N161P357l424
9720D5312k805J2060R166k2889j4392k2420k8138K549p594K0597J1366K657N827
9707A1296p027j7127o627r768K7305J6300J8995P455j5008k0901j1807J0906J4387
9694A8379m683m378O332j3064j197N1265M4803J6290j6224q407j8658k3113M563
$$ plain form
9785 36478 20996 34665 37572 20397 29713 52231 42975 36860 58175 65519 48410 32691 26153
9772 26153 47828 41095 27576 54641 61305 47434 50406 20018 -15393 -5049 16006 36087
9760 36087 37538 35443 31698 20722 -3671 -13448 -20044 -13407 -8805 -3919 1279 45646 74348 51876
9746 51876 45570 42786 4444 -28110 -25475 1772 -1886 -15140 -21993 -18324 13642 21560 34627
9733 34627 30329 24927 54790 40041 55705 50413 33661 18337 24267 36218 41379 48736 45312
9720 45312 42507 54567 63733 40844 26452 4032 -24106 -21557 -29151 -8554 2812 5469 11296
9707 11296 4269 -12858 -19485 -29253 -1948 14352 33347 40802 25794 4893 -6914 3992 18379
9694 18379 13696 9318 15650 2586 1389 52654 97457 113747 97523 89116 70458 47345 51908
9681E1908J3734j2611J5883r901k0238J7986K1838m693j2769R274J695n361n764
9668F0981J4248O127r823j2588j7177n511M552K0703l828j9143J242L2774K2303
9655I4860J754j3864R74l944j7059k3904P767j530L370r769J8916P345J2868J2445
9641I0229m1826j9578J135K3718J8988J2631n109K2710Q658Q756k1873l3148p832
9628E7459L143K0569J3079j893o580l062K4814K6490j2122l6681k024N565m323
9615H4434Q555n331j8279j3938j325K3121L8814m301J1317j2931l1550o813J5806
9602H7579m545r836K3976L4540R439r716j0811j4249N964K8439P119j2356R973
9589A45516O518k1925l557r338k5332Q97N702L8858m042k2231M730J6088j3412
$$ plain form
9681 51908 65642 53031 68914 59013 38775 56761 78599 73906 61137 70411 72106 66745 60981
9668 60981 75229 81356 71533 58945 41768 36257 40809 61512 57684 38541 39783 72557 94860
9655 94860 96614 82750 83724 79780 62721 38817 46584 45054 48424 38655 57571 64916 77784 90229
9641 90229 48403 28825 29960 53678 72666 85297 80188 102898 111556 120312 98439 65291 57459
9628 57459 60602 81171 94250 92357 85777 82715 107529 134019 121897 85216 83192 88757 84434
9615 84434 92989 87658 69379 55441 54116 77237 116051 111750 123067 110136 78586 71773 87579
9602 87579 83034 73198 97174 131714 141153 131437 120626 106377 112341 140780 147899 135543 145516
9589 145516 152034 130109 126552 117214 91882 92779 98481 137339 133297 111066 115796 131884 118472
9576A18472M413M607q338J1559N764k8502J0361K977J0561Q791p86m15n917m764
9562A28783J3679J9192K5364k6297P195J5683K7124J1750j4227O070K9799O733
9550B50848n8804k6008L059J2198n459J4366J8372L7354r222k8814J680J4188
9538B23758K4326l3552j84J8131j3741J6974l918j9129L455K6973R999K4668J2663
9525B90423L345k4519j0987K3646K5373J735L760J172Q63n438M6208K4614q206
9512C71989j0590J3322M526J2294k4521j8548J5930M1706M944m900K5440K4784
9500D56376J1015j543j5705J9832j0841j4796K2841O0397L3675K8319N767J2337
9488F07674n663j5318J8785L4877J5096K9453J1706k393J3690M8712L7365M3210
$$ plain form
9576 118472 122885 127492 119154 130713 136477 107975 118336 121313 131874 140665 139879 139464 133547 128783
9562 128783 142462 161654 187018 160721 167916 183599 210723 222473 208246 214316 244115 250848
9550 250848 192044 166036 169095 181293 175834 190200 208572 245926 236704 207890 209570 223758
9538 223758 248084 214532 214348 232479 218738 235712 231794 212665 216120 243093 253092 277760 290423
9525 290423 293768 269249 258262 281908 307281 309016 312776 313948 314811 309373 355581 380195 371989
9512 371989 361399 374721 379247 391541 367020 348472 364402 406108 411052 406152 431592 456376
9500 456376 467391 465848 450143 469975 459134 444338 467179 527576 561251 589570 595337 607674
9488 607674 602011 586693 605478 640355 655451 684904 696610 694217 707907 756619 793984 837194
9476H37194N224O283J4772L7101L2010J1563J5423K7269K1116L8802P4660M2548
9464A163965J5326J0789L7666O2713O4970M8822P6482O4518M2544O4955P2259
9453A725009M8635N8505J12399J31241R9269J00865R8639R5691J10384J18639
9443B699276J17151J28174J68967J77781K06659K09139K17638K36437K57149K49676
9433D668047K68082L27234L36065L60235M05210M20142M65798M85680N20083N66767
9423H823343O35729O47285O82471O92185P14292P31716P30536O98468O09102N37138
9413A5502265M63128L87247K48270J08983K5172j23517k45741l84767m87410n21889
9403A4971741o01601o40560o53591o56167o33561o65536o52528o18260n75735
$$ plain form
9476 837194 842418 848701 863473 900574 932584 944147 959570 986839 1007955 1046757 1121417 1163965
9464 1163965 1179291 1190080 1227746 1290459 1355429 1404251 1480733 1545251 1587795 1652750 1725009
9453 1725009 1773644 1832149 1944548 2075789 2175058 2275923 2374562 2470253 2580637 2699276
9443 2699276 2816427 2944601 3113568 3291349 3498008 3707147 3924785 4161222 4418371 4668047
9433 4668047 4936129 5263363 5599428 5959663 6364873 6785015 7250813 7736493 8256576 8823343
9423 8823343 9459072 10106357 10788828 11481013 12195305 12927021 13657557 14356025 14965127 15502265
9413 15502265 15965393 16352640 16600910 16709893 16735065 16611548 16365807 15981040 15493630 14971741
9403 14971741 14370140 13729580 13075989 12419822 11786261 11120725 10468197 9849937 9274202
9394I274202n18322m88169m58664m42938m01837l69029l31424l05339l24143k84853
9384E349484k91066k78778k28287k19608j93652j70168j95592j71281j77402j51028
9374C272622j05938j01706j33213j26452j30513r5285q2263q8064r9793r1937
9364B217458p5391j00612r5254n8905p4815m1026l1077m8840m1781k9547n5029
9353A565181p1918n0408k8267l0986m9624o0190n6238j9585j3326k7593k7480
9342A129566m7647n0951l4275l3040r213n2052l998p355j7166j9160J687J0941
9330H67337j9161j4878j4191p431l1225J4761j4661j9792k4984k4734l8952j1087
9318F61002m5998M372j4688k5208j9502M369K034j6997k0110k0210q299L482l860
$$ plain form
9394 9274202 8755880 8267711 7809047 7366109 6964272 6595243 6263819 5958480 5634337 5349484
9384 5349484 5058418 4779640 4551353 4331745 4138093 3967925 3772333 3601052 3423650 3272622
9374 3272622 3166684 3064978 2931765 2805313 2674800 2579515 2497252 2409188 2309395 2217458
9364 2217458 2142067 2041455 1946201 1887296 1812481 1771455 1740378 1691538 1649757 1620210 1565181
9353 1565181 1493263 1442855 1414588 1383602 1333978 1273788 1217550 1197965 1184639 1157046 1129566
9342 1129566 1081919 1030968 996693 963653 954440 902388 898390 891035 873869 854709 856396 867337
9330 867337 848176 833298 819107 811676 780451 795212 780551 760759 735775 711041 672089 661002
9318 661002 615004 619376 604688 579480 559978 564347 566381 549384 529274 509064 500765 504247 500387
9305E00387K0798J2554l6819j1271j4121k6888n0205k1745L3308K9461k3584j1307
9293D00568L4765j9974p232J3035k1314J0249J0248J0463J6035j2781k4414j5098
9281C94550J0047R232M900K0377R485J8534J3647j0053J2849K8284Q2084J30149
9269G24085J77314K18670K17781J77836P8519J4257r1673k17858k93799k31219
9259G73913j49597q2835q5244o6503k6842p930J776j958l6622k6008l2720n227
9247B54203N535k5706K828j2249N797M2187L0803Q975P834k1058m0763M988K8910
9234B92284N911j0416K7810M8816J3507L3660M4374P4048J49187K35279L11869
9223A226329M54453N21689M04634J80122N0847r6712l91901n51879m61977l50689
$$ plain form
9305 500387 521185 533739 496920 485649 471528 444640 394435 372690 405998 435459 411875 400568
9293 400568 435333 415359 408127 421162 399848 410097 420345 430808 446843 434062 409648 394550
9281 394550 404597 413829 418729 439106 448591 467125 480772 470719 483568 511852 593936 724085
9269 724085 901399 1120069 1337850 1515686 1594205 1608462 1516789 1298931 1005132 773913
9259 773913 624316 541481 456237 389734 362892 354962 356738 354780 318158 292150 259430 254203
9247 254203 259738 234032 236860 224611 230408 272595 303398 312373 320207 299149 258386 263374 292284
9234 292284 298195 287779 315589 364405 377912 411572 455946 529994 679181 914460 1226329
9223 1226329 1680782 2202471 2607105 2787227 2838074 2741362 2349461 1797582 1335605 984916
9213I84916k27418j03910o3716o7610p5315m8043n131l0384m2021l5654l5508
9202B50206Q209K580j3427J6392o218l1260j0697j400l011K5516R654j7234j7057
9189B12253k4383j1564J3884K3112L4570L730J1924L8835N1249P9552J29006K22126
9177G84294K53910K19667J21856J6187m3184j50326k61787k36739j71494j15493
9167D16891o3162l8127m3916m3842j3966k0015j8524n311k643P298L1247Q25k2212
9154A84543j8316j9156Q562J5847q207n336k137j2519k3880N637J7797J8522l703
9141A57654q895J4036l115m1069r493L1937K7763P174J4689m978k2858q785K030
9128A56090L2807J3103J5697J4645O786J0766M429J404K8093J7457P256M315j8761
$$ plain form
9213 984916 757498 653588 589872 522262 446947 398904 393773 363389 321368 285714 250206
9202 250206 258415 260995 247568 263960 257742 226482 215785 214385 211374 236890 246544 229310 212253
9189 212253 187870 176306 190190 213302 247872 251602 263526 302361 353610 433162 562168 784294
9177 784294 1038204 1257871 1379727 1395914 1352730 1202404 940617 703878 532384 416891
9167 416891 353729 315602 271686 227844 213878 193863 175339 170028 167385 174683 205930 206755 184543
9154 184543 166227 147071 155633 171480 163273 157937 155800 143281 119401 125038 142835 161357 157654
9141 157654 148759 162795 159680 118611 109118 141055 168818 175992 190681 185703 162845 154060 156090
9128 156090 188897 202000 217697 232342 239128 249894 254323 255727 283820 301277 308533 312848 294087
9115B94087m423j5164m0168k2091l5566k9280j0298p035k4930O229J7617J6756
9103A45734N764Q714O907l33k35K67N23m518j3113m701J3709K4852K6251m888
9089B04933p456P934J7852q331p764R023r140K894P492K9778L0020N4686N7578
9076C89499N3465N4800N2749M4377L1375j7076j9404k6506n8771r1679q3599m5660
9064B83570k8630k3169j446p991J2159Q329J624N314P076L989m8883o4060m6115
9051A01767J6004P390k4282j0149O002M1399N1300K2428k3039k3843K0914k8002
9039A57889m1793M885j0414l6705L348L3593M9837K0422M2595M5509Q297L3559
9027C11022M2170J1527j2517l5672l9161P079l989j7290J4393N479k8650l6650
$$ plain form
9115 294087 289664 274500 234332 212241 176675 147395 137097 130062 105132 111361 128978 145734
9103 145734 151498 160212 167119 166786 166551 166818 167341 162823 149710 145009 158718 183570 209821 204933
9089 204933 197477 205411 223263 214932 207168 216191 207051 209945 217437 247215 277235 331921 389499
9076 389499 442964 497764 550513 594890 626265 609189 589785 563279 504508 412829 329230 283570
9064 283570 254940 231771 230325 222334 234493 242822 244446 249760 256836 260825 211942 147882 101767
9051 101767 117771 125161 100879 90730 96732 138131 189431 211859 188820 164977 185891 157889
9039 157889 116096 120981 110567 73862 77210 110803 160640 181062 223657 269166 277463 311022
9027 311022 353192 364719 352202 316530 277369 284448 280459 263169 277562 283041 254391 217741
9015B17741J0329j118k174P013L0517K4818k938l0092n1579l7076P847j9267k2220
9002A31801K1057K852m0228k1913M586j911j3520k5971l1831k5497K4960O4310
8990H8695L8503P0648Q2553O6231j6636o4121m3851l3407r441N807J7988N280
8978B08249j2401j6049P773L5017N6236N791P822j7463k1138J8659M1468J7240
8966C31204Q952K3345j0453l3763l2558k4887l7055k3611K2544L1094J5674K840
8954B73326M8834M8313j537j8287k1449k8323j0574M4134R6782R0827P6587J47185
8942G45818J51512j5488r2471n8658m8665j6311l557j9872k9153J087L1848L5212
8930F81302l898P738K0850J257q056j0173J2238k990J2632K2097K6609L1685N0141
$$ plain form
9015 217741 228070 226952 224778 231791 262308 287126 284188 254096 202517 165441 173288 154021 131801
9002 131801 152858 155710 115482 93569 98155 96244 82724 56753 24922 -575 24385 88695
8990 88695 127198 197846 280399 346630 329994 265873 222022 188615 179174 184981 202969 208249
8978 208249 195848 179799 187572 222589 278825 284616 292438 274975 253837 272496 313964 331204
8966 331204 340156 363501 353048 319285 286727 261840 224785 201174 223718 254812 270486 273326
8954 273326 322160 370473 368936 350649 329200 300877 290303 334437 431219 522046 598633 745818
8942 745818 897330 881842 789371 730713 682048 665737 662180 642308 613155 614242 646090 681302
8930 681302 677404 685142 705992 707249 699193 689020 701258 698268 710900 732997 759606 791291 841432
8917H41432L2727O0686M4245O1915L1745M5045Q4400O8027J4317L7431Q6245Q0736
8905A488951L4641L1725O9922J14072J41617J66111J20910J13665J40099J00582
8895B522295L4640N5658J22460J62943J98885K17669K56022L19905L44997L51336
8885D586810L95520M93496N74027P35534R56122J151663J368899J474730J722787
8876A3459588K188038K777774L732441N418177Q191903J2819126K0697987L2484664
8868A01769698M5284824M9559419L7330502J7036106L698446p545344l4472432
8861B12661219n5407679m7457880l1540861j9731002j2439470q098062n514607
8854C2471658l914844k853200k119869j638018j321380j066127r26035q72407
$$ plain form
8917 841432 874159 934845 979090 1041005 1072750 1117795 1202195 1270222 1284539 1321970 1408215 1488951
8905 1488951 1523592 1555317 1625239 1739311 1880928 2047039 2167949 2281614 2421713 2522295
8895 2522295 2556935 2612593 2735053 2897996 3096881 3314550 3570572 3890477 4235474 4586810
8885 4586810 4982330 5475826 6049853 6785387 7741509 8893172 10262071 11736801 13459588
8876 13459588 15647626 18425400 22157841 27576018 35767921 48587047 69285034 101769698
8868 101769698 147054522 196613941 233944443 250980549 254678995 247133651 212661219
8861 212661219 157253540 109795660 78254799 58523797 46084327 37986265 32471658
8854 32471658 28556814 25703614 23583745 21945727 20624347 19558220 18632185 17759778
8846A7759778q15382o73131m18942k07389j0709J43182L30069N11193P01331J005545
8836A8325545J409036J863271K227216K530551L010691L802803M817272O415859
8828D4402244R307145J4129870K2260553L6305746N8878327Q6426757J00955957
8821C72666599Q0779786L8458001J0131887n818546n6320983j11248311j00881052
8814B27767381o7804694m2352860k6594684j7252374j1679744q276840o048970
8807D7757215m526329l551362k985143k556339k245446k152424k229151k082726
8799B5428295j701983j343138j009192p57737n42868l66791k17922l9742J99299
8790A9648221L74161O04538Q00428J040114J440311J989812K749411M058139O266366
$$ plain form
8846 17759778 16944396 16271265 15852323 15644934 15634225 15777407 16107476 16618669 17320000 18325545
8836 18325545 19734581 21597852 23825068 26355619 29366310 33169113 37986385 44402244
8828 44402244 53709389 67839259 90099812 126405558 185283885 271710642 372666599
8821 372666599 453446385 491904386 502036273 496217727 439896744 328648433 227767381
8814 227767381 159962687 117609827 91015143 73762769 62083025 53806185 47757215
8807 47757215 43230886 39679524 36694381 34138042 31892596 29740172 27511021 25428295
8799 25428295 23726312 22383174 21373982 20616245 20073377 19706586 19488664 19448922 19648221
8790 19648221 20022382 20626920 21427348 22467462 23907773 25897585 28646996 32705135 38971501
8781C8971501R864949J5912313K5675656L8315808M7403292M2471704K3952564
8774B42567787P157742k302754k0862647m9133263n1990262l6956435k3377266
8767F5102902j4664860r459362o370108m558085l357008k534770j971237j623515
8759B0563957j445211j302632j250486j268806j216071j070209r26498p77736
8751A1306308o30160n24637m73829m55554m05354l80535l58987l39625k87569
8742G450058k72798k63908k53213k30430k18275j53297r2609j54865k18493k20989
8732E371181j95595j43121j48653j59870j74582j53094j34121j52003j23153j07060
8722C879929j06465m0955m3913q0635o4161p5082r3002j04765j26283j15783q3101
$$ plain form
8781 38971501 48836450 64748763 90424419 128740227 176143519 218615223 242567787
8774 242567787 249725529 247422775 226560128 177426865 125436603 88480168 65102902
8767 65102902 50438042 40978680 34608572 30050487 26693479 24158709 22187472 20563957
8759 20563957 19118746 17816114 16565628 15296822 14080751 13010542 12084044 11306308
8751 11306308 10676148 10151511 9677682 9222128 8816774 8436239 8077252 7737627 7450058
8742 7450058 7177260 6913352 6660139 6429709 6211434 6058137 5965528 5810663 5592170 5371181
8732 5371181 5175586 5032465 4883812 4723942 4549360 4396266 4262145 4110142 3986989 3879929
8722 3879929 3773464 3732509 3688596 3607961 3543800 3468718 3375716 3270951 3144668 3028885 2945784
8711B945784q6582n6344m6748l2841n4413o0638n4948p7260o7063n7171k5522
8700B326254K338m0349k0707R860J0753M7964K7113K8732M1987M6931m4495k11107
8688B225274j68116j32269j29013q8208m7692l0748o9335m3298j4147k2695m3202
8677A436551n1935o3840n2398l2678j8032j3930j1040j1961k1290m1921j9544
8666A097982l6785l019l511M703J2349K542k5035K2508J2572r561j8120j4390
8654A042235l352K0999K3723J6905M159K0644O672M7776O2939k1586q1954q0647
8642A058513l4657o1345p1259k7826l4825r074j9509k0680l5040m7525k1994n8075
8630F16704p8484n5164j4215k4506J0937K4146j7114m552p247J4050P443Q235
$$ plain form
8711 2945784 2859202 2802858 2756110 2723269 2668856 2608218 2553270 2476010 2408947 2351776 2326254
8700 2326254 2328592 2288243 2267536 2277396 2288149 2336113 2363226 2391958 2433945 2480876 2436381 2225274
8688 2225274 2057158 1924889 1795876 1707668 1659976 1629228 1559893 1516595 1502448 1479753 1436551
8677 1436551 1384616 1320776 1268378 1235700 1217668 1203738 1192698 1180737 1159447 1117526 1097982
8666 1097982 1061197 1058178 1054667 1059370 1071719 1074261 1049226 1071734 1084306 1074745 1056625 1042235
8654 1042235 1038883 1059882 1083605 1100510 1104669 1125313 1131985 1179761 1242700 1221114 1139160 1058513
8642 1058513 1023856 962511 891252 863426 828601 819527 800018 779338 744298 696773 674779 616704
8630 616704 538220 483056 468841 444335 455272 479418 462304 457752 450505 464555 471998 480233
8618D80233J747N359Q3o951L0669L4428J9564L1643l871j9658m462n968j573j8052
8604E43191k6357m5935n137J2591k1154k2532j9023k4246j9219r892J5154q893
8592C68548J5766K9431K4317j732Q158J9739K1164K0493O554k0907l2585m1705
8580D17241k1309l0651N490q880j4793J2544J4979R679N854O295k3721L2550O8953
8567D74231N2686J5113Q15L422k7929n8667k9871m5976l7249k9858j7364j7442
8555B81911k9107J2786J1217l1953j9349p19K735L9928L1360K0355J3938M5851
8543C78953O8669O2864P1773K1820J5695L5059q222q1556q5894l2447n1080o1064
8531C34570k1490j6117k6293o494J1945k1451n297K4581L3862N559J7138k1091
$$ plain form
8618 480233 481980 487339 487422 480471 511140 545568 565132 596775 592904 573246 568784 562816 561243 543191
8604 543191 516834 470899 465762 478353 457199 434667 415644 391398 372179 362287 377441 368548
8592 368548 384314 413745 438062 436330 444488 464227 485391 505884 512438 491531 458946 417241
8580 417241 395932 365281 370771 361891 347098 359642 374621 384300 390154 396449 372728 405278 474231
8567 474231 526917 542030 542845 546267 518338 459671 429800 383824 346575 316717 299353 281911
8555 281911 252804 265590 276807 244854 225505 224786 227521 267449 298809 319164 333102 378953
8543 378953 447622 510486 582259 604079 619774 654833 646611 565055 479161 446714 395634 334570
8531 334570 313080 296963 270670 264176 276121 254670 249373 273954 307816 313375 330513 309422
8519C09422O295j434m4119l2675l3935k4901J291k457O072l977Q865o3J2290L443
8505B04117r610j8318K1692L11j1164K1553N8267L1995K9328K1353M464K0338
8493C74326J9771j6891o0013n2566r083k3234r050p951j667O820j471j9542J204
8480B00653J5112m695l9162M509R425L1825j1350K470J6698M434n892J8736J6549
8467B59312J4143O5043R8724J31638J81160K14724K84231K00924P9869Q925n2641
8456A486052j82380k84192k78913j70798q4168j07043m9132j9826j4062K50l3246
8445B62542r416r035q087J6544K7467J799J9066O789q63m872k4451k0179k2878
8432B34426q399j7755K167N061Q695K9717K7681M0987L8745K4260L3085P3351
$$ plain form
8519 309422 315717 314283 270164 237489 203554 178653 179944 177487 183559 179582 188447 188384 200674 204117
8505 204117 194507 176189 197881 198192 187028 208581 266848 298843 328171 349524 353988 374326
8493 374326 394097 377206 317193 264627 255544 232310 223260 215309 213642 220462 218991 199449 200653
8480 200653 215765 211070 171908 176417 185842 217667 206317 208787 225485 229919 224027 242763 259312
8467 259312 273455 338498 437222 568860 750020 964744 1248975 1449899 1529768 1538693 1486052
8456 1486052 1303672 1019480 740567 569769 485601 378558 329426 309600 295538 295788 262542
8445 262542 253126 244091 236004 252548 280015 281814 300880 307669 306806 301934 277483 257304 234426
8432 234426 226027 208272 210439 215500 224195 253912 281593 322580 361325 385585 418670 492021
8420D92021J17853K30820L48046M31738N24613M21092K18776N1741p0318l39541
8410B426841o01540n12916l19884k20496j55813j00232r2987n0967l100m2691
8400C26215k8313j6917K228K0323l8808k7898l503Q996J7785K425j2193K0931
8388B71271J4745j8651k0175j2214j7865L744l878P395L012J6145O898K9521K6408
8375C06356L9741J10830J58837K14199K49057K08799R0192J4242j7702j28606
8365A245945k81467k74441j89881q6695p2134q4835n6930q589n054J62j757q122
8353A76202k9818o207K3066j6928J6278K4461n247k5148Q958P795R122o353m4558
8340A31623l6189r61k6464j5831K5048L8318j4139k6558J565p745l293K0025L246
$$ plain form
8420 492021 609874 840694 1188740 1620478 2145091 2566183 2784959 2836700 2766382 2426841
8410 2426841 1825301 1312385 992501 772005 616192 515960 422973 372006 368906 326215
8400 326215 297902 280985 283213 303536 264728 236830 233327 242323 260108 262533 250340 271271
8388 271271 286016 267365 247190 234976 217111 220855 216977 224372 227384 243529 250427 279948 306356
8375 306356 346097 456927 615764 829963 1079020 1287819 1378011 1392253 1374551 1245945
8365 1245945 964478 690037 500156 413461 341327 256492 199562 190973 185919 186081 184324 176202
8353 176202 146384 140177 163243 146315 162593 187054 181807 156659 165617 173412 182534 176181 131623
8340 131623 95434 94473 68009 52178 77226 115544 101405 74847 76412 68667 65374 85399 88645
8327H8645L0725Q115l5998l9528k9433j2633J2501K1343L2763K773r533K1186
8315I0926n319k647N926J0600J6316R928l11j0699k2591j1789K2066K1893K008
8302A26307l994n475k9474j4812J5046p815j8810j3940K3966J1173r429J6299
8290H9042P635r828N466j2659P502J9314K3588l1091j4115M259j7131J9903O563
8277I8448R639K1628j0696k9891k2363Q702J9139n218Q808k302J0343P515Q725
8264A22477k9462j2254O930P235P368j3341k6504k5885p808p756J4730J9553K0134
8251G5417j2678k2211O287J6558j3296P069J2042J0257n272r010k3287j155l865
8238C6856J8062K1336k263j2351K453K582L935R806K978K969l160J3867K6362
$$ plain form
8327 88645 119370 127485 91487 51959 22526 9893 22394 43737 76500 79273 69740 90926
8315 90926 85607 82960 88886 99486 115802 125730 125419 114720 92129 80340 102406 124299 126307
8302 126307 122313 116838 87364 72552 87598 79783 60973 47033 70999 82172 72743 89042
8290 89042 96677 86849 92315 79656 87158 106472 130060 98969 84854 89113 71982 91885 98448
8277 98448 108087 129715 119019 89128 66765 75467 94606 89388 98196 95894 106237 113752 122477
8264 122477 93015 80761 87691 94926 102294 88953 62449 36564 28756 21000 35730 55283 75417
8251 75417 62739 40528 46815 63373 50077 57146 69188 79445 74173 65163 41876 40721 36856
8238 36856 54918 76254 73991 61640 64093 66675 70610 80416 83394 86363 83203 97070 123432
8225A23432O197j3899j6200k0954K68j1205J491j3035J909K300j6647k1972m513
8212A7172n611r031J5258j7612j1257K302J2275L4360J4083j6391j6020l968K3254
8199C8814j1902j9514J1131J4310J212j6560r457R202J7804J2730J4360J5111
8187G7241k909k1412l4127J852L630L2358J4055j0342N52L755N962R278k2139
8174E7754l7606Q48J8257K6468q999J4798J8222N083J7073k1865k0471L643r409
8161F3796q590J8877k199l0440k6743n661K481K9486M263r717l417j0529j342
8148B0265J5299p60m961m041J3416p287J0771O867j7875J6247R126Q01R330j6888
8134E0310l4971m169m94J1969m614p919L9801J4910j1040L771j1709n123R300
$$ plain form
8225 123432 129629 115730 99530 78576 78844 67639 69130 56095 58004 60304 43657 21685 17172
8212 17172 11561 2530 17788 176 -11081 -8779 3496 37856 51939 35548 19528 15560 38814
8199 38814 26912 7398 18529 32839 34051 17491 8034 17236 35040 47770 62130 77241
8187 77241 74332 52920 18793 20645 24275 56633 70688 60346 60898 64653 70615 79893 57754
8174 57754 20148 20996 39253 65721 56722 71520 89742 94825 111898 90033 69562 73205 63796
8161 63796 55206 74083 71884 41444 14701 9040 11521 41007 45270 35553 32136 21607 20265
8148 20265 35564 34804 29843 25802 39218 31931 42702 49569 31694 47941 57067 57868 67198 50310
8134 50310 15339 11170 10676 22645 18031 10112 49913 64823 53783 57554 45845 40722 50022
8121E0022N663j4154N906j2155O145j2018j7386M918j3607K6184o706J9334L7079
8108G9225o960j652k0368k0732q737n381Q943K0039K9584k2763J583q772j4309
8095B9700k5010r238K4314P655J7278p872P915n214m092J3062J733j0075j3946
8082B6210p41k3115l658L872m2490N293K2843L3244L000L341J0863L940Q448L0679
8068H1729M068k6991r936j5691J0559K8939O105n877j3149j5146j7484k8572K4513
8055B3067L463k2533J398J7169K8611j3597k1776J1510K8686N043j6882k5577
8043A8582m584l721L5132K7973M755R358L627j6425k3208R366o474m57J082l802
8029E1204o644R804M528Q064N053L2814Q279l6276l849J4716O919l462o836L6998
$$ plain form
8121 50022 55685 41531 47437 35282 41427 29409 12023 16941 3334 29518 22812 42146 79225
8108 79225 72265 70613 50245 29513 20776 15395 24338 44377 73961 51198 52781 44009 29700
8095 29700 4690 -4548 19766 27421 44699 36827 44742 39528 35436 48498 50231 40156 26210
8082 26210 25469 2354 -1304 2568 -39922 -34629 -11786 21458 24458 27799 38662 42602 51050 81729
8068 81729 85797 58806 48870 33179 43738 72677 78782 72905 59756 44610 27126 -1446 23067
8055 23067 26530 3997 5395 22564 51175 37578 15802 27312 55998 61041 44159 18582
8043 18582 13998 10277 45409 73382 78137 87495 91122 74697 51489 60855 54381 53924 55006 51204
8029 51204 44560 54364 58892 66956 72009 104823 113102 76826 72977 87693 94612 91150 84314 121312
8015A21312l2189J6570N52p833m8393j8004J1988L33J8619O001j7183q625j771
8002D1377K3410J3954J6063j0802j2070k0709J2796R353k1912k0607K3025p6j2048
7989D1754J9024K9289O831l1330K097P358J7333k860k1791k325L8201O177k7051
7976H2707k6939m046K2625J191J4744M152r499K496J2386J4048R424m8164j7267
7963E7858K2899O849K170j8038K932j4158K017K0443m615n895K679p300j2344
7950E5497k3471J1502J7144l289j5056J1217M073J1413k754q213P184k6411j076
7937C7760J5186j3513r851P232K6921K9381q579j2706j7770o561M853P882O334
7924F6569O169p000j115K1402K620k8576j4929R736j045O938J0628J4324n804
$$ plain form
8015 121312 89123 105693 106245 98412 50019 32015 44003 44336 62955 68956 51773 43148 41377
8002 41377 64787 78741 94804 84002 71932 51223 64019 73372 51460 30853 53878 53802 41754
7989 41754 60778 90067 96898 65568 67665 75023 92356 89496 67705 65380 103581 109758 82707
7976 82707 55768 51722 74347 75538 90282 94434 84935 87431 99817 113865 123289 75125 57858
7963 57858 80757 87606 89776 71738 74670 60512 62529 82972 78357 72462 75141 67841 55497
7950 55497 32026 43528 60672 57383 42327 53544 57617 69030 66276 58063 65247 38836 37760
7937 37760 52946 39433 29582 36814 63735 93116 84537 71831 54061 47500 52353 60235 66569
7924 66569 72738 65738 64623 86025 88645 60069 45140 54876 53831 60769 71397 85721 79917
7911G9917m877q08N570m136O159j4732k3684k360o34J3859J9094J3173M483k5139
7897F5885L597J7724j0443k1305Q39o858n760Q499K0613J6022k5586j9979R968
7884E3216J7896J3438K7144l494j7186j1108K6083K7641r207l0205q664K5660
7872A11214l511l9926R22J8903J3216N298l2576k5609J9070J1805Q711j097p91
7859H5629O218l1104M16K854k3205J1890R014p51k3599m633j2083n89K502k664
7845A9895L601J4101J8763k1282l8743J4639K4857J7363J0507j5395r992j2125
7833B6189j3829m887J5851j5858J04j5229J4676J598k888J9105L4273J8550j5170
7820F2485n518P015j8209m2119P129K8939Q687P028k2923K9024P615l4147q719
$$ plain form
7911 79917 75040 74232 79802 75666 81825 67093 43409 41049 40415 54274 73368 86541 91024 65885
7897 65885 69482 87206 76763 55458 56297 49439 43679 52178 72791 88813 63227 43248 53216
7884 53216 71112 84550 111694 108200 91014 79906 105989 133630 124423 94218 85554 111214
7872 111214 107703 67777 68699 87602 100818 106116 73540 47931 67001 78806 87517 86420 85629
7859 85629 91847 60743 61159 64013 40808 52698 61712 60961 37362 32729 20646 20057 22559 19895
7845 19895 23496 37597 56360 35078 -3665 10974 35831 53194 63701 48306 38314 26189
7833 26189 12360 7473 23324 7466 7570 -7659 7017 8615 5727 24832 59105 77655 62485
7820 62485 56967 63982 45773 3654 10783 39722 48409 55437 32514 61538 69153 35006 26287
7807B6287p247k953J0308p687n074N091Q984j2176k328M0353Q289l6301j2568
7794A2978k4038N355J1319J8030J4364O644L199N92P633k3855J1986j1192L464
7781C6479l0650j4961k482J4819J0901J3467P387P693n742l4482k1137K2031L4720
7768C8043K6741L41o720k7250n773J0505j0099k7441J868K4877J7055j7457j8955
7755E735k601j6216r079N0376M1903Q854Q761j120j3993k8091n8524R58M6166
7742C3129J2623M20k0103Q815J556k5946r274m292J089r471j465M089P796n591
7728f625J7666o386j0287K7143k656q834J8009n539o282R875N619j9503J2690
7715B4890K4253q861m372k1442j237J4298j6701l966K6893M428l6927O89M989
$$ plain form
7807 26287 19040 16087 26395 18708 13634 18725 27709 15533 13205 53558 61847 25546 12978
7794 12978 -11060 -5705 5614 23644 38008 44652 47851 48443 56076 32221 44207 33015 36479
7781 36479 5829 -9132 -11614 3205 14106 27573 34960 42653 36911 2429 -18708 3323 38043
7768 38043 64784 65125 58405 31155 25382 35887 25788 -1653 215 25092 42147 24690 5735
7755 5735 3134 -13082 -22161 28215 70118 78972 87733 86613 72620 44529 -13995 -13037 33129
7742 33129 45752 46172 26069 34884 36440 10494 1220 -3072 -1983 -11454 -12919 -8830 -1034 -6625
7728 -6625 11041 4655 -5632 21511 18855 10021 28030 22491 16209 26084 31703 12200 24890
7715 24890 49143 40282 35910 14468 13231 27529 10828 6862 33755 38183 1256 1945 6934
7702F934K9105q881k4815K082j1824Q093L072L041L864J1415p493J4461n317k979
7688B0758J2462J2782K7162j6724k5957l1333j5177k6577J8227M8040J00K182
7676B5945o86N689J5135j6367n044J149L822k0197J0487L0270k4047m0776l652
7663a8272K3448k0143p412j324k2704M549L950K6545K4937J8829M300q174r618
7650A8911j7014L604K5759k451j1651K825J2372N205j6324M114L455L3580n369
7637E7016j8379j5697K5434L0944j9238k5530j0433m788M827k680J2458j484Q230
7624D0680j5821j6305j9174L767k2067k2059K0001K2288j9864M972K198L4530
7612A3146M89k8136J4325K5023j6443m11J262o942J7307m882n639L368m099k5311
$$ plain form
7702 6934 36039 27158 2343 4425 -7399 694 3766 6807 10671 22086 14593 29054 23737 20758
7688 20758 33220 46002 73164 56440 30483 -850 -16027 -42604 -24377 23663 23763 25945
7676 25945 25259 30948 46083 29716 24672 25821 29643 9446 19933 50203 26156 -14620 -18272
7663 -18272 5176 -14967 -22379 -23703 -46407 -41858 -37908 -11363 13574 32403 36703 28529 18911
7650 18911 1897 5501 31260 28809 17158 19983 32355 37560 21236 25350 28805 62385 57016
7637 57016 38637 22940 48374 79318 60080 34550 24117 19329 24156 21476 33934 32450 40680
7624 40680 24859 8554 -10620 -6853 -28920 -50979 -30978 -8690 -28554 -23582 -21384 13146
7612 13146 13635 -14501 -176 24847 8404 7993 9255 2313 19620 14738 9099 12467 8368 -16943
7598a6943r122k6487R846L0828K6209Q04k2950r398j4123J111L4460J7646j0932
7585A0949j6176k7430o39j1053J429J0114R535P496K0719P519J404M22o696K9432
7571C7025J1960n139q234j3777j3638J6065P508n414m68j4245j0891J8581M4007
7558F3340j275r743k616k985j0473K548j1348j5649J2218o587J2533J7274p718
7545C9519L214l358k4328m1329j7666O841M2351J9952p052J1082L2206J2186l9476
7532C4142l1802j560O316Q275J138k1755j6509J8395J0148m962k111J1667M570
7519A5952o922j8591K045J3917J9996K538J8385p728q887r850j2209j1941n73
7506c868K3854k3260j575O12J6512R99p335K4776P369j5069j1481n61J6518L778
$$ plain form
7598 -16943 -26065 -52552 -42706 -11878 14331 15135 -7815 -17213 -31336 -30225 4235 21881 10949
7585 10949 -5227 -32657 -33296 -44349 -42920 -32806 -23271 -15775 4944 12463 13867 14289 7593 37025
7571 37025 48985 43846 35612 21835 8197 24262 31770 26356 25888 11643 752 19333 63340
7558 63340 62065 52322 49706 46721 36248 38796 27448 11799 24017 17430 29963 47237 39519
7545 39519 42733 39375 15047 -26282 -43948 -37107 5244 25196 18144 29226 61432 73618 34142
7532 34142 2340 780 7096 15371 16509 -5246 -21755 -3360 6788 1826 -285 11382 15952
7519 15952 9030 -9561 -7516 6401 26397 28935 47320 39592 30705 20855 8646 -3295 -3868
7506 -3868 19986 -3274 -4849 -4237 12275 13274 5939 30715 38084 23015 11534 10973 27491 31269
7492C1269M114o811J5476k750j359k0703k1325J8069L1091O430J0149N772j3970
7479E5452o224n397j0851j8286J344Q26j8587J4866K9395j1253n028J3579j3093
7466B6743K444j9594k9241q304K2197M1234o008j4433J9231J6508r139j5382m651
7453B1605l802k3677r21K5232o717r038k8984j1589j822P478L1963K0324k8329
7440h277K063L3477J6397k7809j4113J295J0460L082K084J6951j1525j9468N255
7427I872M2518j858l0787j6845M43J6035q57K4527j0954k0722Q284K0502k3095
7414A7063k2184q582K954m408Q158r797j1598n267N142L286J7186K4487j279n236
7400I925O961J8303r751j1016J2772O229j0721m0866k3628J296K2462L1685M5016
$$ plain form
7492 31269 35383 28572 44048 41298 39939 19236 -2089 15980 47071 53501 63650 69422 55452
7479 55452 49228 43831 32980 14694 16038 16864 -1723 13143 42538 31285 26257 39836 26743
7466 26743 29187 9593 -19648 -27952 -5755 35479 29471 15038 34269 50777 41638 26256 21605
7453 21605 17803 -5874 -6795 18437 11720 2682 -26302 -37891 -39713 -32235 -272 20052 -8277
7440 -8277 -6214 27263 43660 15851 1738 3033 13493 16575 18659 35610 24085 4617 9872
7427 9872 52390 50532 19745 2900 3343 19378 18521 43048 32094 11372 19656 40158 17063
7414 17063 -5121 -13703 -10749 -15157 -6999 -16796 -28394 -33661 -28519 -25233 -8047 16440 15161 9925
7400 9925 16886 35189 25438 14422 27194 33423 22702 -18164 -41792 -40496 -18034 13651 58667
7387E8667J1218m2659j3774J259O117m190M464O315j5442J0189p29q283K465j77
7373A5440j0589l7096k477R117J0911p211o554K2190Q741R39N102K1633J594j7657
7359A4083m116J8759N766K040j4386r264J1927L11K989p112o379j487k3034k666
7345a2569L7250K3357J0902r810k39J553j6871k7797Q363K5095K0684Q378l3863
7332C4433J8070L2991k2392l2699k8020n965J3225q515k1325k6794Q784M4791
7320F584K6505k2905p471J9620J6766j995j9563O188k2557j0832J3753j9603k394
7307a7904m604J6287K2127q919q97L604N467J6984M911j442j2418k5012O187k045
7293B326L6791q249m5883j0132R270p062j7910j3252Q000J0405m606l514K2514
$$ plain form
7387 58667 69885 27226 13452 14711 20828 16638 21102 27417 11975 22164 21435 13152 15617 15440
7373 15440 4851 -32245 -34722 -25605 -14694 -21905 -28459 -6269 2472 3411 8513 30146 31740 14083
7359 14083 9967 28726 34492 36532 22146 12882 24809 25120 28109 20997 14618 13131 -9903 -12569
7345 -12569 24681 48038 58940 49130 48891 50444 33573 5776 14139 39234 59918 68296 34433
7332 34433 52503 85494 63102 30403 2383 -3582 9643 1128 -20197 -46991 -38207 6584
7320 6584 33089 10184 2713 22333 39099 37104 17541 23729 1172 -9660 4093 -15510 -17904
7307 -17904 -22508 -6221 15906 6987 6090 9694 15161 32145 37056 35614 23196 -1816 4371 2326
7293 2326 39117 30868 -15015 -25147 -15877 -22939 -40849 -54101 -46101 -35696 -40302 -43816 -21302
7280b1302K2151l543k6009r902P768K464L4317j1492l2144J5739K0197k998K4666
7267A9912m139l2860k7058J015O540J0973J5591P813L634J23j0089k7468J765
7254c4248J0257r384K5314M3913R08m1273k2214J5315R226j0854j4356q375p005
7241d2776J8547L5580M2898m638j1410K242j0377PJ928K436K1589j2109l6832
7228G085j035j9819Q487M525J1429k5677O453p811J6440K0037J8245R51P853k4346
7214B2817p860q696j580J6230r528O974J2311j5078j1213J5044M099q759J0864
7201B5625k383o881J0748M755q966n418m204k3237m599j7976j6701J7875O369
7188b4993o345k90L9188L4909k7636l1301J0183Q733J2989J2542L658M978j48
$$ plain form
7280 -21302 849 -2694 -28703 -38605 -30837 -28373 5944 -5548 -37692 -21953 -1756 -4754 19912
7267 19912 15773 -17087 -44145 -43130 -36590 -25617 -10026 -2213 1421 1544 -8545 -36013 -34248
7254 -34248 -23991 -33375 -8061 35852 36760 -4513 -26727 -11412 -2186 -13040 -27396 -35771 -42776
7241 -42776 -24229 11351 54249 49611 38201 40443 30066 30073 32001 34437 56026 43917 7085
7228 7085 6050 -13769 -5282 -757 10672 -15005 -8552 -16363 77 20114 38359 39310 47163 22817
7214 22817 14957 6261 4681 20911 11383 18357 30668 15590 4377 19421 23520 14761 25625
7201 25625 23242 16361 27109 31864 22898 17480 13276 -9961 -14560 -32536 -49237 -31362 -24993
7188 -24993 -31338 -31628 7560 42469 14833 -16468 -6285 2448 15437 27979 31637 36615 36467
7175C6467j6941R68J0702l2353k6832M762o792j073N253R157j0998l738L4071
7162B653K7407j0932k3741m085k1767K149J2952P497J973K3356K74m428o630p958
7148a280p327j5099r849j3097J2193K5004J30M992K2266J1954N408r052k674o805
7134A6764j7323o029n054K4489L0496J1177j2564j656n051q734k7588j9677L786
7121a6964L9530K4629j2261K32j7324j8794l1274O560p485J2570n582J9020p140
7108a4283j4417J7916J2402K928j7906J74L7260J9455K578l4400j4753k5562J5890
7095a2718K3522j2730o401J2309k0341o811J5818K1677K8111P677k6675j1493
7083A1945j216R151p245N550j9625j0152n776k998j3231j919M172m708M501q473
$$ plain form
7175 36467 19526 20494 31196 -1157 -27989 -23227 -30019 -31092 -25839 -16682 -27680 -31418 2653
7162 2653 30060 19128 -4613 -8698 -30465 -28316 -15364 -7867 -5894 17462 17736 13308 6678 -1280
7148 -1280 -8607 -23706 -33555 -46652 -34459 -9455 -9325 -4333 17933 29887 35295 26243 23569 16764
7134 16764 -559 -6588 -11642 12847 43343 54520 41956 40300 35249 26515 -1073 -20750 -16964
7121 -16964 22566 47195 34934 35166 17842 -952 -32226 -25666 -33151 -20581 -26163 -7143 -14283
7108 -14283 -28700 -10784 1618 4546 -13360 -13186 24074 43529 46107 11707 -3046 -28608 -12718
7095 -12718 10804 -1926 -8327 3982 -16359 -23170 -7352 14325 42436 50113 23438 11945
7083 11945 10729 19880 12635 18185 -1440 -11592 -17368 -20366 -33597 -35516 -31344 -36052 -31551 -40024
7069d0024o620J7869Q488J418M474J8450j3910R850j1478k9906Q457L1063J7857
7056A5988J2714o792M132J9564j8559k3243p152L2118L5548k7644m5245q15O184
7043c202k1485K287l204N628J3194J9152P299J0059J9967n259k5553Q316k1136
7030F063q859N596J0591q87J0145j256l4762l3323J9816M7778L697j516j0233
7017A2850j606k6210n132J002n219J2903K7901J874l1479l0456K606M1746L0411
7004C1191P560m9029p061j2884l214N687R009K437J4113k4031q918p155R106K6290
6990f899O084j6055M682Q788K2410l61l089L52O64P40J6914m67J7229j649p723
6975D1620k1702j6378J7171j7996j7397K2929M374k0826l1083L564M981p91J0186
$$ plain form
7069 -40024 -46644 -28775 -20287 -18869 -14395 4055 -9855 -5 -11483 -41389 -32932 -1869 15988
7056 15988 28702 21910 26042 45606 27047 3804 -3348 28770 64318 36674 -8571 -9386 -3202
7043 -3202 -24687 -22400 -25604 -19976 -6782 12370 19669 29728 49695 44436 18883 27199 6063
7030 6063 -2796 2800 13391 12504 22649 21393 -13369 -46692 -26876 20902 24599 23083 12850
7017 12850 11244 -14966 -20098 -19096 -24315 -11412 16489 18363 -13116 -43572 -40966 780 31191
7004 31191 38751 -10278 -17339 -30223 -33437 -27750 -18741 -16304 -2191 -26222 -35140 -42295 -33189 -6899
6990 -6899 -815 -16870 -12188 -3400 19010 18649 15560 15912 16576 17316 34230 33763 50992 49343 41620
6975 41620 19918 3540 20711 2715 -14682 8247 12621 -8205 -39288 -35724 -30743 -31534 -21348
6962b1348L417Q521J4965k533P614j5491j5466p021K448L3438r754r191o716L75
6948a6742M868k0413K0719J7140N612N688O78j4491j264K9140p803R371k4885
6935G618k8363k801K7123K0100J1392j9254n400J3557N794o368k1599q232N463
6922i70R099J2714Q62j7335P097K4515j3248q975j2522M190k9785k5307Q918K7854
6908a2893J0839M555J4690j1030j4226Q747n716j7091l803J1767J5379j790j9459
6895b0031K9643k496K486q049j7444Q214j6455n143R02J3747m228K4246J919j6042
6881h731j2423n072Q02J212K5008P031J2984L2967o50j4237j5279p793j8980K993
6867a68K1688j7919K2762K6916j4134J001k056j7130K8492K3378O000m031k7414
$$ plain form
6962 -21348 -17931 -9410 5555 3022 10636 -4855 -20321 -27342 -24894 8544 -1210 -10401 -17117 -16742
6948 -16742 -11874 -32287 -11568 5572 11184 16872 17550 3059 1795 30935 23132 32503 7618
6935 7618 -20745 -23546 3577 23677 35069 15815 10415 23972 29766 23398 1799 -6433 -970
6922 -970 8129 20843 21705 4370 11467 35982 22734 13759 1237 5427 -24358 -49665 -40747 -12893
6908 -12893 -2054 2501 17191 6161 -8065 682 -5034 -22125 -25928 -14161 1218 -572 -20031
6895 -20031 9612 7116 9602 1553 -15891 -7677 -24132 -29275 -28373 -14626 -18854 5392 7311 -8731
6881 -8731 -21154 -26226 -25424 -24212 796 7827 20811 53778 53128 38891 23612 15819 -3161 -168
6867 -168 21520 3601 26363 53279 39145 40146 38090 20960 49452 72830 78830 74799 47385
6854D7385m1805j7905J0029k0948k1038J6075K5616K1091j080j2308r80j3549
6842i417J418j6731O115K6062k5948m462J4686r975J4256L0516n277O498J2946
6829D0687R326j0631N75j8012k902m251L101K0908L246o203Q845P550M056l102
6815E3193k6508j1256N517K467j2615j8482L1562L40j5025j3843N540n774l40
6802e224P170r405K7789J0319j3615N234j6375j2935J0744M0897q052l1282q75
6789D390O272r309j7871j0142j4804K3945K7385J8807j1151n377l626K4996m766
6776B8749l2304l3482j0270K2857M1048Q698q860Q726O472j9800r656j1870l234
6763a2926J6933J6997p944j3475p544k1633k901L694j0362k37J053p287J8538
$$ plain form
6854 47385 5580 -12325 -2296 -23244 -44282 -28207 -2591 18500 17420 5112 4132 -9417
6842 -9417 -7999 -24730 -18615 7447 -18501 -22963 -8277 -18252 -3996 26520 21243 27741 40687
6829 40687 50013 39382 39957 21945 19043 14792 17893 38801 42047 35844 44689 52239 56295 53193
6815 53193 26685 15429 20946 23413 10798 -7684 23878 24218 9193 -4650 890 -4884 -5224
6802 -5224 1946 -7459 20330 30649 17034 22268 5893 -7042 3702 44599 36547 5265 4390
6789 4390 10662 1353 -16518 -26660 -41464 -17519 9866 28673 17522 12145 8519 33515 28749
6776 28749 -3555 -37037 -47307 -24450 16598 25296 16436 25162 31634 11834 2178 -9692 -12926
6763 -12926 4007 21004 13060 -415 -7959 -29592 -32493 -28799 -39161 -39398 -38345 -45632 -27094
6750b7094q426j1246k4672Q781K5124L8782J1878J947o599k0851j63j4569P33
6737b6375J8797N835J00o280J183L665K2319Q225j3246J1630J7867K656J3416
6724E9792j4945j9959j4234m596J3215O923L39k4130q227j717j5267N90J9832
6711b384j1046M042Q953J439L9333K9301k7433m1884j8479Q451M920N760K1003
6698B1976K4143N534l0218j8393j1357R282M1196J4149q599j4847k1639K722J7094
6685C1043o231k8685r344L660N618K0994J4677O571k1994j6206m0031j4691p045
6672f1664k415K6983K524J0378J0568j6888n852J8681m681J2462N615J420j1432
6659a4301k1626M581J9138J1594K0553m872j2777P794J8325j2704j7572Q639j2785
$$ plain form
6750 -27094 -35520 -46766 -71438 -62657 -37533 1249 13127 15074 8475 -12376 -12539 -27108 -26375
6737 -26375 -7578 -1743 -1643 -7923 -6740 -3075 19244 27469 14223 25853 43720 46376 59792
6724 59792 44847 24888 10654 6058 19273 26196 26535 2405 -5822 -7539 -22806 -22216 -2384
6711 -2384 -13430 -9388 -435 1004 40337 69638 42205 321 -18158 -9707 -4787 973 21976
6698 21976 46119 51653 21435 3042 -8315 967 42163 56312 47713 32866 11227 13949 31043
6685 31043 24812 -3873 -13217 -9557 -3939 17055 31732 38303 16309 103 -39928 -54619 -61664
6672 -61664 -64079 -37096 -34572 -24194 -13626 -30514 -36366 -17685 -22366 -9904 -4289 -2869 -14301
6659 -14301 -35927 -31346 -12208 -614 19939 15067 2290 10084 28409 15705 -1867 6772 -6013
6646f013p079N676J8188J0625q841l2086j9005L3051K2095j432l8348k353L095
6633b2427J2800j7828r941L7429J9249j1262j3354j931J93L147j6685k539l191
6620b6340R166j1024K6995k2373j2933j615K4985J6283n016K141j4867J5519K449
6607C370J3482J957P201m8456p258J9865L254k3560K5702J6790J4356j8108k4196
6594a5601K815o062j3590J1223J766O416k1162L730J9773K720k8023N285J0889
6581a9821N2247j1950J9749L3928n059k8437q669K363j2458l6993k435O943J1872
6568A280j5962P448n397j0527J1332L2193r962l3970J8369l390j0324j5803J1156
6555b3557k517J1017L2663k087j1072k7143J901M642j9149j2476r162J7724K6430
$$ plain form
6646 -6013 -13092 -7416 10772 21397 12556 -19530 -38535 -5484 16611 15179 -23169 -25522 -22427
6633 -22427 -9627 -27455 -37396 33 19282 8020 -5334 -7265 -7072 -3925 -20610 -23149 -26340
6620 -26340 -17174 -28198 -1203 -23576 -36509 -38124 -13139 3144 -1872 269 -14598 921 3370
6607 3370 16852 18809 26010 -22446 -29704 -9839 -6585 -30145 -4443 12347 26703 8595 -15601
6594 -15601 -12786 -18848 -32438 -21215 -19449 -13033 -34195 -30465 -10692 -7972 -35995 -30710 -19821
6581 -19821 32426 20476 40225 74153 69094 40657 31988 34351 21893 -15100 -17535 -10592 1280
6568 1280 -14682 -7234 -12631 -23158 -11826 20367 10405 -23565 -5196 -8586 -18910 -34713 -23557
6555 -23557 -26074 -15057 17606 15519 4447 -22696 -20795 -16153 -35302 -47778 -56940 -39216 -12786
6542a2786J1043N478k3746p688J3842J4353o404K8520k9608j6657J6522J1700
6530D569j9084O817k6598k0414j3086K593L866k532J6255j2752O517K6840m905
6517c1914J7454L3404P93o102k5819l427J594J3481j3743j9761o801M485L1829
6504d527L6595k7197j790k5524P010Q220j0444k5301r274K0418M5839K2620K380
6491C9025o462J8276j0084l6615j0763r167k7068L9846K5512l3326m2273j0246
6479f3345o314K8877J8673j0749J1572J0397L154o287L6573q369j1393J558K820
6466G167o464k0499l8648j2513L5237K7277L756k6438M555P330r63p875j0178
6453c8256K9374K746P906l5535j4470M2016K0349r73l582j3132p474m456R48j0602
$$ plain form
6542 -12786 -1743 3735 -20011 -27699 -13857 496 -5908 22612 -6996 -23653 -7131 4569
6530 4569 -14515 -7698 -34296 -54710 -67796 -65203 -61337 -63869 -47614 -60366 -53849 -27009 -31914
6517 -31914 -14460 18944 19737 13635 -12184 -15611 -14017 -536 -14279 -34040 -40841 -36356 -4527
6504 -4527 32068 4871 3081 -22443 -15433 -7213 -17657 -42958 -52232 -31814 14025 36645 39025
6491 39025 32563 50839 40755 4140 -6623 -15790 -42858 -3012 22500 -10826 -53099 -63345
6479 -63345 -69659 -40782 -22109 -32858 -21286 -10889 -7735 -14022 22551 14182 2789 4347 7167
6466 7167 703 -19796 -58444 -70957 -35720 -8443 -4687 -31125 -26570 -19240 -20203 -28078 -38256
6453 -38256 -8882 -6136 1770 -33765 -48235 -6219 14130 13157 9575 -3557 -11031 -15487 -14539 -25141
6439b5141J0556K4294O93j5613j0233K279M578M1988j697R702m44j2625j758L795
6425C0374j7719Km806l1344Q583J7551q510j20j129j440j0149M057K8943k4279
6411i986k5902l5438J708J8991K046L4475J5252k2379J7474L4655k1022k1046
6399a1172L887j4463k1182J365j1341n612R458L376O549J4780j0859l1536j2192
6386g8942M3227J1264k894J2618O561l481J4799q024O745O610m54j4299j5879
6373b2149K2655K215K954n920Q814L264o738J0299r15l087J6406k0085k0885j8291
6359c1463n411n586j1704K3516J0246P12n67N032j1561J3585L2543P482L882k5774
6345D932k1238J0232J002j3313Q98N268O084j1600K5134n68l209p73O132Q501
$$ plain form
6439 -25141 -14585 9709 10402 -5211 -15444 -13165 -8587 33401 31704 41406 40962 28337 26579 30374
6425 30374 12655 12657 7851 -23493 -14910 2641 -5869 -5989 -7118 -8558 -18707 -14650 14293 -9986
6411 -9986 -35888 -71326 -69618 -50627 -48581 -14106 1146 -21233 -3759 30896 9874 -11172
6399 -11172 -7285 -21748 -42930 -41565 -52906 -58518 -49060 -45684 -39135 -24355 -35214 -66750 -78942
6386 -78942 -35715 -24451 -27345 -14727 -8166 -11647 3152 -4872 1873 8483 8029 -6270 -22149
6373 -22149 506 2721 5675 -245 8569 11833 5095 15394 14479 11392 27798 7713 -13172 -31463
6359 -31463 -36874 -42460 -54164 -30648 -20402 -19690 -20257 -15225 -26786 -13201 19342 26824 30706 4932
6345 4932 -16306 -6074 -5072 -18385 -17487 -12219 -6135 -17735 7399 6831 3622 2849 8981 17482
6331A7482J1630r791R016k7092r118j0251q87l488K1104j31n159l5759p13M5165
6317B008K7380j2397j9836j4893j6430L7375K2581k3275K906q619j078q132l976
6304a6386J2444K9726M8K345Q547L243j7951l9401J4866L0141J9461m0707j2675
6291f299j1218O073J3999j1199J0044J1070k1067k4057Q884k148p448Q940J4344
6278a0082j3745k848K6300m85J0359R593n769j124J4399j2550k2259J0764j0888
6265h335j389J9917J7207k1603j2309P825K4943P47k5005q864J1976J6042k644
6252A8508j628q944L000k6283j9637N376J8655K1300K0235O428k0839j2643l117
6239D11j3051k5673Q610L4708K4752J098R597k4561m859J9063J6045r295j3654
$$ plain form
6331 17482 29112 19321 28337 1245 -7873 -18124 -19011 -22499 -1395 -1526 -6685 -42444 -43157 2008
6317 2008 29388 16991 -2845 -17738 -34168 3207 25788 2513 5419 -3200 -4278 -12410 -16386
6304 -16386 -3942 25784 25832 28177 36724 39967 22016 -17385 -2519 27622 47083 6376 -6299
6291 -6299 -17517 -11444 2555 -8644 1400 12470 -8597 -32654 -23770 -25918 -33366 -24426 -10082
6278 -10082 -23827 -26675 -375 -860 9499 19092 13323 12199 26598 14048 -8211 2553 -8335
6265 -8335 -9724 10193 27400 5797 -6512 1313 26256 27003 1998 -6866 5110 21152 18508
6252 18508 16880 7936 10936 -15347 -34984 -29608 -10953 10347 30582 37010 16171 3528 411
6239 411 -12640 -38313 -29703 5005 29757 30855 40452 15891 11032 30095 46140 36845 23191
6226B3191M5370O363l0146l8736l1422k5404K7446J4369J0569J7737N777j6938
6214H176j6416P997K05K5867j6767k4022J8872j1233J8438K2392l1857n826L891
6201b83P129J2563Q323P353P015J3998k1222j5591K064J0720k2468k7903K0516
6188B214L1394J399R809J699J636j9695j7695J606K8233K0352l4743j0218j648
6175A4343K7953l463k7711R678p787l1676n44K5517k390r214K7841j4839k7260
6162a9552L846N060K6615P01J0973J262j1517J5300m924K928K707m513N720J1479
6148D6085P127j5541p967j4064l803j9420k2315P737L2628J2873j4479k5685k8145
6135d4969L396J7981j3181j459N92J2605J531M7191K7198J240J2819L743l6244
$$ plain form
6226 23191 68561 74924 44778 6042 -25380 -50784 -23338 -8969 1600 19337 25114 8176
6214 8176 -8240 -243 -38 25829 9062 -14960 3912 -7321 11117 33509 1652 -4174 -283
6201 -283 6846 19409 27732 35085 42100 56098 34876 19285 21349 32069 9601 -18302 2214
6188 2214 33608 35007 44816 46515 48151 28456 10761 12367 40600 60952 26209 15991 14343
6175 14343 42296 38833 11122 20800 13013 -18663 -19207 6310 3920 -5294 22547 7708 -19552
6162 -19552 -15706 -10646 15969 16670 27643 28905 17388 32688 27764 30692 33399 28886 34606 46085
6148 46085 53212 37671 29704 15640 11837 -7583 -29898 -22161 10467 23340 8861 -16824 -44969
6135 -44969 -41573 -23592 -36773 -38232 -37640 -25035 -23504 23687 50885 52125 64944 68687 32443
6122C2443k4628J183J5094P740k7718k9880L772J982J8964J7841j1990O68L3665
6109C9136j5007l5946J3688M2289K3261j2595k604j5143j8574k237k966l215r069
6096A018O524o973J9074J0519k8818j7337K1755j2304j3663r848N004k667Q609
6083a9107J073j1831Q598K4374J0735l1681o884L8410J6966O323J3183K6l642
6070D6543j4062l261k5912q035J2189j9119j1838m074P29J2942K300j1088M3219
6057B0533q274k9634m7724j4930K4322L6180R857J7640p464R871j0823L451k2630
6044a9625j7218p50L774p97K4222K6040r97k3758l8168p230L0449Q353j5949J279
6030c0375P021Q989J3741R76r037J1385q943J799J3710k363j0712l5588J0857
$$ plain form
6122 32443 7815 8998 24092 31832 4114 -25766 -21994 -20012 -1048 16793 4803 5471 39136
6109 39136 24129 -11817 1871 44160 67421 54826 52222 37079 18505 16268 13302 10087 1018
6096 1018 7542 569 19643 30162 1344 -15993 5762 -6542 -20205 -30053 -25049 -27716 -19107
6083 -19107 -18034 -29865 -21267 3107 13842 -17839 -24723 13687 30653 36976 50159 50185 46543
6070 46543 32481 29220 3308 -4727 7462 -11657 -23495 -27569 -26840 -13898 -11598 -22686 20533
6057 20533 12259 -17375 -65099 -80029 -55707 -19527 -9670 7970 506 10377 -446 3005 -19625
6044 -19625 -36843 -37593 -33819 -34616 -10394 15646 14649 -9109 -47277 -54507 -24058 -15705 -31654 -30375
6030 -30375 -23354 -14365 -624 352 -8685 2700 -6243 -4444 9266 6903 -3809 -39397 -28540
6017b8540j1843k6863j2062Q01J9775J2730Q527L498J2539K394j0579L136M654
6004b1833n03n63k529J8375L702O944j9608K1140J2829J2601j0340j4761O515
5991A1969J3591k0542k5411K7615K880j7802k3299j4743M70L944R484N330O375
5978b0139p410J1954J3962L608j5687L319J4920N557n607j778K5291R821j4576
5965B3235m498k2775j528q863J2085K7317j0672J386k489K977L1562Q354k1091
5952C5000q523K1668J4344m0204k6788j7672L6363J7434k1929j7948k592r618
5940b0465q764J9064J973k119q714P657l75k273q772j2239J7081J5811R851n654
5926B062q581r050k7434N196j4301j0573q235L3317K6816j1023j8404R322K2494
$$ plain form
6017 -28540 -40383 -67246 -79308 -78507 -58732 -46002 -37475 -33977 -21438 -19044 -29623 -26487 -21833
6004 -21833 -22336 -22899 -25428 -7053 -3351 3593 -16015 5125 17954 30555 20215 5454 11969
5991 11969 25560 5018 -20393 7222 10102 -7700 -30999 -45742 -45272 -41328 -31844 -26514 -20139
5978 -20139 -27549 -15595 -1633 1975 -13712 -10393 4527 10084 4477 2699 27990 37811 23235
5965 23235 18737 -4038 -5566 -14429 -2344 24973 14301 15687 13198 16175 47737 56091 35000
5952 35000 26477 48145 62489 22285 -4503 -22175 14188 31622 9693 -8255 -10847 -20465
5940 -20465 -29229 -10165 -8192 -10311 -19025 -11368 -11743 -14016 -22788 -35027 -17946 -2135 7716 2062
5926 2062 -6519 -15569 -43003 -37807 -52108 -62681 -70916 -37599 -10783 -21806 -40210 -30888 -8394
5913h394L1557J7235j1346l3045j1336J3416J9460j1767j2485o451k356m734j5474
5900c5720J9968K4453j594J0012K3635l541j9546l6201j6458K4518r649J6373
5888c750Q800j1462k2318R939J3873p192J0055J6108R585J6201j9626j0250j984
5875G979O619o058r645j1099Q354j6585p019P841K5894J1270K7524q984j1718
5862B4373j9486j0870j5924J5660J8319N295o152j0152j203j1090r384J2650j2091
5849b0055j0981J5680J4182j15j4637K96K7529p33J1523q099l872M304j4992J6255
5835A6285M0691J8651l5939k2907n599j1999o292J1321Q479j2305J9712k352k0135
5822b389r560l147M282K0813O7j2285N74M420m126o85N828L004J3116j5528j8853
$$ plain form
5913 -8394 23163 40398 29052 -3993 -15329 -1913 17547 5780 -6705 -13156 -15512 -20246 -35720
5900 -35720 -15752 8701 7107 17119 40754 37213 17667 -18534 -34992 -10474 -20123 -3750
5888 -3750 5050 -6412 -28730 -18791 -4918 -12110 -2055 14053 23638 39839 20213 9963 7979
5875 7979 14598 8540 -1105 -12204 -3850 -20435 -27454 -19613 6281 17551 45075 36091 24373
5862 24373 4887 -5983 -21907 -6247 12072 17367 11215 1063 -140 -11230 -20614 -7964 -20055
5849 -20055 -31036 -15356 -1174 -1289 -15926 -15630 11899 11166 22689 14590 10718 15022 30 16285
5835 16285 56976 75627 39688 16781 11182 -817 -7109 4212 12691 386 20098 17746 -2389
5822 -2389 -11949 -15096 -10814 9999 10066 -2219 -1645 2775 -1351 -2036 3792 6796 19912 4384 -14469
5807a4469J5271J554J5242J2365k1307r74Q855j572J1671k6524q066l578M269
5794g263L667j5692j4616j0896J5991j2806o169l3695J9320L9786M3055J201j8792
5781C091q375K826l2797K208K8788j5280l9629r526M3542J3949p211j077j3553
5768c3044Q388k2571j3712R489M7192m190J2831L099K495j944j5167p926k774
5755a7834o495K6913J5729k5987J673N550P857l970p741J8001J1902j3788j8389
5742f579J1567l1159j8507M181J7693j955K2296R015K4222K1621p919l5083l0644
5729b1251J3750J9764P020L715j754m972K3248K341k0781k6057K5485K3667L980
5716D8155j3511M964K4840j7901l3799k9444n495L3553Q74K0965J1873q766l5052
$$ plain form
5807 -14469 802 2356 17598 29963 8656 7682 16537 14965 26636 112 -7954 -11532 -7263
5794 -7263 -3596 -19288 -33904 -44800 -28809 -41615 -47784 -81479 -62159 -22373 20682 21883 3091
5781 3091 -5284 -2458 -35255 -33047 -4259 -19539 -59168 -68694 -25152 -11203 -18414 -19491 -33044
5768 -33044 -24656 -47227 -60939 -51450 -4258 -8448 4383 7482 9977 8033 -7134 -15060 -17834
5755 -17834 -24329 2584 18313 -7674 -6001 -451 7406 3436 -4305 13696 25598 11810 -6579
5742 -6579 4988 -26171 -44678 -40497 -22804 -24759 -2463 6552 30774 52395 44476 9393 -21251
5729 -21251 -7501 12263 19283 22998 21244 16272 39520 41861 21080 -4977 20508 44175 48155
5716 48155 34644 39608 64448 46547 12748 -16696 -22191 11362 12236 33201 45074 36308 1256
5703A256j4317K1180P443k0727K3482j1360k4221K2232J5216N325k8668j3585
5691a6744j9456M591L483J7506p759j2890k4422K4437J2815j0624j8696m300N107
5678d6952K2490J8163K380J2178k7861j8180o356J4594K5366j4576p093m779O607
5665b4019l292k395Q163O093M741J4409J0663o713K1746k8847l1506o031j0224
5652d7212J9305L0999K7179J832j4680J2731P796j4543j2028P161M508O660k453
5639B7255p828N202r578j1119N661j0320k4689R92J5552j2165j3839J9183P617
5626h076q215J5789K955r193p252m693J4260J3822l7759M03K9230R55q098J1486
5612E614k4017j2187K0904P186n412k0704r178K9069j5160k6908K4891M5318L5896
$$ plain form
5703 1256 -13061 8119 15562 -5165 18317 6957 -17264 4968 20184 25509 -3159 -16744
5691 -16744 -36200 -31609 -28126 -10620 -18379 -31269 -55691 -31254 -18439 -29063 -47759 -52059 -46952
5678 -46952 -24462 -6299 -3919 8259 -19602 -37782 -44138 -29544 -4178 -18754 -25847 -30626 -24019
5665 -24019 -27311 -29706 -21543 -15450 -10709 3700 14363 7650 29396 549 -30957 -36988 -47212
5652 -47212 -27907 3092 30271 32103 17423 30154 37950 23407 11379 18540 23048 29708 27255
5639 27255 19427 24629 15051 3932 9593 -727 -25416 -24424 -8872 -21037 -34876 -15693 -8076
5626 -8076 -16291 -502 2453 -6740 -13992 -18685 -4425 9397 -28362 -27959 1271 2226 -5872 5614
5612 5614 -18403 -30590 -9686 -2500 -7912 -28616 -37794 -8725 -23885 -50793 -25902 19416 55312
5599E5312j7811j3431k4491k8600n674p70L1147J418j2080j4051l837K7799M6398
5586D1329l776m732R062J7059j4505k6114l239k1974j1998K2826j7617r275J6098
5573f856R902J4638j0133j4947k1973k4466L253L2956K1312n869R992m761n285
5560b237K179o121j9469j0561P913J7750N110j2864n45M024O186n485O765m030
5546a1385r730J7958J5415r166K1989J7833j4285k3150j1793J3700J83k1651L4243
5533B0161M1782L407J332q937k9821j5707j5404m1842n521K5891K1360P866J2610
5520A7177K320L5245J7570l1625m1044j037M198K5671j615p416O747p426M283
5507B3048k2761k637J0088J3170j0787j4741l8807j1729J9431N265O661m105p339
$$ plain form
5599 55312 37501 24070 -421 -29021 -34695 -35465 -4318 -2900 -14980 -29031 -32868 -5069 41329
5586 41329 37553 32821 41883 58942 44437 18323 15084 -6890 -18888 3938 -13679 -22954 -6856
5573 -6856 3046 17684 7551 -7396 -29369 -53835 -50582 -17626 3686 -2183 7809 3048 -2237
5560 -2237 -58 -6179 -25648 -36209 -28296 -10546 -5436 -18300 -18845 -14821 -8635 -14120 -7355 -11385
5546 -11385 -21115 -3157 12258 3092 25081 42914 28629 5479 -6314 7386 7569 -14082 20161
5533 20161 61943 65350 66682 57745 27924 12217 -3187 -45029 -50550 -24659 -3299 4567 17177
5520 17177 19497 54742 72312 40687 -357 -1394 2804 28475 26860 19444 26191 18765 23048
5507 23048 287 -2350 7738 20908 10121 -4620 -43427 -55156 -35725 -30460 -23799 -27904 -35243
5494c5243m990K1319J6802M997q249K51n806K2755K4135j8812K229Q480J5592
5481D3460J3105k2836k7338N884k275k858K5867J1028O66J1754L208j8502j2005
5468B9158r084j2786j8274L6674q749j7031N016p54j9268K6103L763L769r254
5455I283J0330m286j1442k9735N691Q96J236Q412P329k87j854R603j421J6092
5441A9847L057j5044j3461l1173J5370M1426L252j6355l438k497j435p135J31
5428g455j0717M613q699q637k276M484r934o070m688K5963J9231J4087j6017q626
5414a4741j1747P878N172j5691p723p886J4870J9749Q902j292j1475O860K73N556
5400a295j7868l607P333J3124j541J520J5679K4867p564j4568J610j1951j6496
$$ plain form
5494 -35243 -40233 -18914 -2112 2885 -5364 -5113 -10919 11836 35971 17159 19388 27868 43460
5481 43460 56565 33729 6391 12275 10000 7142 33009 44037 44703 56457 59665 41163 29158
5468 29158 20074 7288 -10986 25688 16939 -92 4924 4170 -15098 11005 14768 18537 9283
5455 9283 19613 15327 3885 -25850 -20159 -19263 -18027 -9615 -2286 -2573 -4427 5176 3755 19847
5441 19847 22904 7860 -5601 -36774 -21404 20022 23274 6919 3481 984 -451 -7586 -7455
5428 -7455 -18172 -13559 -22258 -30895 -33171 -28687 -38621 -44691 -49379 -23416 -4185 9902 -6115 -14741
5414 -14741 -26488 -18610 -13438 -29129 -36852 -44738 -29868 -10119 -1217 -2509 -13984 -7124 -6851 -1295
5400 -1295 -19163 -22770 -15437 -2313 -3854 -2334 13345 38212 30648 16080 17690 5739 -10757
5387a0757O053L1193L192M173K1170l928l6584p728m151K716n437j8474j325n00
5373b0387k554o135R192J0130J4852o553k4764j5515J2960K9682L649q432Q026
5360D151K0390m397p07j3846n96J4140k7868j5148K7791J6932k0154o15j4937
5347a4864J032J0426M933K2417K2357j0065j2968k7984l1695R675M7992j2531
5335H725j8807M084m151O26o173Q712j833k0705J9945L0904k2436l5658j1623
5322d8390j0717j938r005L132K6296J7432L1784k6935o981R365J1655j1589o907
5309b2798m133K9915J0790k7964n236J7488j4354q553K89j4372J3407J7158J3020
5296D657L0702j7162Q39l262k3118k7253k1934O558Q798J409L08J110p673j655
$$ plain form
5387 -10757 -4704 26489 29681 33854 55024 51096 14512 6784 2633 5349 -88 -18562 -19887 -20387
5373 -20387 -22941 -29076 -19884 -9754 5098 -1455 -26219 -41734 -28774 908 4557 -3875 4151
5360 4151 24541 20144 19437 5591 4995 19135 -8733 -23881 3910 20842 688 73 -14864
5347 -14864 -13832 -3406 1527 23944 46301 36236 23268 -4716 -36411 -26736 21256 8725
5335 8725 -10082 -5998 -10149 -9523 -15696 -6984 -8817 -29522 -9577 21327 -1109 -36767 -48390
5322 -48390 -59107 -61045 -70050 -66918 -40622 -23190 8594 -18341 -25322 -15957 -4302 -15891 -22798
5309 -22798 -26931 2984 13774 -14190 -19426 -1938 -16292 -24845 -24556 -38928 -25521 -8363 4657
5296 4657 35359 18197 19036 15774 -7344 -34597 -56531 -49973 -41175 -39766 -39458 -38348 -46021 -47676
5282d7676J2215J0251o762l295J3148j5880k5978J0922R061l248M102K7487m36
5269a6089K1016J3979R021p127p217m92l258n354l608J873R898J9191J5719J2896
5255F0448P397N577j4324j2749k6207j1707L432N719r955O755J2214K6823N431
5242E8854p163L289l500j9667l4887O187J3533k8827J3244Q095K395L360j3486
5229A427O620j7658n578J5061J8043N335k4127j4741l0889q320K3499R763k9340
5216e0905k198O455J4701J7252Q576J3405k874m163R347p004r783J1554M257j941
5202F679K715J5535q21k5571j558j3198M977J2722O445N922j1539k7313J5040
5189i965K2386m797m9627K052J1535J8899j3286n802o896k7117p221K0483J9364
$$ plain form
5282 -47676 -35461 -25210 -31972 -35267 -22119 -37999 -63977 -53055 -43994 -47242 -43140 -15653 -16089
5269 -16089 4927 18906 27927 20800 13583 13091 9833 4479 871 2744 12642 31833 47552 60448
5255 60448 67845 73422 59098 46349 20142 8435 11867 17586 7631 14386 26600 53423 58854
5242 58854 51691 54980 51480 31813 -3074 3113 16646 -12181 1063 9158 11553 14913 1427
5229 1427 8047 -9611 -15189 -128 17915 23250 -877 -15618 -46507 -54827 -31328 -21565 -50905
5216 -50905 -53103 -46648 -31947 -14695 -6119 7286 4412 249 9596 2592 -7191 4363 8620 6679
5202 6679 9394 24929 24108 -1463 -3021 -16219 -11242 1480 7925 13847 2308 -25005 -9965
5189 -9965 12421 7624 -42003 -39951 -28416 -9517 -22803 -28605 -35501 -62618 -69839 -49356 -29992
5176b9992J207J8467M9278j781k6484j9509J401Q739R341N531q806l602J924J2195
5162A7909j3964J7105j1435k3048J5247p63j576M211J2420k693j6383L52r165
5149a1783J9444J3130k4864m423J2137j3796l2851j4590L5482j4487j4376M3742
5137g235J4032k6707k6024j2338L707r909J0081L5320J8963r670l96J8846n448
5124C222j0197j0020N599K2604n975M071k527K900Q085k962j7400j544j1268k1927
5110c7339J83J9943N7J2908Q604J59O705j92p026J2061J7089l2746j5210k813
5096a7617l8798j225K1431K4523J1522O156L230J778q106k0882Q41J024o365k2282
5082d4770L3366Q315j3366j2759N965J3891R420J6323J6173l2441q916J7473J5176
$$ plain form
5176 -29992 -28785 -10318 38960 37179 10695 -8814 -7413 1326 10667 16198 7392 3790 5714 17909
5162 17909 3945 21050 9615 -13433 1814 1051 -525 3686 16106 13413 -2970 -2618 -11783
5149 -11783 7661 20791 -4073 -8496 3641 -10155 -43006 -57596 -22114 -36601 -50977 -7235
5137 -7235 6797 -19910 -45934 -58272 -54565 -64474 -54393 -19073 -110 -9780 -10176 8670 3222
5124 3222 -6975 -16995 -11396 11208 5233 9304 6777 9677 17762 14800 -2600 -4144 -15412 -37339
5110 -37339 -37156 -17213 -17156 -4248 4356 4515 11220 11028 4002 16063 33152 406 -14804 -17617
5096 -17617 -56415 -57640 -36209 -11686 -164 5992 9222 11000 2894 -17988 -17147 -16123 -22488 -44770
5082 -44770 -11404 -3089 -16455 -29214 -23249 -9358 62 16385 32558 117 -8799 8674 23850
5069B3850j3240L501R647l2599p89m0041j6050J2472J7172R141J9830K8315N77
5056B1786M702J699p862r275q439Q433k3147j9846q331J1963m253K654K8191Q477
5042F752j5915R414L130m409J7015N464j2856J262J004k433r487J3095L236j4449
5028H23M836J5937j319l616J1304p880l6826O510M821J1139J0418j6301n342k6334
5014c1830j7368l6615J4134L6955L2721j7596j572Q236K0136L0332q369l3434
5002d270K004K4763r376j5777p188p430K325q373o70l394M676m065k6359j3310
4988f6444N5037K6506j1459k4688l194j501k8179J0554J2408J5297K2635M8252
4976E5224j2160m1751k1511J6392O125N878N515j9303k6388Q38n513J6721N219
$$ plain form
5069 23850 10610 14111 23758 -8841 -9630 -49671 -65721 -53249 -36077 -26936 -7106 21209 21786
5056 21786 26488 28187 20325 11050 2611 11044 -12103 -31949 -40280 -28317 -32570 -29916 -1725 6752
5042 6752 -9163 251 3381 -1028 15987 21451 8595 9857 10861 8428 -1059 12036 15272 823
5028 823 5659 21596 20277 16661 27965 20085 -16741 -10231 -5410 5729 16147 -154 -5496 -31830
5014 -31830 -49198 -85813 -71679 -34724 -2003 -19599 -21171 -12935 7201 37533 29164 -4270
5002 -4270 -2266 22497 13121 -2656 -9844 -17274 -14949 -23322 -23992 -27386 -22710 -26775 -53134 -66444
4988 -66444 -11407 15099 3640 -21048 -24242 -25743 -53922 -43368 -30960 -15663 6972 55224
4976 55224 43064 1313 -20198 -3806 2319 8197 13712 -5591 -31979 -31141 -36654 -19933 -14714
4963a4714J2168j245j2935j9269j4613j3054N614K6645J260K5217K1944O124l194
4950A9948k1577k9635q380P601P987K0681Q803J1032m213k2398K528L1908j277
4937B3008j9745j6737K8039l310j4813J3785Q488J1479J5787m476j8262k7020
4925c777k2279j1825R884K5605K0452j6260n497J3377j7733j5487q980K468K555
4912b7497p381M374K6042o512j8541K4100o955j3721Q237K4737K681K0939L9376
4899F9879j7057l8417m5650o874K5611R549n179m652j1902J1318K8180K437j9153
4886a910j7100J0535l533R548q02Q17j3154J4209J6053n52P065J5808J444p143
4872C1285J0784L18k8540j130n011o251l78J3269J4596J4953J651j7779l5939
$$ plain form
4963 -14714 -2546 -3791 -16726 -35995 -50608 -63662 -58048 -31403 -30143 -4926 17018 23142 19948
4950 19948 -1629 -31264 -39644 -32043 -24056 -3375 5428 16460 12247 -10151 -7623 24285 23008
4937 23008 3263 -13474 14565 11255 -3558 10227 18715 30194 45981 41505 23243 -3777
4925 -3777 -26056 -37881 -27997 -2392 18060 1800 -3697 9680 -8053 -23540 -32520 -30052 -27497
4912 -27497 -34878 -30504 -4462 -10974 -29515 -5415 -12370 -26091 -17854 6883 9564 30503 69879
4899 69879 52822 14405 -31245 -38119 -12508 -2959 -8138 -12790 -24692 -13374 14806 17243 -1910
4886 -1910 -19010 -8475 -12008 -2460 -3262 -2445 -15599 -1390 14663 14111 21176 36984 38428 31285
4872 31285 42069 42387 13847 12717 7706 1455 1077 14346 28942 43895 45546 27767 -8172
4859h172k7037J7020K3800j3599J4681K1831R51M698j141j7734L670j7131p642
4846e805l4442j0940K4852L1817N131k3646j621j3304q443n095m121K2711L0312
4833G406J867k0113j4112j356J9189l040k7013Q579J878J1919j6847k040L996
4820b9687J8713R23J4986J363O069j9420m27O417J750M833N903J955r567m179
4806c68l523K6318K6381q953r679K3836Q999O604J1538k3187j9759m1093j4066
4793a6952m715j5975q75J0797J1648J2864J6010J857k1187o991k8314M305J6976
4780b0552J3784J2465K0693J5726r82k96j3028l0528j1330l7899k0334K3626R759
4767c8896o434M543K2716M832j9575J2582k200J8525J2214L930o433Q106k596
$$ plain form
4859 -8172 -35209 -18189 5611 -7988 6693 28524 29475 34173 33032 15298 18968 1837 -5805
4846 -5805 -40247 -51187 -26335 5482 10613 -13033 -14654 -27958 -36401 -41496 -45617 -22906 7406
4833 7406 9273 -10840 -24952 -26308 -7119 -10159 -37172 -28593 -26715 -14796 -31643 -33683 -29687
4820 -29687 -10974 -10051 4935 6298 12367 -7053 -7480 -1063 687 5520 11423 13378 3811 -368
4806 -368 -3891 22427 48808 39855 30176 54012 63011 69615 81153 57966 38207 -2886 -16952
4793 -16952 -21667 -37642 -38517 -27720 -16072 -3208 12802 14659 -6528 -13519 -41833 -37528 -20552
4780 -20552 -6768 5697 26390 42116 41134 40838 27810 -2718 -14048 -51947 -72281 -48655 -38896
4767 -38896 -45330 -40787 -18071 -13239 -32814 -20232 -22432 -3907 8307 12237 5804 13910 11314
4754A1314l1891K3099J1384l920j3928m862J6585k0580j2200J1969j4972k008
4742c0010J4730R754j459j0374L590K8490J5605J3888k1017j2395j0855j4225
4730a4278R42M840m51m078J6627J5187l5116J7433P738j7732n927J7278l0003
4717b7540k3949K3649K158j513K0081K3024R649n062R681J4402J3294j812k3311
4704C2751k0632k7098k798Q72N64J6290N156k5324O97J1288M634j0784j7530J4861
4690a7053K9402J138q587l8859o040J5601K0834J2370Q457o008P250J2989n618
4677B5876k7224j2103K5726r7j6921m629J4823r149k8026j2158J3605L4175K5848
4664B9746j5572j8447K44n065J203l958k8211M193M9495J4503k5046o7K4795l4670
$$ plain form
4754 11314 -20577 2522 13906 9986 -3942 -8804 7781 -12799 -24999 -13030 -28002 -30010
4742 -30010 -15280 -5526 -6985 -17359 -13769 14721 30326 44214 23197 10802 -53 -14278
4730 -14278 -13336 -8496 -8947 -13025 3602 18789 -16327 1106 8844 -8888 -14815 2463 -27540
4717 -27540 -51489 -27840 -25682 -27195 -7114 15910 25559 20497 30178 44580 57874 56062 32751
4704 32751 12119 -14979 -17777 -16905 -16341 -51 5105 -20219 -19522 -8234 -3600 -14384 -31914 -17053
4690 -17053 12349 13487 4900 -33959 -39999 -24398 -3564 8806 17263 11255 18505 31494 25876
4677 25876 -1348 -13451 12275 12178 -4743 -9372 5451 -3698 -31724 -43882 -30277 3898 29746
4664 29746 14174 -4273 -4029 -9094 -7891 -11849 -40060 -35867 13628 28131 3085 3018 27813 -6857
4650f857k4869r316J1902M9824J6049j4013J666p765K3324K2158l5539l4178M775
4637b839J3935k5502k5915J5118K6137k2382p989L489L6704J9205J2539l9192
4625C308j4470j0381R054K166j0805k927J2195n352k2225J102J8908J2894M3J13
4611f377p71j2337K518J7246n516p027j5778J3266q20j5310K0043O567j252k882
4597h430m6548r323L4899K8626m434k8367k6008q486J5368K5065M785P303J8942
4584C392J3968O312k9041k755r655n901l598K1999J2907k630j4500q291k6198
4571d3991P434J4312k9195O685J6103n639O701O36K7168j0657k2312J7827o280
4558b1208m297J6785K558J3587M3522k2972l7958q92q732j733K6700J4659k6263
$$ plain form
4650 -6857 -31726 -41042 -29140 20684 36733 22720 24386 16621 39945 62103 26564 -7614 -2839
4637 -2839 11096 -14406 -40321 -25203 934 -21448 -29437 -25948 10756 29961 42500 3308
4625 3308 -11162 -21543 -12489 -10323 -21128 -24055 -11860 -17212 -39437 -38335 -19427 -6533 -6490 -6377
4611 -6377 -7148 -19485 -16967 279 -5237 -12264 -28042 -14776 -15596 -30906 -10863 -4296 -5548 -8430
4597 -8430 -54978 -64301 -29402 -776 -5210 -33577 -59585 -68071 -52703 -27638 -22853 -15550 3392
4584 3392 17360 23672 -5369 -8124 -17779 -23680 -27278 -5279 7628 4998 -9502 -17793 -43991
4571 -43991 -36557 -22245 -51440 -44755 -28652 -34291 -27590 -26954 214 -10443 -32755 -14928 -21208
4558 -21208 -25505 -8720 -6162 7425 50947 27975 -9983 -10875 -19607 -21340 5360 20019 -6244
4545f244n266J2900O955M944j2352k0713n604P218j0685j0452P637q775O721L5330
4531A614O70r552j0206j2669n927J9455J6266K3110O214n846r729j6050q527l353
4517a4530j2369r303J6175L740j3880M182J6777J0854J7669K939j8780k152k0924
4504a9602p904J4680p26l2335O563K9114M947k1421J3045K3888K050M041j1501
4491D839l9118Q088K6824P895k7161m797p300l21K8296j4112k251J4426J7280
4478A2588J1532k5854p222j5164J480K6807Q10o611O568R27J9639J0227l554o076
4464B6097j0707q644k5863O000K7010m469J6547k5037l211J4590j1515q47k7430
4451b7479N126O289K7238M0681j3246j942j2207k0267K412J2663p841j5896J54
$$ plain form
4545 -6244 -11510 1390 8345 13289 937 -19776 -25380 -18162 -28847 -39299 -31662 -40437 -33716 1614
4531 1614 2284 -7268 -17474 -30143 -36070 -16615 -349 22761 28975 23129 13400 -2650 -11177 -14530
4517 -14530 -26899 -36202 -20027 -16287 -30167 -25985 -9208 1646 19315 22254 3474 1322 -19602
4504 -19602 -27506 -12826 -13552 -45887 -39324 -10210 -5263 -26684 -13639 10249 12299 16340 4839
4491 4839 -34279 -26191 633 8528 -18633 -23430 -30730 -31051 -2755 -16867 -19118 -4692 12588
4478 12588 24120 -1734 -8956 -24120 -22640 4167 4977 -1634 4934 5861 25500 35727 32173 26097
4464 26097 15390 6746 -19117 -13117 13893 9424 25971 934 -2277 12313 798 -49 -27479
4451 -27479 -22353 -16064 11174 51855 38609 36667 24460 4193 6605 19268 11427 -4469 -4315
4438d315j3393m820K1413K1348J1783k6606k210P463j6585k7890L384M578K286
4425b3564L545j1790P212j457j1990K740J0903n497J0780K250J2247J0136j5982
4412a0467j4347m286P009P981j8447p73P552K47J7168M1170J241m4590l9329j548
4398e1419L8512J5013J8307J3561j2993q605q828j5879J4683k384j8983k4255
4386d3270K6804J8403m908K1951L0133l7503n175J3214l670k6070k3756P103J1711
4373a5033n241j4237J0599p28L256j6628J2639O995j20j7364j1169N887n271j4533
4359f0948j8097J1265J1636l872p894J5711J7191J8904j7238j3056J0577K9625
4347f196K4819j1370p073k4486J1835M542j873k2388O028M6121K4203q985l362
$$ plain form
4438 -4315 -17708 -22528 -1115 20233 32016 5410 3200 10663 -5922 -33812 -30428 -25850 -23564
4425 -23564 -20019 -31809 -24597 -26054 -38044 -35304 -24401 -29898 -19118 -16868 -4621 5515 -10467
4412 -10467 -24814 -29100 -22091 -14110 -32557 -33330 -25778 -25531 -8363 32807 34048 -10542 -49871 -51419
4398 -51419 -12907 2106 20413 33974 20981 12376 3548 -12331 2352 -32 -19015 -43270
4386 -43270 -16466 1937 -2971 18980 49113 11610 6435 19649 15979 -10091 -33847 -26744 -15033
4373 -15033 -20274 -34511 -23912 -24640 -21384 -38012 -25373 -18378 -18498 -35862 -47031 -41144 -46415 -60948
4359 -60948 -79045 -67780 -56144 -60016 -67910 -52199 -35008 -16104 -33342 -46398 -35821 -6196
4347 -6196 18623 7253 180 -24306 -12471 -7929 -9802 -32190 -26162 19959 44162 35177 31815
4334C1815r689j6397o778K115J3438Q024l522j8020N139j5537p309j4227j6870
4321d7818J8222J2211J7212J5731o896q665L004j7765M695p678j1727Q386R100
4308a1988n373r538M062m594J4020J0196K6016J6361l1250j1392j8876j6399J2010
4295b6745M987p046N899L2936n290j4928K3178j7835l023M099L149k031M468J0603
4281A2421R752j2743j9897R838O100n140K4074j6034J3052j2641k4756k880Q058
4268a0796J4518K0255j2795O10R928L911J0552K22J9991J925j8504j5812J2407
4255C6412q691l0336j2761J0789J1121K580j4853j2734O762m617K5594J4763l6347
4242a2318L591P430k4061K725R166r009K2323J0399j8370k8703J8981L1777J5856
$$ plain form
4334 31815 22126 5729 -1049 1066 14504 22528 19006 986 6125 -9412 -16721 -30948 -47818
4321 -47818 -29596 -17385 -173 15558 8662 -3 3001 -14764 -10069 -17747 -29474 -21088 -11988
4308 -11988 -17361 -26899 -22837 -27431 -13411 -3215 22801 39162 7912 -3480 -22356 -38755 -26745
4295 -26745 -21758 -28804 -22905 10031 4741 -10187 12991 -4844 -7867 -3768 -619 -2650 1818 12421
4281 12421 22173 9430 -10467 -629 5471 331 24405 8371 21423 8782 -15974 -18854 -10796
4268 -10796 3722 23977 11182 11792 21720 25631 36183 36405 56396 58321 39817 24005 36412
4255 36412 27721 -2615 -15376 -4587 6534 9114 -5739 -18473 -11711 -16328 9266 24029 -12318
4242 -12318 -8727 -1297 -25358 -22633 -13467 -22476 -153 10246 -8124 -36827 -17846 13931 29787
4229B9787L965j5278k7856j6101l6418Q551K8741q14N060L5728K8051j7241q614
4216A7561k0815j6218m849O838Q111J9107Q409j0270K654j3005J176n989k0507
4203b7797J1884K7958J2883j7776m0044j5291P049J5955K8018J4062J2686j6775
4191A2812l334Q150P153l1770o484J5043l125R699r407J44k2458k0532r806J2697
4177d1218J1368J8906K7117m584j3896L54r856J4801K5330J1325k1448j4233k2972
4164a9006j4482J7276N530k7871N225K5163Q4j0557J8587J2028j6776j1705K2469
4151E965j0992j0408J6514J8959o854l3267J1217J6332j3509m342J2199J8025
4139A9839M907L5593l394j5078k7519k1080j1430m198L126j7177r439N791K5168
$$ plain form
4229 29787 33752 18474 -9382 -25483 -61901 -53350 -24609 -25423 -20363 15365 43416 26175 17561
4216 17561 -3254 -19472 -24321 -17483 -9372 9735 18144 7874 10528 -2477 -1301 -7290 -27797
4203 -27797 -15913 12045 24928 7152 -32892 -48183 -41134 -25179 2839 16901 29587 12812
4191 12812 9478 17628 24781 -6989 -13473 1570 -1555 8144 -1263 -1119 -23577 -44109 -53915 -41218
4177 -41218 -29850 -10944 16173 11589 -2307 -1953 -11809 2992 28322 39647 18199 3966 -19006
4164 -19006 -33488 -16212 -10682 -38553 -33328 -8165 -8081 -18638 -51 11977 -4799 -16504 5965
4151 5965 -5027 -15435 1079 20038 13184 -20083 -8866 7466 -6043 -10385 1814 19839
4139 19839 24746 60339 56945 41867 14348 -6732 -18162 -22360 -19234 -36411 -45850 -40059 -14891
4126a4891o058j4181J3780L1408p434j0044k5797J0230N277N002K630k2196j8069
4113e0343J0713k7268l720J8439K611Q995K561J5093P144q916k7561J8756L0415
4100c081j0206k6289k4290m788L2921K8049m120J712r735L263r230J0647K8582
4087A3435K0906M014k2195l5268k3912M4081L8756O891M613j2830J9033K643J9759
4074G9926l0937j1807j0792m3816l5133O025M7121L2029j7559j9349J0302p070
4062a060q386K9134l433l5742j9197R284O969P840K6904m481k01N700K913O631
4048B2875j0532k3566N106J5618j1295O410l14l015K179J6356j4360j6620K5589
4035A4431p725j2543K857J6979L2584k1458j8807N168k6313k7225p230J8994J7169
$$ plain form
4126 -14891 -20949 -35130 -21350 10058 2624 -7420 -33217 -22987 -17710 -12708 -10078 -32274 -50343
4113 -50343 -39630 -66898 -70618 -52179 -49568 -40573 -38012 -22919 -15775 -24691 -52252 -33496 -3081
4100 -3081 -13287 -39576 -63866 -68654 -35733 -7684 -11804 -10092 -19827 -16564 -25794 -15147 13435
4087 13435 34341 38355 16160 -19108 -43020 1061 39817 46708 51321 38491 57524 60167 79926
4074 79926 48989 37182 26390 -17426 -52559 -46534 587 32616 15057 -4292 6010 -1060
4062 -1060 -9446 19688 16255 -19487 -38684 -29400 -22431 -14591 12313 7832 7631 13331 16244 22875
4048 22875 12343 -11223 -6117 9501 -1794 4616 4302 1287 3466 19822 5462 -11158 14431
4035 14431 6706 -5837 -2980 13999 46583 25125 6318 11486 -14827 -42052 -49282 -30288 -13119
4022a3119K0627J0437O535p708j8133k9270L867L958K8846J7773k2115k2698J3168
4009g832J7537l624n945j4727J3498j2690R346M242O506k093k0110k732j0432
3996b9056R592J2220Q81p734N887M596j4846J8257J9315K943j752l3791K685N840
3982d963L664O109l122n503m21J3842l540j1182K139p283r120Q412Q387Q736n709
3967D46L771K761K7798J2350l453J6777l0929k0214j6370J6463j668K542J3875
3954B4149k5121j1726K8509R918k676k6636L059k589o536L875L242j0537O7j264
3940a4266j6894j3037p762J1302J2536J7002J8817l2187k7987o610j004J366K2811
3927c5913L2706k654Q038L44M913q014l3438J0964J8319K1478j5887k7441o652
$$ plain form
4022 -13119 7508 17945 24480 16772 -1361 -30631 -26764 -22806 6040 23813 1698 -21000 -7832
4009 -7832 9705 6081 136 -14591 -1093 -13783 -4437 -195 6311 4218 -15892 -18624 -29056
3996 -29056 -19464 -7244 -6363 -14097 -8210 -3614 -18460 -203 19112 22055 20303 -13488 -10803 -4963
3982 -4963 -1299 4810 1688 -3815 -4236 9606 6066 -5116 -2977 -10260 -19380 -10968 -2581 6155 446
3967 446 4217 6978 34776 47126 43673 60450 29521 9307 -7063 9400 7732 10274 24149
3954 24149 -972 -12698 15811 25729 23053 -3583 -524 -3113 -9649 -5774 -2532 -13069 -13002 -14266
3940 -14266 -31160 -44197 -51959 -40657 -28121 -11119 7698 -24489 -52476 -59086 -60090 -58724 -35913
3927 -35913 -3207 -5861 2177 2521 7434 -580 -34018 -23054 -4735 16743 856 -26585 -33237
3914c3237J4854m278j7286k941K8303K0607q047m3609k2625K5351J4187J3283
3902a5438K0497j6817o932k1034M010m472J4129Q93K251j0738P065J8733K0994
3889A3141j6427k2010n15J0949R068k8659k27K1376J8547K5417o78l3310j6578
3876a9906j019K4062K1717k1528o946J3186j5435l3163M132J8747K1964K2121
3864B7932p481j8482j3496K5770n690l4614k0019L139J438m100J3789R408J1579
3851a0827Q470O731O759R650j297p263Q834J0749k8514j6075j1966J2468j6264
3838b8545j3164l597J1141J8006R266p242o785l4011L15P3895O450j1546m90J5542
3824B9235J3775l6149k2151O928J6368J347j1784M872J5578L599J7916p816q33
$$ plain form
3914 -33237 -18383 -22661 -39947 -42888 -14585 6022 -2025 -45634 -68259 -42908 -28721 -15438
3902 -15438 5059 -11758 -18690 -39724 -35714 -40186 -26057 -25164 -22913 -33651 -26586 -7853 13141
3889 13141 -3286 -25296 -25811 -14862 -5794 -34453 -34680 -13304 5243 30660 29982 -3328 -19906
3876 -19906 -20925 3137 24854 3326 -3620 9566 -5869 -39032 -34900 -16153 5811 27932
3864 27932 20451 1969 -11527 14243 8553 -26061 -46080 -42941 -41503 -45603 -31814 -22406 -10827
3851 -10827 -2357 4374 11133 20783 19486 12223 21057 31806 3292 -12783 -24749 -12281 -28545
3838 -28545 -41709 -45306 -34165 -16159 -6893 -14135 -20920 -54931 -54616 19279 25729 14183 13693 29235
3824 29235 43010 6861 -15290 -8362 8006 9353 -2431 2441 18019 21618 39534 31718 30885
3811C0885r233o577q531j2149m2397J1962M1834k834m245K8364k244k2921j0470
3798h556K1941n712K5407J3867k536k5175o770J503J4683J6956j4519j8153Q662
3785B1598J6834N700l338o212j0554l2320k2421R839R598K3595J1270n511K6705
3772D4783R73N192k8100k3832K0738R385j9703n15J2393j6805j8033k994M137
3759a2381m698L4254J7924j5763k0877r228n037J5765J2372k3912j4917j8869
3747d5367K3890J4385M613J2191k953j3945J519O344o80j904K1823J9373k6189
3734A3100j9424K2629j0249k8640Q068L6826K1240j8301l003J6341j2626o639
3722A9322j7164k4989k9244K2442L1931J5063p32L188M282l3296j5577J3405O651
$$ plain form
3811 30885 21652 15075 6544 -5605 -48002 -36040 5794 2960 -1285 27079 24835 1914 -8556
3798 -8556 13385 7673 33080 46947 44411 19236 12466 13969 28652 45608 31089 12936 21598
3785 21598 38432 44132 40794 34582 24028 -8292 -30713 -20874 -11276 12319 23589 18078 44783
3772 44783 45756 50948 22848 -984 19754 29139 9436 8921 21314 4509 -13524 -16518 -12381
3759 -12381 -17079 17175 35099 19336 -1541 -10769 -15806 -41 12331 -11581 -26498 -45367
3747 -45367 -21477 -7092 -2479 9712 6759 -7186 -5667 677 -3 -1907 19916 39289 13100
3734 13100 -6324 16305 6056 -22584 -14516 22310 43550 25249 22246 38587 25961 19322
3722 19322 2158 -22831 -52075 -29633 2298 17361 16629 19817 24099 -9197 -24774 -11369 -4718
3709d718l827j2628R609l863j2354j3744j582L702r935O483Q036J0580J4134R959
3695a48m5178K941J4872o352o949R892K4210J4357l3509J1352K5084l336J467
3682H703j1087j1126m835M774K064K3967K3822j9036j3964m983k2058j3297j1516
3669d8572M8889L8997k6043k9818q123J4583K6932Q694K1055N613k6138J591P363
3656C5023j4050l0840n500K4183R288O805Q819j0065j3794J882j331p176j8027
3643a4783k0662q670P656N024J8192K2092K632k3353k6917J3168m820O806K0966
3630b669L097K6892K4822j0175j7951l7628n808K2652O090j4803r971L769K5085
3617A3402j4304J8572K9733j5023r748J9263J072o680L42m806m906o781Q370J2959
$$ plain form
3709 -4718 -8545 -21173 -11564 -15427 -27781 -41525 -43107 -39405 -49340 -42857 -34821 -24241 -10107 -148
3695 -148 -45326 -42385 -27513 -33865 -40814 -30922 -6712 7645 -25864 -14512 10572 7236 8703
3682 8703 -2384 -13510 -18345 -13571 -11507 12460 36282 17246 3282 -1701 -23759 -37056 -48572
3669 -48572 317 39314 13271 -16547 -24670 -10087 16845 25539 46594 52207 26069 27660 35023
3656 35023 20973 -9867 -15367 8816 18104 24909 33728 23663 9869 11751 10420 3244 -14783
3643 -14783 -35445 -44115 -36459 -31435 -13243 8849 11481 -11872 -38789 -25621 -30441 -23635 -2669
3630 -2669 428 27320 52142 41967 24016 -13612 -19420 3232 9322 -5481 -15452 -11683 13402
3617 13402 -902 17670 47403 32380 22632 41895 42967 36287 36629 31823 26917 20136 28506 41465
3603D1465p936p238J8941R538j8009k0397j4063J6579J95k9118l0236j6117J0931
3590d5465K7627M6363j8389j6551j084O87k278R113K5849J9568k170k1645m674
3577A6951l88p363K6686j1614j6524j0271l3863o242k167q982Q518O355j972J8339
3563b2537J412P905J5715J9389O542k9093p996J9892L811l717L887n637N230K2709
3549C7512K7553l1034k5985r351Q862j722k831j5808k4156j6526K3836J3286j3041
3536b9405k376J448N607K3348J613J4814J3012k9299l881K1862r316q427M712
3523C712r644j4295j9814j8411K0581J3424K3402L058j2196j1665J4501J2083
3511D736k8442R442M7930J8047l2456k2137j3293j4287R841N629J8900j1101p185
$$ plain form
3603 41465 33529 26291 45232 54770 36761 16364 2301 18880 19075 -10043 -40279 -56396 -45465
3590 -45465 -17838 28525 10136 -6415 -7499 -6812 -9090 23 25872 45440 43270 21625 16951
3577 16951 16563 9200 35886 24272 7748 -2523 -36386 -42628 -44795 -53777 -45259 -38904 -40876 -22537
3563 -22537 -21125 -13220 2495 21884 28426 -667 -8663 11229 15040 11323 15210 9573 14803 37512
3549 37512 65065 34031 8046 -1305 7557 5835 3004 -12804 -36960 -53486 -29650 -16364 -29405
3536 -29405 -31781 -30333 -24726 -1378 235 15049 28061 -1238 -5119 16743 7427 -1000 3712
3523 3712 -5932 -20227 -40041 -58452 -37871 -24447 -1045 2013 -10183 -21848 -7347 4736
3511 4736 -23706 -14264 33666 51713 19257 -2880 -16173 -30460 -20619 -14990 3910 -7191 -14376
3498a4376m184k676J0501P510j7653O320l293J2186J1393K0247l007m2075j3901
3485c3008p93J4881J6875k1968k6124K5060P495J9385M208j1400j4669j8910K3253
3472a5715L4460P770o920j374K372j3612j5084k1929r314L9736J6828m9773j4447
3459d7002L8763J5768j5000p725M797Q350K022N144r222k2895m170L619M677j7857
3445d0731Q480j1404Q173j0163J651K6605J6635K434l890J2451J6424j1078p224
3432H363M308M840R253k000j8088k2504J8968K3627j058j7049k2316k0813j6468
3419e0937n040L4358J5943L2319p804P07K705m0Q905K684K560j7621j0720L923
3405A1942r280j1935O756l686j5099J5599J4152L4047P531k8186J6726k8960P254
$$ plain form
3498 -14376 -18560 -21236 -10735 -3225 -20878 -14558 -17851 -5665 5728 25975 22968 -19107 -33008
3485 -33008 -33801 -18920 -2045 -24013 -50137 -25077 -17582 1803 6011 -5389 -20058 -38968 -15715
3472 -15715 18745 26515 19595 18221 20593 6981 -8103 -30032 -39346 390 17218 -32555 -47002
3459 -47002 -8239 7529 -7471 -15196 -10399 -2049 -27 5117 -4105 -27000 -31170 -27551 -22874 -40731
3445 -40731 -32251 -43655 -35482 -45645 -43994 -17389 -754 1680 -2210 10241 26665 15587 8363
3432 8363 12671 17511 26764 24764 6676 -15828 3140 26767 25709 8660 -13656 -34469 -50937
3419 -50937 -55977 -21619 -5676 26643 18839 19546 22251 22211 31116 33800 36360 18739 8019 11942
3405 11942 2662 -9273 -2517 -6203 -21302 -5703 8449 42496 50027 21841 38567 9607 16861
3392A6861r896j1398k597K7309j1015k5800j2855N356K1113p790Q157J2584J3503
3379B3532o571n602n548R533J3833j7199j9459k1691J2308L6661K545j1244k3945
3366a2847K152K4764j0125q345j6427k4097J9871K7806K2629J3589J3783o934
3354D5819M267k2786k7599l3437p624R936k912M50J0503J6893K727J7960R601
3341B3798j7805J9556J5379r937p740k1640J407p941J236j6096k0298j0469J7554
3328c2996J2185J8455L872J1779k0249l1888q357j5590J8168L2631J0864L082
3316A956J2860N112J8586j1782k6801j3400J5552k7j9645J2805P357J4949l412
3303A4110k5262j8913l2118j61K0787K1205K4659Q805L277j970J50j5622K326
$$ plain form
3392 16861 6965 -4433 -7030 20279 9264 -16536 -29391 -24035 -2922 -10712 -2555 10029 23532
3379 23532 16961 11359 5811 15344 29177 11978 -7481 -29172 -16864 19797 22342 11098 -12847
3366 -12847 -10695 14069 3944 -4401 -20828 -44925 -25054 2752 25381 38970 52753 45819
3354 45819 50086 27300 -299 -33736 -41360 -31424 -34336 -33886 -23383 -6490 -3763 14197 23798
3341 23798 5993 25549 40928 30991 23251 1611 3018 -4923 -3687 -19783 -40081 -50550 -32996
3328 -32996 -20811 -2356 1516 13295 -6954 -38842 -47199 -62789 -44621 -11990 -1126 1956
3316 1956 14816 19928 38514 26732 -69 -13469 2083 2056 -17589 -4784 2573 17522 14110
3303 14110 -11152 -30065 -62183 -62344 -41557 -20352 4307 13112 16389 14419 14569 -1053 1273
3290A273Q74q163P406j4985k5172J1493K0659R120j3826J19l013J2127k6219k9912
3276e8219J7864L0820j201M70L167n212j4378J2319j7768N439M2609J8857Q07
3263C5574j677l5530r150J7556L3874J4653j3469j2089l0611k9333Q213L0594
3251H605r024j9045j798K1869J0465j3485j0230R38J0231j5708J3281M1244J9996
3238E7339j6472q927m1069j2951j3388k176L563K2642K2478o535k6712R529l992
3225a6671N970n686K722L706l576J3927J4783J2401j4419m046K4767J0799J243
3212D5920r800j8475l1454q341L641j9552J6824J1698l929J36k564J1625Q17q87
3198d341N201Q938N34j3658k26L3152P140j2787k0309J72R932K103N520j8947
$$ plain form
3290 1273 2147 -6016 1390 -13595 -38767 -27274 -6615 2505 -11321 -11202 -14215 -2088 -28307 -58219
3276 -58219 -40355 -9535 -10736 -10266 -7099 -12311 -26689 -14370 -32138 -26699 15910 34767 35574
3263 35574 33897 -1633 -10783 6773 40647 55300 41831 29742 -869 -30202 -21989 8605
3251 8605 -419 -19464 -21262 607 11072 -2413 -12643 -11705 -1474 -17182 -3901 37343 57339
3238 57339 40867 31940 -9129 -22080 -35468 -37644 -34081 -11439 11039 4504 -22208 -12679 -16671
3225 -16671 -10701 -16387 -13665 -9959 -13535 392 15175 27576 13157 9111 33878 44677 45920
3212 45920 36120 17645 -13809 -22150 -18509 -38061 -21237 -9539 -13468 -13332 -15896 -4271 -3454 -4341
3198 -4341 860 9798 10332 -3326 -3552 29600 36740 23953 3644 3816 13748 15851 21371 2424
3184B424k1620J1668J3260J0163J8631j1947k1218r882O252p790j9876J5962J0224
3171c749o452J118m890J4307j0467J4346L0701p326j0472N576k3690l972J945
3158c025k4887Q363K9180L563q683j023j025n024P383k6426o09k061j7150J2375
3144b9049K4970J2770J9888K2025J1090K4319m9215l7833p104k1984o581R544
3132b7160K5822j4405j2128O400j2272j1063l745R901J5304K1957K9461K8153
3120E6225J5415m1341L867J6495k5779j4784j2528j1034N111L1387j6444j4455
3108g865L164p205k0584L364J5509K7919n840j2611O216o965p782O013j980k116
3094a0763r131m4936l7236O018L4120L8110K0917J0909j6620l2516J0219L1129
$$ plain form
3184 2424 -19196 -7528 5732 15895 34526 22579 1361 -8521 -2269 -10059 -29935 -13973 -3749
3171 -3749 -10201 -9083 -13973 334 -10133 4213 34914 27588 17116 22692 -998 -4970 -3025
3158 -3025 -27912 -19549 9631 13194 4511 3488 2463 -2561 4822 -21604 -22213 -24274 -41424 -29049
3144 -29049 -4079 8691 28579 50604 61694 86013 36798 -1035 -8139 -30123 -36704 -27160
3132 -27160 -1338 -15743 -27871 -21471 -33743 -44806 -48551 -38650 -23346 -1389 28072 56225
3120 56225 71640 30299 34166 50661 24882 10098 -2430 -13464 -8353 23034 6590 -7865
3108 -7865 -4701 -11906 -32490 -29126 -13617 14302 8462 -4149 2067 -4898 -12680 -6667 -8647 -10763
3094 -10763 -19894 -64830 -102066 -96048 -61928 -23818 -2901 8008 -8612 -41128 -30909 220
3082B20R487O570k5834l6959j324Q234l376M801J3045j0759o676k371K2233o557
3068b9266O305M7458K3095l222k5563j5269R815l3813j9062K841L1877K6985J6095
3055C8276j520j9710k4607r075J9045K5904j5797j5485K0562n276r326j1888L590
3042e307K4020l981j4205j877o361p395j0568n140K1099k7469j9627K1292J9562
3029a5957N479k1634j1820O114K2982M1151M116J628k1889j5037j2590L2860M1640
3016E7043j0938m6705n856p749K3316K5674O483l339m4257J1955l358j2664L719
3003f676K3377J3397j6513k3907j2389J9897r266l159q828j2138o252j351K182
2990d1626K774K2299Q544j5253q618N810J5942j8080o982J576K0730J8433J610
$$ plain form
3082 220 9707 16277 -9557 -46516 -47840 -39606 -42982 -38181 -25136 -35895 -42571 -44942 -22709 -29266
3068 -29266 -22961 24497 47592 44370 18807 3538 13353 -20460 -39522 -36681 -4804 22181 38276
3055 38276 36756 17046 -7561 -16636 2409 28313 12516 -2969 17593 12317 2991 -8897 -5307
3042 -5307 18713 14732 527 -1350 -7711 -15106 -25674 -30814 -9715 -37184 -56811 -35519 -15957
3029 -15957 -10478 -32112 -43932 -37818 -14836 26315 30431 32059 10170 -4867 -17457 15403 57043
3016 57043 46105 -600 -6456 -14205 9111 34785 41268 37929 -6328 5627 2269 -10395 -6676
3003 -6676 16701 30098 13585 -10322 -22711 -2814 -12080 -15239 -24067 -36205 -42457 -43808 -41626
2990 -41626 -38852 -16553 -8009 -23262 -31880 -26070 -10128 -28208 -35190 -33614 -12884 5549 7159
2977G159o766j63J4019l110o470k0869j4032J4063L5131L09j4690J7421Q675k0746
2963I931k2674O911r676l6054J4771J620o135J7116J1224l932j789J7557Q797
2950G667k87M758K6031J5072J7410k8746l3531J946k5101j9183J9851j2791k284
2937b9188L2717r52j5178j4240j1070j749J6884N334j2902K1576O964P391K5768
2924C1355J0407j2186n357l2976l75Q718J6778L2722k824j002K17k1131k7318
2911b972k975O920J6794O778r244k0546K609o880j448o467R215P581k1914k711
2897b5260J5230q107k425r866J839k8235o848J9153j4896P038N6536K4734l5524
2884f631K021J5176q588Q235P798r972r475P504Q609k2170m37K1480j8515o131
$$ plain form
2977 7159 393 230 14249 11139 4669 -16200 -30232 -16169 18962 19271 4581 22002 30677 9931
2963 9931 -12743 -5832 -15508 -51562 -36791 -35171 -41306 -24190 -12966 -16898 -18687 -1130 7667
2950 7667 7380 12138 38169 53241 70651 41905 8374 10320 -14781 -33964 -14113 -26904 -29188
2937 -29188 3529 2577 -12601 -26841 -37911 -39660 -22776 -17442 -30344 -8768 -1804 5587 31355
2924 31355 41762 29576 24219 -8757 -9132 -414 16364 49086 46262 45260 45477 24346 -2972
2911 -2972 -5947 973 17767 24545 15301 -5245 -2636 -9516 -10964 -17431 -8216 -635 -22549 -25260
2897 -25260 -10030 -18137 -20562 -30428 -28589 -56824 -63672 -44519 -59415 -52377 4159 28893 -6631
2884 -6631 -4610 10566 1978 10213 18011 8039 -1436 6068 14677 -7493 -7930 13550 -4965 -11096
2870a1096R379L652j2681Q281L4796L881R943j5456j8902p238j3706j0641J3589
2857f199o310J6179J1150J394L894r899p998J0848j8569l0834J5357K6686J099
2844F798j932J3768k2125k7938J5128M2575q949J08j65j2323J8996j0532l1672
2831a8263m476j8204K044M1479L866r034m770q307P569J9799J0385q592O225J172
2817B0893k4812l0606L769J3669J8808R53j0557K484r881K3997J2115o057k7663
2804a2888j6870J3529R953j8163J9030K143J9610J1449j3097k5330j4657j0467
2792c5758J1077J846p441l447l138J8951N5350L199j8879j8790j2896R865l1386
2779c1447Q289L6170n078l3057k633R414K191K0947P194j8655J0509r277j1078
$$ plain form
2870 -11096 -1717 1935 -10746 -2465 32331 36212 46155 30699 11797 4559 -9147 -19788 -6199
2857 -6199 -12509 3670 14820 16214 20108 10209 2211 13059 -5510 -36344 -20987 5699 6798
2844 6798 4866 18634 -3491 -31429 -16301 26274 17325 17433 17268 4945 23941 13409 -18263
2831 -18263 -22739 -40943 -38899 2580 6446 -2588 -7358 -15665 -8096 11703 22088 13496 19721 20893
2817 20893 -3919 -34525 -30756 -17087 1721 2674 -7883 -5399 -15280 8717 20832 14775 -12888
2804 -12888 -29758 -16229 -6276 -24439 -5409 -3266 16344 27793 14696 -10634 -25291 -35758
2792 -35758 -24681 -22835 -30276 -33723 -36861 -17910 37440 40639 21760 2970 -9926 -61 -31447
2779 -31447 -23158 13012 7934 -25123 -27756 -18342 -16151 4796 11990 -6665 3844 -5433 -16511
2766a6511J1132O037k883J48j6340R71J4583Q543n99J934K1480k1524Q651P379
2752B3001o24n21k120j0397l3659j9699m576K8181M2985L70l0889P5M728O981
2738C836J5304j5120J4126j933j6255J1011O857m352j652Q99o636k6587j5871
2725c6373L5880R233r939k3119j2710K2821j398j6351k35q590q713P711K6152
2712a5631K1435O734J2159j5639j9223j358j0689K0223K8590j340m982k0472k1922
2699b2115j8514n129J1222J4469K5504K5628m239R316k680j9428j0710L239j046
2686E517k7591k5263l0507O290J7330J8150J3460M751l885j5688J210P199j706
2673c0733k302J096o633J2457j1243K366K1356K7631N586k1616j5310J7995j4595
$$ plain form
2766 -16511 -5379 658 -2225 -2077 -18417 -17446 -2863 5680 5081 7015 28495 6971 15622 23001
2752 23001 22377 21856 19736 9339 -24320 -44019 -48595 -20414 22571 22941 -7948 -7873 -3145 3836
2738 3836 19140 4020 18146 16213 -42 10969 17826 13474 11822 12721 6085 -20502 -36373
2725 -36373 -493 8740 -1199 -24318 -37028 -14207 -15605 -31956 -32191 -40781 -49494 -41783 -15631
2712 -15631 5804 12538 24697 9058 -10165 -11523 -22212 -1989 26601 25261 20279 -193 -22115
2699 -22115 -40629 -45758 -34536 -20067 5437 31065 26826 36142 33462 14034 3324 6563 5517
2686 5517 -22074 -47337 -77844 -71554 -54224 -36074 -22614 -17863 -21748 -37436 -36226 -29027 -30733
2673 -30733 -33035 -31939 -38572 -26115 -37358 -34992 -13636 13995 19581 -2035 -17345 650 -13945
$$ [...]
##END NTUPLES=NMR SPECTRUM
##END=
