##TITLE=Analysis number 322730
Compound Code tl 00212
Project Code adrs
Chemist Name ugmt
##JCAMPDX= 6.0         $$ Bruker NMR JCAMP-DX V2.0
##DATA TYPE= NMR SPECTRUM
##DATA CLASS= NTUPLES
##ORIGIN= Bruker BioSpin GmbH
##OWNER= nmr
$$ XWIN-NMR		Version 3.5
$$ Sat Oct 14 11:47:53 2006 GMT Daylight Time (UT+1h)  MAYBRIDGE\nmr@NMR_250MHZ
##.OBSERVE FREQUENCY= 250.131544655141
##.OBSERVE NUCLEUS= ^1H
##.ACQUISITION MODE= SIMULTANEOUS (DQD)
##.ACQUISITION SCHEME= undefined
##.AVERAGES= 16
##.DIGITISER RES= 18
##SPECTROMETER/DATA SYSTEM= dpx250
##.PULSE SEQUENCE= zg30
##.SOLVENT NAME= CDCl3
##.SHIFT REFERENCE= (INTERNAL, CDCl3, 0, 16.522)
##AUDIT TRAIL= $$ (NUMBER, WHEN, WHO, WHERE, WHAT)
$$ ##TITLE= Audit trail, XWIN-NMR		Version 3.5
$$ ##JCAMPDX= 5.01
$$ ##ORIGIN= Bruker BioSpin GmbH
$$ ##OWNER= nmr
$$ C:\u/data/dgb/nmr/ADRS/320/pdata/1/auditp.txt
$$ ##AUDIT TRAIL=  $$ (NUMBER, WHEN, WHO, WHERE, WHAT)
(   1,<2006-10-14 11:47:32.42 +100>,<MAYBRIDGE\nmr>,<NMR_250MHZ>,
      <created by zg, POWCHK disabled, PULCHK disabled
       configuration hash MD5:
       49 4B E0 1D 92 C2 6B 37 9F E6 65 BC 52 41 86 1D
       data hash MD5: 64K
       59 13 B3 3E 70 EF 31 C3 1A 17 41 7F 51 9F 22 BE>)
(   2,<2006-10-14 11:47:44.49 +100>,<MAYBRIDGE\nmr>,<NMR_250MHZ>,
      <Start of raw data processing
       ef LB = 0.3 FT_mod = 6 PKNL = 1 SI = 32K 
       data hash MD5: 32K
       9C 7F B7 0D A2 68 B3 78 7F 9F E0 18 D5 75 7B 86>)
(   3,<2006-10-14 11:47:46.35 +100>,<MAYBRIDGE\nmr>,<NMR_250MHZ>,
      <apk 
       data hash MD5: 32K
       13 48 FA 23 64 01 D4 1E 3F AF DC 26 36 AF 00 A1>)
(   4,<2006-10-14 11:47:47.20 +100>,<MAYBRIDGE\nmr>,<NMR_250MHZ>,
      <abs ABSG = 5 
       data hash MD5: 32K
       4F 71 D9 36 CB F6 BB A5 0C 62 F7 F8 2E B2 BE AA>)
$$ ##END=
$$ 
$$ hash MD5
$$ 46 57 3A F5 72 2E 2A FD 6E D4 69 A6 43 35 7D 27
##$RELAX= 
##$RELAX= 
##$RELAX= 
##$RELAX= 
##$RELAX= 
##$RELAX= 
##$RELAX= 
$$ Bruker specific parameters
$$ --------------------------
##$DU= <C:\u>
##$EXPNO= 320
##$NAME= <ADRS>
##$PROCNO= 1
##$TYPE= <nmr>
##$USER= <dgb>
##$AMP= (0..31)
100 100 100 100 100 100 100 100 100 100 100 100 100 100 100 100 100 100 
100 100 100 100 100 100 100 100 100 100 100 100 100 100 
##$AQSEQ= 0
##$AQ_mod= 3
##$AUNM= <au_zg>
##$AUTOPOS= <9 >
##$BF1= 250.13
##$BF2= 250.13
##$BF3= 250.13
##$BF4= 250.13
##$BF5= 500.13
##$BF6= 500.13
##$BF7= 500.13
##$BF8= 500.13
##$BYTORDA= 1
##$CFDGTYP= 0
##$CFRGTYP= 5
##$CHEMSTR= <none>
##$CNST= (0..31)
1 1 145 1 1 1 1 1 1 1 1 1 1 1 1 1 1 1 1 1 1 1 1 1 1 1 1 1 1 1 1 1 
##$CPDPRG= <>
##$CPDPRG1= <>
##$CPDPRG2= <>
##$CPDPRG3= <>
##$CPDPRG4= <mlev>
##$CPDPRG5= <mlev>
##$CPDPRG6= <mlev>
##$CPDPRG7= <mlev>
##$CPDPRG8= <mlev>
##$CPDPRGB= <>
##$CPDPRGT= <>
##$D= (0..31)
0 1 0 0 0 0 0 0 0 0.06 0 0 0 0 0 0 0.0002 0 0 0 0 0 0 0 0 0 0 0 0 0 0 
0 
##$DATE= 1160822851
##$DBL= (0..7)
120 120 120 120 120 120 120 120 
##$DBP= (0..7)
150 150 150 150 150 150 150 150 
##$DBP07= 0
##$DBPNAM0= <>
##$DBPNAM1= <>
##$DBPNAM2= <>
##$DBPNAM3= <>
$$ [...]
##$SUBNAM7= <"">
##$SUBNAM8= <"">
##$SUBNAM9= <"">
##$SW= 20.6930455092707
##$SWIBOX= (0..15)
0 0 3 0 0 0 0 0 0 0 0 0 0 0 0 0 
##$SW_h= 5175.983436853
##$TD= 65536
##$TD0= 1
##$TE= 683.16
##$TE2= 300
##$TE3= 300
##$TEG= 300
##$TL= (0..7)
0 120 120 120 120 120 120 120 
##$TP= (0..7)
150 150 150 150 150 150 150 150 
##$TP07= 0
##$TPNAME0= <>
##$TPNAME1= <>
##$TPNAME2= <>
##$TPNAME3= <>
##$TPNAME4= <>
##$TPNAME5= <>
##$TPNAME6= <>
##$TPNAME7= <>
##$TPOAL= (0..7)
0.5 0.5 0.5 0.5 0.5 0.5 0.5 0.5 
##$TPOFFS= (0..7)
0 0 0 0 0 0 0 0 
##$TUNHIN= 0
##$TUNHOUT= 0
##$TUNXOUT= 0
##$USERA1= <user>
##$USERA2= <user>
##$USERA3= <user>
##$USERA4= <user>
##$USERA5= <user>
##$V9= 5
##$VALIST= <valist>
##$VCLIST= <CCCCCCCCCCCCCCC>
##$VD= 0
##$VDLIST= <DDDDDDDDDDDDDDD>
##$VPLIST= <PPPPPPPPPPPPPPP>
##$VTLIST= <TTTTTTTTTTTTTTT>
##$WBST= 1024
##$WBSW= 4
##$XGAIN= (0..3)
0 0 0 0 
##$XL= 0
##$YL= 0
##$YMAX_a= 623701
##$YMIN_a= -629494
##$ZGOPTNS= <>
##$ZL1= 120
##$ZL2= 120
##$ZL3= 120
##$ZL4= 120
##$ABSF1= 16.522
##$ABSF2= -4.171173
##$ABSG= 5
##$ABSL= 3
##$ALPHA= 0
##$AQORDER= 0
##$ASSFAC= 0
##$ASSFACI= 0
##$ASSFACX= 0
##$ASSWID= 0
##$AUNMP= <proc_1d>
##$AZFE= 0.1
##$AZFW= 0.1
##$BCFW= 0
##$BC_mod= 0
##$BYTORDP= 0
##$COROFFS= 0
##$CY= 12.5
##$DATMOD= 1
##$DC= 0
##$DFILT= <>
##$DTYPP= 0
##$F1P= 14.0000005364418
##$F2P= -0.99999901652339
##$FCOR= 0.5
##$FTSIZE= 32768
##$FT_mod= 6
##$GAMMA= 0
##$GB= 0
##$INTBC= 1
##$INTSCL= 1
##$ISEN= 128
##$LB= 0.3
##$LEV0= 0
##$LPBIN= 0
##$MAXI= 10000
##$MC2= 0
##$MEAN= 0
##$ME_mod= 0
##$MI= 0
##$NCOEF= 0
##$NC_proc= -3
##$NLEV= 6
##$NOISF1= 0
##$NOISF2= 0
##$NSP= 0
##$NTH_PI= 0
##$NZP= 0
##$OFFSET= 16.522
##$PC= 1
##$PHC0= -46.37157
##$PHC1= 4.977156
##$PH_mod= 1
##$PKNL= yes
##$PPARMOD= 0
##$PSCAL= 4
##$PSIGN= 0
##$REVERSE= no
##$SF= 250.13
##$SI= 32768
##$SIGF1= 0
##$SIGF2= 0
##$SINO= 400
##$SIOLD= 32768
##$SREGLST= <1H.CDCl3>
##$SSB= 0
##$STSI= 32768
##$STSR= 0
##$SW_p= 5175.98343685301
##$SYMM= 0
##$S_DEV= 0
##$TDeff= 65536
##$TDoff= 0
##$TI= <Analysis number 999999
Compound Code 99
Book Reference 9
Project Code 9>
##$TILT= no
##$TM1= 0
##$TM2= 0
##$TOPLEV= 0
##$USERP1= <user>
##$USERP2= <user>
##$USERP3= <user>
##$USERP4= <user>
##$USERP5= <user>
##$WDW= 1
##$XDIM= 32768
##$YMAX_p= 555935677
##$YMIN_p= -56934
$$ End of Bruker specific parameters
$$ ---------------------------------
##NTUPLES= NMR SPECTRUM
##VAR_NAME=  FREQUENCY,     SPECTRUM/REAL,   SPECTRUM/IMAG
##SYMBOL=    X,             R,               I
##VAR_TYPE=  INDEPENDENT,   DEPENDENT,       DEPENDENT
##VAR_FORM=  AFFN,          ASDF,            ASDF
##VAR_DIM=   32768,         32768,           32768
##UNITS=     HZ,            ARBITRARY UNITS, ARBITRARY UNITS
##FACTOR=    0.157963299565203, 1,           1
##FIRST=     4132.6476996994, 0,             0
##LAST=      -1043.33573715361, 0,           0
##MIN=       -1043.33573715361, -56934,      0
##MAX=       4132.6476996994, 555935677,     0
$$ Real data points
##PAGE= N=1
##DATA TABLE= (X++(R..R)), XYDATA
$$ [...]
14749d512m981o612L163k2366j1707K1431J4003L026l976j0675o704N243J4169
$$ -4512 -9493 -16105 -12942 -35308 -47015 -25584 -11581 -8555 -12531 -23206 -29910 -24667 -10498
14736a0498R750l704n778O481l215L408J484j1208m744j0597j678J5884N182m381
$$ -10498 -748 -4452 -10230 -3749 -6964 -3556 -2072 -13280 -18024 -28621 -30299 -14415 -9233 -13614
14722a3614j0633r168o465J2120J1336J1028j0118q298J6716N619j2919M777k154
$$ -13614 -24247 -33415 -39880 -27760 -16424 -5396 -15514 -23812 -7096 -1477 -14396 -9619 -11773
14709a1773j0193J3414R226j6437j1201R662k107j2733M363J1834r291j0776r31
$$ -11773 -21966 -8552 674 -15763 -26964 -17302 -19409 -32142 -27779 -15945 -25236 -36012 -36943
14696c6943O542J029J5006J1796m572l872n855O703%Q599j565j5507o452j19J1067
$$ -36943 -30401 -29372 -14366 -2570 -7142 -11014 -16869 -10166 -10166 -1567 -3132 -18639 -25091 -25210 -14143
14681a4143J0616q422p51N694n495j1746j379L317N904J6442K571n641l75l640
$$ -14143 -3527 -11949 -12700 -7006 -12501 -24247 -25626 -22309 -16405 37 2608 -3033 -3408 -7048
14667g048j0626R133R671O189L964k227k130j0317q018p311R08J4326J2704o033
$$ -7048 -17674 -8541 1130 7319 11283 9056 6926 -3391 -11409 -18720 -17812 -3486 9218 3185
14653C185r090m151J1298k314j3845p517J0991n326l960j933J92J0017Q894p256
$$ 3185 -5905 -10056 1242 -1072 -14917 -22434 -11443 -16769 -20729 -22662 -22470 -12453 -3559 -10815
14639a0815l372J4080j394j7447o64k002L217J1759J471O901J803l415L545M542
$$ -10815 -14187 -107 -1501 -18948 -19612 -21614 -18397 -6638 -5167 1734 3537 122 3667 8209
14625H209K036n488n151r083k694l080N469J241L047j2473J132J127L935n329
$$ 8209 10245 4757 -394 -9477 -12171 -15251 -9782 -8541 -5494 -17967 -16835 -15708 -11773 -17102
14611a7102O337L29p627j467J085n812j749Q237J4924Q398q060p040O848k907
$$ -17102 -10765 -10436 -18063 -19530 -18445 -24257 -26006 -17769 -2845 5553 -2507 -9547 -2699 -5606
14597e606p831L927J0675j483m15m796o890j4462R212J3303J925N726J1348r977
$$ -5606 -13437 -9510 1165 -318 -733 -5529 -12419 -26881 -17669 -4366 -2441 3285 14633 4656
14583D656L547k016p557j2497Q207Q05J460l683O161o46m65P166J1795L253l444
$$ 4656 8203 6187 -1370 -13867 -5660 -4855 -3395 -7078 -917 -1563 -2028 5138 16933 20186 16742
14568A6742l4j6318j5998j923l00R755R489n47L060o643m116J0584K430j0129
$$ 16742 16708 390 -15608 -17531 -17831 -8076 1413 866 3926 -2717 -6833 3751 6181 -3948
14554c948j5165j2989M525k231J0159K595J0766M222l709J6588r288j4735J1506
$$ -3948 -19113 -32102 -27577 -29808 -19649 -17054 -6288 -2066 -5775 10813 1525 -13210 -1704
14541a704m404J496N154K03J7986Q676k0879j1225p389K129p686o754m664l314
$$ -1704 -6108 -4612 542 745 18731 27407 6528 -4697 -12086 -9957 -17643 -24397 -29061 -32375
14527c2375n175n553J8954J4000j1048m178J746J248J679k871K165M146j2271
$$ -32375 -37550 -43103 -24149 -10149 -21197 -25375 -23629 -22381 -20702 -23573 -21408 -17262 -29533
14514b9533j071J2289K809N765J1887j413j6796l747M277p92M614k477m795j805
$$ -29533 -30604 -18315 -15506 -9741 2146 733 -16063 -19810 -15533 -16325 -11711 -14188 -18983 -20788
14500b0788L773K2193Q264j0660l345R835R102j6883k0510J76J3524J9147O8j6043
$$ -20788 -17015 5178 13442 2782 -563 9272 18374 1491 -19019 -18843 -5319 13828 13896 -2147
14486b147l085M521m840m362k84K42R224J560p107j0439K853L722m34j420P001
$$ -2147 -5232 -711 -5551 -9913 -10197 -9955 -731 829 -6278 -16717 -13864 -10142 -10576 -11996 -4995
14471d995L022k056L743j5586O301k97J5184m22m869N727o143p336o781m375R45
$$ -4995 -1973 -4029 -286 -15872 -9571 -9868 5316 4894 25 5752 -391 -7727 -14508 -18883 -17938
14456a7938K230K11J41M242O215n709r492l108n244n098J7809O193n771r646J864
$$ -17938 -15708 -15497 -15356 -11114 -4899 -10608 -20100 -23208 -28452 -33550 -15741 -9548 -15319 -24965 -23101
14441b3101J3638N455J527J268M588o660n596q052J14L331l274O247j6159n057
$$ -23101 -9463 -4008 -2481 -1213 3375 -3285 -8881 -16933 -16819 -13488 -16762 -10515 -26674 -31731
14427c1731J6403J1783J1694K394K568M112j5637o814k854n570N663P024J5063
$$ -31731 -15328 -3545 8149 10543 13111 17223 1586 -5228 -8082 -13652 -7989 -965 14098
14414A4098k140o728m481n117P245l922q570J0031J3827p419j5720n562k374N689
$$ 14098 11958 5230 749 -4368 2877 -1045 -9615 416 14243 6824 -8896 -14458 -16832 -11143
14400a1143O393M804P168j1444m067M014J489L03m905j6847n236M229j425o539
$$ -11143 -4750 54 7222 -4222 -8289 -4275 -2786 -2483 -7388 -24235 -29471 -25242 -26667 -33206
14386c3206l802L583J1633Q493J2718k165K524L603N74m916m30L336J4160j0414
$$ -33206 -37008 -33425 -21792 -13299 -581 -2746 -222 3381 3955 -961 -1391 1945 16105 5691
14372E691j3912j993J3582J48J259P216L872O242j2181p977J0153P489p655q197
$$ 5691 -8221 -10214 3368 3516 4775 11991 15863 22105 9924 1947 12100 19589 11934 3737
14358C737k181n341O149J40J829l401j9993j86Q877J1880J820j1047o170q804
$$ 3737 1556 -3785 2364 2504 4333 932 -19061 -19247 -10370 1510 3330 -7717 -13887 -22691
14344b2691M707Q237m282J0496K311j0415p238N609J1997Q134p91q052M88M445
$$ -22691 -17984 -9747 -14029 -3533 -1222 -11637 -18875 -13266 -1269 6865 6074 -1978 -1490 2955
14330B955N84l771J940P064j6373p55m705n780m757n852J7011Q032N238M270k962
$$ 2955 3539 -232 1708 8772 -7601 -8356 -13061 -18841 -23598 -29450 -12439 -4407 831 5101 2139
14315B139k064J5876j317q31K1r376j2352k349O370j1896K05m648q10j654J375
$$ 2139 75 15951 14634 13803 13824 4448 -7904 -10253 -3883 -15779 -15574 -20222 -21032 -22686 -21311
14300b1311L864k715J581R983L429l938j860J500m654L118M467J5605k396K405
$$ -21311 -17447 -20162 -18581 -8598 -5169 -9107 -10967 -9467 -14121 -11003 -6536 9069 6673 9078
14286I078K465O690n716l753M502q74l396L413o16j0185K556j0613j1403r005
$$ 9078 11543 18233 12517 8764 13266 12392 8996 12409 11793 1608 4164 -6449 -17852 -26857
14272b6857J6759M528p629j2013J705K183m081o044l694p036M03K485K1314j4160
$$ -26857 -10098 -5570 -13199 -25212 -23507 -21324 -25405 -31449 -35143 -42179 -41776 -39291 -17977 -32137
14258c2137P252K0593O13J4868j0582p936j1023J7124j2563J722r000R080M873
$$ -32137 -24885 -4292 -3679 11189 607 -7329 -18352 -1228 -13791 -12069 -21069 -11989 -7116
14245g116l890j36Q550l565j6374Q051J1297P377j973r518o979j6069J600q878
$$ -7116 -11006 -11142 -2592 -6157 -22531 -14480 -3183 4194 2221 -7297 -14276 -30345 -28745 -37623
14231c7623n453R046J2337L930q594M05J990P569R062r916P256J5350n326L99
$$ -37623 -43076 -34030 -21693 -17763 -26357 -25952 -23962 -16393 -7331 -17247 -9991 5359 33 432
14217D32R25j0424K537J1502R430L192N27o478r590q618Q083P676P648o907q421
$$ 432 1357 -9067 -6530 4972 14402 17594 18121 11643 2053 -6565 1518 9194 16842 9935 1514
14202A514j3723r207N799P440n251Q27L327Q454j0910r994k734o652L033K8234
$$ 1514 -12209 -21416 -15617 -8177 -13428 -12601 -9274 -820 -11730 -21724 -24458 -31110 -28077 157
14188A57K9194j0010k7912p799M115K2731m175m400r537P720j850J024j0751n650
$$ 157 29351 19341 -8571 -16370 -12255 10476 6301 1901 -7636 84 -1766 -742 -11493 -17143
14174a7143j637o321k981p382l795J5930J4025N189P059J889J1525m483j200j2579
$$ -17143 -18780 -25101 -28082 -35464 -39259 -23329 -9304 -4115 2944 4833 16358 11875 10675 -1904
14160a904J511j2677l315K192J6597P27j4160l463o868p195k856m890J7002J3771
$$ -1904 -393 -13070 -16385 -14193 2404 3131 -11029 -14492 -21360 -28555 -31411 -36301 -19299 -5528
14146e528M607K158q633m512l221j2339o256J3022R983l341p435k800J4731O858
$$ -5528 -921 1237 -7396 -11908 -15129 -27468 -33724 -20702 -10719 -14060 -21495 -24295 -9564 -2706
14132b706n698k222P406n44q371L667M569R6O682j6581j4473J0656N617J446Q833
$$ -2706 -8404 -10626 -3220 -3764 -12135 -8468 -3899 -3803 2879 -13702 -28175 -17519 -11902 -10456 -1623
14117a623L546m795r203Q687n178j1558L339N639J1918j621o869P617o014R47
$$ -1623 1923 -2872 -12075 -3388 -8566 -20124 -16785 -11146 772 -849 -7718 -101 -6115 -5168
14103e168J0501J9091L2837M0131O411J7782n143m0256m1072j4399o835n001j1408
$$ -5168 5333 24424 57261 97392 103803 121585 116442 76186 35114 20715 13880 8879 -2529
14090b529p64m132l566K181l442J037P357N908M88o954J845Q19O052Q537K478
$$ -2529 -3293 -7425 -10991 -8810 -12252 -11215 -3858 2050 2538 -4416 -2571 -1752 4300 12837 15315
14075A5315j0022k322J493r638j5946N798J68m813N806N316Q961n003J4977J3381
$$ 15315 5293 2971 4464 -5174 -21120 -15322 -15154 -19967 -14161 -8845 116 -4887 10090 23471
14061B3471J047j3368Q490J5616J9739M416j6128M661j223K487q331j9273j7258
$$ 23471 24518 11150 19640 35256 54995 59411 43283 47944 46721 49208 40877 21604 4346
14048D346q691m346n425k643J5838n946L945n09M164J4041k820J6927R769J2652
$$ 4346 -4345 -8691 -14116 -16759 -921 -6867 -2922 -3431 733 14774 11954 28881 38650 51302
14034E1302M829R544P004j4295j0584j4990j2915Qp331l306l460O411J5586p523
$$ 51302 56131 65675 72679 58384 47800 32810 19895 19903 12572 9266 5806 12217 27803 20280
14020B0280n621r780J474j0329j2079J5762K4537J869j1264l217l042l001M229
$$ 20280 14659 4879 6353 -3976 -16055 -293 24244 26113 14849 11632 8590 5589 9818
14007I818K09j5784k256J365P048J721J915M216j0458l566J526J455L344J000
$$ 9818 10027 -5757 -8013 -6648 400 2121 4036 8252 -2206 -5772 -4246 -2791 553 1553
13993A553k248q8M842N833j5709N46r355p399j180n113j269P321l928j2390K189
$$ 1553 -695 -783 4059 9892 -5817 -5271 -14626 -22025 -23205 -28318 -29587 -22266 -26194 -38584 -36395
13978c6395J4729O806p632Q575O27Q668N244j3652j559O646L885m064k651p70
$$ -36395 -21666 -14860 -22492 -13917 -13290 -4622 622 -13030 -14589 -7943 -4058 -8122 -10773 -11543
13964a1543m760j732J2429r983o159p584L581m639N907O1m86L152Q425J1026k984
$$ -11543 -16303 -18035 -5606 -15589 -21748 -29332 -25751 -30390 -24483 -24422 -24908 -21756 -13331 -2305 -5289
13949e289n300p922m983J1933Q196N786K874m277J09J130n258O95O37N991j058
$$ -5289 -10589 -18511 -23494 -11561 -3365 2421 5295 1018 1127 2257 -3001 -2306 -1669 4322 3264
13934C264O497j8M574q77j0287p857p29K560n226r209O41q878l076P417J256N099
$$ 3264 9761 9743 14317 13440 3153 -4704 -5433 -2873 -8099 -17308 -16667 -25545 -28621 -21204 -19948 -14849
13918a4849k481j3402R329J2299R284m237o542J1055N527L143q09r528n957Q098
$$ -14849 -17330 -30732 -21403 -9104 180 -4057 -10599 456 5983 9126 8317 -1211 -7168 930
13904I30j1893r744j0612Q50R439K921l296j901K345R84K75n611J15j550j331
$$ 930 -10963 -20707 -31319 -30469 -21030 -18109 -21405 -23306 -20961 -19977 -19702 -25313 -25198 -26748 -28079
13889b8079J1348J0515O639J165j2653j997R11q03K701j4877P986J3286N282n088
$$ -28079 -16731 -6216 423 1588 -11065 -13062 -12151 -12954 -10253 -25130 -17144 -3858 1424 -3664
13875c664k3928r804J3336J1242K538K178N930K093m568j0038n855L07N172J10
$$ -3664 -27592 -37396 -24060 -12818 -10280 -8102 -2172 -79 -4647 -14685 -20540 -20233 -15061 -14951
13861a4951j1848l985P185R708L552q383O728k251l685o269Q679k394J4310Q79
$$ -14951 -26799 -30784 -23599 -13891 -10339 -18722 -11994 -14245 -17930 -24199 -15520 -17914 -3604 -2725
13847b725j2912j3413K595K8662L589r45K569r410j9300j1399J2429K1180L07
$$ -2725 -15637 -29050 -26455 2207 5796 4851 7420 -1990 -21290 -32689 -20260 920 1227
13834A227o276p156j3305o83J0907Q555Q405L663k298j0013o465Q888n720l870
$$ 1227 -5049 -12205 -25510 -26193 -15286 -6731 1674 5337 3039 -6974 -13439 -4551 -10271 -14141
13820a4141j471j70O255p90P12Q54l397Q415j0695j2271k274J4303O618l836o93
$$ -14141 -15612 -15782 -9527 -10317 -9605 -8751 -12148 -3733 -14428 -26699 -28973 -14670 -8052 -11888 -12581
13805a2581K364M402P776J9486m73j1450L257R457j5565r849R243q40j0522J0334
$$ -12581 -10217 -5815 1961 21447 20974 9524 12781 22238 6673 -3176 6067 5227 -5295 5039
13791E039n51n421q799r195K123M287M133J8192o586k2449j4252j537K2113k343
$$ 5039 4488 -933 -9732 -18927 -16804 -12517 -8384 9808 3222 -19227 -33479 -35016 -12903 -15246
13777a5246L071K089P403J971p683j25J2868L883J5068n524j4866j255R64Q177
$$ -15246 -12175 -10086 -2683 -712 -8395 -8520 4348 8231 23299 17775 2909 1654 2618 10795
13763A0795l941j6259j4139J8121J5411O05m322j2498j0542P492j1931q159R40
$$ 10795 6854 -9405 -23544 -5423 9988 10593 6271 -6227 -16769 -9277 -21208 -29367 -28427
13750b8427l749N100M120O992q991j0410N698J3122N712k338k15O698P591L319
$$ -28427 -32176 -27076 -22956 -15964 -24955 -35365 -29667 -16545 -10833 -13171 -13386 -6688 903 4222
13736D222p065j299l242j3369n154P889m737J7405Q210j855k3779k247j6108K5495
$$ 4222 -2843 -4142 -7384 -20753 -25907 -18018 -22755 -5350 2860 1005 -22774 -25021 -41129 -15634
13722a5634J4112J3160J4418p089r280j5916o793q196k017L093N166L011O057
$$ -15634 -1522 11638 26056 18967 9687 -6229 -13022 -21218 -23235 -20142 -14976 -11965 -5908
13709e908j5262k699J6097o23l868l04M003K303M782K053m666M533j481o738j605
$$ -5908 -21170 -23869 -7772 -8395 -12263 -12567 -8564 -6261 -1479 574 -4092 441 -1040 -7778 -9383
13694i383J752J221q449R52n533K839o950J1649J4653q546K174j151K542J2795
$$ -9383 -7631 -6410 -14859 -13907 -19440 -16601 -23551 -11902 2751 -5795 -3621 -4772 -2230 10565
13680A0565J591M842o615p877o324n469r840m816K459K928J3166J0442q525j1442
$$ 10565 12156 16998 10383 2506 -3818 -9287 -19127 -23943 -21484 -18556 -5390 5052 -3473 -14915
13666a4915p423j733O002J6729j182K92J1785O412j266o479K762j1761p932l197
$$ -14915 -22338 -24071 -18069 -1340 -2522 -2230 9555 15967 14701 8222 10984 -777 -8709 -11906
13652a1906J4306P866j679k254o466K048j5117j0185o710l607p05O610J3203m520
$$ -11906 2400 10266 8587 6333 -133 1915 -13202 -23387 -30097 -33704 -34409 -27799 -14596 -19116
13638a9116l092K2m120j144O124N988J1478J031R54j545M72o375l49J788j354
$$ -19116 -22208 -22186 -26306 -27450 -21326 -15338 -3860 -2829 -1875 -3420 -2948 -9323 -9672 -7884 -9238
13623i238N401M90P524J1023n874k864M026j721j0474m756l855p106n028K2418
$$ -9238 -3837 -3347 4177 15200 9326 6462 10488 8767 -1707 -6463 -10318 -17424 -22452 -34
13609c4P19J166J2226j320j3160j0172J2041O465L55J453M686k3612j2964j3494
$$ -34 685 1851 14077 12757 -403 -10575 1466 7931 8286 9739 14425 -9187 -22151 -35645
13595c5645J292K0921R304R0J7066Q216J224j1481j3054K894J2958M144o367j386
$$ -35645 -34353 -13432 -4128 -4038 13028 21244 22468 10987 -2067 827 13785 17929 11562 10176
13581A0176J1097j145j2604p515O807p07r426r696p66N690Q524N381p155o890
$$ 10176 21273 20128 7524 9 6816 6109 -3317 -13013 -13779 -8089 435 5816 -1339 -8229
13567h229n450M998J264N933J5855p486j0778N565j266m946j4318l159N849l156
$$ -8229 -13679 -8681 -7417 -1484 14371 6885 -3893 1672 406 -4540 -18858 -22017 -16168 -19324
13553a9324Q06L241O9J13K357O461M460j468L607o652r896L310r421o759O760
$$ -19324 -18518 -15277 -15208 -15095 -12738 -6277 -1817 -3285 322 -6330 -16226 -12916 -22337 -29096 -22336
13538b2336K3653M859J816j6976j1243l895m010J2498j0228Q450R549J3021n28
$$ -22336 1317 6176 7992 -8984 -20227 -24122 -28132 -15634 -25862 -17412 -7863 5158 4630
13525D630r182O20k703j2898N437L319q077k874N897M778L594Q623O032j5465
$$ 4630 -4552 -3932 -6635 -19533 -14096 -10777 -18854 -21728 -15831 -11053 -7459 1164 7196 -8269
13511h269J000j157r753L672J5838R09j1490j1862N833J4343M470m062j2441j5202
$$ -8269 -7269 -8426 -18179 -14507 1331 2240 -9250 -21112 -15279 -936 3534 -528 -12969 -28171
13497b8171P198k895k987L150L04N105Q310Q928Q267j312p531J4143p91k1287
$$ -28171 -20973 -23868 -26855 -23705 -23401 -18296 -9986 -1058 7209 5897 -1634 12509 11718 -9569
13483i569m250J4452J565K078M678p81j1083l485o604j129J2125m770m327n56
$$ -9569 -13819 633 2198 4276 8954 8173 -2910 -6395 -12999 -14128 -2003 -6773 -11100 -11656
13469a1656k521O711j0790O29N626j582L892l094k009M292m112Q989n606j3554
$$ -11656 -14177 -7466 -18256 -17627 -12001 -13583 -9691 -12785 -14794 -10502 -14614 -5625 -11231 -24785
13455b4785P669J0030M368n537R865J711j1011K264K1n02L93q239R34n317l701
$$ -24785 -17116 -7086 -2718 -8255 1610 3321 -7690 -5426 -5405 -5907 -5514 -13753 -12819 -18136 -21837
13440b1837J77P568O134M977M342J1338J2510j1276p971p726j0648K501j525k904
$$ -21837 -21660 -14092 -7958 -2981 1361 12699 25209 13933 5962 -1764 -12412 -9911 -11436 -14340
13426a4340K824J1520M481j0819j7137j0635Q130K840M013P46Q138j698r996K787
$$ -14340 -11516 4 4485 -6334 -23471 -34106 -25976 -23136 -19123 -18377 -10239 -11937 -21933 -19146
13412a9146O09M202N292j1503r092K92J1992J0196m18o598N864K960p82R66R402
$$ -19146 -18537 -14335 -9043 -20546 -29638 -29346 -17354 -7158 -7576 -14174 -8310 -5350 -6132 -5166 4236
13397D236p304p866Q175K771n618M14o135q062l469J930J279M795j535P663N072
$$ 4236 -3068 -10934 -2759 12 -5606 -5192 -11327 -19389 -22858 -20928 -19649 -14854 -16389 -8726 -3654
13382c654Q674j454j2522m749K459m890q298L756K964r431r26Q228l542p598J4121
$$ -3654 5020 3566 -8956 -13705 -11246 -16136 -24434 -20678 -17714 -27145 -28071 -19843 -23385 -30983 -16862
13367a6862N518q420J948J8626m719K807n736J570k252m498l976K724K1267R794
$$ -16862 -11344 -19764 -17816 810 -3909 -1102 -6838 -5268 -7520 -12018 -15994 -13270 7997 17791
13353A7791N437J0382J601P662j2553m671j1425j7541l59r634o88o661k769P201
$$ 17791 23228 33610 35211 42873 30320 25649 14224 -3317 -3676 -13310 -13998 -20659 -23428 -16227
13339a6227R933j3003q31J3668J3144P753m120P296j0117j0004q512l127q535
$$ -16227 -6294 -19297 -20128 -6460 6684 14437 10317 17613 7496 -2508 -11020 -14147 -22682
13326b2682p34K2828Q081o080p957J3675m254j1829l984O150M266o439J224l389
$$ -22682 -23416 -588 7493 1413 -6544 7131 2877 -8952 -12936 -6786 -2520 -8959 -7735 -11124
13312a1124J23p35j347n323n991L712L741q64O170Q721p732j0441O528J5123J3589
$$ -11124 -11001 -11736 -13083 -18406 -24397 -20685 -16944 -17808 -11638 -2917 -10649 -21090 -14562 561 14150
13297A4150M479j898j7739j0877Q70K912n918m595j3354K032J4188Q096Q211Q528
$$ 14150 18629 16731 -1008 -11885 -11015 -8103 -14021 -18616 -31970 -29938 -15750 -7654 557 9085
13283I085j6754k9846R116J0964J4994Q290j0079L272O422M535N967j1056j9810
$$ 9085 -7669 -37515 -28399 -17435 -2441 5849 -4230 -958 5464 9999 15966 4910 -14900
13270a4900o615n268K539p26q759M434J1130R900n446l415J0084k977j0279j735
$$ -14900 -21515 -26783 -24244 -24970 -33729 -29295 -18165 -8265 -13711 -17126 -7042 -10019 -20298 -22033
13256b2033j28o974J0389J0401n324P70k426j566o754j8367J4003Q999N669J2554
$$ -22033 -22161 -29135 -18746 -8345 -13669 -12899 -15325 -16891 -23645 -42012 -28009 -19010 -13341 -787
13242g87M596M151l185r02k898k165r69N15K711J5269j521j8400j1105j2651O374
$$ -787 3809 7960 4775 3873 975 -1190 -2159 -1644 1067 16336 14815 -3585 -14690 -27341 -20967
13227b0967J0464L684J406n908m473q934j375J971m576j7588m961J1257J4184
$$ -20967 -10503 -6819 -5413 -11321 -15794 -24728 -26103 -24132 -28708 -46296 -51257 -40000 -25816
13214b5816L307O959J2603l617j4375m276O229m901k576J2155j854q16l1J2209
$$ -25816 -22509 -15550 -2947 -6564 -20939 -25215 -18986 -23887 -26463 -14308 -16162 -16978 -17009 -4800
13200d800J7014l916L123L544j9493j6292o733K297p99J0877j85o382J7030J129
$$ -4800 12214 8298 11421 14965 -4528 -20820 -27553 -25256 -26055 -15178 -15363 -21745 -4715 -3586
13186c586m127P926K347q08j0055j4402j1361L047J438P592O307P227L564N863
$$ -3586 -7713 213 2560 1752 -8303 -22705 -34066 -31019 -29581 -21989 -15682 -8455 -4891 972
13172I72k4701P813O996n177J5823p46n073k179j3226k1247n749J5127K914L5
$$ 972 -23729 -15916 -8920 -14097 1726 980 -4093 -6272 -19498 -40745 -46494 -31367 -28453 -28418
13158b8418J0143R135M271k583N469L442j1060m335k99j480O459Q470K015J391
$$ -28418 -18275 -9140 -4869 -7452 -1983 1459 -9601 -13936 -14235 -15715 -9256 -786 1229 2620
13144B620r398k820o123N322n775j1384r148J5844J5525J732j225n345o435j1054
$$ 2620 -6778 -9598 -15721 -10399 -16174 -27558 -36706 -20862 -5337 -3605 -4830 -10175 -16610 -27664
13130b7664J352J2288J387o870J8967K941m932j0609p739j2756L20L27K779J6509
$$ -27664 -26312 -14024 -12637 -19507 -540 2401 -2531 -13140 -20879 -33635 -33315 -32988 -30209 -13700
13116a3700J7934L089j238k4469j3924k103r500J0709J845j117N27J7976J2158
$$ -13700 4234 7323 6085 -18384 -32308 -34411 -43911 -33202 -31357 -32474 -31947 -13971 -1813
13103a813n822j9552O188M240K157R972o322j8379k80J0829J4155n556j5272K118
$$ -1813 -7635 -27187 -20999 -16759 -14602 -4630 -10952 -29331 -29611 -18782 -4627 -10183 -25455 -23337
13089b3337J2891j323k790J605Q371p637L272M245j4793K187L568R975p876j4202
$$ -23337 -10446 -11769 -14559 -12954 -4583 -12220 -8948 -4703 -19496 -17309 -13741 -3766 -11642 -25844
13075b5844p997Q253M753J1196l759q740j2120k99J8024J5622J309j0398j4494
$$ -25844 -33841 -25588 -20835 -9639 -13398 -22138 -34258 -34557 -16533 -911 398 -10000 -24494
13062b4494l623J1762J5671J522J3556k004j9783j1062N768j226O780K0060j432
$$ -24494 -28117 -16355 -684 838 14394 12390 -7393 -18455 -12687 -13913 -7133 12927 11495
13049A1495j752o393l642Q86N128R08O866J214L623l059q449m09r581o203N121
$$ 11495 9743 3350 -292 594 5722 6630 13496 14710 18333 15274 6825 6416 -3165 -9368 -4247
13034d247l329k402Q378j306j2150N115K044O531r28N551j953K068R467Q70p757
$$ -4247 -7576 -9978 -1600 -2906 -15056 -9941 -7897 -1366 -2294 3257 1304 3372 12839 13709 5952
13019E952m123m182K255m201O983K0891n036m671N268L223j755J746J557k869
$$ 5952 1829 -2353 -98 -4299 2684 23575 18539 13868 19136 22359 20604 22350 23907 21038
13005B1038l280j721L771J2851L170m124j1570r039J0427m791p683j1848o221
$$ 21038 17758 16037 19808 32659 35829 31705 20135 11096 21523 16732 9049 -2799 -9020
12992i020O020j938J141J1956p627r110j7773j3648j067J2499J2778N945l595
$$ -9020 -3000 -4938 -3797 8159 532 -8578 -26351 -39999 -41066 -28567 -15789 -9844 -13439
12979a3439L829j2810r703p792m173R630K7878J1089j4794j0752K586J7613J834
$$ -13439 -9610 -22420 -32123 -39915 -44088 -34458 -6580 4509 -10285 -21037 -18451 -838 996
12966I96l125L858M931o078k0312P26N308J3651j2346j0177O544j431K908J318
$$ 996 -2129 1729 6660 582 -19730 -19004 -13696 -45 -12391 -22568 -16024 -17455 -14547 -13229
12952a3229j4560O155J2257k172n217N919p220m45m725J566O43n312M922j061
$$ -13229 -27789 -21634 -9377 -11549 -16766 -10847 -18067 -18512 -23237 -21671 -21028 -26340 -21418 -22479
12938b2479n307O334P03L041p070l822k106J644K291J822K317n76N100M095k158
$$ -22479 -27786 -21452 -20749 -17708 -24778 -28600 -30706 -29062 -26771 -24949 -22632 -23208 -18108 -14013 -16171
12923a6171q738P670m222m233j2150J0573M796m912J1945j000J166m452K53N215
$$ -16171 -24909 -17239 -21461 -25694 -37844 -27271 -22475 -27387 -15442 -16442 -15276 -19728 -19475 -14260
12909a4260K892j668R307P023p979j3392J304N706p097p064L662L492j996J3053
$$ -14260 -11368 -13036 -3729 3294 -4685 -18077 -16773 -11067 -18164 -25228 -21566 -18074 -20070 -7017
12895g017O099N224q175J0248J1450j0067k1426M489j647P351o914N153J1716
$$ -7017 -918 4306 -3869 6379 17829 7762 -13664 -9175 -10822 -3471 -10385 -5232 6484
12882F484j6992r049L268k810J259o250j0993Q350J5439K745o125o751J0286l511
$$ 6484 -10508 -19557 -16289 -19099 -17840 -24090 -35083 -26733 -11294 -8549 -14674 -21425 -11139 -14650
12868a4650j3237M371K6782n715j4368k228J2296k981n219l876j74r544m932J297
$$ -14650 -27887 -23516 3266 -2449 -16817 -19045 -6749 -9730 -14949 -18825 -18999 -28543 -33475 -32178
12854c2178m946q43P507J1910M207l911O254M665J3550J926o704J610n589p219
$$ -32178 -37124 -37967 -30460 -18550 -14343 -18254 -12000 -7335 6215 8141 1437 3047 -2542 -9761
12840i761n598J6408P10m62J7384P956k1494k4164l753L949k478o118P902J955
$$ -9761 -15359 1049 1759 1297 18681 26637 5143 -19021 -22774 -18825 -21303 -27421 -19519 -17564
12826a7564O89J0589j271J1124Q705j229O715O595o738O61M705P813l269k1250
$$ -17564 -16875 -6286 -7557 3567 12272 11043 17758 24353 17615 18276 22981 30794 27525 6275
12812F275l476k43J006M217j9289j0872K477O470o164m150l552j397j954j567
$$ 6275 2799 2556 3562 7779 -11510 -22382 -19905 -13435 -19599 -23749 -27301 -28698 -30652 -32219
12798c2219R468J0952k156N971N344M991K756Q864R18j0191j8350K403n62n52
$$ -32219 -22751 -11799 -13955 -7984 -2640 2351 5107 13971 14889 4698 -13652 -11249 -11811 -12363
12784a2363K303k410r000k461n32L304k444P98k57m785K90N794J2194j7247m735
$$ -12363 -10060 -12470 -21470 -23931 -24463 -21159 -23603 -22805 -23062 -27847 -27557 -21763 -9569 -26816 -31551
12769c1551J4082K3223J1565j5474k995J3360q629j0252J481J0113K156q130l44
$$ -31551 -17469 5754 17319 1845 -1150 12210 3581 -6671 -5190 4923 7079 -1051 -1395
12756a395N636o666j3871r596o099M744L371P208J4943R960m861o437j562p375
$$ -1395 4241 -2425 -16296 -25892 -31991 -27247 -23876 -16668 -1725 8235 3374 -3063 -4625 -12000
12742a2000j3899L511J7665N006m647L706j1681j3076R657N903j4945o148O252
$$ -12000 -25899 -22388 -4723 283 -4364 -658 -12339 -25415 -15758 -9855 -24800 -30948 -24696
12729b4696K473O20j479j759n62J3974J3927k508Q558p245j8256o038J0227R300
$$ -24696 -22223 -21603 -23082 -24841 -25403 -11429 2498 -10 8548 1303 -16953 -22991 -12764 -3464
12715c464j70N214o706j8249K784L167J29k410J2815n595m972J0025K064J505
$$ -3464 -3634 1580 -5126 -23375 -20591 -17424 -17295 -19705 -6890 -12485 -17457 -7432 -5368 -3863
12701c863K538K528k610P59J309j591j3778L683N010P081O617J640q344q320P43
$$ -3863 -1325 1203 -1407 -648 661 -930 -14708 -11025 -6015 1066 7683 9323 979 -7341 -6598
12686f598N59k487N261N442r602k095P58p245r42K876j000M37J051j954K685j848
$$ -6598 -6039 -8526 -3265 2177 -7425 -9520 -8762 -16007 -16949 -14073 -15073 -14636 -13585 -15539 -12854 -14702
12670a4702j1202O708R917O597j0104j3430N215N118j0744M419L99m662o777J1923
$$ -14702 -25904 -19196 -9279 -2682 -12786 -26216 -21001 -15883 -26627 -22208 -21809 -26471 -33248 -21325
12656b1325J0774Q313o144R424P496m788n688j0340O835M964j3921j4533l868
$$ -21325 -10551 -2238 -8382 1042 8538 3750 -1938 -12278 -5443 -479 -14400 -28933 -32801
12643c2801N834J1775o51J355m466k686J1325m287N373Q982M134q499j1402P896
$$ -32801 -26967 -15192 -15843 -14488 -18954 -21640 -10315 -14602 -9229 -247 3887 -4612 -16014 -8118
12629h118j437k0643o381m472J0803Q685K681n33o062J007J0069o68Q494p570
$$ -8118 -9555 -30198 -36579 -41051 -30248 -21563 -18882 -19415 -25477 -24470 -14401 -15069 -6575 -14145
12615a4145q398o911J861k702M32M974J704q983K11J2103J135Q919K940p22m331
$$ -14145 -22543 -29454 -27593 -30295 -29863 -24889 -23185 -32168 -31957 -19854 -18719 -9800 -6860 -7582 -11913
12600a1913q453M753M774N648J6008l963L207o798j1861M66L295j800n896K144
$$ -11913 -20366 -15613 -10839 -5191 10817 6854 10061 3263 -8598 -8132 -4837 -6637 -12533 -10389
12586a0389K859l781N5o106o72L90R219M61N273L32n488J9170M198p665j6481
$$ -10389 -7530 -11311 -11256 -17362 -18034 -17644 -8425 -7964 -2691 -2359 -7847 11323 15521 7856 -8625
12571h625k296p145J0651M608m464J0650m119k2835r172J0269J3122j307n321
$$ -8625 -10921 -18066 -7415 -2807 -7271 3379 -740 -23575 -32747 -22478 -9356 -10663 -15984
12558a5984K839p58R63R669O277M62o686p625l508J6943R814K021m001J005r177
$$ -15984 -13145 -13903 -12940 -3271 3006 3468 -3218 -10843 -14351 2592 12406 14427 10426 11431 2254
12543B254j1250j1051M902P050m765q063q116k092O984J3646J722L648P717k03
$$ 2254 -8996 -20047 -15145 -8095 -12860 -20923 -29039 -31131 -24147 -10501 -8779 -5131 2586 2383
12529B383R350J5275J1073j3372r896Q40P070j3402p900j246P642J390m084N756
$$ 2383 11733 27008 38081 24709 14813 15653 22723 9321 1421 175 7817 9207 5123 10879
12515A0879O609j174l289p068j669k438Q883J3676r258L138R120L325J3066O407
$$ 10879 17488 16314 13025 5957 4288 1850 10733 24409 15151 18289 27409 30734 43800 50207
12501E0207K0292K4050L181N160J7412q960n103j3140j9581q060j1194o401N602
$$ 50207 70499 94549 97730 102890 120302 111342 106239 93099 73518 65458 54264 47863 53465
12488E3465J335Q660J593Q366J2720K0126J5861P842k2777j0665j437j8107j1595
$$ 53465 54800 63460 65053 73419 86139 106265 122126 129968 107191 96526 95089 76982 65387
12475F5387j6618j9420L952P611J3227K554j2836J0976N567n08L438n051j4396
$$ 65387 48769 29349 33301 40912 54139 56693 43857 54833 60400 59892 63330 58279 43883
12462D3883j5955j0103j2052j3653O256N608J788j1043j783L649j3602m932M762
$$ 43883 27928 17825 5773 -7880 -1624 3984 5772 -5271 -7054 -3405 -17007 -21939 -17177
12449a7177k586N309J2160q70m791J0484p585o467P757N843k909M562J0290j786
$$ -17177 -19763 -14454 -2294 -3164 -7955 2529 -5056 -11523 -3766 2077 -832 3730 14020 12234
12435A2234O18p134j2620p85l215Q471K164j3119n626n62r557r488N714J3928
$$ 12234 12852 5718 -6902 -7687 -10902 -2431 -267 -13386 -19012 -19574 -29131 -38619 -32905 -18977
12421a8977J0163R67N337r265m563j1248r059p799N440J1957J2695q59M294Q90
$$ -18977 -8814 -7847 -2510 -11775 -16338 -27586 -36645 -44444 -39004 -27047 -14352 -15211 -10917 -10027
12407a0027j0538M862l576J0808J1087K158J437j7838j2030j0647m171J2077J328
$$ -10027 -20565 -15703 -19279 -8471 2616 4774 6211 -11627 -23657 -34304 -38475 -26398 -25070
12394b5070n90j2862o687J4634J0557o419O619k080N298N901J3336j1465j0360
$$ -25070 -25660 -38522 -45209 -30575 -20018 -26437 -19818 -21898 -16600 -10699 2637 -8828 -19188
12381a9188N980p101j4676j1185j41Q823Q863J663J2328O057j5427N06P427P803
$$ -19188 -13208 -20309 -34985 -46170 -46311 -37488 -28625 -26962 -14634 -8577 -24004 -23498 -16071 -8268
12367h268q656p368j897q195J2725P722n537n102m86J1235N645q517j58n511M344
$$ -8268 -16924 -24292 -26189 -34384 -21659 -13937 -19474 -24576 -25062 -13827 -8182 -16699 -16857 -22368 -18024
12352a8024o993l439O374Q616J0050l100L044k622n335r802J600l687r417R74
$$ -18024 -25017 -28456 -22082 -13466 -3416 -6516 -3472 -6094 -11429 -21231 -19631 -23318 -32735 -31761
12338c1761J3101J0636L655l157j728J1566j6097o762P728k760p28Q085Q282O404
$$ -31761 -18660 -8024 -4369 -7526 -9254 2312 -13785 -20547 -12819 -15579 -16307 -8222 60 6464
12324F464q953j1568n448N690N046M007O93P930K895N512L562O459M756j2069
$$ 6464 -2489 -14057 -19505 -13815 -8769 -4762 -4069 3861 6756 12268 15830 22289 27045 14976
12310A4976q388n717r07j14l124O858Q322p658j5951O430j679M478l784L349l550
$$ 14976 6588 871 -36 -150 -3274 3584 11906 4248 -11703 -5273 -6952 -2474 -6258 -2909 -6459
12295f459l014K418n81N523l664p239R896J7518l323j0517m532q122p008M508
$$ -6459 -9473 -7055 -7636 -2113 -5777 -13016 -3120 14398 11075 558 -3974 -12096 -19104 -14596
12281a4596j0463r535K1628J6841n144j1211n177K318j962P633N469j0136k441
$$ -14596 -25059 -34594 -12966 3875 -1269 -12480 -17657 -15339 -17301 -9668 -4199 -14335 -16776
12268a6776P078m80m808l159N472J2096l626O53J813j926o917O782J685K758o858
$$ -16776 -9698 -10178 -14986 -18145 -12673 -577 -4203 -3550 -1737 -3663 -10580 -3798 -2113 645 -6213
12253f213n313K605J1126P051j2112o754N226J2137q232K777O017P22j1048j4779
$$ -6213 -11526 -8921 2205 9256 -2856 -9610 -4384 7753 -479 2298 8315 9037 -2011 -16790
12239a6790l125l013J6267J6348J272l182j3438m556l621m390K791R813O211L899
$$ -16790 -19915 -22928 -6661 9687 10959 7777 -5661 -10217 -13838 -18228 -15437 -5624 587 4486
12225D486l620l784p486j2860L809J3237O687O88k744n085P365K623K775q54r557
$$ 4486 866 -2918 -10404 -23264 -19455 -6218 469 1157 -1587 -6672 693 3316 6091 5237 -4320
12210d320p537p85N073n506j6250j9988k041K0984K4640l773n849k069L277j659
$$ -4320 -11857 -12642 -7569 -13075 -29325 -49313 -51354 -30370 -5730 -9503 -15352 -17421 -14144 -15803
12196a5803r051o914J6176J0428K813k737M075N916l158J766M144p70j4040j1151
$$ -15803 -24854 -31768 -15592 -5164 -2351 -5088 -1013 4903 1745 3511 7655 6885 -7155 -18306
12182a8306m880O83j028R408P271l691j0463j384J213Q534O677q256L244K717
$$ -18306 -23186 -22503 -23531 -14123 -6852 -10543 -21006 -22390 -21177 -12643 -5966 -14222 -10978 -8261
12168h261P622J001j1239P218Q968o891n745k95k114m399J194N184L20L087o840
$$ -8261 -639 362 -10877 -3659 5309 -1582 -7327 -7622 -9736 -14135 -12941 -7757 -7437 -4350 -11190
12153a1190p733K766R830q31k2546j0441J2824J8094J0135j1479j9755o606Q802
$$ -11190 -18923 -16157 -6327 -7158 -29704 -40145 -27321 -9227 908 -10571 -30326 -36932 -28130
12140b8130L651Q58J1508P035j8551j774J5264M562j0876k382L860k00O521Q023
$$ -28130 -24479 -23621 -12113 -5078 -23629 -25403 -10139 -5577 -16453 -18835 -14975 -15175 -8654 -631
12126f31Q763m203j2146j0985K268q266O329J2529l772o145O729l8L615L085j2861
$$ -631 8132 3929 -8217 -19202 -16934 -25200 -18871 -6342 -10114 -16259 -9530 -9568 -5953 -2868 -15729
12111a5729j0189k330R821L804M738J1567L71j6976o610o282J3324Q326P421J5217
$$ -15729 -25918 -28248 -18427 -14623 -9885 1682 2053 -14923 -21533 -27815 -14491 -6165 1256 16473
12097A6473k48j8256m955M014r084q661M446k574n496J2939J7608P921j4607k0240
$$ 16473 16225 -2031 -6986 -2972 -12056 -20717 -16271 -18845 -24341 -11402 6206 14127 -480 -20720
12083b0720m389l108P5L51J984P280J1256l126k800p16K548M47J879j2657q306
$$ -20720 -25109 -28217 -28142 -27791 -25807 -18527 -7271 -10397 -13197 -13913 -11365 -10918 -9039 -21696 -30002
12068c0002O207K898m686k74J5624M264M218n500j3540R641Q774N990r351j1842
$$ -30002 -23795 -20897 -25583 -25857 -10233 -5969 -1751 -7251 -20791 -11150 -2376 3614 -5737 -17579
12054a7579J304O253q157M578j469K811O03Q430R523K892j0371o872J2892j1892
$$ -17579 -16275 -10022 -18179 -13601 -15070 -12259 -11656 -3226 6297 9189 -1182 -8054 4838 -7054
12040g054j7171k939q558N546k421o325J1329K1165P273j492q641j6131J1728
$$ -7054 -24225 -27164 -35722 -30176 -32597 -38922 -27593 -6428 845 -647 -9288 -25419 -13691
12027a3691L748O745J3232M52K39j4231J892j674R99L188p556m274o164j8732
$$ -13691 -9943 -3198 10034 10486 10725 -3506 -1614 -3288 -2289 899 -6657 -10931 -17095 -35827
12013c5827M355m440n978J1018P399P348J4050P055K001K103l480n592o508j4059
$$ -35827 -31472 -35912 -41890 -30872 -23473 -16125 -2075 4980 6981 9084 5604 12 -6496 -20555
11999b0555K285k558J2341J0367j4445j0051m772O970m782J791O661O524n342
$$ -20555 -18270 -20828 -8487 1880 -12565 -22616 -27388 -20418 -25200 -23409 -16748 -10224 -15566
11986a5566k251j330K389N180n68J166R778J101m258j523J0791n376j0988j633
$$ -15566 -17817 -19147 -16758 -11578 -12146 -10980 -1202 -101 -4359 -5882 4909 -467 -11455 -13088
11972a3088P298O480L986j1747r006n998Q90J5132L914m599m96Q524O321O672
$$ -13088 -5790 690 4676 -7071 -16077 -22075 -21185 -6053 -2139 -6738 -7234 1290 7611 14283
11958A4283j420n660j6981j7375J879O163p996j61N556P95M14j1838K719K0519
$$ 14283 12863 7203 -9778 -27153 -25274 -19111 -27107 -27268 -21712 -20917 -20503 -32341 -29622 -9103
11944i103Q945J1200o31r490o888J0595J7858r953j6328j3742P866p129L859J939
$$ -9103 -158 11042 10411 921 -5967 4628 22486 12533 -3795 -17537 -9671 -16800 -12941 -11002
11930a1002p619J914R158M152O533l477j251n127j0699J0052K2833p462j615r550
$$ -11002 -18621 -16707 -7549 -3397 3136 -341 -1592 -6719 -17418 -7366 15467 8005 6390 -3160
11916c160j293J0733M52p863k895K391K830m479J566r66O821l335j7155o507J3325
$$ -3160 -4453 6280 6732 -1131 -4026 -1635 1195 -3284 -1718 -2684 4137 802 -16353 -22860 -9535
11901i535M416O973R391p277j3414l578o567J2530j94l854l288j390P610N979
$$ -9535 -5119 1854 11245 3968 -9446 -13024 -19591 -7061 -7255 -11109 -14397 -15787 -8177 -2198
11887b198J583O86k96M457J1797m876j6890k823L260J2770N733l770r169l727
$$ -2198 -615 71 -225 4232 16029 11153 -5737 -8560 -5300 7470 13203 9433 264 -3463
11873c463J1638J913j6032J081J3404K515J1938j0525r726J3540p481r997l272
$$ -3463 8175 10088 -5944 -4863 8541 11056 22994 12469 2743 16283 8802 -1195 -4467
11860d467j1700J0919j973O426K1292Q866l278o960R410j016j1389q481k723L105
$$ -4467 -16167 -5248 -7221 -795 20497 29363 26085 19125 28535 27519 16130 7649 4926 8031
11846H031Q327m951p19J339j698m899J0903J0526j3144k8881j678R795j588J3320
$$ 8031 16358 11407 10688 12027 10329 5430 16333 26859 13715 -15166 -16844 -7049 -8637 4683
11832D683K1022K466l381m970m871J4977J5727J2996N521m373j0826j9275k701
$$ 4683 25705 28171 24790 19820 14949 29926 45653 58649 64170 59797 48971 29696 26995
11819B6995J3751O629j635j2717m096O750K442O550K942L891L577K034k337j2375
$$ 26995 40746 47375 45740 33023 28927 35677 38119 44669 47611 51502 55079 57113 54776 42401
11805D2401M928q67k4458M759J8770Q426m729J111j0193j3536N382P052L543R33
$$ 42401 47329 46462 22004 26763 45533 53959 49230 50341 40148 26612 31994 39046 42589 43522
11791D3522k942j3925J071M585r777q64M558J000P253k89O469p802P735Q377Q328
$$ 43522 40580 26655 27726 32311 22534 21670 26228 27228 34481 34192 40661 32859 40594 48971 57299
11776E7299N551j1264j3665N00p380J6936J3274n708n899j383k869j354K625L293
$$ 57299 62850 51586 37921 38421 31041 47977 61251 55543 49644 48261 45392 44038 46663 49956
11762D9956J1847l50j838l642r825k630O053K022j1191o650k369L270m956k08
$$ 49956 61803 61453 59615 55973 46148 43518 49571 51593 40402 33752 31383 34653 29697 29489
11748B9489J0010M876j619j4254o529m800J2621J093N27Q660Q33r563K021N275
$$ 29489 39499 44375 42756 28502 21973 17173 29794 30887 31414 40074 40907 31344 33365 38640
11734C8640P641J3299K838l971j7856m942j331l904k313J1209J57n791j166o393
$$ 38640 46281 59580 62418 58447 40591 35649 34318 30414 28101 39310 39467 33676 32510 26117
11720B6117j840r418J6224R322m603L571o00P82K766m310o378J0208J729j6408
$$ 26117 24277 14859 31083 40405 35802 39373 38773 39555 42321 38011 31633 41841 43570 27162
11706B7162j2316J656N527L501L409j772J011o643O588q048n371L477j870k268
$$ 27162 14846 16502 22029 25530 28939 27167 28178 21535 28123 20075 14704 18181 16311 14043
11692A4043N768P077J0145L41n070o560o560j965Q100o825j552j2956j2799j211
$$ 14043 19811 26888 37033 37374 32304 25744 19184 17219 25319 18494 16942 3986 -8813 -10024
11678a0024O791Q616j231R321p708m032J308m575J281J130j1860M70Q789j366
$$ -10024 -3233 5383 4152 13473 5765 1733 3041 -1534 -253 877 -10983 -10513 -1724 -3090
11664c090l217J1515J1304j4585k254O696M678K474J3932n764j6001p943l859
$$ -3090 -6307 5208 16512 1927 -327 6369 11047 13521 27453 21689 5688 -2255 -6114
11651f114J4182L387j624p578j0145k461J0038O195M301J1351j877r735o543k0964
$$ -6114 8068 11455 9831 2253 -7892 -10353 -315 5880 10181 21532 19655 9920 3377 -17587
11637a7587Q59k246L608L300o05Q591K757q096M761K507j815N300m310R121j3443
$$ -17587 -16728 -18974 -15366 -12066 -12671 -4080 -1323 -9419 -4658 -2151 -3966 1334 -2976 6145 -7298
11622g298o314N794j4300k246M029J5992N264J278P232l34N733Q78j9826J340
$$ -7298 -13612 -7818 -22118 -24364 -20335 -4343 921 2199 9431 9097 14830 15708 -4118 -2778
11608b778q535n678m514j2394L915J5003k720m873N46R626J0401J538M21k103
$$ -2778 -11313 -16991 -21505 -33899 -29984 -14981 -17701 -22574 -22028 -12402 -2001 -463 -42 -2145
11594b145L604M456J0679p136j5517M086L101n210m20o344k383J4671J364j4090
$$ -2145 1459 5915 16594 9458 -6059 -1973 1128 -4082 -4502 -10846 -13229 1442 2806 -11284
11580a1284j340J519l021K190m090p051R085J2338K22O357K007O30j581l653j4246
$$ -11284 -12624 -11105 -14126 -11936 -16026 -23077 -13992 -1654 -1432 4925 6932 7562 5981 2328 -11918
11565a1918O548P650N216j3313p778k620P43L413m723O887J920O279k18M28j1029
$$ -11918 -5370 2280 7496 -5817 -13595 -16215 -15472 -12059 -16782 -9895 -7975 -1696 -1914 -1486 -12515
11550a2515p962Q727n558q545K714O929m412J3205K931n42M291k558l935Q53K119
$$ -12515 -20477 -11750 -17308 -25853 -23139 -16210 -20622 -7417 -4486 -5028 -737 -3295 -7230 -6377 -4258
11535d258P137N864j5764r119O904J0985O3k65l244J3370J15j0702r283j2423
$$ -4258 2879 8743 -7021 -16140 -9236 1749 1812 1547 -1697 11673 11788 1086 -8197 -20620
11521b0620m223J2371R546M663l610q601K70N698j047l437n151J531o199K097
$$ -20620 -24843 -12472 -2926 1737 -1873 -10474 -10204 -4506 -5553 -8990 -14141 -12610 -18809 -16712
11507a6712r1Q291j0040p63Q29J597n715M597R815O509k500M837J0054J395o726
$$ -16712 -16803 -8512 -18552 -19315 -18486 -16889 -22604 -18007 -8192 -1683 -4183 654 10708 12103 5377
11492E377m407K926O099o113j0577P807J6o614J1464J735L782p240J3956j85j0515
$$ 5377 970 3896 9995 3882 -6695 1112 1128 -5486 5978 7713 11495 4255 18211 18026 7511
11477G511l778P597Q994N684q029j2384L614N672R542J5270o994j7161j4533N15
$$ 7511 3733 11330 20324 26008 17979 5595 9209 14881 24423 39693 32699 15538 1005 1520
11463A520k4p489l013J87J6932k1238m271L149m531Q592M754m096N408L461M593
$$ 1520 1496 -5993 -9006 -8819 8113 -13125 -17396 -14247 -18778 -10186 -5432 -9528 -4120 -659 3934
11448C934K559l873k829J5095J2489m117m337j3759M163j6502L185m631M619J2529
$$ 3934 6493 2620 -209 14886 27375 23258 18921 5162 9325 -7177 -3992 -8623 -4004 8525
11434H525K758P811k7429r582O790J0728l900Q542K253m025P193M52K986n595
$$ 8525 11283 19094 -8335 -17917 -11127 -399 -4299 4243 6496 2471 9664 10116 13102 7507
11420G507J0401j1477n698Q808P297o761n404j0239r208R066P875m29P77q28M375
$$ 7507 17908 6431 733 9541 16838 10077 4673 -5566 -14774 -5708 2167 1738 2515 1687 6062
11405F062J7237P781l880L16n156j1240o099o123R636k883M424P750m559n654
$$ 6062 23299 31080 27200 27516 22360 11120 5021 -1102 8534 5651 10075 17825 13266 7612
11391G612o96J744P467J5293P805k9816j6153R55O189m100K17J0095M969J0686
$$ 7612 6916 8660 16127 31420 39225 9409 -6744 -5789 400 -3700 -3483 6612 11581 22267
11377B2267j653j794l381o498j4883r420q440K574L213O58J1971K949L394J6642
$$ 22267 20614 18820 15439 8941 -5942 -15362 -23802 -21228 -18015 -17357 -5386 -2437 957 17599
11363A7599K442q543j857J9854N522m957j4461L938K961J805j9759q548N516J978
$$ 17599 20041 11498 9641 29495 35017 30060 15599 19537 22498 24303 4544 -4004 1512 3490
11349C490L464J5046K1050L927n452n353p169l273J565P836j61O182J212j4685
$$ 3490 6954 22000 43050 46977 41525 36172 29003 25730 27295 35131 34970 41152 42364 27679
11335B7679n69K717j676K04L03L342O838o232m603O476k284J1105o265K27l682
$$ 27679 27110 29827 28151 28355 28658 32000 38838 32606 28003 34479 32195 43300 37035 37262 33580
11320C3580j7852O108L680J4737P789O739j6677j5773J278K842J783j9143p809
$$ 33580 15728 21836 25516 40253 48042 54781 38104 22331 23609 26451 28234 9091 1282
11307A282P808J6240K1703J489m637p603j6102k5237P288P784O513N477l369J138
$$ 1282 9090 25330 47033 48522 43885 36282 20180 -5057 2231 10015 16528 22005 18636 19774
11293A9774n344k194j831Q993L804p802l169O548q426j0193j236M933J3075O686
$$ 19774 14430 12236 10405 19398 23202 15400 12231 18779 10353 160 -1076 3857 16932 23618
11279B3618m20j436K675J0818O875P338N793p717j3384j96o195q165M202N363
$$ 23618 23198 21762 24437 35255 42130 49468 55261 47544 34160 33964 27769 19604 23806 29169
11265B9169m461J0388k349o286j435O635J1187M369o727j662L215j055n054q903
$$ 29169 24708 35096 32747 26461 25026 31661 42848 47217 40490 38828 42043 40988 35934 27031
11251B7031j335Q173j0669Q263o209n184J0326M344j876r396j632N499K0560K475
$$ 27031 25696 33869 23200 31463 25254 20070 30396 34740 32864 23468 21836 27335 47895 50370
11237E0370q340o350j7420N495l283j1676j22K185J0446J1999m294j56M353O863
$$ 50370 42030 35680 18260 23755 20472 8796 8674 10859 21305 33304 29010 28854 33207 40070
11223D0070J2323r463n268q591l040K85j71P06M05J0723N679J762p955o297R55
$$ 40070 52393 42930 37662 29071 26031 26316 26145 26851 27256 37979 43658 45420 37465 31168 32123
11208C2123P798j919k3399l178J5840P738J1495Q85Q559k049P164R708M68R149
$$ 32123 39921 38002 14603 11425 27265 35003 46498 47383 55942 53893 61057 70765 71233 80382
11194H0382n941j4265k178K358l446j1299J741m104j657k63n46pK114nk246J125
$$ 80382 74441 60176 57998 60356 56910 45611 47352 43248 41591 41328 40782 40775 42889 42884 40638 41763
11178D1763J0251j671n463n461j2846K497K0321J0621m275N195j382r716M687
$$ 41763 52014 50343 44880 39419 26573 29070 49391 60012 55737 60932 59550 49834 54521
11165E4521Q184J6997j085j2834q568o071o275o476j2017n31J144J7552K2478
$$ 54521 62705 79702 78617 65783 57215 51144 44869 38393 26376 25845 26989 44541 67019
11152F7019J7725J3758M139R525N98J2893m822o215P123m416J5105R695p039p188
$$ 67019 84744 98502 102641 112166 112764 125657 120835 114620 121743 117327 132432 142127 135088 127900
11138A27900j4214j5986m997n073k672q139M622o001q44r110K653J957Q514N468
$$ 127900 113686 97700 92703 87630 84958 76819 81441 75440 74596 65486 68139 70096 78610 84078
11124H4078n174K522j75K3521J8861p329j4828l09J3637J6106J2844K697q119
$$ 84078 78904 81426 81251 104772 123633 116304 101476 101167 114804 130910 143754 146451 138332
11111A38332k750J615R115M450k98q318K313K741P15J7812L4261M7601M1380N5063
$$ 138332 135582 137197 146312 150762 150464 142146 144459 147200 147915 165727 199988 247589 288969 344032
11097C44032R1344J49711K57572L66314L70277K71964J12566j73936m64570l99604
$$ 344032 435376 585087 842659 1208973 1579250 1851214 1963780 1789844 1325274 925670
11087I25670k57016j60105j11462q4851n2269m0329k4079r899j5610N605N076
$$ 925670 668654 508549 397087 312236 259967 219638 195559 185660 170050 175655 180731
11076A80731l147l687l808p377J1286J4990p412j5570q672m862j5326J364p400
$$ 180731 177584 173897 170089 162712 173998 188988 181576 166006 157334 152472 137146 138510 131110
11063A31110j0602j733j649j8904l658j3060L12N392J5761Q208j1035q589M656
$$ 131110 120508 118775 117126 98222 94564 81504 81816 87208 102969 111177 100142 91553 96209
11050I6209J206J9209k564m801K055J746m115j5040j6832m152K220J7173P570
$$ 96209 97415 116624 114060 109259 111314 113060 108945 93905 77073 72921 75141 92314 99884
11037I9884N93q317j0286K798J091j209K010p205q296q18J2542r1P189R526M976
$$ 99884 100477 92160 81874 84672 85763 84554 86564 79359 71063 70245 82787 82696 89885 99411 104387
11022A04387l203R38r710j0474k54j795j2129o332J7403J9332m367j6669j2389
$$ 104387 101184 102122 92412 81938 81684 79889 67760 61428 78831 98163 93796 77127 64738
11009F4738l027r654O87P830J5234J2711j0429o606j1601r560R536M701Q925m560
$$ 64738 61711 52057 52744 60574 75808 88519 78090 71484 59883 50323 59859 64560 73485 68925
10995F8925r300k412r749l333L0500J1266J179M475O94K1366N771k151p092j4248
$$ 68925 59625 57213 47464 44131 74631 85897 87076 91551 92245 113611 119382 117231 110139 95891
10981I5891J533J645j6030r593J0171J0429K702j0576M489P266J4623j1569k4465
$$ 95891 97424 99069 83039 73446 83617 94046 96748 86172 90661 97927 112550 100981 76516
10968G6516j1926N898p68J1996K4078Q709N240J2700q339L709K5747L0616l020
$$ 76516 64590 70488 69720 81716 105794 114503 119743 132443 124104 127813 153560 184176 181156
10955A81156L051J4902L197J6966J7418J5532K9328M0988Q9411J09497Q7535O3020
$$ 181156 184207 199109 202306 219272 236690 252222 281550 322538 411949 521446 608981 672001
10943F72001L4556n2320j25610j42579j17532l8596j9233j8002p502j0673j0579
$$ 672001 706557 654237 528627 386048 268516 229920 210687 192685 185183 174510 163931
10932A63931O116K366q036L969k1604l649P808k934o355j4232j5145N329N988
$$ 163931 170047 172413 164377 168346 146742 143093 150901 147967 141612 127380 112235 117564 123552
10919A23552n089j1054n418J2069P903l718q899Q859K8796J9279J6076M790m962
$$ 123552 118463 107409 101991 114060 121963 118245 109346 118205 147001 166280 182356 187146 182184
10906A82184p779M753p184j1825k9037n615p296j1114n378m831j4541m254J5872
$$ 182184 174405 179158 171974 160149 131112 125497 118201 107087 101709 96878 82337 78083 93955
10893I3955J0818m517r191P838J0245J0315j576J0673M376R021j7350k7609k7792
$$ 93955 104773 100256 91065 98903 109148 119463 117887 128560 132936 141957 124607 96998 69206
10880F9206j9163R415R282j1992M742J4970J3330J4049K0835K9448J7875K4744
$$ 69206 50043 59458 68740 56748 61490 76460 89790 103839 124674 154122 171997 196741
10868A96741K4572P489K8282K6211J4117L824Q369O141j386m630r769j0868j4071
$$ 196741 221313 228802 257084 283295 297412 301236 309605 315746 314360 309730 299961 289093 275022
10855B75022k2662k6233k5968l785L94K140n610j4916k108K0801j0206j3626k3209
$$ 275022 252360 226127 200159 196374 196768 198908 193298 178382 176274 197075 186869 173243 150034
10842A50034k746J6260P510L056L342j0103p877J3214j0050j1669J3572J8339
$$ 150034 147288 163548 171058 174114 177456 167353 159476 172690 162640 150971 164543 182882
10830A82882M470Q596K597m393J6655J0996J1728J1124M260J5705K2893N3859
$$ 182882 187352 195948 198545 194152 210807 221803 233531 244655 248915 264620 287513 341372
10818C41372N2716Q0136O7363K4235l1142o6962p2399n9446l0861j1277m924P415
$$ 341372 394088 474224 541587 565822 534680 467718 395319 335873 305012 293735 288811 296226
10806B96226O385P642O298L185l615j584j3446k4878j4063O892o800j2579m624
$$ 296226 302611 310253 316551 319736 316121 314537 301091 276213 262150 269042 262242 249663 245039
10793B45039L642J0192J3409J5921N548J3696K1640L4582K2039o661k484P643
$$ 245039 248681 258873 272282 288203 293751 307447 329087 363669 385708 379047 376563 384206
10781C84206J0642J7607Q217j9863k6969J579J2546M250J4837J5453J1647K0083
$$ 384206 394848 412455 420672 400809 373840 375419 387965 392215 407052 422505 434152 454235
10769D54235J6699J8933J4488N810L2421L9163J5147k610l85o494k565K7197M8357
$$ 454235 470934 489867 504355 510165 542586 581749 596896 594286 593901 587407 584842 612039 660396
10756F60396P1285P8107Q0282O5172L3163Q517M001j0279k4729l095K5283J8583
$$ 660396 731681 809788 890070 955242 988405 996922 1000923 990644 965915 962820 988103 1006686
10744A006686L2905J9567L3081M0042N7410P7754J08802J22271J15012J26937
$$ 1006686 1039591 1059158 1092239 1132281 1189691 1267445 1376247 1498518 1613530 1740467
10734A740467J25956J19930J57018K43182L46068M28367N18704N28637M41035
$$ 1740467 1866423 1986353 2143371 2386553 2732621 3160988 3679692 4208329 4649364
10725D649364K96137Q0407q5340o3968M7413J51809J85788K29574L15451M98878
$$ 4649364 4945501 5025908 4940568 4876600 4924013 5075822 5261610 5491184 5806635 6305513
10715F305513O88699Q80719J065794J167694J052682P53648M03043m8966l69026
$$ 6305513 6994212 7874931 8940725 10108419 11161101 11914749 12317792 12268826 11899800
10706A1899800j07339L97358R80674J561664K099107K800746L713608N000115
$$ 11899800 11792461 12189819 13170493 14732157 16831264 19632010 23345618 28345733
10698B8345733P630388J2616714K1950988L8195753N9236045P2519454O1774251
$$ 28345733 35976121 48592835 70543823 108739576 167975621 240495075 302269326
10691C02269326L7280956L499161o5864840r0322639o1865929l7501260k3717746
$$ 302269326 339550282 343049443 277184603 186861964 124996035 87494775 63777029
10684F3777029j5161503r946239o900007m961677l625817k685432k021963j631777
$$ 63777029 48615526 38669287 31769280 26807603 23181786 20496354 18474391 16842614
10676A6842614j277075q90605o21902n38415n87675o82305r60523j128135q88872
$$ 16842614 15565539 14674934 14053032 13514617 12926942 12244637 11284114 10155979 9267107
10667I267107o32945n08413m58366m33421m16987m06256l47998k68292k22122
$$ 9267107 8634162 8125749 7667383 7233962 6816975 6410719 6062721 5794429 5572307
10658E572307k00840j94558j92890k00576k04374j91052j76480j75946j56983
$$ 5572307 5371467 5176909 4984019 4783443 4579069 4388017 4211537 4035591 3878608
10649C878608j53993j36595j21500j27736j13481j27232j17533j05459o8890o3109
$$ 3878608 3724615 3588020 3466520 3338784 3225303 3098071 2980538 2875079 2806189 2743080
10639B743080o9254r2663q6519r4836q9566o0497n6715o8811m6416n8111n5715
$$ 2743080 2673826 2581163 2494644 2399808 2310242 2249745 2193030 2124219 2077803 2019692 1963977
10628A963977n4402n3117l9712l8522n4977m0784m7363n4781k9107m7884m9635
$$ 1963977 1909575 1856458 1816746 1778224 1723247 1682463 1635100 1580319 1551212 1503328 1453693
10617A453693j9929l4709k8401k4688j5250l6538l8562j7959J62M714o615k4985
$$ 1453693 1433764 1399055 1370654 1345966 1330716 1294178 1255616 1237657 1237819 1242533 1235918 1210933
10605A210933j9986l0838m0953n6461n0776l2519j7977k2384k9768k6204q453
$$ 1210933 1190947 1160109 1119156 1062695 1011919 979400 961423 939039 909271 883067 874614
10594H74614k1000k3975K424m635o662p449m657J0292j773j0961k2265k2176k3948
$$ 874614 853614 829639 832063 827428 820766 813317 808660 818952 817179 806218 783953 761777 737829
10581G37829k5750l9746j5881M737J0067K5334K4115K1520J9753O54k227p420
$$ 737829 712079 672333 656452 661189 671256 696590 720705 742225 761978 762632 760405 752985
10569G52985N928O699J4173J0614K6178L4960J4353r088l4076l0422m4588k5358
$$ 752985 758913 765612 779785 790399 816577 851537 865890 856802 822726 792304 747716 722358
10557G22358r443k3199l4023l2477m0093m9488m4284k6923k3732p520o751j2965
$$ 722358 712915 689716 655693 623216 583123 533635 489351 462428 438696 431176 424425 411460
10545D11460j5956r109J952N21j5633q451q833n387j2368p618j5359Q27R228P398
$$ 411460 395504 386395 388347 388868 373235 364784 355951 350564 338196 330578 315219 316046 325274 332672
10531C32672J425n829j378O331o3Q49n988J0944M0852O1988J11765J51094J37597
$$ 332672 334097 328268 326890 333221 333158 334007 328019 338963 379815 441803 553568 704662 842259
10518H42259Q2804O387j37441j97033j07748n4134k9775k1093q748j3347k306
$$ 842259 925063 931450 794009 596976 489228 435094 405319 384226 375478 362131 359825
10507C59825J0752k0242j4275J4079p604k2997k7330l1278j9328k148n310o116
$$ 359825 370577 350335 336060 350139 342535 319538 292208 260930 241602 239454 234144 228028
10495B28028m810l614p471j2514m634K694n229r990m259P702N726o962l70o483
$$ 228028 223218 219604 212133 199619 194985 197679 192450 182460 178201 185903 191629 184667 184297 177814
10481A77814K035k237m776p285q20k938m230j0337p754J0379J9482p77k4O077
$$ 177814 179849 177612 172836 165551 164731 161793 157563 147226 139472 149851 169333 168556 168532 174609
10467A74609J8106J144j834j0563j1490p984n741K0954n687j2439r302m354m707
$$ 174609 192715 193859 192025 181462 169972 161988 156247 177201 171514 159075 149773 145419 140712
10454A40712n754n951n293k0102j5548K188k470j469J3755M962J682N456K270
$$ 140712 134958 129007 123714 103612 88064 90252 87782 86313 100068 105030 106712 112168 114438
10441A14438K93r757L655K0453J8192p991j1468J108j5173o007j077p63R625N34
$$ 114438 114731 104974 108629 129082 147274 139283 127815 128923 113750 107743 106666 105903 115528 116062
10427A16062N603J2597j5732k875J2593J0738L040O729k304N372N789j6578p442
$$ 116062 121665 134262 118530 115655 128248 138986 142026 148755 146451 151823 157612 141034 133592
10414A33592j0499j4924j0592j012J6529j300k233k0815k1219O067J486j74J0409
$$ 133592 123093 108169 97577 96565 113094 111794 109561 88746 67527 73594 75080 74906 85315
10401H5315O031j0025k0899j1571O182J4371k967P820J0023o151n39L378J0039
$$ 85315 91346 81321 60422 48851 55033 69404 66437 74257 84280 78129 77590 80968 91007
10388I1007q025j1383p190l209k0004L66J2087n344J4942J3280r882K234P957
$$ 91007 82982 71599 64409 61200 41196 41562 53649 48305 63247 76527 66645 68879 76836
10375G6836J032n54P013j0607J0531J6697R43q28j0965p199r6j0879k0221p558
$$ 76836 77868 77314 84327 73720 84251 100948 101891 101063 90098 82899 82803 71924 51703 44145
10361D4145M819l24J847j273m397L158J300J0312K12k0612M541J0870P400j777
$$ 44145 48964 48640 50487 49214 44817 47975 49275 59587 59799 39187 43728 54598 61998 60221
10347F0221J776L415M58O200J0633J072l805q112j5099K138J921k20N482j353
$$ 60221 61997 65412 65870 72070 82703 83775 79970 71858 56759 58897 60818 60598 66080 64727
10333F4727j4231R183J5988K53r734J392M282Q923J404R445R742K850R967J5386
$$ 64727 50496 59679 75667 75920 66186 67578 71860 80783 82187 91632 101374 104224 114191 129577
10319A29577l512j0954J427J846l189n725j045j1438J1292J4550O198R696N556
$$ 129577 126065 115111 116538 118384 115195 109470 108425 96987 108279 122829 129027 138723 144279
10306A44279j1677K61j057j049o132M328o650R309J1034p508Q65J2942K7747L9604
$$ 144279 132602 132863 131806 130757 124625 128953 122303 131612 142646 135138 136003 148945 176692 216296
10292B16296M3946P9292J62295K57793L52761L66397K71733J50999r2785m31519
$$ 216296 260242 339534 501829 759622 1112383 1478780 1750513 1901512 1808727 1377208
10282A377208m11823k68549j83888j09661n8102n7279m0456l5778j5253j7984
$$ 1377208 965385 696836 512948 403287 345185 287906 247450 211672 196419 178435
10272A78435j0264p077j0397n20j3214r25K122m033q35o130n944K020r85j6472
$$ 178435 168171 161094 150697 150177 136963 136038 138160 134127 133292 127162 121218 123238 122253 105781
10258A05781j8774m353M579j5836l829J1177M97J581o187k452j5225r264L874
$$ 105781 87007 82654 87233 71397 67568 78745 79242 80823 74636 72184 56959 47695 51569
10245E1569P575k641j484j4080P354J6067O455m147j514J0474l799k683k767n191
$$ 51569 59144 56503 55019 40939 48293 64360 70815 66668 65154 75628 71829 69146 66379 61188
10231F1188J5412K1286K0531M103L345j002j2346j8993n748p065j0093J2956k002
$$ 61188 76600 97886 118417 122520 125865 124863 112517 93524 87776 80711 70618 83574 81572
10218H1572j1527j0701l845j5546p716J6608J9149Q307J819l355j3259j394j2947
$$ 81572 70045 59344 55499 39953 32237 48845 67994 76301 78120 74765 61506 60112 47165
10205D7165j5104m313M357L085j4341J270K312Q445O459n264O209M527K146J0315
$$ 47165 32061 27748 32105 35190 20849 22119 24431 32876 39335 34071 40280 44807 46953 57268
10191E7268k381L584J779l737P793L496o29N098L232J356r372j1831j3483m679
$$ 57268 54887 58471 60250 56513 64306 67802 67173 72271 75503 76859 67487 55656 42173 37494
10177C7494j49j0829j8020j2045J4289L1430J1413l816J313k503p705M175m16
$$ 37494 37345 26516 8496 -3549 10740 42170 53583 49767 51080 48577 40872 45047 44631
10164D4631k853j752Q567M020j724n764J339P209J2335m05k522M923R770k481
$$ 44631 41778 40026 48593 52613 50889 45125 46464 53673 66008 65603 63081 68004 77774 75293
10150G5293n210j1510Q067K8740N82K332p598q027q339r841j2147j81n589j896
$$ 75293 70083 58573 66640 95380 95962 98294 90696 82669 74330 64489 52342 52161 46572 44676
10136D4676m168l846N656m127j2005n388K679N611J026j255R393J1257J0008L738
$$ 44676 40508 36662 42318 38191 26186 20798 23477 29088 30114 28859 38252 49509 59517 63255
10122F3255M891r244n42l448k062M264P174Q330l193m178p04N832K0373J0598
$$ 63255 68146 58902 58360 54912 52850 57114 64288 72618 69425 65247 64543 70375 90748 101346
10108A01346K103j0038J1617L33n678J1898R415q989j7616j7889j3296j7987j406
$$ 101346 103449 93411 105028 105361 99683 111581 120996 112007 94391 76502 63206 45219 43813
10095D3813J3320O55M486j0563j5211K619J9720n10l453j898l290J920o521l689
$$ 43813 57133 57788 62274 51711 36500 39119 58839 58329 54876 52978 49688 51608 45087 41398
10081D1398p299P944Q104L612M240K722n461k170R691K0157J1354j9012j9025
$$ 41398 34099 42043 50147 53759 57999 60721 55260 53090 62781 82938 94292 75280 56255
10068E6255n687J845P387N351M023k36q439j705Q764J6417K4809K3808K5703L2581
$$ 56255 50568 52413 59800 65151 69174 68938 60499 58794 67558 83975 108784 132592 158295 190876
10054A90876M6507K5514L699k0768p5448m4755j8387j2206L060L467j5373m393
$$ 190876 237383 262897 266596 245828 170380 125625 107238 95032 98092 101559 86186 81793
10042H1793r319j6077K169L763J8801k236p399m258P174J0587N843J812R07J2056
$$ 81793 72474 56397 58566 62329 81130 78894 71495 67237 74411 84998 90841 92653 93560 105616
10028A05616J0992O521m582m743Q9o934M404o481l733j891M690Q975j3595j4466
$$ 105616 116608 123129 118547 113804 113893 106959 111363 104882 101149 99258 103948 112923 99328 84862
10014H4862j2667l331J3152Q407K802n272q848P414M760o945L736J633k231J035
$$ 84862 72195 68864 82016 90423 93225 87953 79105 86519 91279 84334 88070 89703 87472 88507
10000H8507J7305k850j6019j945J2570O020j1023j4165q254Q476j522j8150o581
$$ 88507 105812 102962 86943 84998 97568 103588 92565 78400 70146 78622 77100 58950 52369
9987E2369J1537K205J2646J3905R633o843j0979j246Q88k790r347j6220k960J1121
$$ 52369 63906 66111 78757 92662 102295 95452 84473 83227 84115 81325 71978 55758 52798 63919
9973F3919J3583j634j0184j7540j905K319J0383K1046J7638P903q766q294m232
$$ 63919 77502 75868 65684 48144 46239 48558 58941 79987 97625 105528 96762 88468 84236
9960H4236m29P179k649q547j4813l351o08l867L616q98K716J447o877m25O269
$$ 84236 83807 90986 88337 79790 64977 61626 61018 57151 60767 59869 62585 64032 57155 56730 62999
9945F2999k191p767j690R367Q089J0830m322m096k822K548p373m527L667J9614
$$ 62999 60808 53041 51351 60718 68807 79637 75315 71219 68397 70945 63572 59045 62712 82326
9931H2326J2586M095o245n454R307J5963Q122J034n393m129j753o223q531L433
$$ 82326 94912 99007 92762 87308 96615 112578 120700 121734 116341 112212 110459 104236 95705 99138
9917I9138J4506m39r863j6496r322o511j0952L064K2156Q394j9398P102J4770
$$ 99138 113644 113205 103342 86846 77524 71013 60061 63125 85281 93675 74277 81379 96149
9904I6149J7423R235K010l010Q748O260Q323Q302m641N116l391J605P997Q208
$$ 96149 113572 122807 124817 121807 130555 136815 145138 153440 148799 153915 150524 152129 160126 168334
9890A68334j669j5335k6018r375p243l074J7863j5429o94l282p824p828r037j2614
$$ 168334 166665 151330 125312 115937 108694 105620 123483 108054 107360 104078 96254 88426 79389 66775
9876F6775L552J0409k379j3522L309L105n11J1679J0324p258p264j1054J573J4753
$$ 66775 70327 80736 78357 64835 68144 71249 70738 82417 92741 85483 78219 67165 68738 83491
9862H3491R959j6773k2999J727J0795M048Q739R316j491K007O621P527K871Q357
$$ 83491 93450 76677 53678 55405 66200 70248 78987 88303 86812 88819 95440 102967 105838 114195
9848A14195P07o71j651n508j3674j5763j255k114J1114J1893P127l360j2429r592
$$ 114195 114902 114231 112580 107072 93398 77635 76380 74266 85380 97273 104400 101040 88611 79019
9834G9019K852J450K497r450j6475J6373J4774J6428J1358j176m935P857j178
$$ 79019 81871 83321 85818 76368 59893 76266 91040 107468 118826 117650 112715 120572 119394
9821A19394L268m086l453M761Q138l730O104m026P484K2995J8159J3982P635K2107
$$ 119394 122662 118576 115123 119884 128022 124292 130396 126370 133854 156849 175008 188990 196625 218732
9807B18732J7832O446j0481k7817l8135k0881q673j2233k5482O837p035n363j742
$$ 218732 236564 243010 232529 204712 166577 145696 137023 124790 99308 106145 99110 93747 92005
9794I2005k333o07m024j45p906r470O595Q831p608j0539m238K551m270l007K628
$$ 92005 89672 89065 85041 84896 76990 67520 74115 82946 75338 64799 60561 63112 58842 55835 58463
9779E8463J324J2840P653N052n137k39M013R125P448K185Q655K129L346M806j457
$$ 58463 59787 72627 80280 85332 80195 79956 83969 93094 100542 102727 111382 113511 116857 121663 120206
9764A20206o744n343Q271J1819J6826P68k844J4130K5443L0266K5133L3167M5657
$$ 120206 113462 108119 116390 128209 145035 145803 142959 157089 182532 212798 237931 271098 316755
9751C16755K3505K2355o512j5789k5648l1860m2447j6049k4938k7207k6433j4787
$$ 316755 340260 362615 356103 340314 314666 282806 240359 224310 199372 172165 145732 130945
9739A30945M727Q793J7924K1242L1338K0563J8447J8978K2193J5332J3623J2867
$$ 130945 135672 144465 162389 183631 214969 235532 253979 272957 295150 310482 324105 336972
9727C36972j3487k7434k2847o380O11N1j096J4588J5253L2458J9692P732O28J2312
$$ 336972 323485 296051 273204 266824 267435 267486 266390 280978 296231 328689 348381 356113 356741 369053
9713C69053N265J8491J7468j9159j8173k9859m3465m3547k0805j5967q304j3793
$$ 369053 374318 392809 410277 391118 372945 343086 299621 256074 235269 219302 210998 197205
9701A97205j7069l765k139O296p92O28K1335L5484L8263M0697L6641J3334m410
$$ 197205 180136 176371 174232 180528 179736 180364 201699 237183 275446 316143 352784 366118 361708
9688C61708l4504l5617k5987n907j4539j9143j832J2477L2521L9476M1759O5666
$$ 361708 327204 291587 265600 259693 245154 226011 224179 236656 269177 308653 350412 416078
9676D16078P8021P3218N5767K5078j864n0235o6773q3061n6895n4987l8339m0573
$$ 416078 494099 567317 623084 648162 646298 596063 529290 446229 389334 334347 296008 255435
9664B55435k9650r773j6913p064K706q535j1573J231n158Q257R729k586k651N497
$$ 255435 225785 216012 199099 192035 194741 186206 174633 175864 170706 178963 188692 186106 183455 188952
9650A88952l87N103J3232P816J0217J461j1128j5698m902N111Q722L35p979j5269
$$ 188952 188565 193668 206900 214716 224933 226394 215266 199568 194666 199777 208499 208834 200855 185586
9636A85586j49Q236n927l0637p262J3560p33n741j615l737O328J4275P277K300
$$ 185586 185437 193673 187746 157109 149847 163407 162674 156933 155318 151581 157909 172184 179461 181761
9622A81761r131J525P674n742p555O35j0510k879r959N49j992J5514L002R697
$$ 181761 172630 174155 181829 176087 168532 169167 158657 155778 145819 146368 144376 159890 162892 172589
9608A72589N355o48J9807l682j1195J750J2966J6624K2258K5436K2149J3274K112
$$ 172589 177944 177296 197103 193421 182226 183976 196942 213566 235824 261260 283409 296683 298795
9595B98795j165j8742k2066j896j0872N466P122j7250k0860m971J2455O89j7161
$$ 298795 297630 278888 256822 254926 244054 249520 256642 239392 218532 213561 226016 226705 209544
9582B09544j3398N01j575J9273J4869J9878J4805j557l987J6813K7465L1783N7005
$$ 209544 196146 196647 195072 214345 229214 249092 263897 262340 258353 275166 302631 334414 391419
9569C91419O3212M7142O0577M8164Q376j4442m6459o8105p7319o5305l1962j8879
$$ 391419 454631 501773 562350 610514 618890 604448 557989 489884 412565 347260 315298 296419
9557B96419l057Q090p0r759j9897k1693r564j457m236m999J7040K1731J4346k988
$$ 296419 293362 301452 301382 291623 271726 250033 240469 239012 234776 229777 246817 268548 282894 279906
9543B79906j1940j355J650o919l868M736L787K783o610j3713j1321J2770M837
$$ 279906 267966 266611 268261 261342 257474 262210 265997 268780 262170 248457 237136 249906 254743
9530B54743k10l884J661p346n812j535J1490m339k933m188o6r824o648o816k135
$$ 254743 254533 250649 252310 244964 239152 237617 249107 244768 241835 237647 237581 227757 221109 214293 212158
9515B12158J2575J6694O967p201l678J140J3616J8613J0150j100o488k4725j8523
$$ 212158 224733 241427 248394 241193 237515 238655 252271 270884 281034 279934 273446 248721 230198
9502B30198j0615n485o134n632M515J7880m829o405J2098J3047L682J2110J5368
$$ 230198 219583 214098 207964 202332 206847 224727 219898 213493 225591 238638 242320 254430 269798
9489B69798J0544J2422P309j896n354k156K5843L7769L3763K0741K9167L8381
$$ 269798 280342 292764 300073 298177 292823 290667 316510 354279 388042 408783 437950 476331
9477D76331P491j1441k0459l1629k5982p418j586o964j3013L367j779j8424j40
$$ 476331 483822 472381 451922 420293 394311 386893 385307 378343 365330 368697 366918 348494 348354
9464C48354q714j3353o90l575Q748J2625n033j0072J1886Q025o52L231j1418m668
$$ 348354 339640 326287 325597 322022 330770 343395 338362 328290 340176 348201 347549 350780 339362 334694
9450C34694r993l501J7273J4874M274J7505O703l340J3693K6546M3294N1002N4853
$$ 334694 324701 321200 338473 353347 357621 375126 381829 378489 392182 418728 462022 513024 567877
9437E67877N2713J7074j1984m5203o6989n2052l0065q446J0239M078K657K987
$$ 567877 620590 637664 625680 580477 513488 461436 431371 422925 433164 437242 439899 442886
9425D42886j052R559j837N25J0309L954J1389J1412J27O24L827J2595K4678J8243
$$ 442886 441834 451393 449556 450081 460390 464344 475733 487145 487272 487896 491723 504318 528996 547239
9411E47239J3153Q680J4339K6940L5304M0084L0274J9685J6915K3339J2658M391
$$ 547239 560392 569072 583411 610351 645655 685739 716013 735698 752613 775952 788610 793001
9399G93001q019L051J15j0474J5427L4072J7145Q48J3884N072q568m833Q58K3636
$$ 793001 784982 788033 788148 777674 793101 827173 844318 845166 859050 864122 855554 850721 851579 875215
9385H75215K9883r121m93J5180M559m85o459K8296M9475L8127M6298O1780N1441
$$ 875215 905098 895977 895484 910664 915223 914738 908279 936575 986050 1024177 1070475 1132255 1183696
9372A183696M8138O8348O9954Q8233Q7331P0255N9619M7078M8815L5613M3792
$$ 1183696 1231834 1300182 1370136 1458369 1545700 1615955 1675574 1722652 1771467 1807080 1850872
9361A850872K9591L0840M5777M3045M0685M8167N9921O7762P0441P6170P5311
$$ 1850872 1880463 1911303 1957080 2000125 2040810 2088977 2148898 2216660 2287101 2363271 2438582
9350B438582J02662J35751J61624K06249K22792K04441J96410J88280J75255K06070
$$ 2438582 2541244 2676995 2838619 3044868 3267660 3472101 3668511 3856791 4032046 4238116
9340D238116K53347K97331L49727M09032M83554N23764N50583N73408O13456P05165
$$ 4238116 4491463 4788794 5138521 5547553 6031107 6554871 7105454 7678862 8292318 8997483
9330H997483Q45665J034023J298645J635825K068069K623801L328980M290326
$$ 8997483 9843148 10877171 12175816 13811641 15879710 18503511 21832491 26122817
9322B6122817N630889P470758J0014173J3686827J9550046K9279614M3739898
$$ 26122817 31753706 39224464 49238637 62925464 82475510 111755124 155495022
9315A55495022N9603853O7022848N6899155L2437394n379805n4228623p5903635
$$ 155495022 215098875 282121723 339020878 371458272 366078467 311849844 235946209
9308B35946209o2833576m3283486k9300737k0601235j5175233j1585662q876353
$$ 235946209 173112633 129829147 100528410 79927175 64751942 53166280 44289927
9301D4289927o692952n031328l861540l059665k509206k051331j688604j410801
$$ 44289927 37596975 32565647 28704107 25644442 23135236 21083905 19395301 17984500
9293A7984500j175244r82662q53622p68053p21271p15946o93824o60572o34314
$$ 17984500 16809256 15826594 14972972 14204919 13483648 12767702 12073878 11413306 10778992
9284A0778992o03987n63506n04491m23943l53543k96217k80753k88413k82181
$$ 10778992 10175005 9611499 9107008 8683065 8329522 8033305 7752552 7464139 7181958
9275G181958k58944k39984k20774j98154j63754j25990o8226m1519k3114M4833
$$ 7181958 6923014 6683030 6462256 6264102 6100348 5974358 5906132 5864613 5841499 5886332
9265E886332J42518K37289M66132Q83179J743973L330182N328642O102985M473535
$$ 5886332 6028850 6266139 6732271 7615450 9359423 12689605 18018247 24121232 28594767
9256B8594767K389734k080045q259175o748600l760164k208026j376369q80349
$$ 28594767 30984501 28904456 20645281 13896681 10136517 7928491 6552122 5671773
9248E671773n97865m36975l44467k59156k05129j75956j59130j30981j08793j08447
$$ 5671773 5073908 4636933 4292466 4033310 3828181 3652225 3493095 3362114 3253321 3144874
9238C144874r3263r0330j01938q1717p6946p7396p2741p8741n6401m9036m3996
$$ 3144874 3051611 2961281 2859343 2777626 2700680 2623284 2550543 2471802 2415401 2366365 2322369
9227B322369k9890k2010r016J9229M9351P2799N9620J612o9858j34023j75010
$$ 2322369 2292479 2270469 2261453 2280682 2330033 2402832 2462452 2464064 2394206 2260183 2085173
9216B085173j51321j00392p8101n9041n8448o0480m0495l7128n3727l9886k5799
$$ 2085173 1933852 1833460 1755359 1696318 1637870 1577390 1536895 1499767 1446040 1406154 1380355
9205A380355l1524j9405r691j5150l009o652o250L923r474j5858j0872j5860j642
$$ 1380355 1348831 1329426 1319735 1304585 1301576 1294924 1288674 1292597 1283123 1267265 1256393 1240533 1238891
9192A238891k430J0061J519M73K606K193l552L169j9808n0272m6068k8183q189
$$ 1238891 1236461 1246522 1248041 1248514 1251120 1253313 1249761 1252930 1233122 1182850 1136782 1108599 1100410
9179A100410o526J4950k03j1562k2588k7554m5710n9210m4119m0764l8636l1416
$$ 1100410 1093884 1108834 1108631 1097069 1074481 1046927 1001217 942007 897888 857124 818488 787072
9167G87072l6667l7316k7692j3111O150K335l75J8662J4436q65j332r47J9381
$$ 787072 750405 713089 685397 672286 678436 680771 680396 699058 713494 712629 711297 710350 729731
9154G29731K2901J1027J2725J3782K4294o37l5481l0774j3440k6675j0097k874
$$ 729731 752632 763659 776384 790166 814460 813823 778342 747568 734128 707453 697356 694482
9142F94482r053j3878j9943j3368j253J1476p927K1674M3579N2289L4796K4728
$$ 694482 685429 671551 651608 638240 636987 648463 640536 662210 705789 758078 792874 817602
9130H17602J7852Q487J679j1026m0783m3637k5142k8966l8132l7801l0387j4246
$$ 817602 835454 843941 845620 834594 793811 750174 725032 696066 657934 620133 589746 575500
9118E75500j7792J3308J1447L936L854K0446K4070J3282K766J8769K0326J9554
$$ 575500 557708 571016 582463 586399 590253 610699 634769 648051 650817 669586 689912 709466
9106G09466L5133M0639M5897P0703J22627J62952K29332K82572L11775L14290
$$ 709466 744599 785238 831135 901838 1024465 1187417 1416749 1699321 2011096 2325386
9096B325386K55826J48948l806j65428k76768l30865l17207k60928j84891j23462
$$ 2325386 2581212 2730160 2726354 2560926 2284158 1953293 1636086 1375158 1190267 1066805
9086A066805j05070q4822m9404n2739j8879j3892j5359l0887j4648K05j106O936
$$ 1066805 961735 876913 827509 774770 755891 741999 726640 695753 681105 681310 680204 687140
9074F87140J8003K8975K7944M9186J00788J50148J96506K56934L28152L40308
$$ 687140 705143 734118 762062 811248 912036 1062184 1258690 1515624 1843776 2184084
9064B184084L00797K00050M1096j05813k37105l11066l03958k83391k39924j84300
$$ 2184084 2484881 2684931 2726027 2620214 2383109 2072043 1768085 1484694 1244770 1060470
9054A060470j41217r6824n2767l8761j7829l1160l3162k5918k3076l1756j5601
$$ 1060470 919253 822429 769662 730901 713072 681912 648750 622832 599756 568000 552399
9043E52399j7980k5953k1414m4055k1977o229n921r389k917n855j1125j7918p318
$$ 552399 534419 508466 487052 442997 421020 414791 408870 399481 396564 390709 379584 361666 354348
9030C54348N506J1423k121m824l30k537j724J069p196m59j4772j351K777J3823
$$ 354348 359854 371277 369156 364332 364002 361465 359741 360810 353614 353155 338383 337032 339809 353632
9016C53632J1783P935J1100o175p826N03J429J5114L434r554n615r297j3045p844
$$ 353632 365415 373350 384450 378275 370449 370952 372381 387495 390929 381375 375760 366463 353418 345574
9002C45574p264n108m718J1547K6572J783N52Q258J905k300M75q886l602p442
$$ 345574 338310 333202 328484 340031 366603 368386 368938 377196 379101 376801 377276 368390 364788 357346
8988C57346n078Q662K034n347l355k698q150j1997J108Q745n975p490r036p605
$$ 357346 352268 360930 362964 357617 354262 351564 343414 331417 332525 341270 335295 327805 318769 311164
8974C11164Q499J4183O906J7336M68l987n477K266n361Q722P812K3626K6018K8017
$$ 311164 319663 333846 340752 358088 358556 354569 349092 351358 345997 354719 362531 386157 412175 440192
8960D40192K1888M1148O3973O5453P0655R0836Q6923O0320L4439L2769j667n3100
$$ 440192 462080 503228 567201 632654 703309 794145 881068 941388 975827 1008596 1006929 953829
8948I53829m0823j6364J2153o908j9687m9150p7019q1706o0299m6762m4627k9678
$$ 953829 913006 896642 908795 901887 882200 833050 756031 674325 614026 567264 522637 492959
8936D92959j6704k827j428J2572L1347M8541M6146M4948M1494K7390J6594N1346
$$ 492959 476255 473428 472000 484572 515919 564460 610606 655554 697048 724438 741032 792378
8924G92378N2340M5899P8791O3553K2839J6925j6700p4737r9433r7561o1345k1096
$$ 792378 844718 890617 969408 1032961 1055800 1072725 1056025 981288 881855 784294 722949 701853
8912G01853o385K6437J4863J0856N864Q601j0354j3851k0780r656o818m737p935
$$ 701853 695468 721905 736768 747624 753488 762089 751735 737884 717104 707448 700630 695893 687958
8899F87958q79o311M990N346P199o737k649j8781k4633k6408k957n281j7766l5211
$$ 687958 687079 680768 685758 691104 698303 691566 688917 670136 645503 619095 616138 610857 593091 557880
8885E57880l1340j8622j3689O67R055J2624L3657L2099K9117L6032L8491N3381
$$ 557880 526540 507918 494229 494896 503951 516575 550232 582331 611448 647480 685971 739352
8873G39352M9417L2667J5866K061r570m379j5930l5863n2970l6188l9793k9575
$$ 739352 788769 821436 837302 839363 829793 825414 809484 773621 720651 684463 644670 615095
8861F15095j8886k9806n158j3522j8127k4288j5972l927K0899J7083J2930L655
$$ 615095 596209 566403 561245 547723 529596 505308 489336 485409 506308 523391 536321 539976
8849E39976J2683J9027L3591L2569K4809K184Q499K4457J9558P282J7029K3677
$$ 539976 552659 571686 605277 637846 662655 664839 673338 697795 717353 724635 741664 765341
8837G65341J8475L0977L8307M4298N2909O7418N9563M7426L2262J6226J8120P1042
$$ 765341 783816 814793 853100 897398 950307 1017725 1077288 1124714 1156976 1173202 1191322 1262364
8825A262364Q7422O4024K6741k4539m1252o1660o8662m4702k7368K3766P0917
$$ 1262364 1349786 1413810 1440551 1416012 1374760 1313100 1244438 1199736 1172368 1196134 1267051
8814A267051J05363J38738J64416J60663J33340N1599l0798r1342j27975r8214
$$ 1267051 1372414 1511152 1675568 1836231 1969571 2021170 1990372 1899030 1771055 1672841
8804A672841p2775k6422j3193j367O947O289K0012J3361M6826P9926R2283J02067
$$ 1672841 1600066 1573644 1560451 1559084 1566031 1572320 1592332 1605693 1652519 1732445 1824728 1926795
8792A926795J26225J07357O8294J4441j4075q327o143k356K33J2381K4683K5405
$$ 1926795 2053020 2160377 2228671 2243112 2229037 2220710 2214567 2212211 2212444 2224825 2249508 2274913
8780B274913L1758M0552O7471R2349J17578J30106J39558J30870J06988M3433
$$ 2274913 2306671 2347223 2414694 2507043 2624621 2754727 2894285 3025155 3132143 3175576
8770C175576J4712j0741k7176j5593L936L4529M7198N4724M2501N8213M6911M5187
$$ 3175576 3190288 3179547 3152371 3136778 3140714 3175243 3222441 3277165 3319666 3377879 3424790 3469977
8758C469977N7083K8979M4623K5533O014J1745k86K6914O1718J09368J46707J60112
$$ 3469977 3527060 3556039 3600662 3626195 3632209 3643954 3643668 3670582 3732300 3841668 3988375 4148487
8746D148487K02676K64034L24406L74671L92913L62744K39557O0601Q180N86J7251
$$ 4148487 4351163 4615197 4939603 5314274 5707187 6069931 6309488 6370089 6378269 6378855 6396106
8735F396106Q8204J91545K98962L81193L88284L95270M28041M80917N53949O32136
$$ 6396106 6484310 6675855 6974817 7356010 7744294 8139564 8567605 9048522 9602471 10234607
8725A0234607P43614Q65688R51495J062999J192677J342173J554246J887212K339014
$$ 10234607 10978221 11843909 12795404 13858403 15051080 16393253 17947499 19834711 22173725
8716B2173725K846826L349154L830631M230210M467416M681802N164686O201793
$$ 22173725 25020551 28369705 32200336 36430546 40897962 45579764 50744450 56946243
8708E6946243Q276421J2103839J8483586K8746404M4729568O6560084Q8175696
$$ 56946243 65222664 77326503 95810089 124556493 169286061 235846145 324021841
8701C24021841R6081802P9992209M3870910j0193876p4458240j05856425r2729945
$$ 324021841 420103643 500095852 543966762 533772886 459314646 353458221 260728276
8694B60728276o6570086m5172514l0260716k0192908j3447852q852876n707387
$$ 260728276 194158190 148985676 118724960 98532052 85084200 76231324 70523937
8687G0523937l683550k600366k246509k034566j464003o35104K56921J120511
$$ 70523937 66840387 64240021 61993512 59958946 58494943 57859839 58116760 59237271
8679E9237271J828410K457510L355124M821537P334591J1751899J8984623L0583713
$$ 59237271 61065681 63523191 66878315 71699852 79034443 90786342 109770965 140354678
8671A40354678M8433182P1678128R2153348R5360087P3992348L3963906k5145819
$$ 140354678 188787860 260465988 352619336 447979423 521971771 555935677 530789858
8664E30789858q7111255j06766656q7500589o1740553m2104970k8623294j9543910
$$ 530789858 443678603 336911947 249411358 187670805 145565835 116942541 97398631
8657I7398631j3439341r286078o535827m910030m283153m364541m474230m327660
$$ 97398631 83959290 74673212 68137385 63227355 58944202 54579661 50105431 45777771
8649D5777771m057633l671571l248773k857267k438826k019124j696201j447647
$$ 45777771 41720138 38048567 34799794 31942527 29503701 27484577 25788376 24340729
8641B4340729j272073j134539j042306r40985q54403p75714p39892p40669p09246
$$ 24340729 23068656 21934117 20891811 19950826 19096423 18320709 17580817 16840148 16130902
8632A6130902o70898o25097n64262n06653m77189m31017l71903l40933l06663
$$ 16130902 15460004 14834907 14270645 13763992 13286803 12855786 12483883 12142950 11836287
8623A1836287k49322j86282j09215n7616k7491k587J6620j575k3399o0312j46599
$$ 11836287 11586965 11400683 11291468 11233852 11206361 11203774 11220394 11218819 11195420 11135108 10988509
8612A0988509k94850m76369n47265m65132l21059k26732k06119k21673k62375
$$ 10988509 10693659 10217290 9670025 9204893 8883834 8657102 8450983 8229310 7966935
8603G966935l57884m02327l74733l08022k60145k02755j80166j67645j33340j00515
$$ 7966935 7609051 7206724 6831991 6523969 6263824 6061069 5880903 5713258 5579918 5479403
8593E479403q3749p3845q1864r6652j13910j03752j04402j11590j04572j05486
$$ 5479403 5395654 5321809 5239945 5143293 5029383 4925631 4821229 4709639 4605067 4499581
8583D499581j11602j03893r2162p3745l8161J0754N7555P9399O7919K7378l4996
$$ 4499581 4387979 4284086 4191924 4118179 4080018 4090772 4148327 4227726 4295645 4323023 4288027
8572D288027j41058k08394k22386j71458j27614r3499o4670k0754K94j3421l5774
$$ 4288027 4146969 3938575 3716189 3544731 3417117 3323618 3258948 3238194 3238488 3225067 3189293
8561C189293m7742q0694j03075j13935j06749j04115r0990m7868k5362l1944l3697
$$ 3189293 3141551 3060857 2957782 2843847 2737098 2632983 2541993 2494125 2468763 2436819 2403122
8550B403122m2653m6862l8931l6402m3029k7879k8195k1188O895O696j2310m862
$$ 2403122 2360469 2313607 2274676 2238274 2195245 2167366 2139171 2117983 2124878 2131574 2119264 2114402
8538B114402l1526o1743q6739r2244p1981n1690k9115l9041n2587m1213l8882
$$ 2114402 2082876 2021133 1934394 1842150 1770169 1718479 1689364 1650323 1597736 1556523 1517641
8527A517641m8238l8286k3014k6733m679L306J9355L3432M6643K4721M302k8707
$$ 1517641 1469403 1431117 1408103 1381370 1376691 1379997 1399352 1432784 1479427 1504148 1508450 1479743
8515A479743m6172n2953n9390n3662l4100l1203k9211l6600l6059j5022j5706
$$ 1479743 1433571 1380618 1321228 1267566 1233466 1202263 1173052 1136452 1100393 1085371 1069665
8504A069665j3282p385P272k976K928Q095J9350K3298L1247M0916O1904Q6010
$$ 1069665 1056383 1048998 1056270 1053294 1056222 1064317 1083667 1106965 1138212 1179128 1241032 1327042
8492A327042R6271J01001Q6058O5454O9078L5678l679n0817n6261m9403l7823
$$ 1327042 1423313 1524314 1610372 1675826 1744904 1780582 1776903 1726086 1669825 1620422 1582599
8481A582599n3673m4590j7874k1782m1273p3433p2805p9148r9737q5568m9698
$$ 1582599 1528926 1484336 1466462 1444680 1403407 1329974 1257169 1178021 1078284 992716 943018
8470I43018j6400k973r435k2469k7284l3905m1091m4242l9917l1256k7515k0305
$$ 943018 926618 923645 914210 891741 864457 830552 789461 745219 705302 674046 646531 626226
8458F26226j8164r863j0077p490p772j773J3348r350j8404M490p768o774K1500
$$ 626226 608062 598199 588122 580632 572860 571087 584435 575085 556681 561171 553403 546629 568129
8445E68129K6934j1645o99j75K3966N508k233j7073k2266l3522k0905N527Q582
$$ 568129 595063 583418 582719 582544 606510 612018 609785 592712 570446 536924 516019 521546 530128
8432E30128m33j2199k2817j4882r304k259L255K0704J6059P014Q805J2515J7998
$$ 530128 529695 517496 494679 479797 470493 468234 471489 492193 508252 515266 524071 536586 554584
8419E54584M454o911j3454Q722O970N040q261j0292k1395k9629k6498k3999l0333
$$ 554584 559038 552127 538673 547395 554365 559405 551144 540852 519457 489828 463330 439331 408998
8406D08998j9487j6382n936k507N327M347O119Q056K905r067j0199J1168J0893
$$ 408998 389511 373129 367193 364686 370013 374360 380479 388535 391440 382373 372174 383342 394235
8393C94235J0513J3391P894K081P196K7737J8510L718r33R088J3962K881K0449
$$ 394235 404748 418139 426033 428114 435310 463047 481557 485275 484342 493430 507392 510273 530722
8380E30722L4726N7810Q9086O8339N7620L4672J6943l2961p2796r0964p3689o2318
$$ 530722 565448 623258 712344 780683 838303 872975 889918 856957 784161 693197 619508 557190
8368E57190o3368m7141k5564k4757n045l552j0666m530N007K9467O0569O1694
$$ 557190 493822 446681 421117 396360 391315 387763 377097 372567 377574 407041 467610 529304
8356E29304M0648J3327j1711k6757n3053l3644j0080j5062k771l106K517J9816
$$ 529304 569952 583279 571568 544811 491758 458114 448034 432972 430201 427095 429612 449428
8344D49428L4763M1259L0134P5485J15602J28542J49054J70850J46085Q4306l374
$$ 449428 484191 525450 555584 631069 746671 875213 1024267 1195117 1341202 1425508 1422134
8333A422134q8056j29924j53147j59602j28897r4201p0063l9229l3778N18j874
$$ 1422134 1334078 1204154 1051007 891405 762508 668307 598244 559015 525237 525755 523881
8322E23881l73q000j2294K4226K4077K2993M8297O1040J07180R5091Q0909N5788
$$ 523881 523508 515508 503214 527440 551517 574510 622807 683847 791027 886118 967027 1022815
8310A022815K6429J6504J7588K9762N7531J35783K06386K58727L23520L48306
$$ 1022815 1049244 1065748 1083336 1113098 1170629 1306412 1512798 1771525 2095045 2443351
8300B443351L20748K49783J32905J580j40713k26423k69185k45650j83824j44985
$$ 2443351 2764099 3013882 3146787 3148367 3007654 2781231 2512046 2266396 2082572 1937587
8290A937587j49094j57464j68239j70204j64021j37394j04996n1320k9098N36
$$ 1937587 1788493 1631029 1462790 1292586 1128565 991171 886175 834855 805757 806293
8280H06293K4665k950J6396L2616L5428L8333O7788J10304J35479J97522K48558
$$ 806293 830958 828008 844404 877020 912448 950781 1018569 1128873 1264352 1461874 1710432
8269A710432K75892L04278L21917K81839J90986P1511p3697j86856k56464k47427
$$ 1710432 1986324 2290602 2612519 2894358 3085344 3156855 3083158 2896302 2639838 2392411
8259B392411j84580j58105j54922j74086j64909j47440j39156j22658r3472p6123
$$ 2392411 2207831 2049726 1894804 1720718 1555809 1408369 1269213 1146555 1053083 976960
8249I76960q2605q8927q2093p3248o5687p3543l6806j9741j4434o46m235q786
$$ 976960 894355 805428 723335 650087 584400 510857 474051 454310 439876 439230 434995 426209
8237D26209O743Q916R24l341k591J6380J8843R257P306p75J1800N488K817J5175
$$ 426209 432952 441868 442792 439451 436860 453240 472083 481340 488646 487871 499671 505159 507976 523151
8223E23151K6081K7736J3910L968r327p914J5190K3259K1373Q427Q679j2782k4400
$$ 523151 549232 576968 590878 594846 585519 577605 592795 616054 637427 645854 654533 641751 617351
8210F17351n967M535j1976l4265l0794l7315l7831l7463k9711m957k7638k2023
$$ 617351 611384 615919 603943 569678 538884 501569 463738 426275 396564 391607 363969 341946
8198C41946m762r917O841P541r980o273l566k1839L878J0499K0051K3961K7347
$$ 341946 337184 327267 334108 341649 331669 325396 321830 299991 303869 314368 334419 358380 385727
8185C85727L2009L6784L4469M6165P1244J08778J52924J85771J86956J49216O9313
$$ 385727 417736 454520 488989 535154 606398 715176 868100 1053871 1240827 1390043 1459356
8174A459356l9570j51407j68618j44314j11213q5833n4425l6029j9252k1273j0065
$$ 1459356 1419786 1268379 1099761 955447 844234 758401 703976 667947 648695 627422 617357
8163F17357j3595j8367q246j7331k4959l6200j3651p02m976p37Q152R61j0424
$$ 617357 603762 585395 577149 559818 534859 498659 485008 484306 479330 478593 486745 487706 477282
8150D77282K930K5271J9365L4009M1090K1234K4947L1544N5283O0929M9155J6611
$$ 477282 480212 505483 524848 558857 599947 621181 646128 677672 732955 793884 843039 859650
8138H59650J452k0551j9512q371N649L0111L1898L6935M4058J4178j1333l9241
$$ 859650 861102 840551 821039 812668 818317 848428 880326 917261 961319 975497 964164 924923
8126I24923n4893o2008n9064n4381m9486n5845n1392m9772l7360k1469p28j2928
$$ 924923 870030 808022 748958 694577 645091 589246 537854 488082 450722 429253 428525 415597
8114D15597p439j7615r754J3233J9670L9862N1675M7326L0961j2551l5141l6739
$$ 415597 408158 390543 380789 394022 413692 453554 505229 552555 583516 570965 535824 499085
8102D99085l7919n3665m0347k6194r526p896j2665j6730j0699K696J2134M3407
$$ 499085 461166 407501 367154 340960 331434 323538 310873 294143 283444 286140 298274 341681
8090C41681N1809O4019N4971M0021R841j0038k8936k7984j6540k662J806L533
$$ 341681 393490 457509 512480 552501 562342 552304 523368 495384 478844 476182 477988 481521
8078D81521J0986K6666M7109N2982L5171K1001L794o6736j00143o2721l5346l5715
$$ 481521 492507 519173 566282 619264 654435 675436 679230 612494 512351 449630 414284 378569
8066C78569k0824j179q320j7743j8385r31j540j2372N37J2173J1388k806n574
$$ 378569 357745 356566 348246 330503 312118 311187 309647 297275 297812 309985 321373 318567 312993
8053C12993O681j208k9982j9609o138m597Q634L650r460L509j4550k6809k699
$$ 312993 319674 318466 288484 268875 262737 258140 266774 270424 260964 264473 249923 223114 220415
8040B20415J8411J4128K1916J9334K2786L7502M2601P9840O4115K9934n514o3007
$$ 220415 238826 252954 274870 294204 316990 354492 397093 476933 541048 570982 565468 502461
8028E02461p6065n2142k6215k9226j3350P342J7023L1479J9826J871n719m180
$$ 502461 426396 374254 348039 318813 305463 312805 329828 361307 381133 383004 377285 373105
8016C73105k4602l757J8779K3486K1248K3579K7464L3132J8519O770R522K228
$$ 373105 348503 344746 363525 387011 408259 431838 459302 492434 510953 517723 527245 529473
8004E29473q183R59j5980l0644j8039l609J5707J3225Q331j817Q954j163k3060
$$ 529473 521290 522249 506269 475625 457586 453977 469684 482909 491240 489423 498377 497214 474154
7991D74154l4534m9876l4655k4506k4577J449N317r250j5547n816P683q872j6921
$$ 474154 439620 389744 355089 330583 306006 307455 312772 303522 287975 282159 289842 280970 264049
7978B64049P440J6625K449k432l842j5102K312P791M039j81k413j0801j9162O94
$$ 264049 271489 288114 290563 288131 284289 269187 271499 279290 283329 283148 280735 269934 250772 251466
7964B51466k410O640K4554N2582N9237M2959K8377J7651J2701j8799l4913j979
$$ 251466 249056 255696 280250 332832 392069 435028 463405 481056 493757 474958 440045 438066
7952D38066J4956K3140L7110K9054J5474n998m636j3531l9167l2724m9591m6233
$$ 438066 453022 476162 513272 542326 557800 551802 547166 533635 494468 461744 412153 365920
7940C65920k0904k1179j8560p694l905J3209J8687J128J3090J6760J0764J4693
$$ 365920 345016 323837 305277 297583 293678 306887 325574 326702 339792 356552 367316 382009
7928C82009K5973M2416O3583P7428J47388K05865K46560K10298J10480q316j65756
$$ 382009 407982 450398 513981 591409 738797 944662 1191222 1401520 1512000 1503684 1337928
7917A337928k48913k05426r9009j0121M2009N8839M9138K6683k2900m0540o6338
$$ 1337928 1089015 883589 784580 774459 816468 875307 924445 951128 928228 887688 821350
7906H21350n3148n0032n2454o6786n9420m6570m0961l7276j0789j8442k5485l9935
$$ 821350 768202 718170 665716 598930 539510 492940 451979 414703 403914 385472 359987 320052
7894C20052k9207k7696j4246q901k367J1208j1261j2012n046P546p182j9945r87
$$ 320052 290845 263149 248903 240002 237635 248843 237582 225570 220524 228070 220888 200943 199956
7881A99956O653n274J2276J0955K599K1179K4801J1460M104Q400J8928K5569K6861
$$ 199956 206609 201335 213611 224566 227165 248344 273145 284605 288709 297109 316037 341606 368467
7868C68467L0158M5510L4423N5722L6474P998l4535p6434p9165o6347n3799m3714
$$ 368467 398625 444135 478558 534280 570754 578752 544217 467783 388618 322271 268472 224758
7856B24758k6787k2569j2658k817q878J32p729j618L624L448K61n403P908K298
$$ 224758 197971 175402 162744 159927 151049 151181 143452 141834 145458 148906 149167 143764 151672 153970
7842A53970l579j1910L626L694k062M15M061J3980J0317K9594K4701K9560L4756
$$ 153970 150391 138481 142107 145801 143739 144154 148215 162195 172512 202106 226807 256367 291123
7829B91123K4783M6119L0859J4144K1489K1374J8618j6773k555J411q43J9186
$$ 291123 315906 362025 392884 407028 428517 449891 468509 451736 449181 450592 449749 468935
7817D68935L8082M1937L7729L5073K8890L3124N2847P5197O9048M8026o346p4421
$$ 468935 507017 548954 586683 621756 650646 683770 736617 811814 880862 928888 922542 848121
7805H48121j08489j30474j27079j00819o0113l4584k8241k9932k6638p590q481
$$ 848121 739632 609158 482079 381260 321147 286563 258322 228390 201752 194162 185681
7794A85681M995q535n08N021j0615j1076P766m449P484Q327J0455K0557J3716
$$ 185681 190676 182141 181633 186654 176039 164963 172729 168280 175764 184091 194546 215103 228819
7781B28819K4831K9639J5646J2760M8656O0431O9144N3047N4545N9393J9102L992
$$ 228819 253650 283289 298935 311695 360351 420782 489926 542973 597518 656911 676013 680005
7769F80005O690K0963M9585O3342N2637J6645m3044j12745j35691j08595r8823
$$ 680005 686695 707658 757243 820585 873222 889867 846823 734078 598387 489792 390969
7758C90969p4753m7307k5228j5379k538j2190l0113j8061O958R858N141j2508
$$ 390969 316216 268909 243681 228302 225764 213574 183461 165400 172358 182216 187357 174849
7746A74849j8477j4167L939P268m440J998n078j6738K103k415j934P94J5564P366
$$ 174849 156372 142205 146144 153412 148972 150970 145892 129154 131257 128842 126908 127702 143266 150632
7732A50632n070J758Q149P094J5481J9230J3440Q830k7569k4322k1296k8415j3426
$$ 150632 145562 147320 155469 162563 178044 197274 210714 219544 191975 167653 146357 117942 104516
7719A04516j8488j6397j4509r163k873J2900K0617J0871n40K2501J0648K5666
$$ 104516 86028 69631 55122 45959 43086 55986 76603 87474 86934 109435 120083 145749
7707A45749K5126K131j8455k8843q712O980j0446j2218j2273O632Q530r232o073
$$ 145749 170875 173006 154551 125708 116996 123976 113530 101312 89039 95671 104201 94969 88896
7694H8896k209N541J6178K0955J1745J9941K6259K1981K5009Q270n86L954J0637
$$ 88896 86687 92228 108406 129361 141106 161047 187306 209287 234296 242566 241980 245934 256571
7681B56571K077j3073j2631m909n046k379k0362l1451k3241k5552j1379o815j6129
$$ 256571 258648 245575 232944 228035 222989 220610 200248 168797 145556 120004 108625 101810 85681
7668H5681j3399q936N031J6586J4843N590P204J3673O290O647k090n645k1695
$$ 85681 72282 63346 68377 84963 99806 105396 112600 126273 132563 139210 137120 131475 109780
7655A09780k0707j5608Q88j0139j4717j7190p952Q840j0836n76L323J0596J5266
$$ 109780 89073 73465 74353 64214 49497 32307 24355 33195 22359 21783 25106 35702 50968
7642E0968K422j2402n335k045n482Q437J2868L520O77Q525m892n094j622M484
$$ 50968 53390 40988 35653 33608 28126 36563 49431 52951 53628 62153 57261 52167 50545 55029
7628E5029j855M259j252r926r09N473J500K761J6651J4587J1082j4030j9639q062
$$ 55029 53174 57433 56181 46255 45346 50819 52319 55080 71731 86318 97400 83370 63731 55669
7614E5669j1941j0289j1139J462L121r166M02M737J6335j385K222j951j1516m258
$$ 55669 43728 33439 22300 23762 26883 17717 18119 22856 39191 37806 40028 38077 26561 22303
7600B2303J5300M164o973l288J589k376l873L342o741K359k090K034O945J0944
$$ 22303 37603 41767 34794 31506 33095 30719 26846 30188 23447 25806 23716 25750 32695 43639
7586D3639p548j233J82J855n576M399P99p04j210j1079Q045j0370J0598m201j5820
$$ 43639 36091 34858 35040 36895 31319 35718 36517 35813 34603 23524 31569 21199 31797 27596 11776
7571A1776L916k791j1842O189J7692P53O958P167j2019L76N705j1914N917n424
$$ 11776 15692 12901 1059 7248 24940 25693 32651 39818 27799 28175 33880 21966 27883 22459
7557B2459r305Q405M411k151k983j447m17J912q340J126r40r856k888J2506P96
$$ 22459 13154 21559 25970 23819 20836 19389 18972 20884 12544 13670 12730 2874 -14 12492 13288
7542A3288N950J668k0195R149P949O294N519N748j560P234l088m878R279q52M178
$$ 13288 19238 20906 711 9860 17809 24103 29622 35370 33810 41044 37956 33078 42357 41505 45683
7527D5683J143L844L158L838M925l701k1176k0302q905N151J4905J597m788J237
$$ 45683 46826 50670 53828 57666 62591 58890 37714 17412 8507 13658 28563 30160 25372 26609
7513B6609P962M350N247r794P50M467L781L920r32q823p257M450J702J075M584
$$ 26609 34571 38921 44168 34374 35124 39591 43372 47292 46360 37537 30280 34730 36432 37507 42091
7498D2091p057j1225p971o901P542o156j1138J3329M814N259K313P9j4173j5051
$$ 42091 35034 23809 15838 8937 16479 10323 -815 12514 17328 22587 24900 24979 10806 -4245
7484d245M528K4431J0493r297j233R198j285j3789j879N817j4R23N982m854j615
$$ -4245 283 24714 35207 25910 24677 33875 32590 18801 16922 22739 22725 23648 29630 24776 23161
7469B3161L782j621j3601K394J8841J2345L596k799J3019J5670j7650p23q895
$$ 23161 26943 25322 11721 14115 32956 45301 48897 46098 59117 74787 57137 56414 47519
7456D7519k347m516K513j0912N50J1627J3659q858J885K782j4392k402q211j4136
$$ 47519 45172 40656 43169 32257 32807 44434 58093 49235 51120 53902 39510 37108 28897 14761
7442A4761j4337J181o388p275J1172M852J5696K2250j1528p834l822n499L451
$$ 14761 424 1605 -4783 -12058 -886 3966 19662 41912 30384 22550 18728 13229 16680
7429A6680M653n50o116j583O17J359R643K026nk6327j2158k539K4135K1233n75
$$ 16680 21333 20783 14667 13084 13701 15060 24703 26729 26724 397 -11761 -14300 9835 31068 30493
7414C0493j1476J1425k888p234m784m503Q576Q118j5044L713M775K320n672r584
$$ 30493 19017 30442 27554 20320 15536 11033 19609 27727 12683 16396 21171 23491 17819 8235
7400H235J3J2924J0579j1741J0441J3600K065j0990l588M832J920N418j3141j0993
$$ 8235 8248 21172 31751 20010 30451 44051 46116 35126 31538 36370 38290 43708 30567 19574
7386A9574J0898R541j486k452j5485Q808j0800n735J3014P018M628j8865k8851
$$ 19574 30472 40013 38527 36075 20590 29398 18598 12863 25877 32895 37523 18658 -10193
7373a0193J2637J0716N989p1q422l791r47j61J702l436M348J5166k500m77Q388
$$ -10193 2444 13160 19149 19078 10656 6865 5918 5757 7459 4023 8371 23537 21037 20560 28948
7358B8948Q707j109r449o090r042n211k453j010l79k737p387j1922R779J3124
$$ 28948 37655 36546 27097 21007 11965 6754 4301 3291 2912 175 -7212 -19134 -9355 3769
7344C769P274J8478J4839o713j1323n813R409L059j6399J0458J1269P872J464
$$ 3769 11043 29521 44360 37647 26324 20511 29920 32979 16580 27038 38307 46179 47643
7331D7643j9021j3750P726o750p310o314k168N703J955J2069K6504N481r958p087
$$ 47643 28622 14872 22598 15848 8538 2224 56 5759 7714 19783 46287 51768 41810 34723
7317C4723r430o393O6p539L189O921p879l924r918J3071K1580L278M587j0365
$$ 34723 25293 18900 18966 11427 14616 21537 13658 9734 -184 12887 34467 37745 42332 31967
7303C1967j1199k852l409M637J1281n278j7403n786O467K208n775j1396P915J3306
$$ 31967 20768 17916 14507 19144 30425 25147 7744 1958 8425 10633 4858 -6538 1377 14683
7289A4683k366j637n299N446J5647k278j7863j0364J375r928J774o098Q807J1761
$$ 14683 12317 10680 5381 10827 26474 24196 6333 -4031 -2656 -12584 -10810 -16908 -8101 3660
7275C660Q532J505Q21j5471p493K333K77j4342M989L996J4762K0769O456q938
$$ 3660 12192 13697 14518 -953 -8446 -6113 -5836 -20178 -15189 -11193 3569 24338 30794 21856
7261B1856j2575l938P214p491k6998j0158K862Q232P022K959n532J0461K1971
$$ 21856 9281 5343 12557 5066 -21932 -32090 -29228 -20996 -13974 -11015 -16547 -6086 15885
7248A5885M494j482k398J0955J0210o61j2584q553M130K378j542l369o774j5669
$$ 15885 20379 18897 16499 27454 37664 37003 24419 15866 19996 22374 20832 17463 10689 -4980
7234d980m05J0531J9742J980m806n664j4069j0013M669J066J8402j507m40P237
$$ -4980 -5385 5146 24888 26868 22062 16398 2329 -7684 -3015 -1949 16453 14946 14506 21743
7220B1743q499n442p767K291R623m774r115o768M319P011J0518J4182K583o80
$$ 21743 13244 7802 35 2326 11949 7175 -1940 -8708 -4389 2622 13140 27322 29905 29225
7206B9225k871M042P724j5652j2757J373O023J313K988n842j448J5095p565n286
$$ 29225 26354 30396 38120 22468 9711 11084 17107 18420 21408 15566 14118 29213 21648 16362
7192A6362o86l743k0277q031m40L553J3429N406Q995J4767o980q36j4730n382
$$ 16362 15676 11933 -8344 -16375 -16815 -13262 167 5573 14568 29335 22355 21519 6789 1407
7178A407o80n834L437l727J1972O627M832J717O366K341n689q189K521Q596r935
$$ 1407 727 -5107 -1670 -5397 6575 13202 18034 19751 26117 28458 22769 14580 17101 25697 15762
7163A5762j4437k572l817N674l713l52j663l270n600J586J0508J3301N547l379
$$ 15762 1325 -1247 -5064 610 -3103 -3455 -5118 -8388 -13988 -12402 -1894 11407 16954 13575
7149A3575n669p140J008J568L348j2315P884q47L553N159l960j248o187P928l961
$$ 13575 7906 766 1774 3342 6690 -5625 2259 1412 4965 10124 6164 4916 -1271 6657 2696
7134B696J406N655K202q255K650J1156M21J2453J4286J0666n197j4629j0021n558
$$ 2696 4102 9757 11959 3704 6354 17510 17931 30384 44670 55336 50139 35510 25489 19931
7120A9931j7350O823O527Q220O945r528Q286r628p828J224Q932j188j0077J099
$$ 19931 2581 9404 15931 24151 31096 21568 29854 20226 12398 13622 22554 21366 11289 12388
7106A2388J094j431P3O095Q341j563l782q215K181K883j1213j8455j796J0671
$$ 12388 13482 12051 12124 18219 26560 24997 21215 13000 15181 18064 6851 -11604 -13400 -2729
7092b729r309j040n701P124k476R640J9653k391l0j612k020o287J71K2126o642
$$ -2729 -12038 -13078 -18779 -11655 -14131 -4491 15162 12771 12741 11129 9109 2822 2993 25119 18477
7077A8477j4766L803N395K03j0254M273m685m898K623O263M18P573K868O562J571
$$ 18477 3711 7514 12909 13112 2858 7131 2446 -2452 171 6434 6852 14425 17293 23855 25426
7062B5426j522p57J3076n796O41l375n254q093p700Q88j541J2161K0275j344j0269
$$ 25426 23904 23147 36223 30427 31068 27693 22439 14346 6646 7534 5993 18154 38429 37085 26816
7047B6816j0848Q67R380k277M343mJ334j5306O232K1296L149j6415p015Q242j970
$$ 26816 15968 16835 26215 23938 28281 28277 29611 14305 20537 41833 44982 28567 21552 29794 27824
7032B7824N830o367q883r637J737J1076j180m696m796j291P921J1391Q095q359
$$ 27824 33654 27287 18404 8767 10504 21580 20400 15704 10908 9617 17538 28929 37024 28665
7018B8665N319L530j1676l970N119J271k342N117Q284J137j2963l619J205L800
$$ 28665 33984 37514 25838 21868 26987 28258 25916 31033 39317 40454 27491 23872 25077 28877
7004B8877j6165r332p575R040N887N774N047K281N32L032N847O655O256p884k464
$$ 28877 12712 3380 -4195 4845 10732 16506 21553 23834 24366 27398 33245 39900 46156 38272 35808
6989C5808N82j1623l983q297L229j5575k173O084J596M685k997K26P948J2717
$$ 35808 36390 24767 20784 12487 15716 141 -2032 4052 5648 10333 7336 7562 15510 28227
6975B8227m026j6519L29l156K972P501r664n114J3996N788N083q570k985l953
$$ 28227 24201 7682 8011 4855 7827 15328 5664 550 14546 20334 25417 16847 13862 9909
6961I909l947J5447R962j0499k472o330j1540J594R346J0748r17j2183m29L65
$$ 9909 5962 21409 31371 20872 18400 12070 530 2124 11470 22218 21301 9118 8689 9054
6947I054j222J9275J611j8609p131J3700J221M833M501o378K027L777K34j0047
$$ 9054 7832 27107 28718 10109 2978 16678 17899 22732 27233 20855 22882 26659 26893 16846
6933A6846p838k151l917J4566k796j084j512R719J658j0607m641k131J3536J3315
$$ 16846 9008 6857 2940 17506 14710 13626 12114 21833 23491 12884 8243 6112 19648 32963
6919C2963q709j3414j101M682J4151J1509r764k4706r01N993O791k624p349K869
$$ 32963 24254 10840 9739 14421 28572 40081 30317 5611 4710 10703 17494 14870 7521 10390
6905A0390k911o899q16J685J2294k837p521L485J0639N762M117m471r580P13N843
$$ 10390 7479 580 -236 1449 13743 10906 3385 6870 17509 23271 27388 22917 13337 14050 19893
6890A9893j571K673L37r155o930K216K798j3342q48N822Q912J612P573o824N958
$$ 19893 18322 20995 21332 12177 5247 7463 10261 -3081 -3929 1893 10805 12417 19990 13166 19124
6875A9124L180r764J21Q455r297j1669P358j955m689j915n320O487R26L192p773
$$ 19124 22304 12540 12661 21116 11819 150 7508 5553 864 -1051 -6371 116 1042 4234 -3539
6860c539p405N561n67Q099m392m65r370K759L685K089P265J2583Q094m262p374
$$ -3539 -10944 -5383 -5950 2149 -2243 -2708 -12078 -9319 -5634 -3545 3720 16303 24397 20135 12761
6845A2761R084k136J530K532o882N090n965j4296j1447j4610j270P541R383O641
$$ 12761 21845 19709 21239 23771 16889 21979 16014 1718 -9729 -24339 -25609 -18068 -8685 -2044
6831b044J2742j621J769M352R428L913q904n764m443J0550p14q448R68K032M633
$$ -2044 10698 9077 10846 15198 24626 28539 19635 13871 9428 19978 19264 10816 11784 13816 18449
6816A8449n752j1336l672o557O529Q118o08l660O646J0417N285q507r209Q152
$$ 18449 12697 1361 -2311 -8868 -2339 5779 5171 1511 8157 18574 23859 15352 6143 14295
6802A4295k958m278P242n025l408J7103N49j189l649q902j2330R617k982J280
$$ 14295 11337 7059 14301 9276 5868 22971 23520 22331 18682 9780 -2550 7067 4085 5365
6788E365J2340r61j4323j852M504r255N704n138K343m024J68J3061M298j5126
$$ 5365 17705 16744 2421 569 5073 -4182 1522 -3616 -1273 -5297 -5129 7932 12230 -2896
6774b896p98j182q171P214l868K4996J594n915o513P973K977K013J603J662o27
$$ -2896 -3694 -4876 -13047 -5833 -9701 15295 16889 10974 4461 12434 15411 17424 19027 20689 20062
6759B0062j3072P37L262J0668m192j3721J3873K705q14O385j666j3649N930M454
$$ 20062 6990 7727 10989 21657 17465 3744 17617 20322 19508 25893 24227 10578 16508 20962
6745B0962k191r138k994M764M308O382L08l924o196J0281O922j0527k7890k607
$$ 20962 18771 9633 6639 11403 15711 22093 22401 18477 12281 22562 29484 18957 -8933 -11540
6731a1540P488R456m417j6243J400L441O582l725M610R033R066p738P88L888Q42
$$ -11540 -4052 5404 987 -15256 -13856 -10415 -3833 -7558 -2948 6085 15151 7413 8201 12089 12931
6716A2931M64p652K995o988l211J0328J7665K999K002q677j8373Q503n081k7816
$$ 12931 13395 5743 8738 1750 -1461 8867 26532 29531 31533 22856 4483 12986 7905 -19911
6702a9911J3069K677j3294O350P157P027L129R782q654n810l284n289R247Q485
$$ -19911 -6842 -4165 -17459 -11109 -3952 3075 6204 15986 7332 1522 -1762 -7051 2196 10681
6688A0681k159o005P441O465N546J776j1230l866m107P485o621j1101J0561M3282
$$ 10681 8522 2517 9958 16423 21969 23745 12515 8649 4542 12027 5406 -5695 4866 48148
6674D8148K0232j4026j0346j3484j7267q79J712Q50J3380L004r176j169q337o042
$$ 48148 68380 54354 44008 30524 13257 12378 14090 14940 28320 31324 22148 20979 12642 6600
6660F600J660j255l800m044M533m118P750r968l016O516J0949J2952M862q113
$$ 6600 8260 7005 3205 -839 3694 -424 7326 -2642 -5658 858 11807 24759 29621 21508
6646B1508j9285o95P430M198k52j3471q137l124P267k693p234l48J7141J2260
$$ 21508 2223 1528 8958 13156 12904 -567 -8704 -11828 -4561 -7254 -14488 -14836 2305 14565
6632A4565r476m364o641N343L839J1990J3526j2943J025J95J702j852j2805k099
$$ 14565 5089 725 -5916 -573 3266 15256 28782 15839 16864 17059 18761 16909 4104 2005
6618B005o59L666O234q52J0369M422q277j6026Q10j3153l182j566j195K2896J1348
$$ 2005 1346 5012 11246 10394 20763 25185 16908 882 1692 -11461 -14643 -16209 -17404 5492 16840
6603A6840j0802m095p013m731Q088N453J0993j698p107J0572J7074n598q228q205
$$ 16840 6038 1943 -5070 -9801 -1713 3740 14733 13035 5928 16500 33574 27976 19748 11543
6589A1543l455m626r376M545p8M11Q300Q292j1727K370P461j7270k0753J3097
$$ 11543 8088 3462 -5914 -1369 -1447 -1036 7264 15556 3829 6199 13660 -3610 -24363 -11266
6575a1266J4499J1923N02r46o599p95l734m077J6836R423l700o942k691l265J837
$$ -11266 3233 15156 15658 14712 8113 7318 3584 -493 16343 25766 22066 15124 12433 9168 11005
6560A1005o839P994n347n365N908m622L044n774m237N162O863J2190k551j4084
$$ 11005 4166 12160 6813 1448 7356 2734 5778 4 -4233 929 7792 19982 17431 3347
6546C347R066J7793j71k2930P27k390j0344N580m717j2963o310k700O256Q793
$$ 3347 12413 30206 30035 7105 7832 5442 -4902 678 -4039 -17002 -23312 -26012 -19756 -10963
6532a0963L019R794Q102k941j323J0481L420M969j2590l331K353j1125j1246o453
$$ -10963 -7944 1850 9952 7011 5688 16169 19589 24558 11968 8637 10990 -135 -11381 -17834
6518a7834k16q138J868R785J6879O248l682j2203K946J202J4244K357j5479j5099
$$ -17834 -18050 -26188 -24320 -14535 2344 8592 4910 -7293 -4347 -3145 11099 13456 -2023 -17122
6504a7122k852J5176J6916R723p644r348O109M573j3264J3962m517J25j3160M253
$$ -17122 -19974 -4798 12118 21841 14197 4849 10958 15531 2267 16229 11712 11837 -1323 2930
6490B930K095n059M785Q391Q842Q180p43m539m468q272j0594o187J4446k077p374
$$ 2930 5025 -34 4751 13142 21984 30164 29421 24882 20414 12142 1548 -4639 9807 7730 356
6475C56J0127o122O247R333l846r229M675J0809O694p57k353q249j0387J462k224
$$ 356 10483 4361 10608 19941 16095 6866 11541 22350 29044 28287 25934 17685 7298 8760 6536
6460F536J2540N901l00j3510R879N494m555M547L678o472K139j454J521R326m367
$$ 6536 19076 24977 24677 11167 21046 26540 21985 26532 30210 23738 25877 24423 25944 35270 30903
6445C0903o114p796j1195R090K810l357n096P045p805J218M880M95r917j72M65
$$ 30903 24789 16993 5798 14888 17698 14341 9245 16290 8485 9703 14583 15078 5161 4989 5454
6430E454k334n202j605l36L704L052J2645l948m522J2811J48k647j255j9739p059
$$ 5454 3120 -2082 -3687 -4023 -319 2733 15378 11430 6908 19719 19867 17220 15965 -3774 -10833
6415a0833j976J69J1653L466l309R74J005p797J0155M788M679N086L778O46j0133
$$ -10833 -12809 -12640 -987 2479 -830 144 1149 -6648 3507 8295 12974 18060 21838 22484 12351
6400A2351p747J1750K290O65o472k080O692J724K270J0108M84m969q544m910n571
$$ 12351 4604 16354 18644 19309 12837 10757 17449 19173 21443 31551 32035 27066 18522 13612 8041
6385H041m939M827p74j164L993l910r137l7Q703o989q282K120P95q23o197l927
$$ 8041 3102 7929 7155 5991 9984 6074 -3063 -3100 5603 -1386 -9668 -7548 -6753 -7576 -13773 -17700
6369a7700L509p51Q377M168M050j933M891O569r291J2741R657P633N933j4934
$$ -17700 -14191 -14942 -6565 -2397 1653 -280 4611 11180 1889 14630 24287 31920 37853 22919
6355B2919j5875k221Q976j1910l948J3097J0840Q70P64r637j4896j799J592m930
$$ 22919 7044 4823 13799 1889 -2059 11038 21878 22748 23512 13875 -1021 -2820 -1228 -6158
6341f158K837N489j1129m666J4006J1215j877Q33L559j7623o947J4201J238j3604
$$ -6158 -3321 2168 -8961 -13627 379 11594 9717 10550 14109 -3514 -10461 3740 4978 -8626
6327h626l507m796R289J4873l319j8321q727J2018J0077Q295k892k759R46O349
$$ -8626 -12133 -16929 -7640 7233 3914 -14407 -23134 -11116 -1039 7256 4364 1605 2551 8900
6313H900Q443j1886j2206l010J7818P433j0207n897J3487J079q57o031j946J793
$$ 8900 17343 5457 -6749 -9759 8059 15492 5285 -612 12875 13954 13097 7066 5120 6913
6299F913j2094Q10O557o6M194J947j1009l365m237m855j685o049R039K114p664
$$ 6913 -5181 -4371 2186 2120 6314 8261 -2748 -6113 -10350 -15205 -16890 -22939 -13900 -11786 -19450
6284a9450l187l039L815k53k127P132J5502J4640n40j190j0485j5041k222P200
$$ -19450 -22637 -25676 -21861 -22114 -24241 -17109 -1607 13033 12493 11303 818 -14223 -16445 -9245
6270i245J0030J827k261j4431P802j0410n638P259l606R077N649k926N891K1079
$$ -9245 785 2612 351 -14080 -6278 -16688 -22326 -15067 -18673 -9596 -3947 -6873 -982 20097
6256B0097N476q549p975K0505J8797l322l4172j459O576o408r907M647J0316R788
$$ 20097 25573 17024 9049 29554 48351 45029 10857 9398 15974 9566 -341 4306 14622 24410
6242B4410j670r960l773j696L161j846l16N474j227j0205K885P307k337J0390
$$ 24410 22740 12780 9007 7311 10472 8626 8310 13784 12557 2352 5237 12544 10207 20597
6228B0597K413l549j0155Q864L857k1699n195j342j2391L840K4114O608n618q831
$$ 20597 23010 19461 9306 18170 22027 328 -4867 -6209 -18600 -14760 9354 15962 10344 1513
6214A513m625p247J209j17J837R704l21P16m069J951q853q333J6133M042J2546
$$ 1513 -3112 -10359 -9150 -9267 -7430 2274 1953 2669 -1400 551 -8302 -16635 -502 3540 16086
6199A6086L332k517N16p89J278N118j3332k0484p483j811L346J0459j462K153
$$ 16086 19418 16901 17417 16628 17906 23024 9692 -10792 -18275 -20086 -16740 -6281 -7743 -5590
6185e590N829J6549N871p993j1817o081j604O657p694q858J2367K808J834r148
$$ -5590 239 16788 22659 14666 2849 -3232 -4836 1821 -5873 -14731 -2364 444 2278 -6870
6171f870n712r999J0658n354o85N280K809q315K539L82J4554J2748J3811M717
$$ -6870 -12582 -22581 -11923 -17277 -17962 -12682 -9873 -18188 -15649 -15267 -713 12035 25846 30563
6157C0563j4694m591j0664K223R227k178r894q88R773N416j8131j1619J871o488
$$ 30563 15869 11278 614 2837 12064 9886 -8 -896 8877 14293 -3838 -15457 -13586 -20074
6143b0074M03M912J6884J2229k990j6109j1642m817j155M005J4621k989j8685
$$ -20074 -19671 -14759 2125 14354 11364 -4745 -16387 -21204 -22359 -18354 -3733 -6722 -25407
6130b5407n854J0269J0946Q822J637q950M628K638J384n004L277N1L084l011j0335
$$ -25407 -31261 -20992 -10046 -1224 413 -8537 -3909 -1271 113 -4891 -1614 -1563 1521 -1490 -11825
6115a1825q360j2452J1068N434j621J3814j179j031P494J142l183j3230P484O013
$$ -11825 -20185 -32637 -21569 -16135 -17756 -3942 -5121 -6152 1342 2484 -699 -13929 -6445 -432
6101d32J945j8636j792J0619J8678J3973K176J1964M454r450m695M03j5494k8810
$$ -432 1513 -17123 -18915 -8296 10382 24355 26531 38495 42949 33499 28804 29207 13713 -15097
6087a5097j0723M088K0409N927L38r771J145J4258r316k140l09K2374K1264j5734
$$ -15097 -25820 -21732 -1323 4604 4942 -4829 -3684 10574 1258 -882 -1191 21183 42447 26713
6073B6713j5408p773o818r083N921J1682K857j296J743j9092j8152m329j324J1067
$$ 26713 11305 3532 -3286 -12369 -6448 5234 8091 6795 8538 -10554 -28706 -33035 -34359 -23292
6059b3292K1834J1777N512n239J906j1264P20m86J17l302o48j3824k668J168P628
$$ -23292 -1458 10319 15831 10592 12498 1234 1954 1468 1585 -1717 -2365 -16189 -18857 -17689 -10061
6044a0061O614j975j3264p224P577Q689r165m03O029J150K313K220Q027j0100
$$ -10061 -3447 -5422 -18686 -25910 -18333 -9644 -18809 -19212 -13183 -12033 -9720 -7500 527 -9573
6030i573j3488Q402L602l824p351L402J3096L910q184n167k188L334N49L076K15
$$ -9573 -23061 -14659 -11057 -14881 -22232 -18830 -5734 -1824 -10008 -15175 -17363 -14029 -13480 -10404 -10189
6015a0189k150m543M649J9949P525j3818j652O004m048j633P194N73j3879k4121
$$ -10189 -12339 -16882 -12233 7716 15241 1423 -229 5775 1727 94 7288 7861 -6018 -30139
6001c0139r528m87O801N487J0102M588N458J955J8242J9237j1255j6616j1592
$$ -30139 -39667 -40154 -33353 -27866 -17764 -13176 -7718 -5763 12479 31716 20461 3845 -7747
5988g747K272j680l312Q436J8324l813j6974j1084M31N696N756J3920J078J0655
$$ -7747 -5475 -7155 -10467 -2031 16293 12480 -4494 -15578 -15147 -9451 -3695 10225 11303 21958
5974B1958O037m856l860O350j2683j5202M843K73K853J6176j4614p508J200k819
$$ 21958 27995 23139 19279 25629 12946 -2256 2587 2860 5713 21889 7275 -233 967 -1852
5960a852j3895K922M372k390O664m288m806m160J6139R004q277M34M737j2801
$$ -1852 -15747 -12825 -8453 -10843 -4179 -8467 -13273 -17433 -1294 7710 -567 -133 4604 -8197
5946h197l288K2222N587k356P303R052o535q131j6154l486J888P055N505j3643
$$ -8197 -11485 10737 16324 13968 21271 30323 23788 15657 -497 -3983 -2095 4960 10465 -3178
5932c178j1809R510J3811O784J1481q600m381L167q281J3863J305j3540K451J0345
$$ -3178 -14987 -5477 8334 15118 26599 17999 13618 16785 8504 22367 23672 10132 12583 22928
5918B2928J935r645l762K649L500M395k911o660l321r314K138N27J731j9987k979
$$ 22928 24863 15218 11456 14105 17605 22000 19089 12429 9108 -206 1932 2459 4190 -15797 -18776
5903a8776L27j1879J4838J8656J058j935j1311n190L540J1681L720j2290q229
$$ -18776 -18449 -30328 -15490 3166 4224 2289 -9022 -14212 -10672 1009 4729 -7561 -15790
5890a5790J1299n110n241q229L423J4378n162P700J4400o156j7232Q815Q852m634
$$ -15790 -4491 -9601 -14842 -23071 -19648 -5270 -10432 -2732 11668 5512 -11720 -2905 5947 1313
5876A313j677j3736M301Q457m793j6276p602J1809O68j410J1331R194J312j844
$$ 1313 -364 -14100 -9799 -1342 -6135 -22411 -30013 -18204 -17536 -18946 -7615 1579 2891 1047
5862A047q82q159R331J0917M220j0008J878N364N508j3172j3728J8806L809j0962
$$ 1047 165 -7994 1337 12254 16474 6466 8344 13708 19216 6044 -7684 11122 14931 3969
5848C969n151m46J963M221j1617J3883M360r049j1783o635o007L335L456l591
$$ 3969 -1182 -1628 335 4556 -7061 6822 11182 2133 -9650 -16285 -22292 -18957 -15501 -19092
5834a9092j0835o84P692Q449q084p501M148P750m543K505K1689r880j394R323
$$ -19092 -29927 -30611 -22919 -14470 -22554 -30055 -25907 -18157 -22700 -20195 1494 -8386 -9780 -457
5820d57J1009l511j6676p717n906O148J2433J5014j88n107p228J0964M019j6388
$$ -457 10552 7041 -9635 -17352 -23258 -17110 -4677 10337 10149 5042 -2186 8778 12797 -3591
5806c591M419r663m263j358k595J4371q346O109K894K922N432j0549r140L859
$$ -3591 828 -8835 -13098 -14456 -17051 -2680 -11026 -4917 -2023 899 6331 -4218 -13358 -9499
5792i499o129N385J3413J5525p822k0362l117J820J053J0006J2116j728j614P97
$$ -9499 -15628 -10243 3170 18695 10873 -9489 -12606 -10786 -9733 273 12389 10661 9047 9844
5778I844J84J817n739j3044o63R297J0913k83q125j0196Q41J2645J6367o044j4664
$$ 9844 10028 11845 6106 -6938 -7601 1696 12609 12326 4201 -5995 -5154 7491 23858 17814 3150
5763C150Q889j2005J354J2518O901M4r210j7656J978o146N521J0929l964q080
$$ 3150 12039 34 1388 13906 20807 20851 11641 -6015 -4037 -10183 -4662 6267 2303 -5777
5749e777J850R454m141J495K322k050K249L85m452n440j2349M15j081N356P10
$$ -5777 -3927 5527 1386 2881 5203 3153 5402 5787 1335 -4105 -16454 -16039 -17120 -11764 -11054
5734a1054K1852J0163j688r663J087j190q580j0003k445J3076J5176o11q183j5551
$$ -11054 10798 20961 19273 9610 10697 9507 927 -9076 -11521 1555 16731 16120 7937 -7614
5720g614j1847P055R07J2685j237j6971N744R118R434O220j726p060o056P438
$$ -7614 -19461 -12406 -11499 1186 -51 -17022 -11278 -2160 7274 13494 11768 4708 -1348 6090
5706F090N60p930j3108J1492K0073J8541p996j5228k112j0186j1805j139J1360
$$ 6090 6650 -1280 -14388 -2896 17177 35718 27722 12494 10382 196 -11609 -12748 -1388
5693a388J5539j765j664L048j2871R3J0854m027M460n147k03J3561o643j0346
$$ -1388 14151 12386 10722 13770 899 992 11846 7819 12279 7132 6929 20490 13847 3501
5679C501j2812L636O322N12Q248l187j0037J163J4779M652n456j1291O37M499
$$ 3501 -9311 -5675 647 1159 9407 6220 -3817 -2654 12125 16777 11321 30 667 5166
5665E166p859o175K039j591p134O390J2123O546j2213j791L152k306j3090J87
$$ 5166 -2693 -8868 -6829 -8420 -15554 -9164 2959 9505 -2708 -4499 -1347 -3653 -16743 -16556
5651a6556J3981M296p373p113l624J226j733l27M119K827N694Q933o587l128P122
$$ -16556 -2575 1721 -5652 -12765 -16389 -15163 -16896 -17223 -13104 -10277 -4583 4350 -2237 -5365 1757
5636A757K072k458J3660K455j3140m590Q595R386j675n398j4756o351L386N612
$$ 1757 3829 1371 15031 17486 4346 -244 8351 17737 16062 10664 -4092 -10443 -7057 -1445
5622a445J9213j921p368q710p78j1023l941O112o506J293K4968P127j3696l398
$$ -1445 17768 15847 8479 -231 -1009 -12032 -15973 -9861 -16367 -15074 9894 17021 3325 -73
5608g3J1202q052q19L465J0773o50r103m284m482l425n491K015K583L873p336
$$ -73 11129 3077 2258 5723 16496 15846 6743 2459 -2023 -5448 -10939 -8924 -6341 -2468 -9804
5593i804J088n965j5427J1822J9007j338M843N436j7015J923K907k860n604o855
$$ -9804 -8716 -14681 -30108 -18286 721 -617 4226 9662 -7353 -5430 -2523 -5383 -10987 -17842
5579a7842r065Q023O909q635J2248p86n771r237J4692Q101L509k706L343n422
$$ -17842 -26907 -18884 -11975 -20610 -8362 -9148 -14919 -24156 -9464 -1363 2146 -560 2783 -2639
5565b639O26J722l964N389L920q266l825L860l156P011M335j1794q129K0526l497
$$ -2639 -2013 -291 -4255 1134 5054 -3212 -7037 -3177 -6333 678 5013 -6781 -14910 5616 2119
5550B119J11O991o439j1894m859J5597M72N612r91m708j902k038P587R726j7916
$$ 2119 2230 9221 2782 -9112 -13971 1626 2098 7710 6719 2011 109 -1929 5658 15384 -2532
5535b532j3682L391N398K1347m524j3023R46Q084K7019l682m323m731j5846j4570
$$ -2532 -16214 -12823 -7425 13922 9398 -3625 -2679 5405 32424 28742 24419 19688 3842 -10728
5521a0728P851J0250L241L107o406N977r285j2474J5702L069n151J0154k368L4
$$ -10728 -2877 7373 10614 13721 7315 13292 4007 -8467 7235 10304 5153 15307 12939 12973
5507A2973j1119J4233K175M042R622q442j5554l800q680r973R435l55o356n073
$$ 12973 1854 16087 18262 22304 31926 23484 7930 4130 -4550 -14523 -5088 -5443 -11799 -16872
5493a6872n714l282P574j447p045P096K4522Q350j046k0010l273J743j2903n364
$$ -16872 -22586 -25868 -18294 -19741 -26786 -19690 4832 13182 12136 -7874 -11147 -9404 -22307 -27671
5479b7671Q044J0466k900j707N333n545K584R134j2291K121o125j1078P487J3548
$$ -27671 -19627 -9161 -12061 -13768 -8435 -13980 -11396 -2262 -14553 -12432 -18557 -29635 -22148 -8600
5465h600J354n921k913Q374Q674k778P087o543m45j338M50j0767n910J330J1092
$$ -8600 -7246 -13167 -16080 -7706 968 -1810 5277 -1266 -1711 -3049 -2599 -13366 -19276 -17946 -6854
5450f854R561P76R839o929j7948k0232K981R111J3674r29J66j652j4870m961J5962
$$ -6854 2707 3483 13322 6393 -11555 -31787 -28806 -19695 -6021 -6950 -6784 -8436 -23306 -28267 -12305
5435a2305N084L412Q928j893P456J021j9645k858Q370J7414n619j840M433k332
$$ -12305 -7221 -3809 5119 3226 10682 11703 -7942 -10800 -2430 14984 9365 7525 11958 9626
5421I626O730N777N330o181N004j2275l873j0271n820J4306K870p0j0799j1255
$$ 9626 16356 22133 27463 21282 26286 14011 10138 -133 -5953 8353 11223 11153 354 -10901
5407a0901L008Q265L442N246J0756j864q248j2889m896J1235P389j936q554O831
$$ -10901 -7893 372 3814 9060 19816 17952 9704 -3185 -8081 3154 10543 8607 53 6884
5393F884L672J815M8j0217l548J068k809l692O774J5709N917j0766k4682Q342
$$ 6884 10556 12371 12419 2202 -1346 -278 -3087 -6779 -5 15704 21621 10855 -13827 -5485
5379e485J5923l100M764n310l880j376j3074n619J7888J0324n053m788j904j3362
$$ -5485 10438 7338 12102 6792 2912 1536 -11538 -17157 731 11055 6002 1214 -690 -14052
5365a4052O976J663Q277R387r538j2014n260K800m472J300n718q958J0973K423
$$ -14052 -7076 -5413 2864 12251 2713 -9301 -14561 -11761 -16233 -14933 -20651 -29609 -18636 -16213
5351a6213l466L9J1057j1232j7798L091K1290M980j0875q3N062m091n146O3K387
$$ -16213 -19679 -19640 -8583 -19815 -37613 -34522 -13232 -8252 -19127 -19210 -14148 -18239 -23385 -23322 -20935
5336b0935J4194Q379j6169n114r55j924o467J1818L4144R200r367j4538p674k440
$$ -20935 -6741 1638 -14531 -19645 -20600 -22524 -28991 -17173 16971 26171 16804 2266 -5408 -7848
5322g848n975m639L301J5561J0959O499j0651m599J2086o654o526N017p74j4236
$$ -7848 -13823 -18462 -15161 400 11359 17858 7207 2608 14694 8040 1514 6531 5757 -8479
5308h479K221N517l010p180J27j7347n045P809M708J1626j331k0699m885J562
$$ -8479 -6258 -741 -3751 -10931 -10804 -28151 -33196 -25387 -20679 -9053 -10384 -31083 -35968 -34406
5294c4406n93J1257r242O096J4115J0886j8162m107Q249K241N001N697k856j1937
$$ -34406 -34999 -23742 -32984 -26888 -12773 -1887 -20049 -24156 -15907 -13666 -8665 -2968 -5824 -17761
5280a7761J578R558J187j9600j7951m742J4309J4272L192j6829j6991Q022J9807
$$ -17761 -16183 -6625 -5438 -25038 -42989 -47731 -33422 -19150 -15958 -32787 -49778 -41756 -21949
5267b1949J3409J3408P707k284o90Q756l829k3591j4967p166k662Q082R67l922
$$ -21949 -8540 4868 12575 10291 9601 18357 14528 -9063 -24030 -31196 -33858 -25776 -24809 -28731
5253b8731J2590m687J1952J3142l540j2161o159J1576J8359m65q529o485r06n462
$$ -28731 -16141 -20828 -8876 4266 726 -11435 -17594 -6018 12341 11876 3347 -3138 -4044 -9506
5239i506M05P252R779L51j9488k92K0157P937m194j3827k1883j369N371N422K529
$$ -9506 -9101 -1849 7930 8281 -11207 -11499 8658 16595 12401 -1426 -23309 -24678 -19307 -13885 -11356
5224a1356o00j2623m716J2492R683j4800j4533J0778K4412N906j316N825o455
$$ -11356 -11956 -24579 -29295 -16803 -7120 -21920 -36453 -25675 -1263 4643 3327 9152 2697
5211B697j1293j1584m182J0218M747M562r177O710n79r61m038O422K259j3598
$$ 2697 -8596 -20180 -24362 -14144 -9397 -4835 -14012 -7302 -7881 -8842 -12880 -6458 -4199 -17797
5197a7797q435J6378K903j489O20J1583Q700j5873j3183P243Q633J1699K344k1732
$$ -17797 -26232 -9854 -6951 -8440 -7820 3763 12463 -3410 -16593 -9350 -717 10982 13326 -8406
5183h406k1690j135J0619K4134n056k230R176K556j5962L048L706L936l369K148
$$ -8406 -30096 -31231 -20612 3522 -1534 -3764 5412 7968 -7994 -4946 -1240 2696 -673 1475
5169A475J1411Q371k958j5762J898J201o4J1472q293r496O752j2103o995K622
$$ 1475 12886 21257 18299 2537 4435 5636 5572 17044 8751 -745 6007 -6096 -13091 -10469
5155a0469o029m732K157o957K048P654J3123N481q377O659J0714j3342o232q417
$$ -10469 -16498 -21230 -19073 -26030 -23982 -16328 -3205 2276 -6101 558 11272 -2070 -8302 -16719
5141a6719J076O036N124m519j0427M05J8369O213m442q443j701P868M980p36j0018
$$ -16719 -15643 -9607 -4483 -9002 -19429 -19024 -655 5558 1116 -7327 -9028 -1160 3820 3084 -6934
5126f934j1411Q08j2085l675J963P421M646k608Q59J0642l21L394J1374M351r869
$$ -6934 -18345 -17537 -29622 -33297 -31334 -23913 -19267 -21875 -21016 -10374 -10695 -7301 4073 8424 -1445
5111a445q567j1483R088K403n109q892L734o263l765M572m449K912J0052R206
$$ -1445 -10012 -21495 -12407 -10004 -15113 -24005 -20271 -26534 -30299 -25727 -30176 -27264 -17212 -8006
5097h006K89p304K729Q092l683L273K622k516j863J0087J5016N701q12j574O16
$$ -8006 -7717 -15021 -12292 -4200 -7883 -4610 -1988 -4504 -6367 3720 18736 24437 23625 22051 22667
5082B2667j0873o303p038N281N620r626j64P075r528o925L805n999k342m410j875
$$ 22667 11794 5491 -1547 3734 9354 -272 -436 6639 -2889 -9814 -6009 -12008 -14350 -18760 -20635
5067b0635O813M379J1323k137R877q229j4102O951Q040l125n128j546k580K132
$$ -20635 -13822 -9443 1880 -257 9620 1391 -12711 -5760 2280 -845 -5973 -7519 -10099 -7967
5053g967L816Q84K015M323R789m494o252J603j4116j4780j0400M194K4081K0147
$$ -7967 -4151 -3267 -1252 3071 12860 8366 2114 3717 -10399 -25179 -35579 -31385 -7304 12843
5039A2843j668k641k653N092j429Q257J1489m714p549J706n333j3970n540K678
$$ 12843 11175 8534 5881 10973 9544 17801 29290 24576 17027 18733 13400 -570 -6110 -3432
5025c432P358n397m260J0344r332L785m349J0578n12m667l963j1190q987M535
$$ -3432 3926 -1471 -5731 4613 -4719 -934 -5283 5295 4783 116 -3847 -15037 -24024 -19489
5011a9489K1256J797j4515j4003J874K190J6325R573r053j6747L050N174N37Q047
$$ -19489 1767 3564 -10951 -24954 -23080 -20890 -4565 5008 -4045 -20792 -17742 -12568 -12031 -3984
4997c984M154j0337m932J0944J1534l631p266n359m41L915j019Q108l359R010
$$ -3984 170 -10167 -15099 -4155 7379 3748 -3518 -8877 -9318 -5403 -6422 1686 -1673 7337
4983G337L699j840k187l623p409j6899j22N108L019O501K563l428j7462j182K7909
$$ 7337 11036 9196 7009 3386 -4023 -20922 -21044 -15936 -12917 -6416 -3853 -7281 -24743 -25925 1984
4968A984O575j7341k665q853N146r40NM028M797Q000j5989L164O708j4308M372
$$ 1984 8559 -8782 -11447 -20300 -15154 -16094 -16089 -12061 -7264 736 -15253 -12089 -5381 -19689 -15317
4953a5317P628l244r52M99r516J802J6001M973r529m391p601j4201j717M545J1848
$$ -15317 -7689 -10933 -11885 -11386 -20902 -19100 -3099 1874 -7655 -12046 -19647 -33848 -35565 -31020 -19172
4938a9172O998l860R797N395j0852j0514r338p257N715o436O482K0832O628m50
$$ -19172 -12174 -16034 -6237 -842 -11694 -22208 -31546 -38803 -33088 -39524 -33042 -12210 -5582 -6032
4924f032j0519J2328P792J655p746K053J2614m487m605j2973j804J2959Q26j3218
$$ -6032 -16551 -4223 3569 5224 -2522 -469 12145 7658 3053 -9920 -11724 1235 2061 -11157
4910a1157J103J58K228K108n307R966Q166j0581j616J3398J4633J5222r379q051
$$ -11157 -10054 -9896 -7668 -5560 -10867 -901 7265 -3316 -4932 8466 23099 38321 28942 20891
4896B0891j3382r95Q658o019q993j0632L608P051L014n224k721J0624p745p797
$$ 20891 7509 6514 15172 9153 160 -10472 -6864 187 3201 -2023 -4744 5880 -1865 -9662
4882i662o06J161M209R075K784j520n531N348L280k864j5478j3078J3441J2891
$$ -9662 -10268 -9107 -4898 4177 6961 5441 -90 5258 8538 5674 -9804 -22882 -9441 3450
4868C450o411J911L241R522j7288Q73L718m590K943R806q81K502q865j910n521
$$ 3450 -2961 -1050 2191 11713 -5575 -4702 -984 -5574 -2631 7175 6294 8796 -69 -1979 -7500
4853g500M115m430O598n416J669q493j456o569l738o517J1719K2289K855j2336
$$ -7500 -3385 -7815 -1217 -6633 -4964 -13457 -14913 -21482 -25220 -31737 -20018 2271 5126 -7210
4839g210r291o101P017O921O013K920p492J53L673L45o87j7297m423J0407Q056
$$ -7210 -16501 -22602 -15585 -8664 -2651 269 -7223 -7070 -3397 -3052 -3739 -21036 -25459 -15052 -6996
4824f996K219n219n338l734M660M360L888k798o594k919O056R796O616k466j7558
$$ -6996 -4777 -9996 -15334 -19068 -14408 -10048 -6160 -8958 -15552 -18471 -12415 -2619 3997 1531 -16027
4809a6027L246O389J874p500M327P205L574l033P487p746k1875P602r13O426l07
$$ -16027 -12781 -6392 -4518 -12018 -7691 -486 3088 55 7542 -204 -22079 -14477 -15390 -8964 -9271
4794i271L139J368L475j589l755j183J4144l895L104J2834j7976j2497m301m366
$$ -9271 -6132 -4764 -1289 -2878 -6633 -7816 6328 2433 5537 18371 395 -12102 -16403 -20769
4780b0769K007N321R96m441O455r3K881O742J340l871O22j156R397k648k454P312
$$ -20769 -18762 -13441 -12445 -16886 -10431 -10524 -7643 -901 439 -3432 -2810 -3966 5431 2783 329 7641
4764G641L332j3361Q327L774N751o70Q407r862j3738q831M869J8911Q761q164
$$ 7641 10973 -2388 5939 9713 15464 14794 23201 13339 -399 -9230 -4361 14550 23311 15147
4750A5147j2379N783j002j2777M49m712o537l346p58J3384m254o40K516J1455
$$ 15147 2768 8551 7549 -5228 -4779 -9491 -16028 -19374 -20132 -6748 -11002 -11642 -9126 2329
4736B329j257L219M306J751N262j228N295J302j7745K286n657o535k430l171J0432
$$ 2329 1072 4291 8597 10348 15610 14382 19677 20979 3234 5520 -137 -6672 -9102 -12273 -1841
4721a841M023O058O00O028l254q087k890J716N955j6068o426j073n096j848J3598
$$ -1841 2182 8240 8840 14868 11614 3527 637 2353 8308 -7760 -14186 -15259 -20355 -22203 -8605
4706h605l137J892O069P447k152j0835L843M260l150R264o055L92j92J977J4364
$$ -8605 -11742 -9850 -3781 3666 1514 -9321 -5478 -1218 -4368 4896 -1159 -767 -959 1018 15382
4691A5382J2012j280j0647o715J073K583n3j2796j6491j4992j4622Q088J4922
$$ 15382 27394 26114 15467 8752 9825 12408 12355 -441 -16932 -31924 -46546 -38458 -23536
4678b3536J2144R669M605p448m758J1810Q2J517j1264j4183q638O67m306q427
$$ -23536 -11392 -1723 2882 -4566 -9324 2486 2568 4085 -7179 -21362 -30000 -29333 -33639 -42066
4664d2066M93J1625J095R084J1023K043J3577l865k553J1749K212q820j6487l108
$$ -42066 -41573 -29948 -28853 -19769 -8746 -6703 6874 3009 456 12205 14417 5597 -10890 -13998
4650a3998k336o150j591J3540P250J644r758j1836M382n367j071O252j1078p195
$$ -13998 -16334 -22484 -24075 -10535 -3285 -1641 -11399 -23235 -18853 -24220 -25291 -19039 -30117 -37312
4636c7312M937J0349K775J0184P818n862j0716j0161o283m308Q308O701J2378
$$ -37312 -32375 -22026 -19251 -9067 -1249 -7111 -17827 -27988 -34271 -38579 -30271 -23570 -11192
4623a1192o522j0727J304J3658m179o78K665j606n89R171J1188l191l220L95k374
$$ -11192 -17714 -28441 -27137 -13479 -17658 -18336 -15671 -17277 -17866 -8695 2493 -698 -3918 -3523 -5897
4608e897q441k153J81j0593K201J2462N283K569N437n128R85O221q737l864n857
$$ -5897 -14338 -16491 -16310 -26903 -24702 -12240 -6957 -4388 1049 -4079 -3094 3127 -5610 -9474 -15331
4593a5331L419N238J6984q506l123J7410L320R62o05p303l502p459q147l223M050
$$ -15331 -11912 -6674 10310 1804 -1319 16091 19411 20373 19768 12465 8963 1504 -6643 -9866 -5816
4578e816R058j0629j1337m326j863J7319L046j2608R453J382p845J0253J2230
$$ -5816 3242 -7387 -18724 -23050 -24913 -7594 -4548 -17156 -7703 -6321 -14166 -3913 8317
4565H317J513p118K585L809N970P542N735j7166q617q079j023n544k373k712L803
$$ 8317 9830 2712 5297 9106 15076 22618 28353 11187 2570 -5509 -6532 -12076 -14449 -17161 -13358
4550a3358L158j694N873L126q196o210K6946k372j1455l992N361k277q587O162
$$ -13358 -10200 -11894 -6021 -2895 -11091 -17301 9645 7273 -4182 -8174 -2813 -5090 -13677 -7515
4536g515J618j433k371j008L714N13r789j2289J5298J2435Q743J5602m968q152
$$ -7515 -5897 -7330 -9701 -10709 -6995 -6482 -16271 -28560 -13262 -827 7916 23518 18550 10398
4522A0398P589j304p450Q925r043j3253j2797L367P718j2378l978J2877L180o42
$$ 10398 17987 16683 9233 18158 9115 -4138 -16935 -13568 -5850 -18228 -22206 -9329 -6149 -6791
4508f791p857n495p129L643J6735O657j1884j1342q070k945J333K6274K5108k175
$$ -6791 -14648 -20143 -27272 -23629 -6894 -237 -12121 -23463 -31533 -34478 -33145 -6871 18237 16062
4494A6062j1120j1897m597K167o417N611l926k2967J0503J5963m614J206J0464
$$ 16062 4942 -6955 -11552 -9385 -15802 -10191 -14117 -37084 -26581 -10618 -15232 -14026 -3562
4481c562j38J631M094N23k346Q815L761p861j708J0289J4195J38j3298j2055o369
$$ -3562 -3700 -2069 2025 2548 202 9017 12778 4917 3209 13498 27693 27831 14533 2478 -3891
4466c891k421O814J3964R164k2168j3840R983N071N963P500q419J671n864j1707
$$ -3891 -6312 502 14466 23630 1462 -12378 -2395 2676 8639 16139 7720 9391 3527 -8180
4452h180Q734P557k417m258N535M634J583L359j839j1500K763j3473J794J1836
$$ -8180 554 8111 5694 1436 6971 11605 13188 16547 14708 3208 5971 -7502 -5708 6128
4438F128P716K612k736q153m444o072J5059N377j5343o271O384p079o055o800
$$ 6128 13844 16456 13720 5567 1123 -4949 10110 15487 144 -6127 257 -6822 -12877 -19677
4424a9677q9j2377M433K2149L732k555k965J6247q593J605j10p052J886j631J944
$$ -19677 -19766 -32143 -27710 -5561 -1829 -4384 -7349 8898 305 1910 1800 -5252 -3366 -4997 -3053
4409c053J0976r705j0378N658J0426N620K090l936L078R97j1524M729N429j1743
$$ -3053 7923 -1782 -12160 -6502 3924 9544 11634 7698 10776 11773 249 4978 10407 -1336
4395a336m404k520N105L809J3127J8664J376q926m562R56j6847l688l969p83O441
$$ -1336 -5740 -8260 -3155 654 13781 32445 33821 24895 20333 21289 4442 754 -3215 -3998 2443
4380B443m696P110O792J171r079J4526q334j8196p27p261J471p442j120N564j6920
$$ 2443 -2253 4857 11649 12820 3741 18267 9933 -8263 -8990 -16251 -14780 -22222 -23342 -17778 -34698
4365c4698j06R778J2247J917l130M030L674J1376q69m558l557L575J6188J790
$$ -34698 -34804 -25026 -12779 -10862 -13992 -9962 -6288 5088 4219 -339 -3896 -321 15867 17657
4351A7657r635j2822p873K864m158K443j1294r573k218J359O369J6727J0688k397
$$ 17657 8022 -4800 -12673 -9809 -13967 -11524 -22818 -32391 -34609 -33250 -26881 -10154 534 -1863
4337a863j208p501O150n75m933p903J0230K886r393J969k429j8011P130R154O630
$$ -1863 -3071 -10572 -4422 -4997 -9930 -17833 -7603 -4717 -14110 -12141 -14570 -32581 -25451 -16297 -9667
4322i667l852O15N120l807J1595K0812J102j8099l970K755J2657j0773r750j0085
$$ -9667 -13519 -12904 -7784 -11591 4 20816 21918 3819 -151 2604 15261 4488 -5262 -15347
4308a5347M300N018r652J3316p7m597L244r792n50J3028J4930K0421k575q139
$$ -15347 -11047 -6029 -15681 -2365 -2442 -7039 -3795 -13587 -14137 -1109 13821 34242 31667 23528
4294B3528j2360p546o581l774j919J09n714j1244m659J0776L372R544k673k859
$$ 23528 11168 3622 -2959 -6733 -8652 -8543 -14257 -25501 -30160 -19384 -16012 -6468 -9141 -12000
4280a2000O699O185r692O785M428P854p921n049o443j772O68J2678k239L576l06
$$ -12000 -5301 884 -8808 -2023 2405 10259 2338 -2711 -9154 -10926 -10258 2420 181 3757 3451
4265C451Q69n503O363J1280L204k2394j5126L7K1135J3050k510m09Q23j5131j2431
$$ 3451 4320 -1183 5180 16460 19664 -2730 -17856 -17819 3316 16366 13856 13447 14270 -861 -13292
4250a3292M405J759j446O990R947j2522k062q249j4836J1385J5218o493j2762
$$ -13292 -8887 -7128 -8574 -1584 8363 -4159 -6221 -14470 -29306 -17921 -2703 -9196 -21958
4237b1958J639K4070R547k2605k985O881P625r180O325J4064O581k579q805k3949
$$ -21958 -20319 3751 13298 -9307 -12292 -5411 2214 -6966 -641 13423 20004 17425 8620 -15329
4223a5329J838J2934q522j2259P21J4581R932J94J322O759q507j0227o838o243
$$ -15329 -13491 -557 -9079 -21338 -20617 -6036 3896 4090 5412 12171 3664 -6563 -13401 -19644
4209a9644R510J715m075N094R557m227k847o580k315J6390l455r764j1912o008
$$ -19644 -10134 -8419 -12494 -7400 2157 -2070 -4917 -11497 -13812 2578 -877 -10641 -22553 -28561
4195b8561J2026J765Q987k016m172K778J3832J1279j3183j3939M03L00l784J1252
$$ -28561 -16535 -14770 -5783 -7799 -11971 -9193 4639 15918 2735 -11204 -10801 -10501 -14285 -3033
4181c033M069m149j0558M068J435q82n90O638m255K331m150R057p662J510J6588
$$ -3033 1036 -3113 -13671 -9603 -8168 -9050 -9640 -3002 -7257 -4926 -9076 -19 -7681 -6171 10417
4166A0417R518j0272j6881l396J2577Q993O424j6865L110J219o12j3274M816j416
$$ 10417 19935 9663 -7218 -10614 1963 10956 17380 515 3625 4844 4232 -9042 -4226 -5642
4152e642l904J4067N865q470q797P719O590L999k366q199L06J81j359J905q612
$$ -5642 -9546 4521 10386 1916 -6881 838 7428 11427 9061 862 1168 1349 -10 1895 -6717
4137f717n595l76m140Q667J199j1585k5328J3164K6284J1089L943j3742r654m465
$$ -6717 -12312 -12688 -16828 -8161 -6962 -18547 -43875 -30711 -4427 6662 10605 -3137 -12791 -17256
4123a7256J3780k913j1911P013P155N451j932J157N313L342l027j0768M072J634
$$ -17256 -3476 -6389 -18300 -11287 -4132 1319 -613 544 5857 9199 6172 -4596 -524 1110
4109A110P193o986j989j6428j2570M348N85M533J2797J347j185p850p151r741
$$ 1110 8303 1317 -672 -17100 -29670 -25322 -24737 -20204 -7407 -6060 -7245 -15095 -22246 -31987
4095c1987N154K996K815J0421Q051M189J749j377j1979j7969N263P093J1120K904
$$ -31987 -26833 -23837 -21022 -10601 -2550 1639 3388 2011 -9968 -27937 -22674 -15581 -4461 -1557
4081a557m081P287K888n086m654Q726M873j6000j8337r405R655K4202J0738j004
$$ -1557 -5638 1649 4537 -549 -5203 3523 8396 -7604 -25941 -35346 -25691 -1489 9249 8245
4067H245M574K331n141J596j4877r037P51n509r772l91P886M649L056R716M226
$$ 8245 12819 15150 10009 11605 -3272 -12309 -11558 -17067 -26839 -27230 -19344 -14695 -11639 -1923 2303
4052B303P0M860M77j2210r038j679m297J3829J3669r81m376m853Q28J622K594
$$ 2303 2373 7233 7710 -4500 -13538 -15217 -19514 -5685 7984 7003 2627 -2226 -1398 224 2818
4037B818p361k313j874P608k722m7o719Q382Q621Q785r219j1879j41K572J459
$$ 2818 -4543 -6856 -8730 -1122 -3844 -3891 -10610 -2228 6393 15178 5959 -5920 -6061 -3489 -2030
4022b030P748j9057j4949j647R164J9744R038l352J879l930K323l475j1952k730
$$ -2030 5718 -13339 -28288 -29935 -20771 -1027 8011 4659 6538 2608 4931 1456 -10496 -13226
4008a3226J31l453R151Q750P837m196k383R493K277R787m348j6564o335o842J529
$$ -13226 -13095 -16548 -7397 1353 9190 4994 2611 12104 14381 24168 19820 3256 -3079 -9921 -8392
3993h392L669J430q583Q979O461k803q720o959m92p78j573J0319J973J92N661
$$ -8392 -4723 -3293 -11876 -2897 3564 761 -7959 -14918 -15410 -16188 -17761 -7442 -5469 -5277 384
3978C84J1478M437J0825N855j2788k0155l290K790m314j2850n848J316N04M131
$$ 384 11862 16299 27124 32979 20191 36 -3254 -464 -4778 -17628 -23476 -22160 -21656 -17525
3964a7525J7514N822j3663k049J0989J3366p199j4282o387J7586l490r477R832
$$ -17525 -11 5811 -7852 -9901 1088 14454 7255 -7027 -13414 4172 682 -8795 1037
3951A037O648j0292j4706p137J0338M487k8j4058M673P43k049R009Q896M896J1233
$$ 1037 7685 -2607 -17313 -24450 -14112 -9625 -9653 -23711 -19038 -18295 -20344 -11335 -2439 2457 13690
3936A3690L989j5994j1196j6197N982R105P412N913j3484O319J0181M648J2602
$$ 13690 17679 1685 -9511 -25708 -19726 -10621 -3209 2704 -10780 -4461 5720 10368 22970
3923B2970l977n886n520j3798M64J787J92M633n540N074p202j5014L926J2806
$$ 22970 18993 13107 7587 -6211 -5747 -3960 -3768 865 -4675 399 -6803 -21817 -17891 -5085
3909e085o17R921J1570M759o462j2687j784K532N106R730J3586j1602k0643n082
$$ -5085 -5702 4219 15789 20548 14086 1399 -385 2147 7253 16983 30569 18967 -1676 -6758
3895f758O582n46P203K0413m855j7445n185n471j1091k865L943R272N123K951
$$ -6758 -176 -722 6481 26894 22039 4594 -591 -6062 -17153 -20018 -16075 -6803 -1680 1271
3881A271j540n533J776Q962O231J841P521k644q470j0262l8Q692J0899l471j2485
$$ 1271 -269 -5802 -4026 4936 11167 13008 20529 17885 9415 -847 -885 7807 18706 15235 2750
3866B750j2108J292p681o998o936l556O702J3501N248o688n71l527O645J3031
$$ 2750 -9358 -8066 -15747 -22745 -29681 -33237 -26535 -13034 -7786 -14474 -15045 -18572 -11927 1104
3852A104R200J112o375j2486k708j285L771J246K342q71J878k782N554K0169N781
$$ 1104 10304 11416 5041 -7445 -10153 -11438 -7667 -6421 -4079 -4950 -3072 -5854 -300 19869 25650
3837B5650n599P29P946j6141j0314J1469J7409o757j0621j1220r08P029j2399
$$ 25650 20051 20780 28726 12585 2271 13740 31149 24392 13771 2551 1643 8672 -3727
3824c727j0907o94O552j0087l118M466J537P720j34j050N912J4366M591q796L269
$$ -3727 -14634 -15328 -8776 -18863 -21981 -17515 -15978 -8258 -8392 -9442 -3530 10836 15427 6631 9900
3809I900r082j11L452l485q796K0572J821k80m062o246L911Q657k261J609r181
$$ 9900 818 707 4159 674 -8122 12450 14271 13991 9929 3683 7594 16251 13990 15599 6418
3794F418o683j926r891o642L583L765P378P663Q140j196j5125p640j0430n974
$$ 6418 -265 -2191 -12082 -18724 -15141 -11376 -3998 3665 11805 10609 -4516 -12156 -22586 -28560
3780b8560o138K325J3435J776K784K0216j440n810j4027j1677P658J4521n038
$$ -28560 -34698 -32373 -18938 -17162 -14378 5838 4398 -1412 -15439 -27116 -19458 -4937 -9975
3767i975j9969k979Q003K161p406K346J562k702J8744K0692J355j9604o031j485
$$ -9975 -29944 -32923 -24920 -22759 -30165 -27819 -26257 -28959 -10215 10477 11832 -7772 -13803 -15288
3753a5288L114J724M316r139m319j1398l137O014K1202O316r334m492k536k874
$$ -15288 -12174 -10450 -6134 -15273 -19592 -30990 -34127 -28113 -6911 -595 -9929 -14421 -16957 -19831
3739a9831N195O90j0385k552R077M833L079Q897o098j0190o93L438K107N885j1097
$$ -19831 -14636 -13946 -24331 -26883 -17806 -12973 -9894 -997 -7095 -17285 -17978 -14540 -12433 -6548 -17645
3724a7645l957N987Q095K642J2014R159j552j7554j4593J3707J6176J656r336
$$ -17645 -21602 -15615 -7520 -4878 7136 16295 14743 -2811 -17404 -3697 12479 14135 4799
3711D799j1059q424K067k136J49K1127O270n36p054o961n117k277l465R606J2614
$$ 4799 -6260 -14684 -12617 -14753 -14604 6523 12793 12257 5203 -1758 -6875 -9152 -12617 -3011 9603
3696I603K096o560j6778j386J6325K640k844K862m196m676r758o780J3984P268
$$ 9603 11699 5139 -11639 -13025 3300 5940 3096 5958 1762 -2914 -12672 -19452 -5468 1800
3682A800J607N295K606o810j3041l588k797j0868O831K0021Q327N0p597q248N368
$$ 1800 3407 8702 11308 4498 -8543 -12131 -14928 -25796 -18965 1056 9383 9433 1836 -6412 -1044
3667a044q583l783N713L543K66L771O94j742J338m900k5165n028J3684J254R973
$$ -1044 -9627 -13410 -7697 -4154 -3888 -117 577 -1165 173 -4727 -29892 -34920 -21236 -19982 -10009
3652a0009l589q00P148n313l320m219k518j3808l175o48J0537J2361o708R133
$$ -10009 -13598 -14398 -7250 -12563 -15883 -20102 -22620 -36428 -39603 -40251 -29714 -17353 -24061 -14928
3638a4928N642j227j3677j1596Q975P644l7l930J1350M011L148j8411O763Q744
$$ -14928 -9286 -10513 -24190 -35786 -26811 -19167 -19204 -23134 -11784 -7773 -4625 -23036 -16273 -7529
3624g529o46Q09L030q837P900J1662j065p831j2718j2044P540K1049L996k327
$$ -7529 -8175 -7366 -4336 -13173 -5273 6389 5324 -2507 -15225 -27269 -19729 1320 5316 2989
3610B989o440M354J5131P716O789l829o132k217j0228r927r986M520l923O100
$$ 2989 -3451 903 16034 23750 30539 26710 20578 18361 8133 -1794 -11780 -7260 -11183 -5083
3596e083L375o942m093m92p821m32n92J3652P307j170K724L826n170l327k878
$$ -5083 -1708 -8650 -12743 -13235 -21056 -21488 -22080 -8428 -1121 -2291 433 4259 -911 -4238 -7116
3581g116q589O503P316L54J405n16j945K364j3578j3176J0228J2969J286K438
$$ -7116 -15705 -9202 -1886 -1532 -127 -643 -2588 -224 -13802 -26978 -16750 -3781 -2495 -57
3567e7j41Q438J0189p336j5960O57j613p710J525k367r420O255L411k300k654
$$ -57 -198 8240 18429 11093 -4867 -4210 -5823 -13533 -12008 -14375 -23795 -17540 -14129 -16429 -19083
3552a9083L891J9017j792j0993N219J1336J2484j1221n620o561r081M362r74J9488
$$ -19083 -15192 3825 2033 -8960 -3741 7595 20079 8858 3238 -3323 -12404 -8042 -9016 10472
3538A0472J938j0629j4061k205P079m018k667p038J1903Q42J2295L991M009r780
$$ 10472 12410 1781 -12280 -14485 -7406 -11424 -14091 -21129 -9226 -8384 3911 7902 11911 2131
3524B131k448k206j8081j2803K528L776J5975J3228o471q273K55q145m49l84k16
$$ 2131 -317 -2523 -20604 -33407 -30879 -27103 -11128 2100 -4371 -12644 -12389 -20534 -20983 -21367 -21583
3509b1583L759Q449P743J9011k377n82k529q197K357l057j873J8J0694N881j3227
$$ -21583 -17824 -9375 -1632 17379 15002 14420 11891 3694 6051 2994 1121 1139 11833 17714 4487
3494D487o879J0840L153p323l841n868o988O387p438R79q355r228N684J9465J4533
$$ 4487 -2392 8448 11601 4278 437 -5431 -12419 -6032 -13470 -12491 -20846 -30074 -24390 -4925 9608
3479I608P360j6943r366Q327R029O987L481j6141J021M649m679r631k365J0943
$$ 9608 16968 25 -9341 -1014 8015 15002 18483 2342 3363 8012 3333 -6298 -8663 2280
3465B280J074o279o529J2818Q51j2735j425J3224Q869K664l35J699p905k811r68
$$ 2280 3354 -2925 -9454 3364 4215 -8520 -9945 3279 12148 14812 14477 16176 8271 5460 4492
3450D492l546P312m587p927m011p703o084L773M541M955j853Q440l75j2910M501
$$ 4492 946 8258 3671 -4256 -8267 -15970 -22054 -18281 -13740 -8785 -10638 -2198 -2573 -15483 -10982
3435a0982k41K17J1683m418j266J6R38J162p369j8380M507J4222J3801o27l009
$$ -10982 -11223 -11006 677 -3741 -5007 -4991 -4053 -2891 -10260 -28640 -24133 -9911 3890 3263 254
3420B54p446o947J739K0583R121j3474Q234J0399J326j612j3454j8690n13j8093
$$ 254 -7192 -14139 -12400 8183 17304 3830 12064 22463 23789 22177 8723 -9967 -10480 -28573
3406b8573M242K2052J50r149n761L963J1541J2918k673r58n399K41P667o585o195
$$ -28573 -24331 -2279 -2129 -11278 -17039 -13076 -1535 11383 8710 7752 2353 2594 10261 3676 -2519
3391b519Q022J039k504k436j1585j014j051m804O235J1152N089r193j2546J2080
$$ -2519 5503 6542 4038 1602 -9983 -10997 -12048 -16852 -10617 535 5624 -3569 -16115 -4035
3377d035N191o976N45l819J4637J124j628p16o573m007O15J5682K42K187R38l618
$$ -4035 1156 -5820 -5275 -9094 5543 6667 5039 4323 -2250 -6257 -5642 10040 10282 12469 13407 9789
3361I789m590Q61P678o152o920j0203P537n987j4442p580K4243M171O562Q885
$$ 9789 5199 6060 13738 7586 666 -9537 -2000 -7987 -22429 -30009 -5766 -1595 4967 13852
3347A3852P110q284j8036q972q31J0147L551J121n842j0789L565j952o031O960
$$ 13852 20962 12678 -5358 -14330 -15161 -5014 -1463 -342 -6184 -16973 -13408 -15360 -21391 -14431
3333a4431Q772j2994j5677L173N857N968N242r44L35j0632p26O030j2519J0507
$$ -14431 -5659 -18653 -34330 -31157 -25300 -19332 -14090 -15034 -14699 -25331 -26057 -20027 -32546 -22039
3319b2039R460j005O960k0098j2799q490N234L292J4008J7290J873j3502N720
$$ -22039 -12579 -13584 -6624 -26722 -39521 -48011 -42777 -39485 -25477 -8187 -6314 -19816 -14096
3306a4096N926Q427m4N067K271j182L483l194o111p285J348J1860Q251k631R693
$$ -14096 -8170 257 213 5280 7551 6369 9852 6658 547 -6738 -5390 6470 14721 12090 21783
3291B1783L492p681j0237J11j2099m827R82K667k012k49j145N715l722q755K443
$$ 21783 25275 17594 7357 7468 -4631 -9458 -8476 -5809 -7821 -8070 -9215 -3500 -7222 -15977 -13534
3276a3534K0580P506P901K243J1417K276j3447o216L744p736r075n530r235q859
$$ -13534 7046 14552 22453 24696 36113 38389 24942 18726 22470 14734 5659 129 -9106 -17965
3262a7965l259O091N6M403n534J1206J6027L714l390l13j1348j0514Q589R407
$$ -17965 -21224 -15133 -15077 -10674 -16208 -5002 11025 14739 11349 11036 -312 -10826 -2237 7170
3248G170M291q641J182O744j4230r582n574O394J0007P97m982J6872J3463L68
$$ 7170 11461 2820 4002 10746 -3484 -13066 -18640 -12246 -2239 -1442 -6424 10448 23911 24279
3234B4279m316k0002j7926j0125J6038O041j6562l401L669L770O36j4668J3293
$$ 24279 19963 -39 -17965 -28090 -12052 -6011 -22573 -25974 -22305 -18535 -17899 -32567 -19274
3221a9274P993Q252K986O453J603q015q989k475j926L489o758n446J203P480O143
$$ -19274 -11281 -3029 -43 6410 8013 -2 -8991 -11466 -13392 -9903 -16661 -22107 -20904 -13424 -7281
3206g281K809P405O654l221j571J409o829j0887J2360K2046p406o554n466J1600
$$ -7281 -4472 2933 9587 6366 4795 6204 -625 -11512 848 22894 15488 8934 3468 15068
3192A5068K994j2244o583j006Q08j14J618n93j5140M478K3549J2500P013o330
$$ 15068 18062 5818 -765 -1771 -963 -1077 541 -52 -15192 -10714 12835 25335 32348 26018
3178B6018j6640j2058j174Q398J2787J6752m111k8291j2773R47J4209J0p781j456
$$ 26018 9378 -2680 -3854 4544 17331 34083 29972 1681 -11092 -10145 4064 4074 -3707 -5163
3164e163N593M409o153o250o103K500J606Mj85k385j0455n705L298k715J510J1256
$$ -5163 430 4839 -1314 -7564 -13667 -11167 -9561 -9557 -9742 -12127 -22582 -28287 -24989 -27704 -26194 -14938
3148a4938q97M888J3917Q00P105j1572r501m668O00J2984k476j1124o6O596m48
$$ -14938 -15835 -10947 2970 3770 10875 -697 -10198 -14866 -14266 -1282 -3758 -14882 -14948 -8352 -8800
3133h800L139J1673j531j5064J176K323J4571p673l299r324n787J1792K1241Q246
$$ -8800 -5661 6012 4481 -10583 -9407 -7084 7487 -186 -3485 -12809 -18596 -6804 14437 22683
3119B2683l335j4723n265m869j0274J806N563N314P367l051q938m38j488p496
$$ 22683 19348 4625 -640 -5509 -15783 -13977 -8414 -3100 4267 1216 -7722 -8160 -9648 -17144
3105a7144j1242K523O373O161R287L87L217r89l365m785j4503K030N007q427n219
$$ -17144 -28386 -25863 -19490 -13329 -4042 -3655 -438 -1427 -4792 -9577 -24080 -22050 -17043 -25470 -30689
3090c0689J509K787Q586l568M974K453Q184M702N878M728j385N116M54m792j4695
$$ -30689 -29180 -26393 -17807 -21375 -16401 -13948 -5764 -1062 4816 9544 8159 13275 13729 8937 -5758
3075e758P844M107j1458J020Q93J16j2244n242J2624J7471r062p737j175N581
$$ -5758 2086 6193 -5265 -4245 -3352 -3236 -15480 -20722 -8098 9373 311 -7426 -8601 -3020
3061c020Q575l212o809r59n231n996P82J5689K94j632j210J0901l65m570j3339
$$ -3020 5555 2343 -4466 -5425 -10656 -16652 -15870 -181 113 -1519 -2729 8172 7807 3237 -10102
3046a0102l434N377J3562k457R016J1025N147j1944n102j6983J2931J0598j273
$$ -10102 -13536 -8159 5403 2946 11962 22987 28134 16190 11088 -5895 7036 17634 16361
3033A6361J11J9136q021m427r313r245j0979k478J4945Q610r487q085n825l119
$$ 16361 16472 35608 27587 23160 13847 4602 -6377 -8855 6090 14700 5213 -2872 -8697 -11816
3019a1816j2830J1271J8373p275m227N953R047J192N849j6700j8559m222L567
$$ -11816 -24646 -13375 4998 -2277 -6504 -551 8496 9688 15537 -1163 -19722 -23944 -20377
3006b0377J6633P424k640O75J2529N431j1337L633r220j0965k318q000j450N650
$$ -20377 -3744 3680 1040 1715 14244 19675 8338 11971 2751 -8214 -10532 -18532 -19982 -14332
2992a4332P058J876J1040R053M751M810p485j065o965j315m296j2134r213O440
$$ -14332 -7274 -5398 5642 14695 19446 24256 16771 15706 8741 7426 3130 -9004 -18217 -11777
2978a1777r658Q513M810r92n910r92K872J5562O20m088m445j1459j782J833o153
$$ -11777 -21435 -12922 -8112 -9104 -15014 -16006 -13134 2428 3048 -1040 -5485 -16944 -18726 -16893 -23046
2963b3046J091L498J681k074k009n179K872J2047J4260O854j5843n687J768p197
$$ -23046 -21955 -18457 -16776 -18850 -20859 -26038 -23166 -11119 3141 9995 -5848 -11535 -9767 -16964
2949a6964r980k423J560m14m473R418O809K901J2431j1023L32J1640P064o960
$$ -16964 -26944 -29367 -27807 -28221 -32694 -23276 -16467 -13566 -1135 -12158 -11826 -186 6878 -82
2935h2j131J2798L006o874j5012o349M420n748R71J6929m200p919O323J329k230
$$ -82 -1213 11585 14591 7717 -7295 -13644 -9224 -14972 -14001 2928 -1272 -9191 -2868 -1539 -3769
2920c769O922N118j4777j0874R5J2965O689p606p375j3114p039J4102L269L50
$$ -3769 3153 8271 -6506 -17380 -17285 -4320 2369 -5237 -12612 -25726 -32765 -18663 -15394 -15044
2906a5044J266O026Q706j215n963p545j0953r53K24R085Q809P915O747N907m936
$$ -15044 -13778 -7752 954 -261 -6224 -13769 -24722 -25675 -25451 -16366 -7557 358 7105 13012 8076
2891H076n638j3510l640K46k200P081l101J3624J1624r170m401n150m685q636
$$ 8076 2438 -11072 -14712 -14466 -16666 -9585 -12686 938 12562 3392 -1009 -6159 -10844 -19480
2877a9480l029r64R844Q679p471M315L003P00j4943m464J0701K1093O403n488
$$ -19480 -22509 -23473 -13629 -4950 -12421 -8106 -5103 -4403 -19346 -23810 -13109 7984 14387 8899
2863H899Q296r784k465q993r691k590N900L378J012o074J0010J1160p598n037
$$ 8899 17195 7411 4946 -4047 -13738 -16328 -10428 -7050 -6038 -12112 -2102 9058 1460 -3577
2849c577r160K682J7108J8951R07j7862j1517q452L789J4769J357j948L683J254
$$ -3577 -12737 -10055 7053 26004 26911 9049 -2468 -10920 -7131 7638 8995 7047 10730 11984
2835A1984K532J6278k956j9965j2396J707K900M426N402N001j6521j6870Q58n908
$$ 11984 14516 30794 27838 7873 -4523 -2816 84 4510 9912 14913 -1608 -18478 -17620 -23528
2821b3528J3006J2926M910P328O474j1301r187o724K911M218L935J1981O38j4664
$$ -23528 -10522 2404 7314 14642 21116 9815 628 -6096 -3185 1033 4968 16949 17587 2923
2807B923k3493M206K337J668P888Q111L943n759M274N471j6284r962Q859K54M733
$$ 2923 -20570 -16364 -14027 -12359 -4471 3640 7583 1824 6098 11569 -4715 -14677 -5818 -5564 -831
2792h31K17o11J893p024k28M051J2794l038p839m36M555j0400q40k950N913L556
$$ -831 -614 -1225 668 -6356 -6584 -2533 10261 7223 -616 -1052 3503 -6897 -7737 -10687 -4774 -1218
2776a218j5982j366R641M040L870Q722M459M39j4181k249l116n604N473o224M367
$$ -1218 -17200 -18566 -8925 -4885 -1015 7707 12166 12605 -1576 -3825 -6941 -12545 -7072 -13296 -8929
2761h929M712n971j867j0754J1285J0641m566Q17j859j851J780o510K06l78j097
$$ -8929 -4217 -10188 -12055 -22809 -11524 -883 -5449 -4632 -6491 -8342 -6562 -13072 -12866 -13244 -14341
2746a4341j2666j2988P002J0274Q290k160M161N338l566K948O987m759K857R87
$$ -14341 -27007 -39995 -32993 -22719 -14429 -16589 -12428 -7090 -10656 -7708 -721 -5480 -2623 -1636
2732a636M402r889P398O956m469M19M980r9Q265M406j1860k413l838p150K483
$$ -1636 2766 -7123 275 7231 2762 3181 8161 8062 16327 20733 8873 6460 2622 -4528 -2045
2717b045K280j0091j1951P323J6989N126j5115n348M095O444j559N065p785j4472
$$ -2045 235 -9856 -21807 -14484 2505 7631 -7484 -12832 -8737 -2293 -3852 1213 -6572 -21044
2703b1044j3957P196Q337P697K808P855j3171j311M473K800M316p184j4775M079
$$ -21044 -35001 -27805 -19468 -11771 -8963 -1108 -14279 -15590 -11117 -8317 -4001 -11185 -25960 -21881
2689b1881N327J3046O759P284j4791L72p707M355K084j7139r886M333J2994J0988
$$ -21881 -16554 -3508 3251 10535 -4256 -3884 -11591 -7236 -5152 -22291 -32177 -27844 -14850 -3862
2675c862O071n228q115j1879J7848J1214m013j3663j782l630P35J4441k617L426
$$ -3862 2209 -3019 -11134 -23013 -5165 6049 2036 -11627 -13409 -17039 -16304 -1863 -4480 -1054
2661a054j3173r610n064N976n483K105J0675J0918l499j2100J1684J8310o415
$$ -1054 -14227 -23837 -28901 -22925 -28408 -26303 -15628 -4710 -8209 -20309 -8625 9685 3270
2648C270q509J3044J1079J717j19n074N005N766o209j5613j414P446J962m710
$$ 3270 -5239 7805 18884 20601 20482 15408 20413 26179 19970 4357 2943 10389 12351 7641
2634G641M217k09p701n766r021L488N96J4193J8725L002l670J153r719l780P109
$$ 7641 11858 11649 3948 -1818 -10839 -7351 -6755 7438 26163 29165 25495 26648 16929 13149 20258
2619B0258K410k978j6789J0812J3196p694L303n24p270j416o205j1384j239P037
$$ 20258 22668 19690 2901 13713 26909 19215 22518 21994 14724 13308 7103 -4281 -5520 1517
2605A517N103k532j3022K505R274L726j2037J258J4538J3569n930n127l486j7744
$$ 1517 6620 4088 -8934 -6429 2845 6571 -5466 -4208 10330 23899 17969 12842 9356 -8388
2591h388k1368N360K2338L968p912j1876L46N017l824J1256P626k904J1230j3107
$$ -8388 -29756 -24396 -2058 1910 -6002 -17878 -17532 -12515 -16339 -5083 2543 -361 10869 -2238
2577b238j92O2q016l254J327J1097j014R541O22j350J0267L030l160j600J0229
$$ -2238 -2430 -2368 -10384 -13638 -12311 -1214 -2228 7313 7935 6585 16852 19882 16722 15122 25351
2562B5351J789j3494r627R06K86o468m605m51P501N608j5907J124J3369J2040
$$ 25351 27140 13646 4019 4925 5211 -1257 -5862 -6313 1188 6796 -9111 -7987 5382 17422
2548A7422j3346P46N446r347J900N042M59L095M190q935n145k1339L625J6244
$$ 17422 4076 4822 10268 921 2821 7863 8322 11417 15607 6672 1527 -19812 -16187 57
2534E7J0367J4351j6429j7270n267J2347r080j343J579K639J7154R635N39j379
$$ 57 10424 24775 8346 -8924 -14191 -1844 -10924 -12267 -10688 -8049 9105 18740 19279 17900
2520A7900k3091j1427L931k775n855J4162K0023O156P68o39o069l362K489k0376
$$ 17900 -5191 -16618 -12687 -15462 -21317 -7155 12868 19024 19792 19153 13084 9722 12211 -8165
2506h165j2801q114J576P311N737q160N388Q065R952n286o53P998l010L876q824
$$ -8165 -20966 -29080 -27504 -20193 -14456 -22616 -17228 -9163 789 -4497 -5150 2848 -162 3714 -5110
2491e110j4052p173L647R419N82j0014j1293Q571R553N275n025j4357J7301J3861
$$ -5110 -19162 -26335 -22688 -13269 -12687 -22701 -33994 -25423 -15870 -10595 -15620 -29977 -12676 1185
2477A185Q009p870k5758j1921L426O830O403M727m174L634O894l090O773O000
$$ 1185 9194 1324 -24434 -36355 -32929 -26099 -19696 -14969 -19143 -15509 -8615 -11705 -4932 1068
2463A068M489P036j4373j0808n53k06Q756J4716P042k327k697j8901M381M853
$$ 1068 5557 12593 -1780 -12588 -13141 -13347 -4591 10125 17167 14840 12143 -6758 -2377 2476
2449B476p418l854Q40o305k549J6065n764L454P890K393k86l333o256M337M626
$$ 2476 -4942 -8796 -7956 -14261 -16810 -745 -6509 -3055 4835 7228 6942 3609 -2647 1690 6316
2434F316l491r157r113p390l679Q714J4296J010Q236P988j221O814o372p667N040
$$ 6316 2825 -6332 -15445 -22835 -26514 -17800 -3504 -2494 5742 13730 12509 19323 12951 5284 10324
2419A0324l354q955o259p350k800o39R515j63j186M978J1614O511p630m386l606
$$ 10324 6970 -1985 -8244 -15594 -18394 -19033 -9518 -9681 -10867 -5889 5725 12236 4606 220 -3386
2404c386q11j0561J2003o224j505J432J80p081l257L407J4739q324j6975M475
$$ -3386 -4197 -14758 -2755 -8979 -10484 -9052 -8872 -15953 -19210 -15803 -1064 -9388 -26363 -21888
2390b1888l49q921L433J2589J1139k043p971Q103J5157K663l316j481K514K092
$$ -21888 -22237 -31158 -27725 -15136 -3997 -6040 -14011 -5908 9249 11912 8596 7115 9629 11721
2376A1721q716j2225L626Q403J373n186j5740j655K0075l134k899J576n978j1921
$$ 11721 3005 -9220 -5594 2809 4182 -1004 -16744 -18399 1676 -1458 -4357 -2781 -8759 -20680
2362b0680l204Q335P516J377J7928K433r064n918N54K2565O310j6659k0559P861
$$ -20680 -23884 -15549 -8033 -6656 11272 13705 4641 -1277 -723 21842 28152 11493 -9066 -1205
2348a205R703J3463l433p958j170J695k758l480j808l355k388j3394r253R200
$$ -1205 8498 21961 18528 10570 9400 11095 8337 4857 3049 -306 -2694 -16088 -25341 -16141
2334a6141P621k774J384J0667m477L87m936o736J2308K238j635P745p078l620
$$ -16141 -8520 -11294 -9910 757 -3720 -3333 -8269 -15005 -2697 -459 -2094 5651 -1427 -5047
2320e047M217j0287j0755O725j475p543R591J0279q611P520l277P283R30l027
$$ -5047 -830 -11117 -21872 -15147 -16622 -24165 -14574 -4295 -12906 -5386 -8663 -1380 -450 -3477
2306c477L375K853l301L255l00k962n742J267J22M211N934j255p261r77L710Q205
$$ -3477 -102 2751 -550 2705 2405 -557 -6299 -5032 -4910 -699 5235 3980 -3281 -4258 -548 7657
2290G657k309j6533j4512J2027J7699M623n009J2126O334J2752m041j0363o234
$$ 7657 5348 -11185 -25697 -13670 4029 8652 3643 15769 22103 34855 30814 20451 14217
2277A4217j690k714q675J0349L589q491j6666K004P006j2254n481j0875n190N430
$$ 14217 12527 9813 1138 11487 15076 6585 -10081 -8077 -1071 -13325 -18806 -29681 -34871 -29441
$$ [...]
##END NTUPLES=NMR SPECTRUM
##END=
