##TITLE=Analysis number 322613
Compound Code cc 36504
Book Reference 468/170/10
Project Code adrs
Chemist Name colinb
##JCAMPDX= 6.0         $$ Bruker NMR JCAMP-DX V2.0
##DATA TYPE= NMR SPECTRUM
##DATA CLASS= NTUPLES
##ORIGIN= Bruker BioSpin GmbH
##OWNER= nmr
$$ XWIN-NMR		Version 3.5
$$ Mon Oct  2 13:16:39 2006 GMT Daylight Time (UT+1h)  MAYBRIDGE\nmr@NMR_250MHZ
##.OBSERVE FREQUENCY= 250.131544655141
##.OBSERVE NUCLEUS= ^1H
##.ACQUISITION MODE= SIMULTANEOUS (DQD)
##.ACQUISITION SCHEME= undefined
##.AVERAGES= 16
##.DIGITISER RES= 18
##SPECTROMETER/DATA SYSTEM= dpx250
##.PULSE SEQUENCE= zg30
##.SOLVENT NAME= CDCl3
##.SHIFT REFERENCE= (INTERNAL, CDCl3, 0, 16.522)
##AUDIT TRAIL= $$ (NUMBER, WHEN, WHO, WHERE, WHAT)
$$ ##TITLE= Audit trail, XWIN-NMR		Version 3.5
$$ ##JCAMPDX= 5.01
$$ ##ORIGIN= Bruker BioSpin GmbH
$$ ##OWNER= nmr
$$ C:\u/data/dgb/nmr/ADRS/60/pdata/1/auditp.txt
$$ ##AUDIT TRAIL=  $$ (NUMBER, WHEN, WHO, WHERE, WHAT)
(   1,<2006-10-02 13:16:10.65 +100>,<MAYBRIDGE\nmr>,<NMR_250MHZ>,
      <created by zg, POWCHK disabled, PULCHK disabled
       configuration hash MD5:
       E2 DF 36 D8 04 B2 41 60 5A D7 A3 38 5A 4B D0 FE
       data hash MD5: 64K
       27 99 07 3D 26 29 E7 27 2B E4 7B 0D 76 E0 7A 26>)
(   2,<2006-10-02 13:16:26.82 +100>,<MAYBRIDGE\nmr>,<NMR_250MHZ>,
      <Start of raw data processing
       ef LB = 0.3 FT_mod = 6 PKNL = 1 SI = 32K 
       data hash MD5: 32K
       85 D5 F7 AD CB 0A 9F 21 2D BC 37 F4 64 00 97 71>)
(   3,<2006-10-02 13:16:28.46 +100>,<MAYBRIDGE\nmr>,<NMR_250MHZ>,
      <apk 
       data hash MD5: 32K
       F9 BB 97 87 FF E6 34 88 95 63 8A F9 75 59 6C A2>)
(   4,<2006-10-02 13:16:29.32 +100>,<MAYBRIDGE\nmr>,<NMR_250MHZ>,
      <abs ABSG = 5 
       data hash MD5: 32K
       59 56 DA B1 29 56 B0 C5 19 A0 CB 82 66 37 28 89>)
$$ ##END=
$$ 
$$ hash MD5
$$ 5A FB CC 11 A0 51 22 F9 BE C8 F0 83 1C DB 66 8B
##$RELAX= 
##$RELAX= 
##$RELAX= 
##$RELAX= 
##$RELAX= 
##$RELAX= 
##$RELAX= 
$$ Bruker specific parameters
$$ --------------------------
##$DU= <C:\u>
##$EXPNO= 60
##$NAME= <ADRS>
##$PROCNO= 1
##$TYPE= <nmr>
##$USER= <dgb>
##$AMP= (0..31)
100 100 100 100 100 100 100 100 100 100 100 100 100 100 100 100 100 100 
100 100 100 100 100 100 100 100 100 100 100 100 100 100 
##$AQSEQ= 0
##$AQ_mod= 3
##$AUNM= <au_zg>
##$AUTOPOS= <39 >
##$BF1= 250.13
##$BF2= 250.13
##$BF3= 250.13
##$BF4= 250.13
##$BF5= 500.13
##$BF6= 500.13
##$BF7= 500.13
##$BF8= 500.13
##$BYTORDA= 1
##$CFDGTYP= 0
##$CFRGTYP= 5
##$CHEMSTR= <none>
##$CNST= (0..31)
1 1 145 1 1 1 1 1 1 1 1 1 1 1 1 1 1 1 1 1 1 1 1 1 1 1 1 1 1 1 1 1 
##$CPDPRG= <>
##$CPDPRG1= <>
##$CPDPRG2= <>
##$CPDPRG3= <>
##$CPDPRG4= <mlev>
##$CPDPRG5= <mlev>
##$CPDPRG6= <mlev>
##$CPDPRG7= <mlev>
##$CPDPRG8= <mlev>
##$CPDPRGB= <>
##$CPDPRGT= <>
##$D= (0..31)
0 1 0 0 0 0 0 0 0 0.06 0 0 0 0 0 0 0.0002 0 0 0 0 0 0 0 0 0 0 0 0 0 0 
0 
##$DATE= 1159791369
##$DBL= (0..7)
120 120 120 120 120 120 120 120 
##$DBP= (0..7)
150 150 150 150 150 150 150 150 
##$DBP07= 0
##$DBPNAM0= <>
##$DBPNAM1= <>
$$ [...]
##$SUBNAM7= <"">
##$SUBNAM8= <"">
##$SUBNAM9= <"">
##$SW= 20.6930455092707
##$SWIBOX= (0..15)
0 0 3 0 0 0 0 0 0 0 0 0 0 0 0 0 
##$SW_h= 5175.983436853
##$TD= 65536
##$TD0= 1
##$TE= 296.16
##$TE2= 300
##$TE3= 300
##$TEG= 300
##$TL= (0..7)
0 120 120 120 120 120 120 120 
##$TP= (0..7)
150 150 150 150 150 150 150 150 
##$TP07= 0
##$TPNAME0= <>
##$TPNAME1= <>
##$TPNAME2= <>
##$TPNAME3= <>
##$TPNAME4= <>
##$TPNAME5= <>
##$TPNAME6= <>
##$TPNAME7= <>
##$TPOAL= (0..7)
0.5 0.5 0.5 0.5 0.5 0.5 0.5 0.5 
##$TPOFFS= (0..7)
0 0 0 0 0 0 0 0 
##$TUNHIN= 0
##$TUNHOUT= 0
##$TUNXOUT= 0
##$USERA1= <user>
##$USERA2= <user>
##$USERA3= <user>
##$USERA4= <user>
##$USERA5= <user>
##$V9= 5
##$VALIST= <valist>
##$VCLIST= <CCCCCCCCCCCCCCC>
##$VD= 0
##$VDLIST= <DDDDDDDDDDDDDDD>
##$VPLIST= <PPPPPPPPPPPPPPP>
##$VTLIST= <TTTTTTTTTTTTTTT>
##$WBST= 1024
##$WBSW= 4
##$XGAIN= (0..3)
0 0 0 0 
##$XL= 0
##$YL= 0
##$YMAX_a= 343333
##$YMIN_a= -497465
##$ZGOPTNS= <>
##$ZL1= 120
##$ZL2= 120
##$ZL3= 120
##$ZL4= 120
##$ABSF1= 16.522
##$ABSF2= -4.171173
##$ABSG= 5
##$ABSL= 3
##$ALPHA= 0
##$AQORDER= 0
##$ASSFAC= 0
##$ASSFACI= 0
##$ASSFACX= 0
##$ASSWID= 0
##$AUNMP= <proc_1d>
##$AZFE= 0.1
##$AZFW= 0.1
##$BCFW= 0
##$BC_mod= 0
##$BYTORDP= 0
##$COROFFS= 0
##$CY= 12.5
##$DATMOD= 1
##$DC= 0
##$DFILT= <>
##$DTYPP= 0
##$F1P= 14.0000005364418
##$F2P= -0.99999901652339
##$FCOR= 0.5
##$FTSIZE= 32768
##$FT_mod= 6
##$GAMMA= 0
##$GB= 0
##$INTBC= 1
##$INTSCL= 1
##$ISEN= 128
##$LB= 0.3
##$LEV0= 0
##$LPBIN= 0
##$MAXI= 10000
##$MC2= 0
##$MEAN= 0
##$ME_mod= 0
##$MI= 0
##$NCOEF= 0
##$NC_proc= -4
##$NLEV= 6
##$NOISF1= 0
##$NOISF2= 0
##$NSP= 0
##$NTH_PI= 0
##$NZP= 0
##$OFFSET= 16.522
##$PC= 1
##$PHC0= 156.2352
##$PHC1= 6.360171
##$PH_mod= 1
##$PKNL= yes
##$PPARMOD= 0
##$PSCAL= 4
##$PSIGN= 0
##$REVERSE= no
##$SF= 250.13
##$SI= 32768
##$SIGF1= 0
##$SIGF2= 0
##$SINO= 400
##$SIOLD= 32768
##$SREGLST= <1H.CDCl3>
##$SSB= 0
##$STSI= 32768
##$STSR= 0
##$SW_p= 5175.98343685301
##$SYMM= 0
##$S_DEV= 0
##$TDeff= 65536
##$TDoff= 0
##$TI= <Analysis number 999999
Compound Code 99
Book Reference 9
Project Code 9>
##$TILT= no
##$TM1= 0
##$TM2= 0
##$TOPLEV= 0
##$USERP1= <user>
##$USERP2= <user>
##$USERP3= <user>
##$USERP4= <user>
##$USERP5= <user>
##$WDW= 1
##$XDIM= 32768
##$YMAX_p= 367114299
##$YMIN_p= -435783
$$ End of Bruker specific parameters
$$ ---------------------------------
##NTUPLES= NMR SPECTRUM
##VAR_NAME=  FREQUENCY,     SPECTRUM/REAL,   SPECTRUM/IMAG
##SYMBOL=    X,             R,               I
##VAR_TYPE=  INDEPENDENT,   DEPENDENT,       DEPENDENT
##VAR_FORM=  AFFN,          ASDF,            ASDF
##VAR_DIM=   32768,         32768,           32768
##UNITS=     HZ,            ARBITRARY UNITS, ARBITRARY UNITS
##FACTOR=    0.157963299565203, 1,           1
##FIRST=     4132.6476996994, 0,             0
##LAST=      -1043.33573715361, 0,           0
##MIN=       -1043.33573715361, -435783,     0
##MAX=       4132.6476996994, 367114299,     0
$$ Real data points
##PAGE= N=1
##DATA TABLE= (X++(R..R)), XYDATA
$$ [...]
28052A50262j11560j66179N8102P6879O4595j21393p6402P2920J00538j7777j55112
$$ 150262 38702 -127477 -69375 7504 72099 -49294 -125696 -52776 47762 29985 -125127
28041a25127P2411N5387r3285j50884K4310R4414J52449J772j9835R9207j4902
$$ -125127 -52716 2671 -90614 -241498 -217188 -122774 29675 31447 11612 110819 95917
28030I5917o2475o9752N8242R6332r0414k1161O030p6437J0662J6955m674J03679
$$ 95917 33442 -36310 21932 118264 27850 6689 12719 -63718 -53056 -36101 -40775 62904
28018F2904q786M3982k3126R5230q191p6606q6814K9714P928j8545O5168J694
$$ 62904 54118 98100 74974 170204 162013 85407 -1407 28307 36235 17690 82858 84552
28006H4552j52574p6906P0322O7093j484M0116O5693O9766O3639r2163k9342o4335
$$ 84552 -68022 -144928 -74606 -7513 -8997 31119 96812 166578 230217 138054 108712 44377
27994D4377p0896m5940P1559P4780l5626J4039n7805L1663O0010o9665r7329j33205
$$ 44377 -26519 -72459 -900 73880 38254 52293 -5512 26151 86161 16496 -80833 -214038
27982b14038R804K0964L8985O9461L996K2373J28110r730j48638m6158R0580L294
$$ -214038 -204234 -183270 -144285 -74824 -70828 -48455 79655 69925 -78713 -124871 -34291 -30997
27970c0997o7026J7012Q446j75319k62J67820J79899R4307K6596j86158j61173
$$ -30997 -98023 -81011 -72565 -247884 -248146 -80326 99573 193880 220476 34318 -126855
27959a26855j0526J24369P066k4403M6387L7956n607k6647j34376K2254P9989
$$ -126855 -137381 -13012 -5946 -30349 16038 53994 48387 21740 -112636 -90382 -10393
27948a0393Q2412P8780P305k5338j4006M5670P5235M3118n9161J0595j9454n8092
$$ -10393 72019 150799 158104 132766 118760 164430 239665 282783 223622 234217 214763 156671
27936A56671j30308j03514o7771o7046M9999O101J28704o7870M1830K968N6230
$$ 156671 26363 -77151 -144922 -211968 -161969 -155868 -27164 -95034 -53204 -50236 5994
27925E994J14785M4546o0013j00414r7592n1368n0282m645J91731Q6254l9627
$$ 5994 120779 165325 105312 4898 -92694 -144062 -194344 -198989 -7258 78996 39369
27914C9369N4J1779J05384L9101j78874l3710J2945O3750J07192J0853j16761
$$ 39369 39423 51202 156586 195687 16813 -16897 -3952 59798 166990 177843 61082
27903F1082n6314m0621R7691J36332L8111j0515l974j91731n7360N130N8591o9053
$$ 61082 4768 -35853 61838 198170 236281 225766 221792 30061 -27299 -22169 36422 -32631
27891c2631j50205j17005l2614P1254K02797J14898M3687j03209j25387J5087
$$ -32631 -182836 -299841 -332455 -261201 -58404 56494 100181 -3028 -128415 -113328
27881a13328J16283J17487J80618n3513j08181N5453k3938j5328j9606J7687N885
$$ -113328 2955 120442 301060 247547 139366 194819 170881 155553 135947 153634 159519
27870A59519j0229l5074k6899l9093n0005Q0389j3503O5015o3145n419n5129k4913
$$ 159519 149290 114216 87317 48224 -1781 78608 65105 130120 66975 61556 6427 -18486
27858a8486l6680L2323J5268n515m6362K3201M9960R1309k5491o2549p3500L2577
$$ -18486 -55166 -22843 -7575 -13090 -59452 -36251 13709 105018 79527 16978 -56522 -23945
27846b3945P1137J8580L2343Q8395j5175j52616p6404p906R6894L7126N6052m8244
$$ -23945 47192 65772 98115 186510 171335 18719 -57685 -65591 31303 68429 124481 76237
27834G6237j19577R1171Q1894j06745l8441r6632R6642J23997n426j65647N8770
$$ 76237 -43340 47831 129725 22980 -15461 -112093 -15451 108546 103120 -62527 -3757
27823c757J13443k7684M0444k3419Q0242M653N6164J27938m2878o1112r0986p1304
$$ -3757 109686 82002 122446 99027 179269 183922 240086 368024 325146 264034 173048 101744
27811A01744j11522J10896o0033q1590M7049q4436l3802P7991R4684J59973l9365
$$ 101744 -9778 101118 41085 -40505 6544 -77892 -111694 -33703 60981 220954 181589
27800A81589j04095j21372o7691J44127o4203j59279M8980M0252j06496L6206
$$ 181589 77494 -43878 -111569 32558 -31645 -190924 -141944 -101692 -208188 -171982
27790a71982q8003J5032J47601l6636K5990J12714l1958j2627N0343n0299M193
$$ -171982 -259985 -244953 -97352 -133988 -107998 4716 -27242 -39869 10474 -39825 -35632
27779c5632J16791M585o9704j65538o3472n6892M0543J45077J15329M7532j27251
$$ -35632 81159 85744 16040 -149498 -212970 -269862 -229319 -84242 31087 78619 -48632
27768d8632J3200n1778l1291L5783l8095q425J33902J86901J10807j27770j18323
$$ -48632 -35432 -87210 -118501 -82718 -120813 -129238 4664 191565 302372 174602 56279
27757E6279l3145r2874J11087Q7020Q3946R829o7968k07887j28492P514K483N5231
$$ 56279 23134 -69740 41347 128367 212313 222142 154174 -53713 -182205 -174691 -172208 -116977
27745a16977M6825J65619N8727L37L9328l9430j56911n0693J3905J09620N0799
$$ -116977 -70152 95467 154194 154531 193859 154429 -2482 -53175 -39270 70350 121149
27734A21149m1916m8125J08044n8830P6853j0781j3774Q708q7307o5267j9106
$$ 121149 79233 31108 139152 80322 157175 146394 132620 141328 54021 -11246 -30352
27723c0352R271J7721R4966m8941k0055N9021n0091j8306P778N0353m1187N1865
$$ -30352 -21081 -3360 91606 42665 22610 81631 31540 13234 21012 71365 30178 82043
27711H2043l0492q292P4749j40780q3533M4744K8908N0665O9987m8490k29682
$$ 82043 51551 43259 118008 -22772 -106305 -61561 -32653 18012 87999 39509 -190173
27700a90173q2779R438j658j9035J8104J01774J54156l1119l0340o2770L8450
$$ -190173 -272952 -263514 -265172 -284207 -266103 -164329 -10173 -41292 -71632 -134402 -95952
27689i5952R4351J06998j06190O750J22371m7758k4624O4375K3217j9540q2459
$$ -95952 -1601 105397 -793 5957 128328 80570 55946 120321 143538 123998 41539
27678D1539p3015j3482J06530J035n5730m6261P5458J06042K7766J0916j76311
$$ 41539 -31476 -44958 61572 62607 6877 -39384 36074 142116 169882 180798 4487
27667D487q6924R3474J2912q3505n6892M4234J8637k3256l7819k0949L2312O5208
$$ 4487 -82437 11037 23949 -59556 -116448 -72214 -53577 -76833 -114652 -135601 -103289 -38081
27655c8081m7443J6983R1571L3903j12533q0984O6095K6847J13472M9477j93110
$$ -38081 -85524 -68541 23030 56933 -55600 -136584 -70489 -43642 69830 119307 -73803
27644g3803r0857J7411J44607R3621R347M1017q0539O855k7173O0750p5103L7130
$$ -73803 -164660 -147249 -2642 90979 100326 141343 60804 67659 40486 101236 26133 63263
27632F3263k8436l0717o7323M0825n8300j21363j3076M6087P3122O1647j2893
$$ 63263 34827 4110 -63213 -22388 -80688 -202051 -215127 -169040 -95918 -34271 -47164
27621d7164O351P0028N484K9459o3743m6504J0468q8735j14872O5263N6128K9469
$$ -47164 -40813 29215 34699 64158 415 -46089 -35621 -124356 -239228 -173965 -117837 -88368
27609h8368J2239n58n4936L3349N1462N4203J7995l5591L914l0861q047P9861
$$ -88368 -76129 -76687 -131623 -98274 -46812 7391 25386 -10205 -6291 -37152 -45199 34662
27597C4662P5815J30219q6294n2414m8022n0301N9574P2940M924J5494Q203j00980
$$ 34662 110477 240696 154402 101988 53966 3665 63239 136179 141103 156597 164800 63820
27585F3820k6343K2727Q3358M9956k834j11984o3530m8836n6767J37711K6728
$$ 63820 37477 60204 143562 193518 190684 78700 15170 -33666 -90433 47278 74006
27574G4006p836q6170L1323M4287N0582j1545j09239N0500K0481N6603l348k0008
$$ 74006 66170 -20000 11323 55610 106192 94647 -14592 35908 56389 112992 109644 89636
27562H9636o4749j17679j0935O3363J18847J1789K151n881L6397q1685q7906O6416
$$ 89636 24887 -92792 -103727 -40364 78483 90272 92423 86542 122939 41254 -46652 19764
27550A9764P8379o3061K1187J24699L3673j11554j39917o0500o2847K2322R3188
$$ 19764 98143 35082 56269 180968 214641 103087 -36830 -97330 -160177 -137855 -44667
27539d4667J6986l0034n3347k4921P6916J02161L2133n3791N5083l2930l9780
$$ -44667 -27681 -57715 -111062 -135983 -59067 43094 75227 21436 76519 43589 3809
27528C809j3479j38500K9981k803L171R1385K7358q0525j6630J09022R451J04449
$$ 3809 -9670 -148170 -118189 -120992 -117821 -26436 922 -79603 -96233 12789 22240 126689
27516A26689j7959q2500o7663j3572N8917R1978k2688k6062p0406o3227p769J6716
$$ 126689 108730 26230 -41433 -55005 3912 95890 73202 47140 -23266 -86493 -94262 -77546
27504g7546K8364l6691j44265N4817Q5951J31716K5764j06280o7774R6055J51111
$$ -77546 -49182 -85873 -230138 -175321 -89370 42346 68110 -38170 -105944 -9889 141222
27493A41222k1226j89836J834J19869m4367M5411J22960L6075k23135n8035J36505
$$ 141222 119996 -69840 -68006 51863 7496 52907 175867 211942 -11193 -69228 67277
27482F7277j6838l6302Q0315l9442J9564N0116l4687r922p5129k1734M3223M8185
$$ 67277 50439 14137 94452 55010 74574 124690 90003 80081 4952 -16782 26441 74626
27470G4626m9188J678l6913m1748Q374R5235j7018M0039K6799j27562n8008J40093
$$ 74626 25438 27116 -9797 -51545 -43171 52064 35046 75085 101884 -25678 -83686 56407
27458E6407J09733l7021M1832M2631q4036o5333J25409M185r3061N1072M0097
$$ 56407 166140 129119 170951 213582 129546 64213 189622 193807 100746 151818 191915
27447A91915o746K3402j10242j15495n8693K6077J42435o3898j09489L0999L3368
$$ 191915 185169 208571 98329 -17166 -75859 -49782 92653 28755 -80734 -49735 -16367
27436a6367K623O6564P3552K9427N9485o733j80251n4025J53630j46491j21665
$$ -16367 -13744 52820 126372 155799 215284 208551 28300 -25725 127905 -18586 -140251
27425a40251Q9209P7519m4966q7096n7728J7433J57098O7431o6974M6672k4185
$$ -140251 -51042 26477 -18489 -105585 -163313 -145880 11218 78649 11675 58347 34162
27414C4162Q1980L668l4350o5656L7661o2949O1420L6741J3179j07123n2287J50853
$$ 34162 116142 119810 85460 19804 57465 -5484 55936 92677 105856 -1267 -53554 97299
27402I7299O333N2267P2006M3722j12717q3546M789P0590m6888p9557j5082N6259
$$ 97299 103632 155899 227905 271627 158910 75364 80153 150743 103855 24298 9216 65475
27390F5475L3328n8510J0003o3995N1918Q8571K2652m7057j81112K1989R5456
$$ 65475 98803 40293 50296 -13699 38219 126790 149442 102385 -78727 -56738 38718
27379C8718l3002J31876M0090j18760k33364n6327j1852J01306J4430l8046J1768
$$ 38718 5716 137592 177682 58922 -174442 -230769 -242621 -141315 -126885 -164931 -153163
27368a53163J42324J0273J1013o8282M1695J0169J0035L9190L5676p044M0343
$$ -153163 -10839 -566 10447 -57835 -16140 -5971 4064 43254 78930 71886 112229
27357A12229J6591o964k0930o26M2676j02770o3947m5811m2931J20204n139m4498
$$ 112229 128820 121856 100926 100300 142976 40206 -23741 -69552 -112483 7721 2582 -41916
27345d1916j20212L5327K9722n6626O1245K9901l1790J3754Q062K1267o2228J3743
$$ -41916 -162128 -126801 -97079 -153705 -92460 -62559 -94349 -80595 -72533 -51266 -113494 -99751
27333i9751j6788m3923N0230J92533k1945j10219o4339k7661N2350m6334p6447
$$ -99751 -116539 -160462 -110232 82301 60356 -49863 -114202 -141863 -89513 -135847 -212294
27322b12294J91110m4555p8574k6224j9825J647J19934J31295l7999m558J4218
$$ -212294 -21184 -65739 -144313 -170537 -190362 -188715 -68781 62514 24515 19957 34175
27311C4175N0950K8824q105J0864P6741O9620l4339k1862n3213k11437K6484P8775
$$ 34175 85125 113949 105844 116708 193449 263069 228730 206868 153655 -57782 -31298 47477
27299D7477p7770j63674K1224P4488J27407N0204J1780m1254q2020q249R6875
$$ 47477 -30293 -193967 -172743 -98255 29152 79356 91136 49882 -32138 -40387 56488
27288E6488N342k0781n5338r3744k0753M1237p114p334P7862J00238r5265r8298
$$ 56488 61830 41049 -14289 -108033 -128786 -87549 -94663 -101997 -24135 76103 -19162 -117460
27276a17460l3306q1246L310R7327M8388k3392R3327J16855k4228j6201L6409
$$ -117460 -150766 -232012 -228702 -131375 -82987 -106379 -13052 103803 79575 63374 99783
27265I9783Q1475j60867q6643J5079Q994M0445r807L3081N1926L3327J3681j178
$$ 99783 181258 20391 -66252 -51173 -42179 -1734 -11541 21540 73466 106793 120474 119296
27253A19296K2327j89957J5869J17112P4104n7988p1415m3384k2409O0764J04263
$$ 119296 141623 -48334 -32465 84647 158751 100763 29348 -14036 -36445 24319 128582
27242A28582L8626N5534r4657j23928j12585l3809L8312N0221O204o2908J3372
$$ 128582 167208 222742 128085 4157 -108428 -142237 -103925 -53704 -47500 -110408 -97036
27231i7036J32878j6914j4288j00218j9327K6870Q1075R7602q1235p9443N3682
$$ -97036 35842 18928 4640 -95578 -114905 -88035 -6960 90642 9407 -70036 -16354
27220a6354Q8480O0272M9799J1948J01975j19539j57847n5168L7100j3349K5496
$$ -16354 72126 132398 182197 194145 296120 176581 18734 -36434 666 -12683 12813
27209A2813J9976j32775J3045L278o2176K2528N3114P1350Q362j9282j13169O5389
$$ 12813 32789 -99986 -86941 -83663 -145839 -123311 -70197 1153 9515 -9767 -122936 -57547
27197e7547J25176n5950q9401l2603k6635L065p0830N9722o7258l706j4317J13131
$$ -57547 67629 11679 -77722 -110325 -136960 -133895 -204725 -145003 -212261 -215967 -230284 -117153
27185a17153J14965J8668M5610m732P5388O5424J29864m2286k31666q5215k4568
$$ -117153 -2188 16480 62090 57358 132746 198170 328034 285748 54082 -31133 -55701
27174e5701r663J3679K9419j0163R541K5063j33778J4743J44017Q7649p9084r7040
$$ -55701 -65364 -51685 -22266 -32429 -22888 2175 -131603 -116860 27157 114806 35722 -61318
27162f1318l6890J47023N2154j9835l918R9483o921j00103j58442m8693J38616
$$ -61318 -98208 48815 100969 81134 77216 176699 169778 69675 -88767 -137460 1156
27151A156Q7848l2955j03622m3223j1611M7566m015o7169k18R53L2049K8179k4345
$$ 1156 89004 56049 -47573 -90796 -102407 -54841 -58856 -126025 -126243 -125290 -93241 -65062 -89407
27138h9407p1403n168J02413N2867j4857L5355l314r506l5193n0408L4823L264
$$ -89407 -160810 -165978 -63565 -10698 -25555 9800 6486 -3020 -38213 -88621 -53798 -50534
27126e0534J18384N7035n9675k2281q4244J7100p010n4161L6858K5894o8627o1535
$$ -50534 67850 124885 65210 42929 -41315 -24215 -31225 -85386 -48528 -22634 -91261 -152796
27114a52796N4474K9118K2037R527L2731j14264p3081P8557P5597P4663l4391
$$ -152796 -98322 -69204 -47167 -37640 -4909 -119173 -192254 -113697 -38100 36563 2172
27103B172o8990K1871R278l2942L5742L3857J50164o459n6987R6190q17J7482
$$ 2172 -66818 -44947 -35669 -68611 -32869 988 151152 144693 87706 183896 183079 200561
27091B00561p7815k78161m9205J48171K4748J1002p7974n3237r526L1567R5277
$$ 200561 122746 -155415 -204620 -56449 -31701 -20699 -98673 -151910 -161436 -129869 -34592
27080c4592N5515j048o946l6817M061m1018m0817m6224P5256J435j49827O7621
$$ -34592 20923 19875 12929 -23888 -19827 -60845 -101662 -147886 -72630 -71195 -221022 -153401
27068a53401k5322k9200j2162M6301K2922N8614K2597P0514N5598m2359j2581
$$ -153401 -178723 -207923 -220085 -173784 -150862 -92248 -69651 863 56461 14102 1521
27057A521n5059m9032o2280m7722l5517L1942L8905N7782J56431K3859Q629l8938
$$ 1521 -53538 -102570 -164850 -212572 -248089 -216147 -177242 -119460 36971 60830 69459 30521
27045C0521j30429k4524k4214J0139K613j2188K3644M3384J812K9020O8202R7022
$$ 30521 -99908 -124432 -148646 -138507 -135894 -148082 -124438 -81054 -79242 -50222 17980 115002
27033A15002m0258K0741J1212J20474M3444j33707j14986p4731J43745l6618J4956
$$ 115002 74744 95485 106697 227171 270615 136908 21922 -52809 90936 54318 69274
27022F9274j3714M9905K2128j25261J0331J05846j49623o3240M2549P5793O8606
$$ 69274 55560 105465 127593 2332 12663 118509 -31114 -94354 -51805 23988 92594
27011I2594J19368k934L932j28615j48788j01915M0227R7921j0541r528L1967
$$ 92594 211962 209028 212960 84345 -64443 -166358 -126131 -28210 -38751 -48279 -16312
27000a6312O3447M0079K129M2420o8014l4153q86j30808l8227O2786Q4290L4616
$$ -16312 47135 87214 89343 131763 63749 29596 28710 -102098 -140325 -77539 6751 41367
26988D1367P2924J5921m7676m1705m290l6546k1716J1636j0039m3840K7449q9754
$$ 41367 114291 130212 82536 40831 36541 -5 -21721 -10085 -20124 -63964 -36515 -126269
26976a26269k0817J26255M8449r7984m4703J05734N2886O0405O7432J9196j44163
$$ -126269 -147086 -20831 27618 -70366 -115069 -9335 43551 103956 171388 190584 46421
26965D6421p3300m5129K6978J4785l7947L2027J56182N8776R4999m4685j21056
$$ 46421 -26879 -72008 -45030 -30245 -68192 -36165 120017 178793 273792 229107 108051
26954A08051k8819R5319J3076n8950K5406l0063o951J4902O643L8217k3230P0568
$$ 108051 79232 174551 187627 128677 154083 124020 117069 131971 138614 176831 153601 224169
26942B24169N731j04033l1202m3727K8709P4862j07777j95786p3417Q8982K3117
$$ 224169 229900 125867 94665 50938 79647 154509 46732 -149054 -222471 -133489 -110372
26931a10372J9545P2759n7162m9219r2285J1197O3668P7263M6504m761L1404J3231
$$ -110372 -90827 -18068 -75230 -124449 -216734 -205537 -141869 -64606 -18102 -22863 8541 21772
26919B1772q4100n4008J4007L3831P4754k9745j38186J9456q0069J28908J70608
$$ 21772 -62328 -116336 -102329 -68498 6256 -23489 -161675 -142219 -222288 -93380 77228
26908G7228p6515q2265p4745K4902P9972r127N8727L4220o2075m1177p0219q0204
$$ 77228 713 -81552 -156297 -131395 -51423 -60550 -1823 32397 -29678 -70855 -141074 -221278
26896b21278P2351M9981J20090l3812m4613n8275N9683K6491L6519r3652L4218
$$ -221278 -148927 -98946 21144 -12668 -57281 -115556 -55873 -29382 7137 -86515 -52297
26885e2297j00873j8883M115K4730J31495P731k408l3544P837J4392M649l4810
$$ -52297 -153170 -172053 -167938 -143208 -11713 -3982 -6390 -39934 -32097 -17705 -13056 -47866
26873d7866l0267l4462J37181O5839j01804J05105M634L9489P6235p1771l3246
$$ -47866 -78133 -112595 24586 90425 -11379 93726 98360 137849 214084 142313 109067
26862A09067O3039m2373j27765p6395J0110J5354m5083q3093K7550J17160P3372
$$ 109067 172106 129733 1968 -74427 -64317 -48963 -94046 -177139 -149589 -32429 40943
26851D0943m9647Q274J0897O3232M1226k7939l7692j22493j33005M3858J17666
$$ 40943 -8704 -430 10467 73699 114925 86986 49294 -73199 -206204 -162346 -44680
26840d4680K9020j15614K211K4426m6355J8754L6964m2063N8516l1484j6227m464
$$ -44680 -15660 -131274 -129063 -104637 -150992 -132238 -95274 -137337 -78821 -110305 -126532 -130996
26828a30996P7447P238k6376o7810m8910L5512j7626n4862J06311J90242l8216
$$ -130996 -53549 -46311 -72687 -140497 -189407 -153895 -171521 -226383 -120072 70170 31954
26817C1954r7995J7829l4239R013j27361Q2257K04546J00344p5338j94616l7506
$$ 31954 -66041 -48212 -82451 -73438 -200799 -118542 86004 186348 111010 -83606 -121112
26806a21112K8584K6066j13291m8983K3011J5710O8136Q4050J00524m8800m6762
$$ -121112 -92528 -66462 -179753 -228736 -205725 -190015 -121879 -37829 62695 13895 -32867
26795c2867M0451M9189l8935o9596P2654m1357m7121n6244q5931k1547M31K8073
$$ -32867 7584 56773 17838 -51758 20896 -20461 -67582 -123826 -209757 -231304 -230873 -202800
26783b02800Q0071q869l104N6461P1864k3976L9515L4202p4304o4980J01575q7588
$$ -202800 -122729 -131598 -134702 -78241 -6377 -30353 9162 43364 -30940 -95920 5655 -81933
26771h1933j66466p7604l104J49675K24309R4290N3567l6728o7762K9426N7556
$$ -81933 -248399 -326003 -329107 -179432 44877 139167 192734 156006 88244 117670 175226
26760A75226j27332r9386m5800n2776R0943J31961J05575r8565q2797J0801J09717
$$ 175226 47894 -51492 -97292 -150068 -59125 72836 178411 79846 -2951 7850 117567
26749A17567j6956p9697Q2486M7480p5026q3911K4522L1465k5989J09190n4935
$$ 117567 100611 20914 103400 150880 75854 -8057 16465 47930 21941 131131 76196
26738G6196j6817m7003j03143k7878R0568P385R635M6219p7603p7884P4636J3241
$$ 76196 59379 12376 -90767 -118645 -28077 -20692 -11057 35162 -42441 -120325 -45689 -32448
26726c2448l4611P201J00809L5189n4657j886o813j29473m6787J56037l1214J1725
$$ -32448 -67059 -59858 40951 76140 21483 19597 12784 -116689 -163476 -7439 -38653 -26928
26714b6928J49L2450r8517J21431L035k2365q2735K3673R3924K14349j04046o5340
$$ -26928 -26779 5671 -92846 28585 31620 9255 -73480 -49807 44117 258466 154420 89080
26702H9080l3444k2494L5968J5992q5512q7948J7049n4238L0939J039l8946M7414
$$ 89080 55636 33142 69110 85102 -410 -88358 -71309 -125547 -94608 -93569 -132515 -85101
26690h5101J67321K9364j11600m0041l067q8083k8472L1713K5731O208P7963m5620
$$ -85101 82220 111584 -16 -40057 -43124 -131207 -159679 -127966 -102235 -96027 -18064 -63684
26678f3684q1985N839K9557j2564R0920K32269j12570r4241l9195l5265L3507
$$ -63684 -145669 -139830 -110273 -122837 -31917 200352 87782 -6459 -45654 -80919 -47412
26667d7412m3330j1163r586k4049L9985J14440L5371Q588l6666q6556J20478O1940
$$ -47412 -90742 -101905 -111491 -135540 -95555 18885 54256 62844 26178 -60378 60100 122040
26655A22040L6351M0899l1265p1934J5912j3810j40045q9882M2092N4444m5324
$$ 122040 158391 199290 168025 96091 112003 98193 -41852 -131734 -89642 -35198 -80522
26644h0522O1959L9414L4668j04014J28273J7338L0439R8293k8483l3655r4807
$$ -80522 -18563 20851 55519 -48495 79778 97116 127555 225848 197365 163710 68903
26633F8903p8889L6535J03944o589J301R7054O2265j34317j03761j11401J17615
$$ 68903 -9986 26549 130493 123904 125205 222259 284524 150207 46446 -64955 52660
26622E2660l4132K4523q998k7667r29j80459O7710J1998r612K7569O1119L2093
$$ 52660 18528 43051 34053 6386 5457 -175002 -107292 -95294 -104906 -77337 -16218 15875
26610A5875o0570R1502R0226j04997n4148K4362j749J6747J06185o069m2544j03679
$$ 15875 -44695 46807 137033 32036 -22112 2250 501 17248 123433 117364 74820 -28859
26598b8859m3882k1581K0853j0896N4543L3990r3398l8608R0693J40747L7701
$$ -28859 -72741 -94322 -73469 -84365 -29822 4168 -89230 -127838 -37145 103602 141303
26587A41303o644L5671M1568m8440n0268j16081l5765j56897k8036P4262O5804
$$ 141303 134659 170330 211898 163458 113190 -2891 -38656 -195553 -223589 -149327 -83523
26576h3523Q8085j05518m8492N0108J00774J02225R160l956j26767k2994l8812
$$ -83523 4562 -100956 -149448 -99340 1434 103659 112819 108863 -17904 -40898 -79710
26565g9710L1416J4026R5347J12442l3212n8535q5377j09966K9141O7458n983
$$ -79710 -48294 -34268 61079 173521 140309 81774 -3603 -113569 -84428 -16970 -22953
26554b2953K2957p2044J5454P2319P0290N1006j0546J3284p5765m3482J4820L4523
$$ -22953 4 -72040 -56586 15733 86023 137029 126483 139767 64002 20520 35340 69863
26542F9863Q3592N6094M0964j07029q4336k2466J22083j09932K2016J02069J163
$$ 69863 153455 209549 250513 143484 59148 36682 158765 48833 70849 172918 174081
26531A74081q6608J475n7567K52o9780q8096k6438l8530R5128J43238j06310n9463
$$ 174081 87473 88948 31381 31633 -38147 -126243 -152681 -191211 -96083 47155 -59155 -118618
26519a18618J49535J3685j60146N90M8105P9837r695r9701L261K8304J7925q6205
$$ -118618 30917 44602 -115544 -114954 -66849 12988 3293 -96408 -93147 -64843 -46918 -133123
26507a33123o4310R4982J28697M9371l1407m8027L4117M112m6312K1601R6180
$$ -133123 -197433 -102451 26246 75617 44210 -3817 30300 34412 -11900 9701 105881
26496A05881o2937j55775Q1584J68869O365N6362K8902q2931n0148K967o1523
$$ 105881 42944 -112831 -31247 137622 143987 200349 229251 146320 96172 99139 37616
26485C7616j4283j01466O0752K4077l2385K320Q5913j9304q7117r2350l5926J1934
$$ 37616 23333 -78133 -17381 6696 -25689 -23369 62544 43240 -43877 -136227 -172153 -160219
26473a60219Q3987J16307r5132m861O3527J0417o1572n0477K00685N5818M744
$$ -160219 -76232 40075 -55057 -59918 3609 14026 -47546 -98023 102662 158480 163224
26462A63224k556r2996j54901q537P7400L2206k25253q9064K3135J05540J35151
$$ 163224 160668 67672 -87229 -95766 -18366 13840 -211413 -300477 -277342 -171802 -36651
26451c6651J32256J4856L9606j0806p1561J4882m5514o0743L6819J52093k2733
$$ -36651 95605 110461 150067 139261 67700 82582 37068 -23675 13144 165237 142504
26440A42504r1380k5258r3280J01323R1402j61706O004J53241J03261j521o9887
$$ 142504 51124 25866 -67414 33909 125311 -36395 -30391 122850 226111 224590 154703
26429A54703o3284p5646Q968M6328Q1945K7636n7618J6390J9461L6941K6661n2374
$$ 154703 91419 15773 24741 71069 153014 180650 123032 139422 158883 195824 222485 170111
26417A70111n1368j9207N5334r0602j67315J26230J2697r5187Q6692k5317m2650
$$ 170111 118743 99536 154870 64268 -103047 23183 35880 -59307 27385 2068 -40582
26406d0582M2768J4819L6218O8049J11435q1686l1180J7681j01514j57154N3315
$$ -40582 2186 17005 53223 121272 232707 151021 119841 137522 36008 -121146 -67831
26395f7831N0427J4994q3013l7936P8371N1994k8628N6829J19000k9077j17630
$$ -67831 -17404 -2410 -85423 -123359 -44988 7006 -21622 35207 154207 125130 7500
26384G500m339M3752j46445L2982N9710j37444k2394J00334P3974R8065J1752
$$ 7500 3161 46913 -99532 -66550 -6840 -144284 -166678 -66344 7630 105695 117447
26373A17447r1939q0527J6982n9555o2876J18994O2756J9238J4437J4J48042L0951
$$ 117447 25508 -55019 -38037 -97592 -160468 -41474 21282 40520 54957 54971 203013 233964
26361B33964m8996l7467j906m5132r0347q0799j5228j146M6797O803Q0708J28743
$$ 233964 184968 147501 145595 100463 10116 -70683 -85911 -87057 -40260 -33457 47251 175994
26349A75994k9443O1839J05503p1810j6255q9020j47002J8455P8849m6192n0332
$$ 175994 146551 208390 313893 242083 225828 136808 -10194 8261 87110 40918 -9414
26338i414q2942M920N8765L7959J5013J9793q7224M7677J08117P5574O7485j06124
$$ -9414 -92356 -87436 -28671 9288 24301 44094 -43130 4547 112664 188238 255723 149599
26326A49599k18174j01404o7005R948k4831J55668J447J0194l947k1052L3918
$$ 149599 -68575 -169979 -236984 -227036 -251867 -96199 -94752 -84558 -88505 -109557 -75639
26315g5639j36294o0184K4931J27403Q4093m4202R1367O6842O4368j00534r6232
$$ -75639 -211933 -272117 -247186 -119783 -35690 -79892 11475 78317 142685 42151 -54081
26304e4081n5722J43778J30074J9835M6783n9693j64934m0887K9577M1256o7990
$$ -54081 -109803 33975 164049 183884 230667 170974 6040 -34847 -5270 35986 -32004
26293c2004J03880J43984O2334p8922j21152n6141j0787p3011j198N8170M666
$$ -32004 71876 215860 278194 199272 78120 21979 11192 -61819 -63017 -4847 -181
26282a81Q9871j2232p6648n8391K7128l3892J08822Q5020K6144k5664P5402Q403
$$ -181 89690 77458 810 -57581 -30453 -64345 44477 129497 155641 129977 205379 213782
26270B13782j4530J5033n4106r12m3497j7262p3472L6477L1994j00172q2234m4196
$$ 213782 199252 214285 160179 159267 115770 98508 25036 61513 93507 -6665 -88899 -133095
26258a33095m0261N8322j2315j01138o5236n2398M3161l060O8437Q4829Q9373
$$ -133095 -173356 -115034 -127349 -228487 -293723 -346121 -302960 -306020 -237583 -152754 -63381
26247f3381J16872l9108j93959j1091J67403J26617Q3255N9009K8740j41213o9689
$$ -63381 53491 14383 -179576 -190667 -23264 103353 186608 245617 274357 133144 63455
26236F3455J38193r102j11540j0976J20026O2258n657n7446q57n9940o1590J4465
$$ 63455 201648 192546 81006 70030 190056 252314 246657 189211 188354 128414 66824 81289
26224H1289P8169j92455o4770L7553J2693k7984K5417L2982m7930M2227p0351
$$ 81289 159458 -32997 -97767 -60214 -47521 -75505 -50088 -17106 -65036 -22809 -93160
26213i3160q99O9776P6490J827P425K8460J8283M0200L5725j94387Q4928O6615
$$ -93160 -94059 -24283 52207 54034 61459 89919 108202 148402 184127 -10260 74668 141283
26201A41283q3249l8057J41246M6181j60996n0683m7598j7472K5722o2926J55153
$$ 141283 58034 19977 161223 207404 46408 -4275 -51873 -69345 -43623 -106549 48604
26190D8604O3686j24901m0879Q8106k7501J4637m8135j05580m1897P4257O0773
$$ 48604 112290 -12611 -53490 34616 7115 21752 -26383 -131963 -173860 -99603 -38830
26179c8830j01748N3728l4393L8650M9453O8876P1447K4326r9614j92567n9558
$$ -38830 -140578 -86850 -121243 -82593 -33140 35736 107183 131509 31895 -160672 -220230
26168b20230O9107O1216J73026M3783j51476L6723O9241j16665k9398j07J24130
$$ -220230 -151123 -89907 83119 126902 -24574 12149 81390 -35275 -64673 -64780 59350
26157E9350j20410r5923Q0205m5416K2835J25008Q651K1099n937m7462k8788r8119
$$ 59350 -61060 -156983 -76778 -122194 -99359 25649 34300 55399 49462 2000 -26788 -124907
26145a24907J51453Q8537n122q5323l5393L9371N3270l3675j36354j29534J682
$$ -124907 26546 115083 109961 24638 -10755 28616 81886 48211 -88143 -217677 -215995
26134b15995J17127P6131r854R6098M6924j16314l2662L8052O3036O5116j7179
$$ -215995 -98868 -22737 -32591 63507 110431 -5883 -38545 -493 62543 127659 110480
26123A10480l9349j6829K6945k6554l5850k24970r556O3382p1641R1446J04114
$$ 110480 71131 54302 81247 54693 18843 -206127 -215683 -152301 -223942 -132496 -28382
26112b8382j1481l8345M6563j6495N0220j0429K4403L5834j02157n7451O9703
$$ -28382 -39863 -78208 -31645 -48140 2080 -8349 16054 51888 -50269 -107720 -38017
26101c8017L4627L1530o7302j56651p8750M9238Q9242J9824K7717J15442J65786
$$ -38017 -3390 28140 -39162 -195813 -274563 -225325 -136083 -116259 -88542 26900 192686
26090A92686p9789j34983R9769j3181r6845j21182K0182K0398R866N1955l4856
$$ 192686 112897 -22086 77683 64502 -32343 -153525 -133343 -112945 -103079 -51124 -85980
26079h5980K8022k5127j3722L0841k2947J9016L3042P9295P8476K4186n6075k05626
$$ -85980 -57958 -83085 -96807 -65966 -88913 -69897 -36855 42440 120916 145102 89027 -116599
26067a16599M1616Q4525L3917O2584M6013K2436o5445l0628k5679q6384q4860
$$ -116599 -74983 9542 43459 106043 152056 174492 109047 78419 52740 -33644 -118504
26056a18504J1267P0157j1741J00537J3942j07044j02780q9290N6351P0453M6555
$$ -118504 -107237 -37080 -48821 51716 65658 -41386 -144166 -233456 -177105 -106652 -60097
26045f0097Q3637L8739L2278n0653J1095M4777j38641k697k8460q771K2762O8807
$$ -60097 23540 62279 94557 43904 54999 99776 -38865 -41562 -70022 -78793 -56031 12776
26033A2776J19092N6987J7120q0572p1810j73593j38545P8851K3378o4709P1781
$$ 12776 131868 188855 205975 125403 53593 -120000 -258545 -179694 -156316 -221025 -149244
26022a49244J42885Q1345L7782L0260l9853l0304N9646k3202m4622r9110p8872
$$ -149244 -6359 74986 112768 143028 103175 72871 132517 109315 64693 -34417 -113289
26011a13289J07502M8163M4484J2647k842j3638j45897o1375k1128j04210J39184
$$ -113289 -5787 42376 86860 99507 96665 83027 -62870 -124245 -145373 -249583 -110399
26000a10399L9524P2438N1184J42600P489l7880r5848J17282m6037p8187l6721
$$ -110399 -70875 1563 52747 195347 202836 164956 69108 186390 140353 62166 25445
25989B5445L3444P9705m4207r3016K3245j4471J6790J2776j08518r7823Q5330
$$ 25445 58889 138594 94387 1371 24616 10145 26935 39711 -68807 -166630 -81300
25978h1300J8775l9448q0535j19537r6311L1865K9533P0192R2509J08153J2983
$$ -81300 -62525 -101973 -182508 -302045 -398356 -366491 -336958 -266766 -174257 -66104 -53121
25967e3121j23746N7046J58361M5161k8636R264J6617l3153M1612m9626m9524
$$ -53121 -176867 -119821 38540 83701 55065 64329 80946 47793 89405 39779 -9745
25956i745j6267O3414J02179q0058L7462P5433j971j71570j09251J0143n579J05676
$$ -9745 -26012 37402 139581 59523 96985 172418 170447 -1123 -110374 -100231 -105810 -134
25944a34J4487j48540n1181L7452O6245J57942J8686r125q2202M6855j908q42
$$ -134 14353 -134187 -185368 -147916 -81671 76271 94957 85832 3630 50485 48577 47735
25932D7735J4554l7181m4212p8120o0018J5257R8585J3907j8971J06516J2588
$$ 47735 62289 25108 -19104 -97224 -157242 -141985 -43400 -29493 -48464 58052 70640
25921G0640n4253M0584K2866n0962l2762O6148L3404N3201m5339M158p3408n7188
$$ 70640 16387 56971 79837 28875 -3887 62261 95665 148866 103527 107685 34277 -22911
25909b2911M9961J42086M039k4433n8489j7910J3870J2163L768o0832j36400k7631
$$ -22911 27050 169136 173175 148742 90253 72343 86213 98376 102144 41312 -95088 -122719
25897a22719J15524Q1771k4403J2549q297l521J00351J8045p6402j77791j72099
$$ -122719 -7195 74576 50173 62722 54425 50904 151255 169300 92898 -84893 -256992
25886b56992Q1497R1985n2079l391k2356K7178j2112N0644R2820l9628m1293r1357
$$ -256992 -175495 -83510 -135589 -138980 -161336 -134158 -146270 -95626 -2806 -42434 -83727 -175084
25874a75084j24321O0603J28481Q346q259R5270J98818Q6106q0517k5077r2184
$$ -175084 -299405 -238802 -110321 -101975 -110234 -14964 183854 269960 189443 164366 72182
25863G2182j21505M6495J2412m6224M9037P9051j54387o543k7745j9374J14677
$$ 72182 -49323 -2828 9584 -36640 12397 91448 -62939 -69482 -97227 -116601 -1924
25852a924J00947Q1425m5068j23656k6599n4528k5399O6977P8132K0766j07042
$$ -1924 99023 180448 135380 11724 -14875 -69403 -94802 -27825 50307 71073 -35969
25841c5969O2029j1429j21589p4127R9583O2801Q7612J14261r5201q7458n5065
$$ -35969 26060 14631 -106958 -181085 -81502 -18701 68911 183172 87971 513 -54552
25830e4552n1222K459N6607o873J1512k5858M4924J2100J8868M3412Q3002j1383
$$ -54552 -105774 -103315 -46708 -53581 -42069 -67927 -23003 -10903 7965 51377 134379 122996
25818A22996o533r5916q1400m9421R815l5516K9387N0942l1779l9832M2235L0305
$$ 122996 116463 20547 -60853 -110274 -100459 -135975 -106588 -55646 -87425 -127257 -85022 -54717
25806e4717Q2416J18868q3182k1770l6715j5636j27652k7965J1523J9192L0971
$$ -54717 27699 146567 63385 41615 4900 -10736 -138388 -166353 -154830 -135638 -104667
25795a04667P6866J1826o5123m4254Q9793J75751O8499n3894j65693j4361J11651
$$ -104667 -27801 -15975 -81098 -125352 -35559 140192 208691 154797 -10896 -25257 86394
25784H6394j89q0031Q1619N5653j5307j39387M7511K897l069k7916O7138j42943
$$ 86394 86205 6174 87793 143446 128139 -11248 36263 39160 36091 8175 75313 -67630
25772f7630l6463R2309K7121L5508r985n2581J9281o6025q7906k9847N4417M2872
$$ -67630 -104093 -11784 15337 50845 40860 -11721 7560 -58465 -146371 -176218 -121801 -78929
25760g8929p4337M6895M7173m5037P4733J20911O731p4346j1238Q2383N9433k7599
$$ -78929 -153266 -106371 -59198 -104235 -29502 91409 98140 23794 12556 94939 154372 126773
25748A26773m4971J1113j8155j03408r8056p4005O0306l42M1690R1297J60297
$$ 126773 81802 92915 74760 -28648 -126704 -200709 -140403 -140745 -99055 -7758 152539
25737A52539r9006q3280P5267K9006j7992r1486n1745j1418M0773K8146L8007
$$ 152539 53533 -29747 45520 74526 56534 -34952 -86697 -98115 -57342 -29196 8811
25726H811O9416O8296n8789O5387j57274r3696J13994P7092k0527n7052K5446
$$ 8811 78227 146523 87734 153121 -4153 -97849 16145 93237 72710 15658 41104
25715D1104Q0566j13545L0712p5616o0792k3875l3698q8054L1520Q0442P3444
$$ 41104 121670 8125 38837 -36779 -97571 -121446 -155144 -243198 -211678 -131236 -57792
25704e7792N8120L7384m8213l2028j6290K0623K9994k5722n4292p9552k4678J3346
$$ -57792 328 37712 -10501 -42529 -58819 -38196 -8202 -33924 -88216 -167768 -192446 -179100
25692a79100J99490J02790o9214L9221O9897N9367j01164O2538Q1895m9071j7930
$$ -179100 20390 123180 53966 93187 163084 222451 121287 183825 265720 216649 198719
25681A98719o8470q8676r1579J3503R3674M4751m5542O18m0233M2015N0203n7537
$$ 198719 130249 41573 -50006 -36503 57171 101922 56380 56998 16765 58780 108983 51446
25669E1446k1023M6320j40759j32100J23006P1794L7191O3388L1719L0066j22048
$$ 51446 30423 76743 -64016 -196116 -73110 -1316 35875 99263 130982 161048 39000
25658C9000m9584q550K1136k3185j0477k4227r6708j8017P848J7745M0491Q7678
$$ 39000 -10584 -19134 2002 -21183 -31660 -55887 -152595 -170612 -162764 -145019 -104528 -16850
25646a6850K4978p4782J642J43637l3319R1201J15184r7529L7975m1202q7265
$$ -16850 8128 -66654 -65012 78625 45306 136507 251691 154162 192137 150935 63670
25635F3670p847j8821n804L940L1389j11058j60474k3642J33221N0869M4702O8270
$$ 63670 55823 37002 31198 35138 66527 -44531 -205005 -228647 -95426 -44557 145 68415
25623F8415k6307N3587j8353n0016j8350j14296m0730K3339J02256J30921q1363
$$ 68415 42108 95695 77342 27326 8976 -105320 -146050 -122711 -20455 110466 29103
25612B9103J4334m4479n4417L973q6681R3996Q9310l7661N7651M946j26908K5558
$$ 29103 43437 -1042 -55459 -51486 -138167 -44171 45139 7478 65129 70075 -56833 -31275
25600c1275R4608j22300L8539J5753L0088r0946L5864j367p8539m1785J04445
$$ -31275 63333 -58967 -20428 -4675 25413 -65533 -29669 -31036 -109575 -151360 -46915
25589d6915K792P699M1667j7477m8440l0020k2854m8022l2280N9634j8725K8661
$$ -46915 -44123 -36424 5243 -12234 -60674 -90694 -113548 -161570 -193850 -134216 -152941 -124280
25577a24280P7647n2033M0871L8114P7730K7471j4592j18268k4732N3652q7118
$$ -124280 -46633 -98666 -57795 -19681 58049 85520 70928 -47340 -72072 -18420 -105538
25566a05538q1218J07493l0101M2858L9606j10088J31483J10852L6743k113l5185
$$ -105538 -186756 -79263 -109364 -66506 -26900 -136988 -5505 105347 142090 139977 104792
25555A04792k3890n3408L4799O2729J97k8015m7641p6281r8540M723M4790k3119
$$ 104792 80902 27494 62293 125022 125219 97204 49563 -26718 -125258 -120535 -75745 -98864
25543i8864m5820m3969R6441J2825p047K7386r493J23645M772p0900j36337p5187
$$ -98864 -144684 -188653 -92212 -79387 -86434 -59048 -68541 55104 59876 -11024 -147361 -222548
25531b22548j4281p516P1501P8690M3106Q0532Q307J1983P2876r6483J515Q0296
$$ -222548 -236829 -244345 -172844 -94154 -51048 29484 37791 49774 122650 26167 27682 107978
25519A07978M4399N7858N3385o7615o230k0369N41J883m5067m9516Q80k8929M1275
$$ 107978 152377 210235 263620 196005 189775 169406 169947 171830 126763 77247 78127 49198 90473
25506I0473N3708n0290R065l228o090p3094L3034k3640M608K6123j01238o1313
$$ 90473 144181 93891 102956 99728 93638 20544 53578 29938 34546 60669 -40569 -101882
25494a01882K6155J59520m0382L1378M132j9083j56831L068K5370M9400m9999
$$ -101882 -75727 83793 43411 74789 78921 59838 -96993 -93925 -68555 -19155 -69154
25483f9154o6209p2726p99J13197M6938j1485j2966O6126k5567J9578J3394k5212
$$ -69154 -135363 -208089 -208888 -95691 -48753 -60238 -73204 -7078 -32645 -13067 327 -24885
25471b4885J2018J44958M4948l3107j86698k2881J8292j12285J3997P3605J02140
$$ -24885 -12867 132091 177039 143932 -42766 -65647 -47355 -159640 -145643 -72038 30102
25460C0102j07280K9495O9011O32j01680j40282j105J27954K4923k3872o1143
$$ 30102 -77178 -47683 21328 21960 -79720 -220002 -221107 -93153 -68230 -92102 -153245
25449a53245N835K3120O4399J2459M4737J34902M6517j4743n964r2990q8155N598
$$ -153245 -147410 -124290 -59891 -47432 -2695 132207 178724 163981 158017 65027 -23128 -17530
25437a7530l9061j536Q3520P3514J02168M0575j985p1206l5688j6178L3265r4844
$$ -17530 -56591 -58127 25393 98907 201075 241650 239665 168459 132771 116593 149858 55014
25425E5014L3299k9975J16042q3394j66122j00270m5058M2010J88465R2962K1156
$$ 55014 88313 58338 174380 90986 -75136 -175406 -220464 -178454 10011 102973 124129
25414A24129m0568J4736N4745q276j47058o7983k5574l9653M9011P5419j1641
$$ 124129 83561 98297 153042 144766 -2292 -70275 -95849 -135502 -86491 -11072 -22713
25403b2713j3525Q827J8766K7834R5053o4161m2423L3549K872j0693R0910L2518
$$ -22713 -36238 -27411 -8645 19189 114242 50081 7658 41207 44079 33386 124296 156814
25391A56814J9368K0938M3709p1608j40047p1541K3400j2807K2716N0538Q9323
$$ 156814 176182 197120 240829 169221 29174 -42367 -18967 -31774 -9058 41480 130803
25380A30803K9715j24942r9924o0169j0680Q6424N5017K8024p9232p5873J63366
$$ 130803 160518 35576 -64348 -124517 -135197 -48773 6244 34268 -44964 -120837 42529
25369D2529J22310O5189o7395l0119L83j33182K1875J7944l1362l0751j09625
$$ 42529 164839 230028 162633 132514 132897 -285 21590 39534 8172 -22579 -132204
25358a32204K6782Q0128J42749M1211n54N1652O4067m994m7641q5108l3219l7297
$$ -132204 -105422 -25294 117455 158666 158112 209764 273831 268837 221196 136088 102869 65572
25346F5572o8533k934P1347m492o16q1947m6346O1717l8296l5628O6552N7961
$$ 65572 -2961 -5895 65452 60960 60344 -21603 -67949 -6232 -44528 -80156 -13604 44357
25334D4357J1977k4635p1081M4954j8038L9502k3649n461J05209K4854M8748m6215
$$ 44357 56334 31699 -39382 5572 -12466 27036 3387 -2074 103135 127989 176737 130522
25322A30522j53929l8590Q2402p4435j40576j06436K4597k0829k7653J22750J74269
$$ 130522 -23407 -61997 20405 -54030 -194606 -301042 -276445 -297274 -324927 -202177 -27908
25311b7908L3147M2906k4643k09854j32898P028J73362J00209j8144J0169j19281
$$ -27908 5239 48145 23502 -186352 -319250 -312222 -138860 -38651 -56795 -46626 -165907
25300a65907k7325K5302p6109K06867J75986K1058m6815k4559q8643j83707J1564
$$ -165907 -193232 -167930 -244039 -37172 138814 159872 113057 88498 -145 -183852 -172288
25289a72288R0097O7317j20884j39393L9873J86367K7641j05868M9787O6473r6730
$$ -172288 -82191 -14874 -135758 -275151 -235278 -48911 -21270 -127138 -77351 -10878 -107608
25278a07608N9733M3004n7774J5847j6486m5698l1699q9754l4214K5467J8177
$$ -107608 -47875 -4871 -62645 -46798 -63284 -108982 -140681 -230435 -264649 -239182 -221005
25267b21005M8275J38340N1013o7668O5729K2007J04469N0367o7048n4394j49697
$$ -221005 -172730 -34390 16623 -51045 14684 36691 141160 191527 124479 70085 -79612
25256g9612n9870r211P1784J17849M763j06292j6253k6591J16482j00405q253
$$ -79612 -139482 -148693 -76909 40940 45703 -60589 -76842 -103433 13049 -87356 -95609
25245i5609K7902l4838o1050j02483K9304P3047k4312P7419Q1047K2970k0572
$$ -95609 -67707 -102545 -163595 -266078 -236774 -163727 -188039 -110620 -29573 -6603 -27175
25234b7175L4229P588J7876O5844n7590l265J06588p507J8066N4747m1660j1607
$$ -27175 7054 14642 32518 98362 40772 37507 144095 136588 154654 209401 167741 156134
25222A56134q1175M052O4933N8460l8298j50150n6396J6598J9702J0483m5322
$$ 156134 74959 79011 143944 202404 164106 13956 -42440 -25842 -6140 4343 -40979
25211d0979L982N3703o2457k2379M5511N4099o9199J3627O0410j55289O5340P0740
$$ -40979 -36997 16706 -45751 -68130 -22619 31480 -37719 -24092 36318 -118971 -53631 17109
25199A7109R0792m7539j23525o6838R4236O7473J5409l633L0569P5551o4755l0779
$$ 17109 107901 60362 -63163 -130001 -35765 31708 47117 43484 74053 149604 84849 54070
25187E4070q2691j25786p6357m7013L8234J0798j4838K9181R3358J61823K8634
$$ 54070 -28621 -154407 -230764 -277777 -239543 -228745 -243583 -214402 -121044 40779 69413
25176F9413L8o299m2843m0185M5468n5070n1863J02207L5435Q139J714m6169O9060
$$ 69413 69451 63152 20309 -19876 25592 -29478 -81341 20866 56301 64440 66154 19985 89045
25163H9045M4027m7391k2766O8584q9599j55677j4703P1404N2151j0975M267J3960
$$ 89045 133072 85681 62915 131499 41900 -113777 -128480 -57076 -4925 -15900 -11633 2327
25151B327Q0710K3435Q8258o2875q4998m4179j14090Q5560j3545N4166J12583
$$ 2327 83037 106472 194730 131855 46857 2678 -111412 -25852 -39397 14769 127352
25140A27352l6915m3310r2583m8347m414l7104O3975P9231o0570m2125J29972
$$ 127352 90437 47127 -45456 -93803 -98217 -135321 -71346 7885 -52685 -94810 35162
25129C5162O7146k12156J22432Q0888j55068j4861K7377K8564J7499N6992n1424
$$ 35162 102308 -109848 12584 93472 -61596 -76457 -49080 -20516 -3017 53975 2551
25118B551m1611K3208J24554k6891N6043o1556j53635r0082J15191J42263l467
$$ 2551 -39060 -15852 108702 81811 137854 76298 -77337 -167419 -52228 90035 86568
25107H6568j01802k13168j11448Q3402O258M497J21797k805k1369N9108o1739
$$ 86568 -15234 -228402 -339850 -256448 -250190 -245693 -123896 -126701 -148070 -88962 -150701
25096a50701k3431J24772N5640N2437r9413J1610J44656m5309j2276j16153k9570
$$ -150701 -174132 -49360 6280 58717 -40696 -29086 115570 70261 57985 -58168 -87738
25085h7738j625p782J12749O4574m2012J46254J03159m5280j10183l4856m436
$$ -87738 -89363 -97145 15604 80178 38166 184420 287579 242299 132116 97260 92824
25074I2824o182L0609P0466P9182j02790o5351N8579P0521n019m8841n1405n4646
$$ 92824 86642 117251 187717 266899 164109 98758 157337 227858 222839 173998 122593 67947
25062F7947O2749Q3555p972n7978j84584N0311j2141K3297j3459r0540m599L1860
$$ 67947 130696 214251 206279 148301 -36283 14028 1887 25184 11725 -78815 -83414 -51554
25050e1554L2242j40348p1380j7994P4813J12755J1552O6N1512l113o9403L5021
$$ -51554 -19312 -159660 -231040 -249034 -174221 -61466 -49914 -49848 1664 -1449 -70852 -35831
25038c5831n895M1171J15321P3140j8528n9175P7586o2059r9407k1140j30043
$$ -35831 -41726 -555 114766 187906 169378 110203 187789 125730 26323 5183 -124860
25027a24860l1539O6790M4781j2406M095M1232l4415N6748M2846k4500N8259l3582
$$ -124860 -156399 -89609 -44828 -57234 -53139 -11907 -46322 10426 53272 28772 87031 53449
25015E3449J9925J0374J942j13144N5733L1522n9925p0044j4812r5744j9734j6503
$$ 53449 73374 83748 85690 -27454 28279 59801 -124 -70168 -84980 -180724 -200458 -216961
25003b16961N342O0604O1167O6959Q8243M5153o1503j27790r4664q8294J11765
$$ -216961 -211619 -151015 -89848 -22889 65354 110507 49004 -78786 -173450 -261744 -149979
24992a49979J34733M3685j4750J06559r2880j97337j4898j1105j8278j8378R874
$$ -149979 -15246 28439 13689 120248 27368 -169969 -184867 -195972 -214250 -232628 -222754
24981b22754J58203n7011n2310J5046o0522J04951n871J27665n571r158Q4693
$$ -222754 -64551 -121562 -173872 -158826 -219348 -114397 -120268 7397 1826 -7332 77361
24970G7361o7489o9061J18615R5563J215j08082p856j4501n2594m1858p0079k1003
$$ 77361 9872 -59189 59426 154989 156204 48122 40266 25765 -26829 -68687 -138766 -159769
24958a59769l6464J8788M2371l1904N0699K2120J47170Q8741J03565L1862j70891
$$ -159769 -196233 -177445 -135074 -166978 -116279 -94159 53011 141752 245317 277179 106288
24947A06288k03552j48667Q3147M3094J1438Q3263k5406k5865k0650j249J40558
$$ 106288 -97264 -245931 -162784 -119690 -108252 -24989 -50395 -76260 -96910 -98159 42399
24936D2399q0081j19851P7585J05219j04167k105Q8549L8655r8720N0037k031
$$ 42399 -37682 -157533 -79948 25271 -78896 -81001 7548 46203 -52517 -2480 -4511
24925d511p0649r228J68852K7940o420r0977r5783q616M8790O2423o6573M1123
$$ -4511 -75160 -84388 84464 112404 105984 15007 -80776 -89392 -40602 21821 -44752 -3629
24913c629J5248l9799P633n7270p9017j0692R1731K105R0901m6531q0335k7577
$$ -3629 11619 -28180 -20547 -77817 -156834 -167526 -75795 -73690 17211 -29320 -109655 -137232
24901a37232J4100J5274Q7495J53005N3414O347q6137K4489K7812j01443k4595
$$ -137232 -123132 -107858 -20363 132642 186056 192403 106266 130755 158567 57124 32529
24890C2529P7850r7802j62365n2896M0082O209O2048l7889Q899M5129N0779P4761
$$ 32529 110379 12577 -149788 -202684 -162602 -156393 -94345 -132234 -123335 -78206 -27427 47334
24878D7334j9200m2512R776O8216N5649m5921j09565K6602r759J10796J6856K3252
$$ 47334 28134 -14378 -4602 63614 119263 73342 -36223 -9621 -19380 91416 108272 131524
24866A31524n6418r8567p96J06325N5874L1861l3849o7459p9117j00716m677J04138
$$ 131524 75106 -23461 -24257 82068 137942 169803 135954 68495 -10622 -111338 -116015 -11877
24854a1877M6759K5727P0603o003M0111k3308L0688j2330q9179l8415p6971K2078
$$ -11877 34882 60609 131212 125209 165320 142012 172700 160370 71191 32776 -44195 -22117
24842b2117M2203J4260o7993l9955M8402R2378q998q066p9113r7194P5443J05687
$$ -22117 20086 34346 -33647 -73602 -25200 67178 58180 50114 -28999 -126193 -50750 54937
24830E4937j18968j00333R0172N1928k5558L3323J12488K63n4867R7445K8987
$$ 54937 -64031 -164364 -74192 -22264 -47822 -14499 97989 98252 43385 140830 169817
24819A69817n7955q7703k1386l2541Q7207J45177O2716j6527j19697j05557N6446
$$ 169817 111862 24159 2773 -29768 57439 202616 265332 248805 129108 23551 79997
24808G9997M1327N5231q8653q4973L62j8113r6075j41098K1820J25980L0609L724
$$ 79997 121324 176555 87902 2929 3291 -14822 -110897 -251995 -230175 -104195 -73586 -69862
24796f9862Q9823J06775o0986j62579p4350J44477K5491M1803L5786m5862Q3668
$$ -69862 19961 126736 65750 -96829 -171179 -26702 -1211 40592 76378 30516 114184
24785A14184n6944j30596p0909P3751J39602M5869j13811k6693m1319K3399o8228
$$ 114184 57240 -73356 -144265 -70514 69088 114957 1146 -25547 -66866 -43467 -111695
24774a11695k015J5586j23133N3472N4693J46586M4632p0784J5879m7818j844
$$ -111695 -113710 -98124 -221257 -167785 -113092 33494 78126 7342 23221 -24597 -26441
24763b6441J9825j19997q0486q5019Q0567J42894O6274r1971L6031J37283Q7351
$$ -26441 -6616 -126613 -207099 -292118 -211551 -68657 -2383 -94354 -58323 78960 166311
24752A66311L3136k1751j67947j43953L580J12011P697K0412M5160m2933m8381
$$ 166311 199447 177696 9749 -134204 -130624 -18613 -10916 9496 54656 11723 -36658
24741c6658J8538m9365p2304N4053K8196o4168l6920K0418K486m1464j4712J37438
$$ -36658 -18120 -67485 -139789 -85736 -57540 -121708 -158628 -138210 -135724 -177188 -191900 -54462
24729e4462Q5635j4818O8911K6681m2902j232m2802j66909M778L0354M4824k0311
$$ -54462 31173 16355 85266 111947 69045 67813 25011 -141898 -137120 -106766 -61942 -82253
24717h2253p1569M271M366K6848j0536J4641J8242k5607Q0952N9274j6423L4948
$$ -82253 -153822 -149551 -145185 -118337 -128873 -114232 -95990 -121597 -40645 18629 2206 37154
24705C7154m9106K3225L1104M870p2059O1006N6387j10627j17256l1538J69430
$$ 37154 -11952 11273 42377 47247 -24812 36194 92581 -18046 -135302 -166840 2590
24694B590N3010l9019j2223K9666l3434N5672r325j9401Q697j11818Q699J1372
$$ 2590 55600 16581 4358 34024 590 56262 46937 27536 36233 -75585 -66886 -55514
24682e5514K3334J27771J00402q7451j17804o1421R2879O7588N525j25504J1748
$$ -55514 -32180 95591 195993 108542 -9262 -70683 22196 89784 95309 -30195 -18447
24671a8447l423r5060R0692j3520l0143Q5550P955n2979j3210N6603j7708K8996
$$ -18447 -21870 -116930 -26238 -39758 -69901 15649 23604 -29375 -42585 14018 -3690 25306
24659B5306k2291J01428Q1909o143P1731m101q8075l0506j03942o6049N9639K1818
$$ 25306 3015 104443 186352 180209 251940 247839 159764 129258 25316 -40733 18906 40724
24647D0724J01890P4303o6084j22954o0049j48815J2032J39590m0020M6857M1975
$$ 40724 142614 216917 150833 27879 -32170 -180985 -168953 -29363 -69383 -22526 19449
24636A9449k1653J41907P8534O9272o5130n6657j14021j30780P6517P0150l9965
$$ 19449 -2204 139703 218237 287509 222379 165722 51701 -79079 -2562 67588 27623
24625B7623m1932l7980o212p8934l9254Q1786j5862J81056Q5791K4807k3273K3370
$$ 27623 -14309 -52289 -58501 -137435 -176689 -94903 -110765 70291 156082 180889 157616 180986
24613A80986L0292L8133L7783j6097j32300j1991n7938r9622q6233L6365M0139
$$ 180986 211278 249411 287194 271097 138797 126806 68868 -30754 -116987 -80622 -40483
24602d0483K2545k6956k646j1071k54359q5562K71291J60147J67287p3309j00884
$$ -40483 -17938 -44894 -47540 -58611 -312970 -398532 -127241 32906 200193 126884 26000
24591B6000j35134J44154Q2285J0474M5256o0304p8631j00820k1780m9265m4455
$$ 26000 -109134 35020 117305 127779 173035 112731 34100 -66720 -88500 -137765 -182220
24580a82220J55335Q1016N9112q5712n8172j4741j3349j04501K0776q2488J47010
$$ -182220 -26885 54131 113243 27531 -30641 -45382 -58731 -163232 -142456 -224944 -77934
24569g7934j0855p4893k5159n7355o4296Q2330o0887J20087J03884m6991o7132
$$ -77934 -88789 -163682 -188841 -246196 -310492 -228162 -289049 -168962 -65078 -112069 -179201
24558a79201k4663M6850k4496J04928J28526q4701p2880n8259l0191Q4909M7399
$$ -179201 -203864 -157014 -181510 -76582 51944 -32757 -105637 -163896 -194087 -109178 -61779
24547f1779M2699M6050Q9405m1944r1531J6216M2490q4102p4060M2469Q5537k532
$$ -61779 -19080 26970 116375 74431 -17100 -884 41606 -42496 -116556 -74087 11450 8918
24535H918L0229M4545K9350o9043l0704N8281O2268K60j05306j04437J3037l4332
$$ 8918 39147 83692 113042 43999 13295 71576 133844 134104 28798 -75639 -62602 -96934
24523i6934j07881k7306J67557R0990j7090o2790K3379M4958J05657R517j8456
$$ -96934 -204815 -232121 -64564 26426 9336 -53454 -30075 14883 120540 130057 111601
24512A11601p5233p7137j14071J26396Q2869j9333J4200P6599j37329j12034R1366
$$ 111601 36368 -40769 -154840 -28444 54425 35092 49292 125891 -11438 -123472 -32106
24501c2106J02693O1319J9877p0523k9778n8107l9329J34151j913N0458l521j5609
$$ -32106 70587 131906 151783 81260 51482 -6625 -45954 88197 86284 136742 133221 117612
24489A17612n9873p6144M148J34187k7990L6978R2687P1759k0079q6795j20200
$$ 117612 57739 -18405 -14257 119930 91940 128918 221605 293364 273285 186490 66290
24478F6290J4169p5078r5164r836O6204N6319J26758n9422j23060J9468J7351
$$ 66290 80459 5381 -89783 -99619 -33415 22904 149662 90240 -32820 -13352 3999
24467C999l3983k0322L1381r90q9469j35444L0781L2213m738J25691J08213N4509
$$ 3999 -29984 -50306 -18925 -19915 -109384 -244828 -214047 -181834 -186572 -60881 47332 101841
24455A01841k6388m9122p5635J0309Q4047L2984m9071j11427o2776O7387P9270
$$ 101841 75453 26331 -49304 -38995 45052 78036 28965 -82462 -145238 -77851 1419
24444A419O4746n3157m361l3095k0700l8436j17055j4478K2445Q4444J1542M2542
$$ 1419 66165 13008 8647 -24448 -45148 -83584 -200639 -215117 -192672 -108228 -96686 -54144
24432e4144k5748m0908M4967J8761K4512k2418N3068J3055k533R0217N1688J8344
$$ -54144 -79892 -120800 -75833 -57072 -32560 -54978 -1910 11145 8612 98829 150517 168861
24420A68861j24683n2882m975N3705j7511K6327o830j08084n3860l8222K1731
$$ 168861 44178 -8704 -13679 40026 22515 48842 42012 -66072 -119932 -158154 -136423
24409a36423n7842n3111J44916R902j3083N5777m6277p4090p0481q1463K0288
$$ -136423 -194265 -247376 -102460 -92558 -105641 -49864 -96141 -170231 -240712 -322175 -301887
24398c01887K32680J24902j45892J0510P8475q420o9793n452J7356J0228l1499
$$ -301887 -69207 55695 -90197 -79687 -1212 -9632 -79425 -84877 -67521 -57293 -88792
24387h8792r3485j43910O3043J07567J56656l0022P8922L8539j61417P1405J09110
$$ -88792 -182277 -326187 -263144 -155577 1079 -28943 49979 88518 -72899 -1494 107616
24376A07616j2579J15152J5326l4385m9318J6557K0463p4787p443N480Q301p7409
$$ 107616 95037 210189 225515 191130 141812 158369 178832 104045 96602 102082 110383 32974
24364C2974j07345K0813J70318j7697j14987O0775K1954j21486j06679m162M2889
$$ 32974 -74371 -53558 116760 99063 -15924 44851 66805 -54681 -161360 -165522 -122633
24353a22633k841O073k7883O217J28694J63040j461L1365M815j49753j45106o4016
$$ -122633 -125474 -119401 -147284 -141067 -12373 150667 149206 180571 185386 35633 -109473 -173489
24341a73489M7712L947L3119j3262o2997N2437L6837L7431o8705j0533r0048P6998
$$ -173489 -125777 -121830 -88711 -101973 -164970 -112533 -75696 -38265 -106970 -117503 -207551 -130553
24329a30553J44679M8550L339M0321N7794o4473K1621K9629j07125j65957O7604
$$ -130553 14126 62676 66015 106336 164130 99657 121278 150907 43782 -122175 -54571
24318e4571O4095k9882m1934R210K1459o5599j07440M6676K3587j9651k407J42349
$$ -54571 9524 -20358 -62292 -53082 -31623 -97222 -204662 -157986 -134399 -154050 -156457 -14108
24306a4108J9212k9756j08171l8259K9049J14221J4964m4763J66670J00432q4843
$$ -14108 5104 -24652 -132823 -171082 -142033 -27812 -12848 -57611 109059 209491 124648
24295A24648o9268L5369j30453j00495J5174j20018L9090n22l4910O8152Q6508
$$ 124648 55380 90749 -39704 -140199 -125025 -245043 -205953 -206475 -241385 -173233 -86725
24284h6725j78306r0617R6481Q5970P8143L319L2518N2939J53936O7076j35038
$$ -86725 -265031 -355648 -259167 -173197 -95054 -91735 -59217 -6278 147658 214734 79696
24273G9696r8892r4589p029N1785Q8583n697K7376L5633q9911m8002K8517j02193
$$ 79696 -19196 -113785 -120814 -69029 19554 13857 41233 76866 -13045 -61047 -32530 -134723
24261a34723M6466J17895m7699q5398N3763n9725K7989k5901r122P6411J16596
$$ -134723 -88257 29638 -18061 -103459 -49696 -109421 -81432 -107333 -116455 -40044 76552
24250G6552l2013l349j2376J8797J8217N8229O4286j22411j0110L4621M5807J69342
$$ 76552 44539 41190 28814 47611 65828 124057 188343 65932 55822 90443 136250 305592
24238C05592N2171j07950m5927j26762o3894j21546j16408J07030R3891Q0437
$$ 305592 357763 249813 203886 77124 13230 -108316 -224724 -117694 -23803 56634
24228E6634j0161j5031p5415n7462L5487N8137R2856m9861m5939K8116N7233M3932
$$ 56634 46473 31442 -43973 -101435 -65948 -7811 85045 35184 -10755 17361 74594 118526
24216A18526M8313m3979k2439k7180o7052o0036m8098p9563j2289J00763O7573
$$ 118526 166839 122860 100421 73241 6189 -53847 -101945 -181508 -193797 -93034 -25461
24205b5461l4994j22350J6050K6099r251L1029J48768J28628l6197l1697o1528
$$ -25461 -60455 -182805 -166755 -140656 -149907 -118878 29890 158518 122321 90624 29096
24194B9096j7522n6815L6122o4597J06m3010J11834O66o2850K3916p7727O029
$$ 29096 11574 -45241 -9119 -73716 -73610 -116620 -4786 -4120 -66970 -43054 -120781 -114752
24182a14752M8370Q6906k1276n2096L5323k3599n376M2623O0542N402j09023r9597
$$ -114752 -66382 20524 -752 -52848 -17525 -41124 -46500 -3877 56665 62067 -46956 -146553
24170a46553P8397P2721j32385o5168J23231j8329L8240J9322k1208L4604J7853
$$ -146553 -68156 4565 -127820 -192988 -69757 -88086 -49846 -30524 -51732 -17128 725
24159G25J7479j27648j79673j6227M6425O4849N4792R869P5110k3228l289P8437
$$ 725 18204 -109444 -289117 -305344 -258919 -194070 -139278 -129409 -54299 -77527 -80816 -2379
24147b379L4045j10905J13854N9675m2289r864o8031p362Q6291L2955l5287M998
$$ -2379 31666 -79239 34615 94290 52001 42137 -25894 -33256 53035 85990 50703 55701
24135E5701K6818j22361j9546K6767l0442P425L4086J4584O0417O7712L0236p6776
$$ 55701 82519 -39842 -59388 -32621 -63063 -55638 -21552 -6968 53449 121161 151397 74621
24123G4621q513m1166k2434N2738P4303J4304K5372j11459p2496O9031k8697k2080
$$ 74621 66108 24942 2508 55246 129549 143853 169225 57766 -14730 54301 25604 3524
24111C524j5498k6825j0972n667n2098r6420l7338O3359J57737J74414K3399j47468
$$ 3524 -11974 -38799 -49771 -55438 -107536 -203956 -241294 -177935 -20198 154216 177615 30147
24099C0147k29973p5402J32675J72617j4429o6125j8242R0222l6903n2806k9320
$$ 30147 -199826 -275228 -142553 30064 15635 -50490 -68732 21490 -15413 -68219 -97539
24088i7539k6062J44054N3921j0507q2872K295n6156j9061n7105K4852M9265M9307
$$ -97539 -123601 20453 74374 63867 -19005 -16710 -72866 -91927 -149032 -124180 -74915 -25608
24076b5608J4211m9134l8970O6852M7672Q11L5180J4324m7937k7702p3461p3731
$$ -25608 -11397 -60531 -99501 -32649 15023 15834 51014 65338 17401 -10301 -83762 -157493
24064a57493Q7187L3550J2562J0498P5038l4280M6451Q4012k3148q8999L706Q5737
$$ -157493 -70306 -36756 -24194 -13696 61342 27062 73513 157525 134377 45378 49084 134821
24052A34821k4525J9849K10854N2638j13201j56369l6077K578m419O082l2906
$$ 134821 110296 130145 340999 393637 280436 124067 87990 90568 86149 92231 59325
24041E9325J2059M5338K3031M4621n9780j36955k774N8997O3814N966q5521k8764
$$ 59325 71384 116722 139753 184374 124594 -12361 -15135 43862 107676 113642 28121 -643
24029f43M9126N7865p790L0811Q4184j5916j50614m0135M399M9856r844n834k1970
$$ -643 48483 106348 98558 129369 213553 197637 47023 6888 11287 61143 51299 45465 23495
24016B3495m666J2816j74790j4715K4758N7693J76162m783k0124j22693Q289K1386
$$ 23495 18829 31645 -143145 -157860 -133102 -75409 100753 95970 75846 -46847 -38558 -17172
24004a7172K6010j21612p7267k909R5074J28612k3367J393J0012r4151M1372R0141
$$ -17172 8838 -112774 -190041 -192950 -97876 30736 7369 8762 18774 -75377 -34005 56136
23992E6136M3201o0097j60973J07901R5242k6269j381M6999K2007K8391j9381
$$ 56136 99337 39240 -121733 -13832 81410 55141 53760 100759 122766 151157 131776
23981A31776p5840o3168j27969J0053J47296K1312O3206J1224j09340M2715r6909
$$ 131776 55936 -7232 -135201 -125148 22148 43460 106666 117890 8550 51265 -45644
23970d5644k7613l7234L4602O8733P30p9405j13576P8743J14190J13393J2491
$$ -45644 -73257 -110491 -75889 -7156 -6426 -85831 -199407 -120664 -6474 106919 119410
23959A19410j18434j1262J59590R0984p9430j2365O2359O583p5909q8150j55922
$$ 119410 976 -10286 149304 240288 160858 148493 210852 217435 141526 53376 -102546
23948a02546O0364M0057m4735R3977N6072j76059m0594J34591k9432p0445L2357
$$ -102546 -42182 -2125 -46860 47117 103189 -72870 -113464 21127 -8305 -78750 -46393
23937d6393L6044L8124J1643L3307m451r0762n0705J44372O014l7452j34558O2867
$$ -46393 -10349 27775 39418 72725 68274 -22488 -73193 71179 77193 39741 -94817 -31950
23925c1950J7289j24461K4009R4696J39899L8896j60795N3450N7471J1954j27701
$$ -31950 -14661 -139122 -115113 -20417 119482 158378 -2417 51033 108504 120458 -7243
23914g243p2908m4366r6812k14454J68237J14048K0787J03490R4812j98586J7368
$$ -7243 -80151 -124517 -221329 -435783 -267546 -153498 -132711 -29221 65591 -132995 -115627
23903a15627J28059R2987j6042k850n2098r0531l0280n7718o6226O5775J10570
$$ -115627 12432 105419 89377 86527 34429 -56102 -86382 -144100 -210326 -144551 -33981
23892c3981P8682PL6834K6414j40923k5021J40259M493k398n3038p2696k4909
$$ -33981 44701 44708 81542 107956 -32967 -57988 82271 86764 84366 31328 -41368 -66277
23880f6277l9237p2716q6059l3186J29934P5010p475K2995P2776J009J11287m4120
$$ -66277 -105514 -178230 -264289 -297475 -167541 -92531 -100006 -77011 -4235 -3226 108061 63941
23868F3941N7968K942l7960M4026l1569p2463n4273j5696M6935N979o9809M5217
$$ 63941 121909 124851 86891 130917 99348 26885 -27388 -43084 3851 9830 -59979 -14762
23856a4762J39239O2673j01586r1432J1588m1170o137K4056M1005L400R3560N0318
$$ -14762 124477 187150 85564 -5868 5720 -35450 -41587 -17531 23474 26874 120434 170752
23844A70752r1542k3810l3232l9777K3519N7855J355J7653l6700m5624L9702P4735
$$ 170752 79210 55400 22168 -17609 5910 63765 65120 82773 46073 449 40151 114886
23832A14886k8461j37893L3823K6478j17411m1429M1893l3918n4935n3475P2854
$$ 114886 86425 -51468 -17645 8833 -108578 -150007 -108114 -142032 -196967 -250442 -177588
23821a77588J83135l2829q6281N024K909L3715J3779J5123P6250M6106o9184m3025
$$ -177588 5547 -27282 -113563 -108539 -105630 -71915 -58136 -43013 33237 79343 10159 -32866
23809c2866l566J06575q3912p4039j4391P8243k2431j36081j16938Q2238j7367
$$ -32866 -36432 70143 -13769 -87808 -102199 -23956 -46387 -182468 -299406 -217168 -234535
23798b34535K9833L9664J77171J11782j26595o0960m631M3260Q8211J05018n772
$$ -234535 -204702 -165038 12133 123915 -2680 -63640 -68271 -25011 63200 168218 162446
23787A62446j9440J8349j8894p8069o2731l334O6514k3447n3076p4380N7702n800
$$ 162446 143006 161355 142461 64392 1661 -1673 64841 41394 -11682 -86062 -28360 -34160
23775c4160p4830J6331m2315J63359J19079l4787l6742L7069o7818n9541J21551
$$ -34160 -108990 -92659 -134974 28385 147464 112677 75935 113004 45186 -14355 107196
23764A07196K5873k64589o7611L5077P0354K0043k7131J7552J12943P7117M102
$$ 107196 133069 -131520 -199131 -164054 -93700 -73657 -100788 -83236 29707 106824 110926
23753A10926J7405o775k379o0481j40882J30299R3594k24989l4344J11545j4600
$$ 110926 128331 121556 119177 58696 -82186 48113 141707 -83282 -117626 -6081 -20681
23742b0681j39575k6749K0232P8087K8423m0256j18806N6202J46679J00192l3124
$$ -20681 -160256 -187005 -166773 -88686 -60263 -100519 -219325 -163123 -16444 83748 50624
23731E0624j25082q2038L2628J26813J39779l2877j47949j78575O8193R6811J4560
$$ 50624 -74458 -156496 -123868 2945 142724 109847 -38102 -216677 -148484 -51673 -37113
23720c7113J1315N4588L4259M2330j32436M4360Q3506j784l9125n6272n5865l9614
$$ -37113 -25798 28790 63049 105379 -27057 17303 100809 99025 59900 3628 -52237 -91851
23708i1851j45753o6446R459N9936R3097Q4852j2421l3772l7095O3087R7471J6498
$$ -91851 -237604 -304050 -294591 -234655 -141558 -56706 -69127 -102899 -139994 -76907 20564 37062
23696C7062L8802r8046j35006P2619M9187l2691J02997L9517o7587l6795j7594
$$ 37062 75864 -22182 -157188 -84569 -35382 -68073 34924 74441 6854 -29941 -47535
23685d7535K9685n2461K1275r506L2615J01337k142q4222k4253N7940m1323n647
$$ -47535 -17850 -70311 -49036 -58542 -25927 75410 73268 -10954 -35207 22733 -18590 -24237
23673b4237k9518k7397L1270J4047N3024M524M1346J477j26875r6728o4460Q4319
$$ -24237 -53755 -81152 -49882 -35835 17189 21713 63059 64536 -62339 -159067 -223527 -139208
23661a39208Q0671l1063m8904Q8309r370l9954Q9519J01558j8786r3113P2351
$$ -139208 -58537 -89600 -138504 -50195 -59565 -99519 -10000 91558 72772 -20341 52010
23650E2010j9556j60104K2069L1618n4780q1278O3766J75929O7578M1502p1464
$$ 52010 32454 -127650 -105581 -73963 -128743 -210021 -146255 29674 97252 138754 67290
23639F7290n4482p6138q6495j75982N1185l0525J6878J48963J32649o2668O9959
$$ 67290 12808 -63330 -149825 -325807 -274622 -305147 -288269 -139306 -6657 -69325 634
23628F34L6298q1097q206M0075j00601j18156K5074O3900J6452J59475K9148r3608
$$ 634 36932 -44165 -52371 -12296 -112897 -231053 -205979 -142079 -125627 33848 62996 -30612
23616c0612l7086k9707l4245p4031R758K9169K3081J09884J16158K1627K6770
$$ -30612 -67698 -97405 -131650 -205681 -195923 -166754 -143673 -33789 82369 103996 130766
23605A30766l6892n877j11863q8770N7462J462N485k6644J03124n2939K5008l4203
$$ 130766 93874 87997 -23866 -112636 -55174 -53712 -48227 -74871 28253 -24686 322 -33881
23593c3881m5343Q2337R0060K447k0569m1567k5892R139l4458R212R524m8748
$$ -33881 -79224 3113 93173 95620 75051 33484 7592 16731 -17727 -8515 1009 -47739
23581d7739K9654J51592j17841o7627Q1159N3277l2507L288j9053j31563O3150
$$ -47739 -18085 133507 15666 -51961 29198 82475 49968 53256 34203 -97360 -34210
23570c4210J12187O5658K1000R5260k3504j3755J02580m1263l4382r3546j07398
$$ -34210 77977 143635 164635 259895 236391 222636 325216 283953 249571 156025 48627
23559D8627P5828L1848m2535K1748j34205P271M8216j46196p6677l0947J6658
$$ 48627 124455 156303 113768 135516 1311 8582 56798 -89398 -166075 -197022 -180364
23548a80364J13190N3532R1230N9442l0796n2412L8606K7883o6198j02063r409
$$ -180364 -67174 -13642 77588 137030 106234 53822 92428 120311 54113 -47950 -57359
23537e7359l1523L3232J4328k122N9121q7382j378m1643n9313l098M4682N1430
$$ -57359 -88882 -55650 -41322 -43444 15677 -71705 -73083 -114726 -174039 -177137 -132455 -81025
23525h1025o0835r6927m4095j5496R7318P5868K1517P5439j2737M6129J15634
$$ -81025 -141860 -238787 -282882 -298378 -201060 -125192 -103675 -28236 -40973 5156 120790
23514A20790O199j32594n3319p6466l6628O3519m8512n5761J6189O1842R4568
$$ 120790 126989 -5605 -58924 -135390 -172018 -108499 -157011 -212772 -196583 -134741 -40173
23503d0173J27693O112K0859O982m6574O3688l0611j42981k9868R2584N8640j09139
$$ -40173 87520 93632 114491 121473 74899 138587 107976 -35005 -64873 27711 86351 -22788
23491b2788K5472J26546p7609m8089K4794k6952M4459J207j23234n5498k380r575
$$ -22788 2684 129230 51621 3532 28326 1374 45833 47040 -76194 -131692 -134072 -143647
23479a43647N5021q1822O8477p4387Q041k3756O8654P6663J5652M9030J27323
$$ -143647 -88626 -170448 -101971 -176358 -168317 -192073 -123419 -46756 -31104 17926 145249
23468A45249j0651q5427O2198K7952l3003M6766O8659n992j25687j24613R50j1841
$$ 145249 134598 49171 111369 139321 106318 153084 221743 215751 90064 -34549 -33599 -45440
23456d5440J860m6202P9022J7795J03534r2344j25867J4596K3907J54715L5495
$$ -45440 -43580 -89782 -10760 7035 110569 18225 -107642 -93046 -69139 85576 121071
23445A21071r7387K9592N9826q6571L9395j3831q8328j15174R3927M9413P2579
$$ 121071 23684 53276 113102 26531 65926 52095 -36233 -151407 -57480 -8067 64512
23434F4512O197j20485l9219l1127J08840P53o5866L8292k0285J4659K0530K8340
$$ 64512 70709 -49776 -88995 -120122 -11282 -10529 -76395 -38103 -58388 -43729 -23199 5141
23422E141N398l9111m019L801Q121K7633J33559o4368j09519j67199N3445Q3636
$$ 5141 10539 -28572 -32591 -28790 -20669 6964 140523 76155 -33364 -200563 -147118 -63482
23410f3482K4400J66550k8668J20377Q3178k26532L5080J8765j36223n1722J70801
$$ -63482 -39082 127468 98800 219177 302355 75823 110903 129668 -6555 -58277 112524
23399A12524Q8725l4851n7640n0058k0246n059K662L3241k3530N0620L3102l1650
$$ 112524 201249 166398 108758 58700 38454 33395 36057 69298 45768 96388 129490 97840
23387I7840j65965J3467J41739p4303N8985n7009m2479Q822n7582O1154O2742
$$ 97840 -68125 -54658 87081 12778 71763 14754 -27725 -18903 -76485 -15331 47411
23376D7411r1543p1767L2938r1826m4562M9534J20906l9451p4850L573n7866M1406
$$ 47411 -44132 -115899 -82961 -174787 -219349 -169815 -48909 -88360 -163210 -159637 -217503 -176097
23364a76097P8583L0761J16712K3599j11684n5677k4267N0087R4411J13724j1787
$$ -176097 -97514 -66753 49959 73558 -38126 -93803 -118070 -67983 26428 140152 128365
23353A28365o8792K829J8941Q759j26199n5499j3035P1062P3335N8331N6016p8236
$$ 128365 59573 62402 81343 90102 -36097 -91596 -104631 -33569 39766 98097 154113 75877
23341G5877j0876J3256q1923q3427m0188L7188R8660l3274M4787j4930J08940
$$ 75877 65001 78257 -3666 -87093 -127281 -90093 8567 -24707 20080 5150 114090
23330A14090J24355n6803n220N0599r6768j33606J8974J22182l4806p7960R6548
$$ 114090 238445 181642 176422 227021 130253 -3353 15621 137803 102997 25037 121585
23319A21585J10918l2260m3794r7378o0136L209P4298m1921j10770j4450k1793
$$ 121585 232503 200243 156449 59071 -1065 2144 76442 34521 -76249 -90699 -112492
23308a12492N6941M6704l5564o5944N7189k1600M4754L6754L4227q3908J0297
$$ -112492 -55551 -8847 -44411 -110355 -53166 -74766 -30012 6742 40969 -42939 -32642
23297c2642P3745J126n4163m4440O9124N6186O5938r1318j9817N9571N7187J49641
$$ -32642 41103 42229 -11934 -56374 12750 68936 134874 43556 23739 83310 140497 290138
23285B90138q7744j81692m4737R354m7062j818o7582P2897R9900M9401n583O8793
$$ 290138 202394 20702 -24035 -14681 -61743 -63561 -131143 -58246 41654 91055 85472 154265
23273A54265M1370n9768j61941r1110J30970k2282l3041R625n9254O6691j6038
$$ 154265 195635 135867 -26074 -117184 13786 -8496 -41537 -31912 -91166 -24475 -40513
23262d0513o0785K1292O205P2684O1413l1308q5103J1879r386k5393Q5957J61388
$$ -40513 -101298 -80006 -73801 -1117 60296 28988 -56115 -44236 -53622 -79015 6942 168330
23250A68330J0683j79759k9077m096N7146k7233K3860p6349k2738K544R1544q552
$$ 168330 179013 -746 -29823 -33919 23227 -4006 19854 -56495 -79233 -76689 14855 6303
23238F303P068J4865q8368l1170J8778J43674l24j5695Q9765J7072j31507m0845
$$ 6303 13371 28236 -60132 -91302 -72524 71150 70826 55131 144896 161968 30461 -10384
23226a0384K9654j2144p0465r6121p3829L7419J40924j2166J6702N0913M661m1661
$$ -10384 19270 7126 -63339 -159460 -233289 -195870 -54946 -67112 -50410 503 5164 -36497
23214c6497q1676m7248M0558J29304J29189n0042P746r9828j14690n5988O6123
$$ -36497 -118173 -165421 -124863 4441 133630 83588 91334 -8494 -123184 -179172 -113049
23203a13049P9855M6462J7782N7877k9722q3219j35114o7166J42144J47767O5869
$$ -113049 -33194 13268 31050 88927 59205 -24014 -159128 -226294 -84150 63617 129486
23192A29486K159j00857J11554J50555o6847j30518J4014o838o5246p2108m6712
$$ 129486 131645 30788 142342 292897 226050 95532 109546 102708 37462 -34646 -81358
23181h1358J47468J32986K5065p3312j25362J0254J26236J39806m2793r6994N6038
$$ -81358 66110 199096 224161 150849 25487 35741 161977 301783 258990 161996 218034
23170B18034M1758K0347p9914M331j11389K3740K4060k5640p870L4598J90645
$$ 218034 259792 280139 200225 204556 93167 116907 140967 115327 107457 142055 332700
23159C32700J34866J25412J40964J76787L39745L07491K31489O9039k9737j68384
$$ 332700 467566 592978 733942 910729 1250474 1557965 1789454 1858493 1828756 1660372
23149A660372k31722k65114k83161k66319j35505L0560l2754p9692j44056O647
$$ 1660372 1428650 1163536 880375 614056 478551 509111 476357 396665 252609 259256
23139B59256K2464j13906o6645n138j2569J448M5356n9042l0279R3606k2635K7117
$$ 259256 281720 167814 101169 96031 83462 84910 130266 71224 40945 134551 111916 139033
23127A39033J27179k2429o0366N3548k3721o9005m8797p5770N8779J192q410j08148
$$ 139033 266212 243783 183417 236965 213244 144239 95442 19672 78451 79643 71233 -36915
23115c6915O3937L8458M9563r2697j04036m1830p7552J22095J43071o5031j18413
$$ -36915 27022 65480 115043 22346 -81690 -123520 -201072 -78977 64094 -937 -119350
23104a19350m1924R6273J0217J6797l5653l7894j193J20485J84138l99o934K7511
$$ -119350 -161274 -65001 -54784 -37987 -73640 -111534 -112727 7758 191896 191497 184563 212074
23092B12074r5826j20637m3879J2464l8449M7872J37154O3184o861J1229j7559
$$ 212074 116248 -4389 -48268 -35804 -74253 -26381 110773 173957 167096 178325 160766
23081A60766j6189o5218o0064j01262R5686R8690K3487J9943J06035n9402r1542
$$ 160766 144577 79359 19295 -81967 13719 112409 135896 155839 261874 202472 110930
23070A10930L1033J01108M2701K2700j5427L2692j53941j77714k0577P9226Q2889
$$ 110930 141963 243071 285772 308472 293045 325737 171796 -5918 -26495 52731 135620
23059A35620m9601o1688P8413J45608j656l4674m2718l6786k5429M2542p3981
$$ 135620 86019 24331 102744 248352 246696 212022 169304 132518 107089 149631 75650
23048G5650k3265J4673L1562J13820l0140k6074k9705l5559J09940P4792q8795
$$ 75650 52385 67058 98620 212440 182300 156226 126521 90962 200902 275694 186899
23037A86899j22577k7018J02087k4623j25256P1042P5339R3368o0489m7832J1902
$$ 186899 64322 37304 139391 114768 -10488 60554 135893 229261 168772 120940 132842
23026A32842l0026j47380L6584J09180o4433q327M0260m4925q100P4401o8358
$$ 132842 102816 -44564 -7980 101200 36767 28440 68700 23775 15675 90076 21718
23015B1718n2017m4238O7851M1620o8255j5415J61271K2254m0376j21136r0685
$$ 21718 -30299 -74537 -6686 34934 -33321 -48736 112535 134789 94413 -26723 -117408
23004a17408P9863Q1464J307J11396J11934p7958p1527L9015q0427j26560P379
$$ -117408 -37545 43919 45226 156622 268556 190598 119071 158086 77659 -48901 -41522
22993d1522J10794L2799K2656J2137q6041N4023k222j64138n1571q326J05752
$$ -41522 69272 102071 124727 136864 50823 104846 102624 -61514 -113085 -121411 -15659
22982a5659k0178m0216l1531q455o4924N4686J41613L2582O2666j2686q6605n0856
$$ -15659 -35837 -76053 -107584 -116039 -180963 -126277 15336 47918 110584 97898 11293 -39563
22970c9563J81m2771J767J40417O1854L5932j26825k7787J6972K2436q0706R7583
$$ -39563 -39382 -82153 -80386 60031 121885 157817 30992 3205 20177 42613 -38093 59490
22958E9490P4623r6127o7212O4536O2413o4233j965p7227n4752J250J7521k1950
$$ 59490 134113 37986 -29226 35310 97723 33490 31525 -45702 -100454 -99204 -81683 -103633
22946a03633N9954R1754J16790j9326p8807j37738n4505k4810O1091R4732R340
$$ -103633 -43679 48075 164865 145539 66732 -71006 -125511 -150321 -89230 5502 14842
22935A4842N1327J12858k9042j9033l2390j046n5735n0606p0570k2917J18516
$$ 14842 66169 179027 149985 130952 98562 97516 41781 -8825 -79395 -102312 16204
22924A6204J54032m128n1929r2030o4959l1478m6482J34753M645l188p5825L895
$$ 16204 170236 166108 114179 22149 -42810 -74288 -120770 13983 18628 15440 -60385 -56490
22912e6490N3375j5751J7667j8832p1427k9615P6396k0368J5095K6982L4671q585
$$ -56490 -3115 -18866 -1199 -20031 -91458 -121073 -44677 -65045 -49950 -22968 11703 3118
22900C118K847j5919j01388K9314L070p1643L498J4689J20533Q5518q5070K3376
$$ 3118 5965 -9954 -111342 -82028 -78958 -150601 -147103 -132414 -11881 73637 -11433 11943
22888A1943l5819m6198l8474l142L9995l8104O3324R290j2863N0120J3303J20113
$$ 11943 -23876 -70074 -108548 -111690 -71695 -109799 -46475 -37185 -50048 72 13375 133488
22876A33488Q3570j18569n7233l2264O5123N5314j64004j05779q2379J60024K13981
$$ 133488 217058 98489 41256 8992 74115 129429 -34575 -140354 -222733 -62709 151272
22865A51272m8718j50124j1739J90580J03592P4959N5349L1381n8182j23730K3957
$$ 151272 102554 -47570 -59309 131271 234863 309822 365171 396552 338370 214640 238597
22854B38597O6441k8425j4941N8537j643K2676o113l2714j12998o3070N5535L1703
$$ 238597 305038 276613 261672 320209 318566 341242 335129 302415 189417 126347 181882 213585
22842B13585j87170j36268K6963k3931K3995J28159j3473r0421K9517J61123J79862
$$ 213585 26415 -109853 -82890 -106821 -82826 45333 31860 -58561 -29044 132079 311941
22831C11941Q0590q216j10278q9034j21286m1644P3892o6291K3728n4394J8073
$$ 311941 392531 384315 274037 185003 63717 22073 95965 29674 53402 -992 17081
22820A7081N221N604J10270l3724k4939m746o039k3598j8493j7059k3685o978
$$ 17081 22302 27906 138176 104452 79513 74767 68728 45130 26637 9578 -14107 -21085
22808b1085P7077O5415O4123k425m5748M7921L7728K3771O3362k4021J2348p198
$$ -21085 55992 121407 185530 183105 137357 185278 223006 246777 310139 286118 298466 291268
22796B91268l0730p3222j00086o9914J765o2143j22776q2545N1557K83047K01152
$$ 291268 260538 187316 87230 17316 19081 -43062 -165838 -248383 -196826 86221 287373
22785B87373l3500q3060k8731j9856o2499j9891m9666L2857n099q7128J18104
$$ 287373 253873 170813 142082 122226 59727 39836 -9830 23027 17928 -69200 48904
22774D8904R9646q6291k728J9000J8099k824m238J5577N0778o6282j27268l0717
$$ 48904 148550 62259 59531 78531 96630 93806 89568 105145 155923 89641 -37627 -68344
22762f8344J07497K9351k1513J8098J9337J314J05742P9069j99377j1529Q9248
$$ -68344 39153 68504 46991 65089 84426 85740 191482 270551 71174 59645 148893
22751A48893k0191q5524k8659J64266J3034q1467P1358M7461n541n3102j53948
$$ 148893 128702 43178 14519 178785 191819 110352 181710 229171 223630 170528 16580
22740A6580m6286K8718M3338q500J3772N3489J12711M961R770k9560j14127m5833
$$ 16580 -29706 -988 42350 33850 47622 101111 213822 218783 228553 198993 84866 39033
22728C9033p181L1361K2782K8524j3854J1388K9725L8052J38953J89950n451k7895
$$ 39033 31852 63213 85995 114519 100665 112053 141778 179830 318783 508733 503282 475387
22716D75387J1775p9529p7815n0902J03481J77201k4564m8233j07598n2605O8592
$$ 475387 487162 407633 329818 278916 382397 559598 535034 486801 379203 326598 395190
22705C95190l1909n9947L3793P1559L9372j07968n2763L362M0210K9409M4320
$$ 395190 363281 303334 337127 408686 448058 340090 287327 290689 330899 360308 404628
22694D04628J67161o516j22474n0131Q7846L3370j529L6489n1439m2387J35075
$$ 404628 571789 565273 442799 392668 480514 513884 512355 548844 497405 455018 590093
22683E90093K25024J11806J02141K94438K96211L07075L34358J57791j34113j87804
$$ 590093 815117 926923 1029064 1323502 1619713 1926788 2261146 2418937 2284824 2097020
22673B097020k03963m02289l36520l6132j05826k00067O156j0483k938N0050J04663
$$ 2097020 1893057 1490768 1154248 1118116 1012290 812223 818379 807896 804958 855008 959671
22662I59671J3450m2540l3671J09175J4701R7189j25527j30914O1715R0662J49394
$$ 959671 973121 930581 896910 1006085 1020786 1117975 992448 861534 923249 1013911 1163305
22651A163305J59095K5586J01960J6498j14930j35913L1637N5871k35j1045Q6001
$$ 1163305 1322400 1347986 1449946 1466444 1351514 1215601 1247238 1303109 1302874 1291829 1377830
22640A377830L850o8812k256K18536J86506J7501J25564J59468J04122J32083
$$ 1377830 1381680 1312868 1310612 1529148 1715654 1733155 1858719 2018187 2122309 2254392
22630B254392J78817K34179J66475K12027J29174J72936K01258K12378K96469
$$ 2254392 2433209 2667388 2833863 3045890 3175064 3348000 3549258 3761636 4058105
22621D058105L58329N57499N16508N52083Q07705R86323J254551J573342J985344
$$ 4058105 4416434 4973933 5490441 6042524 6850229 7836552 9091103 10664445 12649789
22612A2649789K831749L816812N331260P546716J1229207J7624146K7591351L9066174
$$ 12649789 15481538 19298350 24629610 32176326 43405533 61029679 88621030 127687204
22604A27687204M8042307N5258421N9906545N1972229K4247593j6750535l9542309
$$ 127687204 175729511 230987932 290894477 342866706 367114299 350363764 310821455
22597C10821455n0146847o8350732o2547176l6987790j9974342j2145521q264565
$$ 310821455 260674608 192323876 129776700 92788910 72814568 60669047 52404482
22590E2404482o183566m742990l578204k848874k415826k155075j829589j568276
$$ 52404482 46220916 41477926 37899722 35050848 32635022 30479947 28650358 27082082
22582B7082082j263586j209999j149661q53335p59776p62513o91291o64470n37177
$$ 27082082 25818496 24608497 23458836 22605501 21845725 21083212 20391921 19727451 19190274
22573A9190274m90389m73161m99923n63938m24489n88193o80964n38414n11239
$$ 19190274 18699885 18226724 17726801 17162863 16738374 16150181 15469217 14930803 14419564
22564A4419564m98306m87773k93323m76006l96015m13326n26652n49573n21095
$$ 14419564 13921258 13433485 13140162 12664156 12268141 11854815 11328163 10778590 10257495
22555A0257495k75137j96955k22626j61933j30558j14506j81375k87329j81271
$$ 10257495 9982358 9785403 9562777 9400844 9270286 9155780 8974405 8687076 8505805
22546H505805j80147p3381n3316j78089k22818k66387j43916p1893j02712j66159
$$ 8505805 8325658 8252277 8198961 8020872 7798054 7531667 7387751 7315858 7213146 7046987
22536G046987j45631k83714j14688o1029k97721j62538j01452q3250q338K21370
$$ 7046987 6901356 6617642 6502954 6441925 6144204 5981666 5880214 5796964 5788626 6009996
22526F009996K66039J06251K85665J03305q6154l54401m08992k89318m30630l63301
$$ 6009996 6276035 6382286 6667951 6771256 6685102 6330701 5921709 5632391 5201761 4838460
22516D838460l02170k28633j18113p2292j69852k18833q6818m2654j19839j46505
$$ 4838460 4536290 4307657 4189544 4117252 3947400 3728567 3641749 3599095 3479256 3332751
22506C332751q4737l4159m2482j06602j91595q7151m6884j11414k0157m1218r4403
$$ 3332751 3248014 3213855 3171373 3064771 2873176 2786025 2739141 2627727 2607570 2566352 2471949
22495B471949j76373m4135j4385r7237j28042K9019N8172p0000j20991q084k736
$$ 2471949 2295576 2251441 2237056 2139819 2011777 2040796 2098968 2028968 1907977 1899893 1897157
22484A897157m3409q4331j59894p5824K9184m40M3042Q0076O5577k1149J7642
$$ 1897157 1853748 1769417 1609523 1533699 1562883 1562443 1605485 1685561 1751138 1729989 1747631
22473A747631Q8400q394o7356k2175q0253r1161j95243l5871q6941P040O0636
$$ 1747631 1836031 1827637 1760281 1738106 1657853 1566692 1371449 1335578 1248637 1255677 1316313
22462A316313j29062p6381P9082K26p3380P4933n233j81732j21383K8212j4601
$$ 1316313 1187251 1110870 1189952 1190178 1116798 1191731 1186498 1004766 883383 911595 896994
22451H96994M2963J9782J03875O0132O5778j13120p6448N327O1008k9107n0814
$$ 896994 939957 959739 1063614 1123746 1189524 1076404 999956 1005283 1066291 1037184 986370
22440I86370p1735j314P0185n5259M264n5181j81382n2626M9683K6560j41731
$$ 986370 914635 913321 983506 928247 932511 877330 695948 643322 693005 719565 577834
22429E77834p5605n9467p1095N232Q5919m4647M9357P4409O5977l5056o4733q5701
$$ 577834 502229 442762 371667 376899 462818 418171 467528 541937 607914 572858 508125 422424
22417D22424o3380O087j4382l492K4078m9800l4596j10931m1022Q2397j7155k4769
$$ 422424 359044 365131 350749 347257 371335 321535 286939 176008 134986 217383 200228 175459
22405A75459j4377j0083m6379O7647j458o6293P3906l9642M2168r4540J49918
$$ 175459 161082 150999 104620 172267 170809 104516 178422 138780 180948 86408 236326
22394B36326p8468K8924L4801o8881M3265K2695l1835k8985K4181J0539O121n173
$$ 236326 157858 186782 221583 152702 195967 218662 186827 157842 182023 192562 198683 193510
22382A93510n387l9437j51958l0069O1081j9010L4692J43865P2594O4510K1476
$$ 193510 188123 148686 -3272 -33341 27740 8730 43422 187287 259881 324391 345867
22371C45867j09492p9760R962p284k5488P8123J2557p1817l4981J87300m5163
$$ 345867 236375 156615 166577 159293 133805 211928 224485 152668 117687 304987 259824
22360B59824p4507K9857P3325J3131L705L9337n9266L452O5159p2583j58645j22609
$$ 259824 185317 215174 288499 301630 305335 344672 285406 288858 354017 281434 122789 180
22348A80p2652n5360l5520j0102J04595J35543L8313k5084Q2704P3983M1428k5139
$$ 180 -72472 -127832 -163352 -173454 -68859 66684 104997 79913 162617 236600 278028 252889
22336B52889l2502N607l4485M0319Q322n21K7156p5542o7624k5611K166n293j5224
$$ 252889 220387 225994 191509 231828 240150 239629 266785 191243 123619 98008 100174 94881 79657
22323G9657j00250N2314m9210j34975l4456J0917L8222R0356j0879M1058Q3758
$$ 79657 -20593 31721 -17489 -152464 -186920 -176003 -137781 -47425 -58304 -17246 66512
22312F6512L9024L3797Q3554O7483p6937j1104Q324Q1912j0629k4403p933O8890
$$ 66512 105536 139333 222887 290370 213433 202329 210653 292565 281936 257533 249600 318490
22300C18490q7361K6945p3499K672p9503p738J05666r1503m3633j46325L1061
$$ 318490 231129 258074 184575 187247 107744 100006 205672 114169 70536 -75789 -44728
22289d4728r547n837M0375J08470k5572J1075m671o7341J6530l451J0786j8863
$$ -44728 -54275 -60112 -19737 88733 63161 74236 69565 2224 18754 15303 26089 7226
22277G226j603P627P3651K6034n2238k6229j4884P2537j9197o9088o3513N5733
$$ 7226 5623 13250 86901 112935 60697 34468 19584 92121 72924 3836 -59677 -3944
22265c944k2631j08769J54964P3346l0162o3560j4444l6481Q9799K3142j4614
$$ -3944 -26575 -135344 19620 92966 62804 -756 -15200 -51681 38118 61260 46646
22254D6646J9861j90k8369O5688q9939m6978n3058l5896J14452M8332p8604j16930
$$ 46646 66507 66317 37948 103636 13697 -33281 -86339 -122235 -7783 40549 -38055 -154985
22242a54985r783P8526O6124n7019m6786R975K0705O7802j05965m2914O9732P5805
$$ -154985 -164768 -86242 -20118 -77137 -123923 -113948 -93243 -25441 -131406 -174320 -104588 -28783
22230b8783k6304O1219j06098N059j9411N210J7389J13006R1052r448O6486k6795
$$ -28783 -55087 6132 -99966 -94907 -114318 -109108 -91719 21287 112339 102891 169377 142582
22218A42582j58718J4508K9750P647j11710j1111Q6669J4368j45998k9044M4152
$$ 142582 -16136 -1628 28122 35769 -75941 -87052 -383 13985 -132013 -161057 -116905
22207a16905M1463l808M1091K1665J00504M9216m5299j87511q0742J18527J70239
$$ -116905 -75442 -79250 -38159 -16494 84010 133226 87927 -99584 -180326 -61799 108440
22196A08440L0216L6114J01158o4679m4311J01440N110J2395N4716J6680j46455
$$ 108440 138656 174770 275928 211249 166938 268378 273488 285883 340599 357279 210824
22185B10824j21640j5426l1206O6436J01824p7364l2023j23614j7527j1675k0174
$$ 210824 89184 73758 42552 108988 210812 133448 101425 -22189 -39716 -51391 -71565
22174g1565l671r6281j5122R1959Q4235P0836J48494J3731j7848j02820m0146
$$ -71565 -75236 -171517 -186639 -94680 -10445 60391 208885 222616 204768 101948 61802
22163F1802k7875P5150q4044O7661J02911n0204j32334M1669l5034m6403m707
$$ 61802 33927 109077 25033 92694 195605 145401 13067 54736 19702 -26701 -31408
22152c1408o8074M2609m5949K7179l5884j5222R9788J4743j7837K6566r135j09436
$$ -31408 -99482 -56873 -102822 -75643 -111527 -126749 -26961 -12218 -30055 -3489 -12624 -122060
22140a22060J8411Q5902K0712p9235k6491J47668Q9289l5485L7004j53619p2816
$$ -122060 -103649 -17747 2965 -76270 -102761 44907 134196 98711 135715 -17904 -90720
22129i0720J16050o2418k584O8649O3801l0985k2800M0358l6763l2875M7842j6733
$$ -90720 25330 -37088 -39672 28977 92778 61793 38993 79351 42588 9713 57555 40822
22117D0822P1789q9792q1331r1782m3486O2942R1158P2136k0438j5501k2562N556
$$ 40822 112611 22819 -58512 -150294 -193780 -130838 -39680 32456 12018 -3483 -26045 -20489
22105b0489K243R9310R8633n7998j5795p5085n6301J0041M4763K5856m8741R231
$$ -20489 -18246 81064 179697 121699 105904 30819 -25482 -15441 29322 55178 6437 15668
22093A5668J3776N2786Q4218M1390n2677n1602k09159n3390Q5464J6189J47094
$$ 15668 29444 82230 166448 207838 155161 103559 -105600 -158990 -73526 -57337 89757
22082H9757l3820j03302L5724J47415O3333n9503p5565K070O9575j893j08323
$$ 89757 55937 -47365 -11641 135774 199107 139604 64039 66109 135684 133791 25468
22071B5468O6479L8350j4312k8816k2599q2003P5130j4231j63655J7052O3083
$$ 25468 91947 130297 115985 87169 64570 -17433 57697 43466 -120189 -103137 -40054
22060d0054J1338j1796N7620K0679p7134Q3814R4944K9952o7887m6261k9582J0470
$$ -40054 -28716 -40512 17108 37787 -39347 44467 139411 169363 101476 55215 25633 36103
22048C6103J18937M7924Q3981J71229K29369K76194L08297K92704K84341J43896
$$ 36103 155040 202964 286945 458174 687543 963737 1272034 1564738 1849079 1992975
22038A992975m7882l81188l57374k27690j81263j41808j50182J1591q0925r051
$$ 1992975 1945093 1563905 1206531 978841 797578 655770 505588 517179 436254 427203
22028D27203p4732p0904o0037m2440j3088q6397P9795J35209l0308m0731q6359
$$ 427203 352471 281567 221530 179090 166002 79605 159400 294609 264301 223570 137211
22017A37211j58263j361P2263K288K6138k7325K1059J01801j084j04964l3820
$$ 137211 -21052 -22413 49850 52138 78276 50951 72010 173811 172727 67763 33943
22006C3943P1776m2267k441r213j32545j04653J68222J15833J6618j1152Q7069
$$ 33943 105719 63452 61011 51798 -80747 -185400 -17178 98655 115273 104121 191190
21995A91190K8566j41040j43066l7329L5018J07131j4394n6505m1041m9738m9095
$$ 191190 219756 78716 -64350 -101679 -66661 40470 26076 -30429 -71470 -121208 -170303
21984a70303k6493Q6675J41939k6194j0211n631n7413m4472k5417Q5351N1875
$$ -170303 -196796 -110121 31818 5624 -4587 -10218 -67631 -112103 -137520 -52169 -294
21973b94J26606O3425Q809m3296j67398k6376n453j24373K8493j8066J0121J01631
$$ -294 126312 189737 198546 155250 -12148 -38524 -43977 -168350 -139857 -157923 -147802 -46171
21961d6171J13731n5940r9719J4123m8642k9283P3784M8629N6330M2649P4452
$$ -46171 67560 11620 -88099 -73976 -122618 -151901 -78117 -29488 26842 69491 143943
21950A43943J7435k4419k7191o9650r06M0472r6296p5264L629J11657N8971L7144
$$ 143943 161378 136959 109768 40118 39212 79684 -16612 -91876 -88247 23410 82381 119525
21938A19525p6175l3647j3103O4389m0378j44378O2559J41758L567k9845k9409
$$ 119525 43350 9703 -3400 60989 20611 -123767 -61208 80550 84117 54272 24863
21927B4863k1614J9808j06583O4636K25946k4218j17371R124j16367o4888k6622
$$ 24863 3249 23057 -83526 -18890 207056 182838 65467 74591 -41776 -106664 -133286
21916a33286R8591P8528M4044Q4437k6467m619N6278M4583j10361q6626l2504
$$ -133286 -34695 43833 87877 172314 145847 141228 197506 242089 131728 45102 12598
21905A2598j381m5283K4203q990R7679m3869q6446J18482O1536J2709j32938m0782
$$ 12598 11217 -34066 -9863 -18853 78826 34957 -51489 66993 128529 141238 8300 -32482
21893c2482P2906J32358J36958l1700n8365j01477r4041k9911L90J4121J19900
$$ -32482 40424 172782 309740 278040 219675 118198 24157 -5754 -5364 8757 128657
21882A28657N0545K4403p6921j52793P710J23858j4017N1182n3974k3685l3617
$$ 128657 179202 203605 126684 -26109 -18399 105459 91442 142624 88650 64965 31348
21871C1348o5767L8019P6728R2397j3301j11262O3955n7362j11125j0463R8838
$$ 31348 -34419 3600 80328 172725 159424 48162 112117 54755 -56370 -66833 32005
21860C2005K4342K3085J3346l6360l5963k1854J18256J2315j65510j12065P5101
$$ 32005 56347 79432 92778 56418 20455 -1399 116857 129172 -36338 -148403 -73302
21849g3302P9168N0913J0158p4602j35313J0799Q878J0823Q2068l0251N4798J7993
$$ -73302 5866 56779 66937 -7665 -142978 -132179 -123301 -112478 -30410 -60661 -5863 12130
21837A2130k6726p3452n0918l3802K9641M0099R1680P9369m6874j81213M769J13818
$$ 12130 -14596 -88048 -138966 -172768 -143127 -103028 -11348 68021 21147 -160066 -155297 -41479
21825d1479J3963n0890M1012Q5939L1965P1986J6359k8838n9902l6575o7152O236
$$ -41479 -27516 -78406 -37394 48545 80510 152496 168855 140017 80115 43540 -23612 -17376
21813a7376Q1724Q8230l3832k5068m0140r8423M7727k6982r0378M7931M3682n9878
$$ -17376 64348 152578 118746 93678 53538 -44885 2842 -24140 -114518 -66587 -22905 -82783
21801h2783R4250J45213j3983J4440j1828J1706K0400j07400j9306K0164n0527
$$ -82783 11467 156680 142697 157137 145309 157015 177415 70015 50709 70873 20346
21790B0346r4313j0301q0947j8510L5205m5018r5341j3307j6580J00154O316j8586
$$ 20346 -73967 -84268 -165215 -183725 -148520 -193538 -288879 -302186 -318766 -218612 -212296 -230882
21778b30882K9089L1290J92138j7842q8429N6990R2874Q263k8991j15993m5715
$$ -230882 -201793 -170503 21635 3793 -84636 -27646 65228 73491 44500 -71493 -117208
21767a17208O219p8418p7131p6573K7811N0652L6821Q0982J61810Q812r079l3171
$$ -117208 -110989 -189407 -266538 -343111 -315300 -264648 -227827 -146845 14965 23777 14698 -18473
21755a8473M722L0076m4667O9189O3309m3533J29936m3752j13595l4087N9390
$$ -18473 -13751 16325 -28342 40847 104156 60623 190559 146807 33212 -875 58515
21744E8515n792R4171Q8410p000n3643k3055r4205k6252p5607R199N6444M6166
$$ 58515 52723 146894 235304 228304 174661 151606 57401 31149 -44458 -35259 21185 67351
21732F7351Q4162Q4742k363o1755j22972k7049m2000J5915l2495j43716Q066J11578
$$ 67351 151513 236255 233892 172137 49165 22116 -19884 -3969 -36464 -180180 -172114 -60536
21720f0536m3727J21646k595r1838O039Q5928M6875p4930J50033k886j91185q6251
$$ -60536 -104263 17383 14788 -77050 -71011 14917 61792 -13138 136895 134009 -57176 -143427
21708a43427J06569q92j01187k4824n7345n9277N1032J34869J31331l166k5142
$$ -143427 -36858 -37750 -138937 -163761 -221106 -280383 -229351 -94482 36849 33683 8541
21697H541N1468r737j7556K3585k7020j01617L8156J13197j7454N5821K8177j25226
$$ 8541 60009 50272 32716 56301 29281 -72336 -34180 79017 61563 117384 145561 20335
21685B0335j64990l8404R7434m056O1699J3609K1445q5237o2531o7619R0559J15023
$$ 20335 -144655 -183059 -85625 -89681 -27982 -14373 7072 -78165 -140696 -208315 -117756 -2733
21673b733m8492j88945n5318p7779K3793P9246L9489J39839K9300J13324J1093
$$ -2733 -51225 -240170 -295488 -373267 -349474 -270228 -230739 -90900 -61600 51724 62817
21662F2817k8276l3890r29M1488n1366K9191l0507Q9374N7039p7949J23594J67075
$$ 62817 34541 651 -278 41210 -10156 19035 -11472 77902 134941 56992 180586 347661
21650C47661o335j84550q0191q8583m4860M3894P3014n94O4802q4985j10318L567
$$ 347661 341326 156776 76585 -11998 -56858 -12964 60050 59456 124258 39273 -71045 -67478
21638f7478K8260o0519P2046J36081j5867o7128o5876L637J14670O1185m3515
$$ -67478 -39218 -99737 -27691 108390 92523 25395 -40481 -36844 77826 139011 95496
21627I5496L5689k494k1860r8731o7769m2521L9666J10085M2468j65656K3211
$$ 95496 131185 128691 106831 8100 -59669 -102190 -62524 47561 90029 -75627 -52416
21616e2416N3899j4761j3630Q5455l5863p5181o859l7607q0662K1610J00525N8813
$$ -52416 1483 -13278 -26908 58547 22684 -52497 -59356 -96963 -177625 -156015 -55490 3323
21604C323P963j34124j922K09063P9244j0233j26715m9564K3723j7872M1017p9688
$$ 3323 11286 -122838 -124760 84303 163547 153314 26599 -22965 758 -17114 23903 -55785
21592e5785o5706N8383J06809K7278p5884P304k3052n5040p3091n4498K7631Q3467
$$ -55785 -121491 -63108 43701 70979 -4905 2399 -20653 -75693 -148784 -203282 -175651 -92184
21580i2184P045J05605J26265l2938L360m5680J4693M0712o2496L2812N4994Q9474
$$ -92184 -85139 20466 146731 113793 117153 71473 86166 126878 64382 97194 152188 241662
21568B41662j7671n5241o0259r2039q3986j6199q9814k1637K0182N6328N218L6468
$$ 241662 223991 168750 108491 16452 -67534 -83733 -173547 -195184 -175002 -118674 -113456 -76988
21556g6988O8480R107J08557L060r8528l4434J7788N6407o1749L0015P5415p9986
$$ -76988 -8508 599 109156 112216 13688 -20746 -2958 53449 -8300 21715 97130 17144
21544A7144O2216q1695M5671K4414j09631M201P809J14897J2508j62433j08203
$$ 17144 79360 -2335 43336 67750 -41881 -37680 -29871 85026 97534 -64899 -173102
21533a73102k1949J08359J3352m7011o62P7008K3633J58709J5623K377j16252
$$ -173102 -195051 -86692 -73340 -120351 -121013 -44005 -20372 138337 153960 156337 40085
21522D0085m1811j3335q3142P2748M040O2876k2883k8257L582O621k6661L527
$$ 40085 -1726 -15061 -98203 -25455 -21415 41461 18578 -9679 -6097 524 -26137 -22610
21510b2610M2289N5984J212m7410P383L1660J605L8914k1940k144R925j6191j45263
$$ -22610 19679 75663 76875 29465 36848 68508 70113 109027 87087 84943 94868 78677 -66586
21497f6586q0660L6082J54242M9529m798K9582J73037j14934j37054L4923m4345
$$ -66586 -147246 -111164 43078 92607 87809 117391 290428 175494 38440 73363 29018
21486B9018j00563j8629O4922J7408J5638P0858J40318n1793j72864k9632k0876
$$ 29018 -71545 -90174 -25252 -7844 7794 78652 218970 167177 -5687 -35319 -56195
21475e6195o6037J9192J44100k5929k3979r7904L516L6823Q8071P1506K9673l2163
$$ -56195 -122232 -103040 41060 15131 -8848 -106752 -103236 -66413 21658 93164 122837 90674
21463I0674J7593q2290p4260J418n1758j8389L0767L0399m7550r7054N5545L4673
$$ 90674 108267 25977 -48283 -46865 -98623 -117012 -86245 -55846 -103396 -200450 -144905 -110232
21451a10232Q8590o6011n6600M2466J26196J7727k2135N6655N6110j16679j07487
$$ -110232 -21642 -87653 -144253 -101787 24409 42136 20001 76656 132766 16087 -91400
21440i1400J639L4732J82609J3987j73028K0067k8239M018q0562M9154M7312p5801
$$ -91400 -89761 -55029 127580 141567 -31461 -11394 -39633 -35615 -116177 -67023 -19711 -95512
21428i5512k5281N262K3560R9128r769K8003j3264J5896o0041j5264j3449N638
$$ -95512 -120793 -115531 -91971 7157 -2612 25391 12127 28023 -32018 -47282 -60731 -55093
21416e5093O8012j0995j53484k1065N4760K9399L5050k1038J1652K1957l2717
$$ -55093 12919 1924 -151560 -172625 -117865 -88466 -53416 -74454 -62802 -40845 -73562
21405g3562L1336O0340M9068m1654p6986o9223O4112j85758r8855l158J10507
$$ -73562 -42226 18114 67182 25528 -51458 -120681 -56569 -242327 -341182 -344340 -233833
21394b33833P2591O647l9665j37419O1883J52457J07527R0906o9173j555Q7955
$$ -233833 -161242 -154595 -194260 -331679 -269796 -117339 -9812 81094 11921 10366 98321
21383I8321J2495m4014m4355J1262N3407k9911J2980M5521L0361j04098l7405
$$ 98321 110816 66802 22447 33709 87116 57205 70185 115706 146067 41969 4564
21372D564l6446j10943k3117L4774J32841N4331m0180o3926J63701O8953r9829
$$ 4564 -31882 -142825 -165942 -131168 1673 56004 15824 -48102 115599 184552 84723
21361H4723j15982l2862k2775Q5254k9256o2297L9126J14583N6070n1135j81812
$$ 84723 -31259 -64121 -86896 -1642 -30898 -93195 -54069 60514 116584 65449 -116363
21350a16363l2825Q4304N7491M8180N4799p9811q2352M891n053l1966L2653O3472
$$ -116363 -149188 -64884 -7393 40787 95586 15775 -66577 -61686 -66739 -98705 -66052 -2580
21338b580R4599j8199o4583q3058P6036J05059P9396m1784J6904o2686j25289
$$ -2580 92019 73820 9237 -73821 2215 107274 186670 144886 161790 99104 -26185
21327b6185n8284N980m41r1792r0915N1943O7841Q4203P7156j2419r8755m2288
$$ -26185 -84469 -78489 -78930 -170722 -261637 -209694 -141853 -57650 19506 7087 -91668 -133956
21315a33956N380o506M4649N4367J1974J5626P4904q677j39575O3742K04268L5843
$$ -133956 -128576 -135082 -90433 -36066 -24092 -8466 66438 57761 -81814 -18072 186196 222039
21303B22039o0190M6069r8669j93098j50324l7927J02698J08101L5650Q139K0882
$$ 222039 161849 207918 109249 -83849 -234173 -272100 -169402 -61301 -25651 -17512 3370
21292C370Q4Q4298l2370r5180J167L8006q8456p4298J02607j9989n6609J6171
$$ 3370 3454 87752 55382 -39798 -38631 -625 -89081 -163379 -60772 -80761 -137370 -121199
21280a21199R3287J04039p1156j33943M9950N0082j08611n0375o2539J4495J15992
$$ -121199 -27912 76127 4971 -128972 -79022 -28940 -137551 -187926 -250465 -235970 -119978
21269a19978Q3490j23691n7162p995J29283N9104r3371n4144M755L1282M132J11124
$$ -119978 -36488 -160179 -217341 -225336 -96053 -36949 -130320 -184464 -179709 -148427 -144295 -33171
21257c3171L5305l2055m8592N1520J46069O4390N4708j76904N1504P6572j28840
$$ -33171 2134 -29921 -78513 -26993 119076 183466 238174 61270 112774 189346 60506
21246F0506o1195Q1304o042j6126l9934M3454R4241q7366j31754k7760N7664o478
$$ 60506 -689 80615 74573 58447 18513 61967 156208 68842 -62912 -90672 -33008 -39486
21234c9486P8772L2923j27916p3962N933M9341J21515K8687L1291J9076m9377
$$ -39486 39286 72209 -55707 -129669 -123736 -74395 47120 75807 107098 126174 76797
21223G6797j10328J05889P1567k0453m5308o5536m344j08285j71993L1033Q3742
$$ 76797 -33531 72358 143925 123472 78164 12628 8284 -100001 -271994 -240961 -157219
21212a57219J2113K5314R7601j987Q1038K5514r3148O790m9751K6184N0814J28479
$$ -157219 -145106 -119792 -22191 -24178 56860 82374 -10774 -3984 -53735 -27551 23263 151742
21200A51742J09091o6079j40722p0064L4637K6084j50561r8746m3717J78563O0873
$$ 151742 260833 194754 54032 -16032 18605 44689 -105872 -204618 -248335 -69772 -8899
21189h899k8998O4090j0704n572L1822j21416j14713n2352R2866L1162J1488R3133
$$ -8899 -37897 26193 15489 9917 41739 -79677 -194390 -246742 -153876 -122714 -111226 -18093
21177a8093M5442r062k5825O9035k1461m1275l3042J3P4990j74933j17610P1537
$$ -18093 27349 18287 -7538 61497 40036 -1239 -34281 -34268 40722 -134211 -251821 -180284
21165a80284J76652M5946M0003m2098j50559j28286J7575l2804K4586L2158R1950
$$ -180284 -3632 42314 82317 40219 -110340 -238626 -221051 -253855 -229269 -197111 -105161
21154a05161L9022L2144o4283k4262J52219N2766p1588q9750j9481M2756Q0748
$$ -105161 -66139 -33995 -98278 -122540 29679 82445 10857 -78893 -98374 -55618 25130
21143B5130J12245J1108m048j10618o4853N479O5631N1336q6868q7991r8200L3499
$$ 25130 137375 148483 144435 33817 -31036 -25557 40074 91410 4542 -83449 -181649 -148150
21131a48150o8840L1370J66950J25030m7496k4089O078P7604k769k6868j3874
$$ -148150 -216990 -185620 -18670 106360 58864 34775 40853 118457 115688 88820 74946
21120G4946j4360M3965j5711r8074j34270j45999K1884J39023P7296J08751j70093
$$ 74946 60586 104551 88840 -9234 -143504 -289503 -267619 -128596 -51300 57451 -112642
21109a12642n1633N3634L4278m8132j35344k5038Q9102M3421l363o8512p241P9952
$$ -112642 -164275 -110641 -76363 -124495 -259839 -284877 -195775 -152354 -155717 -224229 -231470 -151518
21097a51518n8985n6508k4181k7486J11383R9045N7749J1783o1020j18479L0464
$$ -151518 -210503 -267011 -291192 -318678 -207295 -108250 -50501 -38718 -99738 -218217 -187753
21086a87753J59633J0230N489O3785K390P303l1333R5540o9661j13370M3219L0767
$$ -187753 -28120 -17890 -12401 51384 53774 61077 29744 125284 55623 -57747 -14528 16239
21074A6239M8285L0646K3765K3520j29610n4692M1466j3827M3703k6948J3984
$$ 16239 64524 95170 118935 142455 12845 -41847 -381 -14208 29495 2547 16531
21063A6531m723m3022J70793P0651j9273m9830l029j12496j15213k5997K217j8423
$$ 16531 11808 -31214 139579 210230 190957 141127 138098 25602 -89611 -115608 -113391 -131814
21051a31814l1264k5803J57752M4495m1485p4402J37339J8396l5841K8862O0519
$$ -131814 -163078 -188881 -31129 13366 -28119 -102521 34818 53214 17373 46235 106754
21040A06754l5145m7935q6978j688j1718k7714J0136r2489j14p852R9261J5891
$$ 106754 71609 23674 -63304 -64992 -76710 -104424 -94288 -186777 -186891 -194743 -95482 -79591
21028g9591M2852J34639R3622m7400k03424M76J00813j44925o3730J21818J8297
$$ -79591 -36739 97900 191522 144122 -59302 -58826 41987 -102938 -166668 -44850 -26553
21017b6553P1961J00414j5690j12633j9771j385j6726o6550k2969M3135j4611
$$ -26553 45408 145822 130132 17499 -2272 -3657 -20383 -86933 -109902 -66767 -81378
21006h1378N1740P612L5116N0625K8570l5170R3493J33617R251j39635j49776
$$ -81378 -29638 -22026 13090 63715 92285 57115 150608 284225 293476 153841 4065
20995D065J9893j2372r5975j9817M8189J12296Q308n80j16297J01895L375k4076
$$ 4065 23958 11586 -84389 -104206 -56017 56279 64587 64007 -52290 49605 52980 28904
20983B8904J2276n1633K1822n0908K7889J8904j47657J2723J38902K1459o855
$$ 28904 41180 -10453 11369 -39539 -11650 7254 -140403 -127680 11222 32681 25826
20972B5826q6568j13635J42847k5416q3811j5284m7079L8130M9872p3305n9435
$$ 25826 -60742 -174377 -31530 -56946 -140757 -156041 -203120 -164990 -115118 -188423 -247858
20961b47858J19035M9675p4234R492P5159j4656J48296L972j18089j93677L8195
$$ -247858 -128823 -79148 -153382 -143890 -68731 -83387 64909 68881 -49208 -242885 -204690
20950b04690J5576r9861j6512N5496M3567K5677j1626R2633n1595j5528K7371
$$ -204690 -189114 -288975 -305487 -249991 -206424 -180747 -192373 -99740 -151335 -166863 -139492
20939a39492p669Q6941L4699q2660K0275L4870N7081k0332j68655L5179l2738
$$ -139492 -147161 -60220 -25521 -108181 -87906 -53036 4045 -16287 -184942 -149763 -182501
20928a82501M3128n3963J4916K5178N485Q4157Q1669N9928Q030o2346l4687n4907
$$ -182501 -139373 -193336 -178420 -153242 -147757 -63600 18069 77997 86027 23681 -11006 -65913
20916f5913J2956r5376Q1774M8515o7767P8239L245j22192m4273J54574l7697
$$ -65913 -52957 -148333 -66559 -18044 -85811 -7572 -4327 -126519 -170792 -16218 -53915
20905e3915l9674M3824O6702O3355k346J134N6252J6938K2848j6349p5328K3350
$$ -53915 -93589 -49765 16937 80292 77946 79080 135332 152270 175118 158769 83441 106791
20893A06791n2538j3966J61213l0416j742K2495j01070p9764k6472l2827J5223
$$ 106791 54253 40287 201500 171084 169342 191837 90767 11003 -15469 -48296 -33073
20882c3073M4545m8303J2890P4223O5489K1484q5880j25259K8474P7170M632j4147
$$ -33073 11472 -36831 -23941 50282 115771 137255 51375 -73884 -45410 31760 36392 22245
20870B2245q604l2561O3015L3039l7407j7674j53491l5859J53251L9256m833M7254
$$ 22245 13641 -18920 44095 77134 39727 22053 -131438 -167297 -14046 25210 20377 67631
20858F7631o733L3689n7171p5840P5623M5721R0290l5905r2529q6245M4383R0911
$$ 67631 60898 94587 37416 -38424 37199 82920 173210 137305 44776 -41469 2914 93825
20846I3825N129J027J07951l4180n9499j16390q09O745o4462K937J74205J46704
$$ 93825 98954 99981 207932 173752 114253 -2137 -2946 3799 -60663 -57726 116479 263183
20834B63183j82666k12275L117N9787O7567J9652n5455q8730k9171k9942k2283
$$ 263183 80517 -131758 -128641 -68854 -1287 18365 -37090 -125820 -154991 -184933 -207216
20823b07216J47201K04100N1507M4731o8109o4331l6460j06328k6023M8556J39434
$$ -207216 -60015 144085 195592 240323 172214 107883 71423 -34905 -60928 -12372 127062
20812A27062N984r6564o1891L990M2440r4072M0775k168m7688n5864k5732J43025
$$ 127062 133046 36482 -25409 -21419 21021 -73051 -32276 -34444 -82132 -137996 -163728 -20703
20800b0703p6089J6054M2087L4053L9562J4844K7601O38Q221o1411n9315J06042
$$ -20703 -96792 -80738 -38651 -4598 34964 49808 77409 78047 86268 24857 -34458 71584
20788G1584P0901n9911p4125m1774r2667l1179J8205m9755J08639J2989J6119
$$ 71584 142485 82574 8449 -33325 -125992 -157171 -138966 -188721 -80082 -67093 -50974
20777e0974j689J4889o8069J9764J23953J15821N124j08192P281O1163l0985k17748
$$ -50974 -52663 -37774 -105843 -86079 37874 153695 158819 50627 57908 119071 88086 -129662
20765a29662m4728L4147j9570R1327K6758o566n1844J40240J76937l9711j07697
$$ -129662 -174390 -140243 -159813 -68486 -41728 -48294 -100138 40102 217039 177328 69631
20754F9631m2021M5911n5451J04550M319M5765j59236r6427K4570n9683M4651
$$ 69631 27610 73521 18070 122620 126939 172704 13468 -82959 -58389 -118072 -73421
20743g3421J19425l8941o1608l1264n702p9507K5463K8035J40405J95066Q916
$$ -73421 46004 7063 -54545 -85809 -91511 -171018 -145555 -117520 22885 217951 226867
20732B26867j05200r1284q2690j37879Q2550R6076N8617P4503J4685l4387R235
$$ 226867 121667 30383 -52307 -190186 -107636 -11560 47057 121560 136245 101858 111093
20721A11093o4330J9945r2483K4396j55300L6357K12888Q9111j27079k6643P0530
$$ 111093 46763 66708 -25775 -1379 -156679 -120322 92566 181677 54598 27955 98485
20710I8485n599j5634p2983K4962N9238L4828j46769j44605O2789Q5120J2487
$$ 98485 92886 77252 4269 29231 88469 123297 -23472 -168077 -105288 -20168 -7681
20699g681j42319P8800R2784p1866n1696n3465l9083P1955n2392K7274K7315o2859
$$ -7681 -150000 -71200 21584 -50282 -101978 -155443 -194526 -122571 -174963 -147689 -120374 -183233
20687a83233r1635m5599Q3462J24820J7063Q3007l2206o0023M3288Q7303r363
$$ -183233 -274868 -320467 -237005 -112185 -95122 -12115 -44321 -104344 -61056 26247 16884
20676A6884p172j508L6288L9140N2603q0299j57807k9800O6195k8108o634K7643
$$ 16884 9712 8204 44492 83632 136235 55936 -101871 -131671 -65476 -93584 -100218 -72575
20664g2575p4566O308J04251J39362J6480l9644L3985K1855m1357n1296m4750
$$ -72575 -147141 -140833 -36582 102780 119260 79616 113601 135456 94099 42803 -1947
20653a947K4625L9820L6786k7333p028J69017k7880j85226k0550m032K4047M627
$$ -1947 22678 62498 99284 71951 64923 233940 206060 20834 284 -3748 20299 24926
20641B4926o1496p3624J33963Q2432r0611J3872l5079j46466N9458N302r050p0945
$$ 24926 -36570 -110194 23769 106201 15590 29462 -5617 -152083 -92625 -87323 -96373 -167318
20629a67318L1143n29n0643j09452k768j4313Q4565J94961Q8887l0466q7554K3867
$$ -167318 -136175 -136704 -187347 -296799 -299567 -313880 -229315 -34354 54533 24067 -63487 -39620
20617c9620j04386j26347R0180P3508J58901J5668j61195n2813n2485N2232J64298
$$ -39620 -144006 -270353 -180173 -106665 52236 67904 -93291 -146104 -198589 -146357 17941
20606A7941J65625r6027l7809k487O7042m9337j05752j12462O9554J11204N3150
$$ 17941 183566 87539 49730 47243 114285 64948 -40804 -153266 -83712 27492 80642
20595H0642L5962J3106J06056j47650j09640p4994j04955k7206L5196N6862o0225
$$ 80642 116604 129710 235766 88116 -21524 -96518 -201473 -228679 -193483 -136621 -196846
20584a96846n3785K3452J28337j0765Q6978J32944N3745J7875q9506P2782N3830
$$ -196846 -250631 -227179 -98842 -109607 -22629 110315 164060 181935 92429 165211 219041
20573B19041r7604L4813j19514n8598J29845M0020p3410q8257o042P1250K9793
$$ 219041 121437 156250 36736 -21862 107983 148003 74593 -13664 -19706 51544 81337
20562H1337n2453m1904k7632Q7830r6846n875J4874o7221m4656R2412K05203J23664
$$ 81337 28884 -13020 -40652 47178 -49668 -55543 -40669 -107890 -152546 -60134 145069 268733
20550B68733q6312r8917j1648Q8973k8507m3148O419l6060q209r892j1629k1219
$$ 268733 182421 83504 71856 160829 132322 89174 95593 59533 51324 41432 29803 8584
20538H584J19050m4658J07667M7828j28932k3002O779L8418Q7133J13512q1682
$$ 8584 127634 82976 190643 238471 109539 86537 93316 131734 218867 332379 250697
20527B50697j58294R4284K23981m6516k246j38031M6032K65918J17055m9367j47630
$$ 250697 92403 186687 410668 364152 361906 223875 269907 535825 652880 603513 455883
20516D55883n8991K9163N5856L4183P3821J13723l6939P8685J65726J27928J8129
$$ 455883 396892 426055 481911 516094 589915 703638 666699 745384 911110 1039038 1057167
20505A057167q5203p2887J6490l403n5722o7098j48716q997j3112J7193k4769
$$ 1057167 971964 899077 915567 912164 856442 789344 640628 631631 618519 635712 610943
20494F10943K6768J970j86365j72325q3490J1980M8365q691o7686O1595N7157
$$ 610943 637711 639681 453316 280991 197501 209481 257846 249155 181469 243064 300221
20483C00221l4837o3355K0099l8892k4421l0184r4979j4604P0842n97o0279m8584
$$ 300221 265384 202029 222128 183236 158815 128631 33652 19048 89890 89293 29014 -19570
20471a9570P4440J02183Q5558J13062n3689j57246J93361j3035q0316l1351p1604
$$ -19570 54870 157053 242611 355673 301984 144738 338099 325064 244748 213397 141793
20460A41793n590n2010j01173J27898O2715l4726L5952n0323J20731M7113l7798
$$ 141793 136203 84193 -16980 110918 173633 138907 174859 124536 245267 292380 254582
20449B54582p7798J15875j9394o6615q870k5064j0821j00842K6269o5385M0251
$$ 254582 176784 292659 273265 206650 197780 172716 161895 61053 87322 21937 62188
20438F2188o7495j3611J59223N8223j5027p3872o7154O8213N2379o6161q2527
$$ 62188 -5307 -18918 140305 198528 183501 109629 42475 110688 163067 96906 14379
20427A4379q2667j54120P7707R5550P9158j5588l4534R0063K32031J0871k8596
$$ 14379 -68288 -222408 -144701 -49151 30007 14419 -20115 69948 301979 312850 284254
20416B84254J1227o3629Q0287J8051r0815p9783m4164j88726O2102J27080k3981
$$ 284254 295481 231852 312139 330190 239375 159592 115428 -73298 -11196 115884 91903
20405I1903j30778O178N4889J8109j304L5695l3291j15298Q0986J69591O5605
$$ 91903 -38875 -32697 22192 40301 38997 74692 41401 -73897 7089 176680 242285
20394B42285r7577j65144l7646L4609p2882L4419J4173J66426P2590O0405L416
$$ 242285 144708 -20436 -58082 -23473 -96355 -61936 -47763 118663 191253 251658 255074
20383B55074j13555k1206L7623j1163p164l9442o7098q6568l2774Q3370J08080
$$ 255074 141519 120313 157936 146773 139609 100167 33069 -53499 -86273 -2903 105177
20372A05177Q654M9774J26343o2048j21844r7755K209O8482R223J42303l1604
$$ 105177 113831 163605 289948 227900 106056 8301 10510 78992 88215 230518 198914
20361A98914j3056l7456L2773J16280q1434j53005p4571J13770J04661l7921j52865
$$ 198914 185858 148402 181175 297455 216021 63016 -11555 102215 206876 168955 16090
20350A6090J2878O1878N0851k5207p0771L0812j7196l9063m9544O740R8876J10560
$$ 16090 28968 90846 141697 116490 45719 76531 59335 20272 -29272 -22532 76344 186904
20338A86904R534L1747p3811k1295l1840j2958k9701N608O1199J06526N9042l7108
$$ 186904 196438 228185 154374 133079 101239 88281 58580 64188 125387 231913 290955 253847
20326B53847j04661k6586o375K6877l3519j03062j27820Q5815P7285L6754K4848
$$ 253847 149186 122600 116225 143102 109583 6521 -121299 -35484 41801 78555 103403
20315A03403j10585o5760J22365K7439l4525m5173o898K183M1453J41268J34112
$$ 103403 -7182 -72942 49423 76862 42337 -2836 -9734 -7551 33902 175170 309282
20304C09282j52354j77034L5520J2395J20809O3095j103j8072Q9327Q8370j12254
$$ 309282 156928 -20106 15414 27809 148618 211713 210610 192538 281865 370235 257981
20293B57981r3105j3523l9779M4962K8490n1546l5903j2891J0136P5093L2016
$$ 257981 164876 151353 111574 156536 185026 133480 97577 84686 94822 169915 201931
20282B01931l5682j8706Q3614M4090M3962q7489l1201q5605n5605J46082P2305
$$ 201931 166249 147543 231157 275247 319209 231720 200519 114914 59309 205391 277696
20271B77696m6865Q5186J5056N6529P7146J4646p6705k35931n2649O374R116J45736
$$ 277696 230831 316017 331073 387602 464748 479394 402689 166758 114109 120483 129599 275335
20259B75335M8247q7836q2739K5643L8444m9419j55944P7060J48921j2225j25400
$$ 275335 323582 235746 153007 178650 217094 167675 11731 88791 237712 225487 100087
20248A00087L1064Q2269J8287p0824j30898J5046j1769N3458R8760K268k8445
$$ 100087 131151 213420 231707 160883 29985 45031 33262 86720 185480 187748 159303
20237A59303M3262L8151M623O17j01769o8798m1976j3572l1625k0136P1815K47478
$$ 159303 202565 240716 245339 245956 144187 75389 33413 19841 -11784 -31920 39895 287373
20225B87373J999q6310P1118p3307n4469J7281K5812J63613L5241p886L9461M6029
$$ 287373 289372 203062 274180 200873 146404 163685 189497 353110 388351 380465 419926 465955
20213D65955K4912n1600O6648k1221M2928N1632l2993m3762p9379j49357M1890
$$ 465955 490867 439267 505915 484694 527622 579254 546261 502499 423120 273763 315653
20202C15653L01692N2125m0030l6807K9514L88J5630j8415j32529j67551J5401
$$ 315653 617345 669470 629440 592633 622147 622535 638165 619750 487221 319670 335071
20191C35071n0916k8260l3416q5316L9678P2243o1552l7093k358p5336k1569O2687
$$ 335071 284155 255895 222479 137163 176841 249084 187532 150439 148081 72745 51176 113863
20179A13863R466n031O1758P2632k6342J6127J19988J8480J25585j5437J5057
$$ 113863 123329 118298 180056 252688 226346 242473 362461 380941 506526 491089 506146
20168E06146k4385J9515j35939L5956J6012J6795M0366L4263L3235n1225P7188
$$ 506146 481761 501276 365337 401293 417305 434100 474466 508729 541964 490739 567927
20157E67927K3724n538N7972L3364r3657r6916j37682M1608O7860r0592K0658
$$ 567927 591651 586113 644085 677449 583792 486876 349194 390802 458662 368070 388728
20146C88728L1214n3795p9879j15913J73552J07845q9652q457J2000p3283O226
$$ 388728 419942 366147 286268 170355 343907 451752 362100 353643 365643 292360 298586
20135B98586l4114k6991j8436J5060M9063p1078K0182N3196l565O2000k7728j02158
$$ 298586 264472 237481 219045 234105 283168 212090 232272 285468 281903 343903 316175 214017
20123B14017K6825J13274M2822J10542k8817q7532j34009j22566Q9067J40548
$$ 214017 240842 354116 396938 507480 478663 391131 257122 134556 223623 364171
20113C64171J33306L2931m4998m4605j2451J34058N5960j01893j36807l0780Q8271
$$ 364171 497477 530408 485410 440805 428354 562412 618372 516479 379672 348892 437163
20102D37163k1387L2756L5197O208K3403o169P1311R9945L3108l237j06120l5591
$$ 437163 415776 448532 483729 489937 513340 507171 578482 678427 711535 708298 602178 566587
20090E66587n0161j61267j6253J26851M1361j04882l6945K2521J51517J11627
$$ 566587 516426 355159 338906 465757 507118 402236 365291 387812 539329 650956
20080F50956N7029k4001j44982N3037r029P164Q7740K5813P4765k4447j2411m1265
$$ 650956 707985 683984 539002 592039 583010 590174 677914 703727 778492 754045 741634 700369
20068G00369l8457p4265m7378J00711M7982N6438k9601o1538Q5829R2823O9232
$$ 700369 661912 587647 540269 640980 688962 745400 715799 654261 740090 832913 902145
20057I02145J47694P4881j8618l3760L1368L3874p079k8361l7303j7843J04085
$$ 902145 1049839 1124720 1106102 1072342 1103710 1137584 1130505 1102144 1064841 1046998 1151083
20046A151083J49194R0784N6597L1079n8270Q2935Q4204J12050J51045R7141J53177
$$ 1151083 1300277 1391061 1447658 1478737 1420467 1503402 1587606 1699656 1850701 1947842 2101019
20035B101019K16633J47989L59703M65820L98582K78434K46040K80780L75293
$$ 2101019 2317652 2465641 2825344 3291164 3689746 3968180 4214220 4495000 4870293
20026D870293N03405M59978M09372P29034P52168J042979J572461K139086K786652
$$ 4870293 5373698 5833676 6243048 6972082 7724250 8767229 10339690 12478776 15265428
20017A5265428M409177O498665Q658807J0068559J1522712J3146776J2314872
$$ 15265428 19674605 26173270 34832077 44900636 56423348 69570124 81884996
20010H1884996P052603k49685j682487N02964n21816j284681N208434J3421451
$$ 81884996 88937599 88687914 87005427 87508391 86986575 85701894 90910328 104331779
20002A04331779J8994715K1183187J8081954Q244541j696092r038303j3237724
$$ 104331779 123326494 144509681 162591635 170836176 169140084 160101781 146864057
19995A46864057j6500011j7098981j3812455n508121K383397P350848P923046
$$ 146864057 130364046 113265065 99452610 93944489 96327886 103678734 111601780
19988A11601780K386402o663389r004892p868054j1699705j6426710j3504680
$$ 111601780 113988182 107324793 98319901 90451847 78752142 62325432 48820752
19981D8820752q287160n054068l369059k530983j814389j535682j390523j261221
$$ 48820752 40533592 35479524 32110465 29579482 27765093 26229411 24838888 23577667
19973B3577667q84797q43019q43845r19942q25735p81959p72790p37191n89737
$$ 23577667 22692870 21849851 21006006 20086064 19260329 18478370 17705580 16968389 16378652
19964A6378652n42411n92280o49759n45389m25073m01189m36203m29646k72447
$$ 16378652 15836241 15243961 14594202 14048813 13623740 13222551 12786348 12356702 12084255
19955A2084255l04287l75593l80661l25369l46225k18040k45626k37434l50289
$$ 12084255 11779968 11404375 11023714 10698345 10352120 10134080 9888454 9651020 9300731
19946I300731m17927j86803j44334k54470k31482k80697j35289j33022j25395
$$ 9300731 8882804 8696001 8551667 8297197 8065715 7785018 7649729 7516707 7391312
19937G391312j0144j73144k02621r4365j28129n5832j78371k91794j17370j50325
$$ 7391312 7381168 7208024 7005403 6911038 6782909 6727077 6548706 6256912 6139542 5989217
19927E989217j58355j28488r3189k06651l11016k34975M8621L1389j41607j23109
$$ 5989217 5830862 5702374 5609185 5402534 5091518 4856543 4905164 4936553 4794946 4671837
19917D671837j71678j17622o0033p5514j23564j24272o9902n8827m5789j69941
$$ 4671837 4500159 4382537 4322504 4246990 4123426 3999154 3929252 3870425 3824636 3654695
19907C654695j81083o3888Q712j19437k8745j42665j35601j04129L592P4946p2684
$$ 3654695 3473612 3409724 3418436 3298999 3270254 3127589 2991988 2887859 2891451 2966397 2893713
19896B893713j02277p5472K522m741o8265k3037K762j45620j27279j31421R2682
$$ 2893713 2791436 2715964 2718486 2713745 2645480 2622443 2625205 2479585 2352306 2220885 2313567
19885B313567j9411l9065n5424r7991J0511o6982q6848j3370q3843j43769q9079
$$ 2313567 2294156 2255091 2199667 2101676 2112187 2045205 1958357 1944987 1861144 1717375 1628296
19874A628296R14J18827Q8184o3539j50734j11893l3679l9814j6289Q8421L3945
$$ 1628296 1629210 1748037 1836221 1772682 1621948 1510055 1476376 1436562 1420273 1508694 1542639
19863A542639j73599o8438l9271L3098p7247M5503k0743K7826J35232j3386k7390
$$ 1542639 1369040 1300602 1261331 1294429 1217182 1262685 1241942 1269768 1405000 1391614 1364224
19852A364224j34733l7496m9720r3217P1660j1670P1234j48189j9525P2028K1851
$$ 1364224 1229491 1191995 1142275 1049058 1120718 1109048 1180282 1032093 1012568 1084596 1106447
19841A106447L1700m3634q8990j77207K078Q7780n7161p9877j16259M3712N4257
$$ 1106447 1138147 1094513 1005523 828316 830394 918174 861013 781136 664877 708589 762846
19830G62846K0679m9723J83556n2948j09619O3684q0789j8967r4693l5220J41811
$$ 762846 783525 733802 917358 864410 754791 818475 737686 718719 624026 588806 730617
19819G30617K8749l2843p9122m9552K7490P0232l9736o6455n1374o4214J16108
$$ 730617 759366 726523 647401 597849 625339 695571 655835 589380 538006 473792 589900
19808E89900m8634R788Q752J13020K3531j53349j21973R1364J87185m5099o7811
$$ 589900 541266 551054 559806 672826 696357 543008 421035 512399 699584 654485 586674
19797E86674k7351L3041k4548K5502J28732J0740j24543o5555r9520k9895K04543
$$ 586674 559323 592364 567816 593318 722050 732790 608247 542692 443172 413277 617820
19786F17820O2186L5238n0041q576l3928m8088k0925Q1825J27335j4730N4006
$$ 617820 680006 715244 665203 656627 622699 574611 553686 635511 762846 748116 802122
19775H02122M0358O3655p9317m9377p8735q8484J1700m6246J29933K14559J09522
$$ 802122 842480 906135 826818 777441 698706 610222 621922 575676 705609 920168 1029690
19764A029690r3200j58811k5911J14206J54755Q0217j4417K7496j2167p923J02532
$$ 1029690 936490 777679 751768 865974 1020729 1100946 1086529 1114025 1101858 1093935 1196467
19753A196467p5001K20455K19370J49667M0714M7789l637k19187k10266j25772
$$ 1196467 1121466 1341921 1561291 1710958 1751672 1799461 1795824 1576637 1366371 1240599
19743A240599r4666O4667N0430N9199J62320K08159M5262K00711L03609L86989
$$ 1240599 1145933 1210600 1261030 1320229 1482549 1690708 1735970 1936681 2240290 2627279
19733B627279M07426K96758J99669J75145J76652k0548n5917O6779J98347K15294
$$ 2627279 3034705 3331463 3531132 3706277 3882929 3862381 3806464 3873243 4071590 4286884
19723D286884K47119L11506L09437L27376L09136N29133R31625J382454K113836
$$ 4286884 4534003 4845509 5154946 5482322 5791458 6320591 7252216 8634670 10748506
19714A0748506L320436N145053P280912Q328992Q226685P964720O420616K290362
$$ 10748506 14068942 19213995 26494907 34823899 43050584 51015304 57435920 59726282
19706E9726282m864026n705888O66637N195522P645174R606858Q686780K699557
$$ 59726282 54862256 49156368 49823005 55018527 62663701 72270559 80957339 83656896
19698H3656896o080536n161632j674474k938780q223995p333882j179902K399175
$$ 83656896 77576360 72414728 70740254 67801474 59577479 52243597 51063695 53462870
19690E3462870L541700L644198Q49085n625462j2765389j0844290o076336l515449
$$ 53462870 57004570 60648768 61497853 55872391 43107002 32262712 26186376 22670927
19682B2670927k269437j461562j116627q85632o05265l23677k65117k81179l15201
$$ 22670927 20401490 18939928 17823301 16937669 16332404 16008727 15743610 15462431 15147230
19673A5147230n6266j4235p6311P4090L01909O47779J162029J803922K987598
$$ 15147230 15090964 15076729 15000418 15074508 15376417 16024196 17186225 18990147 21977745
19664B1977745N010905P429926Q783333Q656659Q639685P487320L601310m033943
$$ 21977745 26988650 34418576 43201909 51858568 60498253 67985573 71586883 67552940
19656F7552940p361992q00088M945755P724635R983058R863033M581964n132176
$$ 67552940 60190948 59390860 64336615 72061250 82044308 91907341 96489305 91357129
19648I1357129o321734k343131k679800q346858r508316k653142K102703L553436
$$ 91357129 85035395 82692264 80012464 71665606 62157290 59504148 61606851 65160287
19640F5160287L941088J607234m900143j3675598j3426212q076178m595429k818008
$$ 65160287 69101375 70708609 65808466 52132868 38706656 30630478 26035049 23217041
19632B3217041j922505j386536j091448r15279q33476p38999n86184p41162p66290
$$ 23217041 21294536 19908000 18816552 17901273 17067797 16328798 15742614 15001452 14235162
19623A4235162n90098o47351m69867m34334l15537k44786l74385m57331l88568
$$ 14235162 13645064 12997713 12527846 12093512 11777975 11533189 11158804 10701473 10312905
19614A0312905l35126k41221l07632l37661l69514k77736k24490q9555j82839
$$ 10312905 9977779 9736558 9428926 9091265 8721751 8444015 8219525 8129970 7947131
19605G947131l16349k15593j80726j42629k04356j24086j89667j53234k10395
$$ 7947131 7630782 7415189 7234463 7091834 6887478 6763392 6573725 6420491 6210096
19596F210096j69552q7677k44982k38717j71977p5076j28861j02296L4644q687
$$ 6210096 6040544 5952867 5707885 5469168 5297191 5222115 5093254 4990958 5025602 5016915
19586E016915j67701o9489j41784j94120j72848m7908m9217j16357j46449j78345
$$ 5016915 4849214 4779725 4637941 4443821 4270973 4223065 4173848 4057491 3911042 3732697
19576C732697q1135j00756M3238L7268j06803Q223o9545k2527o7681j31558j59851
$$ 3732697 3651562 3550806 3594044 3631312 3524509 3532732 3463187 3440660 3372979 3241421 3081570
19565C081570k31733j54172k0000m6336j20712j65676l9106O3591P2983j12492
$$ 3081570 2849837 2695665 2675665 2629329 2508617 2342941 2303835 2367426 2440409 2327917
19555B327917j29698j8703k3623q7679j04279p1296J32162n951J2146K3467j05292
$$ 2327917 2198219 2179516 2155893 2068214 1963935 1892639 2024801 2018850 2030996 2054463 1949171
19544A949171k76889p0588J25140l4556l8852m9697p5204O342j35499m4291K7617
$$ 1949171 1672282 1601694 1726834 1692278 1653426 1603729 1528525 1534867 1399368 1355077 1382694
19533A382694J3052K84o2829o82k5222O2490k1919m770j7457q3430l7411n5195
$$ 1382694 1395746 1396030 1333201 1332519 1307297 1369787 1347868 1343098 1325641 1242211 1204800 1149605
19521A149605N5098M0089j3981n4397m4097n4035q4962J5764k0912K705j3118
$$ 1149605 1204703 1244792 1230811 1176414 1132317 1078282 993320 1009084 988172 990877 977759
19510I77759o0049R8980R7870m2508m9973L0681k6856k2567P6567m5058N3051
$$ 977759 917710 1016690 1114560 1072052 1022079 1052760 1025904 1003337 1079904 1034846 1087897
19499A087897Q6982J6006J37878J3881p4629l05n9239j16665q183J53550J45943
$$ 1087897 1174879 1190885 1328763 1342644 1268015 1267710 1208471 1091806 1083623 1237173 1383116
19488A383116J31430J36946P288r362N3454r8523k02966j45675o0132q1441M8678
$$ 1383116 1514546 1651492 1658780 1649418 1702872 1604349 1401383 1255708 1195576 1114135 1162813
19477A162813Q1493Q1203j45527j765l3608j40344p110N6034o422o8162j38605
$$ 1162813 1244306 1325509 1179982 1178217 1144609 1004265 997155 1053189 1046767 978605 840000
19466H40000j17230n6801R4464Q2615j50591r5917M7853O4347j7968j10989L9613
$$ 840000 722770 665969 760433 843048 692457 596540 644393 708740 690772 579783 619396
19455F19396n8950p9094O6174N2615p9793q1096O5038k6426J3052K2808J9457
$$ 619396 560446 481352 547526 600141 520348 439252 504290 477864 490916 513724 533181
19444E33181L4312N31j22417j47310n441J35794K3421L6352J1079j20215j8507
$$ 533181 567493 568024 445607 298297 292856 428650 452071 488423 499502 379287 360780
19433C60780N5020j6619J39921M6160l4406j234l2138K1801J00357Q8596o1588
$$ 360780 415800 399181 539102 585262 550856 549622 517484 539285 639642 728238 666650
19422F66650L9728r9610j3822j1446j5781K4076N3283N5790J619l8458K963l7484
$$ 666650 706378 606768 592946 581500 565719 589795 643078 698868 700487 662029 664992 627508
19410F27508P8878R2198n8043j84749k9816j33948p7306J06987m2227o7901N6294
$$ 627508 706386 798584 740541 555792 525976 392028 314722 421709 379482 311581 367875
19399C67875O1641O9398P1469K277K6359o80K9740l8243K0060Q4529J64799J49562
$$ 367875 429516 498914 570383 572660 599019 598339 628079 589836 609896 694425 859224 1008786
19387A008786p4594j40310J35545R6051l6472O2267P2290j33254R528J17834J38905
$$ 1008786 934192 793882 929427 1025478 989006 1051273 1123563 990309 999837 1117671 1256576
19376A256576K6066j6945J8483r6858n4770J4617N6558L8815j83431n5729O9353
$$ 1256576 1282642 1265697 1284180 1187322 1132552 1147169 1203727 1242542 1059111 1003382 1072735
19365A072735J12858l9819p5909k7904K7439j05589j3764j25624p097j761j46147
$$ 1072735 1185593 1145774 1069865 1041961 1069400 963811 950047 824423 817326 815565 669418
19354F69418o7255n5980k5984P0730l4632l1369l2206n194n7806p93N5475N921
$$ 669418 602163 546183 520199 590929 556297 524928 492722 487528 429722 428929 484404 490325
19342D90325M8493J06507R119m5517M9170r7110j09787L8939J10752J05884p9501
$$ 490325 538818 645325 654444 608927 658097 560987 451200 490139 600891 706775 627274
19331F27274j31199r4027L7099L164l5333L8782M0405J10005l0007q8975k9130
$$ 627274 496075 402048 439147 442311 406978 445760 486165 596170 566163 477188 448058
19320D48058n49j552j16892n8630O5940j4531J21260K2618j9668m3140Q4199Q1397
$$ 448058 447509 445957 329065 270435 336375 321844 443104 465722 446054 402914 487113 568510
19308E68510J7465K3065P4566L8341j43459j58301J69067n2745K7970O448j3607
$$ 568510 585975 609040 683606 721947 578488 420187 589254 536509 564479 570927 557320
19297E57320j20473p1490L2499o4726J13045J69698J34345m2295l5459L847n3899
$$ 557320 436847 365357 397856 333130 446175 615873 750218 707923 672464 676311 622412
19286F22412r628J02567J04719N2959Q9243J39796J0385Q3738J11277j19657k2208
$$ 622412 612784 715351 820070 873029 962272 1102068 1112453 1196191 1307468 1187811 1165603
19275A165603J1348K4475m4095J4064n1772j30695J9711K5021R0516J21491m009
$$ 1165603 1176951 1201426 1157331 1171395 1119623 988928 1008639 1033660 1124176 1245667 1241658
19264A241658k1595O0869J07227M0968L8466j5236L7784L2425J68100J52885K3859
$$ 1241658 1220063 1280932 1388159 1429127 1467593 1452357 1490141 1522566 1690666 1843551 1867410
19253A867410O0014J22320P4953J11447J14214O3947K36366K11909L46587J88608
$$ 1867410 1927424 2049744 2124697 2236144 2350358 2414305 2650671 2862580 3209167 3397775
19243C397775K59377J82548K62019J59053L13251M82945N25516P66385J074206
$$ 3397775 3657152 3839700 4101719 4260772 4574023 5056968 5582484 6348869 7423075
19234G423075J535382K144919L267380N118740O871761P610151P930569P743373
$$ 7423075 8958457 11103376 14370756 19489496 26361257 33971408 41901977 49645350
19226D9645350O265086K158815l742652l881858K167410P260874J0382339J1223846
$$ 49645350 55910436 58069251 54326599 50444741 52612151 59873025 70255364 81479210
19218H1479210Q539877J919061n787074q728140j0455096r395554l586018Q73264
$$ 81479210 90019087 91938148 86151074 77422934 66967838 57572284 53986266 54859530
19210E4859530K810027L210955J310265m051289j0753856j1039278o934485m159547
$$ 54859530 57669557 60880512 62190777 58139488 47385632 36346354 29411869 25252322
19202B5252322k767970j829844j174961p51190k76873j15658P2550K14367K30080
$$ 25252322 22484352 20654508 19479547 18728357 18451484 18335826 18408376 18622743 18852823
19193A8852823K54748K58234J11848K01369M72517P43034J135868J333173J967201
$$ 18852823 19107571 19365805 19477653 19679022 20151539 20894573 22030441 23363614 25330815
19184B5330815K998763M635179O901443Q733753R383855R370253Q706979N464873
$$ 25330815 28329578 32964757 39866200 48599953 57983808 67354061 76061040 81525913
19176H1525913j381736n915433q53403O764438J1902069J4888337J4464749R944145
$$ 81525913 80144177 74228744 73375341 80139779 92041848 106930185 121394934 131339079
19168A31339079K072253k571611j849288J429008J2524865K3992818K7796562
$$ 131339079 133411332 130839721 128990433 130419441 142944306 166937124 194733686
19161A94733686K6835478K0704538L483223k6938448n1391739m4852755k8053767
$$ 194733686 221569164 242273702 245756925 218818477 167426738 122573983 94520216
19154I4520216j6712793j0156756o156539l664056j946828j18481J468639L404638
$$ 94520216 77807423 67650667 61494128 57830072 55883244 55764763 57233402 60638040
19146F0638040O346051J0864438J7115941K3322336K6060919K4874945K1742987
$$ 60638040 66984091 77848529 94964470 118286806 144347725 169222670 190965657
19139A90965657J3341713m771830l0509758m2023688l1966588j9777070j2155453
$$ 190965657 204307370 199535540 169025782 127002094 95035506 75258436 63102983
19132F3102983p759241n133497l866820l231780k558633k286858k317548k176480
$$ 63102983 55343742 50210245 46343425 43111645 40553012 38266154 35948606 33772126
19124C3772126j896521j569901j356994j189260r95266q97368q29026o59892o76754
$$ 33772126 31875605 30305704 28948710 27759450 26764184 25866816 25037790 24377898 23701144
19115B3701144m62755m21766k40436r6188j86894k44555l52250l19179m25018
$$ 23701144 23238389 22816623 22576187 22479999 22293105 22048550 21696300 21377121 20952103
19106B0952103p84403j141078j058014q04462p83793n54400m90857l58996k47790
$$ 20952103 20167700 19026622 17968608 17164146 16380353 15825953 15335096 14976100 14728310
19097A4728310j91540m16247k13832j68732K5286J071J9717j12224j64619j75115
$$ 14728310 14536770 14120523 13906691 13737959 13763245 13764316 13784033 13671809 13507190 13332075
19087A3332075k42758m17170p82952o81772m87195m76721l26767k95899l34210
$$ 13332075 13089317 12672147 11889195 11207423 10720228 10243507 9916740 9620841 9286631
19078I286631l20835j63256j15497j75885k17540j11362q6107j37563j29022K10003
$$ 9286631 8965796 8802540 8687043 8511158 8293618 8182256 8096149 7958586 7829564 8039567
19068H039567J8351r1531r1154j22846l68445o10201l69399j73565j82483q7067
$$ 8039567 8057918 7966387 7875233 7752387 7383942 6773741 6404342 6230777 6048294 5961227
19058E961227j53436k00431k58965k19953j65578m7056j34307k01406l9367l9780
$$ 5961227 5807791 5607360 5348395 5128442 4962864 4915808 4781501 4580095 4540728 4500948
19048D500948r0658j63227j86620j08912l53l1520n0971q235J1171j19835j24524
$$ 4500948 4410290 4247063 4060443 3951531 3951178 3919658 3868687 3860452 3871623 3751788 3627264
19037C627264m0211j19986j27368m5383j09461o8902M7749k4952j60916j27498
$$ 3627264 3587053 3467067 3339699 3294316 3184855 3115953 3163702 3138750 2977834 2850336
19027B850336j17569j5802j9565k25068j12295j26402q9499Q1447R363q8215j07228
$$ 2850336 2732767 2716965 2697400 2472332 2360037 2233635 2144136 2225583 2234946 2146731 2039503
19016B039503M2192P0742N5618L0320k9645j9250j85631j36470P2288O5689m8825
$$ 2039503 2081695 2152437 2208055 2238375 2208730 2189480 2003849 1867379 1939667 2005356 1956531
19005A956531l5735m5450q2463M1820k2872J4656j45110k9510k6495j20934k3967
$$ 1956531 1920796 1875346 1792883 1834703 1811831 1826487 1681377 1651867 1625372 1504438 1480471
18994A480471j09818j37625k3690o5569o965J2465K0487J56923l5768p9254L1839
$$ 1480471 1370653 1233028 1209338 1143769 1136804 1149269 1169756 1326679 1290911 1211657 1243496
18983A243496Q8446R7331r6179j01266m515j75198j83424q516J5124R172n6260
$$ 1243496 1331942 1429273 1333094 1231828 1227313 1052115 868691 860175 875299 884471 828211
18972H28211j04958N9152K9436o6157o902O7793n355o1342o7653l3649J18274
$$ 828211 723253 782405 811841 745684 738782 806575 801220 739878 672225 638576 756850
18961G56850J41108O4381P0662J64893L07484K58248O1080Q9938M7817k16468
$$ 756850 897958 962339 1033001 1197894 1505378 1763626 1824706 1914644 1962461 1745993
18951A745993l30008j82545j25500j41605J1658j49263j53293K1528N1012Q063
$$ 1745993 1415985 1233440 1107940 966335 977993 828730 675437 696965 747977 756040
18941G56040j6107R7522J58610n3342N368J08760J92659J39696J16813j03675
$$ 756040 739933 837455 996065 942723 948091 1056851 1249510 1389206 1506019 1402344
18931A402344k38594k25401j36258J6257l8269k0374K1500k1214o1463k41123
$$ 1402344 1163750 938349 802091 818348 780079 759705 781205 759991 698528 457405
18921D57405j27P0465N6008O3686n0755r7877m1573L0215J36995q7873l2689O076
$$ 457405 457278 527743 583751 647437 596682 498805 457232 487447 624442 536569 503880 509956
18909E09956l7310o0558j7442m6255j1531L7582J11065l937j4557O1003L4201
$$ 509956 472646 412088 394646 348391 336860 374442 485507 481570 467013 528016 562217
18898E62217n6941p6248J8558p3569k8023R249J19880P6513n3655j24214K8434
$$ 562217 505276 429028 447586 374017 345994 355243 475123 551636 497981 373767 402201
18887D02201L431o2566o9516L9022O8886L0355K7141l9126O3315p1759k0506K1429
$$ 402201 405632 343066 273550 312572 381458 411813 438954 399828 463143 391384 370878 392307
18875C92307j9870o1757M3267o6o8251L0844o2601Q6267J85639Q7881k6963j10095
$$ 392307 372437 310680 353947 353881 285630 316474 253873 340140 525779 613660 586697 476602
18863D76602q0398j3654j4957j13845j560j3234J01937L7271r3034k9788K5239
$$ 476602 396204 382550 367593 253748 252188 238954 340891 378162 285128 255340 280579
18852B80579L7918o206L2544l7716N4613J3022j9249J3566J615j03204J0060K0280
$$ 280579 318497 312291 344835 307119 361732 374754 355505 369071 370686 267482 277542 297822
18840B97822r913O8047k6272J12080K9628l9328M0343L860j1426n4768k228L5960
$$ 297822 287909 355956 329684 441764 471392 432064 472407 476267 464841 410073 407845 443805
18828D43805M2976j9885Q832N5839n5311j50860J6581R4466J91531n448p1710
$$ 443805 486781 466896 475728 531567 476256 325396 341977 436443 627974 622526 550816
18817E50816j48386M4718J92990K9345j07267L689O2523j9771j75755r5056J44972
$$ 550816 402430 447148 640138 669483 562216 565905 628428 608657 432902 337846 482818
18806D82818K32335J22774n0458j69863j4960J7447J4056L0545J71938n0306j8520
$$ 482818 715153 837927 787469 617606 602646 620093 634149 664694 836632 786326 767806
18795G67806k7776k0908l4981R8477K15943M1813l62q0236j34947q9312J53225
$$ 767806 740030 719122 684141 782618 998561 1040374 1040012 959776 824829 735517 888742
18784H88742M8924p3566M840N7396O8659J40444l449M5984J41956K94341K82036
$$ 888742 937666 864100 868940 926336 994995 1135439 1131990 1177974 1319930 1614271 1896307
18773A896307K49638L31108J53598J51497K08867R4545m0549j22016j36693j7192
$$ 1896307 2145945 2477053 2630651 2782148 2991015 3085560 3045011 2922995 2786302 2769110
18763B769110O3502J14943K59431L17829N17147P61379J031620J380635J981705
$$ 2769110 2832612 2947555 3206986 3524815 4041962 4803341 5834961 7215596 9197301
18754I197301K868267M504749O571541Q304043J0071063J2569252J3354061J1286901
$$ 9197301 12065568 16570317 23141858 31445901 41516964 54086216 67440277 78727178
18746G8727178O151388K917151Q37972o716039j3059939j1194465r811479j1954080
$$ 78727178 84878566 87795717 88633689 81917650 68857711 57663246 47851767 35897687
18738C5897687r195344n416460l275598k273381j635241j224114q64739n70744
$$ 35897687 26702343 21285883 18010285 15736904 14101663 12877549 12012810 11442066
18730A1442066n12340l51667k75537j85044P7213P6213L2596O0928J05134J28745
$$ 11442066 10929726 10578059 10302522 10117478 10194691 10270904 10303500 10364428 10469562 10598307
18720A0598307J9277m4964l17646k77593k36655j30550J20051K10343J42571L82640
$$ 10598307 10617584 10572620 10254974 9977381 9740726 9610176 9730227 9940570 10083141 10465781
18710A0465781Q26837J241626J683166K379663L602310N475323Q162120J1456313
$$ 10465781 11292618 12534244 14217410 16597073 20199383 25674706 33836826 45293139
18702D5293139J4627963J7975059K1624650K2308454J7863419R490940M572996
$$ 45293139 59921102 77896161 99520811 121829265 139692684 149183624 153756620
18695A53756620q21334j3724331k2008303j9144665j7959704j9882631j4823721
$$ 153756620 152935286 139210955 117202652 98057987 80098283 60215652 45391931
18688D5391931q743240n461165l618990k595626j953031j644462j457673j106513
$$ 45391931 36648691 31187526 27568536 24972910 23019879 21375417 19917744 18811231
18680A8811231q87182o67151n10383j91313l5471o9425J12785J13452j86459m15540
$$ 18811231 17924049 17256898 16746515 16555202 16519731 16450306 16563091 16676543 16490084 16074544
18670A6074544n30304n23680n36502m47152m20387m12372k61916l82209l08783
$$ 16074544 15544240 15020560 14484058 14036906 13616519 13204147 12942231 12560022 12251239
18661A2251239j10463R1822M52825Q98537J295500K288997L757651N051996O324686
$$ 12251239 12140776 12232598 12685423 13583960 14879460 17168457 20926108 25978104 32302790
18652C2302790P986256R820280R659122P205435L074065J588073j125531p614615
$$ 32302790 40289046 50109326 59768448 66973883 70047948 71636021 70510490 62895875
18644F2895875j0153399p721188q011259q744721n890507l479109k275856j606171
$$ 62895875 52742476 45021288 37010029 28265308 22374801 18895692 16619836 15013665
18636A5013665j107842q03132p96482o67147n50680n47275m94262k93619j65684
$$ 15013665 13905823 13102691 12306209 11639062 11088382 10541107 10046845 9753226 9587542
18627I587542k49494k26699k16591j58642k11469j91314j81398l05495k52698
$$ 9587542 9338048 9111349 8894758 8736116 8524647 8333333 8151935 7846440 7593742
18618G593742q9114k65838l95641l02951k78275k01352k69773j82501m0943j06756
$$ 7593742 7504628 7238790 6843149 6540198 6261923 6060571 5790798 5608297 5567354 5460598
18608E460598j72327j36052o1091j10148k16450k06542m613M1943p6499j81943
$$ 5460598 5288271 5152219 5091128 4980980 4764530 4557988 4553375 4595318 4518819 4336876
18598D336876p3710N2667r0163m3330r0733j35396l6507n1038q3146k342j63783
$$ 4336876 4263166 4315833 4225670 4182340 4091607 3956211 3919704 3868666 3785520 3783178 3619395
18587C619395k03275j46564j42234K1155q6351j37911r1704n0335n9879K4771
$$ 3619395 3416120 3269556 3127322 3148477 3062126 2924215 2832511 2782176 2722297 2747068
18577B747068j39827r5041o2714j693r707M7989Q0479n1174L885N8636j1853J04600
$$ 2747068 2607241 2512200 2449486 2447793 2438086 2486075 2566554 2515380 2519265 2577901 2566048 2670648
18565B670648O5641P9099M1877q4323k19120k06830Q5206l5975n1826p8818j6896
$$ 2670648 2736289 2815388 2857265 2772942 2553822 2346992 2432198 2396223 2344397 2265579 2248683
18554B248683j02473M725k4481q0900M3220R1039P2033K00629K40239k7571m6124
$$ 2248683 2146210 2150935 2126454 2045554 2088774 2179813 2251846 2452475 2692714 2665143 2619019
18543B619019J03787J07039j05612l38952k34173k80644j19979J13912j03666
$$ 2619019 2722806 2829845 2724233 2385281 2151108 1870464 1750485 1864397 1760731
18534A760731l05536r5542p6596r3152m9335L1579O6451J901M6789Q6060N652
$$ 1760731 1455195 1359653 1283057 1189905 1140570 1172149 1238600 1240501 1287290 1373350 1379002
18523A379002j92963j80846k2998k1809p5690m0139k3374M2977O4248R421p4656
$$ 1379002 1186039 1005193 982195 960386 884696 844557 821183 864160 928408 937829 863173
18512H63173n5798J10587L7515n2076j65891j08065m9706L9233Q3321O356l6106
$$ 863173 807375 917962 955477 903401 737510 629445 579739 618972 702293 708649 672543
18501F72543L8558o3387J0266o2902P79l4974o274Q5666Q4455l4312p1623l8583
$$ 672543 711101 647714 657980 595078 595857 560883 554609 640275 724730 690418 618795 580212
18489E80212j38456K2605Q9253J57991M4637l3471p0620j03732K0513J22891N5472
$$ 580212 441756 464361 553614 711605 756242 722771 652151 548419 568932 691823 747295
18478G47295k0274m5063q628k6127l5893o0263R2842O6825J319p7011j88521J487
$$ 747295 727021 681958 673330 647203 611310 551047 643889 710714 712033 635022 446501 447988
18466D47988m797O0010J4355M6581O2412M7225j25449O3263K3558P2584L5813
$$ 447988 443191 503201 517556 564137 626549 673774 548325 611588 635146 707730 743543
18455G43543L864j0812P1411J46478J62294J16260J38084j36037k22309P2670
$$ 743543 747407 736595 808006 954484 1116778 1233038 1371122 1235085 1012776 1085446
18445A085446N7085j25687j35294j37907j13847k2898R5655j11103P4886N014
$$ 1085446 1142531 1016844 881550 743643 629796 606898 702553 591450 666336 671350
18435F71350R419J7246J84256L9730j45225o4512N5876J01834j7113l2504L6953
$$ 671350 680769 698015 882271 922001 776776 712264 768140 869974 852861 820357 857310
18424H57310L1897j10425Q0465J54847J9588q1556k6289J10633L2783J54449K49831
$$ 857310 889207 778782 859247 1014094 1033682 952126 925837 1036470 1069253 1223702 1473533
18413A473533M16294L73897L05591K97704L23916J50199j49702m44240l20134
$$ 1473533 1889827 2263724 2569315 2867019 3190935 3341134 3191432 2747192 2427058
18404B427058p3277p0596J12287J17985o747j40465q5837J28076O1786k1487R4820
$$ 2427058 2353781 2283185 2395472 2513457 2506710 2366245 2280408 2408484 2470270 2448783 2543603
18393B543603K82150K38383K98449K82019L63603R8909p9345l33427l67480p3983
$$ 2543603 2825753 3064136 3362585 3644604 4008207 4107116 4027771 3694344 3326864 3252881
18383C252881J46403K66719L08701M16116N15057M47271L93924K73557r931J4691
$$ 3252881 3399284 3666003 3974704 4390820 4905877 5353148 5747072 6020629 6010698 6025389
18373F025389L12424M38820N89843R95719J530071K195535L041212M434910O871593
$$ 6025389 6337813 6776633 7366476 8362195 9892266 12087801 15129013 19563923 26435516
18364B6435516J1092886J8541326K7784574L3485756L3027410L1317283K5703007
$$ 26435516 37528402 56069728 83854302 117340058 150367468 181684751 207387758
18357B07387758P412031k9699825n7947778m4324439k3527195j2633376p266371
$$ 207387758 214799789 185099964 127152186 82827747 59300552 46667176 39400805
18350C9400805m070047k358362q75223N67442J862607L629719O559728J1960478
$$ 39400805 35330758 32972396 32097173 32664615 34527222 38156941 44716669 56677147
18342E6677147K0291736K8586797L1533471K9818526K7474534J7929780o332598
$$ 56677147 76968883 105555680 137089151 166907677 194382211 212311991 205979393
18335B05979393m4684178n4701696l4064715j7868548j0120355o085994m102862
$$ 205979393 161295215 106593519 72528804 54660256 44539901 38453907 34351045
18328C4351045l127182k373624j912734j609090j260601j236484j134099q52427
$$ 34351045 31223863 28850239 26937505 25328415 24067814 22831330 21697231 20844804
18320B0844804o83595m08665k46512k48781m25130n51839q90321j058241r42497
$$ 20844804 20161209 19752544 19506032 19257251 18832121 18280282 17389961 16331720 15389223
18311A5389223o95957m82675l99616k85785k70794l54241n38689m66697m03502
$$ 15389223 14693266 14210591 13810975 13525190 13254396 12900155 12361466 11894769 11491267
18302A1491267l79006l45488k74785k80220k51982k94844k59559k07682l40146
$$ 11491267 11112261 10766773 10491988 10211768 9959786 9664942 9405383 9197701 8857555
18293H857555k99728k93488j90897j64235j68787j48240k67990j80438j80656
$$ 8857555 8557827 8264339 8073442 7909207 7740420 7592180 7324190 7143752 6963096
18284F963096k17573j94277o9005r9591m7950j94147n0846o3027p5548o0655k13315
$$ 6963096 6745523 6551246 6482241 6382650 6334700 6140553 6089707 6026680 5951132 5890477 5677162
18273E677162j71529p4117j52522j92590k59428j29840j78089j67604j44962r9845
$$ 5677162 5505633 5431516 5278994 5086404 4826976 4697136 4519047 4351443 4206481 4106636
18263D106636l3997l7018k6388j11520j5897p4600j10335j26560o4656j41050
$$ 4106636 4072639 4035621 4009233 3897713 3881816 3807216 3696881 3570321 3505665 3364615
18253C364615p4554j57966k6088m5283j57470J7958j9120K0251M5859l3353p8194
$$ 3364615 3290061 3132095 3106007 3060724 2903254 2921212 2902092 2922343 2968202 2934849 2856655
18242B856655M1776J00792Q9331J07100K34038K52466N5784k90453l88843k07314
$$ 2856655 2898431 2999223 3088554 3195654 3429692 3682158 3737942 3447489 3058646 2851332
18232B851332j9418n2921k3392k834O551p0733K949j24000p6618M154k4857Q2638
$$ 2851332 2831914 2778993 2755601 2752767 2759318 2688585 2691534 2567534 2490916 2495070 2470213 2552851
18220B552851L4667J02775Q5935J78896R0072j63548l51158j99095j89804j53773
$$ 2552851 2587518 2690293 2776228 2955124 3045196 2881648 2530490 2331395 2141591 1987818
18210A987818m3199p5918p7334o7224O318o0823r5249j09333j15896j13808O818
$$ 1987818 1944619 1868701 1791367 1724143 1730461 1669638 1574389 1465056 1349160 1235352 1242170
18199A242170J07920p2173J18866j912j19958J5428n6837j03447R579l462o236
$$ 1242170 1350090 1277917 1396783 1394871 1274913 1290341 1233504 1130057 1139636 1136174 1129938
18188A129938o2682l417J62840l2491J07229M0220R1899l4519Q0988J46854J01152
$$ 1129938 1067256 1063839 1226679 1194188 1301417 1341637 1433536 1399017 1480005 1626859 1728011
18177A728011m9788q9430m3850r0964j44494j44286m003j02225k65572r7494J67673
$$ 1728011 1678223 1588793 1544943 1453979 1309485 1165199 1161196 1058971 793399 695905 863578
18166H63578R7015o2566r0379j24759J0263L8897j0737P4238L6665j31741j52467
$$ 863578 960593 898027 807648 682889 693152 732049 721312 795550 832215 700474 548007
18155E48007o8240M1090R0073K4222O914N3392J11141Q7514Q4873n4956j30737
$$ 548007 479767 520857 610930 635152 642066 695458 806599 894113 978986 924030 793293
18144G93293m5507J5389o361j020J76712O0669J15721J41305J7263n7118P5777
$$ 793293 747786 763175 756814 755794 932506 993175 1108896 1250201 1267464 1210346 1286123
18133A286123P9480J95582K53149J99484R5650J21724K34040L13180K53603L88450
$$ 1286123 1365603 1561185 1814334 2013818 2109468 2231192 2465232 2778412 3032015 3420465
18123C420465L60613O68327R26358J438197J937892K746905M411316P468454J2897351
$$ 3420465 3781078 4449405 5375763 6813960 8751852 11498757 15910073 23378527 36275878
18114C6275878J8968085K0837896J8880049J8805658J2840350q69261l3616156
$$ 36275878 55243963 76081859 94961908 113767566 126607916 125738655 92122499
18107I2122499l7834697j9185886r352641n296621l280467k116899j575225j280316
$$ 92122499 54287802 35101916 25749275 20452654 17172187 15055288 13480063 12199747
18099A2199747q10713o90386o77586p39252n73213n48133m56961l51567m25595
$$ 12199747 11389034 10698648 10021062 9281810 8708597 8160464 7703503 7351936 6926341
18090F926341l30963j11479k75197k93783j00973q4676o3757j88158j30966K286
$$ 6926341 6595378 6483899 6208702 5914919 5813946 5729270 5665513 5477355 5346389 5348675
18080E348675j05702j85257j77027k99030k88163k55971j09479o0584o4994o7344
$$ 5348675 5242973 5057716 4880689 4581659 4293496 4037525 3928046 3867462 3802468 3735124
18070C735124q8164q9257n9311r6685k07110j18790M907j04887j31352q4459M757
$$ 3735124 3646960 3557703 3498392 3401707 3194597 3075807 3080714 2975827 2844475 2760016 2764773
18059B764773n1396p9301j04419p8960j13178j31269p5182k2301p4116J19644
$$ 2764773 2713377 2634076 2529657 2450697 2337519 2206250 2131068 2108767 2034651 2154295
18049B154295J7885p6339j03017j37696j6525k9441m3080o0207k6640N7260N0036
$$ 2154295 2172180 2095841 1992824 1855128 1838603 1809162 1766082 1705875 1679235 1736495 1786531
18038A786531P7715K941j15292j33945j08484m4031L9412l9284n3731j34272j13109
$$ 1786531 1864246 1867187 1751895 1617950 1509466 1465435 1504847 1465563 1411832 1277560 1164451
18027A164451q6382l5422o3847K8227J24277o4967j08061j78276k6956O3585M7285
$$ 1164451 1078069 1042647 978800 1007027 1131304 1066337 958276 780000 753044 816629 863914
18016H63914K6467j2248P7047J41027K8365j14002o0572L7499n6202Q99M2260
$$ 863914 890381 878133 955180 1096207 1124572 1010570 949998 987497 931295 932194 974454
18005I74454p6925j36515j39469n7030L5010J4308j12534l6219L0034Q5896P674
$$ 974454 897529 761014 621545 564515 599525 613833 501299 465080 495114 581010 588684
17994E88684j15718j38634M9172K018N2761R3648k7338k1790o0483r0088j1403
$$ 588684 472966 334332 383504 385522 438283 531931 504593 482803 422320 332232 320829
17983C20829J34394J14117o0931o9030q5028K8858J5347j25617O4376J41940n9015
$$ 320829 455223 569340 508409 439379 354351 383209 398556 272939 337315 479255 420240
17972D20240l5709k4947N118r8474p0136R1332J5731N3483l4794K1839m3838j55811
$$ 420240 384531 359584 364702 266228 196092 287424 303155 356638 321844 343683 299845 144034
17960A44034l0368j2422R729j19211p8992J11259J33409J17594J30057q7528j18075
$$ 144034 113666 101244 110973 -8238 -87230 24029 157438 275032 405089 317561 199486
17949A99486K9208j03497j78508m4231Q8070O4580K9281J5268R7855R2339q0707
$$ 199486 228694 125197 -53311 -97542 -9472 55108 84389 99657 197512 289851 209144
17938B09144m2679M1418J3650j03348j90184L7656Q1178m384m0544l3264P866
$$ 209144 166465 207883 221533 118185 -71999 -34343 46835 42451 1907 -31357 -23491
17927b3491R1816M6747L0192J21473r7643j11271m2715j8477L2371k1805o4503
$$ -23491 68325 115072 145264 266737 169094 57823 15108 -3369 29002 7197 -57306
17916e7306Q438J27449M8581J3843j8670p9876n8529j62268m2803O1131Q5616
$$ -57306 -48868 78581 127162 141005 122335 42459 -16070 -178338 -221141 -160010 -74394
17905g4394l366K4309J24237J07975P5621q0839j36466k2812o1335k5385K14889
$$ -74394 -77760 -53451 70786 178761 254382 173543 37077 14265 -47070 -72455 142434
17894A42434J16614l1529j1960R8972l4688j81159j20139L4969L3882o791K0297
$$ 142434 259048 227519 215559 314531 279843 98684 -21455 13514 47396 40605 60902
17883F0902J3862p6530m5858l3586J8321K8527P2841P4853O1364k5867n6037r8877
$$ 60902 74764 -1766 -47624 -81210 -62889 -34362 38479 113332 174696 148829 92792 -6085
17871f085n502M3366J18264J86598j39232k04308j64552J8097J85591Q5523j7220
$$ -6085 -11587 31779 150043 336641 197409 -6899 -171451 -153354 32237 117760 100540
17860A00540p6448N1011M7052n9091l5876J6813R553j54466K9037n9038P4346
$$ 100540 24092 75103 122155 63064 27188 44001 53554 -100912 -71875 -130913 -56567
17849e6567M0375o1664L896P7461K9801l7053k3847O2272M0373P231k2272j01169
$$ -56567 -16192 -77856 -73960 3501 33302 -3751 -27598 34674 75047 82278 60006 -41163
17837d1163l6393m2115j5650k8094M2833J52963R3538k2119j55417l9899P2795
$$ -41163 -77556 -119671 -135321 -163415 -120582 32381 125919 103800 -51617 -91516 -18721
17826a8721M3588J25691j0545j27262K03678J12075j19121j11392m0875K0124
$$ -18721 24867 150558 140013 12751 216429 328504 209383 97991 57116 77240
17816G7240j25770j64802R6346J06921J9807K8486P6029j05827j77489J8025k1630
$$ 77240 -48530 -213332 -116986 -10065 9742 38228 114257 8430 -169059 -151034 -172664
17805a72664j2593P5579J2800j5750J8248K08653j4456k9311j48550j22383J00522
$$ -172664 -185257 -109678 -96878 -112628 -94380 114273 99817 70506 -78044 -200427 -99905
17794i9905J10242k3370k1836l9326j38946N7767J15116N2894L8077k6745p6097
$$ -99905 10337 -13033 -34869 -74195 -213141 -155374 -40258 12636 50713 23968 -52129
17783e2129P7379o7758l4919M0545j65277j6042J39482J18852o3349l2022M6108
$$ -52129 25250 -42508 -77427 -36882 -202159 -218201 -78719 40133 -23216 -55238 -9130
17772i130K5951K8405J07956p8971r3519o246p7681j4381Q5891L0530J1561j49817
$$ -9130 16821 45226 153182 74211 -19308 -25554 -103235 -117616 -31725 -1195 10366 -139451
17760a39451K9746J33428J53546K09152K98988J41954J68566R7126j520j59690
$$ -139451 -109705 23723 177269 386421 685409 827363 995929 1093055 1091535 931845
17750I31845k07751j73971l9208o9216j19988j72732K1886O7952k534l7171M3221
$$ 931845 724094 550123 510915 441699 321711 148979 170865 238817 236283 199112 242333
17739B42333O8862r400J05321R7695J36541P3031K52970K36821p444k50853l33000
$$ 242333 311195 301795 407116 504811 641352 714383 967353 1204174 1196730 945877 612877
17728F12877k09369j04403o5650j25005j08524j29399R8615R6688j9549q5286
$$ 612877 403508 299105 233455 108450 -74 -129473 -30858 65830 46281 -39005
17718c9005K1368l2364j4379o584n4895J03326J12615j2885J21031m7518j44497
$$ -39005 -17637 -50001 -64380 -70964 -125859 -22533 90082 77197 198228 150710 6213
17707F213K3347J19296k4355j02665P4342L3590n0803N828q9654p4957l6135Q8078
$$ 6213 29560 148856 124501 21836 96178 129768 78965 84793 -4861 -79818 -115953 -27875
17695b7875j608o3196n9438L8864J65437P5762j5273N8142r6877j40328q1663
$$ -27875 -29483 -92679 -152117 -113253 52184 127946 112673 170815 73938 -66390 -148053
17684a48053m736L7219J10643l4726l0024J47775o4464m0102q1791k4372P3012
$$ -148053 -152789 -115570 -4927 -39653 -69677 78098 13634 -26468 -108259 -132631 -59619
17673e9619l610k7261M7903n6610M9924j04302j3424k392L1192N9921Q5214K8452
$$ -59619 -63229 -90490 -42587 -99197 -49273 -153575 -166999 -169391 -138199 -78278 6936 35388
17661C5388M0663n7645n3709k9991K7765j8276K3440j15326P766J39253O7175
$$ 35388 76051 18406 -35303 -65294 -37529 -55805 -32365 -147691 -139925 -672 66503
17650F6503j27431L6775Q5230M7154r8124K2477L1226J38525O6538j33128l3386
$$ 66503 -60928 -24153 61077 108231 10107 32584 63810 202335 268873 135745 102359
17639A02359N6199L9205r0055L4222O9943l0739K764l5477m3234m7712Q026R2483
$$ 102359 158558 197763 107708 141930 211873 181134 183898 148421 105187 57475 65501 157984
17627A57984j32535M3305R4211m5811J1431J2101N01j02995k00397K8332k7975
$$ 157984 25449 68754 162965 117154 128585 140686 141187 38192 -162205 -133873 -161848
17616a61848R5555P8170L3628L0726o8907N6976J11607k7882m9216r5054j56420
$$ -161848 -66293 11877 45505 76231 7324 64300 175907 148025 98809 3755 -152665
17605a52665j8273J24542J22297Q9504o9471j9898m5683j06788o2503m6857L7503
$$ -152665 -170938 -46396 75901 165405 95934 76036 30353 -76435 -138938 -185795 -148292
17594a48292J52112J5927j48558o7765K6032L5771L5471K8227J36826p2507k9165
$$ -148292 3820 19747 -128811 -196576 -170544 -134773 -99302 -71075 65751 -6756 -35921
17583c5921J27553O3943l6648r6103j05265O5559J73418L0412j02665P79M8456
$$ -35921 91632 155575 118927 22824 -82441 -16882 156536 186948 84283 85062 133518
17572A33518r1839L5095q6130j39618K6683J35154k7702n2829Q8851m8093k6609
$$ 133518 41679 76774 -9356 -148974 -122291 12863 -14839 -67668 21183 -26910 -53519
17561e3519j7094O2453J5561k7630K4621O8241n4367M3366k7454p2272J1254M665
$$ -53519 -70613 -8160 7401 -20229 4392 72633 18266 61632 34178 -38094 -26840 -22175
17549b2175J7651O01r5908M03j9819K70n8680J15291L2126K6383j13022N894N4215
$$ -22175 -4524 -3923 -99831 -99428 -119247 -118977 -177657 -62366 -30240 -3857 -116879 -110985 -56770
17536e6770M9900P2371j64980j65397O3383R9117r170p1754j6283P2487l560R113
$$ -56770 -6870 65501 -99479 -264876 -201493 -102376 -111546 -183300 -199583 -127096 -130656 -121543
17524a21543o7963O3949J37132o3374j31093N3551J42522k7171r0030o6447O9907
$$ -121543 -189506 -125557 11575 -51799 -182892 -129341 13181 -13990 -104020 -170467 -100560
17513a00560J17228o5726j741L9080j29429o1537J36943R6314J7718p8236j28163
$$ -100560 16668 -49058 -50799 -11719 -141148 -202685 -65742 30572 48290 -29946 -158109
17502a58109m3674J4484L7716Q1199N4955K9173O2883j4626O5673O1812j13101
$$ -158109 -201783 -187299 -149583 -68384 -13429 15744 78627 64001 129674 191486 78385
17491G8385m9727k0066j6676p4130L4935k1377k1807J05687J5515j04661l3757
$$ 78385 28658 8592 -8084 -82214 -47279 -68656 -90463 15224 30739 -73922 -107679
17480a07679j0158Q2228m8299j53538m1288q8753J68758K3287L3611R917M429
$$ -107679 -117837 -35609 -83908 -237446 -278734 -367487 -198729 -175442 -141831 -131914 -127485
$$ [...]
##END NTUPLES=NMR SPECTRUM
##END=
