##TITLE=Analysis number 323457
Compound Code cc 50246
Book Reference 464/74/3
Project Code adrs
Chemist Name chrisr
##JCAMPDX= 6.0         $$ Bruker NMR JCAMP-DX V2.0
##DATA TYPE= NMR SPECTRUM
##DATA CLASS= NTUPLES
##ORIGIN= Bruker BioSpin GmbH
##OWNER= nmr
$$ XWIN-NMR		Version 3.5
$$ Thu Oct 26 08:35:37 2006 GMT Daylight Time (UT+1h)  MAYBRIDGE\nmr@NMR_250MHZ
##.OBSERVE FREQUENCY= 250.131544655141
##.OBSERVE NUCLEUS= ^1H
##.ACQUISITION MODE= SIMULTANEOUS (DQD)
##.ACQUISITION SCHEME= undefined
##.AVERAGES= 16
##.DIGITISER RES= 18
##SPECTROMETER/DATA SYSTEM= dpx250
##.PULSE SEQUENCE= zg30
##.SOLVENT NAME= CDCl3
##.SHIFT REFERENCE= (INTERNAL, CDCl3, 0, 16.522)
##AUDIT TRAIL= $$ (NUMBER, WHEN, WHO, WHERE, WHAT)
$$ ##TITLE= Audit trail, XWIN-NMR		Version 3.5
$$ ##JCAMPDX= 5.01
$$ ##ORIGIN= Bruker BioSpin GmbH
$$ ##OWNER= nmr
$$ C:\u/data/dgb/nmr/ADRS/1720/pdata/1/auditp.txt
$$ ##AUDIT TRAIL=  $$ (NUMBER, WHEN, WHO, WHERE, WHAT)
(   1,<2006-10-26 08:35:11.89 +100>,<MAYBRIDGE\nmr>,<NMR_250MHZ>,
      <created by zg, POWCHK disabled, PULCHK disabled
       configuration hash MD5:
       49 4B E0 1D 92 C2 6B 37 9F E6 65 BC 52 41 86 1D
       data hash MD5: 64K
       9D F4 AC C4 C2 FE 36 4B E2 B4 30 DB 89 02 43 49>)
(   2,<2006-10-26 08:35:26.11 +100>,<MAYBRIDGE\nmr>,<NMR_250MHZ>,
      <Start of raw data processing
       ef LB = 0.3 FT_mod = 6 PKNL = 1 SI = 32K 
       data hash MD5: 32K
       A5 02 ED 27 6D 64 8D 77 48 77 1D 31 63 5F FF 34>)
(   3,<2006-10-26 08:35:27.75 +100>,<MAYBRIDGE\nmr>,<NMR_250MHZ>,
      <apk 
       data hash MD5: 32K
       06 65 81 B1 07 72 D9 4D 5B A2 E2 E6 51 1D 5C DB>)
(   4,<2006-10-26 08:35:28.54 +100>,<MAYBRIDGE\nmr>,<NMR_250MHZ>,
      <abs ABSG = 5 
       data hash MD5: 32K
       D9 E5 EE 8B 2C 12 4E B5 A4 0A 1A 9C 06 27 EA 51>)
$$ ##END=
$$ 
$$ hash MD5
$$ B7 22 3C 9A D7 C9 17 61 6A 35 D8 7E 05 52 64 48
##$RELAX= 
##$RELAX= 
##$RELAX= 
##$RELAX= 
##$RELAX= 
##$RELAX= 
##$RELAX= 
$$ Bruker specific parameters
$$ --------------------------
##$DU= <C:\u>
##$EXPNO= 1720
##$NAME= <ADRS>
##$PROCNO= 1
##$TYPE= <nmr>
##$USER= <dgb>
##$AMP= (0..31)
100 100 100 100 100 100 100 100 100 100 100 100 100 100 100 100 100 100 
100 100 100 100 100 100 100 100 100 100 100 100 100 100 
##$AQSEQ= 0
##$AQ_mod= 3
##$AUNM= <au_zg>
##$AUTOPOS= <1 >
##$BF1= 250.13
##$BF2= 250.13
##$BF3= 250.13
##$BF4= 250.13
##$BF5= 500.13
##$BF6= 500.13
##$BF7= 500.13
##$BF8= 500.13
##$BYTORDA= 1
##$CFDGTYP= 0
##$CFRGTYP= 5
##$CHEMSTR= <none>
##$CNST= (0..31)
1 1 145 1 1 1 1 1 1 1 1 1 1 1 1 1 1 1 1 1 1 1 1 1 1 1 1 1 1 1 1 1 
##$CPDPRG= <>
##$CPDPRG1= <>
##$CPDPRG2= <>
##$CPDPRG3= <>
##$CPDPRG4= <mlev>
##$CPDPRG5= <mlev>
##$CPDPRG6= <mlev>
##$CPDPRG7= <mlev>
##$CPDPRG8= <mlev>
##$CPDPRGB= <>
##$CPDPRGT= <>
##$D= (0..31)
0 1 0 0 0 0 0 0 0 0.06 0 0 0 0 0 0 0.0002 0 0 0 0 0 0 0 0 0 0 0 0 0 0 
0 
##$DATE= 1161848110
##$DBL= (0..7)
120 120 120 120 120 120 120 120 
##$DBP= (0..7)
150 150 150 150 150 150 150 150 
##$DBP07= 0
##$DBPNAM0= <>
##$DBPNAM1= <>
$$ [...]
##$SUBNAM7= <"">
##$SUBNAM8= <"">
##$SUBNAM9= <"">
##$SW= 20.6930455092707
##$SWIBOX= (0..15)
0 0 3 0 0 0 0 0 0 0 0 0 0 0 0 0 
##$SW_h= 5175.983436853
##$TD= 65536
##$TD0= 1
##$TE= 683.16
##$TE2= 300
##$TE3= 300
##$TEG= 300
##$TL= (0..7)
0 120 120 120 120 120 120 120 
##$TP= (0..7)
150 150 150 150 150 150 150 150 
##$TP07= 0
##$TPNAME0= <>
##$TPNAME1= <>
##$TPNAME2= <>
##$TPNAME3= <>
##$TPNAME4= <>
##$TPNAME5= <>
##$TPNAME6= <>
##$TPNAME7= <>
##$TPOAL= (0..7)
0.5 0.5 0.5 0.5 0.5 0.5 0.5 0.5 
##$TPOFFS= (0..7)
0 0 0 0 0 0 0 0 
##$TUNHIN= 0
##$TUNHOUT= 0
##$TUNXOUT= 0
##$USERA1= <user>
##$USERA2= <user>
##$USERA3= <user>
##$USERA4= <user>
##$USERA5= <user>
##$V9= 5
##$VALIST= <valist>
##$VCLIST= <CCCCCCCCCCCCCCC>
##$VD= 0
##$VDLIST= <DDDDDDDDDDDDDDD>
##$VPLIST= <PPPPPPPPPPPPPPP>
##$VTLIST= <TTTTTTTTTTTTTTT>
##$WBST= 1024
##$WBSW= 4
##$XGAIN= (0..3)
0 0 0 0 
##$XL= 0
##$YL= 0
##$YMAX_a= 431601
##$YMIN_a= -356623
##$ZGOPTNS= <>
##$ZL1= 120
##$ZL2= 120
##$ZL3= 120
##$ZL4= 120
##$ABSF1= 16.522
##$ABSF2= -4.171173
##$ABSG= 5
##$ABSL= 3
##$ALPHA= 0
##$AQORDER= 0
##$ASSFAC= 0
##$ASSFACI= 0
##$ASSFACX= 0
##$ASSWID= 0
##$AUNMP= <proc_1d>
##$AZFE= 0.1
##$AZFW= 0.1
##$BCFW= 0
##$BC_mod= 0
##$BYTORDP= 0
##$COROFFS= 0
##$CY= 12.5
##$DATMOD= 1
##$DC= 0
##$DFILT= <>
##$DTYPP= 0
##$F1P= 14.0000005364418
##$F2P= -0.99999901652339
##$FCOR= 0.5
##$FTSIZE= 32768
##$FT_mod= 6
##$GAMMA= 0
##$GB= 0
##$INTBC= 1
##$INTSCL= 1
##$ISEN= 128
##$LB= 0.3
##$LEV0= 0
##$LPBIN= 0
##$MAXI= 10000
##$MC2= 0
##$MEAN= 0
##$ME_mod= 0
##$MI= 0
##$NCOEF= 0
##$NC_proc= -4
##$NLEV= 6
##$NOISF1= 0
##$NOISF2= 0
##$NSP= 0
##$NTH_PI= 0
##$NZP= 0
##$OFFSET= 16.522
##$PC= 1
##$PHC0= -48.37775
##$PHC1= 1.963593
##$PH_mod= 1
##$PKNL= yes
##$PPARMOD= 0
##$PSCAL= 4
##$PSIGN= 0
##$REVERSE= no
##$SF= 250.13
##$SI= 32768
##$SIGF1= 0
##$SIGF2= 0
##$SINO= 400
##$SIOLD= 32768
##$SREGLST= <1H.CDCl3>
##$SSB= 0
##$STSI= 32768
##$STSR= 0
##$SW_p= 5175.98343685301
##$SYMM= 0
##$S_DEV= 0
##$TDeff= 65536
##$TDoff= 0
##$TI= <Analysis number 999999
Compound Code 99
Book Reference 9
Project Code 9>
##$TILT= no
##$TM1= 0
##$TM2= 0
##$TOPLEV= 0
##$USERP1= <user>
##$USERP2= <user>
##$USERP3= <user>
##$USERP4= <user>
##$USERP5= <user>
##$WDW= 1
##$XDIM= 32768
##$YMAX_p= 552314363
##$YMIN_p= -351434
$$ End of Bruker specific parameters
$$ ---------------------------------
##NTUPLES= NMR SPECTRUM
##VAR_NAME=  FREQUENCY,     SPECTRUM/REAL,   SPECTRUM/IMAG
##SYMBOL=    X,             R,               I
##VAR_TYPE=  INDEPENDENT,   DEPENDENT,       DEPENDENT
##VAR_FORM=  AFFN,          ASDF,            ASDF
##VAR_DIM=   32768,         32768,           32768
##UNITS=     HZ,            ARBITRARY UNITS, ARBITRARY UNITS
##FACTOR=    0.157963299565203, 1,           1
##FIRST=     4132.6476996994, 0,             0
##LAST=      -1043.33573715361, 0,           0
##MIN=       -1043.33573715361, -351434,     0
##MAX=       4132.6476996994, 552314363,     0
$$ Real data points
##PAGE= N=1
##DATA TABLE= (X++(R..R)), XYDATA
$$ [...]
16195F3967k3243k7532Q19J8764m2784k5665M319l12k3640N608J8378K8757K3006
$$ 63967 40724 13192 14011 32775 -10009 -35674 -31355 -31667 -55307 -49699 -31321 -2564 20442
16182B0442J2348o3352k7518P3749R581n979P495K0711J459j8248k1573j9199
$$ 20442 32790 -30562 -58080 15669 25250 19271 26766 47477 48936 30688 9115 -10084
16170a0084L1961K9241J4921J8756n248K4599Q493m1782m9892M7317k497m1481
$$ -10084 21877 51118 66039 84795 79547 104146 112639 70857 20965 68282 65785 24304
16158B4304p7610J1631m141o9092J2599k7907J6860O9647J4219p328k8721r830
$$ 24304 -53306 -41675 -45816 -114908 -102309 -130216 -113356 -43709 -29490 -36818 -65539 -75369
16146g5369L2025K6567M4019L4084K7589o0626j3821k4970l2724l7259j302Q2535
$$ -75369 -43344 -16777 27242 61326 88915 28289 14468 -10502 -43226 -80485 -81787 748
16134G48l943l1743M9537M3161l1517n3198K3586j6121p590j9676L5552J7035
$$ 748 -3195 -34938 14599 57760 26243 -26955 -3369 -19490 -27080 -46756 -11204 5831
16122E831k8265k5613l0316l1951K5703N6232k6203n3346j5218J4778o792M4934
$$ 5831 -22434 -48047 -78363 -110314 -84611 -28379 -54582 -107928 -123146 -108368 -115160 -70226
16110g0226K6801J1578J0380j0006k4230J1483L5294N487J2857Q855N6555L464
$$ -70226 -43425 -31847 -21467 -31473 -55703 -44220 -8926 -3439 9418 18273 74828 78292
16098G8292p2952k4763R2066M8077m7033l1483m0091m3322J7969O229N131J8916
$$ 78292 5340 -19423 72643 120720 73687 42204 2113 -41209 -23240 -17011 -11880 7036
16086G036Q311J017N542j0000m7404k4299O0387L3514k7077j2615N426m8851m7552
$$ 7036 15347 16364 21906 11906 -35498 -59797 590 34104 7027 -5588 -162 -49013 -96565
16073i6565P4880j7378K5695J0934J1528k5998k5471L5083M5596Q200L2638K4030
$$ -96565 -21685 -39063 -13368 -2434 9094 -16904 -42375 -7292 38304 46504 79142 103172
16061A03172J746o6943k7574K7985J6685j389l014m7227k6497l0587j6570L7405
$$ 103172 104918 37975 10401 38386 55071 53682 50668 3441 -23056 -53643 -70213 -32808
16049c2808l407l4525J9324M821K0929N919J0315l6076m6879L1611N9763J2853
$$ -32808 -36215 -70740 -51416 -46595 -25666 -19747 -9432 -45508 -92387 -60776 -1013 11840
16037A1840J6875r512j1740K2952j2205l612M9693r99k181l9293r132L9471J510
$$ 11840 28715 19203 7463 30415 18210 14598 64291 63292 61111 21818 12686 52157 53667
16024E3667P621l6606n8616O357J3207k8730N835O4769R2424N133p1998n9747
$$ 53667 61288 24682 -33934 -27577 -14370 -43100 -37265 27504 119928 125061 53063 -6684
16012f684N2415Q429o5475p4911j9712P5166p963o5013P316R583j8718J8731J9939
$$ -6684 45731 54160 -11315 -86226 -105938 -30772 -38735 -103748 -96432 -86849 -105567 -86836 -66897
15999f6897J4518K458k2504j5005K9673K0857J6519n8506k6719L9253L3497N153
$$ -66897 -52379 -49921 -72425 -87430 -57757 -36900 -20381 -78887 -105606 -66353 -32856 -27703
15987b7703k0498j5137j0206j499k927J6639M8273N2080J6301m2430n6968L2924
$$ -27703 -48201 -63338 -73544 -75043 -77970 -61331 -13058 39022 55323 12893 -44075 -11151
15975a1151N8727J1981J3503J8191l8489k6583l5839K6837J8607j6644M148m9662
$$ -11151 47576 59557 73060 91251 52762 26179 -9660 17177 35784 19140 23288 -26374
15963b6374J055K8085P9275K1042l2539J3874k2813l6970J6159m58L856Q855l1418
$$ -26374 -25319 2766 82041 103083 70544 84418 61605 24635 40794 40336 44192 53047 21629
15950B1629J4352o37L0471O9235k3365k3448l0475k1283K5604l1239k8945k7453
$$ 21629 35981 35344 65815 135050 111685 88237 57762 36479 62083 30844 1899 -25554
15938b5554k8200n573m3453K0868N1464L4746j1393r401L0017R55l0077M563J8996
$$ -25554 -53754 -59327 -102780 -81912 -30448 4298 -7095 -16496 13521 14476 -15601 -11038 7958
15925G958K2502n754l8912J0615K7778P0617l9264l7415K9496j3313k9648p273
$$ 7958 30460 24706 -14206 -3591 24187 94804 55540 18125 47621 34308 4660 -2613
15913b613n1245K8121L3350P710m7503k4014L5269R2769o84l2345k9635Q78P722
$$ -2613 -53858 -25737 7613 15323 -32180 -56194 -20925 71844 71160 38815 9180 10058 17780
15900A7780j7747k4070P6299K7188l017Q642J2623k1739k043k4370p8215N324
$$ 17780 33 -24037 52262 79450 76433 85075 97698 75959 73916 49546 -28669 -23345
15888b3345j1364k7701J0717l268K7474K0651o1346K4292J9084l694j4053J7468
$$ -23345 -34709 -62410 -51693 -54961 -27487 -6836 -68182 -43890 -24806 -28500 -42553 -25085
15876b5085J5957k0522p4316J4912J09505K8008N060j3046l9502P2795J2707l3867
$$ -25085 -9128 -29650 -103966 -89054 20451 48459 53519 40473 971 73766 86473 52606
15864E2606l6342m4063k5004m964o8427K6449L5904L2879K7453n67J1411k0005
$$ 52606 16264 -27799 -52803 -57767 -126194 -99745 -63841 -30962 -3509 -4076 7335 -12670
15852a2670j0533j4136k5765o2938M855L9437R5690K7078q075o2056M0328N758
$$ -12670 -23203 -37339 -63104 -126042 -121187 -81750 13940 41018 32943 -29113 11215 16973
15840A6973p30j7771p4954j2825J5225J2807J3650j8565o997N7573L0894K4907
$$ 16973 16243 -1528 -76482 -89307 -74082 -61275 -47625 -66190 -73187 -15614 15280 40187
15828D0187L095l3124k1713J946L8636K3837K0065L901N3847l2429r338n2192
$$ 40187 43282 10158 -11555 -9609 29027 52864 72929 76830 130677 98248 88910 36718
15816C6718K4039j8255k6442J3298J3783j67p2128j320J0060m5839k4916K7640
$$ 36718 60757 42502 16060 29358 43141 42974 -29154 -30474 -20414 -66253 -91169 -63529
15804f3529j4452k512O093k594J2135k7169K0573L1494k6503n653o867k451J9042
$$ -63529 -77981 -80493 -74400 -76994 -64859 -92028 -71455 -39961 -66464 -72117 -78984 -81435 -62393
15791f2393L7818P5796L3533k2404l9607j2878j853P7231L4503m0783j3748M727
$$ -62393 -24575 51221 84754 62350 22743 9865 8012 85243 119746 78963 65215 69942
15779F9942l0192q7195K3098O6640m1804m6967L275N595M2567K0457m0783j022
$$ 69942 39750 -47445 -24347 42293 489 -46478 -43203 -37608 4959 25416 -15367 -16389
15767a6389L6108Q9004O67q7552j3592q543n8484n2739n3893J2945L6999M2758
$$ -16389 19719 108723 109390 21838 8246 -297 -58781 -111520 -165413 -152468 -115469 -72711
15755g2711M9657K2439n891l9869Q4025J9025o2597j5640k0918Q7012L7532l7386
$$ -72711 -23054 -615 -6506 -46375 37650 56675 -5922 -21562 -42480 44532 82064 44678
15743D4678q8883j263o088n0683j8193J7798J9618j1114M7463o191j8429q715
$$ 44678 -44205 -45468 -51556 -102239 -120432 -102634 -83016 -94130 -46667 -52858 -71287 -80002
15731h0002O6065M5924l758l9915m6227O1480N7708n336o3788n5720L4757N1497
$$ -80002 -13937 31987 28229 -11686 -57913 3567 61275 55939 -7849 -63569 -28812 22685
15719B2685m5712k0691l4735k2421N7079L7292j7706m1522j8436o902J461Q5779
$$ 22685 -23027 -43718 -78453 -100874 -43795 -6503 -24209 -65731 -84167 -91069 -89608 -3829
15707c829L2331K0974j0063r088k0541o0654n6483j063P7927M3716K896k733j5691
$$ -3829 28502 49476 39413 30325 9784 -50870 -107353 -108416 -30489 13227 16123 13390 -2301
15694b301o8880m8647L7908M0839q700K681o030J8489m3131O755L3413M3745m5923
$$ -2301 -71181 -119828 -81920 -41081 -49781 -47100 -53130 -34641 -77772 -71017 -37604 6141 -39782
15681c9782j0453J7932m7365K5763O123N8252J5580j4061j174J7696J1147o2186
$$ -39782 -50235 -32303 -79668 -53905 -47782 10470 26050 11989 10815 28511 39658 -22528
15669b2528k1252j3445R764L6327n5066J6212j0249N6946N411o0211j3442K8236
$$ -22528 -43780 -57225 -47461 -11134 -66200 -49988 -60237 -3291 2120 -58091 -71533 -43297
15657d3297m981K3683J2223L0501J2323k9703l4263m4474J3697m0673J0908q443
$$ -43297 -48278 -24595 -12372 18129 30452 749 -33514 -77988 -64291 -104964 -94056 -102499
15645a02499P0231l8659j8855j8686K0821k1842k5485L8515N828J6772L1078k9376
$$ -102499 -32268 -70927 -89782 -108468 -87647 -109489 -134974 -96459 -90631 -73859 -42781 -72157
15633g2157o561m5278R3481N1215m5140j5492k0533L0883K1184j23p240J18l690
$$ -72157 -78718 -123996 -30515 20700 -24440 -39932 -60465 -29582 -8398 -8521 -15761 -15643 -19333
15620a9333k6828J1769m498N6234O9062j3967p3125n0428j1902m821M6238P0791
$$ -19333 -46161 -34392 -38890 17344 86406 72439 -686 -51114 -63016 -67837 -21599 49192
15608D9192j7775k5368j5817M9811K3675K6158K2253M581l0245l2278q8029q4993
$$ 49192 31417 6049 -9768 40043 63718 89876 112129 116710 86465 54187 -33842 -118835
15596a18835K0060J10606O0544o5858k8554L7043n6367m0592j1582K918N6505
$$ -118835 -98775 11831 72375 6517 -22037 15006 -41361 -81953 -93535 -90617 -34112
15585c4112k4778N9035j6238q788j9799J4143K0435l6785j046O8526J09128k633
$$ -34112 -58890 145 -16093 -24881 -44680 -30537 -10102 -46887 -47933 20593 129721 127088
15573A27088o7880k8799l8708J174p2582L5621J23178M456l3241k2311l434N600
$$ 127088 59208 30409 -8299 -7125 -79707 -44086 79092 83548 50307 27996 24562 30162
15561C0162j5708n4052j7099K3511N5818j9815o2853m3405Q052m1358J4954O5675
$$ 30162 14454 -39598 -56697 -33186 22632 2817 -60036 -103441 -95389 -136747 -121793 -56118
15549e6118P1901N3115j465Q612m0119m9857l919R375L9266O1787j7292k1871
$$ -56118 15783 68898 67433 76045 35926 -13931 -17850 -8475 30791 92578 75286 53415
15537E3415J1580l3238k4818k9051m666L4386N5736K8859O5685j7299m5222N7510
$$ 53415 64995 31757 6939 -22112 -26778 7608 63344 92203 157888 140589 95367 152877
15525A52877p1482n3543M0361k7111l1376J5294j9830m2340j8539m8799k6172
$$ 152877 81395 27852 68213 41102 9726 25020 5190 -37150 -55689 -104488 -130660
15514a30660j9078L5046P0175k9748k6827L1122O923K0124r580n028k2342J4941
$$ -130660 -149738 -114692 -44517 -74265 -101092 -69970 -63047 -42923 -52503 -57531 -79873 -64932
15502f4932M972J5846J5499K3657N939k4659N2595P9425K974l5789n6984l7162
$$ -64932 -59960 -44114 -28615 -4958 981 -23678 28917 108342 111316 75527 18543 -18619
15490a8619J3637P378j2102K1538N0981m1640K121O9314K6707l547j2178n8214
$$ -18619 -4982 2396 -9706 11832 62813 21173 23294 92608 119315 115768 103590 45376
15478D5376m0708p1702J5731N4504j9587j0507k1074j1472K3089k3908j2130J9697
$$ 45376 4668 -67034 -51303 3201 -16386 -26893 -47967 -59439 -36350 -60258 -72388 -52691
15466e2691j7710l0825R286Q8865M3968l2374j268N959m2005o128O5998l0760
$$ -52691 -70401 -101226 -91940 -3075 40893 8519 7251 13210 -28795 -34923 31075 315
15454C15p7346j440O2365j7391m5178n042L175K5429Q1694l6725n672J9030L3772
$$ 315 -77031 -78471 -16106 -33497 -78675 -83717 -80542 -55113 26581 -10144 -15816 3214 36986
15441C6986j6394n5744l8848k5836L3705J5537j9624o864K793N5258J2619K1938
$$ 36986 20592 -35152 -74000 -99836 -66131 -50594 -70218 -77082 -74289 -19031 -6412 15526
15429A5526L1764Q8278j9347m1051q1980j2093P2168K7872m2155j0857K6175J8031
$$ 15526 47290 135568 116221 75170 -6810 -18903 53265 81137 38982 28125 54300 72331
15417G2331j4066j5291j2469k8371o375m1151J6758O7924K351K5715J8566k0302
$$ 72331 58265 42974 30505 2134 -4241 -45392 -28634 39290 41641 67356 85922 65620
15405F5620k9300m1812K0014L3826L3069k7258k8767k3851M1848O0479k4905o8801
$$ 65620 36320 -5492 14522 48348 81417 54159 25392 1541 43389 103868 78963 10162
15393A0162n5783J4715J0843r504L0283J8033j9178q095J8965M1198K3182o2694
$$ 10162 -45621 -30906 -20063 -29567 716 18749 -429 -8524 10441 51639 74821 12127
15381A2127j5695K2749M7073j8551k1417l2556K1049j9493m5606N4903O1932q02
$$ 12127 -3568 19181 66254 47703 26286 -6270 14779 -4714 -50320 4583 66515 65713
15369F5713j3980p783n5390Q822O196l5074P621K4742k0361j5112j0456Q5311
$$ 65713 51733 43950 -11440 -2618 3578 -31496 -23875 867 -19494 -34606 -45062 40249
15357D0249K6735k7274j035J7408J0552L7970n032n167k2545m4431J6371r592
$$ 40249 66984 39710 38675 56083 66635 104605 99573 94406 71861 27430 43801 34209
15345C4209J8747m3882q09J043K4187K7986j6100m1752o8982K018J9800J6962
$$ 34209 52956 9074 8265 9308 33495 61481 45381 3629 -65353 -63335 -43535 -26573
15333b6573N9960m444n4538J3239K9288O339j7715n7608J6188l6230m5562L8654
$$ -26573 33387 28943 -25595 -12356 16932 23271 5556 -52052 -35864 -72094 -117656 -79002
15321g9002K5565j3138n868j1265L7663j3721M5129n387k1798J8091M9114l2558
$$ -79002 -53437 -66575 -72443 -83708 -46045 -59766 -14637 -20024 -41822 -23731 25383 -7175
15309g175n1930j6826O0920k3154j7471L2154K6712j4630l1577l8183P8306K0177
$$ -7175 -59105 -75931 -15011 -38165 -55636 -23482 3230 -11400 -42977 -81160 -2854 17323
15297A7323R03l8140p0152J6828P0263M878R30q207m521p609O1882K1889m496
$$ 17323 18226 -19914 -90066 -73238 -2975 1903 2833 -5374 -9895 -17504 44378 66267 61771
15284F1771n94k8314j03817o4200O6441K3405l6520L1935O9095m591M92J9357
$$ 61771 61177 32863 -70954 -135154 -68713 -45308 -81828 -49893 19202 14611 15103 34460
15272C4460k1208j275l9411j5167m8209J7883K1659J299o604M881K0983n0587
$$ 34460 13252 11977 -27434 -42601 -90810 -72927 -51268 -49969 -56573 -51692 -30709 -81296
15260h1296o9551J4256N9281O7385p293k152M0732N0976p1510k4611l8866j3313
$$ -81296 -150847 -136591 -77310 -9925 -17218 -19370 21362 72338 828 -23783 -62649 -75962
15248g5962K1874N2800n144K776O2444k225K0765n6319m4447J5179K9330L8713
$$ -75962 -54088 -1288 -6432 -3656 58788 56563 77328 21009 -23438 -8259 21071 59784
15236E9784k3233o8515k9198L7927N6425l441m6492p6032k2462j5860j2228N8265
$$ 59784 36551 -31964 -61162 -23235 33190 29749 -16743 -92775 -115237 -131097 -143325 -85060
15224h5060Q2038J0535k9513j8181K4163R953P996l0029n3390R671N2040J4293
$$ -85060 -3022 7513 -22000 -40181 -16018 -6065 1931 -28098 -81488 -71817 -19777 -5484
15212e484j5659j7662L3189L2882l2069k5566N273j863l7430m6857M9084K0982
$$ -5484 -21143 -38805 -5616 27266 -4803 -30369 -25096 -26959 -64389 -111246 -62162 -41180
15200d1180N6492K2067l8350j7814j3764k2240Q8186L1099r013p383J2067n2840
$$ -41180 15312 37379 -971 -18785 -32549 -54789 33397 64496 55483 48100 60167 7327
15188G327m7617j6300J1101P000K0252L2532J4363l4876k2969Q257K8204k338
$$ 7327 -40290 -56590 -45489 -38489 -18237 14295 28658 -6218 -29187 -20930 7274 4936
15176D936k1290J2697j1289n6482p3337L8009N025j4083J014q11N3326R1273N4426
$$ 4936 -16354 -3657 -14946 -71428 -144765 -106756 -101731 -115814 -114800 -115611 -62285 28988 83414
15163H3414J262j3610l8892l6338k9264k4408n087L3725n605k2670l5634J6332
$$ 83414 84676 71066 32174 -4164 -33428 -57836 -62923 -29198 -34803 -57473 -93107 -76775
15151g6775R0112N9561j5035k7186K008L4642K5921j1330o9467K5811L3414o006
$$ -76775 13337 72898 57863 30677 32685 67327 93248 81918 12451 38262 71676 65670
15139F5670l2227k5731L9566k1298j9436K6127L8225l0934l4849k3341K3364K3381
$$ 65670 33443 7712 47278 25980 6544 32671 70896 39962 5113 -18228 5136 28517
15127B8517j58L0645m4369k3627m6208J6028L3974P979P201j2256L5353K5021
$$ 28517 28359 59004 14635 -8992 -55200 -39172 -5198 2781 9982 -2274 33079 58100
15115E8100p0490k880O252k3778P881L770L5991Q5768k2265q4979k2978L4181
$$ 58100 -12390 -15270 -9018 -32796 -24915 -21145 14846 100614 78349 -6630 -29608 4573
15103D573K5857K3596k4955m3807K1385q4125J0924J5673m0070P370K3860M1093
$$ 4573 30430 54026 29071 -14736 6649 -77476 -66552 -50879 -90949 -83579 -59719 -18626
15091a8626l5702K7598L8687j4832k6356l5593M4810P7809J029l0406L332p2719
$$ -18626 -54328 -26730 11957 -2875 -29231 -64824 -20014 57795 58824 28418 31750 -40969
15079d0969J2992L929O528n5125l5822l207j4283n902N2024k1637o1476J02968
$$ -40969 -27977 -24048 -17520 -72645 -108467 -111674 -125957 -131859 -79835 -101472 -162948 -59980
15067e9980N9389J348j0366K3000J2604o8293j1199k2675l3427P4957k4093p0650
$$ -59980 -591 757 -9609 13391 25995 -42298 -53497 -76172 -109599 -34642 -58735 -129385
15055a29385J6498M7476J5917O9571M2017L99l0555l2499O539N0215k3414m3306
$$ -129385 -112887 -65411 -49494 20077 62094 62493 31938 -561 5978 56193 32779 -10527
15043a0527l5129l5200J8054j7679N8923L0501N3520j9129p1954q4760K3621J068
$$ -10527 -45656 -80856 -62802 -80481 -21558 8943 62463 43334 -28620 -113380 -89759 -88691
15031h8691K6098N4311K2040N440J4956j8088K411L5288m705p8762m9965j3507
$$ -88691 -62593 -8282 13758 19198 34154 16066 18477 53765 49060 -29702 -79667 -93174
15019i3174j938J6314M4556O3908M25n5310j7375L5106L0621k3092Q520l0610
$$ -93174 -95112 -78798 -34242 29666 30091 -25219 -42594 -7488 23133 41 8561 -22049
15007b2049J7952n058j7972L026k060m9330N1701L8417M2835J3398p7186j22963
$$ -22049 -4097 -9155 -27127 -24101 -26161 -75491 -23790 14627 57462 70860 -6326 -129289
14995a29289l3077J0126N171P111K6201Q545K0339M3685j3348Q059O22K0738Q103
$$ -129289 -162366 -152240 -147069 -139958 -113757 -105212 -84873 -41188 -54536 -46477 -45855 -25117 -17014
14982a7014Q328N6218M0105J6963l1891l2164J2189K116J1050J7509j21213o493
$$ -17014 -8686 47532 87637 104600 72709 40545 52734 54850 65900 83409 -37804 -44297
14970d4297L5278K6527l3213j9321K0053m1981R083M5944R190m4579K0825m3445
$$ -44297 -9019 17508 -15705 -35026 -14973 -56954 -47871 -1927 7263 -37316 -16491 -59936
14958e9936K5787L3127N5009m5186o7015m3290J1740L0992j423k9230K9619M0032
$$ -59936 -34149 -1022 53987 8801 -58214 -101504 -89764 -58772 -60195 -89425 -59806 -19774
14946a9774N5142J9865K8797k7841n2585P623K9611j076o8k5947n7553J9868q025
$$ -19774 35368 55233 84030 56189 3604 11227 40838 39762 39694 13747 -43806 -23938 -31963
14933c1963K3067K8849J387j8078J3001N3474L8267m9965n3209l1291n0974N415
$$ -31963 -8896 19953 21340 3262 16263 69737 108004 58039 4830 -26461 -77435 -72020
14921g2020O89J7465M2738L4435p033N763R370R550M3136j0796k7713o5871K5407
$$ -72020 -71331 -53866 -11128 23307 16274 22037 31407 40957 84093 73297 45584 -20287 5120
14908E120k294j1168L5701P6m792l9820J6803K0607L4096k2949k9384J8531L0706
$$ 5120 2826 -8342 27359 27435 22643 -17177 -374 20233 54329 31380 1996 20527 51233
14895E1233j8889J5999K1485n9415k2982k1904K5879k896M6657K0107K5109n8137
$$ 51233 32344 48343 69828 10413 -12569 -34473 -8594 -11490 35167 55274 80383 22246
14883B2246n7846j0921l4614K9989P1495M9591k1575n0517N9560J9494p0984j01516
$$ 22246 -35600 -46521 -81135 -51146 20349 69940 48365 -2152 57408 76902 5918 -95598
14871i5598k4528M7193K1151Q2607o1913m9707L2249L0165L034l5354L1627O9676
$$ -95598 -120126 -72933 -51782 30825 -31088 -80795 -48546 -18381 -15347 -50701 -19074 50602
14859E0602L6331k2834J8983k9921l4871M890K6841j4808l929J349K5961p59K5875
$$ 50602 86933 64099 83082 53161 18290 23180 50021 35213 31284 32633 58594 57835 83710
14846H3710q315j2098k7451l4989m1012n3747k0261n20K819L2685O841M7333N1238
$$ 83710 75395 63297 35846 857 -40155 -93902 -114163 -114683 -111864 -79179 -72338 -25005 26233
14833B6233j1122m1947j3795J5469N059J9700l640K9612L0395m6496P798J8880
$$ 26233 15111 -26836 -40631 -25162 -20103 -403 -4043 25569 55964 9468 17266 36146
14821C6146l0922k4466J1559K923n794L3968l9184J9794O176j3031m6088l1641
$$ 36146 5224 -19242 -7683 -4760 -10554 23414 -15770 4024 10200 -2831 -48919 -80560
14809h0560K4118p5476r305J8016L3299l917l4431j9388R2608J11375K5667r1794
$$ -80560 -56442 -131918 -141223 -123207 -89908 -93825 -128256 -147644 -55036 56339 82006 -9788
14797i788l0581K1954o6124l9Q0081L8727J8540p5100k0720n60o480N3661J9425
$$ -9788 -40369 -18415 -84539 -84578 -4497 34230 52770 -22330 -43050 -43610 -50090 3571 22996
14784B2996p668K923j7959o6943J6959J8187n9433j4692J2985L564K0744J2319
$$ 22996 15328 18251 292 -66651 -49692 -31505 -90938 -105630 -92645 -89081 -68337 -56018
14772e6018l8085j8463R42K9545L9699K8864k7803L141r323L2049j9575l0393
$$ -56018 -94103 -112566 -111624 -82079 -42380 -13516 -41319 -38178 -47501 -15452 -35027 -65420
14760f5420k641l938k1996l40L5019J1509M0254K9894k7237m8876Q340O3460M2190
$$ -65420 -68061 -71999 -93995 -94335 -59316 -47807 -7553 22341 -4896 -53772 -45432 18028 60218
14747F0218J0456K7907m4161k983P333n62o3268o1954K6329L7053O692k6888J2060
$$ 60218 70674 98581 54420 51437 58770 58208 -5060 -67014 -40685 -3632 3060 -23828 -11768
14734a1768k6867r2125N3906N1421K7710L3493o6401l0443O2777J2131L3745K1034
$$ -11768 -38635 -130760 -76854 -25433 2277 35770 -30631 -61074 1703 13834 47579 68613
14722F8613o768L1299n098o1939R714n623m9r053k8076m669m182m5676o364J5195
$$ 68613 61845 93144 88046 26107 35821 30198 30149 21096 -6980 -11649 -15831 -61507 -67871 -52676
14708e2676P754k0097n4479K8406P3908J8359l7592j6788n6249j6215l9682Q6687
$$ -52676 -44922 -65019 -119498 -91092 -17184 1175 -36417 -53205 -109454 -125669 -165351 -78664
14696g8664P4328J3121J337n697n909j8991j290o510L2754K1815l48N061J7360
$$ -78664 -4336 8785 10122 4425 -1484 -20475 -21765 -28275 4479 26294 25946 31007 48367
14683D8367O998o6369m4684j4039O503M8837L781p562k8853N3041K8126k5623
$$ 48367 55365 -11004 -55688 -69727 -63224 -14387 -10606 -18168 -47021 6020 34146 8523
14671H523k1522l9087L29J7311Q723K0985Q55j7859n2254M1062L2991K4403J5867
$$ 8523 -12999 -52086 -51757 -34446 -25723 -4738 -3883 -21742 -73996 -32934 57 24460 40327
14658D0327p161l0175j4340O1282L2357K2585K0391p3053l7718j5033O8452K7444
$$ 40327 33166 2991 -11349 49933 82290 104875 125266 52213 14495 -538 67914 95358
14646I5358K4352j059j00430r742K8019N3920j4020m841N922k0777n959l2304
$$ 95358 119710 118651 18221 8479 36498 90418 76398 71557 77479 56702 50743 18439
14634A8439L9061l6408p3853K3188j8395m9437j3052P3833P0732J675m2395J454
$$ 18439 57500 21092 -52761 -29573 -47968 -97405 -110457 -36624 34108 35783 -6612 -5158
14622e158l728m0047r2160o2786P1898Q7765R182J9422K3067p4021n9778k188
$$ -5158 -8886 -48933 -141093 -203879 -131981 -44216 -35034 -15612 7455 -66566 -126344 -128532
14610a28532O0381Q2220L5284k8372l8678N9872j3917K303j9641p1926l7847k822
$$ -128532 -68151 14069 49353 20981 -17697 42175 28258 30561 10920 -61006 -98853 -101675
14598a01675k2865M2833L2774m3279J1890l471l5021K0967L4634Q3274Q038n182
$$ -101675 -124540 -81707 -48933 -92212 -80322 -83793 -118814 -97847 -63213 20061 28099 22917
14586B2917m0813j0541o02N666k3825m6649O2451L6741M8698j7454l5816j2865
$$ 22917 -17896 -28437 -29039 -23373 -47198 -93847 -31396 5345 54043 36589 773 -12092
14574a2092l0646l0905K6756N6059Q006k9676j9305O459O2184j9503k7674J0218
$$ -12092 -42738 -73643 -46887 9172 17178 -12498 -31803 -25344 36840 17337 -10337 -119
14562a19J4098R12q6634L319m3517j4789K4554N7589J8592m3153M2182Q5711J6814
$$ -119 13979 14891 -71743 -68424 -111941 -126730 -102176 -44587 -25995 -69148 -26966 58745 75559
14549G5559n1473l7049M990J6481j5727k686J4387k0803j0467K5659L2100K7723
$$ 75559 24086 -12963 -7973 8508 -7219 -9905 4482 -16321 -26788 -1129 30971 58694
14537E8694K7676l5794k6503k8046L9790L3119l8703o0597P513l6293J0269N238
$$ 58694 86370 50576 24073 -3973 35817 68936 30233 -30364 -22851 -59144 -48875 -43637
14525d3637J9754L1918J1403l9710r4754k1504r07N711P3633M5895l9638L095
$$ -43637 -23883 8035 19438 -20272 -115026 -136530 -137437 -131726 -58093 -12198 -51836 -48741
14513d8741j6726K1731L3350J3761K191l0202J3881l6568l8214M4546N4291m0255
$$ -48741 -65467 -43736 -10386 3375 5566 -24636 -10755 -47323 -85537 -40991 13300 -26955
14501b6955l9673N06J8908N9844R428m647j7862l4166k9057j4140K232O6479J1196
$$ -26955 -66628 -66122 -47214 12630 22058 17411 -451 -34617 -63674 -77814 -75582 -9103 2093
14488B093l9828m3237n0351j1103O0437J4623K2098J599m1335L3569K8005j6592
$$ 2093 -37735 -80972 -131323 -142426 -81989 -67366 -45268 -43669 -85004 -51435 -23430 -40022
14476d0022k8869M2480K2084k8925J9065L7047L7834K3226L1474k1100r7553j4550
$$ -40022 -68891 -26411 -4327 -33252 -14187 22860 60694 83920 115394 94294 -3259 -17809
14464a7809Q71m0808j5808L0740O4224K5290k3522m6197o847J7378l505j212p573
$$ -17809 -16938 -57746 -73554 -42814 21410 46700 23178 -23019 -29866 -12488 -15993 -17205 -24778
14451b4778j7358K978j5277O7917r586m9978k4308L4413k4653N5590J1146p271
$$ -24778 -42136 -39158 -54435 13482 3896 -46082 -70390 -35977 -60630 -5040 6106 -1165
14439a165l638m2960K2301M5932Q03j2473J7436q2574j6044K6205j1400K5824
$$ -1165 -4803 -47763 -25462 20470 21273 8800 26236 -56338 -72382 -46177 -57577 -31753
14427c1753M5193L6766k1224J6489J7923J0590l0021L4784k3307m6476J5615k4941
$$ -31753 13440 50206 28982 45471 63394 73984 43963 78747 55440 8964 24579 -362
14415c62k4521j9269m5743M054K5121J5204k0701n1863l122L8631J0031m1115
$$ -362 -24883 -44152 -89895 -85841 -60720 -45516 -66217 -118080 -121202 -82571 -72540 -113655
14403a13655O9652K7696q587m3310R491j7844O159J2746L494o994j0500K6279
$$ -113655 -44003 -16307 -24894 -68204 -58713 -76557 -70398 -57652 -54158 -61152 -71652 -45373
14391d5373l9408m561J1439q624M3858M6047J2229r286k8922n7176r20K6759K9015
$$ -45373 -84781 -89342 -77903 -86527 -42669 3378 15607 6321 -22601 -79777 -80697 -53938 -24923
14378b4923O0365K2084k7182o23k4495n0985L6613L835j08937M3035N2042K716
$$ -24923 35442 57526 30344 29721 5226 -45759 -9146 -5311 -114248 -71213 -19171 -16455
14366a6455J0455k2791k6223M3651L6009O145Q608p3962p3562m4767k8909N1302
$$ -16455 -6000 -28791 -55014 -11363 24646 30791 39399 -34563 -108125 -152892 -181801 -130499
14354a30499K8099L3275m610L8441J0374m0141N3358J07774M300p381j9242r1587
$$ -130499 -102400 -69125 -73735 -35294 -24920 -65061 -11703 96071 100371 92990 73748 -17839
14342a7839p806k901j8699J8109l5548K2268r501n771m3014o826J0888M3240L3151
$$ -17839 -25645 -28546 -47245 -29136 -64684 -42416 -51917 -57688 -100702 -107528 -96640 -53400 -20249
14329b0249p1599m639K3589k5904J5073N3036m4139M9746k8148l8098l223K4525
$$ -20249 -91848 -96487 -72898 -98802 -83729 -30693 -74832 -25086 -53234 -91332 -94555 -70030
14317g0030N797O864M1846L7116K5874n137k646Q432k5496k368k475K380j1635
$$ -70030 -64233 -57369 -15523 21593 47467 42330 39684 48116 22620 20252 17777 20157 8522
14304H522J5937Q534K7547m0706k3770M6761L7231L5515j765k4874p4571l4703
$$ 8522 24459 32993 60540 19834 -3936 42825 80056 115571 113806 88932 14361 -20342
14292b0342J0672r798o2560M1889O5300K6819j3989m329p6537l0266O855j0605
$$ -20342 -9670 -19468 -82028 -40139 25161 51980 37991 33662 -42875 -73141 -66286 -76891
14280g6891K0015j6911q713O4624J7193l772P533L005N966Q1740O7390o3945o0114
$$ -76891 -56876 -73787 -82500 -17876 -683 -4455 3078 6083 12049 93789 161179 97234 37120
14267C7120J0557N2096N6026m4474q2025j939p268q184o9694l4340L8154K5080
$$ 37120 47677 99773 155799 111325 29300 27361 20093 11909 -57785 -92125 -53971 -28891
14255b8891J5503K3116l0403l5295k8466M8398p726k2850L9508M0530j771l8104
$$ -28891 -13388 9728 -20675 -55970 -84436 -36038 -43764 -66614 -27106 13424 11653 -26451
14243b6451j5121K0676K4939k5042m548L5638l0765m8405K1841R3740L6897j0717
$$ -26451 -41572 -20896 4043 -20999 -25547 10091 -20674 -69079 -47238 46502 83399 72682
14231G2682l0162k8947k4888j6193J0406K3854j5734l1007K6145L5757P137M153
$$ 72682 42520 13573 -11315 -27508 -17102 6752 -8982 -39989 -13844 21913 29050 33203
14219C3203K6746L3763l9897l4325m937m971m8141l7959K8404L5514o4760l65
$$ 33203 59949 93712 53815 19490 14553 9582 -38559 -76518 -48114 -12600 -77360 -77725
14207g7725N1842m740k7214J5152l152J0255K7782l9452N804k0433p888M7162
$$ -77725 -25883 -30623 -57837 -42685 -45837 -35582 -7800 -47252 -41448 -61881 -69769 -22607
14195b2607L8482J6809k1361j8953M5319L0507n4479k6358k9377k6336n5688k2763
$$ -22607 15875 32684 11323 -7630 37689 68196 13717 -12641 -42018 -68354 -124042 -146805
14183a46805O6183Q1615M0584l6267k4330M40J0225J1101j3125J3259J8061P889
$$ -146805 -80622 993 41577 5310 -19020 -18580 -8355 2746 -10379 2880 20941 28830
14171B8830j1355l114K3981j4493M2261k7651k8745K3781n960k0337O553J2706
$$ 28830 17475 14361 38342 23849 66110 38459 9714 33495 27535 7198 13751 26457
14159B6457n657k1585M511P2352J9881m259o4870m0615K494K4150L5821k5771
$$ 26457 20800 -785 3726 76078 95959 91700 26830 -13785 -11291 12859 48680 22909
14147B2909m4963k3698l7560L6620K9009N42o344l1965J4029K5262K6926M1072
$$ 22909 -22054 -45752 -83312 -46692 -17683 -17141 -23485 -55450 -41421 -16159 10767 51839
14135E1839k3010m1984n6701k577Q577l194k2607j9394K9419O4074K5439k7945
$$ 51839 28829 -13155 -69856 -72433 -63856 -67050 -89657 -109051 -79632 -15558 9881 -18064
14123a8064k6687k9585l6114j3716K4407P622k856O8211O6168j3446q3176j7361
$$ -18064 -44751 -74336 -110450 -124166 -99759 -92137 -94993 -26782 39386 25940 -57236 -74597
14111g4597O713L7342M0438N780n4961M1643N2397n8499k5651K8752j1570j0704
$$ -74597 -67884 -30542 9896 15676 -39285 2358 54755 -3744 -29395 -643 -12213 -22917
14099b2917K1479L813n6966O197P77l8782o8069L0286N2698K7338O9409M1871
$$ -22917 -1438 2375 -54591 -48394 -47617 -86399 -154468 -124182 -71484 -44146 25263 67134
14087F7134M0391l5979n3627l6822j2525L9992j0082m4450k444L3492N242m2250
$$ 67134 107525 71546 17919 -18903 -31428 8564 -1518 -45968 -48412 -14920 -9678 -51928
14075e1928k5084j2435J5222Q4067N7095K53Q341j319j6124n7822j5618j2524
$$ -51928 -77012 -89447 -74225 9842 66937 67190 75531 74212 58088 266 -15352 -27876
14063b7876J1132o967M4676M3378P8235j6361l0408k2712k725l2032N1348N5997
$$ -27876 -16744 -23711 20965 64343 142578 126217 95809 73097 70372 38340 89688 145685
14051A45685P570m9769L7656O3790L6355N0674N7339O8231J30612J46886K36872
$$ 145685 153255 103486 141142 204932 241287 291961 349300 417531 548143 695029 931901
14040I31901K81884K60567L34330L25846K97886L15627K26778J70702R8015m984
$$ 931901 1213785 1474352 1808682 2134528 2432414 2748041 2974819 3145521 3243536 3238552
14030C238552j15551k42039l08466l38365l62739l19480k26296k62940k69706
$$ 3238552 3123001 2880962 2572496 2234131 1871392 1551912 1325616 1062676 792970
14021G92970k13549q7915q9148p9162j5469l6560J486j362m4932j8994M344p0843
$$ 792970 579421 491506 402358 323196 307727 271167 272653 271291 226359 207365 211709 140866
14009A40866l1333l3158l9018L5164m33K735Q470k8313j6283l0950n688J7289
$$ 140866 109533 76375 37357 72521 72088 74823 83293 54980 38697 7747 2059 19348
13997A9348J775P844l7492O636l987J9529k4918J0827K8266J06138r615q7299
$$ 19348 21123 28967 -8525 -1889 -5876 13653 -11265 -438 27828 133966 124351 37052
13985C7052n7992O509M5699l8264k3438J843j8581K1222M7857N771J964J4838
$$ 37052 -20940 -14431 31268 -6996 -30434 -28591 -47172 -25950 21907 27678 29642 44480
13973D4480p1413L786Q3285l474l7418n2810m5008M0142O337j2750J1860L4718
$$ 44480 -26933 -23147 60138 56664 19246 -33564 -78572 -38430 -32093 -44843 -32983 1735
13961A735P5434N377n4282l3120L824k6838j158O440J2892N228k6843K6950L6636
$$ 1735 77169 82546 28264 -4856 -1032 -27870 -29028 -22588 -9696 -4468 -31311 -4361 32275
13948C2275k3053j5597J741m5144q220k0182J5542J731k364L6868q912K2435N3291
$$ 32275 9222 -6375 -4634 -49778 -57998 -78180 -62638 -60907 -63271 -26403 -35315 -12880 40411
13935D0411m5493J2K0946O945O995K3238k5329l9022M0840M6841J5277O4200j78
$$ 40411 -5082 -5070 15876 22821 29816 53054 27725 -11297 29543 76384 91661 155861 155683
13922A55683j01879m7608j5353n7738k2712J5545L3791M599P9003L3964m2098
$$ 155683 53804 6196 -9157 -66895 -89607 -74062 -40271 -35672 43331 77295 35197
13911C5197p445J2492j3084p0428O0531j4309l1712M3154J6559k8809o1728o254
$$ 35197 27752 40244 27160 -43268 17263 2954 -28758 14396 30955 2146 -59582 -65836
13899f5836L3244P2405M7539J3808k7418l9449l6195O2155j6378n3901K7254K3150
$$ -65836 -32592 39813 87352 101160 73742 34293 -1902 60253 43875 -10026 17228 40378
13887D0378p9998n1798M3373Q6705K5801o802o0740l6941m810J2112N3571M7213
$$ 40378 -39620 -91418 -48045 38660 64461 57659 -3081 -40022 -44832 -32720 20851 68064
13875F8064L3514k0386k9834n399J0463m1082p034j4098J862J3152j6918n0061
$$ 68064 101578 81192 51358 45959 56422 15340 8306 -5792 -3930 9222 -7696 -57757
13863e7757j1115k0726j9420k0872K6722L1342K5878p6264k6432m1907P6808L3564
$$ -57757 -68872 -89598 -109018 -129890 -103168 -71826 -45948 -122212 -148644 -190551 -113743 -80179
13851h0179J8400K6264L3257N6495M8832j4930l5261j7031n5036k2465R7481O2405
$$ -80179 -61779 -35515 -2258 54237 103069 88139 52878 35847 -19189 -41654 55827 118232
13839A18232o0758n3750k8149J603j921k2949k2565J1364r138J4618K389P428
$$ 118232 57474 3724 -24425 -22822 -24743 -47692 -70257 -58893 -68031 -53413 -51024 -43596
13827d3596j4666l8133m605R984k1559O814j7938k9617k1243K7943O6569O4656
$$ -43596 -58262 -96395 -101000 -91016 -112575 -105761 -123699 -153316 -174559 -146616 -80047 -15391
13815a5391L1447l4113m7672l845M2489r686j8440K7495M5038k5771m8179M8185
$$ -15391 16056 -18057 -65729 -69574 -27085 -36771 -55211 -27716 17322 -8449 -56628 -8443
13803h443l0146o2104j1706M7556R465m2905n5982J8746M5109j2381J6699O7224
$$ -8443 -38589 -100693 -112399 -64843 -55378 -98283 -154265 -135519 -90410 -102791 -86092 -18868
13791a8868O318o4847L0413K3510J7531J4705P3362n0345m2058r192O000m8735
$$ -18868 -12550 -77397 -46984 -23474 -5943 8762 82124 31779 -10279 -19471 -13471 -62206
13779f2206j1863K0444K5995j797J3001q353k5533L3792N3441j4535j22522l8899
$$ -62206 -74069 -53625 -27630 -29427 -16426 -24779 -50312 -16520 36921 22386 -100136 -139035
13767a39035L4981j1384J1924J5115N9487J3955j3908N330J2882j7320o1690L2745
$$ -139035 -104054 -115438 -103514 -88399 -28912 -14957 -28865 -23535 -10653 -27973 -89663 -56918
13755e6918K370m6907J3205J7786O4248J033Q337r331k60k4894K426l8143K9705
$$ -56918 -54548 -101455 -88250 -70464 -6216 -5183 3154 -6177 -6437 -31331 -28905 -67048 -37343
13742c7343P0847J5052j3633n743k4084m1037k8659m3863K3047O3498K4895R261
$$ -37343 33504 48556 34923 29180 5096 -35941 -64600 -108463 -85416 -21918 2977 12238
13730A2238L6251M8836p0426j08014k7016K3706K7783K303M4447L9262n1591k3895
$$ 12238 48489 97325 26899 -81115 -108131 -84425 -56642 -54339 -9892 29370 -22221 -46116
13718d6116L3667N0073n8536k7528j277J9747J3045j2556k9939k1348l0505N7466
$$ -46116 -12449 37624 -20912 -48440 -49717 -29970 -16925 -29481 -59420 -80768 -111273 -53807
13706e3807N7572O8624k6179K2104N9204J3275m2087j1779p435K4830j9760p7079
$$ -53807 3765 72389 46210 68314 127518 140793 98706 86927 79492 104322 84562 7483
13694G483j9787K2986N8541r3845o2546L9168M1472p139j724M1066M6042L3217
$$ 7483 -12304 10682 69223 -24622 -87168 -48000 -6528 -13667 -15391 25675 71717 104934
13682A04934k7439n2392m7057M6117L3832L3318m0895k2840j5403l5796j6377
$$ 104934 77495 25103 -21954 24163 57995 91313 50418 27578 12175 -23621 -39998
13671c9998l0392N331P5881K8870l6840K638l682J9501k0270k4031J0745j02486
$$ -39998 -70390 -65059 10822 39692 2852 5490 1808 21309 1039 -22992 -12247 -114733
13659a14733l2591L4165N8549N2683J3005N017p205n9337L6736k4634J3446K0133
$$ -114733 -147324 -113159 -54610 -1927 11078 16095 8890 -50447 -13711 -38345 -24899 -4766
13647d766m302n3940m2040Q6849K6100m0624p1690J6616k4527k6500R1585N1188
$$ -4766 -9068 -63008 -105048 -18199 7901 -32723 -104413 -87797 -112324 -138824 -47239 3949
13635C949L5963n9340J2065j964P839J6969K1594l746N4535L1387m2812k0786
$$ 3949 39912 -19428 -7363 -9327 -1488 15481 37075 33329 87864 119251 76439 55653
13623E5653j7449l7767l4934n4169l1677L4197O8349M9851q542l0707l2699o0
$$ 55653 38204 437 -34497 -88666 -120343 -86146 -17797 32054 23512 -7195 -39894 -39954
13611c9954L7357J2157p2461m3711N4753j1532m840L2780M9622M8292Q144J697
$$ -39954 -2597 9560 -62901 -106612 -51859 -63391 -68231 -35451 14171 62463 70607 72304
13599G2304o3049j1929m8299j3310N8533Q3069j5506m3067k7376j0103L323L9241
$$ 72304 9255 -2674 -50973 -64283 -5750 77319 61813 18746 -8630 -18733 -15410 23831
13587B3831J3263M621M5395J1243j4731p8604n935K5991j0351J0552J3043J2061
$$ 23831 37094 41715 87110 98353 83622 5018 -917 25074 14723 25275 38318 50379
13575E0379m0550o209J8876N986j0407p9064p4037L1727M5668l8288J5200M4915
$$ 50379 9829 3620 22496 28482 18075 -60989 -135026 -103299 -57631 -95919 -80719 -35804
13563c5804j5555o828J6139J3061R058o9386K4923P6938M797J2692K5508j4016
$$ -35804 -51359 -58187 -42048 -28987 -19929 -89315 -64392 12546 17343 30035 55543 41527
13551D1527k8008l0922q7314J9059J5480J1278j5927n280K7099N2725L3604n3328
$$ 41527 13519 -17403 -104717 -85658 -70178 -58900 -74827 -80107 -53008 -283 33321 -20007
13539b0007l3669j2369K6698J098m3483O3781J3388k663o1197l2964O8849K8378
$$ -20007 -53676 -66045 -39347 -38249 -81732 -17951 -4563 -7226 -68423 -101387 -32538 -4160
13527d160j6384k7996J3819L5480J4204k8130P361j1676K851j2362l7085M8924
$$ -4160 -20544 -48540 -34721 759 14963 -13167 -5806 -17482 -14631 -26993 -64078 -15154
13515a5154J7128J232L1931j0521K4450L322j2670j9197j9988j6766N9629O490
$$ -15154 1974 3206 35137 24616 49066 52388 39718 20521 533 -16233 43396 49886
13503D9886m9603o7339n1625R414M4997r136j9259K1797q506M4733j5716j8807
$$ 49886 283 -67056 -118681 -109267 -64270 -73406 -92665 -70868 -79374 -34641 -50357 -69164
13491f9164O6127K5849M546l6784O7460j2232o9045N468J1127m9803p156l517
$$ -69164 -3037 22812 27358 -9426 58034 45802 -23243 -17775 -6648 -56451 -63607 -67124
13479f7124k9795M8650M4658J1378k1456L3355N1237K9432l5108j4095K2466j5971
$$ -67124 -96919 -48269 -3611 7767 -13689 19666 70903 100335 65227 51132 73598 57627
13467E7627m8589J2887J6657L8972m264k1377L0742j3872n274K0595m2823r014
$$ 57627 9038 21925 38582 77554 73290 51913 82655 68783 63509 84104 41281 32267
13455C2267L8768K1449n1026l0470K686K7401l0935j4567K3084k9899k617P408
$$ 32267 71035 92484 41458 10988 13674 41075 10140 -4427 18657 -11242 -13859 -6451
13443f451p449k4222l1025q42J1578j0195k1601L3018K2860j1476P748L6167J4279
$$ -6451 -13900 -38122 -69147 -69989 -58411 -68606 -90207 -57189 -34329 -45805 -38057 -1890 12389
13430A2389J1550L1050n0355m313J027K4532J3309l6516l9705m2057L9457P6470
$$ 12389 23939 54989 4634 321 1348 25880 39189 2673 -37032 -79089 -39632 36838
13418C6838K8546n312k7711M4071k9718o7361m0697K2373O0336K1095j4955j172
$$ 36838 65384 60072 32361 76432 46714 -20647 -61344 -38971 21365 42460 27505 26333
13406B6333k5404m9807K1537R406j1577L6454J2609j5567L2266l6499o6860k0509
$$ 26333 929 -48878 -27341 -17935 -29512 6942 19551 3984 36250 -249 -67109 -87618
13394h7618K8088R8437K6950k0666J5984n0131r747K181N3600q148o1971L5668
$$ -87618 -59530 38907 65857 45191 61175 11044 1297 3478 57078 48930 -13041 22627
13382B2627P188m5143q234j0829K1440J6877m9802K491N444l3688L2058J1890
$$ 22627 29815 -15328 -23562 -34391 -12951 3926 -45876 -43385 -37941 -71629 -39571 -27681
13370b7681n2478J8337N115K4951L5871j1516L4546o0849m1187N8827J1015J2413
$$ -27681 -80159 -61822 -56707 -31756 4115 -7401 27145 -33704 -74891 -16064 -5049 7364
13358G364k5010j5993N070j7102k5909m2542M0814J1141j6960M5790N905O404
$$ 7364 -17646 -33639 -28569 -45671 -71580 -114122 -73308 -62167 -79127 -33337 -27432 -21028
13346b1028k2224r021L9319N86l7927j3216L8881J6256n8504j512J09609J2621
$$ -21028 -43252 -52273 -12954 -12368 -50295 -63511 -24630 -8374 -66878 -68390 41219 53840
13334E3840l4875O595J9872j3385l0770N1145K0263l9996j8027k2643J5563O3283
$$ 53840 18965 25560 45432 32047 1277 52422 72685 32689 14662 -7981 7582 70865
13322G0865j0050K008j3102j4351l9723L3976j6281n1412p5634J6972l0868L6801
$$ 70865 60815 62823 49721 35370 -4353 29623 13342 -38070 -113704 -96732 -127600 -90799
13310i0799L4742J0376p223J5013j1477k4447J91j1199j7109J9252M5821L8053
$$ -90799 -56057 -45681 -52904 -37891 -49368 -73815 -73624 -84823 -101932 -82680 -36859 1194
13298A194K0855M7153o1894k3123q412J4621K0378L2798j5059n513M0310J7418
$$ 1194 22049 69202 7308 -15815 -24227 -9606 10772 43570 28511 22998 63308 80726
13286H0726j4424k3140K042K9966l7817j3201m5179r025P899K4335N1622M2m3990
$$ 80726 66302 43162 45204 75170 37353 24152 -21027 -30052 -22153 2182 53804 53846 9856
13273I856m5171R754n0346n436j9993p58L8544J2659J3570k0381j021N1972j9942
$$ 9856 -35315 -25561 -75907 -81343 -101336 -102094 -63550 -50891 -37321 -57702 -58723 -6751 -26693
13260b6693N638M0489o560J4033m4777j811K2299k8203k2823M9581J3949J7501
$$ -26693 -21055 19434 12874 26907 -17870 -19681 2618 -25585 -48408 1173 15122 32623
13248C2623j6555m9456j6941j3283L4898Q446N583O0068M4246L75m8014j6671
$$ 32623 16068 -33388 -50329 -63612 -28714 -20268 -14685 45383 89629 90004 41990 25319
13236B5319r160m0323R832J1581j4846o87K6801m5326K4850M7960K9445o9789
$$ 25319 16159 -24164 -14332 -2751 -17597 -18284 8517 -36809 -11959 36001 65446 -4343
13224d343k36L897R537k6542j2670k867K2241k6880l6799L6498N7489m9952l8388
$$ -4343 -4579 -682 8855 -17687 -30357 -33224 -10983 -37863 -74662 -38164 19325 -30627 -69015
13211f9015j3448J0371k1110q805P471J271K4438K3632N3149K7395j9990m9700
$$ -69015 -82463 -72092 -93202 -102007 -94536 -93265 -68827 -45195 7954 35349 15359 -34341
13199c4341j1315N2875P4614K1384r159o7307k6015j2295K692O0242k0914k7074
$$ -34341 -45656 7219 81833 103217 94058 26751 736 -11559 -8867 51375 30461 3387
13187C387J341K5095l4676J9197n703J0145m1506r0076J0170Q0844P773L4977
$$ 3387 4728 29823 -4853 14344 8641 18786 -22720 -112796 -102626 -21782 -14009 20968
13175B0968M2160k7917k2994o105J5343L8149N942l0305J4359J6424j3154k9267
$$ 20968 63128 35211 12217 6112 21455 59604 65546 35241 49600 66024 52870 23603
13163B3603j8713J5381M2394j5592l5389O845J2248k7811j9741k7315L3636K086
$$ 23603 4890 20271 62665 47073 11684 18529 30777 2966 -16775 -44090 -10454 -8368
13151h368l3457l10L4968m5821K024R0101K20j7243m8216K6639K1316O2782m19
$$ -8368 -41825 -42135 -7167 -52988 -50964 39137 39357 22114 -26102 537 21853 84635 84216
13138H4216L9511K9150k2648m7143q0220n5400J2546N0188q581O4817L2377k5964
$$ 84216 123727 152877 130229 83086 2866 -52534 -39988 10200 1619 66436 98813 72849
13126G2849p2746K2624j8689K0972N3331j6168n9073N544J9228k9117n0157R473
$$ 72849 103 22727 4038 25010 78341 62173 3100 8644 27872 -1245 -51402 -41929
13114d1929M9994J0994j8026k5927k4788K4999L6335O7891j3715p9679m8789K3620
$$ -41929 8065 19059 1033 -24894 -49682 -24683 11652 79543 65828 -13851 -62640 -39020
13102c9020N4231J0509j1722m0759l9810R096M753L3395l1451l820j6885L9014
$$ -39020 15211 25720 13998 -26761 -66571 -57475 -52722 -19327 -50778 -54598 -71483 -32469
13090c2469J9539J4302m0563m4269q833Q1242L1253K0349n8114m6461l8349M1859
$$ -32469 -12930 1372 -39191 -83460 -92293 -11051 20202 40551 -17563 -64024 -102373 -60514
13078f0514O7214J5062K318k1045M5434N197l1895j1791K3382j4061p691l8333
$$ -60514 6700 21762 24080 3035 48469 53666 21771 9980 33362 19301 11610 -26723
13066b6723j8L8196n3374m6595l085J9551P2204R1519K4283R170K412l5347o5601
$$ -26723 -26741 11455 -41919 -88514 -91599 -72048 156 91675 115958 125128 127540 92193 26592
13053B6592n7252M6821k2192j1729M2917m9439l5279J2326J7619L2061N4292M0066
$$ 26592 -30660 16161 -6031 -17760 25157 -24282 -59561 -47235 -29616 2445 56737 96803
13041I6803N268l8338m4914j0591L0142P243m0462J5517j0762K2464P490o050
$$ 96803 102071 63733 18819 8228 38370 45613 5151 20668 9906 32370 39860 33810
13029C3810k9916P0901O1089m4991m9059p482K7635L5357O5125L235j01033o1852
$$ 33810 3894 74795 135884 90893 41834 34352 61987 97344 162469 165704 64671 2819
13017B819J506K8046l1979j8345N6717O784k2966J6623M1219L9365K0566P4242
$$ 2819 4325 32371 392 -17953 38764 45548 22582 39205 80424 119789 140355 214597
13005B14597O3634L8967q441m503P19L9585J18084J65257J56282J51644J36951
$$ 214597 278231 317198 308757 304254 304973 344558 462642 627899 784181 935825 1072776
12994A072776K18709J37223P2285R4359J6291r8611n3109j04423j51668j87915
$$ 1072776 1291485 1428708 1500993 1595352 1611643 1513032 1459923 1355500 1203832 1015917
12984A015917j84360q4104o3316q9065j04527j06262o4409K7986l688m0005p1450
$$ 1015917 831557 747453 684137 595072 490545 384283 319874 347860 344172 304167 232717
12973B32717j8338J4859k8463o2107N285j8764j9241k8116j0617n581K0556O7158
$$ 232717 214379 229238 200775 138668 143953 125189 105948 77832 67215 61634 82190 149348
12961A49348M8130k9139m8821N427j4752J9776N0733K5201k8668j8791l4994q7954
$$ 149348 197478 168339 119518 124945 110193 129969 180702 205903 177235 158444 123450 35496
12949C5496L630k2981L0221N7483N0367j0853q7385k6516M020O1237P4127j2839
$$ 35496 39126 16145 46366 103849 154216 143363 55978 29462 33482 94719 168846 156007
12937A56007q777m7747p3889l6040k0908M0503J797l0261M7490L1077K6126Q1907
$$ 156007 147230 99483 25594 -10446 -31354 9149 10946 -19315 28175 59252 85378 167285
12925A67285m879p9584N026P720L1287K5418J0327m0689p4244L1463M9394m3871
$$ 167285 162406 82822 87848 95568 126855 152273 162600 121911 47667 79130 128524 84653
12913H4653l8014q90M2925j1717j5813l6411r0145J2025Q7457o6793L1222O6262
$$ 84653 46639 45749 88674 76957 61144 24733 -65412 -53387 34070 -32723 -1501 64761
12901F4761N8689n1096m6574j2591K7228j4517M9411m0226K3005K4713j0610k9009
$$ 64761 123450 72354 25780 13189 40417 25900 75311 35085 58090 82803 72193 43184
12889D3184l7172J5686l1490K1486j4874j2250M7624M1956M5784K7297J0778J3974
$$ 43184 6012 21698 -9792 11694 -3180 -15430 32194 74150 119934 147231 158009 171983
12877A71983L576M050j3340L107M698k0720k8732j4901J9721q282k837M7973l4878
$$ 171983 175559 179609 166269 169376 174074 153354 124622 109721 129442 121160 118323 166296 131418
12864A31418J1542K6391j5133j451J136o7914k0702n7889q502Q751L9466J3750
$$ 131418 142960 169351 154218 152767 153903 85989 65287 7398 -1104 7647 47113 60863
12852F0863k5622L1832L2519m3969j6273k7119J8008p679r279L0625N2437N1538
$$ 60863 35241 67073 99592 55623 39350 12231 30239 22560 13281 43906 96343 147881
12840A47881m6265o5536p180N8529J8709K1022M7471K6843O1359K458m6429L5021
$$ 147881 101616 36080 28900 87429 106138 127160 174631 201474 262833 265291 218862 253883
12828B53883M8272M9866J1168k0255l591K5641k2257r3361m464l729m2622m8867
$$ 253883 302155 352021 363189 342934 339343 364984 342727 249366 244902 241173 198551 149684
12816A49684L9217j1194j6165k1627l124p596l8497o408K7857j1928K7297K2593
$$ 149684 188901 177707 161542 139915 136791 129195 90698 84290 112147 100219 127516 150109
12804A50109N977l2567k3638L1085L0824q579j080M3799K0737n3657n2563M951
$$ 150109 156086 123519 99881 130966 161790 153211 152131 195930 216667 163010 110447 115398
12792A15398Q4827j6609n4611L580J5175l6801J3647J1764l2964N580J5349K1965
$$ 115398 200225 183616 129005 132585 147760 110959 124606 136370 103406 108986 124335 146300
12780A46300J5440k6742Q615K6305m4715R938o897N3849L0660P703j1095K8202
$$ 146300 161740 134998 143613 169918 125203 135141 128244 182093 212753 220456 209361 237563
12768B37563k7170n6615M6710L4323q0253n0369k6268P37P3983l7614j5158K4479
$$ 237563 210393 153778 200488 234811 154558 104189 77921 78658 152641 115027 99869 124348
12756A24348K2005N763j4883j7452Q198P809l7222Q181N560K1317k1009O422j3141
$$ 124348 146353 152116 137233 119781 127979 135788 98566 106747 112307 133624 112615 119037 105896
12743A05896K0516P2093O067l484j2485J5666j661Q118j6452r701J3006k1411
$$ 105896 126412 198505 204572 201088 188603 204269 202608 210726 194274 184573 197579 176168
12731A76168Q297m3761j0887N0816L7076M1193m9434K0808j3896j3564N0190k0816
$$ 176168 184465 140704 129817 180633 217709 258902 209468 230276 216380 202816 253006 232190
12719B32190q2408K1471L2903j2345j4861l31R460J3960P0516L6587j3989j4034
$$ 232190 149782 171253 204156 191811 176950 176619 186079 200039 270555 307142 293153 279119
12707B79119p0562K1705L3819l1614J2938L8434J2026J8777P1053L7080J7244
$$ 279119 208557 230262 264081 232467 245405 283839 295865 314642 385695 422775 440019
12696D40019l0211j4356M1730P0713q189j1280m7904N57k9187j3543j5460q3177
$$ 440019 409808 395452 437182 507895 499706 488426 440522 441079 411892 398349 382889 299712
12684B99712K6344k6756n8779L3230P9870P1718J4858n6092m7526O4243K5508
$$ 299712 326056 299300 240521 273751 353621 425339 440197 384105 336579 400822 426330
12673D26330j4268L1331M0233K2982l4522j5295M8629N1408K8584o29R485M397
$$ 426330 412062 443393 483626 506608 472086 456791 505420 556828 585412 584783 594268 598665
12661E98665o551j3702j4230l1185j7113J2066J9098L9535r620j8516O946M9768
$$ 598665 592114 578412 564182 532997 515884 527950 547048 586583 576963 558447 565393 615161
12649F15161m4711k6653L7364P4946P0461j775K4265K3347K2233J2955N3799K1582
$$ 615161 570450 543797 581161 656107 726568 724793 749058 772405 794638 807593 861392 882974
12637H82974K5019L4905p2157n357N9094J4401Q930L022N306J0133J5150J6091
$$ 882974 907993 942898 870741 865384 924478 938879 947809 950831 956137 966270 981420 997511
12625I97511O2622K5480K3184M2359Q9326Q6778L8884N9890L1781L7255P9904
$$ 997511 1060133 1085613 1108797 1151156 1240482 1327260 1366144 1426034 1457815 1495070 1574974
12614A574974R2326J06909J27980R7993J12262J02434O6347Q3122J11807J50618
$$ 1574974 1667300 1774209 1902189 2000182 2112444 2214878 2281225 2364347 2476154 2626772
12604B626772K28079K08286J73568J72445K94903K50995L07622M17848N15024
$$ 2626772 2854851 3063137 3236705 3409150 3704053 3955048 4262670 4680518 5195542
12595E195542N63160P13329R52107J072892J264061J535535J750290J951316K128749
$$ 5195542 5758702 6472031 7424138 8497030 9761091 11296626 13046916 14998232 17126981
12586A7126981K561379L069243L739884M950365O771515R481719J3092517J7186570
$$ 17126981 19688360 22757603 26497487 31447852 38219367 47701086 60793603 77980173
12578G7980173K1235509K5303653K8865595L0744445L0012160K6481730K0953464
$$ 77980173 99215682 124519335 153384930 184129375 214141535 240623265 261576729
12571B61576729J3878372M913339n205896j4234744k1079794k6108523k9370948
$$ 261576729 275455101 280368440 275162544 260927800 239848006 213739483 184368535
12564A84368535k9924315k7636648k3962826k0170343j6230664j2308292q744313
$$ 184368535 154444220 126807572 102844746 82674403 66443739 54135447 45391134
12557D5391134o268311m712532l659608l018632k489417k237029k083306j903632
$$ 45391134 39122823 34410291 30750683 27732051 25242634 23005605 20922299 19018667
12549A9018667j727393j556573j411745j247717j082571r41293q49517p39559
$$ 19018667 17291274 15734701 14322956 13075239 11992668 11051375 10201858 9462299
12541I462299o50168n61267n03619m97151m15150l34727l42118k94733k92923
$$ 9462299 8812131 8250864 7747245 7250094 6834944 6500217 6158099 5863366 5570443
12532E570443k86468k59909k36655k56263k26064k27286k10851k21962j42319
$$ 5570443 5283975 5024066 4787411 4531148 4305084 4077798 3866947 3644985 3502666
12523C502666j25951j52904j10991n0929l6801j22752r2212j58355j85069q9428
$$ 3502666 3376715 3223811 3112820 3061891 3025090 2902338 2810126 2651771 2466702 2377274
12513B377274m9139j08808j15891j08193m8168J513j33408j12826r3830j0676
$$ 2377274 2328135 2219327 2103436 1995243 1947075 1948588 1815180 1702354 1608524 1597848
12503A597848M0986m6776j00890j20630q3233p7483j4744j8661K5980j1151q3031
$$ 1597848 1638834 1592058 1491168 1370538 1287305 1209822 1195078 1176417 1202397 1191246 1108215
12492A108215m5567k6193k0196o3797q5642j037J3457M5487j9492o6659j9797
$$ 1108215 1062648 1036455 1016259 952462 866820 865783 879240 924727 905235 838576 818779
12481H18779k1225k3699m6032m2815m5615j1033J6207O512R173J697p1032n6579
$$ 818779 797554 773855 727823 685008 639393 628360 644567 651079 660252 661949 590917 534338
12469E34338L3032L5456J7378k0238m8582k1917j185k0836k6731N7831K1178l12
$$ 534338 567370 602826 620204 599966 551384 529467 528282 507446 480715 538546 559724 559412
12457E59412k5961o6631L800K1325J7183k1638l7994k7615K2346L5689q663N0950
$$ 559412 533451 466820 470620 491945 509128 487490 449496 421881 444227 479916 471253 522203
12445E22203M6622k544k6313m6336l1054j7552N5770p328K4515j0346n1703p3892
$$ 522203 568825 566281 539968 493632 462578 445026 500796 493468 517983 507637 455934 382042
12433C82042k7546L2675k1025p3996j8976k4777j2413J4375l0786n26j6728k5093
$$ 382042 354496 387171 366146 292150 273174 248397 235984 250359 219573 219047 202319 177226
12421A77226m181J3113K4678j4696K5389J8079J5131K2633K9729M2655p083m3211
$$ 177226 173045 186158 210836 196140 221529 239608 254739 277372 307101 349756 342673 299462
12409B99462M7953k5935n226N1746K4915j9643L002r1652l9029l0786K2970j8559
$$ 299462 347415 321480 316254 368000 392915 373272 376274 284622 245593 214807 237777 219218
12397B19218m7692O609O6190o0100j12678m981P7811m669k633j3589l8378l1101
$$ 219218 171526 178135 244325 184225 71547 66566 144377 139708 137075 123486 85108 54007
12385E4007M3924N6634L5689j2429o2564j15112o1719M3099M232K3807M5374J0622
$$ 54007 97931 154565 190254 177825 115261 149 -61570 -18471 -14239 9568 54942 65564
12373F5564L7951M0178l1531p454M35L4117k6029m6120j0594P754j9553l1699
$$ 65564 103515 143693 112162 104708 105143 139260 113231 67111 56517 64271 44718 13019
12361A3019r590L2663n4805l5696L5955K3568N6049L0169p762j7490l8323j1567
$$ 13019 3429 36092 -18713 -54409 -18454 5114 61163 91332 83570 66080 27757 16190
12349A6190K7178j9728o5553K7015O5766k6085l3472k5793L3678j9952J6465M0586
$$ 16190 43368 23640 -41913 -14898 50868 24783 -8689 -34482 -804 -20756 -4291 36295
12337C6295j1319p475k9580O495M2793J1303j0634j1812p2599J9569M8197k201
$$ 36295 24976 17501 -12079 -5584 37209 48512 37878 26066 -46533 -26964 21233 19032
12325A9032k6580j165n1435J3854J06298P0641k9972k4191J2415j1265o322n4080
$$ 19032 -7548 -8713 -60148 -46294 60004 130645 100673 76482 88897 77632 71310 17230
12313A7230l2358j1439N8619l007m3128K1435m0546l4135J9367L9955P1785k5690
$$ 17230 -15128 -26567 32052 29045 -14083 7352 -33194 -67329 -47962 -8007 63778 38088
12301C8088L5612M4200j5495n2727m114m7536q327R52J5949o246K3254l0417N0673
$$ 38088 73700 117900 102405 49678 45564 -1972 -10299 -9347 6602 356 23610 -6807 43866
12288D3866j1080k5838J2822J7611J2750l0592n4974L3460K0887j1501J9872J7476
$$ 43866 32786 6948 19770 37381 50131 19539 -35435 -1975 18912 7411 27283 44759
12276D4759k6680n9241m2336J5978P0155L662n1863l533K3021k070p6837j1868
$$ 44759 18079 -41162 -83498 -67520 2635 6297 -45566 -49099 -26078 -28148 -104985 -116853
12264a16853k8046j4083J8821L7880L6066j1743Q208N6859j853o617J5426K573
$$ -116853 -144899 -158982 -140161 -102281 -66215 -77958 -69750 -12891 -14744 -21361 -5935 -3362
12252c362j4695k2193K2412L9077n962N02K2083K1221l7539q043j2059M4323K7138
$$ -3362 -18057 -40250 -17838 21239 15277 15779 37862 59083 21544 13501 1442 45765 72903
12239G2903J610r1027K660J8526j4519k3666J7663N9979M462J3003l9564k6388
$$ 72903 74513 -16514 -13854 4672 -9847 -33513 -15850 44129 48591 61594 22030 -4358
12227d358k1412J3015L6616P531l990j0221m0391L01M6319m8700l8335K6901P3842
$$ -4358 -25770 -12755 23861 31392 27402 17181 -23210 -22909 23410 -25290 -63625 -36724 37118
12214C7118k9099m8935L5853J9786j0717N24l5450j0807L198k4709K4044J10433
$$ 37118 8019 -40916 -5063 14723 4006 4530 -30920 -41727 -38529 -63238 -39194 71239
12202G1239J8604k7091p7756j4882O3171J0595L785J5753J298K9040K7184M0961
$$ 71239 89843 62752 -15004 -29886 33285 43880 47665 63418 64716 93756 120940 161901
12190A61901L3188O8488P0893R5822J6830j9190R687P3547K5356o968J1757l9909
$$ 161901 195089 263577 334470 430292 447122 427932 437619 511166 536522 529554 541311 501402
12178E01402p4433n5766q8509m0905O371q371m7401l8154m7435m8482K2807l001
$$ 501402 426969 371203 282694 241789 248160 239789 192388 154234 106799 58317 81124 78123
12166G8123J4716N5445n847q29O2172N7651n0783m0266M8258N4290n7284k9638
$$ 78123 92839 148284 142437 141608 203780 261431 210648 170382 218640 272930 215646 186008
12154A86008K7255Q5864J20070J13415J12641J71271J69390J22430J88281J19255
$$ 186008 213263 299127 419197 532612 645253 816524 985914 1108344 1296625 1415880
12144A415880P3927K3722o4666j07481j33872j36945p9795j32113j78926j55646
$$ 1415880 1489807 1513529 1448863 1341382 1207510 1070565 990770 858657 679731 524085
12134E24085j08164m1174p8469o0357p3798n6634l6968K9157L0822N7393j1069
$$ 524085 415921 374747 296278 235921 162123 105489 68521 97678 128500 185893 174824
12123A74824l2515j288o2109j8012j0830j9691L1103Q363K4892J5805K5877j0372
$$ 174824 142309 141021 78912 60900 50070 30379 61482 69845 94737 110542 136419 126047
12111A26047m6745j2374K4881j3493o1042n372M1795J8652l2496j5220p870P7721
$$ 126047 79302 66928 91809 78316 17274 11902 53697 72349 39853 24633 16763 94484
12099I4484P0908k423m3894k5833q5057n3972M1303J22662O396r351j7964J7933
$$ 94484 165392 162969 119075 93242 8185 -45787 -4484 118178 124574 115223 97259 115192
12087A15192O4904l4055m8500l4398K1140j1479o519j4683O3157N599m8777k6633
$$ 115192 180096 146041 97541 63143 84283 72804 66285 51602 114759 120358 71581 44948
12075D4948p0426l1239M5349J6254l0968N386N0164o013J3221r337n0099R813
$$ 44948 -25478 -56717 -11368 4886 -26082 -20696 29468 23455 36676 27339 -22760 -12947
12063a2947O6700N5908K2093j6012J980k837j2805l9898k8768j137N7623N1532
$$ -12947 53753 109661 131754 115742 117722 114885 102080 62182 33414 32277 89900 141432
12051A41432M7886R0414J19769J42322J49154O5305l2729K8659J19602M2313q0998
$$ 141432 189318 279732 399501 541823 690977 756282 723553 752212 871814 914127 833129
12040H33129n0019r3312q5697n4138j35620j27472j02631k1247L0294K737l1416
$$ 833129 783110 689798 604101 549963 414343 286871 184240 162993 193287 196024 164608
12029A64608l5460j49k2302N615K4037l6146L2728L484R476K9365j2914o113n7154
$$ 164608 129148 128999 106697 112312 136349 100203 132931 136415 145891 175256 162342 156229 99075
12016I9075J1329J9829m6330k316L7864L6932k5906j7216n6232l2982J306J1220
$$ 99075 110404 130233 83903 81587 119451 156383 130477 113261 57029 24047 25353 36573
12004C6573j2390L6690j3391l6892j9649J5532n105k801j7062J1013L5754p776
$$ 36573 24183 60873 47482 10590 -9059 6473 1368 -1433 -18495 -7482 28272 20496
11992B0496o869n3367J7292k9409K295J1726l3756J022o355M3062k0054L9857
$$ 20496 13627 -39740 -22448 -51857 -49562 -37836 -71592 -70570 -76925 -33863 -53917 -14060
11980a4060k2223P9558p2820m1301L8622Q6935m4645k7647O0988M3795k1385r4269
$$ -14060 -36283 43275 -29545 -70846 -32224 54711 10066 -17581 43407 87202 65817 -28452
11968b8452o1952j3918P422k0415k7717l2708J9264K1892P4763Q6543k7211l6105
$$ -28452 -90404 -104322 -96900 -117315 -145032 -177740 -158476 -136584 -61821 24722 -2489 -38594
11956c8594J7383P346R220q794N391o357K8004m053J0000M0384o813L338j3121
$$ -38594 -21211 -13865 -4645 -13439 -8048 -14405 13599 9546 19546 59930 53117 56455 43334
11943D3334K3455l4062k9543o085M9568L0022k4257k3445m5477r349j16J2839
$$ 43334 66789 32727 3184 -2901 46667 76689 52432 28987 -16490 -25839 -25955 -13116
11931a3116K1076k6423o0729J621J908K7604k939J7659K828N9428k6747l1461
$$ -13116 7960 -18463 -79192 -77571 -75663 -48059 -50998 -33339 -30511 28917 2170 -29291
11919b9291j792L3185J4552k548j97l8231o8343k1385L5072L6129L9304K2435
$$ -29291 -31083 2102 16654 14106 13909 -24322 -92665 -114050 -78978 -42849 -3545 18890
11907A8890j4832L5250P7977O3742k3097n7790l8519n5560L6247M7543o779k3748
$$ 18890 4058 39308 117285 181027 157930 100140 61621 6061 42308 89851 83072 59324
11895E9324m3693l8514l7648J9578P2416N4386l2129m4889j639j9805m9386l8542
$$ 59324 15631 -22883 -60531 -40953 31463 85849 53720 8831 7192 -12613 -61999 -100541
11883a00541N9862L4585O750J1771l5177l0621l2522m1248K6665K5418L2377N1855
$$ -100541 -40679 -6094 656 12427 -22750 -53371 -85893 -127141 -100476 -75058 -42681 9174
11871I174O4561J0002j7868k8213j1025P492J6900K9306m3878K7596k7848q0768
$$ 9174 73735 83737 65869 37656 26631 34123 51023 80329 36451 64047 36199 -44569
11859d4569k8967k3887M2063O3882L5439p858j6411n5136m4244l6798j3197o622
$$ -44569 -73536 -97423 -55360 8522 43961 36103 19692 -35444 -79688 -116486 -129683 -136305
11847a36305O7053J7945k7127j2168K1148M6053O0403P921J3687J9025K5098j8469
$$ -136305 -69252 -51307 -78434 -90602 -69454 -23401 37002 44923 58610 77635 102733 84264
11835H4264p7865o28J9901n4178M292K2589K9883m3992j3717k3449j0451j390
$$ 84264 6399 5771 25672 -28506 -24214 -1625 28258 -15734 -29451 -52900 -63351 -64741
11823f4741K2670N8194j7488n4441m5171o225K0776K9019P4243O6552k298n2163
$$ -64741 -42071 16123 -1365 -55806 -100977 -107202 -86426 -57407 16836 83388 81090 28927
11811B8927m3922j5309j209J8622k6347j0257K3393k3622R649M5412M0989o4590
$$ 28927 -14995 -30304 -31513 -12891 -39238 -49495 -26102 -49724 -40075 5337 46326 -18264
11799a8264j3368K9555P126o4043l0297n714N6500M8449j0576q0503k6055L6345
$$ -18264 -31632 -2077 5049 -58994 -89291 -95005 -38505 9944 -632 -81135 -107190 -70845
11787g0845l9670M1052M9049K1280L5358m0391k2803q148P6095O2178m1109k756
$$ -70845 -110515 -69463 -20414 866 36224 -4167 -26970 -35118 40977 103155 62046 59290
11775E9290p672J715J5587j6704k7516o0867o0988j449N9359K3960m4894n1271
$$ 59290 51618 53333 68920 52216 24700 -36167 -97155 -98604 -39245 -15285 -60179 -111450
11763a11450K429M6382K593K5576o091J0658R510M1321M3145J7905J8805L018
$$ -111450 -109021 -62639 -60046 -34470 -40561 -29903 -20393 20928 64073 81978 100783 103801
11751A03801n2393r3145J510J5652q100O7295L3298k1824k9181k894O260j1739
$$ 103801 51408 -41737 -40227 -24575 -32675 34620 67918 46094 16913 14019 20279 8540
11739H540q857k9077j3636k7850p5556M5226N3262j9115j0499k3140R246k838
$$ 8540 -317 -29394 -43030 -70880 -146436 -101210 -47948 -67063 -77562 -100702 -91456 -94294
11727i4294M1355K0313J5547J1898M4463R325K6143j5505j8729J3514o886n7941
$$ -94294 -52939 -32626 -17079 -5181 39282 48607 74750 59245 40516 54030 47144 -10797
11715a0797N360L804P9959k4669n3732j1148j7573k5409j8736k7709R424N361
$$ -10797 -5437 -1633 78326 53657 -75 -11223 -28796 -54205 -72941 -100650 -91226 -85865
11703h5865m6286K1722M3572O4021M1589m900J8362k560j6421j2724M55k6044
$$ -85865 -132151 -110429 -66857 -2836 38753 33853 52215 49655 33234 20510 20965 -5079
11691e079J756K5708N387j9982o4867O390Q8606l0920j067K213M847J7993j1159
$$ -5079 -3323 22385 27772 7790 -57077 -50687 37919 6999 5932 8145 12992 30985 19826
11678A9826O0261r870p6302p3502K3695K6884K2747k2042Q2580L7997j4658n879
$$ 19826 80087 70217 -6085 -79587 -55892 -29008 -6261 -28303 54277 92274 77616 71737
11666G1737r718k9823K657J0910P997P808j0412l4377j4589K9113n6544n7641
$$ 71737 62019 32196 34853 45763 53760 61568 51156 16779 2190 31303 -25241 -82882
11654h2882L2653J1937Q045O1557l4644k1419N5567j5636K6883o639j8462k6272
$$ -82882 -50229 -38292 -30247 31310 -3334 -24753 30814 15178 42061 35422 16960 -9312
11642i312j7970K5127j0829N733N634K0872Q606p1318j9567R222N4930L8062K2436
$$ -9312 -27282 -2155 -12984 -7251 -1617 19255 27861 -43457 -63024 -53802 1128 39190 61626
11629F1626k6274j9078j4884l3094P4716J7960p7771r737N5475n1405l2454J157
$$ 61626 35352 16274 1390 -31704 43012 60972 -16799 -26536 28939 -22466 -54920 -53763
11617e3763N4834R570J3883n9107M1176L4172o9041m9888J184M370K7332k6815
$$ -53763 1071 10641 24524 -34583 6593 40765 -28276 -78164 -76980 -72610 -45278 -72093
11605g2093M7880J0208K3217l0174N175J7824j7585J7782J6059O0379m5247j2262
$$ -72093 -24213 -14005 9212 -20962 -15787 2037 -15548 2234 18293 78672 33425 21163
11593B1163m2782m2641K0608k954r579l5803K0195J2113Q0770M4091m2860j5983
$$ 21163 -21619 -64260 -43652 -46606 -56185 -91988 -71793 -59680 21090 65181 22321 6338
11581F338K806J5408R171K7179j9023L778k9334j8522k5608J9431K0985K3946
$$ 6338 9144 24552 33723 60902 41879 45657 16323 -2199 -27807 -8376 12609 36555
11569C6555M5745j8210n2898O001K47r774k7840m055M3692J3069k9230q057m7463
$$ 36555 82300 64090 11192 17193 17440 7666 -20174 -24229 19463 32532 3302 -4755 -52218
11556e2218j8486J4770P252L0560K817l4004M3879j7467n893L6288p964J8366
$$ -52218 -70704 -55934 -48682 -18122 -15305 -49309 -5430 -22897 -28790 7498 -466 17900
11544A7900L6160m2565K7616l9078J074J5813R436j6565l5504q2820l3719M1356
$$ 17900 54060 11495 39111 33 1107 16920 26356 9791 -25713 -108533 -142252 -100896
11532a00896r001M3866N9828l9m0712o6469M7446M2156M6251K5896O608k8J4698
$$ -100896 -109897 -66031 -6203 -6242 -46954 -113423 -65977 -23821 22430 48326 54934 54906 69604
11519F9604m0328l6422o6507N608K285N8402Q4670K1695n1057k8567k9449l0524
$$ 69604 29276 -7146 -73653 -68045 -65760 -7358 77312 99007 47950 19383 -10066 -40590
11507d0590N380M6702r860o9529M4155J7190o2062o545q858L2390k3859m5081
$$ -40590 -35210 11492 1632 -67897 -23742 -6552 -68614 -75159 -84017 -51627 -75486 -120567
11495a20567N801J151J3362m659K545N8584N5258N7341j113k6239l5613o5871
$$ -120567 -114766 -113615 -100253 -104912 -102367 -43783 11475 68816 67703 41464 5851 -60020
11483f0020l1370L9938Q5505O609M6366M6120L2430J0046o3694p1894o6977J7262
$$ -60020 -91390 -51452 34053 40662 87028 133148 165578 175624 111930 40036 -26941 -9679
11471i679L5893j2854n8540r615N0640j3967j740Q095N0975N9326K290k8240n4434
$$ -9679 26214 13360 -45180 -54795 -4155 -18122 -19862 -11767 39208 98534 100824 72584 18150
11458A8150j2098o1770r535M2573K1893J4795k2084m8364N6739K6856L76j1572
$$ 18150 6052 -55718 -65253 -22680 -787 14008 -8076 -56440 299 27155 27531 15959
11446A5959m6067l9182P923L0702R5267L3072m9864N99j7037k1884k4602p4037
$$ 15959 -30108 -69290 -61367 -30665 64602 97674 47810 48409 31372 9488 -15114 -89151
11434h9151K4167L8131J8080J0739m3720k4346o043R309K3916L4711m8385K037
$$ -89151 -64984 -26853 -8773 1966 -41754 -66100 -72143 -62834 -38918 -4207 -52592 -50555
11422e0555O7022J8592n1965p2186j3642m4443j1371R5302L9156m301J6754j2785
$$ -50555 16467 35059 -16906 -89092 -102734 -147177 -158548 -63246 -24090 -28391 -11637 -24422
11410b4422L1418K3884j4967k9935j01832K6595O8593n454j9126N2846M2699k2126
$$ -24422 6996 30880 15913 -14022 -115854 -89259 -20666 -26120 -45246 7600 50299 28173
11398B8173q5648J93l6459L8810J4972m730R016m524M439J7908n448N8256M6260
$$ 28173 -57475 -57282 -93741 -54931 -39959 -44689 -35673 -40197 -35758 -17850 -23298 34958 81218
11385H1218l8016o487m965p308k1602j2809L782J8316K5741m7305l4006M3909
$$ 81218 43202 36715 31750 24442 2840 -9969 -6187 12129 37870 -9435 -43441 468
11373D68j256K535K6108L672K3555k0150k6516p980J8848J3183L8800L7497r040
$$ 468 -788 1747 27855 31527 55082 34932 8416 436 19284 32467 71267 108764 99724
11360I9724j945l1884J9429p64m6374Q2O284m0463p57K9647j4752J5033k5520
$$ 99724 97779 65895 85324 84560 38186 38268 44552 4089 3332 32979 18227 33260 7740
11347G740L7734j064n41o114k4337l8952L7758o323j0322M5723J7253j8253m825
$$ 7740 45474 44410 43869 37755 13418 -25534 12224 5901 -4421 41302 58555 40302 35477
11334C5477l3467m5217j1580L2316Q1111M1940k9774j3154r133n8190l4480J3673
$$ 35477 2010 -43207 -54787 -22471 58640 100580 70806 57652 48519 -9671 -44151 -30478
11322c0478K1200l855o2637m5036L2368P2006J0720L6772O021k5384K8657j8924
$$ -30478 -9278 -13133 -75770 -120806 -88438 -16432 -5712 31060 37081 11697 40354 21430
11310B1430J2479L0394l2661p0742l9230M9163Q4538K3434k743K4095j2272o5985
$$ 21430 33909 64303 31642 -39100 -78330 -29167 55371 78805 76062 100157 87885 21900
11298B1900j6398M2260k6884O0762J9934n495q8106n4881j201O2779j8073K2892
$$ 21900 5502 47762 20878 81640 101574 96079 7973 -46908 -48109 14670 -3403 19489
11286A9489J3277J5915K5365k1355k1856o2980M625O596j6679M606K7435J1310
$$ 19489 32766 48681 74046 52691 30835 -32145 -27520 -20924 -37603 -32997 -5562 5748
11274E748j0043L0161O030k2477O101k9871M00J8648j9575K558K1092L5994l282
$$ 5748 -4295 25866 31896 9419 15520 -14351 -13951 4697 -14878 -12320 8772 44766 41484
11261D1484k8109N1320o590j6528l1690L1032j8870m716N4495r016J6926j8204
$$ 41484 13375 64695 58105 41577 9887 40919 22049 17333 71828 62812 79738 61534
11249F1534O526K4619M3582m475q04K6251p042k8641j3626Q627J1816k8732k26
$$ 61534 68060 92679 136261 131786 130982 157233 150191 121550 107924 116551 128367 99635 99409
11236I9409j3873m1335j3656O3096l5472j8638K3572J019O097r823N5587L3448
$$ 99409 85536 44201 30545 93641 58169 39531 63103 64122 70219 60396 115983 149431
11224A49431r4517k5680L0579m5358m11O2534n2552L5937K6542K5783M4752K1240
$$ 149431 54914 29234 59813 14455 14044 76578 24026 59963 86505 112288 157040 178280
11212A78280m9177J2162j520n8613K1640p679q711R682K20l1968k7038l6453M014
$$ 178280 129103 141265 139745 81132 102772 95093 86382 96064 96284 64316 37278 825 4839
11199D839N4096N9364M1584l0614k0119M815m8874l5924K1864O3508J886l4455
$$ 4839 58935 118299 159883 129269 109150 113965 65091 29167 51031 114539 116425 81970
11187H1970M1979O1600M6349l6368J0760n1573o5576k7727n0605K5145O2745l1377
$$ 81970 123949 185549 231898 195530 206290 154717 89141 61414 10809 35954 98699 67322
11175F7322j3196n9467r1601j3641K319L5565O6318p404n2302N352J7662R2957
$$ 67322 54126 -5341 -96942 -110583 -108264 -72699 -6381 -13785 -66087 -60735 -43073 49884
11163D9884M1377K7299k2957l6612k9443k6435N437k7296j1447o09j7117q999
$$ 49884 91261 118560 95603 58991 29548 3113 8550 -18746 -30193 -30802 -47919 -56918
11151e6918Q372J5041J8677L4367J6967K0679P2496r981k4628M8550M4513j596
$$ -56918 -48546 -33505 -14828 19539 36506 57185 129681 119700 95072 143622 188135 186539
11139A86539p3664o5606l8472n503l191J0232Q1721m7878o2264j4495N403j4797
$$ 186539 112875 47269 8797 3294 103 10335 92056 44178 -18086 -32581 -27178 -41975
11127d1975R9623l0469k4381N3308l2959o3774j7178j3658j4042L628K5654n426
$$ -41975 57648 27179 2798 56106 23147 -40627 -57805 -71463 -85505 -81877 -56223 -61649
11115f1649r553k2220L9192O5088M3596Q130k3727Q214j6805q1236p617M0375
$$ -61649 -71202 -93422 -54230 10858 54454 62584 38857 47071 30266 -50970 -58587 -18212
11103a8212O2839L1025o102L3720K3991k2528N2951O339n6712r6035J723M7008
$$ -18212 44627 75652 69550 103270 127261 104733 157684 164023 107311 11276 12999 60007
11091F0007M1682j2548k6228j0817l0321k0511J5112J2569N864J6073j5167k7202
$$ 60007 101689 89141 62913 52096 21775 1264 16376 28945 34809 50882 35715 8513
11079H513J0182K5910n5144k70J8202j3259M228L1170r488K775K8742N4710k0383
$$ 8513 18695 44605 -10539 -10809 7393 -5866 -1638 29532 20044 22819 51561 106271 85888
11066H5888o7643R501N0466K0012j2775m2683K4105J6215J4773L9183j3214j9857
$$ 85888 18245 27746 78212 98224 85449 42766 66871 83086 97859 137042 123828 103971
11054A03971l0374o829k8283J4641j3036O0635L4865o3851n1593m9248M0038N4438
$$ 103971 73597 66768 38485 53126 40090 100725 135590 71739 20146 -29102 10936 65374
11042F5374R905M0116q6111n249o665L0776L8483K6502n9083p346L4124L3400
$$ 65374 75279 115395 29284 24035 17370 48146 86629 113131 54048 46702 80826 114226
11030A14226J8160J1383k1535o2862l4637o869J6569J9089O0553L8318M2426Q155
$$ 114226 132386 143769 122234 59372 24735 17866 34435 53524 114077 152395 194821 202976
11018B02976L3692R45q615N622q4731m9386l5192K6791J2170l8258K7603j4091
$$ 202976 236668 237613 228998 234620 149889 100503 65311 92102 104272 66014 93617 79526
11006G9526l08M3615K1681J2029k8370k4482k6115q3754K4303K7975o205l0968
$$ 79526 79218 122833 144514 156543 128173 103691 77576 -6178 18125 46100 39895 8927
10994H927o129j5386l3129m45N1195J3044M4338L2376o6338m3214k594J3803K6664
$$ 8927 2798 -12588 -45717 -46162 5033 18077 62415 94791 28453 -14761 -17355 -3552 23112
10981B3112M3387j9511p7856m9015m1467k4464O4271R7683L1050l7365J3910j7544
$$ 23112 66499 46988 -30868 -79883 -121350 -145814 -81543 16140 47190 9825 23735 6191
10969F191n6225J1412m579J6907O0398N793l0324M4678K118K2773M3334n1684
$$ 6191 -50034 -38622 -43201 -26294 34104 39897 9573 54251 56369 79142 122476 70792
10957G0792K2414k849L4875K080o5905j8321K3980J1126j6325n4118J2769L0450
$$ 70792 93206 90357 125232 127312 61407 43086 67066 78192 61867 7749 20518 50968
10945E0968K4897L8350M4294M317j0122k4272k0596J4498J9640j4007M9631M5281
$$ 50968 75865 114215 158509 162826 152704 128432 107836 122334 141974 127967 177598 222879
10933B22879k541K0019M1725J6181L8624P7126J63434K69823L14142M21316N65754
$$ 222879 220338 240357 282082 298263 336887 414013 577447 847270 1161412 1582728 2148482
10922B148482M19644K45475J04616K5489m1195k64048n38006n86083l63333k90093
$$ 2148482 2568126 2813601 2918217 2943706 2902511 2638463 2100457 1514374 1151041 860948
10912H60948k43639q1523k0994m1952l1775q793k7371p1279m8497K607R086L548
$$ 860948 617309 535786 514792 472840 441065 432272 404901 333622 285125 287732 296818 300366
10900C00366J7096j8163k0952l7823m2955o3341N3738P0454p388q4430l0758j9977
$$ 300366 317462 299299 278347 240524 197569 134228 187966 258420 251032 166602 135844 115867
10888A15867N7428J7269m8323N32O5901L1890p8505j10765L9375K9814P645n2264
$$ 115867 173295 190564 142241 142773 208674 240564 162059 51294 90669 120483 128128 75864
10876G5864J341J3151M2298M5732J6893n3540n7222n859N1501P6240M0349O977
$$ 75864 77205 90356 132654 178386 195279 141739 84517 78658 130159 206399 246748 253725
10864B53725p883j3538k1049n4273q8751k014O4388m7517j6190L0410p79k421
$$ 253725 245842 232304 211255 156982 68231 66217 130605 83088 66898 97308 96529 94108
10852I4108k8256K1398J7552j183q831M5362N4224K6481k0317K4844j7065l2291
$$ 94108 65852 87250 104802 103619 94788 140150 194374 220855 200538 225382 208317 176026
10840A76026k0161j869j727j61K1072n3306M561j1602m10K7745M636k926n4489
$$ 176026 155865 153996 152269 152108 173180 119874 124435 112833 112423 140168 144804 141878 87389
10827H7389r3383N122O5950N9232k463K2829k4822K2277K6397M2878J4297l0133
$$ 87389 -5994 -872 65078 124310 121847 144676 119854 142131 168528 211406 225703 195570
10815A95570M4557N6225K0147j5075L1852k753J5995L0099L1730q394j1166m5010
$$ 195570 240127 296352 316499 301424 333276 330523 346518 376617 408347 399953 388787 343777
10803C43777n7476n248k2233l6111J5319k413l3143m1167o1800L3434L6771Q8843
$$ 343777 286301 281053 258820 222709 238028 235615 202472 161305 99505 132939 169710 258553
10791B58553K9340k2750n5982k0710k6113j016p482l5178o128N2998k3482j411
$$ 258553 287893 265143 209161 188451 162338 161322 153840 118662 112534 165532 142050 140639
10779A40639N0423M6081n495k8540J745M8268k4467m1037k9901n1917J2561R7910
$$ 140639 191062 237143 231648 203108 204853 253121 228654 187617 157716 105799 118360 216270
10767B16270L1409j7494N4944L3988m468J9278K7091K9605Q8406Q8484J2894K9015
$$ 216270 247679 230185 285129 319117 314649 333927 361018 390623 479029 567513 580407 609422
10755F09422P8156J7007j22587j10295J9172m3738p9315l7614k2716J69k7486
$$ 609422 687578 704585 581998 471703 490875 447137 367822 330208 307492 307661 280175
10744B80175q1059K3697N1884M5677p8q7962j6594J7839P154m340q684l8330M0906
$$ 280175 199116 222813 274697 320374 320296 232334 215740 233579 240733 236393 227709 189379 230285
10731B30285O886l7454O6603K8650p887m0868J8283J6047r611j5765k933J4672
$$ 230285 237171 199717 266320 294970 287083 246215 264498 280545 270934 255169 252236 266908
10719B66908L061k7324k6473j8152l1099K3259L9360j5504L8911q562l6962k8681
$$ 266908 269969 242645 216172 198020 166921 190180 229540 214036 252947 244385 207423 178742
10707A78742L5101M9028N2553n517m3058J5947O4528j3912l1561m7123L2916M0054
$$ 178742 213843 262871 315424 309907 266849 282796 347324 333412 301851 254728 287644 327698
10695C27698m2516j6199J9792K615m3499L977n8725m9362k9870k2498L423J3140
$$ 327698 285182 268983 288775 291390 247891 251868 193143 143781 113911 91413 94836 107976
10683A07976N6688K9673J5652k4603j4021M0536L4994m3807K39P5994L9867J7471
$$ 107976 164664 194337 209989 185386 171365 211901 246895 203088 203327 279321 319188 336659
10671C36659k7068n2225j0800K4203O897l5323l7436M470J3656J4235K9655P5532
$$ 336659 309591 257366 246566 270769 277666 242343 204907 209377 223033 237268 266923 342455
10659C42455K5421j5220J1353K681J5392J4031K1488q920k4024o857l2908L1401
$$ 342455 367876 352656 364009 366690 382082 396113 417601 408681 384657 377800 344892 376293
10647C76293k6647k3737O3336K0871j0444k3831k7675M7416M0000N3189K8217
$$ 376293 349646 325909 389245 410116 399672 375841 348166 395582 435582 488771 516988
10636E16988M3061m728J9123n4562r0051l3179J2786J12886P0217R1837L0484
$$ 516988 560049 555321 574444 519882 429831 396652 409438 522324 592541 684378 714862
10625G14862N6655L7831k2485l9101n0341m4844J8214j1107j4458r476m884k5474
$$ 714862 771517 809348 786863 747762 697421 652577 670791 659684 645226 635750 630866 605392
10613F05392m4045K303N2425K6049m9332R116J3734l5282K7091O2591J7447np3314
$$ 605392 561347 563650 616075 642124 592792 601908 615642 580360 607451 670042 687489 687484 614170
10600F14170J7265P3290M1352M3676L7687N9028J2885K2405j3740j8456K104L6093
$$ 614170 631435 704725 746077 789753 827440 886468 899353 921758 908018 889562 891666 927759
10588I27759K7562k0392n9022O751L1709l0797m7781M6902K6358M4904O0884R7944
$$ 927759 955321 934929 875907 882658 914367 883570 835789 882691 909049 953953 1014837 1112781
10576A112781N5070J00571N5737m5884L6624P8401J13818N5366l5044M8104M0116
$$ 1112781 1167851 1268422 1324159 1278275 1314899 1393300 1507118 1562484 1527440 1575544 1615660
10565A615660M7633P659m8937m1345p7735K9522J14491N0440P143N8347J225R6439
$$ 1615660 1663293 1670952 1622015 1580670 1502935 1532457 1646948 1697388 1704531 1762878 1764103 1860542
10553A860542J17924P9269J03150Q9074P0054J63972R1035Q3336O8964P0090M0835
$$ 1860542 1978466 2057735 2160885 2249959 2320013 2483985 2575020 2658356 2727320 2797410 2838245
10542B838245Q3871J36886K32096J83059J99847K90910K43914K00764K86132K74653
$$ 2838245 2922116 3059002 3291098 3474157 3674004 3964914 4208828 4409592 4695724 4970377
10532D970377K83889L61575K71632L10550M71486M54121O11852Q35232R66871
$$ 4970377 5254266 5615841 5887473 6198023 6669509 7123630 7735482 8570714 9537585
10523I537585J176126J424837J704114J668375J775695K096774K404660K592730
$$ 9537585 10713711 12138548 13842662 15511037 17286732 19383506 21788166 24380896
10515B4380896K856161L706359N043694O964185R819269J4289899K1598295L3450041
$$ 24380896 27237057 30943416 35987110 42951295 52770564 67060463 88658758 122108799
10507A22108799N1622713P5134101R5698179R5226129O5918063L0268051J2543085
$$ 122108799 173731512 248865613 344563792 439789921 505707984 535976035 548519120
10500E48519120L795243k4142743q1771902j15299354r5037851o3071666m1405801
$$ 548519120 552314363 528171620 446399718 331100364 236062513 172990847 131585046
10493A31585046k8614782k0540745j5110427j1295408q295497n998408m213779
$$ 131585046 102970264 82429519 67319092 56023684 47728187 41729779 37516000
10486C7516000k919324k143682j730939j615997j576202j754586k070869k212324
$$ 37516000 34596676 32452994 30722055 29106058 27529856 25775270 23704401 21492077
10478B1492077k027050j737717j479217j299685j035263r67821q39645p64405
$$ 21492077 19465027 17727310 16248093 14948408 13913145 12945324 12105679 11341274
10470A1341274p06281o15197n20615m87704m43552m25761l71989l03992l35439
$$ 11341274 10634993 10019796 9499181 9011477 8567925 8142164 7770175 7466183 7130744
10461G130744k75723k16715k98533k70696k29753j96057l17717l18427k25253
$$ 7130744 6855021 6638306 6339773 6069077 5839324 5643267 5325550 5007123 4781870
10452D781870k08681k29765j82868j24332j33305k12257j15658r8575r6551j58234
$$ 4781870 4573189 4343424 4160556 4036224 3902919 3690662 3575004 3476429 3379878 3221644
10442C221644j71984j16965j33577j56633j35493j31852j55435j65767j49239
$$ 3221644 3049660 2932695 2799118 2642485 2506992 2375140 2219705 2053938 1904699
10433A904699m1135k3450o640p15m6181q408j8506j8989o3282j61750k6007L1228
$$ 1904699 1863564 1840114 1833474 1832759 1786578 1778170 1759664 1740675 1677393 1515643 1489636 1520864
10421A520864j2286j6364j3559m9421p0327j70477j46300m6104Q871m0448k7243
$$ 1520864 1508578 1492214 1478655 1429234 1358907 1188430 1042130 996026 1004897 964449 937206
10410I37206l0608m4963l6613M327l5506n752k8634j5648K5190N2657J5616K5641
$$ 937206 906598 861635 825022 829349 793843 788091 759457 743809 768999 821656 837272 862913
10398H62913P39k1170o9772k1073K0494n5204n1119Q060p287J0572N5470R527
$$ 862913 863652 842482 772710 751637 772131 716927 665808 673868 666581 677153 732623 742150
10386G42150n0990n8015k040k9386k1321J0556N2595k4041o3882j1842M0043R4582
$$ 742150 691160 633145 631105 601719 580398 590954 643549 619508 555626 543784 583827 678409
10374F78409J03065J08133L8436l4678n4642n4953l4758j12211j24913n8925L917
$$ 678409 781474 889607 928043 893365 838723 783770 749012 636801 511888 452963 456880
10363D56880p972o9694o8258l0293P113m4623K377l3212k2529L8025n536J7342
$$ 456880 448908 379214 310956 280663 287776 243153 245530 212318 189789 227814 222278 239620
10351B39620L2030n7272k6808p380m2938n3308N261L2144O7564n4623o4990N5569
$$ 239620 271650 214378 187570 180190 137252 83944 89205 121349 188913 134290 69300 124869
10339A24869L1845J4181K6125k617o6226n87M6858K1144L1338j4711Q912j9269
$$ 124869 156714 170895 197020 194403 128177 127590 174448 195592 226930 212219 221131 201862
10327B01862j0037j4526o704M4652j8084k8892L7561L0736m468k6224m8067k4339
$$ 201862 191825 177299 170595 215247 197163 168271 205832 236568 232100 205876 157809 133470
10315A33470l3918k2953J2542j7440m0484K9392K2129j12897k9197Q4411K4442
$$ 133470 99552 76599 89141 71701 31217 60609 82738 -30159 -59356 25055 49497
10304D9497M2962n7108k6280p122J2233M8751J7203J4021j5767J7061k8157q628
$$ 49497 92459 35351 9071 1949 14182 62933 80136 94157 78390 95451 67294 58666
10292E8666m791L4295J3942m9927m0116R780Q432K975k9477m0858J8152J8468
$$ 58666 53875 88170 102112 52185 12069 21849 30281 33256 3779 -37079 -18927 -459
10280d59j0360q728L5224Q918l5659j4331m0190o7087K0216M7115N5852O3112
$$ -459 -10819 -19547 15677 24595 -11064 -25395 -65585 -132672 -112456 -65341 -9489 53623
10268E3623J0748J77N861k1978j1188J5396m0355m5053M7937l4651l5344K1152
$$ 53623 64371 64548 70409 48431 37243 52639 12284 -32769 15168 -19483 -54827 -33675
10256c3675L8808p334L6627J3180j7633k6918O0605M4111l5520k8656Q120N749
$$ -33675 5133 -2201 34426 47606 29973 3055 63660 107771 72251 43595 51715 57464
10244E7464L1789k3115j2890O704j3980k4992q8219K0489J2915m7241N8654N473
$$ 57464 89253 66138 53248 59952 45972 20980 -67239 -46750 -33835 -81076 -22422 -16949
10232a6949l8997M64j8747L0878K0682J3675K0648J3623j1542P1672M1781l8159
$$ -16949 -55946 -55482 -74229 -43351 -22669 -8994 11654 25277 13735 85407 127188 89029
10220H9029r1584l4520m54k5526P44J6549O5785o1305m2734L0815o2989m167j2972
$$ 89029 -2555 -37075 -37529 -63055 -62311 -45762 20023 -41282 -84016 -53201 -116190 -120357 -133329
10207a33329k1412N5605L4017Q736N2209O6324P475p4023r9006j0764p0192p7634
$$ -133329 -154741 -99136 -65119 -56383 -4174 62150 69625 -4398 -103404 -114168 -184360 -261994
10195b61994l4328k8845K494j957k6804Q7212Q5458N4249o464p743O3444L1225
$$ -261994 -296322 -325167 -322673 -324630 -351434 -264222 -178764 -124515 -130979 -138722 -75278 -44053
10183d4053l6453j3661P6518J11737m902j9720j6178N210J4538Q1951O6402K8671
$$ -44053 -80506 -94167 -17649 94088 89186 69466 53288 58498 73036 154987 221389 250060
10171B50060N7354J43329K01481K14768K52974L96094M91651N36296L86321J84706
$$ 250060 307414 450743 652224 866992 1119966 1516060 2007711 2544007 2930328 3115034
10161C115034R1283j0085j12403l90367n65705n21316l99785k39325j76670j75064
$$ 3115034 3206317 3196232 3083829 2693462 2127757 1606441 1206656 967331 790661 615597
10151F15597j39264q2110r7945m1474j8150j9183j9702m4546r227N653k5315n5326
$$ 615597 476333 394223 296278 254804 236654 217471 197769 153223 143996 149649 124334 69008
10139F9008O078m206r378K512L74m245j9885j0971L1768J8222j5833N217o0808
$$ 69008 75086 70880 61502 64014 64388 60143 40258 29287 61055 79277 63444 68661 7853
10126G853M8860L3264J4220N5761n4330q0853l8462l0431m4489K5597M0423L0177
$$ 7853 56713 89977 104197 159958 105628 24775 -13687 -44118 -88607 -63010 -22587 7590
10114G590l804n5086K0908k6258M453K9829M2502k7169n0924k2123J9105M0846
$$ 7590 3786 -51300 -30392 -56650 -52197 -22368 20134 -7035 -57959 -80082 -60977 -20131
10102b0131L537J1168k8630o5963k862N6639M2752P4865R2380K0211q9837L040
$$ -20131 -16594 -5426 -34056 -100019 -102881 -46242 -3490 71375 163755 183966 94129 97169
10090I7169N6509J6240K5301N2457L3347R166Q8831J96591K70686M80817M62605
$$ 97169 153678 169918 195219 247676 281023 290189 379020 575611 846297 1327114 1789719
10079A789719M83855L33240J82886O3561j2307j71908m04430n59367n14858l26304
$$ 1789719 2273574 2606814 2789700 2853261 2840954 2669046 2264616 1705249 1190391 864087
10069H64087k00155j68408j03323j40700q7711l8567l3817J08r356L6456P371
$$ 864087 663932 495524 392201 251501 163790 125223 91406 91514 82158 118614 125985
10058A25985P085q850N881M3938P5527n55n7971p9881K0028J9742J3209j10946
$$ 125985 133070 124220 130101 174039 249566 249011 191040 111159 131187 150929 164138 53192
10046E3192n5818M319L9242j1685J6509K6578Q654K29l9577P2697R5646P6931
$$ 53192 -2626 1693 40935 29250 45759 72337 80991 81220 41643 114340 209986 286917
10034B86917j3162M6302J39512Q9948Q8910J05700J51570J57776J25191K1257
$$ 286917 273755 320057 459569 549517 638427 744127 895697 1053473 1178664 1199921
10024A199921K2787j09097k02195j33158o4305r2652j15907j50151q4259q1995
$$ 1199921 1222708 1113611 911416 778258 713953 621301 505394 355243 270984 188989
10014A88989m1196J7381K8427K6012j7073m8439n753J4462o702l969j5919k8256
$$ 188989 147793 165174 193601 219613 202540 154101 148348 162810 156108 152139 136220 107964
10002A07964n412K5609j5183p7882q5501J4665K7678L1397m7888q005l56j0650
$$ 107964 102552 128161 112978 35096 -50405 -35740 -8062 23335 -24553 -32558 -32914 -43564
9990d3564J8942j240m3859K1329O1337r500p695k8953K2572l370L1743m3174j0679
$$ -43564 -24622 -25862 -69721 -48392 12945 3445 -4250 -33203 -10631 -14001 17742 -25432 -36111
9977c6111N2417J5277R501J7167n0485k9876K7800K0623J4088K4883m083o8473
$$ -36111 16306 31583 41084 58251 7766 -22110 5690 26313 40401 65284 61201 -7272
9965g272r1905l9553L8915L0097J9436O70j5729j772O3434P4791j6757n9624Q753
$$ -7272 -99177 -138730 -99815 -69718 -50282 -49612 -65341 -67113 -3679 71112 54355 -5269 3484
9952C484m923m5784N0505M8426L9296l9779j08531j6178M1049K3897j2825l2557
$$ 3484 -1439 -47223 3282 51708 91004 51225 -57306 -73484 -32435 -8538 -21363 -53920
9940e3920J2422r413k0268O5518M7615l3312J4820j2156J1173L3230K4581K1615
$$ -53920 -41498 -50911 -71179 -5661 41954 8642 23462 11306 22479 55709 80290 101905
9928A01905j782J6658m2243l0960n7855j8655k2021J2897M8390j3738m3794k830
$$ 101905 100123 116781 74538 43578 -14277 -32932 -54953 -42056 6334 -7404 -51198 -54028
9916e4028K6059m5639o1888J5705j11M1357J0094m4535K2565M9721J4398l4994
$$ -54028 -27969 -73608 -135496 -119791 -119902 -78545 -68451 -112986 -90421 -40700 -26302 -61296
9904f1296M0630j3787M1428j4144m1758n6159j4028J34324L2938P251j6123P9659
$$ -61296 -20666 -34453 6975 -7169 -48927 -105086 -119114 15210 48148 55399 39276 118935
9892A18935P0089r4n6295M973m4458m5754o981J4082n5305o5545N0511M1202R11
$$ 118935 189024 188930 132635 137608 93150 47396 40415 54497 -808 -66353 -15842 25360 26271
9879B6271N415J9796J9714l6600q882J0651j9359r291j6733k8011J4969J8532
$$ 26271 31686 51482 71196 34596 25714 36365 17006 7715 -9018 -37029 -22060 -3528
9867c528O8601L8921k2383m1224J4086k6819n512l1595K8326L526k9360j8522
$$ -3528 65073 103994 81611 40387 54473 27654 22142 -9453 18873 22399 -6961 -25483
9855b5483M5780P309K7230K315k8268o0807l3400M7070K8947j5994O9475K8649
$$ -25483 20297 27606 54836 57151 28883 -31924 -65324 -18254 10693 -5301 64174 92823
9843I2823k0498Q695l1924o2616K1184r829j5044J9687l177M0208N250m8633r156
$$ 92823 72325 81020 49096 -13520 7664 -2165 -17209 2478 -699 39509 44759 -3874 -13030
9830a3030l218k7076K487O0856N5852m6206M444J4008k0477q881r611m8888N866
$$ -13030 -16248 -43324 -40837 20019 75871 29665 34109 48117 27640 18759 9148 -39740 -33874
9817c3874L6305J9350R440l5192j7060M3130m428k5622m8311J952J6508L555N185
$$ -33874 2431 21781 31221 -3971 -21031 22099 17671 -7951 -56262 -54310 -37802 -34247 -29062
9804b9062n9928R291M4990l5510L8993K3324k0987j0150l9834J7409L0291j5340
$$ -29062 -88990 -79699 -34709 -70219 -31226 -7902 -28889 -39039 -78873 -61464 -31173 -46513
9792d6513k7747q776L9223M2324K2716n3607n0987K9448p351K6526j7922l8083
$$ -46513 -74260 -83036 -43813 -1489 21227 -32380 -83367 -53919 -61270 -34744 -52666 -90749
9780i0749K6832k229K2051L8903R717K9062j1105m8349k8440O127K6726K7721
$$ -90749 -63917 -66146 -44095 -5192 4525 33587 22482 -25867 -54307 -48180 -21454 6267
9768F267J4675K2228j9803m4906k073L8103J1286P686j5062j7431N893J6670o8533
$$ 6267 20942 43170 23367 -21539 -23612 14491 25777 33463 18401 970 6863 23533 -45000
9755d5000l0477J8969M2663J3398N3093l7429M2196N856J2215l2615n2704N2472
$$ -45000 -75477 -56508 -13845 -447 52646 15217 57413 63269 75484 42869 -9835 42637
9743D2637j860k3258R931m0730k0287j7565O0083K7286k0396k199K4326K8928
$$ 42637 40777 17519 27450 -13280 -33567 -51132 8951 36237 15841 13642 37968 66896
9731F6896j2980Q636k9465P358O5247L2745k839K8152q2931l7628L6329J3519
$$ 66896 53916 62552 33087 40445 105692 138437 135598 163750 80819 43191 79520 93039
9719I3039k5731J3406q083m0167j7851M981O8410r393m0392K1259m0883l5136
$$ 93039 67308 80714 72631 32464 14613 19594 88004 78611 38219 59478 18595 -16541
9707a6541J7893q088M0633L0756m5000k0921Q170k2305m6225L8917J6578k6224
$$ -16541 1352 -6736 33897 64653 19653 -1268 6902 -15403 -61628 -22711 -6133 -32357
9695c2357k9938L4832J3011Q178N2514O8012j2429j2157J5430k7498n0694o2753
$$ -32357 -62295 -27463 -14452 -6274 46240 114252 101823 89666 105096 77598 26904 -35849
9683c5849Q743N5876k9998j0173L5460J0732J1497N334k1614o1308K3377J05722
$$ -35849 -27106 28770 -1228 -11401 24059 34791 46288 51622 30008 -31300 -7923 97799
9671I7799N5401o6066q0310J5845L267L1403M7104L3654M4882l8547l7567n59
$$ 97799 153200 87134 6824 22669 25936 57339 104443 138097 182979 144432 106865 106306
9659A06306n7411L8586K1879j3405l7725o7990j0083K2338k5395N6306J11039
$$ 106306 48895 87481 109360 95955 58230 -9760 -19843 2495 -22900 33406 144445
9648A44445L1658j9819l1588p5950k1533l3117m025N7787M2478k8460k8327m7498
$$ 144445 176103 156284 124696 48746 27213 -5904 -9929 47858 90336 61876 33549 -13949
9636a3949j1061N8288K1356K539K8307K3510j2938l5884l8043r762r82l83P148
$$ -13949 -25010 33278 54634 57173 85480 108990 96052 60168 22125 12363 11381 10998 18146
9623A8146k5821N400N8980J0671l5819j3230L3050n4557m0593o8197r063M2313
$$ 18146 -7675 -2275 56705 67376 31557 18327 51377 -3180 -43773 -111970 -121033 -78720
9611g8720J6909J4244K5508L3911P1910M2720j8215q6610l6043J5929R799N446
$$ -78720 -61811 -47567 -22059 11852 83762 126482 108267 21657 -14386 1543 11342 16788
9599A6788J2143J0496k9741n4146o5194K1413R3582k7218m9967P532j1028m547
$$ 16788 28931 39427 9686 -44460 -109654 -88241 5341 -21877 -71844 -64312 -75340 -79887
9587g9887J7512J3742N2632L8620J3561J2392j2625j6062k4911R48l5232p4443
$$ -79887 -62375 -48633 3999 42619 56180 68572 55947 39885 14974 15922 -19310 -93753
9575i3753j6075K3662L632K2973M568K5886K458j0247K8298L5723L6288N645N5788
$$ -93753 -109828 -86166 -82534 -59561 -54993 -29107 -26649 -36896 -8598 27125 63413 69058 124846
9562A24846l2017p3235l2267J8025Q4023l9576p1535K3279R0160K2596k4928j4917
$$ 124846 92829 19594 -12673 5352 89375 49799 -21736 1543 91703 114299 89371 74454
9550G4454k388K8993o040l3367m9361J811K9304K1307k0426k1562m785j6636k4709
$$ 74454 72066 101059 95019 61652 12291 14102 43406 64713 44287 22725 17940 1304 -23405
9537b3405Q490m0001q715O3082J3054m4830J2655L1820L2910N0338l655n3382
$$ -23405 -14915 -54916 -63631 -549 12505 -32325 -19670 12150 45060 95398 91743 38361
9525C8361j2271J5523o5294j9956L2727O2447k2863j1799j5929l212K6805M1299
$$ 38361 26090 41613 -23681 -43637 -10910 51537 28674 16875 946 -2266 24539 65838
9513F5838P1510M0942j4196l5146o6799p3839J7954K8950l396m9215n808L1552
$$ 65838 137348 178290 164094 128948 62149 -11690 6264 35214 31818 -17397 -23205 8347
9501H347n324M8965M1561M0615K6431m883j0790k0646m3321J094l1619P70j2554
$$ 8347 3023 51988 93549 134164 160595 155712 144922 124276 80955 82049 50430 51200 38646
9488C8646M535n9828m8464k019m416O6404J006j6053K9092L1387j2143j0215Q3002
$$ 38646 43181 -16647 -65111 -67130 -71546 -5142 -4136 -20189 8903 40290 28147 17932 100934
9475A00934n624j6223K4321p011M0729k1627p9980k9452k019K1244k3161J8787
$$ 100934 95310 79087 103408 96397 137126 115499 35519 6067 4048 25292 2131 20918
9463B0918L4136J8006L4478K9466K1823k5441k1702o7040m2298P5382j8123l2830
$$ 20918 55054 73060 107538 137004 158827 133386 111684 44644 2346 77728 59605 26775
9451B6775K035j6477l6411K4132J1367K8254K2607N9235M34o0503K2592j9923
$$ 26775 28810 12333 -24078 54 11421 39675 62282 121517 121951 61448 84040 64117
9439F4117n5650n2640O70M5905K096L4806J3997j5181j7204K3159P1615J3368
$$ 64117 8467 -44173 -43503 2402 4498 39304 53301 38120 20916 44075 115690 129058
9427A29058o835R321m8810j1449O527J8365L5363k7343j3190R631l312K7374n257
$$ 129058 122223 131544 82734 71285 77812 96177 131540 104197 91007 100638 97326 124700 119443
9414A19443k2243K7264J8448J1697l56j8692Q811q0906l0483M2733L0674J3397
$$ 119443 97200 124464 142912 154609 154253 135561 144372 63466 32983 75716 106390 119787
9402A19787K3613n061k7468l8410Q288K4004M3742L524m6440m366M3201k4427
$$ 119787 143400 138339 110871 72461 80749 104753 148495 152019 105579 101213 144414 119987
9390A19987o8127k4407J27531p0356n2877m3463R790J57961R8909m6873o364q6843
$$ 119987 51860 27453 154984 84628 31751 -11712 -1922 156039 254948 208075 201711 114868
9378A14868o7737k7250J2413l868j6874k0444q474j1485J00328P2248l3035k4803
$$ 114868 47131 19881 32294 28426 11552 -8892 -17366 -28851 71477 143725 110690 85887
9366H5887K2704m1145K2600m723J2054R24Q740J4165j8363l9138j2014L509M0529
$$ 85887 108591 67446 90046 85323 97377 98301 107041 121206 102843 63705 51691 55200 95729
9353I5729j1795m169K3684K9297n7055j7328O3880m427J359K5607J6283q145m5010
$$ 95729 83934 79765 103449 132746 75691 58363 122243 117816 119175 144782 161065 152920 107910
9340A07910j5562n250k9662n017L3176j7840j9928q972j5653J6489K1636j7742
$$ 107910 92348 87098 57436 52419 85595 67755 47827 38855 23202 39691 61327 43585
9328D3585L2223K9799M2618o350l0158P422R653p1747N1107M4446J6355m1917
$$ 43585 75808 105607 148225 141875 111717 119139 128792 57045 108152 152598 168953 127036
9316A27036J7811K6682l3837n594k3933J7185J8288j1829M361R621m742K46O191
$$ 127036 144847 171529 137692 132098 108165 125350 143638 131809 136170 145791 141049 141295 147486
9303A47486l060o1731l7284J3549M7399M5630N9931n4136n3708M135k9569k1868
$$ 147486 144426 82695 45411 58960 106359 151989 211920 157784 104076 108211 78642 56774
9291E6774p976N7574q716m5327P471L4020J8575M795l0932m0472M2738M9258j9815
$$ 56774 48798 106372 97656 52329 59800 93820 112395 117190 86258 45786 88524 137782 117967
9278A17967q305l7879m3848m0439Q664q511M0891N4757R302n9972O445k1182J0219
$$ 117967 109662 71783 27935 -12504 -3840 -12351 28540 83297 92599 32627 39072 17890 28109
9265B8109O8455M102R517O0960L1885l8869q486l4807l8568O6138L6804M3689
$$ 28109 96564 100666 110183 171143 203028 164159 155673 120866 82298 148436 185240 228929
9253B28929J7991j738k0388m9126j812O5910r525N6571Q137k2339o9712m8400
$$ 228929 246920 245182 224794 175668 173856 239766 230241 286812 294949 272610 202898 154498
9241A54498k9689j2937J8500M2016J3701L1214J2074r408L230k4696p2841L1986
$$ 154498 124809 111872 130372 172388 186089 217303 229377 219969 223199 198503 125662 157648
9229A57648Q033j1708J764m5022O00j6320j8185p932K4652M4595K0494J2299K8891
$$ 157648 165681 153973 155737 110715 111315 94995 76810 68878 93530 138125 158619 170918 199809
9216A99809q911l5324R540J4865L7880k1887j4662K5564l5995J8769O655n0958
$$ 199809 190898 155574 165114 179979 217859 195972 181310 206874 170879 189648 196303 145345
9204A45345K1222J06972M9108l047k6167l0381j9542q766J5717N3113k7592l7360
$$ 145345 166567 273539 322647 319600 293433 263052 243510 234744 250461 303574 275982 238622
9192B38622l4654N6281N9064k1087n6757m7796J6449Q5963p875R243J0639l4592
$$ 238622 203968 260249 319313 298226 241469 193673 210122 296085 288210 297453 308092 273500
9180B73500K4401J2811p0030k9659J0850K043L3306L952J7167l5301j2019J4733
$$ 273500 297901 310712 240682 211023 221873 223916 257222 261174 278341 243040 231021 245754
9168B45754m9154M586O8326m0203M8573j217j7716R029K6215j2409j0281R827
$$ 245754 196600 201186 269512 229309 277882 276665 258949 267978 294193 281784 271503 281330
9156B81330K2762K6782l0084L3716r219m6233m3269j0564l3283n421L4713q451
$$ 281330 304092 330874 300790 334506 325287 279054 235785 225221 191938 186517 221230 212779
9144B12779K4441K1769n9626o930N8602K1744L9811L3387k5510l8328j2944P4031
$$ 212779 237220 258989 199363 192433 251035 272779 312590 345977 320467 282139 269195 343226
9132C43226L4540j0881l7042o3359m4222K7309O7878K7362K928l8312o8182J9409
$$ 343226 377766 366885 329843 266484 222262 249571 317449 344811 347739 309427 241245 260654
9120B60654O7568J5403j2078m7315J0366j0707J5302N8522n611k152m1175l3999
$$ 260654 328222 343625 331547 284232 294598 283891 299193 357715 352104 349952 308777 274778
9108B74778J371J0463L0994Q25n351k7963n2847M6449Q9933L2408r744j6668k2576
$$ 274778 276149 286612 317606 318431 313080 285117 232270 278719 368652 401060 391316 374648 352072
9095C52072j0802J7514J8915K4761m3377J6009N6410j3499k8262m9258j0939J0055
$$ 352072 341270 358784 377699 402460 359083 375092 431502 418003 389741 340483 329544 339599
9083C39599M0253J3559J5550j1331N050K6695j9912j4796P432L8830K1919l1616
$$ 339599 379852 393411 408961 397630 402680 429375 409463 394667 402099 440929 462848 431232
9071D31232k3784J1489k9810L9334j775K0919O38l6204l340j6574K8463K6661
$$ 431232 407448 418937 389127 428461 426686 447605 448243 412039 408699 392125 420588 447249
9059D47249j7651l0927K1607j7923m0926L2967N1006k7186M4132N5211M5129K4276
$$ 447249 429598 398671 420278 402355 361429 394396 445402 418216 462348 517559 562688 586964
9047E86964o1291r9766Q230j534j6456N915J2067K5847k9556p879K7656L1615
$$ 586964 525673 425907 434137 432603 416147 422062 434129 459976 430420 422541 450197 481812
9035D81812m3961m2648M6732N7265k80j5875M9336N7978J0687o2716J1737j4479
$$ 481812 437851 395203 441935 499200 498920 483045 532381 590359 601046 538330 550067 535588
9023E35588J9686m7697n4154J4805R779K6079L8324j0736J7256J1918K0185N9520
$$ 535588 555274 507577 453423 468228 478007 504086 542410 531674 548930 560848 581033 640553
9011F40553J5141l5029n2939m961R759L7401J2742J1311K3598R050j3442m5831
$$ 640553 655694 620665 567726 562765 572524 609925 622667 633978 657576 666626 653184 607353
8999F07353k650P006M419n5111m9290N6476L0086J2779K0729L2580K0767M1601
$$ 607353 604703 611709 616128 561017 511727 568203 598289 611068 631797 664377 685144 726745
8987G26745J6104J3816L1508K9997l6269M981P2136j1020J3396m3145o2671L199
$$ 726745 742849 756665 788173 818170 781901 786882 859018 847998 861394 818249 755578 758777
8975G58777P9935j8367O597J6104J0292P905l8384m9484L6916M914j3209J6106
$$ 758777 838712 820345 826942 843046 853338 861243 822859 773375 810291 815205 801996 818102
8963H18102M1777K6899l1184j9794L8646L7562j5762k2390M9744K4442l0889k9605
$$ 818102 859879 886778 855594 835800 874446 912008 896246 873856 923600 948042 917153 887548
8951H87548j8585R145N389k4767m423N4427K2959l56K9132Q783j7301N3933J8352
$$ 887548 868963 878108 883497 858730 854307 908734 931693 931337 960469 969252 951951 1005884 1024236
8938A024236k0134m3733K3799J5729J3104J954r439J6789O0048L7186K9913j2776
$$ 1024236 1004102 960369 984168 999897 1013001 1014955 1005516 1022305 1082353 1119539 1149452 1136676
8926A136676J6777m804J7913M4921J6526N7415m7395n3550Q025N4232M2046O859
$$ 1136676 1153453 1148649 1166562 1211483 1228009 1285424 1238029 1184479 1192504 1246736 1288782 1295641
8914A295641J7747M5592j5706k1829O2006Q0325L4756L8693j7845j8772r470l2905
$$ 1295641 1313388 1358980 1343274 1321445 1383451 1463776 1498532 1537225 1519380 1500608 1491138 1458233
8902A458233j8751l8360J1329Q0017N6171L1584P2739n412l5813m84Q1912N5513
$$ 1458233 1439482 1401122 1412451 1492468 1548639 1580223 1652962 1647550 1611737 1611253 1693165 1748678
8890A748678N0767q117l8931O1177L9316M6073K0491K7884M7181l6830K5918J5400
$$ 1748678 1799445 1791328 1752397 1813574 1852890 1898963 1919454 1947338 1994519 1957689 1983607 1999007
8878A999007K3823L5677P2745P4297m100l7710j9591N2559Q4543Q3195R8302J9459
$$ 1999007 2022830 2058507 2131252 2205549 2201449 2163739 2144148 2196707 2281250 2364445 2462747 2482206
8866B482206K173K4115L3869j0894K7510M3193J9383Q3175Q1208M4268Q0043M3490
$$ 2482206 2484379 2508494 2542363 2531469 2558979 2602172 2621555 2704730 2785938 2830206 2910249 2953739
8854B953739J6141P7725J1023j7047J07084Q2246N1912J9723L6578J8339L7679
$$ 2953739 2969880 3047605 3058628 3041581 3148665 3230911 3282823 3302546 3339124 3357463 3395142
8843C395142J24816O4498N105L278J31014O8125O4898Q1824P4891J08833J09699
$$ 3395142 3519958 3584456 3589561 3592839 3723853 3791978 3856876 3938700 4013591 4122424 4232123
8832D232123R3469P6408P9295J9104Q518O1832J49054J31440Q9497J26776J85922
$$ 4232123 4325592 4402000 4481295 4500399 4508917 4570749 4719803 4851243 4940740 5067516 5253438
8821E253438J60409J30753J12431Q1189Q6872J17385J10588R2524O7620J87703
$$ 5253438 5413847 5544600 5657031 5738220 5825092 5942477 6053065 6145589 6213209 6400912
8811F400912J94167J88536J90048J33635J20018J39957J08070J32546J66018K20244
$$ 6400912 6595079 6783615 6973663 7107298 7227316 7367273 7475343 7607889 7773907 7994151
8801G994151K11222J80721K38079J46843K01943J75309J87863K52120K87921K87502
$$ 7994151 8205373 8386094 8624173 8771016 8972959 9148268 9336131 9588251 9876172 10163674
8791A0163674K59475K70752J90569K44812L13677L27902K83334K86785L13312
$$ 10163674 10423149 10693901 10884470 11129282 11442959 11770861 12054195 12340980 12654292
8782A2654292L40619K49741K88785L71326L04133L28328L87292L43237L96098
$$ 12654292 12994911 13244652 13533437 13904763 14208896 14537224 14924516 15267753 15663851
8773A5663851L29838L02721L40248L07116L26783L36261L95470L39311L41014
$$ 15663851 15993689 16296410 16636658 16943774 17270557 17606818 18002288 18341599 18682613
8764A8682613L55889L42365L86137L44363L04983K88453K34794K25845K26187
$$ 18682613 19038502 19380867 19767004 20111367 20416350 20704803 20939597 21165442 21391629
8755B1391629J63076J48177J07650R0754J40900J48164N2298P0564N3932o2339
$$ 21391629 21554705 21702882 21810532 21901286 22042186 22190350 22242648 22313212 22367144 22304805
8745B2304805J39k5143j13833j32100j44488r9399k32810k21798k59427k09890
$$ 22304805 22304944 22279801 22165968 22033868 21889380 21789981 21557171 21335373 21075946 20866056
8735B0866056k43542k82641l33365l27704l28064k95996l19730l60894l32425
$$ 20866056 20622514 20339873 20006508 19678804 19350740 19054744 18735014 18374120 18041695
8726A8041695l31827l16130l14704k82072l13844l61563l90445m16326l75112
$$ 18041695 17709868 17393738 17079034 16796962 16483118 16121555 15731110 15314784 14939672
8717A4939672l13126l38946l15886l12414l53097k43866k04165k55603l11547
$$ 14939672 14626546 14287600 13971714 13659300 13306203 13062337 12858172 12602569 12291022
8708A2291022l58155k99820k39042k65679l10664k67536k59952j94946j82190
$$ 12291022 11932867 11633047 11394005 11128326 10817662 10550126 10290174 10095228 9913038
8699I913038k42396k88099k01082k06866k44954k12000k18492j69694j73320k15762
$$ 9913038 9670642 9382543 9181461 8974595 8729641 8517641 8299149 8129455 7956135 7740373
8689G740373j42519k00554j84499j29219j78046j29340p7490j42298j32441j04152
$$ 7740373 7597854 7397300 7212801 7083582 6905536 6776196 6698706 6556408 6423967 6319815
8679F319815j10505j20423j29058j50528k09686j18797j15120r5147p1538j21044
$$ 6319815 6209310 6088887 5959829 5809301 5599615 5480818 5365698 5270551 5199013 5077969
8669E077969o5605q4569o0145j06796j32258r2625j03827j14309m7343o2587j37831
$$ 5077969 5012364 4927795 4867650 4760854 4628596 4535971 4432144 4317835 4270492 4207905 4070074
8658D070074o1449q8962j05493l9594n2356q0344k2982o543j9396o0374j17150
$$ 4070074 4008625 3919663 3814170 3774576 3722220 3641876 3618894 3612351 3592955 3532581 3415431
8647C415431o2012k5402j17921q5463Q720K8857p4166o3209M840q4758r0236m7104
$$ 3415431 3353419 3328017 3210096 3124633 3133353 3162210 3088044 3024835 3029675 2944917 2854681 2807577
8635B807577p3885p9111j1961l6090l5301o3179n4163k3810K5421J4816o4775
$$ 2807577 2733692 2654581 2642620 2606530 2571229 2508050 2453887 2430077 2455498 2470314 2405539
8624B405539k5126m8403j6417l3047r821q0149n876K4415k6592m6713o2244j4081
$$ 2405539 2380413 2332010 2315593 2282546 2272725 2192576 2186700 2211115 2184523 2137810 2075566 2061485
8612B061485j6056l157M3314k5254m9516j9945L084J1947O0093l3508K8800J5593
$$ 2061485 2045429 2042272 2085586 2060332 2010816 1990871 1993955 2005902 2065995 2032487 2061287 2076880
8600B076880k1008L1838j3849m7333M5477O8214l0986j05048r0137l4504l1608
$$ 2076880 2055872 2087710 2073861 2026528 2072005 2140219 2109233 2004185 1914048 1879544 1847936
8589A847936r5669j04546j16142k8171o334p5359n3582n7613O3055N866j5954
$$ 1847936 1752267 1647721 1531579 1503408 1497074 1421715 1368133 1310520 1373575 1379441 1363487
8578A363487o1944m4641k5035k9949J9341J7369o456M266N671l4168n9476k9282
$$ 1363487 1301543 1256902 1231867 1201918 1221259 1238628 1232172 1236438 1242109 1207941 1148465 1119183
8566A119183k6167k9172L3778P5276Q620r300q2862m6955k0492k6300j017P330
$$ 1119183 1093016 1063844 1097622 1172898 1181518 1172218 1089356 1042401 1021909 995609 994592 1001922
8554A001922R223j4928J5203m4574j7802l4088k0961l1168N623J6544j8372J5923
$$ 1001922 1011145 996217 1011420 966846 949044 914956 893995 862827 868450 884994 866622 882545
8542H82545j3241m7154o541p604r198o3741m0631K2620o0531k0273Q7433o49m5670
$$ 882545 869304 822150 815609 808005 798807 735066 694435 717055 656524 636251 723684 723035 677365
8529F77365k0626K2378j7444J8597o262N2526L4537l5830m1724m7807K8555n1847
$$ 677365 656739 679117 661673 680270 674008 726534 761071 725241 683517 635710 664265 612418
8517F12418k947N6128o44q3573l2185J8211M4624m465R491N0507P81l8984m800
$$ 612418 609471 665599 664955 581382 549197 567408 612032 607567 617058 667565 668346 629362 624562
8504F24562j4555K4969p094N307l5979j1795j0924m3486o0027J6682K7281k2981
$$ 624562 610007 634976 627882 633189 597210 585415 574491 531005 470978 487660 514941 491960
8492D91960J3760m3371n4474o224M2973k288K283j8787j2323o570m8605J3299
$$ 491960 505720 462349 407875 401651 444624 442336 444619 425832 413509 406939 358334 371633
8480C71633O8191n106l9163M4316j4973R033J1099K5183j2096l0155k3108l0892
$$ 371633 439824 434718 395555 439871 424898 433931 445030 470213 458117 427962 404854 373962
8468C73962k5373K3869j5655Q046L0019L3299k4958j5584n0318r212j5542M8391
$$ 373962 348589 372458 356803 364849 394868 428167 403209 387625 337307 328095 312553 360944
8456C60944J0601l2066O674N361l4344L167P749J4792Q680m6337J1446N9198L0044
$$ 360944 371545 339479 346153 351514 317170 320337 328086 342878 351558 305221 316667 375865 405909
8443D05909j9689n9289n3666k3629O646M4865k141l1718N9896N6166L6339L5854
$$ 405909 386220 326931 273265 249636 256282 301147 299006 267288 327184 383350 419689 455543
8431D55543M619o169o6156p0079m0910l4323P323K7119m2722K3531m2993o058
$$ 455543 460162 453993 387837 317758 276848 242525 249848 276967 234245 257776 214783 208725
8419B08725L0247n964m1943K4399K4928J0449L1698j115K2008j6876K9479N1198
$$ 208725 238972 233008 191065 215464 240392 250841 282539 281424 303432 286556 316035 367233
8407C67233R450n8584n1675j9113o656l7088m212K022P6996j0823l3972L39N2792
$$ 367233 376683 318099 266424 247311 240655 203567 199355 201377 278373 267550 233578 233917 286709
8394B86709M1237l931O246n438o2741o7564J9830r903m3062M051K9518J6478l426
$$ 286709 327946 324015 330261 324823 262082 194518 214348 204445 161383 165434 194952 211430 208004
8381B08004j7841P9130N5181r589m367o1299M3740n891k774L3478j08113j04790
$$ 208004 190163 269293 324474 314885 310518 249219 292959 287068 284294 317772 209659 104869
8369A04869K5009J18m1197K5980J4551L2807l862J1226O364j4822K1043j7499
$$ 104869 129878 129996 88799 114779 129330 162137 158275 169501 175865 161043 182086 164587
8357A64587P485Q831J5842M783k825n67M8273N0161o4863m1168n4597J7942L6597
$$ 164587 172072 180903 196745 201528 198703 198136 246409 296570 231707 190539 135942 153884 190481
8344A90481M5839k4928p2165p7479o89M8259J9600J2591l0011K111M9821J4791
$$ 190481 236320 211392 139227 61748 61059 109318 128918 141509 111498 113609 163430 178221
8332A78221L1104j0796j0357n0208q728P3738o8413o2164L6719L1871J0341L0604
$$ 178221 209325 198529 188172 137964 129236 202974 134561 72397 109116 140987 151328 181932
8320A81932j6834k7229L8008O7206n0545k1263N158l6551M9054J3863J5966J1939
$$ 181932 165098 137869 175877 243083 192538 171275 176433 139882 188936 202799 218765 230704
8308B30704p3248j2908L8519J1586m1300l4992m4243j8531m6605Q3672O3031R473
$$ 230704 157456 144548 183067 194653 153353 118361 74118 55587 8982 92654 155685 165158
8296A65158n235K1904O8975K3690L819J769K2522P0341J42291J65494J79375K22097
$$ 165158 159923 181827 250802 274492 278311 280080 302602 372943 515234 680728 860103 1082200
8284A082200J80407R3513Q781j9882p9163j56004j80045j46502k02831j23809
$$ 1082200 1262607 1356120 1364901 1345019 1265856 1109852 929807 783305 580474 456665
8274D56665j03342r9234k5375L2337M0000l8340m156j9728N789L2318j9319m1379
$$ 456665 353323 254089 228714 261051 301051 262711 258555 238827 244616 276934 257615 216236
8262B16236q326m3741n4200k4200K7425M4815O0327K5150L329o4526L609N2676
$$ 216236 207910 164169 109969 85769 113194 158009 218336 243486 246815 182289 185898 238574
8250B38574J22745Q0651J6899R0214J11066K25428J77781J57187O4477M7816J5567
$$ 238574 361319 441970 458869 549083 660149 885577 1063358 1220545 1285022 1332838 1348405
8239A348405l932j31954k82971k27932j17635j38054q5774k0263N206l4632n7972
$$ 1348405 1344473 1212519 929548 701616 583981 445927 360153 339890 345096 310464 252492
8228B52492L2073k5201q5122m2110m1058n008J00454L9299q9323m6474L6663J5686
$$ 252492 284565 259364 174242 132132 91074 86066 186520 225819 136496 90022 126685 142371
8216A42371l5652J1080K6071O4414k0803k9006q509l5123m7683J2235N4962m96
$$ 142371 106719 117799 143870 208284 187481 158475 149966 114843 67160 79395 134357 133861
8204A33861l7251o870L2212J8797p2045j4757O400L4125k198p7291l8371n4029
$$ 133861 96610 89740 121952 140749 68704 53947 60347 94472 92274 14983 -23388 -77417
8192g7417O3816J03744K3938k7537r774k6384k2878Q8667N7431P773k5888J0434
$$ -77417 -13601 90143 114081 86544 76770 50386 27508 116175 173606 181379 155491 165925
8180A65925J926k4866K1325j3104j7022j6136K2050Q173K9372l0154l1010j9599
$$ 165925 167851 142985 164310 151206 134184 118048 140098 148271 177643 147489 116479 96880
8168I6880l3872k3159M7150L2884L1067K2058O396m3374N031n5414j9516K5868
$$ 96880 63008 39849 86999 119883 150950 173008 179404 136030 141061 85647 66131 91999
8156I1999k0417K0612n666l6688m501j7187M5058N3825k0644q0377K1136L6468
$$ 91999 71582 92194 86528 49840 45339 28152 73210 127035 106391 26014 47150 83618
8144H3618p136J6479l4179L0335p961n130M3420l8953j2827k6931n9992p191P2184
$$ 83618 76482 92961 58782 89117 81156 76026 119446 80493 67666 40735 -19257 -26448 45736
8131D5736P9156k9719l4151k3174K5358k3983n0133j6901R4338R5089k5961l2379
$$ 45736 124892 95173 61022 37848 63206 39223 -10910 -27811 66527 161616 135655 103276
8119A03276m0612k8781P450K0758L0324N3l7931l6906j5757k3241j1431K1551
$$ 103276 62664 33883 41333 62091 92415 92468 54537 17631 1874 -21367 -32798 -11247
8107a1247K6786k1256O482J9461j2670j2296Q0081j2099k1304l0177j8703K714
$$ -11247 15539 -5717 765 20226 7556 -4740 75341 63242 41938 11761 -6942 -4228
8095d228M1830r602n125K8910K4136M1038N6951n6207o3713K2504O3062O2005
$$ -4228 37602 28000 22875 51785 75921 116959 173910 117703 53990 76494 139556 201561
8083B01561j3830k5184k0946m6951j6086R627K6784j2764l4508p4516j0376m0801
$$ 201561 187731 162547 141601 94650 78564 88191 114975 102211 67703 -6813 -17189 -57990
8071e7990J5269L5785M6312O08p187R509j5168m65L0463J4828m0083k6031k457
$$ -57990 -42721 -6936 39376 39984 32797 42306 27138 26673 57136 71964 31881 5850 3393
8058C393J3476K5323Q648k5587Q8330L2282o2046J2399m38m1641k948Q083K010
$$ 3393 16869 42192 50840 25253 113583 145865 83819 96218 95780 54139 51191 59274 61284
8045F1284N0975q834p38j6190l0113j6900M7843J750M915l1837J0263N7155p0282
$$ 61284 112259 103425 102687 86497 56384 39484 87327 89077 93992 62155 72418 129573 59291
8032E9291q517N1301N4604j337m5474o0172k733Q789j0424k2169K149m59L5541
$$ 59291 50774 102075 156679 155342 109868 49696 46963 55752 45328 23159 25308 24849 60390
8019F0390P174J8451p233j9485m3694R459O7123J3184M2164j5272K1747n771p3560
$$ 60390 67564 86015 78782 59297 15603 25062 92185 105369 147533 132261 154008 148237 74677
8006G4677J4842l574p490K1217K996J8910M5547j3900R393j2477p49j7273n522
$$ 74677 89519 85945 78455 99672 102668 121578 167125 153225 162618 150141 149392 132119 126597
7993A26597J8616N5695M3607l4885j5752j0111j8571j0704P186P393O835j6859
$$ 126597 145213 200908 244515 209630 193878 183767 165196 154492 161678 169071 175906 159047
7981A59047k7015j6073k4410j7867N1928L5873j4087k5752J9995l999j2084j192
$$ 159047 132032 115959 91549 73682 125610 161483 147396 121644 141639 137640 125556 124364
7969A24364M582J9722K1252m9892k6085K1593j6643L428M0621J6876N1403L4002
$$ 124364 128946 148668 169920 120028 93943 115536 98893 102321 142942 159818 211221 245223
7957B45223m0361Q1467L938q5545k4941L1017L9017K4954o4219q162K3708p2960
$$ 245223 204862 286329 290267 204722 179781 210798 249815 274769 210550 202388 226096 153136
7945A53136q012n0003m2621N1097M4611L0551n1622m8279M3451K6689K7189l748
$$ 153136 145124 95121 52500 103597 148208 178759 127137 78858 122309 148998 176187 172439
7933A72439K7438j1247l1856j3878J1960k8626j3919j159J09k6279m3768k535
$$ 172439 199877 188630 156774 142896 154856 126230 112311 111152 111261 84982 41214 38679
7921C8679J2659N8916K8998R3987k6994n5327k8556n1492l2414N824R548M575
$$ 38679 51338 110254 139252 233239 206245 150918 122362 70870 38456 44280 53828 58403
7909E8403K7950m5216l4190K3251R173J6146o410l9427k2769Q2323O5924Q753
$$ 58403 86353 41137 6947 30198 39371 55517 49107 9680 -13089 69234 135158 143911
7897A43911l561j1307o9675Q4231M8027m0691k2901J480r922k2518j1683M5137
$$ 143911 140350 129043 59368 143599 191626 150935 128034 129514 119592 97074 85391 130528
7885A30528N5899j7703l9582j5527J3183l5089o3980j8495M1973O6992n424o1491
$$ 130528 186427 168724 129142 113615 126798 91709 27729 9234 51207 118199 112775 51284
7873E1284k2005l068O4643o561k9027o9250m8137M6351M7350K5610J5239L1543
$$ 51284 29279 26211 90854 84293 55266 -13984 -62121 -15770 31580 57190 72429 103972
7861A03972M3885l2319j4623N1576k8927j07075p7851K7268P8044L9285j1937
$$ 103972 147857 115538 100915 152491 123564 16489 -61362 -34094 43950 83235 71298
7850G1298L2651Q341o864k1142n2189N5258N4570k3681r179N5600m4692n2862
$$ 71298 103949 112290 105426 84284 32095 87353 141923 118242 109063 164663 119971 67109
7838F7109k4471J7127n982O80j0472Q44J2284n8768r382P361k1612J5458j0336
$$ 67109 42638 59765 53783 54463 43991 44835 57119 -1649 -11031 -3670 -25282 -9824 -20160
7825b0160l632j7477j5206J563L3280j3874j66k8783k6680M1398K6563K6386M2182
$$ -20160 -23792 -41269 -56475 -54912 -21632 -35506 -35672 -64455 -91135 -49737 -23174 3212 45394
7812D5394j2762n8780j9854l9488J4595J2602M640O9755p364o3982L027J4340
$$ 45394 32632 -26148 -46002 -85490 -70895 -58293 -53653 16102 8738 -55244 -52217 -37877
7800c7877n6429J1543Q6841Q1994O037j2093k3601n5291l5466m55l9709J9133
$$ -37877 -94306 -82763 4078 86072 92109 80016 56415 1124 -34342 -34797 -74506 -55373
7788e5373m390l0730K7617K4858Q145J2348J1058n00l471j0937m3940l3098M3152
$$ -55373 -59763 -90493 -62876 -38018 -29873 -17525 -6467 -6967 -10438 -21375 -65315 -98413 -55261
7775e5261L5129L0209n3996L6245m7650L8970K4863m7817k2590j1287M9016N9333
$$ -55261 -20132 10077 -43919 -7674 -55324 -16354 8509 -39308 -61898 -73185 -24169 35164
7763C5164k730k1795L4720j0706j5980k0559R69J4640l2108Q982k6512K265L1948
$$ 35164 32434 10639 45359 34653 18673 -1886 -917 13723 -18385 -9403 -35915 -33650 -1702
7750a702j1414o8255K0722P0859Q5618R393l5972p3029k9039Q7855l1670k0215
$$ -1702 -13116 -81371 -60649 10210 95828 105221 69249 -3780 -32819 55036 23366 3151
7738C151m8494l7822L7171L366K535L5479J8044N979L0116O1472J584k1189n5174
$$ 3151 -45343 -83165 -45994 -42628 -40093 -4614 13430 19409 49525 110997 112581 91392 36218
7725C6218l4055J6158M1301k080j8301k1541n3303J1948O0752O0818k0896n0080
$$ 36218 2163 18321 59622 57542 39241 17700 -35603 -23655 37097 97915 77019 26939
7713B6939m8682j1876N4510J1436N863O3356K4457m32k1315j4232M2444k2704
$$ 26939 -21743 -33619 20891 32327 38190 101546 126003 125571 104256 90024 132468 109764
7701A09764j6043p1839n3575M7899K0368k2932K0503K3528p201K775j7903o9750
$$ 109764 93721 21882 -31693 16206 36574 13642 34145 57673 50472 53247 35344 -34406
7689c4406L6168J7452N301l6203J5466M0421K8705m8340K740M6881J1298l253
$$ -34406 1762 19214 24515 -11688 3778 44199 72904 24564 27304 74185 85483 82230
7677H2230j8687m1765J8007M5033Q3688k4173l5914J3853m7545m2404j1644k8178
$$ 82230 63543 21778 39785 84818 168506 144333 108419 122272 74727 32323 20679 -7499
7665g499j9819R1486O2830m1155q7087k0023L3131M7118O2032j0984p7931k4378
$$ -7499 -27318 64168 126998 85843 -1244 -21267 11864 58982 121014 110030 32099 7721
7653G721L3410k2420j6225L7350k209K1887J3582N974m92n7393m4398R337p0070
$$ 7721 41131 18711 2486 39836 37627 59514 73096 79070 78578 21185 -23213 -13876 -83946
7640h3946l4072L8969L4289L0373L328J7660M4501k7030o6271L5810O288k6083
$$ -83946 -118018 -79049 -44760 -14387 -11059 6601 51102 24072 -42199 -6389 -101 -26184
7628b6184l2960k7877L3627M0967J5589P7779L6067q420l8963n5948J2339j3386
$$ -26184 -59144 -87021 -53394 -12427 3162 80941 117008 108588 69625 13677 26016 12630
7616A2630k2504q692K6702J1995m463k8664k3337l117k3429k6184K9895j6347
$$ 12630 -9874 -18566 8136 20131 15668 -12996 -36333 -39450 -62879 -89063 -59168 -75515
7604g5515M4161K5943j9351O662m9007j3427p792J1422J1067k1601m4889O9445
$$ -75515 -31354 -5411 -24762 -18100 -67107 -80534 -88326 -76904 -65837 -87438 -132327 -62882
7592f2882L8998N260j7878L4944O207j5547j8188r0198j769L491J8053n261k8152
$$ -62882 -23884 -18624 -36502 -1558 4649 -10898 -29086 -119284 -121053 -117562 -99509 -104770 -132922
7579a32922L1801L6417J7844J2591N604M1936K3290l4951m353L610j5338o263
$$ -132922 -101121 -64704 -46860 -34269 -28665 13271 36561 1610 -2743 867 -14471 -20734
7567b0734L5445L5637N472n4247m1419R180p590l67j5039K8465q482O090P5258
$$ -20734 14711 50348 55820 1573 -39846 -30666 -38256 -38623 -53662 -25197 -33679 -27589 47669
7554D7669J8112o0630m2269l8174M1253m021J8551J0709n5862m356N6390p891
$$ 47669 65781 5151 -37118 -75292 -34039 -38060 -19509 -8800 -64662 -69018 -12628 -20519
7542b0519m5413P3984J9364m9554m7975j6049L5451m912K992M4672K4877n2008
$$ -20519 -65932 8052 27416 -22138 -70113 -86162 -50711 -55623 -52631 -7959 16918 -35090
7530c5090K676m164k9418N966k3978K8453Q457M0709j4733l1629l0975l1816N0232
$$ -35090 -32414 -36578 -65996 -60030 -84008 -55555 -47098 -6389 -21122 -52751 -83726 -115542 -65310
7517f5310L6841J5525l3765Q830J4078k1439m1213K1037K9356J2715m6369j4361
$$ -65310 -28469 -12944 -46709 -37879 -23801 -45240 -86453 -65416 -36060 -23345 -69714 -84075
7505h4075j1417K968L5300k2659n086K0533k9991o3898J3331N9346P3457L4879
$$ -84075 -95492 -92524 -57224 -79883 -84969 -64436 -94427 -158325 -144994 -85648 -12191 22688
7493B2688q755p4671q028L6753L446O7981n854l2889o092n744q221N7281o649
$$ 22688 13933 -60738 -68766 -32013 -28567 39414 33560 671 -5421 -11165 -19386 37895 31246
7480C1246o2080m6458l6877n055N5355K7183K6263L0197k9302L4491J8833k7519
$$ 31246 -30834 -77292 -114169 -119224 -63869 -36686 -10423 19774 -9528 24963 43796 16277
7468A6277m2711O849M7025L8488r809p4859j4513n2100k5216K7559L8449L0939
$$ 16277 -26434 -19585 27440 65928 56119 -18740 -33253 -85353 -110569 -83010 -44561 -13622
7456a3622J4268q480K3237j0699n059K0974j3418l3051n8236o3428L3971J00732
$$ -13622 646 -7834 15403 4704 -355 20619 7201 -25850 -84086 -147514 -113543 -12811
7444a2811j3455m2971M7918K5774K2864j6414k0947k1465j2697L270j2089m2209
$$ -12811 -26266 -69237 -21319 4455 27319 10905 -10042 -31507 -44204 -40934 -53023 -95232
7432i5232o344M4572j6831J9970J2570N2844P215o6718p2329M06K9242P6549J5165
$$ -95232 -101576 -57004 -73835 -53865 -41295 11549 18764 -47954 -120283 -119877 -90635 -14086 1079
7419A079o0088k5246J9323K3265N8350J6242l1542L352j336o61N53K735N0665
$$ 1079 -59009 -84255 -64932 -41667 16683 32925 1383 4735 3399 2738 3291 6026 56691
7406E6691J303o8435k5564L1926J02115J2153j6038o3563n9490N4479K5774P51
$$ 56691 57994 -10441 -36005 -4079 98036 110189 94151 30588 -28902 25577 51351 52102
7394E2102M552P299p8066o7099p286K1616k3130J7777K1424r011K4122M7503J9901
$$ 52102 56654 63953 -14113 -81212 -88498 -66882 -90012 -72235 -50811 -59822 -35700 11803 31704
7381C1704k1204M34j7022M524J4878l3621j8942O4130M2217k4789k3933l9745
$$ 31704 10500 10934 -6088 -1564 13314 -20307 -39249 24881 67098 42309 18376 -21369
7369b1369j6798j0413K2611l3765q224L8751l7237K5474K7939L9889L8024J6163
$$ -21369 -38167 -48580 -25969 -59734 -67958 -29207 -66444 -40970 -13031 26858 64882 81045
7357H1045k9596l530K5646j3088l0869j2655k3325N390o023j1168j9264p2376
$$ 81045 51449 47919 73565 60477 29608 16953 -6372 -982 -7005 -18173 -37437 -109813
7345a09813j9902M4070J7088k9806K3550K7364K7859J4345k6733o0225N0568K6825
$$ -109813 -129715 -85645 -68557 -98363 -74813 -47449 -19590 -5245 -31978 -92203 -41635 -14810
7333a4810k6268J482M220J7743j4875o833k7656J2106K0996k2275R771L0653k256
$$ -14810 -41078 -39596 -35376 -17633 -32508 -39341 -66997 -54891 -33895 -56170 -46399 -15746 -18002
7320a8002j0214K7194j124j4407K346R764m5210Q756M3087J9195K91j3328J8880
$$ -18002 -28216 -1022 -2146 -16553 -14207 -4443 -49653 -40897 2190 21385 21676 8348 27228
7307B7228l1203N611J6137N3087L0972k4084m1041k8809K3041K4576l4175j4865
$$ 27228 -3975 1636 17773 70860 101832 77748 36707 7898 30939 55515 21340 6475
7295F475j7431l6881j0689m614q512L3335L6116L4017O809k5495m3765j818O2794
$$ 6475 -10956 -47837 -58526 -63140 -71652 -38317 -2201 31816 38625 13130 -30635 -32453 30341
7282C0341l3398k0236K2278K5125N9649n6010n7837J1234J7535K5865J8424j6444
$$ 30341 -3057 -23293 -1015 24110 83759 27749 -30088 -18854 -1319 24546 42970 26526
7270B6526k8502K3746p292j5585P397l8559J1264M6748j2440P640l1033q3070
$$ 26526 -1976 21770 14478 -1107 6290 -32269 -21005 25743 13303 20943 -10090 -93160
7258i3160J1930M3792J1786P6710n3181k0960m1419j9199N11M4048m111K8652
$$ -93160 -81230 -37438 -25652 51058 -2123 -23083 -64502 -83701 -83190 -39142 -43253 -14601
7246a4601K6852J0081m647P934m613m3656n2908j4849J6533J8423K9206K547J9276
$$ -14601 12251 22332 17685 25619 21006 -22650 -75558 -90407 -73874 -55451 -26245 -23698 -4422
7233d422k7385M2827M6876j093l5344m3666N661J3759K8950n6610j1954P9857
$$ -4422 -31807 11020 57896 56803 21459 -22207 -16546 -2787 26163 -30447 -42401 37456
7221C7456L5191q087j5403k2910n9937m6563M2129L2802l6004j0464L186j7571
$$ 37456 72647 64560 49157 26247 -33690 -80253 -38124 -5322 -41326 -51790 -48604 -66175
7209f6175K952J6927m897K7139J3002O5569n0878p8146k3510j5307K5329J4880
$$ -66175 -63223 -46296 -51193 -24054 -11052 54517 3639 -74507 -98017 -113324 -87995 -73115
7197g3115n5449J8884O3842j4701l5487J520L5282N1836O1877n419n860m0426
$$ -73115 -128564 -109680 -45838 -60539 -96026 -94506 -59224 -7388 54489 49070 43210 2784
7185B784m0804q955M418N312O7713J4006o1305J4690J1818p166Q295k7295K7404
$$ 2784 -38020 -46975 -42557 -37245 30468 44474 -16831 -2141 9677 2511 10806 -16489 10915
7172A0915j8038n5953L9292j6K1494L9692J6381K5135j0196R912k6123p7313J8459
$$ 10915 -7123 -63076 -23784 -23800 -2306 37386 53767 78902 68706 78618 52495 -24818 -6359
7159f359K069K3443P536n5598n4195n1659L2369O0742j0908q7026L0610J1505
$$ -6359 -4290 19153 26689 -28909 -83104 -134763 -102394 -41652 -52560 -139586 -108976 -97471
7147i7471L9704l397N4807j7090m3172M8446K6729m218J1189K1066j1487L7703
$$ -97471 -57767 -61164 -6357 -23447 -66619 -18173 8556 4338 15527 36593 25106 62809
7135F2809J2527M4240p2612p0920m2097M1709M0411N589j4075J1532j4549M2541
$$ 62809 75336 119576 46964 -23956 -66053 -24344 16067 21656 7581 19113 4564 47105
7123D7105L856p172J5797m4615k9190k7234l0888O205N620P8746k1650m1776k6324
$$ 47105 50961 43789 59586 14971 -14219 -41453 -72341 -66136 -60516 18230 -3420 -45196 -71520
7110g1520J5096L7880Q2779L158l7625k744M4349j9171n5507m3010k2038j682
$$ -71520 -56424 -18544 64235 67393 29768 27024 71373 52202 -3305 -46315 -68353 -70035
7098g0035R676l7681k1577p064J05938J1307m8692n116J9829L9363M0675j3418
$$ -70035 -60359 -98040 -119617 -126681 -20743 -9436 -58128 -63244 -43415 -4052 36623 23205
7086B3205M282k601l4897j3123j1819r09P441J3879K8102J0392K9364J5546n7600
$$ 23205 27487 24886 -10011 -23134 -34953 -35862 -28421 -14542 13560 23952 53316 68862 11262
7073A1262l5962l3077n3560l588m6751k9155M4893P9583K8890M306k8657l8758
$$ 11262 -24700 -57777 -111337 -114925 -161676 -190831 -145938 -66355 -37465 -33159 -61816 -100574
7061a00574J8833N3156J4602j2276j6987n4869M075R038K4115L7658n8452l0094
$$ -100574 -81741 -28585 -13983 -26259 -43246 -98115 -94040 -85002 -60887 -23229 -81681 -111775
7049a11775M2168J0017n045m0263m144k1502J2301O8941K5104p1523J694L1122
$$ -111775 -69607 -59590 -64635 -104898 -109042 -130544 -118243 -49302 -24198 -95721 -94027 -62905
7037f2905J465o307J3037J5253N6169M8677j1068p8896p8673k3654N2591L3065
$$ -62905 -61440 -67747 -54710 -39457 16712 65389 54321 -24575 -103248 -126902 -74311 -41246
7025d1246L476j5460O516J4913M500j4703P073J164l2861k4764J5858P8830j5109
$$ -41246 -37770 -53230 -46714 -31801 -27301 -42004 -34931 -33767 -66628 -91392 -75534 3296 -11813
7012a1813m6714j4001p778l0551q232k0405j6947L0350K5194l382K7282K6858
$$ -11813 -58527 -72528 -80306 -110857 -119089 -139494 -156441 -126091 -100897 -104279 -76997 -50139
7000e0139K4640k3534j6131L6851j5170l3456J2906K119j9196J7813L203J1570
$$ -50139 -25499 -49033 -65164 -28313 -43483 -76939 -64033 -61914 -81110 -63297 -60094 -48524
6988d8524L8236N783k110n0458j3591M480j0902L0097J3863L3418p885J316j4851
$$ -48524 -10288 -4505 -6615 -57073 -70664 -66184 -77086 -46989 -33126 292 -7593 -6277 -21128
6975b1128p2320m8228O3641P0839m1484l295l6750L7881j1525k616L8429J682
$$ -21128 -93448 -141676 -78035 -7196 -48680 -51975 -88725 -50844 -62369 -64985 -26556 -24874
6963b4874j3850l8877J6890L2682m7901k7573L3317O332J4065L746J0034L3033
$$ -24874 -38724 -77601 -60711 -28029 -75930 -103503 -70186 -63854 -49789 -46043 -36009 -2976
6951b976j1568N091K6079J0626m402k0549J3302j2666j8289l6044N1894M7364
$$ -2976 -14544 -9453 16626 27252 22850 2301 15603 2937 -15352 -51396 498 47862
6939D7862J9405L9399j2943l2055n23M4788l7310p3919k3570K3856j0674L3299
$$ 47862 67267 106666 93723 61668 61145 105933 68623 -5296 -28866 -5010 -15684 17615
6927A7615L5905l806L8297j3813n1733n4728L2676R2727N1883k1515l6873n062
$$ 17615 53520 49714 88011 74198 22465 -32263 413 93140 145023 123508 86635 81573
6915H1573o1708m9488j6523O8531n5644M810K2140m8553J7354J8598j9248O3661
$$ 81573 19865 -29623 -46146 22385 -33259 -28449 -6309 -54862 -37508 -18910 -38158 25503
6903B5503M9764m3541j1045m3525m4929K2456j2232L6024p249k9650k9759J6439
$$ 25503 75267 31726 20681 -22844 -67773 -45317 -57549 -21525 -28774 -58424 -88183 -71744
6891g1744l184M1308o501J4028J5770k2997Q753k9159J6869O7960j2226l2004
$$ -71744 -74928 -33620 -40121 -26093 -10323 -33320 -24567 -53726 -36857 31103 18877 -13127
6879a3127r8289K2297Q0409L1048l4395O0070L1099k5216k1368q7474m3349K6561
$$ -13127 -111416 -89119 -8710 22338 -12057 48013 79112 53896 32528 -54946 -98295 -71734
6867g1734j7749l4931o086L3552k322L960P8373J4193j6559P2108Q30J3481k6685
$$ -71734 -89483 -124414 -130500 -96948 -99270 -95310 -16937 -2744 -19303 52805 53635 67116 40431
6854D0431k1058k8459L8086J8780r205n059q645l1087k5535j2364J7429K5081
$$ 40431 19373 -9086 29000 47780 38575 33516 24871 -6216 -31751 -44115 -26686 -1605
6842a605n9248m3854N1964L81M6436j0719O274l4802j1408J9631j8689j6837M087
$$ -1605 -60853 -104707 -52743 -52362 -5926 -16645 -10371 -45173 -56581 -36950 -55639 -72476 -68389
6829f8389K3003K160r0700n0312O5727P0718J0973J2307L9099l3107k4203P7878
$$ -68389 -45386 -43226 -133926 -184238 -118511 -47793 -36820 -24513 14586 -18521 -42724 35154
6817C5154L7123l3556m1239p052J5731q261m3530J2372L3297L4227K5825l4161
$$ 35154 72277 38721 -2518 -9570 6161 -2100 -45630 -33258 39 34266 60091 25930
6805B5930o3968j0961O3395j0809l7157j0961m1196M8444O2017k6509k3635r33
$$ 25930 -38038 -48999 14396 3587 -33570 -44531 -85727 -37283 24734 -1775 -25410 -26343
6793b6343l54J8580K9968j0451k8124J650j5504l4073Q2M3285K9897L7307o58
$$ -26343 -26697 -8117 21851 11400 -16724 -15074 -30578 -64651 -64569 -21284 8613 45920 45262
6780D5262l9529R56R751L720l3246n6693J0512k826l8282j9849M3755O9953K8632
$$ 45262 5733 6689 16440 20160 -13086 -69779 -59267 -62093 -100375 -120224 -76469 -6516 22116
6767B2116j3904K442M895L2998k2687q590J8177j9676J9817m3970q184k0208k3703
$$ 22116 8212 10654 15549 48547 25860 17270 35447 15771 35588 -8382 -16566 -36774 -60477
6754f0477L0817J1426O673l0079k1031J6567K8376j4828o779k2917L3241M5598
$$ -60477 -29660 -18234 -11561 -41640 -62671 -46104 -17728 -32556 -39335 -62252 -29011 16587
6742A6587j1287q3563J8199P9702K8255o635L0080j6004k5743L04l0491n4318
$$ 16587 5300 -78263 -60064 19638 47893 41258 71338 55334 29591 29895 -596 -54914
6730e4914Q908p921k367J781k1854m9166L7603M3914R389L7408n6171J2333O0721
$$ -54914 -46006 -53927 -56294 -54513 -76367 -125533 -87930 -44016 -34627 2781 -53390 -41057 19664
6717A9664k174p9704k3879N7023J4451j0351M1498J8861N455K9864j2399n9017
$$ 19664 17490 -62214 -86093 -29070 -14619 -24970 16528 35389 40844 70708 58309 -708
6705g08J2390J9300k6204k6341j0990l6781m263J0649l6356K5749L0309J7822
$$ -708 11682 30982 4778 -21563 -32553 -69334 -73597 -62948 -99304 -73555 -43246 -25424
6693b5424p131n6932L8939L3942k6716J9719p7162J153K6546K213O6404L6918
$$ -25424 -32555 -89487 -50548 -16606 -43322 -23603 -100765 -99612 -73066 -70853 -4449 32469
6681C2469q996M764m4506l9280K173M9299P3483o3421p8473k9681M3040P713K309
$$ 32469 23473 28237 -16269 -55549 -53376 -4077 69406 5985 -72488 -102169 -59129 -51416 -49107
6668d9107N5996Q211l7634N260m5093K891K7440K8240k7096J6971m3803n885J2307
$$ -49107 6889 15100 -22534 -17274 -62367 -59476 -32036 -3796 -30892 -13921 -57724 -63609 -51302
6655e1302M0724J714o5054J4196k7356p7296j1803Q0910M1542L8968o955m9381
$$ -51302 -10578 -8864 -73918 -59722 -87078 -164374 -176177 -95267 -53725 -14757 -21712 -71093
6643g1093o1024K4112O2977K2919p82J9676j0597K7896M5922L7787n7187n6939
$$ -71093 -132117 -108005 -45028 -22109 -22891 -3215 -13812 14084 60006 97793 40606 -16333
6631a6333n8752r8236j1737Q2813Q3716L1667j6398m1280Q715Q593J3956M2796
$$ -16333 -75085 -173321 -185058 -102245 -18529 13138 -3260 -44540 -35825 -27232 -13276 29520
6619B9520l1593n7152l2879L9824K0534K020N0858k0373j7016l4061j0740N5557
$$ 29520 -2073 -59225 -92104 -52280 -31746 -29726 21132 759 -16257 -50318 -61058 -5501
6607e501Q1684J9728p5356l8249K6652P559m5183l6963N7688N6140P261J3841
$$ -5501 76183 95911 20555 -17694 8958 16517 -28666 -65629 -7941 48199 55460 69301
6595F9301q161N914M9329K8540j8194m3568q0881n558n8780J2074J310j72L0777
$$ 69301 61140 67054 116383 144923 126729 83161 2280 -3278 -62058 -49984 -48674 -48846 -18069
6582a8069J7413O951l9329k3962K1837m4803M2708K7012k0049J893K4177J9806
$$ -18069 -656 6295 -33034 -56996 -35159 -79962 -37254 -10242 -30291 -28398 -4221 15585
6570A5585L2885l8368J2312J7329l1511N066K8781K9296j00844k646n378j1225
$$ 15585 48470 10102 22414 39743 8232 13298 42079 71375 -29469 -32115 -37493 -48718
6558d8718J2891n933p227J1768L7619J1802m6432J0551M2476N0698K7499o9464
$$ -48718 -35827 -41760 -48987 -37219 400 12202 -34230 -23679 18797 69495 96994 27530
6546B7530j4979N757l5485j147J5863M5066M0347l2124J1820j7135m6009k9205
$$ 27530 12551 18308 -17177 -18324 -2461 42605 82952 50828 62648 45513 -496 -29701
6534b9701o512J3629K5501J7196k8229n4003J4412P5454L0459K8908L5358r00
$$ -29701 -36213 -22584 2917 20113 -8116 -62119 -47707 27747 58206 87114 122472 121572
6522A21572l8681p1136p3694J4251k8931k3624M0581K2433O8835K387K3249J6393
$$ 121572 82891 11755 -61939 -47688 -76619 -100243 -59662 -37229 31606 33993 57242 73635
6510G3635k8501p9297j7079k4968K5378P6126j1822Q800K2640M6856L951k0936
$$ 73635 45134 -34163 -51242 -76210 -50832 25294 13472 22272 44912 91768 95719 74783
6498G4783j0768l3556q3763m8934k3453J305J2218K6715k9097m354M7328r364
$$ 74783 64015 30459 -53304 -102238 -125691 -124386 -112168 -85453 -114550 -118904 -71576 -80940
6486h0940J8030P6546j0718K583l3748m1798L3971N004Q034K4185j5146n1403
$$ -80940 -62910 13636 2918 5501 -28247 -70045 -36074 -31070 -23036 1149 -13997 -65400
6474f5400r249J1406L2566J1207N867L7100k7439M1062L5589M279J2384o2906
$$ -65400 -74649 -63243 -30677 -19470 -13603 23497 -3942 37120 72709 76988 89372 26466
6462B6466l1385q914p3715M7342L0590k7419k867q718j1383M788j4646l521m1188
$$ 26466 -4919 -13833 -87548 -40206 -9616 -37035 -39902 -48620 -60003 -55215 -69861 -73382 -114570
6449a14570K6654N5687p434k7049k0156J7822N3076J8519k8318j2668l1170m3665
$$ -114570 -87916 -32229 -39663 -66712 -86868 -69046 -15970 2549 -25769 -38437 -69607 -113272
6437a13272K0106N0350N576r639p977K535J987k3598L5873j2030L4460K111p267
$$ -113272 -93166 -42816 -37240 -46879 -54856 -52321 -50334 -73932 -38059 -50089 -15629 -13518 -20785
6424b0785k0319q004J1630k11k0245k0275K8121M7265L124N716l7743r273M8933
$$ -20785 -41104 -49108 -37478 -37689 -57934 -78209 -50088 -2823 301 6017 -31726 -40999 7934
6411G934O2617J516L1460p0398q5580n743L8863Q1109j6833o0887k7481m4024
$$ 7934 70551 72067 103527 33129 -52451 -58194 -19331 61778 44945 -15942 -43423 -87447
6399h7447q975P0856Q1915n8316L679j9762k4599m1029l5485k4005O1264L8685
$$ -87447 -96422 -25566 56349 -1967 1712 -18050 -42649 -83678 -119163 -143168 -81904 -43219
6387d3219o4208P99K5435K8448L4621P792j1940Q049M0318L4463m2339j0623l4066
$$ -43219 -107427 -106628 -81193 -52745 -18124 -10332 -22272 -14223 26095 60558 18219 7596 -26470
6374b6470j0986j5957j6382m407L7426M1951L1589l5900n5480l8945L0160O312
$$ -26470 -37456 -53413 -69795 -74202 -36776 5175 36764 864 -54616 -93561 -63401 -57089
6362e7089l420r1803R878O6586J6540P619N4715K9828m0706j5469J4086K0716
$$ -57089 -60509 -152312 -142434 -75848 -59308 -51689 3026 32854 -7852 -23321 -9235 11481
6350A1481j3311L7889k1619n2855j7987m67L624j2095L1201M3216l5236j0247
$$ 11481 -1830 36059 14440 -38415 -56402 -56869 -53245 -65340 -34139 9077 -26159 -36406
6338c6406l0686L6906K1060n1322m3059N3724Q5089o2840l6959M4813L9242M9964
$$ -36406 -67092 -30186 -9126 -60448 -103507 -49783 35306 -27534 -64493 -19680 19562 69526
6326F9526n140l4627J6196j3461r8327o7514J2931J6756K4537P524J7763r955
$$ 69526 64386 29759 45955 32494 -65833 -133347 -120416 -103660 -79123 -71599 -53836 -63791
6314f3791k3514L4367J9749J2424l2957K6454K5159L3598L4933j9202o0127j0613
$$ -63791 -87305 -52938 -33189 -20765 -53722 -27268 -2109 31489 66422 47220 -12907 -23520
6302b3520n1251k4232O7786O6462L4811p7384p0911p7n9260L9350P5930K1259
$$ -23520 -74771 -99003 -31217 35245 70056 -7328 -78239 -78316 -137576 -98226 -22296 -1037
6290a037m5032J3089N2461o305j2062n775K2264J0734m8764K014Q1320O0619m0240
$$ -1037 -46069 -32980 19481 13176 1114 -4661 17603 28337 -20427 -18413 62907 123526 83286
6277H3286m3181m771p048j3306M70m5602j8286M0267L8929m0170k131N649Q6497
$$ 83286 40105 35334 28286 14980 15450 -30152 -48438 -8171 30758 -9412 -11543 -5894 80603
6264H0603M2508k9185r0660J1324K3106r768k3848J2800m7526p0694N1910M8239
$$ 80603 123111 93926 3266 14590 37696 27928 4080 16880 -30646 -101340 -49430 -1191
6252a191J0294J9834J9753j321K1668M900o6023k3754l5082N983L9897N6432k1097
$$ -1191 9103 28937 48690 47369 69037 73937 7914 -15840 -50922 -44939 -5042 51390 30293
6239C0293p2621j6551R687J1971p80O012Q070J1951K3007j6308L0573P261p307
$$ 30293 -42328 -58879 -49192 -37221 -38001 -31989 -23919 -11968 11039 -5269 25304 32565 25258
6226B5258j8481k1027m17K51k8526L5679K0945Q319j4524j3385J8874m306l1280
$$ 25258 6777 -14250 -14667 -14416 -42942 -7263 13682 22001 7477 -5908 12966 8660 -22620
6213b2620k2089l8327L5351M6793J6906j0714M6864K0192p667M7425l2424j10061
$$ -22620 -44709 -83036 -47685 -892 16014 5300 52164 72356 64689 112114 79690 -30371
6201c0371j2246N3773Q6808P402o6377m7045m663o978o2p952p2570k1535L7454
$$ -30371 -42617 11156 97964 105366 38989 -8056 -12719 -19697 -19759 -27711 -100281 -121816 -84362
6188h4362k0121J4801K341n457O6511K5209m8855J1030J7778l4145K818K6082
$$ -84362 -104483 -89682 -87341 -92798 -26287 -1078 -49933 -38903 -21125 -55270 -52452 -26370
6176b6370K9309J9365J5630L078m388j276q426N1083K9452m8826q2896J2072L8557
$$ -26370 2939 22304 37934 41012 36624 35348 26922 78005 107457 58631 -24265 -12193 26364
6163B6364N7073K0615k5548m4964q5354K5676K3141l4442m4420j4447J9531k2556
$$ 26364 83437 104052 78504 33540 -51814 -26138 -2997 -37439 -81859 -96306 -76775 -99331
6151i9331M9230N3127n3783J9524j169J9033m2725J3742N2224Q250J1091k7361
$$ -99331 -50101 3026 -50757 -31233 -32402 -13369 -56094 -42352 9872 18122 29213 1852
6139A852j1432M0578l8404l9551R129N8656k9626K6185j0439N892n03m2282k5519
$$ 1852 -9580 30998 -7406 -46957 -37828 20828 -8798 17387 6948 12840 12337 -29945 -55464
6126e5464l4342j6187M1497O4274L6782M2596k5761o2448k4013m2830N328J7311
$$ -55464 -89806 -105993 -64496 -222 36560 79156 53395 -9053 -33066 -75896 -70568 -53257
6114e3257o9383J00P7342k1863m2206j3800l3260M9955N5444L9092M3599n6030
$$ -53257 -122640 -122540 -45198 -67061 -109267 -123067 -156327 -106372 -50928 -11836 31763 -24267
6102b4267k1843m3870j3273J6808J5926O4659K0372L224L2652M1834l9526o8942
$$ -24267 -46110 -89980 -103253 -86445 -70519 -5860 14512 17736 50388 92222 52696 -16246
6090a6246J3195k698J4343M3809O171m7098p9806J3929J00800J4906l1012k027
$$ -16246 -3051 -5749 8594 52403 58574 11476 -68330 -54401 46399 61305 30293 28266
6078B8266k7021l5309k1226l5629P944J8074l791k4695j1004m0579N5520M4951
$$ 28266 1245 -34064 -55290 -90919 -82975 -64901 -68692 -93387 -104391 -144970 -89450 -44499
6066d4499k5782n7055O424o195L2623J1120Q669j3948J011N4358M0411K3559l1530
$$ -44499 -70281 -127336 -120912 -127107 -94484 -83364 -74695 -88643 -87632 -33274 7137 30696 -834
6053h34k1193j9492K629l1873k7555K2708M1433p1101m6229N6146L4051O846n4869
$$ -834 -22027 -41519 -38890 -70763 -98318 -75610 -34177 -105278 -151507 -95361 -61310 -54464 -109333
6040a09333p280j4766K8718M9572j3199N0767N6019o5300J3351P7411O780o5936
$$ -109333 -116613 -131379 -102661 -53089 -66288 -15521 40498 -24802 -11451 65960 72740 6804
6028F804j5349l4626K0200L1108k52l4265n1574K6960L5679K40j555J443R157
$$ 6804 -8545 -43171 -22971 8137 7885 -26380 -77954 -50994 -15315 -15075 -16630 -15187 -6030
6015f030J3227M6889l6961m2228j9504K2267J4239R102M6396j3827J2827J4897
$$ -6030 7197 54086 17125 -25103 -44607 -22340 -8101 1001 47397 33570 46397 61294
6003F1294J4899p1109p2044K9113Q265j8225P0914o329o2143k4775O3519N4041
$$ 61294 76193 5084 -66960 -37847 -29582 -47807 23107 16778 -45365 -70140 -6621 47420
5991D7420k7782j6860M27j9557n677L1205M6047J93j7650J6343m2838l0155K4461
$$ 47420 19638 2778 3205 -16352 -22029 9176 55223 55416 37766 54109 11271 -18884 5577
5978E577p232r715k7415j4168J4621M5891P530P5134l3198p2519K5126m0532k0993
$$ 5577 -1655 -11370 -38785 -52953 -38332 7559 15089 90223 57025 -15494 9632 -30900 -51893
5965e1893k7265J531J8185k6153j3794J7954L0585J4458l6363j8750j0068m5680
$$ -51893 -79158 -77627 -59442 -85595 -99389 -81435 -50850 -36392 -72755 -91505 -101573 -147253
5953a47253Q586N2356K7183k7225k076L8920j1233j0960j8580m082K1650L7197
$$ -147253 -138667 -86311 -59128 -86353 -88429 -49509 -60742 -71702 -90282 -94364 -72714 -35517
5941c5517L0663K3788K2423m0104k9286O719K8776j8040L782l2563j252K9615
$$ -35517 -4854 18934 41357 1253 -28033 -21314 7462 -10578 -6796 -39359 -40611 -10996
5929a0996k202j6122j9187O846J3386L5767M0721k1087l0967n3567R713Q825J2700
$$ -10996 -13198 -29320 -48507 -41661 -28275 7492 48213 27126 -3841 -57408 -47695 -38870 -26170
5916b6170j5306k9147j2218K542K1886J2748q509N0554L5832O929q0204l6564
$$ -26170 -41476 -70623 -82841 -80299 -58413 -45665 -54174 -3620 32212 39141 -41063 -77627
5904g7627K4484p771p953M1635k1846l421K5512L0278o480o3256j4070J5861K8739
$$ -77627 -53143 -60914 -68867 -27232 -49078 -52499 -26987 3291 -3189 -66445 -80515 -64654 -35915
5891c5915K1873m331Q099m1404O095P3828L7663k2490o1411M1472K1097j3879
$$ -35915 -14042 -18373 -10274 -51678 -45583 28245 65908 43418 -17993 23479 44576 30697
5879C0697j9123k3689M7242K0391P916j06619p6121J9792M2633J2716p5K6436
$$ 30697 11574 -12115 35127 55518 63434 -43185 -119306 -99514 -56881 -44165 -44240 -17804
5867a7804J3499m744m7954m9043O3576m582l0256o50j2423l8253r385J08240O2545
$$ -17804 -4305 -9049 -57003 -106046 -42470 -47052 -77308 -77958 -90381 -128634 -138019 -29779 32766
5854C2766M4971l5069k3296p1686o9969k4786k2064M0821L2314K7436Q291M4919
$$ 32766 77737 42668 19372 -52314 -122283 -147069 -169133 -128312 -95998 -68562 -60271 -15352
5842a5352l6584J4589J6981J500p541k731j1573k5218K2283l8404j1697n2372
$$ -15352 -51936 -37347 -20366 -18866 -26407 -29138 -40711 -65929 -43646 -82050 -93747 -146119
5830a46119J7440Q5520Q7580L8516o1745l5733M9539k619k7129K6017K5389J5595
$$ -146119 -128679 -43159 44421 82937 21192 -14541 34998 32379 5250 31267 56656 72251
5818G2251J2191N3744j8885j10513n3769j4220r389O0018N6909O84k0235k0002
$$ 72251 84442 138186 119301 8788 -44981 -59201 -68590 -8572 48337 49021 28786 8784
5806H784j9470J783J9045l0576l5700L9343N0279l6762m9573L8407N5730J9043
$$ 8784 -10686 -8903 10142 -20434 -56134 -16791 33488 -3274 -52847 -14440 41290 60333
5794F0333l4012k0931o8110k8010O676J3737m4202L6347P7285N0128l9113m3789
$$ 60333 26321 5390 -62720 -90730 -84054 -70317 -114519 -78172 -887 49241 10128 -33661
5782c3661J2055l1356m1258r821n0797K3354P717l8913O5597J44347O001k6321
$$ -33661 -21606 -52962 -94220 -104041 -154838 -131484 -123767 -162680 -97083 47264 53265 26944
5770B6944m9496p0706M1837L0676J8766L3120n2995p1596J7153O2623j7365K594
$$ 26944 -22552 -93258 -51421 -20745 -1979 31141 -21854 -93450 -76297 -13674 -31039 -28445
5758b8445j0169k7448L7825j3849N0811N631m5319j9262l3002J3508N7313J1052
$$ -28445 -38614 -66062 -28237 -42086 8725 14356 -30963 -50225 -83227 -69719 -12406 -1354
5746a354K2793j5313l2074K1486M9515J4489p5872m653k2019l5265k1129N5602
$$ -1354 21439 6126 -25948 -4462 45053 59542 -16330 -20983 -43002 -78267 -99396 -43794
5734d3794O4005J9067k4327J6641m388p697l4734l8886j9985j5937j0969n8706
$$ -43794 20211 39278 14951 31592 27204 19507 -15227 -54113 -74098 -90035 -101004 -159710
5722a59710j4266L0179N9841K5528m172Q7907L5998P636M490q421M179k3329K9311
$$ -159710 -173976 -143797 -83956 -58428 -62600 25307 61305 68941 73431 65010 69189 45860 75171
5709G5171R483k9385k1909k6177j5665M243K5079k0879p4570P725K0156j5171
$$ 75171 84654 55269 33360 7183 -8482 -4239 20840 -39 -74609 -66884 -46728 -61899
5697f1899m7004O1785K5610j7782l8992K9289L6824k587O3855J4292j3626J1205
$$ -61899 -108903 -47118 -21508 -39290 -78282 -48993 -12169 -14756 49099 63391 49765 60970
5685F0970r227j416j0070p005K7192J4589J6241q3188L716j2419o2569j7622L2768
$$ 60970 51743 50327 40257 33252 60444 75033 91274 8086 11802 -617 -63186 -80808 -48040
5672d8040K0366r622J2115j6076j429O9N030L7631L3864K5163j0391n1564K5838
$$ -48040 -27674 -37296 -25181 -41257 -42686 -42617 -37587 44 33908 59071 48680 -2884 22954
5659B2954o4991j1548K9760j1376L6206l2646J9668L8254j3764p727j3047J5131
$$ 22954 -42037 -53585 -23825 -35201 1005 -31641 -11973 26281 12517 4790 -8257 6874
5647F874k6306N228R653q8182j3412L7019l0391K6971L6312K9621r212j6504j03391
$$ 6874 -19432 -14204 -4551 -92733 -106145 -69126 -99517 -72546 -36234 -6613 -15825 -32329 -135720
5634a35720N3323K1864R13j3733M1626J7322j1375J6016J8166K8874L7864M8715
$$ -135720 -82397 -60533 -59620 -73353 -31727 -14405 -25780 -9764 8402 37276 75140 123855
5622A23855L246p5705l7593Q515m7445n903Q8270N4288n952l6146n4815L4960
$$ 123855 127101 51396 13803 22318 -25127 -31030 57240 111528 105576 69430 14615 49575
5610D9575l0327k4739J3766m8278K4066L7741k7873M3867j6644K7881k0729L5846
$$ 49575 19248 -5491 8275 -40003 -15937 21804 -6069 37798 21154 49035 28306 64152
5598F4152K7010L4194J3321o0843m0563j0296P664r5078k0794P98J4395N5832
$$ 64152 91162 125356 138677 77834 37271 26975 34639 -60439 -81233 -80435 -66040 -10208
5586a0208K1708L576p8864m3700k903J7379J2349L413k9576J3545O3766K2752
$$ -10208 11500 15076 -63788 -107488 -110391 -93012 -80663 -77250 -106826 -93281 -29515 -6763
5574f763M6268j2360p3641N777M6356j1670l1466j7930l4072K5293n384l20O3268
$$ -6763 39505 27145 -46496 -40719 5637 -6033 -37499 -55429 -89501 -64208 -69592 -69912 -6644
5561f644j7449N2643L4103o1007l9292j2919J1878l7314l3184L1692P63K8244
$$ -6644 -24093 28550 62653 1646 -37646 -50565 -38687 -76001 -109185 -77493 -76730 -48486
5549d8486p879M6750J8933r649k2118k0246j8426N2804J1413O048m3042m7654
$$ -48486 -56365 -9615 9318 -331 -22449 -42695 -61121 -8317 3096 9144 -33898 -81552
5537h1552O9310J6731k0766p4743k8227N7046M3362m7762n6484K937J2707J5369
$$ -81552 -12242 4489 -16277 -91020 -119247 -62201 -18839 -66601 -123085 -120148 -107441 -92072
5525i2072m0599L7450J0115K0986M0301L7899m7743K3158L6681m360M999l5510
$$ -92072 -132671 -95221 -85106 -64120 -23819 14080 -33663 -10505 26176 21816 26815 -8695
5513h695j6277j6267L0661M8603J6004n0035l4314j5177j9302j6951M2230q136
$$ -8695 -24972 -41239 -10578 38025 54029 3994 -30320 -45497 -64799 -81750 -39520 -47656
5501d7656K5476N4138o892o1056k3501N9388L7414l5520L1917j8406M096R679
$$ -47656 -22180 31958 25066 -35990 -59491 -103 37311 1791 33708 15302 19398 29077
5489B9077k1258j5582M452l7698m2596L1128K2162P3664R22p4028L9596K4586
$$ 29077 7819 -7763 -3311 -41009 -83605 -52477 -30315 43349 44271 -29757 9839 34425
5477C4425j2134k0677m9473R495O3834M4494L0474q594m0269l6259k4508j9881
$$ 34425 22291 1614 -47859 -38364 25470 69964 100438 91844 51575 15316 -9192 -29073
5465b9073k3469m9145L0100K828P2652K7722n8339m9896K0836J9135L08k4873
$$ -29073 -52542 -101687 -71587 -68759 3893 31615 -26724 -76620 -55784 -36649 -36341 -61214
5453f1214k7573J3979L5093J0276o437L3250M5906M03o9340o6111R003O8369J8773
$$ -61214 -88787 -74808 -39715 -29439 -35876 -2626 43280 43683 -25657 -91768 -82765 -14396 4377
5440D377j1697M3046K768l0468k4908n0213L0181O1373N1060j4299q4580o0999
$$ 4377 -7320 35726 38494 8026 -16882 -67095 -36914 24459 75519 61220 -23360 -84359
5428h4359Q167O50M2908j2202L477M5848L0846N2048O9129J230k7249l3962k2695
$$ -84359 -76192 -75542 -32634 -44836 -41359 4489 35335 87383 156512 157742 130493 96531 73836
5415G3836p5272N624l293M628J9966N3357K1371m6084p0669J9880N0249O528N481
$$ 73836 -1436 4188 895 5523 25489 78846 100217 54133 -16536 3344 53593 60121 65602
5402F5602J0948j7295l9783l8153j0151k5722J4299K1926l543Q826K3493M5565
$$ 65602 76550 59255 19472 -18681 -28832 -54554 -40255 -18329 -21872 -13046 10447 56012
5390E6012j0570l8194k8418L008O666J6715J4454k3098l8423J9105l662n569j9520
$$ 56012 45442 7248 -21170 -18162 -11496 5219 19673 -3425 -41848 -22743 -26405 -31974 -51494
5377e1494J3812M3668M9308m9665m5959Q660k4393k6167j3698M8954j8876k3001
$$ -51494 -37682 5986 55294 5629 -40330 -31670 -56063 -82230 -95928 -46974 -65850 -88851
5365h8851J9652L9360M0191O860K0545j9533m4142L8882j0171M7070L9502r1237
$$ -88851 -69199 -29839 10352 17212 37757 18224 -25918 12964 2793 49863 89365 -1872
5353a872q5183M9336P8040L220j5854p411P333l4330o4186j0165j1754k3083N0401
$$ -1872 -87055 -37719 40321 43541 27687 20276 27609 -6721 -70907 -81072 -92826 -115909 -65508
5340f5508l134L8449K7975k6966n3698K5910L3660k0995k9162K0615O0367J2467
$$ -65508 -68642 -30193 -2218 -29184 -82882 -56972 -23312 -44307 -73469 -52854 7513 19980
5328A9980l0852R842L8194K8437K6975j1323L286j7608k6712m6172l492L1991
$$ 19980 -10872 -1030 37164 65601 92576 81253 84539 66931 40219 -5953 -9445 22546
5316B2546M928r847o4510m1458M5625N23M86L4862K5224k5571m6488N7874P5802
$$ 22546 27474 17627 -46883 -88341 -42716 -42193 -41707 -6845 18379 -7192 -53680 4194 79996
5303G9996K1903m4061Q068P718m5514l9291l3898l3757P72J1993J2732j3119M4760
$$ 79996 101899 57838 65906 73624 28110 -11181 -45079 -78836 -78064 -66071 -53339 -66458 -21698
5290b1698J521M0847n3198n6956N4909P0489l5704K1214J0270k7039Q313L8594
$$ -21698 -20177 20670 -32528 -89484 -34575 35914 210 21424 31694 4655 12968 51562
5278E1562J1209m6162m2304k7491o7650M3769L4730r655n8262L1072M2919k1913
$$ 51562 62771 16609 -25695 -53186 -120836 -77067 -42337 -51992 -110254 -79182 -36263 -58176
5266e8176l4036j7150J5291l0212K763K8074M8243l5619M807R6485K7997J3989
$$ -58176 -92212 -109362 -94071 -124283 -121520 -93446 -45203 -80822 -76015 20470 48467 62456
5254F2456m1515l1311J1476L7816L571l5114m5864O862k0354l715k1141k7768
$$ 62456 20941 -10370 1106 38922 42493 7379 -38485 -31623 -51977 -55692 -76833 -104601
5242a04601M1208K3578L3347r349n0763k2838N782k1760J2361N7371M004k2649
$$ -104601 -63393 -39815 -6468 -15817 -66580 -89418 -83636 -105396 -93035 -35664 -31660 -54309
5230e4309L0405q495j9547N4966j8948L3168k5284l927J266L008j9869L9252r5928
$$ -54309 -23904 -32399 -51946 3020 -15928 17240 -8044 -11971 -10705 -7697 -27566 11686 -84242
5217h4242k166M6206L493N4949R957k1318N847J335l4493k1952L4207L4937j5266
$$ -84242 -86408 -40202 -36709 18240 28197 6879 12726 14061 -20432 -42384 -8177 26760 11494
5204A1494l7509j1282J1042O857p167K6735o71N0054R461k2970m7375n5292L7889
$$ 11494 -26015 -37297 -26255 -19398 -26565 170 -501 49553 59014 36044 -11331 -66623 -28734
5191b8734K2935O378O7074m193n5720j1126j5175L0034J2960j7018j9399M6318
$$ -28734 -5799 579 67653 63460 7740 -3386 -18561 11473 24433 7415 -11984 34334
5179C4334m9329q919p446l3644k3030p407J977k6327N7881M0985J4622K2142Q154
$$ 34334 -14995 -23914 -31360 -65004 -88034 -95441 -93464 -119791 -61910 -20925 -6303 15839 23993
5166B3993m782J583L1522m6513n1260l4624L1745J8323M5681j5746k5393j7478
$$ 23993 19211 20794 52316 5803 -45457 -80081 -48336 -30013 15668 -78 -25471 -42949
5154d2949K078k543j3823l4421N0196k6207J4528L5434R57K1053N724k4754k1792
$$ -42949 -40871 -43414 -57237 -91658 -41462 -67669 -53141 -17707 -16750 4303 10027 -14727 -36519
5141c6519L9075n1216j4149K035k3248N9210L4002k827J4561O0458j0260N5331
$$ -36519 2556 -48660 -62809 -60774 -84022 -24812 9190 6363 20924 81382 71122 126453
5129A26453k1221p336l4945n7834k2966M0098J8628j3967Q807j3493J7715Q981
$$ 126453 105232 97896 62951 5117 -17849 22249 40877 26910 35717 22224 39939 48920
5117D8920R34j7258l0071l0457J956O619K1442N4370J8890K4491l7933k5283J9977
$$ 48920 49854 32596 2525 -27932 -25976 -19357 2085 56455 75345 99836 61903 36620 56597
5104E6597K9093m677m9555m709K2764O8093q5460r3393K5276J1414p851J7998
$$ 56597 85690 81013 31458 26749 49513 117606 32146 -61247 -35971 -24557 -32408 -14410
5092a4410L680K2319m7865N3252M1649j2336k7411o1176l6300K7713Q5055L7807
$$ -14410 -10730 11589 -36276 16976 58625 46289 18878 -42298 -78598 -50885 34170 71977
5080G1977L3809o2715m7695k157k3793N740L4133M8600P879k7549k6372J5161
$$ 71977 105786 43071 -4624 -6781 -30574 -24834 9299 57899 65778 38229 11857 27018
5068B7018j5486J7687Q09k7780q8094M6026J1707M277J8664j7899j3552o1728
$$ 27018 11532 29219 30028 2248 -85846 -39820 -28113 -23836 -5172 -23071 -36623 -98351
5056i8351k8222k1408K3615K9759k1624P459Q921K9738Q2659q47k2552N806o7019
$$ -98351 -126573 -147981 -124366 -94607 -116231 -108772 -99851 -70113 12546 11699 -10853 -5047 -72066
5043g2066n2624O3238K0550Q5868J2352k9870m0864n8391j0868L8801P9004m27
$$ -72066 -124690 -61452 -40902 44966 57318 27448 -13416 -71807 -82675 -43874 35130 34703
5031C4703j2392j4203j308k5499k6746L9353L8872J1370j2756l91n872M1156k0519
$$ 34703 22311 8108 6800 -18699 -45445 -6092 32780 44150 31394 31003 25131 66287 45768
5018D5768m3144l7372j7608J6656J8370k0771j7159K6131L0448m5199K969R076
$$ 45768 2624 -34748 -52356 -35700 -17330 -38101 -55260 -29129 1319 -43880 -40911 -31835
5006c1835R633J766J0701j0630j9773J4465L7262p7982k89O2790K3099N2755j749
$$ -31835 -22202 -20436 -9735 -20365 -40138 -25673 11589 -66393 -66682 -3892 19207 71962 70213
4993G0213o3956l9323O155J6759k2834j8526N0036N7003M5113k6118j7082J2339
$$ 70213 6257 -33066 -26911 -10152 -32986 -51512 -1476 55527 100640 74522 57440 69779
4981F9779j5150l2639K4594l2222l844K4438K1387k4720L158J114N20o78Q672
$$ 69779 54629 21990 46584 14362 10518 34956 56343 31623 34781 35895 36415 35737 44409
4968D4409j1769o5407k1253J8703K7605j242O567k4464K3817j6343o5906J6324
$$ 44409 32640 -32767 -54020 -35317 -7712 -8954 -2387 -26851 -3034 -19377 -85283 -68959
4956f8959L5944J9029M1034K0509j9268m4898j7196n48L8409M8008j2503l1495
$$ -68959 -33015 -13986 27048 47557 28289 -16609 -33805 -34353 4056 52064 39561 8066
4944H066k5464l7860j03801j9841P6878P3184L1l1582O4355R442J205m6651K553
$$ 8066 -17398 -55258 -159059 -178900 -102022 -28838 -28807 -60389 3966 13408 14613 -32038 -29485
4931b9485P2237m9609j0574M0819K4639J407q5318j3950k7043L330l4165N1199
$$ -29485 42752 -6857 -17431 23388 48027 49434 -35884 -49834 -76877 -73547 -107712 -56513
4919e6513O1926O745m7336J2255N2126l4460p243L1132J03183q025k1824m7724
$$ -56513 5413 12158 -35178 -22923 29203 -5257 -12500 18632 121815 113790 91966 44242
4907D4242o6557j9763m408O2636K3873J1816n0425k3297q980J9304M87k5220k9870
$$ 44242 -22315 -42078 -46486 16150 40023 51839 1414 -21883 -30863 -11559 -11072 -36292 -66162
4894f6162j3586l5881M2880L3931l2702K975J1716J6763j7499K6526j4144N489
$$ -66162 -79748 -115629 -72749 -38818 -71520 -68545 -56829 -40066 -57565 -31039 -45183 -39694
4882c9694k4539K0132M6373j3213L6889K7636L3556k7037j145k2067K1407L4534
$$ -39694 -64233 -44101 2272 -10941 25948 53584 87140 60103 58958 36891 58298 92832
4870I2832j1188n3252n2440k2127L9750l7226m402N1581p217P524m0530N1610
$$ 92832 81644 28392 -24048 -46175 -6425 -43651 -48053 3528 -3689 3835 -36695 14915
4858A4915Q037l9052R221j531m7427K5608l7693l2041J6380Q9632O0857j1136
$$ 14915 22952 -16100 -6879 -8410 -55837 -30229 -67922 -99963 -83583 6049 66906 55770
4846E5770n4279n133j1023o501Q932o815q8299l4132L8210J8379N9608Q7107k2862
$$ 55770 1491 -3642 -14665 -21166 -12234 -19049 -107348 -141480 -103270 -84891 -25283 61824 38962
4833C8962q0221l8708K4579K7392R287k0897o7941J6385M5522J921J743M5555
$$ 38962 -41259 -79967 -55388 -27996 -18709 -39606 -107547 -91162 -45640 -43719 -41976 3579
4821C579J3908J2625M6964K3661m0247O741l9569j2273L7619m0819p2832O1444
$$ 3579 17487 30112 77076 100737 60490 67231 27662 15389 53008 12189 -60643 801
4809H01J6472N885l8048j1504O2564j5849o2455l4223L8351J5995k788l4788P7737
$$ 801 17273 23158 -14890 -26394 36170 20321 -42134 -76357 -38006 -22011 -24799 -59587 18150
4796A8150L1470l5708j3941L9739m7149m6842L278q851n1268r693n6240L4084
$$ 18150 49620 13912 -29 39710 -7439 -54281 -51003 -59854 -111122 -120815 -177055 -142971
4784a42971M9270O510q537M7015K3533J6099K9457n0331k8811j0054j8548r401
$$ -142971 -93701 -87191 -95728 -48713 -25180 -9081 20376 -29955 -58766 -68820 -87368 -96769
4772i6769J1370M9646k0651Q587K4103L6157O844r263M5955k8699J1999M8l5975
$$ -96769 -85399 -35753 -56404 -47817 -23714 12443 19287 10024 55979 27280 39279 39327 3352
4759C352J6536k9009o27L0743n6949K493j0431J3658K0275K6718N3015N035j1934
$$ 3352 19888 -9121 -9748 20995 -35954 -33461 -43892 -30234 -9959 16759 69774 74809 62875
4746F2875l0217p5596K5841R788k7179m1670J2032j9407j6316j4267J8230M8340
$$ 62875 32658 -42938 -17097 -7309 -34488 -76158 -64126 -83533 -99849 -114116 -95886 -47546
$$ [...]
##END NTUPLES=NMR SPECTRUM
##END=
