##TITLE=Analysis number 323432
Compound Code cc 50516
Book Reference 451/173
Project Code adrs
Chemist Name evam
##JCAMPDX= 6.0         $$ Bruker NMR JCAMP-DX V2.0
##DATA TYPE= NMR SPECTRUM
##DATA CLASS= NTUPLES
##ORIGIN= Bruker BioSpin GmbH
##OWNER= nmr
$$ XWIN-NMR		Version 3.5
$$ Wed Oct 25 10:16:52 2006 GMT Daylight Time (UT+1h)  MAYBRIDGE\nmr@NMR_250MHZ
##.OBSERVE FREQUENCY= 250.131544655141
##.OBSERVE NUCLEUS= ^1H
##.ACQUISITION MODE= SIMULTANEOUS (DQD)
##.ACQUISITION SCHEME= undefined
##.AVERAGES= 16
##.DIGITISER RES= 18
##SPECTROMETER/DATA SYSTEM= dpx250
##.PULSE SEQUENCE= zg30
##.SOLVENT NAME= CDCl3
##.SHIFT REFERENCE= (INTERNAL, CDCl3, 0, 16.522)
##AUDIT TRAIL= $$ (NUMBER, WHEN, WHO, WHERE, WHAT)
$$ ##TITLE= Audit trail, XWIN-NMR		Version 3.5
$$ ##JCAMPDX= 5.01
$$ ##ORIGIN= Bruker BioSpin GmbH
$$ ##OWNER= nmr
$$ C:\u/data/dgb/nmr/ADRS/1230/pdata/1/auditp.txt
$$ ##AUDIT TRAIL=  $$ (NUMBER, WHEN, WHO, WHERE, WHAT)
(   1,<2006-10-25 10:16:31.97 +100>,<MAYBRIDGE\nmr>,<NMR_250MHZ>,
      <created by zg, POWCHK disabled, PULCHK disabled
       configuration hash MD5:
       49 4B E0 1D 92 C2 6B 37 9F E6 65 BC 52 41 86 1D
       data hash MD5: 64K
       A0 E1 54 0C B1 8A BD 00 80 33 6E 6B 3A 1F 81 BF>)
(   2,<2006-10-25 10:16:43.67 +100>,<MAYBRIDGE\nmr>,<NMR_250MHZ>,
      <Start of raw data processing
       ef LB = 0.3 FT_mod = 6 PKNL = 1 SI = 32K 
       data hash MD5: 32K
       D7 03 F8 B3 C2 1A 60 AD 2A C9 38 65 51 22 B9 78>)
(   3,<2006-10-25 10:16:45.28 +100>,<MAYBRIDGE\nmr>,<NMR_250MHZ>,
      <apk 
       data hash MD5: 32K
       EC 09 67 84 DF EC 0B 8A FE 3A 97 06 AB B6 49 1E>)
(   4,<2006-10-25 10:16:46.08 +100>,<MAYBRIDGE\nmr>,<NMR_250MHZ>,
      <abs ABSG = 5 
       data hash MD5: 32K
       39 4D F1 F0 F1 79 9F 2F AB CE 35 09 24 F3 0F 44>)
$$ ##END=
$$ 
$$ hash MD5
$$ 80 22 CF E7 6B AD 1C 1E 05 89 48 51 D6 B8 94 A8
##$RELAX= 
##$RELAX= 
##$RELAX= 
##$RELAX= 
##$RELAX= 
##$RELAX= 
##$RELAX= 
$$ Bruker specific parameters
$$ --------------------------
##$DU= <C:\u>
##$EXPNO= 1230
##$NAME= <ADRS>
##$PROCNO= 1
##$TYPE= <nmr>
##$USER= <dgb>
##$AMP= (0..31)
100 100 100 100 100 100 100 100 100 100 100 100 100 100 100 100 100 100 
100 100 100 100 100 100 100 100 100 100 100 100 100 100 
##$AQSEQ= 0
##$AQ_mod= 3
##$AUNM= <au_zg>
##$AUTOPOS= <7 >
##$BF1= 250.13
##$BF2= 250.13
##$BF3= 250.13
##$BF4= 250.13
##$BF5= 500.13
##$BF6= 500.13
##$BF7= 500.13
##$BF8= 500.13
##$BYTORDA= 1
##$CFDGTYP= 0
##$CFRGTYP= 5
##$CHEMSTR= <none>
##$CNST= (0..31)
1 1 145 1 1 1 1 1 1 1 1 1 1 1 1 1 1 1 1 1 1 1 1 1 1 1 1 1 1 1 1 1 
##$CPDPRG= <>
##$CPDPRG1= <>
##$CPDPRG2= <>
##$CPDPRG3= <>
##$CPDPRG4= <mlev>
##$CPDPRG5= <mlev>
##$CPDPRG6= <mlev>
##$CPDPRG7= <mlev>
##$CPDPRG8= <mlev>
##$CPDPRGB= <>
##$CPDPRGT= <>
##$D= (0..31)
0 1 0 0 0 0 0 0 0 0.06 0 0 0 0 0 0 0.0002 0 0 0 0 0 0 0 0 0 0 0 0 0 0 
0 
##$DATE= 1161767791
##$DBL= (0..7)
120 120 120 120 120 120 120 120 
##$DBP= (0..7)
150 150 150 150 150 150 150 150 
##$DBP07= 0
##$DBPNAM0= <>
##$DBPNAM1= <>
$$ [...]
##$SUBNAM7= <"">
##$SUBNAM8= <"">
##$SUBNAM9= <"">
##$SW= 20.6930455092707
##$SWIBOX= (0..15)
0 0 3 0 0 0 0 0 0 0 0 0 0 0 0 0 
##$SW_h= 5175.983436853
##$TD= 65536
##$TD0= 1
##$TE= 683.16
##$TE2= 300
##$TE3= 300
##$TEG= 300
##$TL= (0..7)
0 120 120 120 120 120 120 120 
##$TP= (0..7)
150 150 150 150 150 150 150 150 
##$TP07= 0
##$TPNAME0= <>
##$TPNAME1= <>
##$TPNAME2= <>
##$TPNAME3= <>
##$TPNAME4= <>
##$TPNAME5= <>
##$TPNAME6= <>
##$TPNAME7= <>
##$TPOAL= (0..7)
0.5 0.5 0.5 0.5 0.5 0.5 0.5 0.5 
##$TPOFFS= (0..7)
0 0 0 0 0 0 0 0 
##$TUNHIN= 0
##$TUNHOUT= 0
##$TUNXOUT= 0
##$USERA1= <user>
##$USERA2= <user>
##$USERA3= <user>
##$USERA4= <user>
##$USERA5= <user>
##$V9= 5
##$VALIST= <valist>
##$VCLIST= <CCCCCCCCCCCCCCC>
##$VD= 0
##$VDLIST= <DDDDDDDDDDDDDDD>
##$VPLIST= <PPPPPPPPPPPPPPP>
##$VTLIST= <TTTTTTTTTTTTTTT>
##$WBST= 1024
##$WBSW= 4
##$XGAIN= (0..3)
0 0 0 0 
##$XL= 0
##$YL= 0
##$YMAX_a= 448488
##$YMIN_a= -451344
##$ZGOPTNS= <>
##$ZL1= 120
##$ZL2= 120
##$ZL3= 120
##$ZL4= 120
##$ABSF1= 16.522
##$ABSF2= -4.171173
##$ABSG= 5
##$ABSL= 3
##$ALPHA= 0
##$AQORDER= 0
##$ASSFAC= 0
##$ASSFACI= 0
##$ASSFACX= 0
##$ASSWID= 0
##$AUNMP= <proc_1d>
##$AZFE= 0.1
##$AZFW= 0.1
##$BCFW= 0
##$BC_mod= 0
##$BYTORDP= 0
##$COROFFS= 0
##$CY= 12.5
##$DATMOD= 1
##$DC= 0
##$DFILT= <>
##$DTYPP= 0
##$F1P= 14.0000005364418
##$F2P= -0.99999901652339
##$FCOR= 0.5
##$FTSIZE= 32768
##$FT_mod= 6
##$GAMMA= 0
##$GB= 0
##$INTBC= 1
##$INTSCL= 1
##$ISEN= 128
##$LB= 0.3
##$LEV0= 0
##$LPBIN= 0
##$MAXI= 10000
##$MC2= 0
##$MEAN= 0
##$ME_mod= 0
##$MI= 0
##$NCOEF= 0
##$NC_proc= -5
##$NLEV= 6
##$NOISF1= 0
##$NOISF2= 0
##$NSP= 0
##$NTH_PI= 0
##$NZP= 0
##$OFFSET= 16.522
##$PC= 1
##$PHC0= -41.46001
##$PHC1= 3.329711
##$PH_mod= 1
##$PKNL= yes
##$PPARMOD= 0
##$PSCAL= 4
##$PSIGN= 0
##$REVERSE= no
##$SF= 250.13
##$SI= 32768
##$SIGF1= 0
##$SIGF2= 0
##$SINO= 400
##$SIOLD= 32768
##$SREGLST= <1H.CDCl3>
##$SSB= 0
##$STSI= 32768
##$STSR= 0
##$SW_p= 5175.98343685301
##$SYMM= 0
##$S_DEV= 0
##$TDeff= 65536
##$TDoff= 0
##$TI= <Analysis number 999999
Compound Code 99
Book Reference 9
Project Code 9>
##$TILT= no
##$TM1= 0
##$TM2= 0
##$TOPLEV= 0
##$USERP1= <user>
##$USERP2= <user>
##$USERP3= <user>
##$USERP4= <user>
##$USERP5= <user>
##$WDW= 1
##$XDIM= 32768
##$YMAX_p= 447590579
##$YMIN_p= -609916
$$ End of Bruker specific parameters
$$ ---------------------------------
##NTUPLES= NMR SPECTRUM
##VAR_NAME=  FREQUENCY,     SPECTRUM/REAL,   SPECTRUM/IMAG
##SYMBOL=    X,             R,               I
##VAR_TYPE=  INDEPENDENT,   DEPENDENT,       DEPENDENT
##VAR_FORM=  AFFN,          ASDF,            ASDF
##VAR_DIM=   32768,         32768,           32768
##UNITS=     HZ,            ARBITRARY UNITS, ARBITRARY UNITS
##FACTOR=    0.157963299565203, 1,           1
##FIRST=     4132.6476996994, 0,             0
##LAST=      -1043.33573715361, 0,           0
##MIN=       -1043.33573715361, -609916,     0
##MAX=       4132.6476996994, 447590579,     0
$$ Real data points
##PAGE= N=1
##DATA TABLE= (X++(R..R)), XYDATA
$$ [...]
$$ plain form
15977 -46617 89723 359751 315547 160406 -18273 -2293 86475 39013 14797 120777 43693
15966 43693 -176773 -104769 -55523 -23492 48846 -17443 -55678 -113916 -118412 -113323 -101828 -58250
15954 -58250 46922 122676 -35155 -17527 25407 36248 89024 -125389 -253602 -364043 -298664
15943 -298664 -193999 -286903 -185596 -162214 -201758 -16215 63347 151658 81223 61538 110073
15932 110073 41365 416 3795 165791 102820 9475 66385 -119039 -262632 -128538 -35589
15921 -35589 21507 91059 117218 217244 149943 179209 195165 134970 103931 100552 33051 -110387
15909 -110387 -79768 -90095 -18976 -98568 -23832 109984 2043 -32933 -134105 -97051 -116941
15898 -116941 -247793 -167152 433 11228 -114352 -72244 -42767 20279 -114536 -20988 137573
$$ packed form
15977d6617J36340K70028m4204j55141j78679J5980Q8768m7462k4216J05980p7084
15966D3693k20466P2004M9246L2031P2338o6289l8235n8238m496N089J1495M3578
15954e8250J05172P5754j57831J7628M2934J0841N2776k14413j28213j10441O5379
15943b98664J04665r2904J01307K3382l9544J85543P9562Q8311p0435j9685M8535
15932A10073o8708m0949L379J61996o2971r3345N6910j85424j43593J34094R2949
15921c5589N7096O9552K6159J00026o7301K9266J5956o0195l1039l379o7501j43438
15909a10387L0619j0327P1119p9592P4736J33816j07941l4976j01172L7054j9890
15898a16941j30852Q0641J67585J0795j25580M2108K9477O3046j34815R3548J58561
$$ plain form
15887 137573 202192 147216 222342 150739 64711 101532 235663 249489 381510 367121 240982
15876 240982 76048 22881 -81668 -44972 1675 -10873 165955 351617 310722 241320 269326
15865 269326 94532 9993 91599 42230 2144 -43074 68697 100661 167611 271875 115426
15854 115426 76188 25811 77618 56962 193221 208377 205428 197770 232704 266028 81569
15843 81569 115732 82954 118548 193867 202182 244852 63665 40367 216178 288022 396244
15832 396244 250969 -13781 25371 -148217 -182024 -121242 -187927 -97672 19185 -26044 128908
15821 128908 -20821 31991 14052 -108915 -180016 -213058 -94069 -136523 -86334 -8533 -126759
15810 -126759 -125087 -164930 -182223 -57598 -28423 -102621 -56113 -34648 -171989 -44408 -46833
$$ packed form
15887A37573O4619n4976P5126p1603q6028L6821J34131J3826J32021j4389j26139
15876B40982j64934n3167j04549L6696M6647j2548J76828J85662m0895o9402K8006
15865B69326j74794q4539Q1606m9369m0086m5218J11771L1964O6950J04264j56449
15854A15426l9238n0377N1807k0656J36259J5156k949p658L4934L3324j84459
15843H1569L4163l2778L5594P5319Q315M2670j81187k3298J75811P1844J08222
15832C96244j45275k64750L9152j73588l3807O0782o6685R0255J16857m5229J54952
15821A28908j49729N2812j7939j22967p1101l3042J18989m2454N0189P7801j18226
15810a26759J672l9843j7293J24625K9175p4198M6508K1465j37341J27581k425
$$ plain form
15799 -46833 -152079 -30707 110777 5895 -23271 15207 -62863 -85557 110264 48868 -31288
15788 -31288 -20671 108907 293343 335544 210730 173568 205854 172272 109394 -150640 -215256
15777 -215256 -168102 -89101 -66497 -16965 6765 -4839 47721 72204 -10754 -23940 -66909
15766 -66909 -224759 -55530 41366 146580 84373 101080 181099 408390 379062 395934 274539
15755 274539 110135 230279 139181 -35600 -93214 -162005 -71064 82669 224473 169432
15745 169432 38761 17530 -91253 -111272 4855 86240 59663 41686 44437 27517 -17038
15734 -17038 -52329 141495 266274 201913 174336 368230 441189 399864 236708 222320 186955
15723 186955 159892 331181 399182 380910 286465 82478 111314 215256 271550 212715 56236
$$ packed form
15799d6833j05246J21372J41484j04882k9166L8478p8070k2694J95821o1396q0156
15788c1288J0617J29578J84436M2201j24814l7162L2286l3582o2878k60034o4616
15777b15256M7154P9001K2604M9532K3730j1604N2560K4483q2958j3186m2969
15766f6909j57850J69229R6896J05214o2207J6707Q0019K27291k9328J6872j21395
15755B74539j64404J20144r1098j74781n7614o8791R0941J53733J41804n5041
15745A69432j30671k1231j08783k0019J16127Q1385k6577j7977K751j6920m4555
15734a7038l5291J93824J24779o4361k7577J93894P2959m1325j63156j4388l5365
15723A86955k7063J71289O8001j8272r4445k03987K8836J03942N6294n8835j56479
$$ plain form
15712 56236 -78023 6545 131774 220962 187424 193864 290530 293194 259983 322487 117481
15701 117481 -5534 -98698 -220123 -245079 -151389 128882 199355 -4477 -146872 -205025
15691 -205025 -197154 -134580 144997 185693 158298 178043 52827 82800 1080 6174 -25557
15680 -25557 28801 -3569 -112551 -84589 -4700 -38734 -256371 -350968 -316777 -72395 101651
15669 101651 109076 147092 297927 251622 150686 14814 -14359 -42350 -109499 29398 178205
15658 178205 138365 261582 335960 311212 105149 119750 56304 66655 43134 -32043 42833
15647 42833 215848 30137 -78170 44619 238649 223507 133376 267626 350264 168779
15637 168779 43815 225119 190311 -719 -33410 -92546 -171771 33894 45268 -124034
$$ packed form
15712E6236j34259Q4568J25229Q9188l3538O440R6666K664l3211O2504k05006
15701A17481j23015r3164j21425k4956R3690K80271P0473k03832j42395n8153
15691b05025P871O2574K79577M0696k7395J9745j25216K9973q1720N094l1731
15680b5557N4358l2370j08982K7962P9889l4034k17637r4597L4191K44382J74046
15669A01651P425L8016J50835m6305j00936j35872k9173k7991o7149J38897J48807
15658A78205l9840J23217P4378k4748k06063J4601o3446J0351k3521p5177P4876
15647D2833J73015j85711j08307J22789J94030j5142r0131J34250Q2638j81485
15637A68779j24964J81304l4808j91030l2691n9136p9225K05665J1374j69302
$$ plain form
15627 -124034 -167569 15029 30838 -61444 -173630 -278027 -213814 -115682 -19373 240162 337647
15616 337647 234292 172235 206287 236550 36162 38596 -16431 89839 134439 51897 132930
15605 132930 353874 195018 878 -156595 -141410 -52807 3078 35320 7744 -86968 20495
15594 20495 139073 164837 158343 73384 -882 50415 73452 23086 -1127 42544 33650 52879
15582 52879 49313 -10963 17195 -137832 -275299 -91163 117434 247814 165534 173900 227032
15571 227032 203809 161759 190185 252724 206829 219338 288333 209485 90877 -94984 136972
15560 136972 205539 141501 74524 47834 1714 171947 283883 219218 185647 236254 125705
15549 125705 85163 223661 181943 114399 164243 107038 164313 123823 -87404 -175191 97504
$$ packed form
15627a24034m3535J82598J5809r2282j12186j04397O4213R8132R6309K59535R7485
15616C37647j03355o2057L4052L0263k00388K434n5027J06270M4600q2542Q1033
15605A32930K20944j58856j94140j57473J5185Q8603N5885L2242k7576r4712J07463
15594B0495J18578K5764o494q4959p4266N1297K3037n0366k4213M3671q894J9229
15582E2879l566o0276K8158j55027j37467J84136K08597J30380q2280Q366N3132
15571B27032k3223m2050K8426O2539m5895J2509O8995p8848j18608j85861K31956
15560A36972O8567o4038o6977k6690m6120J70233J11936o4665l3571N0607j10549
15549A25705m0542J38498m1718o7544M9844n7205N7275m0490k11227q7787K72695
$$ plain form
15538 97504 248122 259132 348849 308678 264227 209132 138328 163154 297650 172204 99579
15527 99579 -87468 -161241 -88223 -41292 -4745 -56253 48094 73881 -48062 -94829 35613
15516 35613 138027 198797 117705 95629 116605 193264 209440 62634 -112435 -162009 -24497
15505 -24497 33479 60409 153166 193395 193297 125380 -21516 -20165 -100140 -285897 -265378 -127773
15493 -127773 -103898 -6090 15634 45850 178000 176987 135706 97574 107731 137964 179141
15482 179141 87063 -17806 -18112 -86431 -132600 -157015 -268357 -274850 -171918 -30196 -85631
15471 -85631 -260685 -296596 -211726 -210019 -116037 -136911 -201999 -198604 109282 40834 10323 77481
15459 77481 -9036 -57668 -56217 -31002 -163069 -197690 -156305 -314660 -258255 -19844 47338
$$ packed form
15538I7504J50618J1010Q9717m0171m4451n5095p0804K4826J34496j25446p2625
15527I9579j87047p3773P3018M6931L6547n1508J04347K5787j21943m6767J30442
15516C5613J02414O0770q1092k2076K0976P6659J6176j46806j75069m9574J37512
15505b4497N7976K6930R2757M0229r8o7917j46896J351p9975j85757K0519J37605
15493a27773K3875R7808K1724L0216J32150j013m1281l8132J0157L0233M1177
15482A79141r2078j04869l06o8319m6169k4415j11342o493J02932J41722n5435
15471h5631j75054l5911Q4870J707R3982k0874o5088L395L07886o8448l0511O7158
15459G7481q6517m8632J451K5215j32067l4621M1385j58355N6405K38411O7182
$$ plain form
15448 47338 157088 182465 121521 -30648 -66764 101402 163593 17020 -92549 -24350 219467
15437 219467 402303 153329 140935 72264 48673 325309 175089 46262 70461 -142382
15427 -142382 -188707 -163426 -24017 10605 5074 -69308 -54965 -41243 79523 291050 219153
15416 219153 29031 55666 9187 -224887 -310477 -240375 -129860 105748 252473 169022
15406 169022 60764 68228 93297 45040 20892 34089 -128114 -126740 47630 107289 94309
15395 94309 -29408 -192595 -322158 -245979 -204722 -284807 -238225 -128277 -133114 -165533 -213343
15384 -213343 -149668 -95235 -76991 -101838 -125085 -143566 7868 62113 132559 393692 521767
15373 521767 361435 249432 113068 8342 -10982 -128239 -186948 -225567 -180156 46828
$$ packed form
15448D7338J09750K5377o0944j52169l6116J68166O2191j46573j09569O8199K43817
15437B19467J82836k48974j2394o8671k3591K76636j50220j28827K4199k12843
15427a42382m6325K5281J39409L4622n531p4382J4343J3722J20766K11527p1897
15416B19153j90122K6635m6479k34074q5590P0102J10515K35608J46725q3451
15406A69022j08258P464K5069m8257k4148J3197j62203J374J74370N9659j2980
15395I4309j23717j63187j29563P6179M1257q0085M6582J09948m837l2419m7810
15384b13343O3675N4433J8244k4847k3247j8481J51434N4245P0446K61133J28075
15373E21767j60332j12003j36364j04726j9324j17257n8709l8619M5411K26984
$$ plain form
15363 46828 208913 118148 55279 24823 118436 40091 -60298 -96653 -1314 -40130 -120508
15352 -120508 -125289 -207981 -213289 -39417 -137505 -178474 -189918 -109151 -77505 -177037 -211348 -213214
15340 -213214 -115917 -141946 -255325 -300217 -312868 -3319 104196 22073 12340 -144975 -102195
15329 -102195 60424 17588 -7214 38793 34469 80111 71416 119890 282051 225701 231540 121836
15317 121836 -71192 -145987 -263766 -141603 -13380 -15694 8579 -203398 -206909 1748 90193
15306 90193 31681 -142056 -318730 -385517 -277311 -137846 -205522 -193778 -189525 -211561 -264053
15295 -264053 -275898 -191893 -148269 -195566 -248897 -342348 -213452 -166695 -1874 -4986 -70269
15284 -70269 -46530 -216577 -303332 -206757 -162195 -167824 -221610 -143942 -97412 -157617 -212732 -134186
$$ packed form
15363D6828J62085r0765o2869l0456R3613p8345j00389l6355R5339l8816q0378
15352a20508m781q2692n308J73872r8088m0969j1444Q0767L1646r9532l4311j866
15340b13214R7297k6029j13379m4892j2651L09549J07515q2123r733j57315M2780
15329a02195J62619m2836k4802M6007m324M5642q695M8474J62161n6350N839j09704
15317A21836j93028p4795j17779J22163J28223k314K4273k11977l511K08657Q8445
15306I0193n8512j73737j76674o6787J08206J39465o7676J1744M253k2036n2492
15295b64053j1845Q4005M3624m7297n3331r3451J28896M6757J64821l112o5283
15284g0269K3739j70047q6755R6575M4562n629n3786P7668M6530o0205n5115P8546
$$ plain form
15272 -134186 26352 176605 229457 259989 236010 254034 309052 316191 343554 216969 345181
15261 345181 491520 469265 292858 289098 156597 -21354 78584 -56067 -97567 -142534 -236047
15250 -236047 -124560 -116231 -156705 -279619 -267307 -270426 -174335 -174481 -200903 -17421 47635 -3337
15238 -3337 -162742 -173942 -156847 -404544 -471088 -381172 -295788 -248302 -73788 -60738 -82743
15227 -82743 -76937 -97199 -19384 372 39566 140328 60548 -32690 10017 -73078 -39266 105340
15215 105340 168149 98046 -70498 -199262 -187992 -40621 -11579 -17043 3808 105136 144013
15204 144013 -4625 -29855 -59652 11988 168886 329239 435243 245668 59048 -68009
15194 -68009 -198827 -161056 -191443 -146000 -144309 -227220 -225286 -92102 -215755 -219853 -128685 -31784
$$ packed form
15272a34186J60538J50253N2852L0532k3979J8024N5018P139K7363j26585J28212
15261C45181J46339k2255j76407l760j32501j77951R9938j34651m1500m4967r3513
15250b36047J11487Q329m0474j22914J2312l119R6091j46k6422J83482O5056n0972
15238c337j59405j1200J7095k47697o6544Q9916Q5384M7486J74514J3050k2005
15227h2743N806k0262P7815J9756L9194J00762p9780r3238M2707q3095L3812J44606
15215A05340O2809p0103j68544j28764J1270J47371K9042n464K0851J01328L8877
15204A44013j48638k5230k9797P1640J56898J60353J06004j89575j86620j27057
15194f8009j30818L7771l0387M5443J691q2911J934J33184j23653m098R1168R6901
$$ plain form
15182 -31784 17241 -117180 -166700 -199856 -170069 8880 -8555 -14173 -33624 47507 67589
15171 67589 -61534 -138635 -114409 -138812 -145062 -180373 -323615 -408055 -405010 -284375 -78944
15160 -78944 -3946 -150868 -145586 -68090 41763 24156 -55351 -149246 -199948 -366147 -268346
15149 -268346 -5252 68346 80393 -5631 -102930 6200 136498 104792 146981 159850 6868
15138 6868 -38015 -57022 -95254 -72344 35833 -38977 -135698 -61156 100530 155842 6714
15127 6714 -45603 -65809 54137 116545 124888 218145 317374 124119 -163754 -123446 17509
15116 17509 -51279 -241896 -235072 -138063 81333 223181 207317 -93950 -268543 -325379 -305304
15105 -305304 -237428 -300188 -313602 -275597 -243372 -59165 71942 224370 162661 8556 -59664
$$ packed form
15182c1784M9025j34421m9520l3156K9787J78949j7435n618j9451Q1131K0082
15171F7589j29123p7101K4226k4403o250l5311j43242q4440L045J20635K05431
15160g8944P4998j46922N282P7496J09853j7607p9507r3895n0702j66199R7801
15149b68346K63094P3598J2047q6024r7299J09130J30298l1706M2189J2869j52982
15138F868m4883j9007l8232K2910J08177p4810r6721P4542J61686N5312j49128
15127F714n2317k0206J19946O2408Q343R3257R9229j93255k87873M0308J40955
15116A7509o8788j90617O824R7009K19396J41848j5864l01267j74593n6836K0075
15105c05304O7876o2760j3414L8005L2225J84207J31107J52428o1709j54105o8220
$$ plain form
15094 -59664 25614 -12505 -92186 -110217 -99791 -84945 52637 139181 -4361 -151016 -73606
15083 -73606 -24988 -24838 -40253 -95186 38082 130954 160468 55428 -133915 -39083 56540
15072 56540 -21342 -138219 -100561 -34901 -122185 -90753 -194452 -219491 -332961 -141262 -124280
15061 -124280 27994 250620 352291 129336 -114125 -202775 -37591 -111969 -226190 -155938
15051 -155938 -78322 -209271 -134850 -62785 -217803 -184673 -162836 -29639 -57830 -197981 -254322
15040 -254322 -180250 -168014 35865 76221 103019 85456 85120 -192138 -221660 -198756 -229548
15029 -229548 -187982 -192031 -299781 -342908 -221669 -201878 -76233 -90327 -157975 -111648 -22091
15018 -22091 -27698 -129473 -204150 -196109 -270101 -227226 -185537 -172606 -217493 -189701 -123157 -230629
$$ packed form
15094e9664Q5278l8119p9681j8031J0426J4846J37582Q6544j43542j46655P7410
15083g3606M8618J50j5415n4933J33268R2872K9514j05040j89343R4832R5623
15072E6540p7882j16877L7658O5660q7284L1432j03699k5039j13470J91699J6982
15061a24280J52274K22626J01671k22955k43461q8650J65184p4378j14221P0252
15051a55938P7616j30949P4421P2065j55018L3130K1837J33197k8191j40151n6341
15040b54322P4072J2236K03879M0356K6798j7563l36k77258k9522K2904l0792
15029b29548M1566m049j07750m3127J21239J9791J25645j4094o7648M6327Q9557
15018b2091n607j01775p4677Q041p3992M2875M1689J2931m4887K7792O6544j07472
$$ plain form
15006 -230629 -175121 -62247 45484 61768 96434 62526 67586 -44663 6209 213369 294657
14995 294657 150782 -57009 -363803 -448064 -150108 -74042 13603 -24247 -251522 -87665
14985 -87665 164185 86923 -73182 -133531 -46096 -158 63893 105322 222876 51032 -79255
14974 -79255 -95663 -127525 -107272 -41359 58924 59271 -90385 -109502 -57748 46318 125222
14963 125222 92698 72231 -12865 -141817 -302073 -320067 -194081 -158647 -211331 -65244 180803
14952 180803 187225 -6875 -21651 21110 2650 -1055 41734 -80740 -58231 -78771 -170466
14941 -170466 -250476 -176408 -143406 24612 57390 117958 -51553 -102326 -55645 -139154 -204826
14930 -204826 -121767 -75471 -160739 -177573 -134885 -143033 -71366 -79440 53553 114340 105273 31944
$$ packed form
15006b30629N5508J12874J07731J6284L4666l3908N060j12249N0872K07160Q1288
14995B94657j43875k07791l06794q4261K97956P6066Q7645l7850k27275J63857
14985h7665K51850p7262j60105o0349Q7435M5938O4051M1429J17554j71844j30287
14974g9255j6408l1862K0253O5913J00283L47j49656j9117N1754J04066P8904
14963A25222l2524k0467q5096j28952j60256j7994J25986L5434n2684J46087K46047
14952A80803O422j94100j4776M2761j8460l705M2789j22474K2509k0540r1695
14941a70466q0010P4068L3002J68018L2778O0568j69511n0773M6681q3509o5672
14930b04826Q3059M6296q5268j6834M2688q148P1667q074J32993O0787r067p3329
$$ plain form
14918 31944 11696 -47456 -88273 -37221 -78730 -40899 -99113 -20878 18309 -120367 -200897
14907 -200897 -69726 -60631 -180121 -323167 -337413 -485630 -312620 -287885 -216846 -178752 -285304
14896 -285304 -348387 -264411 -268048 135902 366711 377465 230282 74338 78757 16253 73876
14885 73876 -1182 30521 105621 22222 -4038 -108819 -55805 -79930 -119822 -153783 -135746
14874 -135746 -22998 -38283 40171 68564 46365 69135 -114535 -200566 -280077 -97557 170827
14863 170827 309422 122370 13190 25629 2579 -24150 -156853 -184080 -161227 -220252 -222223
14852 -222223 -166233 -202196 -160703 -132383 -56631 160849 36640 -195233 -86084 202638
14842 202638 202968 63545 64280 30643 -87554 -31571 137520 142490 77625 96465 97485 96881
$$ packed form
14918C1944k0248n9152m0817N1052m1509L7831n8214P8235L9187j38676q0530
14907b00897J31171R095j19490j43046j4246j48217J73010K4735P1039L8094j06552
14896b85304o3083Q3976l637M03950K30809J0754j47183j55944M419o2504N7623
14885G3876p5058L1703P5100q3399k6260j04781N3014k4125l9892l3961J8037
14874a35746J12748j5285P8454K8393k2199K2770j83670q6031p9511J82520K68384
14863A70827J38595j87052j09180J2439k3050k6729j32703k7227K2853n9025j971
14852b22223N5990l5963M1493K8320P5752K17480j24209k31873J09149K88722
14842B02638L30j39423P35l3637j18197N5983J69091M970o4865J8840J020o04
$$ plain form
14830 96881 155864 36964 126 100353 123149 -5472 -94172 -70677 -75545 -41225 -120355
14819 -120355 -159150 -27136 -62325 73158 241979 162856 -59599 6350 73165 -2473 -280473
14808 -280473 -399622 -304573 -250266 -107896 -42139 -25252 -101834 -235454 -213275 -110289 -47902
14797 -47902 57367 104294 46935 -122031 -188118 4398 -1076 -49036 10385 74549 60340
14786 60340 236929 197126 182579 97419 120405 119772 48894 37380 -77756 -34924 -80379 -156094
14774 -156094 -183634 -188602 -177303 -54534 -97576 -79789 -104015 2499 74893 104959 -21311
14763 -21311 -71574 -186380 -257604 -152489 -130119 -46602 -21581 -37864 143302 148423 -16278
14752 -16278 -66999 -32560 -251005 -310848 -102898 -99990 -137652 179487 345450 390559 301294
$$ packed form
14830I6881N8983j18900l6838J00227K2796j28621q8700K3495m868L4320p9130
14819a20355l8795J32014l5189J35483J68821p9123k22455O5949O6815p5638k78000
14808b80473j19149R5049N4307J42370O5757J6887p6582j33620K2179J02986O2387
14797d7902J05269M6927n7359j68966o6087J92516n474m7960N9421O4164j4209
14786F0340J76589l9803j4547q5160K2986o33p0878j1514j15136M2832m5455p5715
14774a56094k7540m968J1299J22769m3042J7787k4226J06514P2394L0066j26270
14763b1311n0263j14806p1224J05115K2370Q3517K5021j6283J81166N121j64701
14752a6278n0721L4439k18445n9843K07950K908l7662L17139J65963M5109q9265
$$ plain form
14741 301294 148509 156765 58299 -47665 -51403 19976 -44913 -174320 -188717 -152785 -201768
14730 -201768 -131301 -45367 -22745 -35206 29650 147947 -10856 -66597 89380 212764 53264
14719 53264 -70016 39039 18455 -90776 -46439 -9829 21576 -34679 -131610 -129803 -113916
14708 -113916 -115815 -76827 -183033 -231361 -161572 -881 -929 -121536 -165835 -315968 -342768
14697 -342768 -244585 -146331 -89991 -136899 -115259 -99652 -105159 -16106 -22735 -16249 44346 141809
14685 141809 207283 199028 137927 56290 -142510 -287465 -157883 55236 104841 11988 -106239
14674 -106239 -237753 -193220 82087 93234 -131571 -157187 -118595 -121588 -169927 -44670 7127
14663 7127 -109548 -120486 -182757 -273693 -438231 -416702 -169239 -225 62099 -91917 2530
$$ packed form
14741C01294j52785Q256r8466j05964l738P1379o4889j29407j4397L5932m8983
14730b01768P0467Q5934K2622j2461O4856J18297j58803n5741J55977J23384j59500
14719E3264j23280J09055k0584j09231M4337L6610L1405n6255r6931J807J5887
14708a13916j899L8988j06206m8328O9789J60691m8j20607m4299j50133k6800
14697c42768R8183R8254N6340m6908K1640J5607n507Q9053o629O486O0595R7463
14685A41809O5474q255o1101q1637j98800j44955J29582K13119M9605r2853j18227
14674a06239j31514M4533K75307J1147k24805k5616L8592k993m8339J25257N1797
14663G127j16675j0938o2271r0936j64538K1529K47463J69014O2324j54016R4447
$$ plain form
14652 2530 98638 159793 183930 172416 157662 241589 248792 21450 80260 145234 -1178 -142069
14640 -142069 -143760 -215317 -176905 -171589 -134485 -101802 41198 81558 -42754 -87238 134485
14629 134485 193058 -44950 -137160 -203345 -122621 -20908 -92095 -206192 -252525 -156413 -229311
14618 -229311 -354077 -119119 -68917 -75348 -37435 -77999 -238345 -232492 -194130 -78080 -51639
14607 -51639 -80316 139909 154463 11482 83199 37835 -210212 -90416 -101312 -65582 -175
14596 -175 183227 70844 -27290 -18442 50536 -22805 54766 28211 -16753 -37207 -142602 -171721
14584 -171721 68002 146747 107118 44006 -51234 -98 55137 -40039 -31753 -114015 -7278
14573 -7278 -149343 -276345 -237741 -108021 -2583 -11541 -125345 -80279 -80304 -36987 -120994 -10707
$$ packed form
14652B530R6108O1155K4137j1514j4754Q3927P203k27342N8810O4974j46412j40891
14640a42069j691p1557L8412N316L7104L2683J43000M0360j24312m4484K21723
14629A34485N8573k38008r2210o6185Q0724J01713p1187j14097m6333R6112p2898
14618b29311j24766K34958N0202o431L7913m0564j60346N853L8362J16050K6441
14607e1639k8677K20225J4554j42981P1717m5364k48047J19796j0896L5730O5407
14596a75J83402j12383r8134Q848O8978p3341P7571k6555m4964k0454j05395k9119
14584a71721K39723P8745l9629o3112r5240N1136N5235r5176Q286q2262J06737
14573g278j42065j27002L8604J29720J05438q958j13804M5066k5M3317q4007J10287
$$ plain form
14561 -10707 64599 -7212 -2610 17388 -74912 -180780 -150654 -21447 19832 42139 -157034
14550 -157034 -134087 5974 120825 136484 7264 -46659 -62713 120505 -87433 -304435
14540 -304435 -207904 -64682 112874 106171 -15123 -9752 -44130 -135350 -174246 -92083 -28432
14529 -28432 49163 -116114 2383 283034 400326 442149 379271 209644 78407 46739
14519 46739 191520 295008 187268 161723 73608 94155 274575 456016 416637 267472
14509 267472 179807 3870 -88823 -159274 -200614 -156473 -15044 -23439 -238143 -127617 -83358
14498 -83358 -175900 -182692 -207961 -276109 -237304 -201233 -120591 -136793 -76395 159501 148963 48895
14486 48895 25811 10682 113211 184569 216612 205247 20125 14554 30045 -35049 -152781
$$ packed form
14561a0707P5306p1811M602J9998r2300j05868L0126J29207M1279K2307j99173
14550a57034K2947J40061J14851J5659j29220n3923j6054J83218k07938k17002
14540c04435R6531J43222J77556o703j21294N371l4378r1220l8896Q2163O3651
14529b8432P7595j65277J18497K80651J17292M1823o2878j69627j31237l1668
14519D6739J44781J03488j07740k5545q8115K0547J80420J81441l9379j49165
14509B67472q7665j75937r2693p0451m1340M4141J41429q395k14704J10526M4259
14498h3358r2542o792k5269o8148L8805L6071Q0642j6202O0398K35896j0538j00068
14486D8895k3084j5129J02529P1358L2043j1365j85122n571J5491o5094j17732
$$ plain form
14475 -152781 -186185 -82188 -46473 -71769 -43115 -67373 -68582 83562 100050 181811 77750
14464 77750 -42602 11991 -63120 -122556 -163991 -49694 55671 35872 -82296 -74352 -554
14453 -554 -57416 -209413 -389478 -305702 -217160 13336 -22555 -70703 44806 44031 -16741 -166028
14441 -166028 -105987 -193269 -416063 -300309 -69379 133373 238543 313472 367122 310821
14431 310821 205233 97205 96004 -110528 -61607 88435 126535 6523 112992 87399
14421 87399 60556 111352 170645 -19088 -189286 -340082 -267194 -156157 -52857 -39992 160046
14410 160046 197931 49586 -53079 -120320 -93478 4922 -74565 -67333 -12740 35485 88552
14399 88552 -88245 -237648 -236438 -145615 -115607 -65105 -138870 -112426 -139099 -356677 -226107
$$ packed form
14475a52781l3404J03997L5715k5296K8654k4258j209J52144J6488Q1761j04061
14464G7750j20352N4593p5111n9436m1435J14297J05365j9799j18168P944P3798
14453e54n6862j51997j80065Q3776Q8542K30496l5891m8148J15509p75o0772j49287
14441a66028O0041q7282k22794J15754K30930K02752J05170P4929N3650n6301
14431C10821j05588j08028j201k06532M8921J50042L8100j20012J06469k5593
14421H7399k6843N0796N9293j89733j70198j50796P2888J11037J03300J2865K00038
14410A60046L7885j48345j02665o7241K6842R8400p9487P232N4593M8225N3067
14399H8552j76797j49403J210R0823L0008N0502p3765K6444k6673k17578J30570
$$ plain form
14388 -226107 14512 70514 174222 94081 27347 9730 48778 175566 167119 55240 -200818
14377 -200818 -251908 -87898 -93336 40394 81801 -99266 -161772 -54675 29494 -13913 -41035
14366 -41035 -124048 -44263 13275 58590 8768 -17835 -117332 -144600 -67983 -55010 -160906
14355 -160906 -282685 -185506 8925 -120797 -170983 -238300 -333818 -115647 -113769 -234073 -362291
14344 -362291 -269726 -131607 -111137 -120108 -98156 -102964 -19761 -83336 -186778 -223819 -167007
14333 -167007 48485 199809 115418 -33097 113407 140146 -20919 -28692 71796 91386
14323 91386 -80799 -339626 -330821 -314513 -292951 -262352 -107360 -168028 -221273 -195969 -90563
14312 -90563 -30323 44647 -868 -97076 -29978 -19388 55027 -77759 -141260 -138191 -123116 41120
$$ packed form
14388b26107K40619N6002J03708q0141o6734j7617L9048J26788q447j11879k56058
14377b00818n1090J64010n438J33730M1407j81067o2506J07097Q4169m3407k7122
14366d1035q3013P9785N7538M5315m9822k6603r9497k7268P6617J2973j05896
14355a60906j21779R7179J94431j29722n0186o7317r5518K18171J878j20304j28218
14344c62291R2565J38119K0470q971K1952m808Q3203o3575j03442l7041N6812
14333a67007K15492J51324q4391j48515J46504K6739j61065p773J00488J9590
14323I1386j72185k58827Q805J6308K1562L0599J54992o0668n3245K5304J05406
14312i0563O0240P4970m5515r6208O7098J0590P4415j32786o3501L069J5075J64236
$$ plain form
14300 41120 51493 -79941 -207353 -111780 58865 -51157 -114667 -47576 -5050 61916 94143
14289 94143 38881 98920 81436 70062 90184 -134168 -227230 -99116 -48191 77703 100594
14278 100594 -31010 -128295 69353 72899 169026 242631 261407 208397 -8224 -44669 -190768
14267 -190768 -178670 -8676 -132265 -138480 -86293 -107584 50788 94342 -188965 -329562 -304796
14256 -304796 -326788 -325235 -370957 -409278 -348476 -256999 -123624 130637 214930 115037 -19230
14245 -19230 -46462 55406 98457 -54819 -141853 -166998 -227003 -131297 72457 -125063 -187894
14234 -187894 -208867 -245465 -65758 -144199 -174142 -161850 -92737 -101507 -96177 -126088 -298904
14223 -298904 -284665 -340250 -371260 -314925 -82473 96931 57218 75440 195950 176814 -52110
$$ packed form
14300D1120J0373j31434j27412R5573J70645j10022o3510O7091M2526O6966L2227
14289I4143n5262O0039j7484j1374K0122k24352r3062J28114N0925J25894K2891
14278A00594j31604r7285J97648L546R6127P3605J8776n3010k16621l6445j46099
14267a90768J2098J69994j23589o215N2187k1291J58372M3554k83307j40597K4766
14256c04796k1992J553m5722l8321O0802R1477J33375K54261Q4293r9893j34267
14245a9230k7232J01868M3051j53276q7034k5145o0005R5706K03754j97520o2831
14234a87894k0973l6598J79707p8441k9943J2292O9113q770N330k9911j72816
14223b98904J4239n5585l1010N6335K32452J79404l9713J8222J20510j9136k28924
$$ plain form
14212 -52110 -150042 -201193 -302692 -77783 177898 123227 39767 -10446 -68346 52439 105498
14201 105498 88506 225873 212565 40127 52269 312670 269956 77511 -122841 -117275 -49432
14190 -49432 20763 62960 57186 53991 -100230 25490 89136 218804 332438 442884 397040
14179 397040 283470 265779 15182 -73858 -34720 -33679 13959 82097 53377 55790 87950
14168 87950 43950 94670 291904 171106 36923 -123035 -227197 -181218 -199637 -28279
14158 -28279 173089 222447 166691 49544 -74649 -104129 -221059 -295269 -96227 111949
14148 111949 219861 79363 -112024 -143189 23096 -100787 -148096 -199003 -182616 72914
14138 72914 83724 89514 64861 12087 67778 63361 164896 151416 -108730 -189127 -97823 -71406
$$ packed form
14212e2110r7932n1151j01499K24909K55681n4671q3460n0213n7900J20785N3059
14201A05498j6992J37367j3308j72438J2142K60401m2714j92445k00352N566O7843
14190d9432P0195M2197n774l195j54221J25720O3646J29668J13634J10446m5844
14179C97040j13570j7691k50597q9040L9138J041M7638O8138k8720K413L2160
14168H7950m4000N0720J97234j20798j34183j59958j04162M5979j8419J71358
14158b8279K01368M9358n5756j17147j24193k9480j16930p4210J99042K08176
14148A11949J07912j40498j91387l1165J66285j23883m7309n0907J6387K55530
14138G2914J0810N790k4653n2774N5691m417J01535j3480k60146q0397R1304K6417
$$ plain form
14126 -71406 -161249 -105200 -72037 -119705 -162032 -87110 -67206 -39053 250920 451533 381028
14115 381028 362714 133477 -45843 -23523 71835 -832 100886 19777 -100720 -98435 -57949
14104 -57949 -29911 -5665 -64317 -37246 -213933 -279389 -85840 -20836 -49890 18621 216681
14093 216681 221808 131997 133714 -4653 -238338 -229826 -253994 -243774 -56830 3768 287 62479
14081 62479 171501 229271 216213 235466 101346 57908 110451 -62505 -104404 20556 117397
14070 117397 -43355 -249548 -49563 -131677 -312036 -248322 -69435 -14452 -181443 -120138
14060 -120138 -77601 -111617 -125528 -168167 -143917 -40980 -17567 178477 179470 -114004 -184239
14049 -184239 -197672 -59325 -15580 -12807 119124 -49951 -283876 -101221 -42409 -115918 -167800
$$ packed form
14126g1406q9843N6049L3163m7668m2327P4922J9904K8153K89973K00613p0505
14115C81028j8314k29237j79320K2320R5358p2667J01718q1109j20497K285M0486
14104e7949K8038K4246n8652K7071j76687o5456J93549O5004k9054O8511J98060
14093B16681N127q9811J717j38367k33685Q512k4168J0220J86944O0598l481O2192
14081F2479J09022N7770j3058J9253j34120m3438N2543j72956m1899J24960R6841
14070A17397j60752k06193J99985q2114j80359O3714J78887N4983j66991O1305
14060a20138M2537l4016j3911m2639K4250J02937K3413J96044R93k93474p0235
14049a84239j3433J38347M3745K773J31931j69075k33925J82655N8812p3509n1882
$$ plain form
14038 -167800 -93791 -138061 -136780 -18950 -45028 -180195 -300734 -183115 -126868 2087 5672
14027 5672 96044 35886 -17912 -33763 25962 109157 164552 278760 304479 315725 319640 278730
14015 278730 197577 258824 190265 27826 14729 145979 56358 -16636 -5315 31518 103193
14004 103193 85299 -73886 -143652 -58023 -57821 126698 96504 79178 -46561 -44292 -9366
13993 -9366 126587 164466 180497 -81310 -133560 -99343 -93360 -145686 -44817 102243 286088
13982 286088 143400 49738 -47028 -193811 -141610 -140576 -214298 -180172 -37294 7689 -40360
13971 -40360 -14235 58380 91111 38688 137048 39006 -74936 -44066 -49367 -113341 -135389 -111224
13959 -111224 -197709 -271751 -147107 -139450 -250592 -384194 -200424 -158341 -181079 -217831 -141699
$$ packed form
14038a67800P4009m4270J281J17830k6078j35167j20539J17619N6247J28955L585
14027E672R0372o0158n3798j5851N9725Q3195N5395J14208K5719J1246L915m0910
14015B78730q1153O1247o8559j62439j3097J31250q9621p2994J1321L6833P1675
14004A03193j7894j59185o9766Q5629K02J84519l0194j7326j25739K269L4926
13993i366J35953L7879J6031k61807n2250L4217N983n2326J00869J47060J83845
13982B86088j42688r3662r6766j46783N2201J034p3722L4126J42878M4983m8049
13971d0360K6125P2615L2731n2423R8360r8042j13942L0870n301o3974k2048K4165
13959a11224q6485p4042J24644P657j11142j33602J83770M2083k2738l6752P6132
$$ plain form
13948 -141699 -186627 -115601 12384 -26352 -205027 -314678 -291791 -179673 -150867 -154230 -148532
13937 -148532 -111341 -186894 -259875 -333453 -321846 -135955 -81770 -28014 -64623 -96882 -18568
13926 -18568 38490 44704 95953 110828 115734 152669 89384 98065 8221 64718 10572 -3318
13914 -3318 -107651 -103891 -32813 -19389 -184366 -295740 -59088 114109 46581 -171923 -274868
13903 -274868 -259540 -117882 70665 112121 210561 116194 104547 192864 121635 22186 73349
13892 73349 252287 351966 466916 256795 24313 -8923 -49079 19586 201259 272154 271565
13881 271565 292585 115246 87652 40550 -116988 -210752 -195894 -287104 -269882 -88235 -67417
13870 -67417 59051 134212 110197 124032 116140 83550 -1986 -95030 9881 162345 139372
$$ packed form
13948a41699m4928P1026J27985l8736j78675j09651K2887J12118K8806l363N698
13937a48532L7191p5553p2981p3578J1607J85891N4185N3756l6609l2259P8314
13926a8568N7058O214N1249J4875M906L6935o3285Q681q9844N6497n4146j3890
13914c318j04333L760P1078J3424j64977j11374K36652J73197o7528k18504j02945
13903b74868J5328J41658J88547M1456R8440r4367j1647Q8317p1229r9449N1163
13892G3349J78938R9679J14950k10121k32482l3236m0156O8665J81673P0895n89
13881B71565K1020j77339k7594m7102j57538r3764J4858r1210J7222J81647K0818
13870f7417J26468P5161k4015J3835p892l2590q5536r3044J04911J52464k2973
$$ plain form
13859 139372 38878 -7168 -199042 -307710 -224366 -179825 -83206 29647 169817 -10175
13849 -10175 -93791 -239714 -206195 -174430 -86758 -126476 -106767 -17805 -18482 136607 214612 172021
13837 172021 81097 295209 355344 319237 191098 17235 -82010 -40594 66085 46352 154538
13826 154538 173165 87955 123187 287618 108731 2409 148197 211502 247739 171239 -41262
13815 -41262 -158761 25579 93900 23846 88953 99165 -43154 -124332 -204338 -217486 -163617
13804 -163617 -72970 -2141 216006 120760 73881 117902 20500 36685 119922 210455 163545
13793 163545 198108 129763 30034 36040 68841 115114 45507 65377 127347 106430 98402 172988
13781 172988 191926 120543 84260 162595 88710 -121847 -228961 -46265 203773 332551
$$ packed form
13859A39372j00494m6046j91874j08668Q3344M4541R6619J12853J40170j79992
13849a0175q3616j45923L3519L1765Q7672l9718J9709Q8962o77J55089P8005m2591
13837A72021r0924K14112O0135l6107j28139j73863r9245M1416J06679j9733J08186
13826A54538J8627q5210L5232J64431j78887j06322J45788O3305L6237p6500k12501
13815d1262j17499J84340O8321p0054O5107J0212j42319q1178q0006j3148N3869
13804a63617R0647P0829K18147r5246m6879M4021r7402J6185Q3237R0533m6910
13793A63545L4563o8345r9729O006L2801M6273o9607J9870O1970k0917q028P4586
13781A72988J8938p1383l6283P8335p3885k10557j07114J82696K50038J28778
$$ plain form
13771 332551 182011 -121116 -270416 -226007 -104014 -89887 -40722 93714 74587 -84925
13761 -84925 -253646 -249599 -272015 -240795 -96014 17421 64902 40256 -8586 149417 189237
13750 189237 -12353 -156890 -103161 -52434 -172756 -285740 -25116 113865 123217 170296
13740 170296 181708 120551 300868 410208 273883 141809 200419 96165 -31716 -280215
13730 -280215 -148491 93479 25653 107015 133295 78453 34368 -123246 -247681 -125063
13720 -125063 28780 60222 182333 249532 382950 338043 362787 231620 213956 192840 97273
13709 97273 1301 -174188 -225477 -85241 57778 197790 169916 27165 -19262 -74149 -152188
13698 -152188 -8068 132879 145722 156106 210748 152771 98842 19771 82085 41889 171653
$$ packed form
13771C32551j50540l03127j49300M4409J21993J4127M9165J34436j9127j59512
13761h4925j68721M047k2416L1220J44781J13435M7481k4646m8842J58003L9820
13750A89237k01590j44537N3729N0727j20322j12984K60624J38981R352M7079
13740A70296J1412o1157J80317J09340j36325j32074N8610j04254j27881k48499
13730b80215J31724K41970o7826Q1362K6280n4842m4085j57614j24435J22618
13720a25063J53843L1442J22111O7199J33418m4907K4744j31167j7664k1116r5567
13709I7273r5972j75489n1289J40236J43019J40012k7874j42751m6427n4887p8039
13698a52188J44120J40947J2843J0384N4642n7977n3929p9071O2314m0196J29764
$$ plain form
13687 171653 333944 157659 36158 -195660 -434826 -529570 -489030 -389254 -28388 130616
13677 130616 -31165 -35471 147177 270263 -12725 -14194 22483 -63976 -38837 -31400 -106819
13666 -106819 -19586 -30857 -32184 -76977 47337 -1263 -22035 -35090 -214451 -125226 2898
13655 2898 95621 197464 127014 -25379 -121552 -81209 216641 307363 325009 106810 -8628
13644 -8628 -149138 -135514 -81856 -19850 -41128 -47072 -118262 -178451 -157423 -212123 -459512 -372002
13632 -372002 -208605 -63346 7230 -152257 -178365 63210 281558 257483 108767 61425
13622 61425 19945 118529 115538 65859 -91575 -153868 -152974 -23792 87880 105655 -35036
13611 -35036 -76189 26363 108198 157838 106951 172750 166532 174420 170903 100499 67121 135213
$$ packed form
13687A71653J62291j76285j21501k31818k39166r4744M0540R9776L60866J59004
13677A30616j61781m306J82648J23086k82988j469L6677q6459K5139P437p5419
13666a06819Q7233j1271j327m4793J24314m8600k0772j3055j79361Q9225J28124
13655B898R2723J01843p0450j52393r6173M0343K97850R0722J7646k18199j15438
13644h628j40510J3624N3658O2006k1278n944p1190o0189K1028n4700k47389Q7510
13632c72002J63397J45259P0576j59487k6108K41575K18348k4075j48716m7342
13622F1425m1480R8584k991m9679j57434o2293Q94J29182J11672J7775j40691
13611c5036m1153J02552Q1835M9640n0887O5799o218P888l517p0404l3378O8092
$$ plain form
13599 135213 79853 159060 195846 268041 377435 415470 223551 40808 -83569 107471
13589 107471 308575 409024 317666 252756 -10050 52087 200021 180385 11134 785
13579 785 64696 132808 110975 -47766 -17888 28947 168288 409230 445092 268010 73262
13568 73262 -54959 40500 277161 314744 263637 382840 322958 401866 143443 156021 212669
13557 212669 165290 141296 278613 340894 341330 259552 64276 -168912 -110681 -14097 -70241
13546 -70241 157643 377855 378194 80242 -457 78077 -74413 -85148 11129 71250 -7382
13535 -7382 45781 146020 190881 172756 223452 87252 29677 -6909 97382 80490 11658
13524 11658 -854 -24887 254356 317359 229821 85495 117972 156587 194956 291374 253227
$$ packed form
13599A35213n5360P9207L6786P2195J09394L8035j91919j82743j24377J91040
13589A07471K01104J00449r1358o4910k62806O2137J47934j9636j69251j0349
13579G85O3911O8112k1833j58741K9878M6835J39341K40942L5862j77082j94748
13568G3262j28221R5459K36661L7583n1107J19203n9882P8908k58423J2578N6648
13557B12669m7379k3994J37317O2281M36q1778j95276k33188N8231R6584n6144
13546g0241K27884K20212L39k97952q0699P8534j52490j0735R6277O0121p8632
13535g382N3163J00239M4861j8125N0696j36200n7575l6586J04291j6892o8832
13524A1658j2512k4033K79243O3003q7538j44326L2477L8615L8369R6418l8147
$$ plain form
13513 253227 -579 -216731 -200136 -58650 59733 12764 -45625 99337 282426 185727
13503 185727 -72460 -246836 -147423 -56228 -169754 -206451 -177513 -219784 -6306 81254 -5919
13492 -5919 -208567 -289639 24301 272624 332085 417013 153948 17556 218280 305784 109908
13481 109908 38898 82759 146105 170260 59895 -60061 -132048 -39987 160398 213484 162655
13470 162655 134917 162502 -30818 76920 343290 357164 299521 188244 111085 -5219
13460 -5219 -109511 -101471 43489 188528 245963 275088 285034 366022 314368 278568 178165
13449 178165 299041 391619 403777 289728 328464 370976 455529 308505 69058 121258 238252
13438 238252 163211 51628 -9075 102504 416373 458072 241182 173992 338847 372578
$$ packed form
13513B53227k53806k16152J6595J41486J18383m6969n8389J44962J83089r6699
13503A85727k58187j74376R9413R1195j13526l6697K8938m2271K13478Q7560q7173
13492e919k02648q1072L13940K48323N9461Q4928k63065j36392K00724Q7504j95876
13481A09908p1010M3861O3346K4155j10365j19956p1987R2061K00385N3086n0829
13470A62655k7738K7585j93320J07738K66370J3874n7643j11277p7159j16304
13460e219j04292Q040J44960J45039N7435K9125R946Q0988n1654l5800j00403
13449A78165J20876R2578J2158j14049L8736M2512Q4553j47024k39447N2200J16994
13438B38252p5041j11583o0703J11579L13869M1699k16890o7190J64855L3731
$$ plain form
13428 372578 217166 111085 18025 29331 -30592 93166 52377 -21273 -23640 55554 160907
13417 160907 249728 314645 369848 270288 19676 34073 80794 -28012 -84366 -38250 224597
13406 224597 185376 136730 299361 351075 137925 40229 97530 174893 229570 243488 351640
13395 351640 409074 400559 341502 385985 584054 561793 779066 1155907 1485869 1952997 2177748
13384 2177748 2212709 2175748 2227309 2011147 1967635 1965160 1704928 1424068 1135069 1039440 995266
13373 995266 1028241 1162682 1264449 1431723 1353833 1393249 1282037 1377200 1415898 1389952 1360851
13362 1360851 1529346 1721149 1767660 1652437 1541591 1559561 1797630 2015596 2125827 2165929
13352 2165929 2302713 2414640 2502264 2483473 2334255 2146142 1865656 1594664 1437879 1378214
$$ packed form
13428C72578j55412j06081r3060J1306n9923J23758m0789p3650k367P9194J05353
13417A60907Q8821O4917N5203r9560k50612J4397M6721j08806n6354M6116K62847
13406B24597l9221m8646J62631N1714k13150r7696N7301P7363N4677J3918J08152
13395C51640N7434q515n9057M4483J98069k2261K17273L76841L29962M67128K24751
13384B177748L4961l6961N1561k16162m3512k475k60232k80860k88999r5629m4174
13373I95266L2975J34441J01767J67274p7890L9416j11212R5163L8698k5946k9101
13362A360851J68495J91803M6511j15223j10846J7970K38069K17966J10231M0102
13352B165929J36784J11927Q7624j8791j49218j88113k80486k70992j56785n9665
$$ plain form
13342 1378214 1383373 1260293 1176018 1377735 1492063 1400076 1454839 1513908 1486489 1296590 1129969
13331 1129969 1242144 1272779 1115090 1204860 1441238 1405966 1380299 1553073 1693742 1921338
13321 1921338 2018753 2309910 2430260 2465778 2404711 2296009 2046565 1833312 1684610 1538497
13311 1538497 1323646 1156686 1106904 1149819 995647 867587 656340 355393 254155 372816
13301 372816 507538 405543 418933 502392 414199 370958 478944 595452 738276 700289
13291 700289 487406 310129 331606 371816 402719 467246 652111 684594 440147 473014 593611
13280 593611 582294 552240 489542 578454 681407 655428 476669 380587 456785 577187 600957
13269 600957 638574 620740 509399 533919 564007 462956 596081 696770 564420 178888
$$ packed form
13342A378214N159j23080q4275K01717J14328r1987N4763N9069k7419j89899j66621
13331A129969J12175L0635j57689Q9770K36378l5272k5667J72774J40669K27596
13321A921338R7415K91157J20350L5518o1067j08702k49444k13253j48702j46113
13311A538497k14851j66960m9782M2915j54172j28060k11247l00947j01238J18661
13301C72816J34722j01995J3390Q3459q8193m3241J07986J16508J42824l7987
13291G00289k12883j77277K1477M0210L0903O4527J84865L2483k44447L2867J20597
13280E93611j1317l0054o2698Q8912J02953k5979j78759r6082P6198J20402K3770
13269F00957L7617j7834j11341K4520L0088j01051J33125J00689j32350l85532
$$ plain form
13259 178888 152974 453320 578052 675352 673332 876501 916432 633452 461237 466187 368108
13248 368108 408705 530936 583130 621091 494792 483251 575142 608076 373479 379873 510168
13237 510168 596242 514874 322815 306247 464995 610520 615840 604610 511482 566171 727408
13226 727408 716492 480977 298684 333421 231022 153907 244717 279177 412248 471845 684907
13215 684907 701574 582179 431680 444591 543732 593740 518989 407233 441168 517071 592573
13204 592573 843456 1217979 1521845 1565071 1539241 1296121 1317510 1221984 1101041 948310
13194 948310 958964 978625 841398 887217 850585 813848 689566 755228 788573 792342 854222
13183 854222 884860 946220 887686 928705 903709 767591 787232 765924 566918 427658 596740
$$ packed form
13259A78888k5914L00346J24732R7300k020K03169L9931k82980j72215M950r8079
13248C68108M0597J22231N2194L7961j26299j1541R1891L2934k34597O394J30295
13237E10168Q6074q1368j92059j6568J58748J45525N320j1230r3128N4689J61237
13226G27408j0916k35515j82293L4737j02399p7115R0810L4460J33071N9597K13062
13215F84907J6667j19395j50499J2911R9141N0008p4751j11756L3935P5903P5502
13204E92573K50883L74523L03866M3226k5830k43120K1389r5526j20943j52731
13194I48310J0654J9661j37227M5819l6632l6737j24282O5662L3345L769O1880
13183H54222L0638O1360n8534M1019k4996j36118J9641k1308j99006j39260J69082
$$ plain form
13172 596740 496781 444500 546530 644235 718814 729038 761216 809729 871350 1081320 1291091
13161 1291091 1520869 1517747 1722135 1974225 2170761 2517334 2801773 2839600 2695918 2522074
13151 2522074 2409365 1971087 1684167 1420764 1169795 1099219 989685 943467 898429 969647
13141 969647 999255 1275493 1372757 1457336 1393590 1196991 1059413 897018 818812 904133 864349
13130 864349 889365 832621 649129 696593 882713 972649 864399 788691 740457 735531 793389
13119 793389 772841 711405 773025 1038199 1314656 1570018 1803226 2038667 2218384 2327722
13109 2327722 2462289 2354923 2123778 2028458 1975458 1633136 1410824 1367133 1422261 1325705
13099 1325705 1228324 1262058 1333002 1412215 1647484 1731258 1865226 2060796 2072211 2165068 2251089
$$ packed form
13172E96740r9959n2281J02030R7705P4579J0224L2178M8513O1621K09970K09771
13161A291091K29778l122K04388K52090J96536L46573K84439L7827j43682j73844
13151B522074j12709m38278k86920k63403k50969p0576j09534m6218m5038P1218
13141I69647K9608K76238R7264Q4579o3746j96599j37578j62395p8206Q5321l9784
13130H64349K5016n6744j83492M7464J86120Q9936j08250p5708m8234m926N7858
13119G93389k0548o1436O1620K65174K76457K55362K33208K35441J79717J09338
13109B327722J34567j07366k31145r5320n3000l42322k22312m3691N5128r6556
13099A325705r7381L3734P0944P9213K35269Q3774J33968J95570J1415R2857Q6021
$$ plain form
13088 2251089 2228893 2110319 2130938 2177501 1872250 1571943 1501938 1561181 1428051 1479015
13078 1479015 1476418 1527112 1594916 1489719 1506523 1609751 1697802 1592654 1401223 1325271 1488379
13067 1488379 1571845 1747153 1765821 1734345 1491078 1360008 1357670 1357610 1402273 1398906 1349979 1397857
13055 1397857 1360609 1374876 1386979 1578270 1653815 1558873 1596739 1708886 1704147 1531073 1261586
13044 1261586 1349522 1480722 1477373 1429154 1502704 1686230 1819817 1857769 1718822 1788292 2013340
13033 2013340 2062516 1930098 1783263 1783478 1820731 1958383 1968133 1994861 2105338 2028408 2113682
13022 2113682 2308481 2360768 2297506 2194055 2213789 2342821 2373673 2321290 2393845 2444950 2571745
13011 2571745 2737091 2834768 2924720 2949009 2916223 3036730 3109682 3220820 3088236 3055603
$$ packed form
13088B251089k2196j18574K0619M6563l05251l00307p0005N9243j33130N0964
13078A479015k597N0694O7804j05197J6804J03228Q8051j05148j91431p5952J63108
13067A488379Q3466J75308J8668l1476k43267j31070k338o0M4663l367m8927M7878
13055A397857l7248J4267J2103J91291P5545r4942L7866J12147m739j73074k69487
13044A261586Q7936J31200l349m8219P3550J83526J33587L7952j38947O9470K25048
13033B013340M9176j32418j46835K15L7253J37652R750K6728J10477p6930Q5274
13022B113682J94799N2287o3262j03451J9734J29032L0852n2383P2555N1105J26795
13011B571745J65346R7677Q9952K4289l2786J20507P2952J11138j32584l2633
$$ plain form
13001 3055603 3216661 3431701 3384881 3370137 3560021 3662512 3750049 3840575 4069688 4292014
12991 4292014 4236363 4195267 4284749 4404609 4620803 4846290 5212747 5425689 5537679 5590581
12981 5590581 5984708 6383548 6760698 6917856 7440915 8064572 8543931 8920310 9187321
12972 9187321 9675527 10326823 11077031 11835963 12655268 13781082 15150908 16554707 18255481
12963 18255481 20437534 22933862 26105962 30029388 34794201 40845530 48390873 57900554
12955 57900554 70192747 86704510 109431267 140222623 180771150 230891953 286590422
12948 286590422 339819953 380326905 401633691 403578733 389336495 361745347 324361414
12941 324361414 283375260 244696269 212217759 188748879 175226533 171058634 174543187
$$ packed form
13001C055603J61058K15040m6820j4744J89884J02491Q7537R0526K29113K22326
12991D292014n5651m1096Q9482J19860K16194K25487L66457K12942J11990N2902
12981E590581L94127L98840L77150J57158N23059O23657M79359L76379K67011
12972I187321M88206O51296P50208P58932Q19305J125814J369826J403799J700774
12963A8255481K182053K496328L172100L923426M764813O051329P545343R509681
12955E7900554J2292193J6511763K2726757L0791356M0548527N0120803N5698469
12948B86590422N3229531M0506952K1306786J945042j4242238k7591148l7383933
12941C24361414m0986154l8678991l2478510k3468880j3522346m167899L484553
$$ plain form
12934 174543187 183465362 195426401 208859387 222410183 234223796 242080959 244635923
12927 244635923 242729254 237995720 231888915 225846865 221763777 222111492 229277653 244654961
12919 244654961 267831958 297282432 330195230 362256613 388446848 404502350 407866919
12912 407866919 398347589 378358631 351044129 319794004 288264580 260260085 238539158
12905 238539158 224136420 217297764 217431141 222897991 231625335 241383230 249275111 253411562
12897 253411562 253026586 248840008 241111170 229911979 216622255 204086498 194912142 191235491
12889 191235491 194802392 207282855 230076850 263611232 306179492 353267401 398087246
12882 398087246 432204583 447590579 440212279 412523345 371516964 323707987 272953609
$$ packed form
12934A74543187Q922175J1961039J3432986J3550796J1813613P857163K554964
12927B44635923j906669m733534o106805o042050m083088L47715P166161J5377308
12919B44654961K3176997K9450474L2912798L2061383K6190235J6055502L364569
12912D07866919r519330j9988958k7314502l1250125l1529424k8004495k1720927
12905B38539158j4402738o838656J33377N466850Q727344R757895P891881M136451
12897B53411562l84976m186578p728838j1199191j3289724j2535757r174356l676651
12889A91235491L566901J2480463K2793995L3534382M2568260M7087909M4819845
12882C98087246L4117337J5385996p378300k7688934m1006381m7808977n0754378
$$ plain form
12875 272953609 223280495 179537085 144606637 118262512 98675932 84017312 72791138
12868 72791138 63800970 56727965 50969613 46349846 42403137 39066400 36070849 33759425
12860 33759425 31761005 29906642 28165862 26532592 25006561 23723381 22540477 21644762
12852 21644762 20734021 19794332 18929318 17910511 17123791 16464320 15827448 15170397 14517279
12843 14517279 13874967 13305964 12897297 12575888 12354915 11980485 11732312 11286621 10944005
12834 10944005 10862628 10577223 10202575 9885553 9759132 9501009 9275626 9057773 8993742 8996891
12824 8996891 8946540 9025487 8786743 8652548 8226107 7906290 7706233 7389402 6814990 6335911
12814 6335911 6251000 6013037 5742844 5433772 5120834 5022299 4833523 4782781 4708381 4515004
$$ packed form
12875B72953609m9673114m3743410l4930448k6344125j9586580j4658620j1226174
12868G2791138q990168p073005n758352m619767l946709l336737k995551k311424
12860C3759425j998420j854363j740780j633270j526031j283180j182904q95715
12852B1644762r10741r39689q65014j018807p86720o59471o36872o57051o53118
12843A4517279o42312n69003m08667l21409k20973l74430k48173m45691l42616
12834A0944005q1377k85405l74648l17022j26421k58123k25383k17853o4031L149
12824H996891n0351P8947k38744j34195m26441l19817k00057l16831n74412m79079
12814F335911q4911k37963k70193l09072l12938r8535j88776n0742p4400j93377
$$ plain form
12804 4515004 4318905 4175165 3984145 3606438 3401731 3373455 3190968 2918853 2848226 2947246
12794 2947246 2991418 2935150 3100653 3083660 2941346 2932791 2901121 2715359 2580752 2629477 2741608
12783 2741608 2695298 2761560 2679833 2584778 2451606 2263967 2135630 2089461 2175226 2308377
12773 2308377 2057527 2051751 2056105 2008042 1895260 2050597 2117393 2001110 1888296 1718169
12763 1718169 1599836 1561728 1527922 1655746 1550502 1393765 1506598 1625816 1551606 1598282
12753 1598282 1674367 1638239 1591639 1582460 1673104 1650946 1632553 1652406 1686251 1772014 1875984
12742 1875984 1978513 2165233 2283983 2372612 2467667 2359985 2150977 1991155 1758414 1575961
12732 1575961 1337092 1212929 1103465 1014691 1106771 1050684 945139 937301 765186 677573
$$ packed form
12804D515004j96099j43740j91020l77707k04707k8276j82487k72115p0627R9020
12794B947246M4172n6268J65503j6993j42314q555l1670j85762j34607M8725J12131
12783B741608m6310O6262q1727r5055j33172j87639j28337m6169Q5765J33151
12773B308377k50850n776M354m8063j12782J55337O6796j16283j12814j70127
12763A718169j18333l8108l3806J27824j05244j56737J12833J19218p4210M6676
12753A598282P6085l6128m6600r179R0644k2158j8393J9853L3845Q5763J03970
12742A875984J02529J86720J18750Q8629R5055j07682k09008j59822k32741j82453
12732A575961k38869j24163j09464q8774R2080n6087j05545p838j72115q7613
$$ plain form
12722 677573 659672 637254 653474 696611 638885 376122 271966 322133 357159 294071 404427
12711 404427 436944 401597 381999 384154 406675 192460 245969 338120 243471 174533 269124
12700 269124 185922 270275 350433 507249 518772 398070 282215 119463 127468 205762 58866
12689 58866 -159308 -151808 -107301 -44267 62051 122076 126121 139708 -33838 98559 238568
12678 238568 219364 -14104 -127829 -6159 76749 -27266 -111915 -12756 110142 11846
12668 11846 96092 6727 88252 43460 97348 276665 309514 171516 107009 168071 195456
12657 195456 109315 79527 97523 217925 175283 94416 133874 57631 78263 105727 44831
12646 44831 65677 46110 -122140 -132279 -201517 -21689 266184 306366 376816 422971 463853
$$ packed form
12722F77573j7901k2418J6220M3137n7726k62763j04156N0167L5026o3088J10356
12711D04427L2517l5347j9598K155K2521k14215N3509R2151r4649o8938R4591
12700B69124q3202Q4353Q0158J56816J1523j20702j15855j62752Q005P8294j46896
12689E8866k18174P500M4507O3034J06318O0025M045J3587j73546J32397J40009
12678B38568j9204k33468j13725J21670Q2908j04015q4649R9159J22898r8296
12668A1846Q4246q9365Q1525m4792N3888J79317L2849j37998o4507O1062K7385
12657A95456q6141k9788J7996J20402m2642q0867L9458p6243K0632K7464o0896
12646D4831K0846j9567j68250j0139o9238J79828K87873M0182P0450M6155M0882
$$ plain form
12635 463853 396747 426750 404911 175591 98917 65249 -7124 -2741 -79254 111768 266140
12624 266140 152335 104264 100009 -84518 -125324 -119492 -240912 -225379 6849 7377 -376 10734
12612 10734 -85487 -244230 -358865 -246131 -7764 322977 343094 61516 -7092 -69000
12602 -69000 -167723 -182802 -106961 -179826 -235784 -287055 -268277 -133514 -106192 -156621 -43400
12591 -43400 109376 -14396 -126487 -34121 113413 66363 -6854 -46352 -88825 -54812 65341
12580 65341 119773 46577 -65014 -67687 -95963 52302 258790 289690 200643 74755 -105753
12569 -105753 -157348 -73691 -40752 -78849 -47864 163721 392291 399012 140202 79292 246232
12558 246232 420828 442080 435734 387589 215221 15190 44787 170418 205353 191760 265157
$$ packed form
12635D63853o7106L0003k1839k29320p6674l3668p2373M383p6513J91022J54372
12624B66140j13805m8071m255j84527m0806N832j21420J5533K32228N28p753J1110
12612A0734r6221j58743j14635J12734K38367L30741K0117k81578o8608o1908
12602f9000r8723j5079P5841p2865n5958n1271J8778J34763K7322n0429J13221
12591d3400J52776j23772j12091R2366J47534m7050p3217l9498m2473L4013J20153
12580F5341N4432p3196j11591k673k8276J48265K06488L0900q9047j25888j80508
12569a05753n1595Q3657L2939l8097L0985K11585K28570O721k58810o0910J66940
12558B46232J74596K1252o346m8145j72368k00031K9597J25631L4935j3593P3397
$$ plain form
12547 265157 383632 300438 69382 224614 501476 469904 391915 410471 494734 455254 454290
12536 454290 439472 284239 283089 353323 273020 130372 323120 386478 357663 442250 367203
12525 367203 220996 169425 167230 172219 274216 435969 541762 412699 294044 305511 391883
12514 391883 418607 345047 474738 783182 928195 1056546 1308192 1600070 1732463 1944659
12504 1944659 2229119 2284685 2250907 2321714 2280464 2181608 2072069 1916752 1824506 1785487 1702234
12493 1702234 1479758 1595849 1574866 1355679 1243638 1184960 1155882 1162543 1173430 1269590 1220523
12482 1220523 1248944 1300745 1172298 1252984 1356667 1421278 1634681 1690250 1662212 1812085
12472 1812085 1996084 2197446 2317014 2242402 2134744 2209165 2272711 2107189 1932401 1734084
$$ packed form
12547B65157J18475q3194k31056J55232K76862l1572p7989J8556Q4263l9480r64
12536D54290j4818j55233j150P0234q0303j42648J92748O3358k8815Q4587p5047
12525C67203j46207n1571k195M989J01997J61753J05793j29063j18655J1467Q6372
12514C91883K6724p3560J29691L08444J45013J28351K51646K91878J32393K12196
12504A944659K84460N5566l3778P0807m1250r8856j09539j55317r2246l9019q3253
12493A702234k22476J16091k0983k19187j12041n8678k9078O661J0887R6160m9067
12482A220523K8421N1801j28447Q0686J03683O4611K13403N5569k8038J49873
12472A812085J83999K01362J19568p4612j07658P4421O3546j65522j74788j98317
$$ plain form
12462 1734084 1658180 1582597 1548265 1543925 1237061 1186030 1327636 1357134 1403617 1388124 1370521
12451 1370521 1372205 1341440 1206478 1190809 1182167 982300 910197 1190754 1398914 1483588 1752657
12440 1752657 2063727 2209898 2318792 2227070 2175187 1967704 1814774 1793257 1507724 1138069
12430 1138069 916731 810851 872501 725473 736841 595727 372611 184370 53752 67244
12420 67244 186818 245688 256776 384925 409143 414296 165446 135309 136442 193479 277469
12409 277469 150799 63485 91175 150445 209031 300061 249133 104736 108030 139774 -53965
12398 -53965 -206308 -80630 -76589 -219955 -126313 80711 130799 48390 -53123 5070 -5203
12387 -5203 4306 137537 158309 87424 -22513 -121021 -102739 -18637 -9652 -170695 -166758 10990
$$ packed form
12462A734084p5904p5583l4332m340l06864n1031J41606K9498M6483j5493j7603
12451A370521J684l0765j34962j5669q642j99867p2103K80557K08160Q4674K69069
12440A752657L11070J46171J08894r1722n1883k07483j52930k1517k85533l69655
12430A138069k21338j05880O1650j47028J1368j41114k23116j88241j30618J3492
12420F7244J19574N8870J1088J28149K4218N153k48850l0137J133N7037Q3990
12409B77469j26670q7314K7690N9270N8586R1030n0928j44397L294L1744j93739
12398e3965j52343J25678M041j43366R3642K07024N0088q2409j01513N8193j0273
12387e203R509J33231K0772p0885j09937r8508J8282Q4102Q985j61043L937J77748
$$ plain form
12375 10990 -29729 -40439 96761 185616 206955 108580 45223 51463 97882 46305 -130587
12364 -130587 -126217 -276580 -149062 -134711 -128136 -225874 -181476 -119746 -91423 -78667 -183736
12353 -183736 -225189 -208322 3990 100232 26642 -142879 -139017 2230 42338 71383 72043
12342 72043 70612 211729 107952 -6777 -95348 -132720 43948 220742 371280 357719 312379
12331 312379 178165 133419 271216 390426 436911 197913 8448 -52834 -111233 -135791
12321 -135791 -28746 33465 54406 181874 79365 29812 79305 -2414 -104653 -80409 -53253
12310 -53253 143893 222269 32261 129456 104654 -128299 -89477 -158602 70300 36298 -5157
12299 -5157 38783 19643 -44963 131218 217315 154973 -45895 -61263 122040 167567 68505
$$ packed form
12375A0990m0719j0710J37200Q8855K1339r8375o3357O240M6419n1577j76892
12364a30587M370j50363J27518J4351O575r7738M4398O1730K8323J2756j05069
12353a83736m1453J6867K12312R6242p3590j69521L862J41247M0108K9045O60
12342G2043j431J41117j03777j14729q8571l7372J76668J76794J50538j3561m5340
12331C12379j34214m4746J37797J19210M6485k38998j89465o1282n8399k4558
12321a35791J07045O2211K0941J27468j02509m9553M9493q1719j02239K4244K7156
12310e3253J97146P8376j90008R7195k4802k32953L8822o9125K28902l4002m1455
12299e157M3940j9140o4606J76181Q6097o2342k00868j5368J83303M5527r9062
$$ plain form
12288 68505 -4534 -22030 -53570 182509 195127 78810 47829 14026 -15368 -82330 41716
12277 41716 260844 326203 279270 246631 223264 193985 319117 181603 106998 -25809 -60502
12266 -60502 73625 -1282 -138297 -176707 -75204 -62416 -150492 -88473 -6719 -31937 -63503
12255 -63503 5856 14581 -203154 -213205 -120086 -144708 -115116 -297282 -378545 -411564 -225699
12244 -225699 -46214 -15840 -62869 -106758 -85650 -82363 -133713 -96717 181837 307531 220707
12233 220707 36180 -175846 -121193 151702 140519 45902 176447 232597 230129 13715 -75115
12222 -75115 1024 -146655 -252177 -145785 34012 227907 250694 277254 98487 86800
12212 86800 -28718 -245111 -274811 -238168 -159877 35613 54505 -89762 -143804 -159942 -129453
$$ packed form
12288F8505p3039j7496l1540K36079J2618j16317l0981l3803k9394o6962J24046
12277D1716K19128O5359m6933l2639k3367k9279J25132j37514p4605j32807l4693
12266f0502J34127p4907j37015l8410J01503J2788q8076O2019Q1754k5218l1566
12255f3503O9359Q725k17735j0051R3119k4622K9592j82166q1263l3019J85865
12244b25699J79485L0374m7029m3889K1108L287n1350L6996K78554J25694q6824
12233B20707j84527k12026N4653K72895j1183r4617J30545N6150k468k16414q8830
12222g5115P6139j47679j05522J06392J79797J93895K2787K6560j78767j1687
12212H6800j15518k16393k9700L6643P8291J95490J8892j44267n4042j6138L0489
$$ plain form
12201 -129453 -115599 -133845 -53276 -102465 -19744 3042 -2892 90018 113536 209341 224199 90729
12189 90729 89961 89128 15686 -81407 -128355 -168851 -27320 67176 70286 -14200 110932 197421
12177 197421 288815 241729 259180 276988 204746 84310 92240 173484 215021 138469 -2519
12166 -2519 -53074 -17851 106741 239106 252391 131476 99624 143481 51512 14845 118681
12155 118681 259203 376334 294633 97681 205695 385555 293582 73349 160135 167573
12145 167573 205458 212242 210239 115645 83129 171518 253112 241208 287213 278838 296047 117751
12133 117751 -39780 -112116 -49566 20558 103384 207529 90260 65278 128149 63736 -36288
12122 -36288 -12781 -54423 -55479 -80274 113633 376683 226170 7928 101332 168761 258783
$$ packed form
12201a29453J3854j8246Q0569m9189Q2721K2786n934R2910K3518R5805J4858j33470
12189I0729p68q33p3442r7093m6948m0496J41531R4496L110q4486J25132Q6489
12177A97421R1394m7086J7451J7808p2242j20436P930Q1244M1537p6552j40988
12166b519n0555L5223J24592J32365J3285j20915l1852M3857r1969l6667J03836
12155A18681J40522J17131q1701j96952J08014J79860r1973k20233Q6786P438
12145A67573L7885O784k003r4594l2516Q8389Q1594j1904M6005q375J7209j78296
12133A17751j57531p2336O2550P0124Q2826J04145j17269k4982O2871o4413j00024
12122c6288K3507m1642j056k4795J93907K63050j50513k18242R3404O7429R0022
$$ plain form
12111 258783 201378 267535 301862 124873 -46183 -170663 -339461 -203445 59433 -31313
12101 -31313 -114882 -71971 20100 83165 31096 -125126 -62283 94554 -39207 -200390 -219781
12090 -219781 -26447 134179 119698 -2913 -106349 -159031 16204 242829 284351 444147
12080 444147 516884 372366 274464 244896 268459 211504 112797 96596 -90065 47 151309
12069 151309 148461 139412 119557 54161 42276 14792 43248 -3593 -188218 -206773 -149596 -110029
12057 -110029 69228 161744 200159 12865 -218689 -51780 46396 73966 104314 27919 8264
12046 8264 -32310 -110228 -251043 -393941 -208646 45389 53163 -3524 43605 2689 67330
12035 67330 22200 -150801 -132322 -63098 4477 -69728 -140375 -52815 24 -57651 7994
$$ packed form
12111B58783n7405O6157L4327j76989j71056j24480j68798J36016K62878r0746
12101c1313q3569M2911R2071O3065n2069j56222O2843J56837j33761j61183j9391
12090b19781J93334J60626j4481j22611j03436n2682J75235K26625M1522J59796
12080D44147P2737j44518r7902k9568K3563n6955r8707j6201j86661R0112J51262
12069A51309k848r049j9855o5396j1885k7484K8456m6841j84625j8555N7177L9567
12057a10029J79257R2516L8415j87294k31554J66909R8176K7570L0348p6395j9655
12046H264m0574p7918j40815j42898J85295K54035P774n6687M7129m0916O4641
12035F7330m5130j73001J8479O9224O7575p4205p0647Q7560N2839n7675O5645
$$ plain form
12024 7994 -99629 -36267 127619 195746 67706 -88361 32637 73114 73158 -25356 -15984 -125393
12012 -125393 -183952 -42318 13347 112316 161892 180415 200819 -45164 -259104 -356185 -219071
12001 -219071 -47702 60667 -28339 -69699 6891 108913 50914 67198 218809 301743 351100
11990 351100 278967 169759 213305 132285 115115 145704 174724 249578 164531 7474 -150378
11979 -150378 -65078 -175881 -187105 -103946 -59401 236620 230168 212419 167598 117141 236219
11968 236219 200046 40784 -50455 -99953 -181648 -96666 69100 18234 15792 142078 65086
11957 65086 177656 112239 -56487 52743 116594 -25278 -156287 -19335 -49777 64114
11947 64114 55735 -64603 37309 144893 94351 136016 79306 79462 146859 46172 42767 57904
$$ packed form
12024G994j07623O3362J63886O8127j28040j56067J20998M0477M4r8514R372j09409
12012a25393n8559J41634N5665R8969M9576J8523K0404k45983k13940r7081J37114
12001b19071J71369J08369q9006m1360P6590J02022n7999J6284J51611Q2934M9357
11990C51100p2133j09208M3546q1020j7170L0589K9020P4854q5047j57057j57852
11979a50378Q5300j10803j1224Q3159M4545K96021o452j7749m4821n0457J19078
11968B36219l6173j59262r1239m9498q1695Q4982J65766n0866k442J26286p6992
11957F5086J12570o5417j68726J09230O3851j41872j31009J36952l0442J13891
11947F4114q379j20338J01912J07584n0542M1665n6710J56O7397j00687l405J5137
$$ plain form
11935 57904 15207 94074 71925 114455 97521 11605 -50396 -103351 16745 -53343 -56966 -87697
11923 -87697 -38898 8000 -68987 -4342 167350 155265 119479 15078 -66171 -185969 -159847
11912 -159847 -98247 -123141 -142594 -43793 -228728 -416351 -408112 -217789 -88241 41333 1922
11901 1922 -121394 -89677 -234155 -278826 -170614 -136598 -153426 45601 35962 -66617 20053
11890 20053 58952 -44703 -52811 -12 -106286 -16298 124059 170354 110367 213237 62500
11879 62500 -51997 25426 -42724 -27797 -78499 -133133 -16123 11803 57809 266703 305269
11868 305269 179461 -56239 -75315 -4513 -135672 -257365 -153521 116795 166583 167906
11858 167906 63343 126691 18542 -89318 -73252 24375 -34910 -216282 -205866 -163106 -158198
$$ packed form
11935E7904m2697P8867k2149M2530j6934q5916o2001n2955J20096p0088l623l0731
11923h7697M8799M6898p6987O4645J71692j2085l5786j04401q1249j19798K6122
11912a59847O1600k4894j9453R8801j84935j87623Q239J90323J29548J29574l9411
11901A922j23316L1717j44478m4671J08212L4016j6828J99027r639j02579Q6670
11890B0053L8899j03655q108N2799j06274Q9988J40357M6295n9987J02870j50737
11879F2500j14497P7423o8150J4927n0702n4634J17010K7926M6006K08894L8566
11868C05269j25808k35700j9076P0802j31159j21693J03844K70316M9788J323
11858A67906j04563O3348j08149j07860J6066R7627n9285j81372J0416M2760M908
$$ plain form
11847 -158198 -143713 -78464 -103133 10294 245357 244377 231996 264224 271225 231305 119142
11836 119142 94502 -26549 -106399 -275872 -309982 -176382 -128662 -73225 -46258 -74445 -171100
11825 -171100 -265061 -15362 218578 112588 14199 110088 318557 311019 174116 -48845
11815 -48845 -92740 82124 259549 -7369 27835 65409 83405 -13342 16940 44913 52547
11804 52547 122372 46637 43207 -17019 26001 70085 -45404 -252181 -290407 -187105 -83836
11793 -83836 -52917 -126745 -7728 -27015 -107086 -81486 -16763 -88676 37358 28503 50560
11782 50560 -2699 -119262 -18932 37549 -39582 -7037 106233 28034 -130641 -203836 -92966
11771 -92966 21165 63540 37713 120576 174171 229211 113989 -104249 -94464 96933 122449
$$ packed form
11847a58198J4485O5249k4669J13427K35063r80j2381L2228P001l9920j12163
11836A19142k4640j21051p9850j69473l4110J33600M7720N5437K6967k8187r6655
11825a71100r3961K49699K33940j05990r8389R5889K08469p538j36903k22961
11815d8845m3895J74864J77425k66918L5204L7574J7996r6747L0282K7973P634
11804E2547O9825p5735l430o0226M3020M4084j15489k06777l8226J03302J03269
11793h3836L0919p3828J19017j9287q0071K5600O4723p1913J26034q855K2057
11782E0560n3259j16563J00330N6481p7131L2545J13270p8199j58675p3195J10870
11771i2966J14131M2375k5827Q2863N3595N5040j15222k18238R785J91397K5516
$$ plain form
11760 122449 71614 114741 175921 138624 133133 227736 145535 55267 -74533 -35104 -1097
11749 -1097 93876 201912 71003 -61824 -119863 -121879 -102444 -66944 -60480 -163311 -182254
11738 -182254 -147239 -3024 69632 -60546 -158823 -140493 -98304 -2015 268334 305787 252829
11727 252829 224227 185255 133174 56039 107625 59916 113544 16094 26382 43415 58824
11716 58824 8317 97 279229 363413 352582 291248 405058 528688 382325 247119 265652
11705 265652 185132 94162 17325 -41537 139473 197113 156945 -70482 -233949 -259755 -236668
11694 -236668 -226240 -135360 -62466 -95639 -26916 50580 130583 34568 -53747 -158993 -158305 -209272
11682 -209272 -60356 -6345 76263 59068 3832 114390 213887 252323 138577 -99020 -213112
$$ packed form
11760A22449n0835M3127O1180l7297n491R4603q2201r0268j29800L9429L4007
11749a097R4973J08036j30909j32827n8039k016J9435L5500O464j02831j8943
11738a82254L5015J44215P2656j30178r8277J8330M2189R6289K70349L7453n2958
11727B52829k8602l8972n2081p7135N1586m7709N3628r7450J0288J7033J5409
11716E8824n0507q220K79132Q4184j0831o1334J13810J23630j46363j35206J8533
11705B65652q0520r0970p6837n8862J81010N7640m0168k27427j63467k5806K3087
11694b36668J0428R0880P2894l3173O8723P7496Q0003r6015q8315j05246O88n0967
11682b09272J48916N4011Q2608j7195n5236J10558R9497L8436j13746k37597j14092
$$ plain form
11671 -213112 -148687 -85375 -10977 125078 120057 -49757 99172 196211 238673 232822 83113
11660 83113 17550 73591 89406 299349 392707 324247 178177 223549 87446 92743 100497
11649 100497 21844 165716 164973 38606 57503 176429 179038 173870 65535 83201 15845
11638 15845 -33012 -45874 -79408 60496 286412 355600 381798 264419 239604 228479 207699
11627 207699 137026 144760 48490 10790 40474 167220 34864 -7894 -43224 -56705 102072
11616 102072 193641 260120 320234 291344 169891 222797 286835 238680 154327 251931 388257
11605 388257 352695 393286 428348 333630 281727 378559 345707 216493 159277 68522 -53431
11594 -53431 -136489 -110635 -81281 -57753 -210873 -130935 42052 85918 65251 161008 40394
$$ packed form
11671b13112O4425O3312P4398J36055n021j69814J48929R7039M2462n851j49709
11660H3113o5563N6041J5815K09943R3358o8460j46070M5372j36103N297P754
11649A00497p8653J43872p43j26367J8897J18926K609n168j08335J7666o7356
11638A5845m8857j2862l3534J39904K25916O9188K6198j17379k4815j1125k0780
11627B07699p0673P734r6270l7700K9684J26746j32356m2758l5330j3481J58777
11616A02072R1569O6479O0114k8890j21453N2906O4038m8155q4353R7604J36326
11605C88257l5562M0591L5062r4718n1903R6832l2852j29214n7216r0755j21953
11594e3431q3058K5854K9354K3528j53120P9938J72987M3866k0667R5757j20614
$$ plain form
11583 40394 30948 104126 134669 -18290 26348 79633 230971 380501 236794 104903 170031
11572 170031 203277 283170 179303 -653 76094 119802 166816 298746 302335 207496 162722
11561 162722 262297 335550 249264 58214 86058 204313 217048 73813 -78250 155066
11551 155066 190645 212654 231678 162060 172476 321416 301828 352326 359361 299144 132982
11540 132982 5917 -104746 42797 155062 126377 -5748 18401 111967 127028 220808
11530 220808 322675 334688 247837 199630 49061 -111274 -91067 -95248 -124653 117817 196477
11519 196477 209461 386830 374833 161712 145364 169414 152825 95508 139295 158045 253232
11508 253232 381671 290771 152909 10391 -69748 -16856 28396 78514 149419 152719 202429
$$ packed form
11583D0394r446P3178L0543j52959M4638N3285J51338J49530j43707j31891O5128
11572A70031L3246P9893j03867j79956P6747M3708M7014J31930L589r4839m4774
11561A62722R9575P3253q6286j91050K7844J18255J2735j43235j52063K33316
11551A55066L5579K2009J9024o9618J0416J48940j9588N0498P035o0217j66162
11540A32982j27065j10663J47543J12265k8685j32125K4149R3566J5061R3780
11530B20808J01867J2013q6851m8207j50569j60335K0207m181k9405K42470P8660
11519A96477J2984J77369j1997k13121j6348K4050j6589n7317M3787J8750R5187
11508B53232J28439r0900j37862j42518q0139N2892M5252N0118P0905L300M9710
$$ plain form
11497 202429 370597 381164 341589 300627 188607 83078 -30156 -57569 66026 126664
11487 126664 34372 -4868 -19691 -134341 -200932 -30716 -68143 85860 184953 54735 59152
11476 59152 62132 122769 295629 392400 339457 240912 107762 144601 138170 94155 -54097
11465 -54097 -1276 74970 115400 63175 -55860 -70039 19472 70525 172636 121126 165730
11454 165730 114315 116489 188907 184741 264984 7639 -76803 146989 219779 71617 143227
11443 143227 69118 -217 129468 96106 110203 153111 -74708 -216952 -142681 25194 93487
11432 93487 -14910 -62630 44875 32703 -33311 26140 126245 186589 160322 1664 -124090
11421 -124090 33665 116980 108700 188239 126492 10809 31313 96443 155785 166001 160411
$$ packed form
11497B02429J68168J0567l9575m0962j12020j05529j13234k7413J23595O0638
11487A26664r2292l9240j4823j14650o6591J70216l7427J54003R9093j30218M417
11476E9152K980O0637J72860R6771n2943r8545j33150L6839o431m4015j48252
11465e4097N2821P6246M0430n2225j19035j4179Q9511N1053J02111n1510M4604
11454A65730n1415K174P2418m166Q0243k57345q4442K23792P2790j48162P1610
11443A43227p4109o9335J29685l3362J4097M2908k27819j42244P4271J67875O8293
11432I3487j08397m7720J07505j2172o6014N9451J00105O0344k6267j58658j25754
11421a24090J57755Q3315q280P9539o1747j15683K0504O5130N9342J0216n590
$$ plain form
11410 160411 2163 137212 126143 147998 310031 375715 295782 167559 88761 184156 265501
11399 265501 225734 241152 355349 147743 119669 159665 171154 184024 105336 59105 -7105
11388 -7105 184525 344020 295855 272421 205239 147766 217642 180876 35935 -28211 133825
11377 133825 192506 145406 27303 -77812 -87866 -33978 -97152 54440 55926 123990 147504
11366 147504 30006 -108252 77744 249472 433594 517898 451307 286819 131255 129633
11356 129633 315057 231895 204959 80105 130178 219937 289041 308015 275996 323955 404255
11345 404255 540063 444988 340288 221181 121519 251478 378534 217119 250247 271074
11335 271074 105568 -7568 35315 -37751 -5246 114635 186681 473710 569658 477272 379437
$$ packed form
11410A60411j58248J35049j1069K1855J62033O5684p9933j28223p8798R5395Q1345
11399B65501l9767J5418J14197k07606k8074L9996J1489J2870p8688m6231o6210
11388g105J91630J59495m8165k3434o7182n7473O9876l6766j44941o4146J62036
11377A33825N8681m7100j18103j05115j0054N3888o3174J51592J486O8064K3514
11366A47504j17498j38258J85996J71728J84122Q4304o6591j64488j55564j622
11356A29633J85424q3162k6936j24854N0073Q9759O9104J8974l2019M7959Q0300
11345D04255J35808r5075j04700j19107r9662J29959J27056j61415L3128K0827
11335B71074j65506j13136M2883p3066L2505J19881P2046K87029R5948r2386r7835
$$ plain form
11324 379437 321158 274952 285777 293350 273825 338333 270063 216220 298970 401760 500712
11313 500712 405360 471279 445366 530132 546258 540437 699868 877818 1119662 1354529 1756747
11302 1756747 2042626 2313387 2466702 2425408 2391391 2251077 2160099 2169013 2099389 1938074
11292 1938074 1496502 1341754 1319084 1300803 1053801 1003376 956777 1116569 1274362 1456724
11282 1456724 1576840 1591220 1430225 1434866 1507179 1512805 1409719 1288215 1376214 1341206 1438728
11271 1438728 1708242 1788074 2064689 2236658 2210494 2297120 2324116 2334802 2294470 2090140
11261 2090140 1832840 1688754 1537709 1363809 1289784 1336786 1399958 1503819 1608996 1607446
11251 1607446 1570071 1514190 1661642 1619798 1588279 1491233 1402874 1478508 1467230 1540285 1610372
$$ packed form
11324C79437n8279m6206J0825P573j9525O4508o8270n3843Q2750J02790R8952
11313E00712r5352O5919k5913Q4766J6126n821J59431J77950K41844K34867M02218
11302A756747K85879K70761J53315m1294l4017j40314r0978Q914o9624j61315
11292A938074m41572j54748k2670j8281k47002n0425m6599J59792J57793J82362
11282A456724J20116J4380j60995M641P2313N626j03086j21504Q7999l5008R7522
11271A438728K69514P9832K76615J71969k6164Q6626K6996J0686m0332k04330
11261B090140k57300j44086j51045j73900p4025M7002O3172J03861J05177j550
11251A607446l7375n5881J47452m1844l1519r7046q8359P5634j1278P3055P0087
$$ plain form
11240 1610372 1669453 1898166 2016220 2216654 2332322 2518213 2489276 2516074 2504121 2313188
11230 2313188 2093377 1794740 1505597 1161554 914721 919952 822663 508862 544900 514181
11220 514181 534426 514567 400012 298627 241423 211842 383951 299065 285611 356143 462077
11209 462077 474494 397466 493265 479150 310956 344330 473819 572287 568956 471810 503984
11198 503984 472514 368574 392214 417917 304086 220974 320439 253947 205851 309248 493136
11187 493136 662493 656073 459434 471011 481190 452121 424928 487199 582214 583684 466012
11176 466012 313538 313370 511914 362629 250524 305764 498059 429371 378982 411164 243032
11165 243032 300389 481062 506345 543593 376484 240023 170389 251998 287579 107600 58459
$$ packed form
11240A610372N9081K28713J18054K00434J15668J85891k8937K6798j1953j90933
11230B313188k19811k98637k89143l44043k46833N231r7289l13801L6038l0719
11220E14181K0245j9859j14555j01385n7204k9581J72109q4886j3454P0532J05934
11209D62077J2417p7028R5799j4115j68194L3374J29489R8468l331r7146L2174
11198E03984l1470j03940K3640K5703j13831q3112R9465o6492m8096J03397J83888
11187D93136J69357o420j96639J1577J0179k9069k7193O2271R5015J470j17672
11176D66012j52474j68J98544j49285j12105N5240J92295o8688n0389L2182j68132
11165B43032N7357J80673K5283L7248j67109j36461o9634Q1609L5581j79979m9141
$$ plain form
11154 58459 179591 351844 516551 455292 422107 342088 345038 303992 336174 272184 277641
11143 277641 358466 379377 343929 255696 214441 265654 270762 182524 241296 435797 367023
11132 367023 409961 174879 218520 378420 446752 572472 572025 549177 682451 766183 950984
11121 950984 875341 875156 971336 1016751 1030617 989675 1027345 1106515 1147042 948528 869917 799004
11109 799004 735062 785878 738786 665144 645343 775856 777327 834708 931537 1036519 966091
11098 966091 992214 961601 861940 762636 819974 890735 905949 968506 1079715 1056031 936644
11087 936644 1028403 1022895 936598 898156 961892 1022079 1101325 1081367 995949 1022173 1023958 914343
11075 914343 896657 817265 829089 961702 1045196 1047200 1143228 1295587 1288905 1100711 1155505
$$ packed form
11154E8459J21132J72253J64707o1259l3185q0019K950m1046L2182o3990N457
11143B77641Q0825K0911l5448q8233m1255N1213N108q8238N8772J94501o8774
11132C67023M2938k35082M3641J59900O8332J25720m47k2848J33274Q3732J84801
11121I50984p5643j85R6180M5415J3866m0942L7670P9170M0527j98514p8611p0913
11109G99004o3942N0816m7092p3642j9801J30513J471N7381R6829J04982p0428
11098I66091K6123l0613r9661r9304N7338P0761J5214O2557J11209k3684j19387
11087I36644R1759n508q6297l8442O3736O0187P9246j9958q5418K6224J785j09615
11075I14343j7686p9392J1824J32613Q3494K004R6028J52359o682j88194N4794
$$ plain form
11064 1155505 1127968 1058182 1024343 941125 922385 926962 999489 1055743 1003129 1064035 1276299
11053 1276299 1316732 1408930 1466140 1429799 1228841 1029187 959227 878092 862992 915145 1043080
11042 1043080 1179111 1158806 1070908 959908 897940 967054 928600 866658 838518 894620 885008
11031 885008 899509 917117 1008544 923158 820448 948055 904743 867479 971949 979042 867812
11020 867812 850236 814011 756598 874533 1017162 1220061 1351762 1452061 1356294 1262051
11010 1262051 1464679 1587055 1709224 1890110 2274230 2514880 2583365 2659180 2666396 2601118
11000 2601118 2402968 2241301 2119404 2097910 1899312 1678485 1649266 1537553 1575078 1482284
10990 1482284 1470835 1606469 1631953 1783250 1800299 1677777 1371898 1246928 1140027 1201671
$$ packed form
11064A155505k7537o9786l3839q3218j8740M577P2527N6254n2614O0906K12264
11053A276299M0433R2198N7210l6341k00958j99654o9960q1135j5100N2153J27935
11042A043080J36031k0305q7898j11000o1968O9114l8454o1942k8140N6102r612
11031H85008J4501J7608R1427q5386j02710J27607m3312l7264J04470P093j11230
11020H67812j7576l6225n7413J17935J42629K02899J31701J00299r5767r4243
11010A262051K02628J22376J22169J80886L84120K40650O8485P5815P216o5278
11000B601118j98150j61667j21897k1494j98598k20827k9219j11713L7525r2794
10990A482284j1449J35634K5484J51297J7049j22522l05879j24970j06901O1644
$$ plain form
10980 1201671 1241641 1099794 1148387 1223352 1216779 1220107 1218452 1145227 1086825 984489 1003394
10969 1003394 1243740 1199148 1017575 1053466 1211947 1290765 1349673 1426357 1497990 1635480
10959 1635480 1658412 1618079 1623773 1758463 1771289 1776471 1947078 2013858 2006789 1926165 2090257
10948 2090257 2169379 2029197 1935261 2026894 1942695 1978325 1987588 1901578 1842484 1847041 1906335
10937 1906335 1906891 2030158 2097552 2190339 2368963 2342353 2251926 2240065 2317999 2613468 2745186
10926 2745186 2732502 2852966 2849809 3059333 3258013 3360058 3515786 3645441 3701061 3568272
10916 3568272 3480742 3449915 3461931 3521247 3629512 3653352 3728761 3695918 3791432 4091797 4281756
10905 4281756 4427378 4440413 4466777 4549011 4758186 5151923 5453939 5701801 5875491 6164462
$$ packed form
10980A201671L9970j41847M8593P4965o573L328j655p3225n8402j02336J8905
10969A003394K40346m4592j81573L5891J58481P8818N8908P6684P1633J37490
10959A635480K2932m0333N694J34690J2826N182J70607O6780p069q0624J64092
10948B090257P9122j40182r3936R1633q4199L5630R263q6010n9094M557N9294
10937A906335N56J23267O7394R2787J78624k6610r0427j1861P7934K95469J31718
10926B745186j2684J20464l157K09524J98680J02045J55728J29655N5620j32789
10916C568272q7530l0827J2016N9316J08265K3840P5409l2843R5514L00365J89959
10905D281756J45622J3035K6364Q2234K09175L93737L02016K47862J73690K88971
$$ plain form
10895 6164462 6519271 6706106 7058541 7547885 8109822 8500984 8721039 9231383 9842996
10886 9842996 10317821 10912327 11655071 12535239 13713140 15071904 16630554 18604074 20717529
10877 20717529 23137644 26048109 29824529 34540791 40231447 47570729 57359448 70573669
10869 70573669 88810257 114207918 148861489 194578207 250406436 312324675 371178330
10862 371178330 415091527 435334854 433055549 414753080 383808395 342148692 295604665
10855 295604665 251918888 216405972 190937836 176433882 172735400 179064658 193675085
10848 193675085 213318896 234237015 252907898 266266919 272734670 271077141 261231957
10841 261231957 245665844 228217207 211990536 199983611 194653498 198178101 211772248
$$ packed form
10895F164462L54809J86835L52435M89344N61937L91162K20055N10344O11613
10886I842996M74825N94506P42744Q80168J177901J358764J558650J973520K113455
10877B0717529K420115K910465L776420M716262N690656P339282R788719J3214221
10869G0573669J8236588K5397661L4653571M5716718N5828229O1918239N8853655
10862C71178330M3913197K0243327k279305j8302469l0944685m1659703m6544027
10855B95604665m3685777l5512916k5468136j4503954l698482O329258J4610427
10848A93675085J9643811K0918119J8670883J3359021O467751j657529r845184
10841B61231957j5566113j7448637j6226671j2006925n330113L524603J3594147
$$ plain form
10834 211772248 235664606 269082707 309548977 352644401 391435167 418537063 429232099
10827 429232099 422987242 402230337 371462981 335226536 297114141 261987394 234577046
10820 234577046 217665076 211484798 215014599 225860364 240749344 255711662 267205320
10813 267205320 272889958 271417310 262084654 245675138 225289347 204798249 186981184
10806 186981184 173938027 167736755 170115413 182113773 204506432 237391649 279228339
10799 279228339 326827331 373943007 411468320 429705648 424042704 397768480 358787947
10792 358787947 312971819 262970023 213136434 169191785 134314907 108157687 89110412
10785 89110412 75146401 64743816 57107655 51146777 46161949 41939907 38473801 35454664
$$ packed form
10834B11772248K3892358L3418101M0466270M3095424L8790766K7101896J0695036
10827D29232099o244857k0756905l0767356l6236445l8112395l5126747k7410348
10820B34577046j6911970o180278L529801J0845765J4888980J4962318J1493658
10813B67205320N684638j472648r332656j6409516k0385791k0491098j7817065
10806A86981184j3043157o201272K378658J1998360K2392659L2885217M1836690
10799B79228339M7598992M7115676L7525313J8237328n662944k6274224l8980533
10792C58787947m5816128n0001796m9833589m3944649l4876878k6157220j9047275
10785H9110412j3964011j0402585p636161n960878m984828m222042l466106l019137
$$ plain form
10777 35454664 32965639 30839209 28922333 27363947 26087888 24667768 23287143 22220480
10769 22220480 21078995 20087282 19232809 18358698 17501961 16626253 15898488 15259334 14662825
10760 14662825 13947959 13588814 13244599 12809532 12269600 11676683 11470816 11150095 10792200
10751 10792200 10404244 10228313 10123451 9929824 9582579 9319840 9074266 8840606 8602618
10742 8602618 8569989 8694406 8832368 8753329 8594042 8369325 8032042 7769671 7304203 7067728
10732 7067728 6761699 6449751 6203847 5890536 5570508 5411364 5064347 4730937 4677534 4505548
10722 4505548 4371921 4250127 4079214 3810801 3684562 3602817 3537626 3325774 3114342 3049934
10712 3049934 3039343 3009105 2979297 2978215 2937572 2891349 2867032 2545087 2475679 2503295 2365531
$$ packed form
10777C5454664k489025k126430j916876j558386j276059j420120j380625j066663
10769B2220480j141485r91713q54473q74111q56737q75708p27765o39154n96509
10760A4662825p14866l59145l44215m35067n39932n92917k05867l20721l57895
10751A0792200l87956j75931j04862j93627l47245k62739k45574k33660k37988
10742H602618l2629J24417J37962p9039j59287k24717l37283k62371m65468k36475
10732G067728l06029l11948k45904l13311l20028j59144l47017l33410n3403j71986
10722D505548j33627j21794j70913k68413j26239q1745o5191k11852k11432o4408
10712C049934j0591l0238k9808j082m0643m6223k4317l21945o9408K7616j37764
$$ plain form
10701 2365531 2271558 2201831 2216154 2332598 2299916 2182324 2117413 1971268 1800613 1854200
10691 1854200 1833312 1771382 1716343 1889019 1954089 1906221 1625038 1500056 1572379 1691405
10681 1691405 1800213 1623773 1416999 1289381 1298477 1312597 1281478 1189452 1218735 1276955 1269185
10670 1269185 1472090 1596608 1588994 1510857 1582357 1489462 1360641 1299397 1296435 1309994 1330274
10659 1330274 1472314 1632061 1627922 1697590 1899048 1919696 1853460 1753614 1682623 1781808 1606786
10648 1606786 1374904 1256261 1046540 810007 864298 918694 780975 774855 697168 653069
10638 653069 594452 568295 645351 686582 801878 653289 619216 711470 604635 481303 515441
10627 515441 473060 248798 170667 142635 149813 174362 186409 280758 316363 381655 333715
$$ packed form
10701B365531r3973o9727J4323J16444l2682j17592o4911j46145j70655N3587
10691A854200k0888o1930n5039J72676O5070m7868k81183j24982P2323J19026
10681A691405J08808j76440k06774j27618R096J4120l1119r2026K9283N8220p770
10670A269185K02905J24518p614p8137P1500r2895j28821o1244k962J3559K0280
10659A330274J42040J59747m139O9668K01458K0648o6236r9846p0991R9185j75022
10648A606786k31882j18643k09721k36533N4291N4396j37719o120p7687m4099
10638F53069n8617k6157P7056M1231J15296j48589l4073R2254j06835j23332L4138
10627E15441m2381k24262p8131k8032P178K4549J2047R4349L5605O5292m7940
$$ plain form
10616 333715 295547 263599 311520 278829 319770 329718 272341 292149 217587 208590 250944 152944
10604 152944 -25712 -151943 -166199 -266509 -175521 -136326 -204579 -99873 -37435 25788 98776
10593 98776 120955 11167 99170 666 -131291 -219863 -195274 -113170 45207 -48621 -241444
10582 -241444 -223343 -134477 -94372 76404 126251 110680 24405 -76860 -99782 -47810 -46602
10571 -46602 -136825 -150319 -251038 -77094 1893 44434 11863 14091 -118206 -100826 147566
10560 147566 11301 -252088 -258458 -38092 144067 236471 226887 67153 -31868 -11983 28350
10549 28350 -25066 -23789 17288 -109857 -175471 -175986 69610 288250 10729 5469 89292 -37407
10537 -37407 -257140 -451914 -344345 -190139 -98571 -31231 -111420 -154611 -138379 -167007 -133701
$$ packed form
10616C33715l8168l1948M7921l2691M0941R948n7377J9808p4562q997M2354r8000
10604A52944j78656j26231j4256j00310R0988L9195o8253J04706O2438O3223P2988
10593I8776K2179j09788Q8003r8504j31957q8572K4589Q2104J58377r3828j92823
10582b41444J8101Q8866M0105J70776M9847j5571q6275j01265k2922N1972J208
10571d6602r0223j3494j00719J73944P8987M2541l2571K228j32297J7380K48392
10560A47566j36265k63389o370K20366J82159R2404r584j59734r9021J9885M0333
10549B8350n3416J277M1077j27145o5614n15K45596K18640k77521n260Q3823j26699
10537c7407k19733j94774J07569J54206R1568O7340q0189m3191J6232k8628L3306
$$ plain form
10526 -133701 -137384 -104401 -30208 -15680 -58569 -18718 43557 85282 94609 -14061 -105179 -183872
10514 -183872 -129938 -6908 201191 90614 -94200 -86659 33229 168428 178613 34097
10504 34097 -127058 -241392 -155516 -56375 -68898 -15124 -116933 -276285 -172632 75987
10494 75987 25081 -89692 -20069 44959 44445 -75514 -74436 -126433 -234656 -263153 -297166 -398994
10482 -398994 -279125 -206545 -140502 -108124 -168879 -303132 -251187 -285004 -408835 -357395 -176104
10471 -176104 -108903 -156161 -361942 -394643 -342210 -168205 -234733 -256801 -230626 -261291 -388850
10460 -388850 -422215 -394733 -296109 -272321 -131814 -52704 121684 213327 212557 141664 92419
10449 92419 -107047 -136223 -6490 -27974 -85885 -171836 -174033 -153416 -202012 -179505 -86443
$$ packed form
10526a33701l683L2983P4193J4528m2889L9851O2275M1725R327j08670r1118p8693
10514a83872N3934J23030K08099j10577j84814P541J19888J35199J0185j44516
10504C4097j61155j14334Q5876R9141j2523N3774j01809j59352J03653K48619
10494G5987n0906j14773O9623O5028n14j19959J078n1997j08223k8497l4013j01828
10482c98994J19869P2580O6043L2378o0755j34253N1945l3817j23831N1440J81291
10471a76104O7201m7258k05781l2701N2433J74005o6528k2068K6175l0665j27559
10460c88850l3365K7482R8624K3788J40507P9110J74388R1643p70p0893m9245
10449I2419j99466k9176J29733k1484n7911q5951k197K0617m8596K2507R3062
$$ plain form
10438 -86443 -29525 8076 140988 103495 32255 100292 81335 -94502 -118604 14180 207782
10427 207782 310725 471202 596823 634638 766269 912308 1248442 1508384 1588142 1862566
10417 1862566 2044314 2093914 1923555 1565649 1239227 1097012 1137096 977026 841942 946227
10407 946227 913297 770345 760715 865138 1111190 1224120 1278529 1285004 1352586 1329419 1199239
10396 1199239 1037486 1070704 925616 1086025 1141069 1139040 1276796 1378119 1344910 1406466
10386 1406466 1546615 1805165 1927816 1894763 1715598 1696167 1595047 1533024 1389523 1347873
10376 1347873 1317855 1197509 1243263 1409522 1542729 1543105 1814218 1837329 1647799 1572969 1366588
10365 1366588 1184964 1133964 1062551 1096113 1041484 934061 1127968 1404660 1352324 1419585
$$ packed form
10438h6443N6918L7601J32912l7493p1240O8037j8957j75837k4102J32784J93602
10427B07782J02943J60477J25621L7815J31631J46039L36134K59942P9758K74424
10417A862566J81748M9600j70359l57906l26422j42215M0084j60070j35084J04285
10407I46227l2930j42952r630J04423K46052J12930N4409O475O7582k3167j30180
10396A199239j61753L3218j45088J60409N5044k029J37756J01323l3209O1556
10386A406466J40149K58550J22651l3053j79165j9431j01120o2023j43501m1650
10376A347873l0018j20346M5754J66259J33207L76K71113K3111j89530p4830k06381
10365A366588j81624n1000p1413L3562n4629j07423J93907K76692n2336O7261
$$ plain form
10355 1419585 1641236 1949745 2085052 2165249 2131533 1998310 1766473 1526088 1282141 1102016
10345 1102016 809504 656081 502123 416070 364581 159207 -6638 -105952 -181568 -6336
10335 -6336 122634 77909 31271 9622 -109308 -163271 -158963 -79412 59283 2000 -149328
10324 -149328 -255274 -138865 -22198 -44411 -25713 -68630 -240944 -283903 -205923 -149816 -106300
10313 -106300 -232379 -347081 -430231 -314391 -143146 -106940 -27490 -19599 -213327 -276538 -105124
10302 -105124 101693 106880 80360 -50499 31702 130823 101279 -37858 -85536 -27484 -20430
10291 -20430 -65200 -144402 -62619 -15330 67845 -80043 -139916 -16555 29354 -50116 -56107
10280 -56107 -46324 -65682 2431 85568 26888 51154 100770 129197 99499 -90540 -152019 53090
$$ packed form
10355A419585K21651L08509J35307Q0197l3716j33223k31837k40385k43947j80125
10345A102016k92512j53423j53958q6053n1489k05374j65845r9314p5616J75232
10335f336J28970m4725m6638k1649j18930n3963M308P9551J38695n7283j51328
10324a49328j05946J16409J16667k2213J8698m2917j72314m2959P7980N6107M3516
10313a06300j26079j14702q3150J15840J71245L6206P9450P891j93728o3211J71414
10302a05124K06817N187k6520j30859Q2201R9121k9544j39137m7678N8052P054
10291b0430m4770p9202Q1783M7289Q3175j47888n9873J23361M5909p9470n991
10280e6107R783j9358O8113Q3137n8680K4266M9616K8427k9698j90039o1479K05109
$$ plain form
10268 53090 161440 158256 -8241 -17172 -121719 -104477 85137 178583 97124 205018 105401
10257 105401 -55345 -75264 -41833 33961 60774 91293 -28379 -129547 -179723 -68290 60977
10246 60977 91198 74546 -88713 -26126 68127 54621 -19414 67798 -8250 13212 -29434
10235 -29434 -85 -144708 -52270 115507 19192 -98351 -129976 -80581 -152818 -137407 -77478
10224 -77478 -49727 -2715 47911 86243 164217 240416 136659 79422 27340 -140424 -335530
10213 -335530 -186139 -57537 -100877 -38421 -128132 -89542 -37025 -170086 -299505 -368490 -379983
10202 -379983 -264414 -403370 -391645 -257760 -97510 71327 22093 -46716 -74050 -41874
10192 -41874 -151599 -113343 -143963 -267264 -270988 -132563 26289 -15521 -23501 -170569 -330200
$$ packed form
10268E3090J08350l184j66497q931j04547J7242J89614R3446q1459J07894r9617
10257A05401j60746j9919L3431P5794K6813L0519j19672j01168n0176J11433J29267
10246F0977L0221j6652j63259O2587R4253j3506p4035Q7212p6048K1462m2646
10235b9434K9349j44623R2438J67777r6315j17543l1625M9395p2237J5411N9929
10224g7478K7751M7012N0626L8332P7974P6199j03757n7237n2082j67764j95106
10213c35530J49391J28602m3340O2456q9711L8590N2517j33061j29419o8985j1493
10202c79983J15569j38956J1725J33885J60250J68837m9234o8809k7334L2176
10192d1874j09725L8256l0620j23301l724J38425J58852m1810p980j47068j59631
$$ plain form
10181 -330200 -100720 126071 224923 198245 -1837 -106652 59677 51793 -51921 71640
10171 71640 80292 23147 -34619 -187915 -252107 -349139 -248144 -124897 -84559 -114141 -75115
10160 -75115 -201913 -262216 -227566 -83559 -57631 60130 242135 163142 -33215 -48675 -91991
10149 -91991 -26985 -22417 11368 66625 128404 -111749 -156500 -116298 -141210 60007 82034
10138 82034 83285 116527 117589 185304 230252 201897 82232 225377 263286 78797 -417
10127 -417 -107844 2964 129371 229200 144275 150722 118346 45535 81519 39972 -33857 -64055
10115 -64055 -180577 -334696 -328068 -240723 -86009 -16107 168807 268847 208687 192079 140390
10104 140390 41273 64446 -21690 12589 174317 197181 163677 26983 -131598 -71731 -94632
$$ packed form
10181c30200K29480K26791R8852k6678k00082j04815J66329p884j03714J23561
10171G1640Q652n7145n7766j53296o4192r7032J00995J23247M0338k9582L9026
10160g5115j26798o0303L4650J44007K5928J17761J82005p8993j96357j5460m3316
10149i1991O5006M568L3785N5257O1779k40153m4751M0202k4912K01217K2027
10138H2034J251L3242J062O7715M4948k8355j19665J43145L7909j84489p9214
10127d17j07427J10808J26407R9829q4925O447l2376p2811L5984m1547p3829l0198
10115f4055j16522j54119O628Q7345J54714O9902J84914J00040o0160j6608n1689
10104A40390r9117K3173q6136L4279J61728K2864l3504j36694j58581N9867k2901
$$ plain form
10093 -94632 -146407 -109912 -19693 -95679 -111420 -64497 -105569 -7976 8364 90269 109682 260825
10081 260825 129357 -132066 -220111 -42461 -21656 61327 105520 106794 59000 -173873 -194471
10070 -194471 -242151 -274994 -173413 -77067 -70283 22630 -10599 -125135 -36945 115885 172631
10059 172631 238396 88433 -42470 -30851 199053 459589 702722 948025 1368650 1616852
10049 1616852 1776404 1573770 1472152 1449101 1230377 993185 601348 326713 153471 64032
10039 64032 -33762 67060 162593 224077 229509 112358 147291 146408 91393 -37925 -169708
10028 -169708 -173751 -262083 -131331 31444 96074 155297 112635 118594 31734 -66977 -132496
10017 -132496 -176909 -164689 -186113 -171257 -159853 -118627 -162160 -188063 -184328 -241770 -200927 -118929
$$ packed form
10093i4632n1775L6495R0219p5986j5741M6923m1072R7593J6340Q1905J9413J51143
10081B60825j31468k61423q8045J77650K0805Q2983M4193J274m7794k32873k0598
10070a94471m7680l2843J01581R6346O784R2913l3229j14536Q8190J52830N6746
10059A72631O5765j49963j30903J1619K29904K60536K43133K45303M20625K48202
10049A616852J59552k02634j01618k3051k18724k37192l91837k74635j73242q9439
10039F4032r7794J00822R5533O1484N432j17151L4933q83n5015j29318j31783
10028a69708m043q8332J30752J62775O4630N9223m2662N959q6860r8711o5519
10017a32496m4413J2220k1424J4856J1404M1226m3533k5903L735n7442M0843Q1998
$$ plain form
10005 -118929 -103983 -272629 -213066 -180583 -171844 -179169 -216306 -235280 -323308 -352494 -268851 -98663
9993 -98663 -47088 -187637 -321412 -336163 -108872 58453 89194 -116793 -216280 -160485 -136282
9982 -136282 -37914 -6494 -152508 -179746 -41596 -129200 -131479 -124569 -111510 -48037 26888 -119315
9970 -119315 -236288 -180803 -169402 -55886 -1849 -16242 -249046 -234121 -147179 -206079 -110042
9959 -110042 36609 -132095 -152744 -187434 -162580 -125402 -107676 -35086 -61806 -12004 -131046
9948 -131046 -206891 -190663 2999 161151 237997 105975 -108768 -60176 -106492 -173591 -146306
9937 -146306 101355 109749 57873 57603 70849 -119211 -191573 -214491 -263202 -267392 -180467 -7254
9925 -7254 -47776 -19590 104141 144520 -33717 -84504 35344 99468 124465 168942 94158
$$ packed form
10005a18929J4946j68646N9563L2483Q739p325l7137j8974q8028k9186Q3643J70188
9993i8663N1575j40549j33775j4751K27291J67325L0741k05987r9487N5795K4203
9982a36282R8368L1420j46014k7238J38150q7604k279O910J3059O3473P4925j46203
9970a19315j16973N5485J1401J13516N4037j4393k32804J4925Q6942n8900R6037
9959a10042J46651j68704k0649l4690K4854L7178J7726P2590k6720M9802j19042
9948a31046p5845J6228J93662J58152P6846j32022k14743M8592m6316o7099K7285
9937a46306K47661Q394n1876k70J3246j90060p2362k2918m8711m190Q6925J73213
9925g254m0522K8186J23731M0379j78237n0787J19848O4124K4997M4477p4784
$$ plain form
9914 94158 -78466 -227168 -267444 -287314 -202421 -105871 -11252 -39529 23481 20830 -119956
9903 -119956 -161267 26760 -12985 -35036 -159233 -137933 43999 55979 127963 161432 138058
9892 138058 23496 90234 98153 325212 425190 374439 244610 278686 338834 197236 85328
9881 85328 140596 182989 126391 98976 156519 112985 -28260 -27032 -8063 163695 277112
9870 277112 249468 201397 188613 350404 208016 49984 237174 286853 108904 37615 166859
9859 166859 209306 399514 547609 585264 855276 1297814 1955977 2775955 3936939 5407617
9849 5407617 6701210 7371365 7104203 6268955 5512719 4705461 3685207 2464128 1405610
9840 1405610 862101 699924 511373 291141 265351 432031 544008 422300 313961 219219
$$ packed form
9914I4158j72624j48702m0276j9870Q4893R6550R4619k8277O3010k651j40786
9903a19956m1311J88027l9745k2051j24197K1300J81932J1980P1984L3469k3374
9892A38058j14562O6738P919K27059R9978n0751j29829L4076O0148j41598j11908
9881H5328N5268M2393n6598k7415N7543m3534j41245J228J8969J71758J13417
9870B77112k7644m8071j2784J61791j42388j58032J87190M9679j77949p1289J29244
9859A66859M2447J90208J48095L7655K70012M42538O58163Q19978J160984J470678
9849E407617J293593O70155k67162q35248p56236q07258j020254j221079j058518
9840A405610n43509j62177j88551k20232k5790J66680J11977j21708j08339r4742
$$ plain form
9830 219219 297632 358347 447329 427861 296403 40831 -67205 -16743 14269 -21309 109958
9819 109958 172284 76837 70588 -6475 -39498 31714 120702 134844 -50151 -97797 -76025 -114100
9807 -114100 83356 269364 362502 327140 202539 126917 226881 337884 350589 256089 37105
9796 37105 196673 374298 687642 1057720 1007524 732013 726374 702673 446032 158819 -50696
9785 -50696 -47168 -92694 -136476 -266202 -250877 -148165 -173114 -154627 3421 -72745 -158831
9774 -158831 27622 22830 78484 -71095 -90163 -138952 -166910 -54382 -90867 -111330 -188953
9763 -188953 -309946 -318201 -208628 -102046 84503 22137 -155273 -207444 -202325 -119384 -43276
9752 -43276 -59443 -137808 -203380 -239067 -233120 -218641 -144881 -7581 44587 -33097 27111 -103829
$$ packed form
9830B19219P8413O0715Q8982j9468j31458k55572j08036N0462L1012l5578J31267
9819A09958O2326r5447o249p7063l3023P1212Q8988J4142j84995m7646K1772l8075
9807a14100J97456J86008R3138l5362j24601p5622R9964J11003J2705r4500k18984
9796C7105J59568J77625L13344L70078n0196k75511n639k3701k56641k87213k09515
9785e0696L528m5526m3782j29726J5325J02712k4949J8487J58048p6166q6086
9774a58831J86453m792N5654j49579j9068m8789k7958J12528l6485k0463p7623
9763a88953j20993q255J09573J06582J86549o2366j77410n2171N119Q2941P6108
9752d3276j6167p8365o5572l5687N947J4479P3760J37300N2168p7684O0208j30940
$$ plain form
9740 -103829 -264914 -215322 -201709 -144343 -156222 -76793 -57894 -52638 24004 127380 -131668
9729 -131668 -165409 -159229 -265016 -150076 -128761 26795 30447 47270 19028 -4082 30456
9718 30456 119155 100053 141939 18505 6888 8480 146837 187021 92175 31064 -72333
9707 -72333 -204030 -7461 -18933 -51026 -80167 118936 284869 120995 24878 -10715 -88649
9696 -88649 55131 230420 386273 413548 377223 220310 82648 82706 143007 67424 -81621
9685 -81621 -218182 -263421 -141332 -10214 -159204 -261778 -290422 -212514 -123408 -140517 -89550
9674 -89550 -112995 42355 111367 37921 78625 200698 174090 171706 108896 9936 -27757 -26310
9662 -26310 -141179 -149932 -121897 -201876 -93294 41782 -34363 -244062 -207860 -222787 -158091
$$ packed form
9740a03829j61085M9592J3613N7366j1879P9429J8899N256P6642J03376k59048
9729a31668l3741O180j05787J14940K1315J55556L652J6823k8242k3110L4538
9718C0456Q8699j9102M1886j23434j1617J592J38357M0184r4846o1111j03397
9707g2333j31697J96569j1472l2093k9141J99103J65933j63874r6117l5593p7934
9696h8649J43780J75289J55853K7275l6325j56913j37662N8O0301p5583j49045
9685h1621j36561m5239J22089J31118j48990j02574k8644P7908Q9106j7109N0967
9674h9550k3445J55350O9012p3446M0704J22073k6608k384o2810r8960l7693J447
9662b6310j14869q753K8035p9979J08582J35076p6145k09699L6202j4927O4696
$$ plain form
9651 -158091 -188918 -225943 -229964 -241718 -246588 -172987 -102320 -50709 64662 -3562 -37822 2317
9639 2317 5616 -2497 -70864 -112256 -108254 -139417 -131103 -5 -44646 -174057 -273444 -220511
9627 -220511 -21190 49582 52196 86113 100179 -43902 -62011 -6516 -68157 -55168 103698
9616 103698 143101 43305 94434 53375 9941 97393 63020 146448 193333 59502 -31624
9605 -31624 -2802 -180308 -307341 -310105 -129197 352 -48940 -19181 157142 68395 -38872
9594 -38872 -197043 -232781 -212371 -81753 -156842 -170733 -80132 4479 -149732 -8728 62598
9583 62598 124570 238920 293916 162175 -11924 -173732 -10901 152359 -57178 -147289
9573 -147289 -108868 -8641 8885 -58014 -262218 -97661 87366 -64986 -207349 -88037
$$ packed form
9651a58091l0827l7025m021j1754m870P3601P0667N1611J15371o8224l4260M0139
9639B317L299q113o8367m1392M002l1163Q314J31098m4641j29411r9387N2933
9627b20511J99321P0772K614L3917J4066j44081j8109N5495o1641J2989J58866
9616A03698L9403r9796N1129m1059m3434Q7452l4373Q3428M6885j33831r1126
9605c1624K8822j77506j27033k764J80908J29549m9292K9759J76323q8747j07267
9594c8872j58171l5738K0410J30618p5089j3891R0601Q4611j54211J41004P1326
9583F2598O1972J14350N4996j31741j74099j61808J62831J63260k09537r0111
9573a47289L8421J00227J7526o6899k04204J64557J85027j52352j42363J19312
$$ plain form
9563 -88037 34611 14146 3234 62857 217324 257959 127069 96859 87595 -158735 -180571
9552 -180571 -31143 -80586 -125269 -67547 86430 224925 182371 56116 -75626 -43886 -87231
9541 -87231 -199393 -284020 -116412 -81342 -175411 -249313 -339748 -272472 -137690 108683 263970
9530 263970 291536 196493 156724 138637 172737 302414 330480 162652 2398 48089 -147750
9519 -147750 -113072 -2633 -87156 -246271 -88589 -188026 -307459 -420971 -458303 -291487
9509 -291487 -229834 -208911 -3591 157069 180301 -47204 -129777 103376 155545 104243 -32646
9498 -32646 -138870 -93241 -18697 14939 135440 65382 -10313 22760 34343 -47196 -82517
9487 -82517 -145250 -136866 -14265 -12377 -49498 70330 258670 327691 224458 -19692 -66714
$$ packed form
9563h8037J22648k0465j0912N9623J54467M0635j30890l0210r264k46330k1836
9552a80571J49428m9443m4683N7722J53977J38495m2554j26255j31742L1740m3345
9541h7231j12162q4627J67608L5070r4069p3902r0435O7276J34782K46373J55287
9530B63970K7566r5043l9769j8087L4100J29677K8066j67828j60254M5691j95839
9519a47750L4678J10439q4523j59115J57682r9437j19433j13512l7332J66816
9509b91487O1653K0923K05320J60660K3232k27505q2573K33153N2169n1302j36889
9498c2646j06224M5629P4544L3636J20501p0058p5695L3073J1583q1539l5321
9487h2517o2733Q384J22601J888l7121J19828J88340O9021j03233k44150m7022
$$ plain form
9476 -66714 -106445 -101098 -70911 -108142 -190642 -188419 -38704 1060 53654 19293 -25277 -63092
9464 -63092 -105734 -105607 -83451 -216722 -295467 -273634 -157623 -37016 42200 22486 -98656
9453 -98656 -182118 -103378 -192991 -174345 -210869 -190705 -338130 -343587 -89861 83431 134032
9442 134032 280862 147630 125727 82469 -132316 -109461 -162333 -248314 -175185 -112744 -260966
9431 -260966 -237443 -161329 -101068 -95541 -124187 -111541 -236952 -166826 68866 145448 62000
9420 62000 39439 -83022 -162778 -233504 -219172 139879 148004 -57235 -113848 33694 69485
9409 69485 124999 202512 206100 114840 50287 126359 206911 134363 -73411 -225418 -189014 15056
9397 15056 251523 271672 280022 319350 129514 126863 -150472 -280535 -155879 -195622 -309095
$$ packed form
9476f6714l9731N347L0187l7231q2500K223J49715L9764N2594l4361m4570l7815
9464f3092m2642J27K2156j33271p8745K1833J16011J20607P9216j9714j21142
9453i8656q3462P8740q9613J8646l6524K0164j47425n457K53726J73292N0601
9442A34032J46830j33232k1903m3258k14785K2855n2872q5981P3129O2441j48222
9431b60966K3523P6114O0261N527k8646J2646j25411P0126K35692P6582q3448
9420F2000k2561j22461p9756p0726J4332L59051Q125k05239n6613J47542L5791
9409F9485N5514P7513L588r1260o4553P6072Q0552p2548k07774j52007L6404K04070
9397A5056K36467K0149Q350L9328j89836k651k77335j30063J24656l9743j13473
$$ plain form
9386 -309095 -153599 138187 103692 45597 -18018 169547 211379 -99395 -135645 -60904 -139638
9375 -139638 -96620 -51245 -20053 -47314 41281 41624 -48505 26454 -109326 -254632 -213542 -8266
9363 -8266 -9447 -79966 -51879 48921 101396 -79920 -162906 -63013 17137 243729 176945 -31202
9351 -31202 -3169 220191 365273 338561 274054 244577 218367 65665 103341 66877 161798
9340 161798 201643 163948 76596 11962 -50058 25219 38665 71177 111632 231436 241786
9329 241786 183593 -10141 -14341 -63170 -64583 -128316 -267867 -145038 -3044 35545 82053
9318 82053 18131 -43332 -29749 12863 -70044 -97458 -92559 -109293 -297791 -330244 -240200 -141497
9306 -141497 -96612 -28384 -85340 -173102 -235111 -132403 147306 141171 85140 -50520 -268604
$$ packed form
9386c09095J55496K91786l4495n8095o3615J87565M1832l10774l6250P4741p8734
9375a39638M3018M5375L1192k7261Q8595L43r0129P4959j35780j45306M1090K05276
9363h266j181p0519K8087J00800N2475j81316q2986R9893Q0150K26592o6784k08147
9351c1202K8033K23360J45082k6712o4507k9477k6210j52702L7676l6464R4921
9340A61798L9845l7695q7352o4634o2020P5277J3446L2512M0455J19804J0350
9329B41786n8193j93734m200m8829j413o3733j39551J22829J41994L8589M6508
9318H2053o3922o1463J3583M2612q2907k7414M899j6734j88498l2453R0044R8703
9306a41497M4885O8228n6956q7762o2009J02708K79709o135n6031j35660k18084
$$ plain form
9295 -268604 -260869 -103230 60400 188282 205651 -48966 -121358 36592 149722 108116 86478
9284 86478 78414 -20055 -150331 13924 20782 44502 237035 78246 -39861 5771 143181
9273 143181 83827 113253 219924 250349 314210 278733 164804 142425 119752 6748 -24533
9262 -24533 -128529 -196930 -23628 47023 -21368 -61673 -90771 -100047 20727 -20638 -62223
9251 -62223 75547 66943 186593 189958 199381 269467 147005 115925 54013 -43496 -48540 21834
9239 21834 122306 13196 17925 100702 240299 211070 23851 21441 172176 73854 65397
9228 65397 -60637 -104141 88886 41654 131308 173188 -82786 -87483 18251 -9675 -64712
9217 -64712 -6490 -68103 -128568 -114204 -9217 121538 63472 -79280 -216204 -123751 20879
$$ packed form
9295b68604P735J57639J63630J27882J7369k54617p2392J57950J13130m1606k1638
9284H6478q064r8469j30276J64255O858K3720J92533j58789j18107M5632J37410
9273A43181n9354K9426J06671L0425O3861l5477j13929k2379k2673j13004l1281
9262b4533j03996o8401J73302P0651o8391m0305k9098r276J20774m1365m1585
9251f2223J37770q604J19650L365R423P0086j22462l1080o1912r7509n044P0374
9239B1834J00472j09110M729Q2777J39597k9229j87219k410J50735r8322q457
9228F5397j26034m3504J93027m7232Q9654M1880k55974m697J05734k7926n5037
9217f4712N8222o1613o0465J4364J04987J30755n8066j42752j36924R2453J44630
$$ plain form
9206 20879 231087 294499 198772 21037 107284 390298 389953 294710 247734 413560 291846
9195 291846 188766 377451 351502 353880 286599 192694 258340 316883 229004 242147 217799
9184 217799 141473 307026 377402 377374 449895 568898 625772 694063 647403 451166 359290 377230
9172 377230 534913 589335 647829 497635 449253 487282 315048 347202 505140 395954 372582
9161 372582 317988 274745 359912 401064 313067 358191 621803 691096 726005 446350 237972
9150 237972 450704 669705 698440 786127 874786 893038 1019541 1154258 1250449 1420652 1654456
9139 1654456 1736070 1830444 1867001 2084330 2421758 2826947 3074698 3569469 4175231 4815467
9129 4815467 5567047 6536061 7785607 9556892 12023009 15733750 21228968 29497393 41343147
$$ packed form
9206B0879K10208O3412r5727j77735Q6247K83014l45r5243m6976J65826j21714
9195B91846j03080J88685k5949K378o7281r3905O5646N8543q7879J3143k4348
9184B17799p6326J65553P0376k8P2521J19003N6874O8291m6660j96237r1876J7940
9172C77230J57683N4422N8494j50194m8382L8029j72234L2154J57938j09186k3372
9161C72582n4594m3243Q5167M1152q7997M5124K63612O9293L4909k79655k08378
9150B37972K12732K19001K8735Q7687Q8659J8252J26503J34717R6191J70203K33804
9139A654456Q1614R4374L6557K17329L37428M05189K47751M94771O05762O40236
9129D815467P51580R69014J249546J771285K466117L710741N495218Q268425J1845754
$$ plain form
9120 41343147 56631561 73710609 88287491 94882997 91689614 83576541 74528549 63783013
9112 63783013 50230914 36875092 26851149 20056595 15443036 12394459 10293603 8711259
9104 8711259 7474250 6556104 5845430 5201484 4780173 4399365 3967627 3483688 3191589
9095 3191589 2939034 2723010 2556745 2437723 2277992 2263462 2321860 2247631 2214302 1985214
9085 1985214 1792393 1830202 1705577 1563466 1577169 1467691 1289480 1276615 1233534 1076674
9075 1076674 1059409 1255966 1318786 1273473 989110 825464 796291 833931 867528 999488 949624
9064 949624 851622 825626 858176 900966 966129 1076509 1315907 1299181 899957 620364 564314
9053 564314 540348 435166 416029 478039 510315 603705 634279 618551 391154 259702 180111
$$ packed form
9120D1343147J5288414J7079048J4576882O595506l193383q113073r047992j0745536
9112F3783013j3552099j3355822j0023943o794554m613559l048577k100856j582344
9104H711259j237009r18146p10674o43946m21311l80808m31738m83939k92099
9095C191589k52555k16024j66265j19022j59731j4530N8398p4229l3329k29088
9085A985214j92821L7809j24625j42111J3703j09478j78211j2865m3081j56860
9075A076674j7265J96557O2820m5313k84363j63646k9173L7640L3597J31960m9864
9064I49624r8002k5996L2550M2790O5163J10380K39398j6726l99224k79593n6050
9053E64314k3966j05182j9137O2010L2276R3390L0574j5728k27397j31452p9591
$$ plain form
9042 180111 131608 79805 250098 223883 169202 196600 74742 -6224 30994 122316 116523
9031 116523 236211 180094 345231 418871 413380 427700 412669 401251 380669 207282 4197
9020 4197 -174982 -170886 -60252 72421 269142 211448 31665 -7694 45852 75073 -46442
9009 -46442 63524 141111 228850 76993 -69183 -150039 -64550 181779 350808 187000 89969
8998 89969 77038 363228 404850 312779 217261 98441 -35587 69750 174268 293434 228223
8987 228223 153052 -33102 -14753 101630 207842 422057 350005 336934 230022 104786
8977 104786 -9475 -8113 22962 91160 122474 120501 263791 289409 187454 120566 231153
8966 231153 271063 94945 -149926 -213033 -116513 32035 220330 212449 160758 105006 77204
$$ packed form
9042A80111m8503n1803J70293k6215n4681K7398j21858q0966L7218R1322n793
9031A16523J19688n6117J65137P3640n491J4320j5031j1418k0582j73387k03085
9020D197j79179M096J10634J32673J96721n7694j79783l9359N3546K9221j21515
9009d6442J09966P7587Q7739j51857j46176q0856Q5489K46329J69029j63808r7031
8998H9969j2931K86190M1622r2071r5518j18820j34028J05337J04518J19166o5211
8987B28223p5171j86154J8349J16383J06212K14215p2052j3071j06912j25236
8977A04786j14261J362L1075O8198L1314j973J43290K5618j01955o6888J10587
8966B31153L9910j76118k44871o3107R6520J48548J88295p881n1691n5752k7802
$$ plain form
8955 77204 72570 67356 5878 -15353 100934 130780 203765 277438 345091 232689 174304 106023
8943 106023 -41773 -97801 -130066 -139947 -76701 -8568 -167499 -107171 -22866 -97946 -52363
8932 -52363 -94961 -176532 -196254 -180779 -149760 -94354 -84779 -47755 -221912 -191333 -148993 -147813
8920 -147813 -97758 26520 143969 66785 -165626 -105259 26634 15911 -49813 -32703 -47939
8909 -47939 -176113 -287731 -258736 -212875 -15790 145277 -39732 -181314 -166486 73403
8899 73403 4216 -185496 -293265 -425737 -391744 -286065 -115932 -76477 -162057 -205485 -218940
8888 -218940 -38837 94261 189167 153800 38654 -65478 -209365 -230560 -93158 -46232
8878 -46232 -6385 -34104 -109751 -185019 -102565 -16647 102296 99987 -43479 -25939 -105043 -98555
$$ packed form
8955G7204m634n214o1478k1231J16287K9846P2985P3673O7653j12402n8385o8281
8943A06023j47796n6028l2265r881O3246O8133j58931O0328Q4305p5080M5583
8932e2363m2598q1571j9722J5475L1019N5406R575L7024j74157L0579M2340J180
8920a47813N0055J24278J17449p7184k32411O0367J31893j0723o5724J7110j5236
8909d7939j28174j11618K8995M5861J97085J61067j85009j41582J4828K39889
8899G3403o9187j89712j07769j32472L3993J05679J70133L9455q5580m3428j3455
8888b18940J80103J33098R4906l5367j15146j04132j43887k1195J37402M6926
8878d6232L9847k7719p5647p5268Q2454Q5918J18943k309j43466J7540p9104O488
$$ plain form
8866 -98555 -156805 -81618 -11963 -129571 55093 -7342 -220339 -207574 -274515 -162417 3819
8855 3819 70892 102339 128278 83446 6801 -21907 -78135 51604 173931 244078 269951 265553
8843 265553 300243 181513 110083 51421 -5328 -90592 -110404 -105752 10146 143507 75613
8832 75613 87644 -25158 -50033 -61020 -41935 4919 -10352 70942 -142329 -221949 -245182
8821 -245182 -126657 49448 200326 198729 144181 96396 -23652 -124920 -122209 -65108 33787
8810 33787 255628 140214 27664 28289 128558 67078 -5690 -88549 -163716 -249916 -280848
8799 -280848 -98289 -20644 -88584 57499 88948 -121703 -133669 -231743 -422464 -478179 -378612
8788 -378612 -352309 -312462 -295789 -253958 -290762 -147156 -78201 3223 869 73823 -9559 54731
$$ packed form
8866i8555n8250P5187O9655j17608J84664o2435k12997J2765o6941J12098J66236
8855C819O7073L1447K5939m4832p6645k8708n6228J29739J22327P0147K5873m398
8843B65553L4690j18730p1430n8662n6749q5264j9812M652J15898J33361o7894
8832G5613J2031j12802k4875j0987J9085M6854j5271Q1294k13271p9620k3233
8821b45182J18525J76105J50878j597n4548m7785j20048j01268K711N7101R8895
8810C3787K21841j15414j12550O25J00269o1480p2768q2859p5167q6200l0932
8799b80848J82559P7645o7940J46083L1449k10651j1966r8074j90721n5715R9567
8788c78612K6303L9847J6673M1831l6804J43606O8955Q1424k354P2954q3382O4290
$$ plain form
8776 54731 131088 57777 167420 156857 91101 -15008 50820 147619 76967 -23999 -61870
8765 -61870 -127349 -193628 -326369 -296698 -138440 -169218 -198656 -96764 -76249 -67872 -168334
8754 -168334 -179451 -182411 -209174 -187019 -134479 -148083 -127600 -195264 -82392 -175805 -240129 -100545
8742 -100545 -17201 -112323 -221299 -140784 -148537 -245112 -302858 -212584 -241577 -243714 -117286 -108638
8730 -108638 -134036 -121546 -72305 -63596 -94891 -123476 -125005 -89424 -25254 -60405 -99525 -97532
8718 -97532 -139009 -136141 -109195 -98692 -21075 62018 -18455 -66279 92291 95822 -39646 19025
8706 19025 68818 24517 -102379 -96162 346 40906 73638 104725 25148 -40689 -53989 11628
8694 11628 142283 99917 -49337 -41802 -93526 -155020 -146464 -2482 83820 164879 34850
$$ packed form
8776E4731P6357p3311J09643j0563o5756j06109O5828R6799p0652j00966l7871
8765f1870o5479o6279j32741K9671J58258l0778k9438J01892K0515Q377j00462
8754a68334j1117k960k6763K2155N2540j3604K0483o7664J12872r3413o4324J39584
8742a00545Q3344r5122j08976Q0515p753r6575n7746R0274k8993k137J26428Q648
8730a08638k5398J2490M9241Q709l1295k8585j529L5581O4170l5151l9120J993
8718i7532m1477K868K6946J0503P7617Q3093q0473m7824J58570L531j35468N8671
8706A9025M9793m4301j26896O217R6508M0560L2732L1087p9577o5837j3300O5617
8694A1628J30655m2366j49254P535n1724o1494Q556J43982Q6302Q1059j30029
$$ plain form
8683 34850 53844 28907 12031 43848 -85993 -153949 -104826 -43803 -139892 -112929 -213669
8672 -213669 -249769 2716 117379 53351 86852 241688 182355 12106 -83401 31075 81362
8661 81362 49000 89315 71398 126272 168486 171333 124224 59301 73494 253320 499424 724611
8649 724611 1149575 1477535 1782379 1878511 1795911 1542101 1277896 864485 669798 578160
8639 578160 394858 299856 279274 215686 217647 189524 277300 260891 272424 359607 282550 217817
8627 217817 191832 234116 596637 1022754 1378141 1636236 1643853 1305538 1111647 1148796 1044455
8616 1044455 789178 621408 638144 610570 459867 454095 392907 376138 522068 791724 1171396
8605 1171396 1793441 2514489 3304999 3937508 4283046 4146358 3754877 3354721 2958226 2514216
$$ packed form
8683C4850J8994k4937j6876L1817j29841o7956M9123O1023r6089K6963j00740
8672b13669l6100K52485J14663o4028L3501J54836n9333j70249r5507J14476N0287
8661H1362l2362M0315j7917N4874M2214K847m7109o4923J4193J79826K46104K25187
8649G24611M24964L27960L04844R6132q2600k53810k64205m13411j94687r1638
8639E78160j83302r5002k0582o3588J961k8123Q7776j6409J1533Q7183p7057o4733
8627B17817k5985M2284L62521M26117L55387K58095P617l38315j93891L7149j04341
8616A044455k55277j67770J6736k7574j50703n772o1188j6769J45930K69656L79672
8605A171396O22045P21048P90510O32509L45538j36688l91481m00156l96495m44010
$$ plain form
8595 2514216 1704053 1174722 866301 775770 700823 587401 530353 468490 471586 485174 630258
8584 630258 821565 890514 1103152 1341344 1751315 2133718 2635425 3113903 3181838 3239942
8574 3239942 3102475 2801091 2532933 2082502 1581701 1332184 1016852 858652 780460 615288
8564 615288 467940 491146 499050 652875 807729 1052570 1485697 1914356 2114709 2075241
8554 2075241 1943846 1683726 1412472 1117681 819189 495109 399874 397500 400373 243290
8544 243290 304423 177500 193728 417189 645104 604248 730482 889723 1097130 1386390
8534 1386390 1459345 1433116 1448787 1225099 1170698 1021520 1115726 909996 534929 258150
8524 258150 86109 101575 142307 249793 261710 102166 59828 140420 85723 124448 183454
$$ packed form
8595B514216q10163n29331l08421r0531p4947j13422n7048o1863L096J3588J45084
8584F30258J91307O8949K12638K38192M09971L82403N01707M78478O7935N8104
8574C239942j37467l01384k68158m50431n00801k49517l15332j58200p8192j65172
8564F15288j47348K3206P904J53825J54854K44841M33127M28659K00353l9468
8554B075241j31395k60120k71254k94791k98492l24080r5235k374K873j57083
8544B43290O1133j26923J6228K23461K27915m0856J26234J59241K07407K89260
8534A386390P2955k6229J5671k23688n4401j49178R4206k05730l75067k76779
8524B58150j72041J5466M0732J07486J1917j59544m2338Q0592n4697L8725N9006
$$ plain form
8513 183454 177475 316380 235202 38813 -43120 63130 194190 178820 220011 177768 116140
8502 116140 44037 88596 -22348 -240450 -167921 -6446 105672 -18550 -181079 -95960
8492 -95960 -147061 -221342 -313473 -348287 -196328 -10896 67162 -51854 -90535 -51934 38975
8481 38975 134745 18422 4602 -30307 -196450 -294084 -193914 -202961 -290524 -121814 -10899
8470 -10899 174332 165027 44997 167244 219426 102480 77440 57562 3031 -67483 -11867
8459 -11867 80264 -81946 -233944 -242572 -159033 49939 50188 -59573 25364 -31594 -112459 -42656
8447 -42656 149257 203210 128243 68484 179217 195824 144756 147371 152599 67546 -120148 -188470
8435 -188470 -22128 62932 -129066 -224226 -166313 -177288 -170318 -185345 -137645 -187587 -179177 -141033
$$ packed form
8513A83454n979J38905q1178j96389q1933J06250J31060j5370M1191m2243o1628
8502A16140p2103M4559j10944k18102P2529J61475J12118j24222j62529Q5119
8492i5960n1101p4281r2131l4814J51959J85432P8058j19016l8681L8601R0909
8481C8975R5770j16323j3820l4909j66143r7634J00170r047q7563J68710J10915
8470a0899J85231r305j20030J22247N2182j16946k5040j9878n4531p0514N5616
8459a1867R2131j62210j51998q628Q3539K08972K49j09761Q4937n6958q0865O9803
8447d2656J91913N3953p4967n9759J10733J6607n1068K615N228q5053j87694o8322
8435a88470J66342Q5060j91998r5160N7913j0975O970j5027M7700m9942Q410L8144
$$ plain form
8423 -141033 -82962 -232558 -181701 -89868 27668 50129 -108447 -97209 -31457 -30583 63282
8412 63282 88340 106020 16740 106387 121934 363011 321886 112418 -61162 -56882 17186
8401 17186 -143239 -25404 130347 -97623 -154535 -37905 82477 59500 10476 77878 113370
8390 113370 -2705 -77463 -108939 -242607 -230261 -31864 162726 222240 113893 39012 -39
8379 -39 -40079 51999 -28205 -45723 103009 125901 -35816 -63774 -135219 17954 207812 244535
8367 244535 38712 125225 -98263 -296847 -159532 41817 96541 18948 -116225 80557
8357 80557 207549 186806 52485 32045 144343 211331 135798 166163 63418 -30035 -167987
8346 -167987 -191069 -138588 41064 34043 -111522 -138030 -160510 -191066 -184021 -83562 27119
$$ packed form
8423a41033N8071j49596N0857R1833J17536K2461j58576J1238O5752Q74R3865
8412F3282K5058J7680q9280Q9647J5547K41077m1125k09468j73580M280P4068
8401A7186j60425J17835J55751k27970n6912J16630J20382k2977m9024O7402L5492
8390A13370j16075p4758l1476j33668J2346J98397J94590N9514j08347p4881l9051
8379c9m0040R2078q0204j7518J48732K2892j61717k7958p1445J53173J89858L6723
8367B44535k05823Q6513k23488j98584J37315K01349N4724p7593j35173J96782
8357H0557J26992k0743j34321k0440J12298O6988p5533L0365j02745r3453j37952
8346a67987k3082N2481J79652p021j45565k6508k2480l0556P045J00459J10681
$$ plain form
8335 27119 -153812 -470107 -554557 -441198 -324624 -187317 52563 41731 9276 -141831
8325 -141831 -366496 -476482 -476894 -230258 -43720 137878 199267 3867 -19495 -32727 107427
8314 107427 270335 311438 114786 -44698 -9817 -144406 -142808 -18863 208468 271111 104791
8303 104791 3584 20716 -110679 -104910 -32455 -196154 -150287 -26383 -159978 -439094 -296554
8292 -296554 -73980 -92802 -142388 -196518 -335716 -360334 -244809 -146383 -133132 -85560 3892
8281 3892 -44383 9793 116387 199854 197033 375102 561296 412760 135778 105843 35991
8270 35991 -145441 -297693 -116993 -94417 -47780 -17241 -103804 103261 93022 276405 176426
8259 176426 -13275 -7456 -106294 -124534 117306 290298 393926 324783 385589 308779 191542
$$ packed form
8335B7119j80931l16295q4450J13359J16574J37307K39880j0832l2455j51107
8325a41831k24665j09986m12K46636J86538J81598O1389j95400k3362j3232J40154
8314A07427J62908M1103j96652j59484L4881j34589J598J23945K27331O2643j66320
8303A04791j01207J7132j31395N769P2455j63699M5867J23904j33595k79116J42540
8292b96554K22574j8822m9586n4130j39198k4618J15525R8426J3251M7572Q9452
8281C892m8275N4176J06594Q3467k821J78069J86194j48536k76982k9935o9852
8270C5991j81432j52252J80700K2576M6637L0539q6563K07065j0239J83383r9979
8259A76426j89701N819r8838j8240K41840J72992J03628o9143O0806p6810j17237
$$ plain form
8248 191542 294523 325225 311756 224957 167831 52543 117322 135767 110272 206427 251492
8237 251492 226118 124536 -27790 -168739 -295357 -57036 6070 24268 -20143 35850 142960
8226 142960 166536 221571 213660 125143 54367 -152952 -205065 -286272 -427331 -353437 -227881
8215 -227881 -75181 -107303 -137608 -166210 -163134 -108843 -94398 -69711 -2553 73506 200476
8204 200476 103282 11529 83547 109017 28749 66046 6719 -63063 148783 47569 2763
8193 2763 78002 84616 162703 150518 34699 86192 36338 103295 186217 207922 77582 115676
8181 115676 45964 -129178 -242111 -151181 -23999 56844 199049 134604 -25741 -166804
8171 -166804 -23674 54531 117627 105772 125919 91885 -112398 -128027 -232764 -184296 -106610
$$ packed form
8248A91542J02981L0702j3469q6799n7126j15288O4779J8445k5495R6155M5065
8237B51492k5374j01582j52326j40949j26618K38321O3106J8198m4411N5993J07110
8226A42960K3576N5035p911q8517p0776k07319n2113q1207j41059P3894J25556
8215b27881J52700l2122l0305k8602L076N4291J4445K4687O7158P6059J26970
8204B00476r7194r1753P2018K5470q0268L7297n9327o9782K11846j01214m4806
8193B763P5239O614P8087j2185j15819N1493m9854O6957Q2922K1705j30340L8094
8181A15676o9712j75142j12933R0930J27182Q0843J42205o4445j60345j41063
8171a66804J43130P8205O3096j1855K0147l4034k04283j5629j04737M8468P7686
$$ plain form
8160 -106610 118223 174544 28073 -279776 -405937 -437609 -285876 -237804 -249152 -383220
8150 -383220 -309320 -138110 -16572 -33615 -22786 -54943 -102755 -29943 -29322 78359 98883
8139 98883 125944 156199 201923 67256 101043 -95074 -76494 32852 4842 -61306 -54660
8128 -54660 112785 163652 111370 242993 246616 341594 410241 165028 35397 6620 112444
8117 112444 170956 127121 161389 273022 305809 142906 20511 -24718 -211338 -230654 -80870
8106 -80870 -198295 -164829 2913 141811 88234 -75915 -121299 89171 167248 -13926 -32726
8095 -32726 123846 112218 38912 27307 34732 -113968 -287935 -267515 -62041 163077 135383
8084 135383 84597 14209 -676 -206072 -124346 86352 137132 38095 -78734 -185321 -257786
$$ packed form
8160a06610K24833N6321j46471l07849j26161l1672J51733M8072j1348j34068
8150c83220P3900J71210J21538j7043J0829l2157m7812P2812O21J07681K0524
8139I8883K7061L0255M5724j34667L3787j96117J8580J09346k8010o6148O646
8128e4660J67445N0867n2282J31623L623R4978O8647k45213j29631k8777J05824
8117A12444N8512m3835L4268J11633L2787j62903j22395m5229j86620j9316J49784
8106h0870j17425L3466J67742J38898n3577j64149m5384K10470P8077j81174j8800
8095c2726J56572j1628p3306j1605P425j48700j73967K0420K05474K25118k7694
8084A35383n0786p0388j4885k05396Q1726K10698N0780r9037j16829j06587p2465
$$ plain form
8073 -257786 -117280 -114576 -19416 130203 15284 13615 -71019 -102661 5622 -46027 -137892
8062 -137892 -130117 -180819 -251580 -92951 -32407 -93958 -304665 -411863 -385526 -436947 -283326
8051 -283326 -277539 -258785 -289396 -95917 123230 194654 173076 70688 -156139 -203642 -156745
8040 -156745 -250296 -299072 -163912 -17602 126188 275088 401231 358859 130006 92992
8030 92992 32244 3935 -118405 -99384 -40198 69017 -40692 -213457 -116990 68208 16516
8019 16516 -34447 -143438 -38179 178949 93319 13062 -266303 -253304 -80600 -41777 -29148
8008 -29148 45570 213757 261193 228029 112190 -73543 -19278 -3884 27303 121783 18275
7997 18275 -175689 -186592 -144743 -104016 -76685 80253 58453 45737 -18640 -58050 -69784
$$ packed form
8073b57786J40506K704R5160J49619j14919j669q4634l1642J08283n1649r1865
8062a37892P775n0702p0761J58629O0544o1551k10707j07198K6337n1421J53621
8051b83326N787J8754l0611J93479K19147P1424k1578j02388k26827m7503M6897
8040a56745r3551m8776J35160J46310J43790J48900J26143m2372k28853l7014
8030I2992o0748k8309j22340J9021N9186J09215j09709j72765R6467J85198n1692
8019A6516n0963j08991J05259K17128q5630q0257k79365J2999J72704L8823J2629
8008b9148P4718J68187M7436l3164j15839j85733N4265J5394L1187R4480j03508
7997A8275j93964j0903M1849M0727K7331J56938k1800j2716o4377l9410j1734
$$ plain form
7986 -69784 -120942 -98172 -64189 -48284 -191143 -218180 -63052 12193 -77737 -44973 -74294
7975 -74294 -176034 -96447 57630 32372 -42268 68327 18598 -103798 -54599 74202 135078
7964 135078 32710 -23557 -91703 -143887 -82508 -38722 29224 -23255 -27356 -127397 -102645
7953 -102645 -17017 84723 -49024 -28584 120920 68386 -13539 48574 -50667 -59980 -56199
7942 -56199 -81960 -136729 -89364 -58268 -144492 -193647 -375727 -272808 -119762 -1108 -9373
7931 -9373 -81405 65777 269131 355765 322409 334181 136533 -94531 -74778 -127073 -220305
7920 -220305 -95796 -52027 -177797 -117491 -19061 -94392 -238583 -471909 -333445 -321147 -280282
7909 -280282 -289873 -397077 -362872 -254647 -36837 70436 39583 -48324 -94155 -232239 -312118
$$ packed form
7986f9784n1158K2770L3983J5905j42859k7037J55128P5245q9930L2764k9321
7975g4294j01740P9587J54077k5258p4640J10595m9729j22396M9199J28801O0876
7964A35078j02368n6267o8146n2184O1379M3786O7946n2479m101j00041K4752
7953a02645Q5628J01740j33747K0440J49504n2534q1925O2113r9241r313L781
7942e6199k5761n4769M7365L1096q6224m9155j82080J02919J53046J18654q265
7931i373p2032J47182K03354Q6634l3356J1772j97648k31064J9753n2295r3232
7920b20305J24509M3769j25770O0306R8430p5331j44191k33326J38464J2298M0865
7909b80282r591j07204L4205J08225K17810J07273l0853q7907m5831j38084p9879
$$ plain form
7898 -312118 -218112 -103188 98808 229989 8424 -9575 -45665 -145423 -79813 23129 -77415
7887 -77415 -81831 105365 235815 260910 372383 474616 248859 150654 142869 -13520 -158177
7876 -158177 -190335 -118872 13697 27170 -204443 -152200 -142094 -99868 40205 127976 159402
7865 159402 87853 85865 248606 168956 -40896 -16330 -135393 -165942 -156890 -168217 -225545
7854 -225545 -77863 90360 25923 5718 -27564 -3409 36589 81066 18696 15860 -42758
7843 -42758 -49801 -82907 -96021 -67153 -100048 -172338 -63079 -25947 -95438 -136405 -109563 -194296
7831 -194296 -334326 -284377 -244679 -145554 -236090 -283554 -165089 -49066 147109 126868 243237
7820 243237 153918 -45602 13549 19506 -42448 7354 -26908 -164131 -87609 95565 -10054
$$ packed form
7898c12118R4006J14924K01996J31181k21565j7999l6090r9758O5610J02942j00544
7887g7415m416J87196J30450K5095J11473J02233k25757r8205p785j56389j44657
7876a58177l2158P1463J32569J3473k31613N2243J0106M2226J40073Q7771L1426
7865A59402p1549j988J62741p9650k09852K4566j19063l0549R052j1327n7328
7854b25545J47682J68223o4437k0205l3282K4155L9998M4477o2370k836n8618
7843d2758p043l3106j3114K8868l2895p2290J09259L7132o9491m0967K6842q4733
7831a94296j40030M9949L9698R9125r0536m7464J18465J16023J96175k0241J16369
7820B43237q9319j99520N9151N957o1954M9802l4262j37223P6522J83174j05619
$$ plain form
7809 -10054 30765 70228 64729 -2173 -49272 16839 11208 -94265 -59363 4227 89788 -99628
7797 -99628 -263931 -271164 -169785 -189591 -191558 -92250 10428 -23560 -57711 -68883 -126210 -315850
7785 -315850 -341538 -142352 -74975 58863 192318 22506 -114126 -114440 88845 172525 121784
7774 121784 71626 11211 244418 280172 172807 289984 316842 258733 310400 258451 167054
7763 167054 302307 249445 178321 35262 183270 223798 227859 151486 -58530 -162689 61908
7752 61908 138721 104547 58581 20373 -102861 -268422 -428910 -431000 -298291 -104885 -28916
7741 -28916 -25009 -60236 -30778 47556 114741 72959 -30587 -6885 6420 115087 147943 14350
7729 14350 15419 114079 249746 175332 179213 114158 240252 392277 277373 171242 114100
$$ packed form
7809a0054M0819L9463n499o6902m7099O6111n631j05473L4902O3590Q5561j89416
7797i9628j64303p233J01379j9806j967R9308J02678l3988l4151j1172n7327j89640
7785c15850k5688J99186O7377J33838J33455j69812j36632l14K03285Q3680n0741
7774A21784n0158o0415K33207L5754j07365J17177K6858n8109N1667n1949r1397
7763A67054J35253n2862p1124j43059J48008M0528M061p6373k10016j04159K24597
7752F1908P6813l4174m5966l8208j23234j65561j60488k090J32709J93406P5969
7741b8916L907l5227K9458P8334O7185m1782j03546K3702J3305J08667L2856j33593
7729A4350J069R8660J35667p4414L881o5055J26094J52025j14904j06131n7142
$$ plain form
7718 114100 152120 36924 131038 17589 -223624 -305710 -319163 -170585 4195 133242
7708 133242 101939 86458 -123499 -233725 -184938 -313846 -313186 -79426 194168 314602 248208
7697 248208 118270 151697 93823 -127457 -174175 48045 -57383 57446 195970 117929
7687 117929 -56932 -250953 -60560 14512 -19068 -144436 -182453 -110793 -117337 -174093 -59651
7676 -59651 -32888 110460 169795 60057 -139236 -74720 -57703 91760 83679 -26401 -6433
7665 -6433 -39930 -32947 -88108 -11648 -66296 -106744 -176218 -206627 -239015 -144844 -145968 49701
7653 49701 218057 60057 42543 144274 193956 78230 -73627 -122304 -155340 82694 126086
7642 126086 46364 62084 8950 139053 173124 60851 17690 -214155 -255145 -320097 -234630
$$ packed form
7718A14100L8020j15196R4114j13449k41213q2086j3453J48578J74780J29047
7708A33242l1303j5481k09957j10226M8787j28908O60K33760K73594J20434o6394
7697B48208j29938L3427n7874k21280m6718K22220j05428J14829J38524p8041
7687A17929j74861j94021J90393P5072l3580j25368l8017P1660o544n6756J14442
7676e9651K6763J43348N9335j09738j99293O4516J7017J49463q081j10080J9968
7665f433l3497O983n5161P6460n4648m0448o9474l0409l2388R4171j124J95669
7653D9701J68356j58000j7514J01731M9682j15726j51857m8677l3036K38034M3392
7642A26086p9722J5720n3134J30103L4071j12273m3161k31845m0990o4952Q5467
$$ plain form
7631 -234630 -171852 -104702 -51641 53997 61279 165774 102059 -60803 -9307 -47940 99445
7620 99445 202458 215726 96372 -8737 8879 -80 22654 -122 38558 -33483 -100937
7609 -100937 -9311 30823 -138114 -266553 -173196 -64439 21488 5141 -59212 84649 88694
7598 88694 -71891 -58372 25887 112863 -17619 -129838 1181 -14116 -149882 -255847 -3487
7587 -3487 137126 198176 136164 108885 295385 339563 135363 -64032 -211515 -201407 -70998
7576 -70998 62362 -7554 16552 -39739 -147770 -228129 -141749 2822 115786 112726 71631
7565 71631 -31986 -48867 54491 -83008 -97366 -72387 -181037 -124704 -35204 -87751 -47276
7554 -47276 103121 72680 -55696 1366 286940 222868 81805 22424 22704 -74123 -47358
$$ packed form
7631b34630O2778O7150N3061J05638P282J04495o3715j62862N1496l8633J47385
7620I9445J03013J3268j19354j05109J7616q959K2734k2776L8680p2041o7454
7609a00937R1626M0134j68937j28439R3357J08757Q5927j6347o4353J43861M045
7598H8694j60585J3519Q4259Q6976j30482j12219J31019j5297j35766j05965K52360
7587c487J40613O1050o2012k7279J86500M4178k04200j99395j47483J0108J30409
7576g0998J33360o9916K4106n6291j08031q0359Q6380J44571J12964l060m1095
7565G1631j03617j6881J03358j37499j4358K4979j08650N6333Q9500n2547M0475
7554d7276J50397l0441j28376N7062K85574o4072j41063n9381K80r6827K6765
$$ plain form
7543 -47358 5206 128814 230547 165953 72124 -49493 -9506 32901 -135392 -144334 -150413
7532 -150413 -21679 34588 11129 48799 51772 98082 69749 159221 229484 113437 165123
7521 165123 110103 -3563 -86931 -133863 -177601 -54812 79299 160379 281178 220605 35228
7510 35228 34714 63130 239081 77227 -18980 -49302 -119870 -151079 -162467 -267731 -270123 -186792
7498 -186792 -179094 -188811 -279004 -305738 -220502 46382 169366 131094 225154 163382 15309
7487 15309 -105377 -103054 -98797 -14966 16848 1612 -78767 -96560 -64101 -136939 -155043 -201013
7475 -201013 -238150 -162871 -178800 -178051 -93879 -62646 -91658 79718 151206 22210 -909 38216
7463 38216 -67465 -48559 -2508 -104278 -180753 46674 222446 155461 -12314 9184 93242
$$ packed form
7543d7358N2564J23608J01733o4594r3829j21617L9987M2407j68293q942o079
7532a50413J28734N6267k3459L7670K973M6310k8333Q9472P0263j16047N1686
7521A65123n5020j13666q3368m6932m3738J22789J34111Q1080J20799o0573j85377
7510C5228n14K8416J75951j61854r6207l0322p0568l1209j1388j05264k392Q3331
7498a86792P698r717r0193k6734Q5236K66884J22984l8272R4060o1772j48073
7487A5309j20686K323M257Q3831L1814j5236q0379j7793L2459p2838j8104m5970
7475b01013l7137P5279j5929P49Q4172L1233k9012J71376P1488j28996k3119L9125
7463C8216j05681J8906M6051j01770p6475K27427J75772o6985j67775K1498Q4058
$$ plain form
7452 93242 123524 301985 451877 262114 268899 368370 191787 85336 123462 127336 94648
7441 94648 64722 76318 -6850 7066 7508 -16745 50435 74160 170492 136239 30611 16802
7429 16802 66300 19630 -99878 -177091 -205851 -241565 -364378 -285072 -228628 -161210 -237343
7418 -237343 -117547 -153449 -218913 -319003 -265865 -245681 -79440 -91620 -13149 -97536 -174205
7407 -174205 93405 332927 238766 -34212 -11015 129472 102588 171864 221007 -68557 -59750
7396 -59750 83090 122667 58931 -6640 24630 58999 -28537 -308586 -284800 -221282 -187123
7385 -187123 -98234 -174767 -266219 -281583 -163560 -104839 -285357 -414508 -196723 44480 156438
7374 156438 214130 211435 152684 63344 332 -60606 138276 173206 142747 114154 151863 135197
$$ packed form
7452I3242L0282J78461J49892j89763O785R9471j76583j06451L8126L874l2688
7441I4648k9926J1596q3168J3916M42k4253O7180K3725R6332l4253j05628j3809
7429A6802M9498m6670j19508p7213k8760l5714j22813P9306N6444O7418p6133
7418b37343J19796l5902o5464j00090N3138K0184J66241j2180P8471q4387p6669
7407a74205K67610K39522r4161k72978K3197J40487k6884O9276M9143k89564Q807
7396e9750J42840L9577o3736o5571L1270L4369q7536k80049K3786O3518L4159
7385a87123Q8889p6533r1452j5364J18023N8721j80518j29151K17785K41203J11958
7374A56438N7692k695n8751q9340o3012o0938J98882L4930l0459k8593L7709j6666
$$ plain form
7362 135197 190389 250695 157221 80043 42946 -12938 -51568 -12182 -37123 28709 134826
7351 134826 61095 -43084 -72814 -54808 -148626 -248144 -106354 -48214 38304 -85842 21471
7340 21471 22640 -31066 -51473 230974 343719 215179 180873 94217 23923 -85186 -140719
7329 -140719 -794 132020 143786 -56786 -56676 27436 -2677 -57631 -24704 25300 6299
7318 6299 -105706 -177309 -219413 -308242 -192977 -133027 41256 120369 89737 384 -128872
7307 -128872 -150819 -250680 -164506 59428 197548 100369 -50759 516 40603 -16422 23993
7296 23993 136800 222965 226726 90397 -53663 -540 144259 90591 3819 17554 16738 -9721
7284 -9721 -14153 3583 -97826 -98532 -227452 -252883 -205966 -365306 -301024 -155783 -125301 -135078
$$ packed form
7362A35197N5192O0306r3474p7178l7097n5884l8630L9386k4941O5832J06117
7351A34826p3731j04179k9730J8006r3818r9518J41790N8140Q6518j24146J07313
7340B1471J169n3706k0407K82447J12745j28540l4306q6656p0294j09109n5533
7329a40719J39925J32814J1766k00572J10Q4112l0113n4954L2927N0004j9001
7318F299j12005p1603m2104q8829J15265N9950J74283P9113l0632q9353j29256
7307a28872k1947r9861Q6174K23934J38120r7179j51128N1275M0087n7025M0415
7296B3993J12807Q6165L761j36329j44060N3123J44799n3668q6772J3735q16k6459
7284i721m432J7736j01409p06j28920k5431M6917j59340O4282J45241L0482r777
$$ plain form
7272 -135078 -284159 -213074 -56206 22251 68633 -11819 -34362 95864 169548 178476 276163
7261 276163 154122 189772 89018 -52632 -162585 -123849 -60544 -18323 -24070 26027 136678
7250 136678 171256 49023 -17348 -191489 -112566 -120986 -5808 -235063 -320088 -204619 -66563
7239 -66563 -43676 -126723 -129940 -92503 -12221 91532 218952 201498 24546 16951 113245 176922
7227 176922 163131 19200 3655 -17365 9399 86978 151526 50097 -253934 -247021 -76232
7216 -76232 1504 -79628 -58027 -27712 37284 -651 -118555 -91696 -29871 35203 26449 71494
7204 71494 34260 8625 121462 207787 171962 -8667 -104410 -129128 -163883 -70445 -47938
7193 -47938 -107775 -111900 -167450 -229304 -216662 -258700 -301801 -93523 124140 80471 -74157
$$ packed form
7272a35078j49081P1085J56868P8457M6382q0452k2543J30226P3684Q928R7687
7261B76163j22041L5650j00754j41650j09953L8736O3305M2221n747N0097J10651
7250A36678L4578j22233o6371j74141P8923q420J15178k29255q5025J15469J38056
7239f6563K2887q3047l217L7437Q0282J03753J27420j7454j76952p595R6294O3677
7227A76922j3791j43931j5545k1020K6764P7579O4548j01429l04031O913J70789
7216g6232P7736q1132K1601L0315O4996l7935j17904K6859O1825O5074q754M5045
7204G1494l7234k5635J12837Q6325l5825j80629r5743k4718l4755R3438K2507
7193d7938n9837m125n5550o1854J2642m2038m3101K08278K17663m3669j54628
$$ plain form
7182 -74157 81305 269070 136305 23679 -32243 -186597 -200859 -67467 -154372 -449983
7172 -449983 -418574 -290464 -205277 -139710 -170151 -259396 -84386 -18741 -37958 -42425 -84240
7161 -84240 -147149 -16555 2749 -94333 7392 37924 81749 127731 14318 -50318 -161908
7150 -161908 -170302 16440 36520 -23150 57043 5640 -97718 -174786 -167858 -124962 -200961 -224503
7138 -224503 -166933 -25532 191091 308096 276342 256807 193134 99445 58104 56056 73665
7127 73665 114478 101189 -37750 -10949 -109510 -176849 -117385 -174099 -278552 -230277 -111890
7116 -111890 -27396 35439 76307 -7310 -244210 -256187 -172449 -210532 -114959 38123 23124
7105 23124 16044 151863 252790 77175 -61053 3643 171279 330982 140957 39975
$$ packed form
7182g4157J55462J87765j32765j12626n5922j54354j4262J33392q6905k95611
7172d49983L1409J28110Q5187O5567l0441q9245J75010O5645j9217m467m1815
7161h4240o2909J30594J9304r7082J01725L0532M3825M5982j13413o4636j11590
7150a61908q394J86742K0080n9670Q0193n1403j03358p7068O928M2896p5999k3542
7138b24503N7570J41401K16623J17005l1754j9535o3673r3689m1341k048J7609
7127G3665M0813j3289j38939K6801r8561o7339N9464n6714j04453M8275J18387
7116a11890Q4494O2835M0868q3617k36900j1977Q3738l8083R5573J53082j4999
7105B3124p080J35819J00927j75615j38228O4696J67636J59703j90025j00982
$$ plain form
7095 39975 162933 112990 -49461 -15154 94997 123511 -7136 -22196 -34161 21953 88437
7084 88437 -46535 -239695 -168099 -188581 -84056 23579 101356 177209 -7787 -91904 -33727
7073 -33727 115178 216980 374170 358380 143572 40856 -73741 -59613 -203666 -231948
7063 -231948 -172189 -261956 -350460 -229308 -353889 -312523 -60531 -113707 -91429 97053 60558
7052 60558 -57262 -10126 165357 136873 206293 229788 70468 8396 -53104 -171742 -193711
7041 -193711 -111157 33146 181511 283785 290069 173362 134500 140549 106196 34167 -48341
7030 -48341 59926 77779 9123 -24752 -50708 -51689 -193439 -331546 -226891 -174240 -259659
7019 -259659 -226813 -107454 -45412 141260 123447 57359 95327 32136 -10553 -85738 -162672
$$ packed form
7095C9975J22958m9943j62451L4307J10151K8514j30647j5060j1965N6114O6484
7084H8437j34972j93160P1596k0482J04525J07635P7777P5853j84996q4117N8177
7073c3727J48905J01802J57190j5790k14808j02716j14597J4128j44053k8282
7063b31948N9759q9767q8504J21152j24581M1366K51992n3176K2278J88482l6495
7052F0558j17820M7136J75483k8484O9420K3495j59320o2072o1500j18638k1969
7041a93711Q2554J44303J48365J02274O284j16707l8862O049l4353p2029q2508
7030d8341J08267J7853o8656l3875k5956r81j41750j38107J04655N2651q5419
7019b59659L2846J19359O2042J86672j7813o6088L7968o3191m2689p5185p6934
$$ plain form
7008 -162672 -91861 34105 4624 -86050 -82605 -143848 -113806 -116852 -51660 1028 -17087 18698
6996 18698 44450 -96681 -67998 7240 -67323 -152116 -95529 -7814 -1373 -140258 -208334 -256534
6984 -256534 -150224 -256262 -343611 -174734 -95180 -106879 65221 111785 106058 220292 176971
6973 176971 59469 -61498 -22567 112954 13736 62603 70915 -41457 -155911 -153271 -192090
6962 -192090 -127438 -232377 -310201 -350272 -331228 -343891 -191253 -147738 -320361 -321465 -136782
6951 -136782 197027 234260 37025 -123404 -213170 -293240 -344331 -288806 -198419 -68986 -73811
6940 -73811 -97655 -162304 -59127 -115323 -80205 -57423 -10598 182835 196578 84703 166664
6929 166664 206765 129320 65883 59513 -67325 -157197 -93859 -43098 -17369 -92748 -128258 -68140
$$ packed form
7008a62672P0811J25966k9481r0674L445o1243L0042l046O5192N2688j8115L5785
6996A8698K5752j41131K8683P5238p4563q4793N6587Q7715O441j38885o8076m8200
6984b56534J06310j06038q7349J68877P9554j1699J72100M6564n727J14234m3321
6973A76971j17502j20967L8931J35521r9218M8867Q312j12372j14454K640l8819
6962a92090O4652j04939p7824m0071J9044j2663J52638M3515j72623j104J84683
6951a36782L33809L7233j97235j60429q9766q0070n1091N5525R0387J29433m825
6940g3811k3844o4649J03177n6196L5118K2782M6825J93433J3743j11875Q1961
6929A66664M0101p7445o3437o370j26838q9872O3338N0761K5729p5379l5510O0118
$$ plain form
6917 -68140 108612 142111 121590 18650 -136716 -163466 -129059 -128451 -163551 -140498 -157971 -232397
6905 -232397 -163624 -166463 -160082 -155304 -111390 24858 26109 127453 30612 -65479 -36928 -150158
6893 -150158 -232141 -141914 -23603 -11641 -79954 -2387 -21334 -109291 -109401 -141995 -102317 34784
6881 34784 162527 232664 166463 167437 54793 -61602 -90344 47678 -87397 -69877 192225
6870 192225 221809 135510 87720 -165779 -179808 -138318 -133290 -56504 8625 -41439 -10028 -17997
6858 -17997 -147570 -153317 -79880 63054 105931 194453 49947 2409 -51319 -256410 -256908 -91765
6846 -91765 -122657 -328373 -218503 -134689 -235042 -357389 -293679 -197191 -262182 -238914 -168226
6835 -168226 -78654 -166487 -183355 -87984 -113129 -81424 56052 79441 -29619 10410 148376
$$ packed form
6917f8140J76752L3499k0521j02940j55366k6750L4407O08l5100K3053j7473p4426
6905b32397O8773k839O381M778M3914J36248J251J01344r6841r6091K8551j13230
6893a50158q1983R0227J18311J1962o8313P7567j8947q7957j10l2594L9678J37101
6881C4784J27743P0137o6201R74j12644j16395k8742J38022j35075J7520K62102
6870A92225K9584q6299m7790k53499j4029M1490N028P6786O5129n0064L1411p969
6858a7997j29573n747P3437J42934M2877Q8522j44506m7538n3728k05091m98J65143
6846i1765l0892k05716J09870Q3814j00353j22347O3710R6488o4991K3268P0688
6835a68226Q9572q7833j6868R5371k5145L1705J37476K3389j09060M0029J37966
$$ plain form
6824 148376 -13736 -44279 20172 27838 10164 -72523 -34608 -196199 -279809 -317164 -430656
6813 -430656 -275999 22198 134331 -1909 -69163 -97984 -208206 -95052 -536 -36512
6803 -36512 -39863 59398 16494 -86126 -59703 44305 20092 122029 146807 74734 20828
6792 20828 -62122 -142797 -105097 -2170 72563 13174 21988 184715 273372 313484 243631 149604
6780 149604 136208 -106469 -176512 -113615 -32406 -138959 -89119 -128769 -6037 -41826 -51639
6769 -51639 -121041 -187577 -273661 -325937 -223222 -44263 -14116 -115651 13936 -28111 136427
6758 136427 267757 214608 -6562 -97607 -63000 -23612 -100410 -75765 -30745 -5995 33685
6747 33685 61566 152943 146907 103229 -76934 -246197 -167408 -36907 3354 -105158 -124938
$$ packed form
6824A48376j62112l0543O4451P666j7674q2687L7915j61591q3610l7355j13492
6813d30656J54657K98197J12133j36240o7254k8821j10222J13154R4516l5976
6803c6512l351R9261m2904j02620K6423J04008k4213J01937K4778p2073n3906
6792B0828q2950q0675L7700J02927P4733n9389Q814J62727Q8657M0112o9853r4027
6780A49604j3396k42677p0043O2897Q1209j06553M9840l9650J22732l5789r813
6769e1639o9402o6536q6084n2276J02715J78959L0147j01535J29587m2047J64538
6758A36427J31330n3149k21170r1045L4607L9388p6798K4645M5020K4750L9680
6747C3685K7881R1377o036m3678j80163j69263P8789J30501M0261j08512j9780
$$ plain form
6736 -124938 -274212 -326263 -283441 -371984 -303223 -146753 28562 52289 -84828 -102405 56011
6725 56011 240045 251509 262371 347693 337504 444185 711145 863029 1111113 1215704 1209632
6714 1209632 1163083 1114533 871015 712799 430145 314296 165460 100146 106968 111133 200556
6703 200556 170921 185478 223594 31339 51100 129182 36868 -10053 103497 277064 200957
6692 200957 -4039 -135374 -248549 -316045 -196112 -146399 -60591 13414 122965 5465
6682 5465 20295 59499 20411 42096 -70135 -77550 -6824 2414 -128307 -225302 -257741 -166106
6670 -166106 -99274 -74270 -42270 -127491 47528 109061 -35532 -159370 -60935 -990 -89564
6659 -89564 -203977 -231851 -93975 -178032 -218073 -134921 -110588 -213389 -245851 -276072 -312466
$$ packed form
6736a24938j49274n2051M2822q8543O8761J56470J75315K3727j37117j7577J58416
6725E6011J84034J1464J0862Q5322j0189J06681K66960J51884K48084J04591o072
6714A209632m6549m8550k43518j58216k82654j15849j48836o5314O822M165Q9423
6703B00556k9635J4557L8116j92255J9761P8082r2314m6921J13550J73567p6107
6692B00957k04996j31335j13175o7496J19933M9713Q5808P4005J09551j17500
6682E465J4830L9204l9088K1685j12231p415P0726R238j30721r6995l2439R1635
6670a66106O6832K5004L2000q5221J75019O1533j44593j23838R8435N9945q8574
6659h9564j14413k7874J37876q4057m0041Q3152K4333j02801l2462l0221l6394
$$ plain form
6648 -312466 -281231 -158960 -171521 -264857 -120615 -41157 -90802 -33003 -23651 -8734 -48449
6637 -48449 -67932 -43783 -76904 -117573 -138436 -144676 -237776 -283379 -236609 -174301 -215542 -226925
6625 -226925 -230809 -237089 -207350 -55391 -214331 -214809 -244024 -159223 -10148 -188601 -328836
6614 -328836 -237515 -106146 -51995 -110684 15860 167516 83546 67713 146207 183395 -33052
6603 -33052 -227567 -95256 -9663 13196 188097 293989 125466 5267 6147 -35585 -153043
6592 -153043 -234969 -217513 -140017 -108179 30677 -54151 -76742 137353 116085 27270 7368
6581 7368 185998 336383 357410 300209 122250 -55070 -12937 191629 360718 328401 303468
6570 303468 283326 299107 295822 204201 47894 -66832 2009 117427 178454 160240 68600
$$ packed form
6648c12466L1235J22271j2561r3336J44242P9458m9645N7799R352J4917l9715
6637d8449j9483K4149l3121m0669k0863o240r3100m5603M6770O2308m1241j1383
6625b26925l884o280K9739J51959j58940m78k9215Q4801J49075j78453j40235
6614c28836R1321J31369N4151n8689J26544J51656q3970j5833P8494L7188k16447
6603c3052j94515J32311Q5593K2859J74901J05892j68523j20199Q80m1732j17458
6592a53043q1926J7456P7496L1838J38856q4828k2591K14095k1268q8815j9902
6581G368J78630J50385K1027n7201j77959j77320M2133K04566J69089l2317k4933
6570C03468k0142J5781l285r1621j56307j14726O8841J15418O1027j8214r1640
$$ plain form
6559 68600 -108718 -205516 -119358 12180 -137968 -196527 -230147 -205614 18988 83777 -97249
6548 -97249 -123739 -142961 -51799 -76748 -146278 -29396 43943 -12565 -93128 -107237 -123662 -210117
6536 -210117 -292175 -196070 -198671 -217940 -265310 -188855 -191351 -58346 42434 -22454 -134891
6525 -134891 -16160 -54811 -93787 -91355 -69589 -168554 -259358 -89665 31739 84758 5209
6514 5209 -9768 -939 -26149 -61998 173642 295570 300907 274014 259224 191768 74216 -21397
6502 -21397 -205367 -177235 -244421 -279039 -321812 -270987 -426920 -428149 -301963 -240521 -159083
6491 -159083 -102359 -94084 -55523 -18596 89638 87908 174793 273710 294189 198095 355365 306398
6479 306398 122235 18023 -209295 -325662 -162628 -46274 -44243 -81621 -131506 -79839 -36807
$$ packed form
6559F8600j77318r6798Q6158J31538j50148n8559l3620K4533K24602O4789j81026
6548i7249k6490j9222R1162k4949o9530J16882P3339n6508q0563j4109j6425q6455
6536b10117q2058R6105k601j9269m7370P6455k496J33005J00780o4888j12437
6525a34891J18731l8651l8976K432K1766r8965r0804J69693J21404N3019p9549
6514E209j4977Q829k5210l5849K35640J21928N337k6893j4790o7456j17552r5613
6502b1397j83970K8132o7186l4618m2773N0825j55933j229J26186O1442Q1438
6491a59083N6724Q275L8561L6927J08234j730Q6885R8917K0479r6094J57270m8967
6479C06398j84163j04212k27318j16367J63034J16354K031l7378m9885N1667M3032
$$ plain form
6468 -36807 -138670 -82639 -71303 -64504 98147 139372 248680 145396 -2866 -30865 -3575
6457 -3575 -60419 35683 205713 331838 381780 117316 8147 105602 -88272 -100156 115145
6446 115145 220695 156428 -15363 -266942 -198550 -187582 -124923 -282496 -417583 -354484 -202567
6435 -202567 -223626 -303777 -221346 -272149 -311527 -127881 86974 185743 178759 197924 183305
6424 183305 149168 276791 183095 134020 -75313 -145669 -270947 -121709 12264 -123767
6414 -123767 -245247 -173364 -217056 -361598 -257647 -261609 -311006 -316573 -174268 -50756 -162051
6403 -162051 -7225 22640 -51424 -34419 107809 132332 97199 -92635 -98721 -4808 -78348
6392 -78348 -70287 -13268 94021 73157 -96919 -161764 -37579 132528 356021 362216 274422
$$ packed form
6468c6807j01863N6031J1336O799J62651M1225J09308j03284j48262k7999K7290
6457c575n6844R6102J70030J26125M9942k64464j09169R7455j93874j1884K15301
6446A15145J05550o4267j71791k51579O8392J0968O2659j57573j35087O3099J51917
6435b02567k1059q0151Q2431n0803l9378J83646K14855R8769o984J9165j4619
6424A83305l4137J27623r3696m9075k09333p0356j25278J49238J33973j36031
6414a23767j21480P1883m3692j44542J03951l962m9397n567J42305J23512j11295
6403a62051J54826K9865p4064J7005J42228K4523l5133j89834o086R3913p3540
6392g8348Q061N7019J07289k0864j70076o4845J24185J70107K23493O195q7794
$$ plain form
6381 274422 250001 191941 309558 396674 329492 198223 11744 -153234 -199661 -176011 -185421
6370 -185421 -139568 -117895 -237652 -135107 80797 -26973 -38873 -118139 -201904 -218322 -117618
6359 -117618 -16892 -62945 -67377 -140910 -127373 -38797 -69998 -178223 -214564 -122612 -327972
6348 -327972 -404852 -420160 -390285 -190027 -75294 1692 -18014 -87144 -136250 -262923 -277609
6337 -277609 -227513 -65686 -19110 -1633 -73789 -35809 -175662 -522323 -443447 -292285 -100800
6326 -100800 -157888 -51893 63390 -19563 -5592 138357 90199 117592 -35938 88533 200738
6315 200738 211950 147127 29027 -35340 90835 166246 150319 74719 32023 103661 208537
6304 208537 297860 271825 136852 -31888 -69186 -64951 -274576 -384059 -282883 -267118 -271196
$$ packed form
6381B74422k4421n8060J17617Q7116o7182j31269j86479j64978m6427K3650r410
6370a85421M5853K1673j19757J02545K15904j07770j1900p9266q3765j6418J00704
6359a17618J00726m6053m432p3533J3537Q8576l1201j08225l6341R1952k05360
6348c27972p6880j5308K9875K00258J14733P6986j9706o9130m9106j26673j4686
6337b77609N0096J61827M6576J7477p2156L7980j39853l46661P8876J51162J91485
6326a00800n7088J05995J15283q2953J3971J43949m8158K7393j53530J24471J12205
6315B00738J1212o4823j18100o4367J26175P5411j5927p5600m2696P1638J04876
6304B08537Q9323k6035j34973j68740l7298M235k09625j09483J01176J5765m078
$$ plain form
6293 -271196 -164869 -196162 -101910 -137849 -151673 -141827 -55249 -46354 -98910 -98542 128379 298545
6281 298545 108861 -138772 -121742 -145138 -173757 -140680 -125487 -132671 -175202 -256403 -171870
6270 -171870 -152640 -68396 2183 -10075 -47979 -70037 8026 103444 116603 160287 59951
6259 59951 -87287 15588 189928 163075 68036 160944 113790 37041 13355 -33652 -219323
6248 -219323 -227347 -70194 -36654 -100175 19853 240241 303961 361176 387323 344512 273569
6237 273569 156177 92200 9197 164509 189291 217611 247473 48941 -17040 130642 185155
6226 185155 37726 7354 -83750 -126412 -82797 -132475 -152136 -21968 115245 145611 174857
6215 174857 101690 124364 305885 259625 32769 -177873 -308496 -351307 -270497 -112495 -18100
$$ packed form
6293b71196J06327l1293R4252l5939j3824R846Q6578Q895n2556L68K26921J70166
6281B98545j89684k47633J7030k3396k8619L3077J5193p184m2531q1201Q4533
6270a71870J9230Q4244P0579j2258l7904k2058P8063R5418J3159M3684j00336
6259E9951j47238J02875J74340k6853r5039R2908m7154p6749k3686m7007j85671
6248b19323q024J57153L3540o3521J20028K20388O3720N7215K6147m2811p0943
6237B73569j17392o3977q3003J55312K4782K8320K9862j98532o5981J47682N4513
6226A85155j47429l0372r1104m2662M3615m9678j9661J30168J37213L0366K9246
6215A74857p3167K2674J81521m6260k26856k10642j30623m2811Q0810J58002R4395
$$ plain form
6204 -18100 -164807 -203685 -178126 -198507 -127633 -163570 -133848 -224702 -184099 -111409 -2896
6193 -2896 45195 172668 324943 330334 294764 129762 219351 264523 161776 17010 143893
6182 143893 66968 -218177 -58087 124047 67964 -44796 26238 127575 74659 -169469
6172 -169469 -292072 -239698 31695 -2333 -128726 -111928 62590 -49925 -191112 -174723
6162 -174723 -167744 -141899 -161500 -123412 -140382 -249822 -147974 47530 124741 -74611 -118168
6151 -118168 -180709 -134552 7249 33324 89264 160810 190135 247952 297631 235242 277620
6140 277620 262051 121944 -64060 71125 230008 164695 55867 -79014 -137759 -54289
6130 -54289 -61015 -83948 -107365 -169618 -256106 -204652 -241468 -127808 -2474 7536 111458
$$ packed form
6204a8100j46707l8878K5559k0381P0874l5937K9722r0854M0603P2690J08513
6193b896M8091J27473J52275N391l5570j65002Q9589M5172j02747j44766J26883
6182A43893p6925k85145J60090J82134n6083j12760P1034J01337n2916k44128
6172a69469j22603N2374K71393l4028j26393J6798J74518j12515j41187J6389
6162a74723O979K5845j9601L8088j6970j09440J01848J95504P7211j99352m3557
6151a18168o2541M6157J41801K6075N5940P1546K9325N7817M9679o2389M2378
6140B77620j5569j40107j86004J35185J58883o5313j08828j34881n8745Q3470
6130e4289o726k2933k3417o2253q6488N1454l6816J13660J25334J0010J03922
$$ plain form
6119 111458 120202 68465 -173700 -238170 -204110 -134532 -20481 97579 131884 88281 85031
6108 85031 119071 151852 11282 -84246 -111216 -45197 -124573 -280140 -231507 -147196 -67739
6097 -67739 29471 125550 23922 -105388 -63073 13892 179422 274056 165132 248635 118807
6086 118807 68897 -65791 -186240 -90188 -23890 20608 -65881 -120008 1575 18091 -26071
6075 -26071 -51492 -41579 31025 4979 44181 121025 187097 165903 88057 -80846 -77754 -119032
6063 -119032 -193298 -380056 -435892 -313003 -203594 -68783 32228 -5653 -51175 -83242 -236016
6052 -236016 -177922 -76294 -111021 96662 212608 238972 311958 285434 205153 49436 64406
6041 64406 122300 134324 175758 180426 148669 42886 -195139 -38785 157714 104530 49006
$$ packed form
6119A11458Q744n1737k42165o4470L4060O9578J14051J18060L4305m3603l250
6108H5031L4040L2781j40570r5528k6970O6019p9376j55567M8633Q4311P9457
6097f7739R7210R6079j01628j29310M2315P6965J65530R4634j08924Q3503j29828
6086A18807m9910j34688j20449R6052O6298M4498q6489n4127J21583J6516m4162
6075b6071k5421R913P2604k6046L9202P6844O6072k1194p7846j68903L092m1278
6063a19032p4266j86758n5836J22889J09409J34811J01011l7881m5522l2067j52774
6052b36016N8094J01628l4727K07683J15946K6364P2986k6524q0281j55717J4970
6041F4406N7894J2024M1434M668l1757j05783k38025J56354J96499n3184n5524
$$ plain form
6030 49006 -160900 -114833 9942 23019 21823 74639 72197 88079 59943 45303 -51091 -143486
6018 -143486 -168156 12973 -6311 31910 102837 120806 96795 69606 -56149 -97984 95855
6007 95855 167639 152306 113541 70242 3229 -116084 -248296 -280761 -306060 -252081 -285087
5996 -285087 -213706 -20141 -77269 60197 16751 -61994 -47861 19712 -21545 12973 -4184
5985 -4184 121953 38383 100272 167378 -31361 -217101 -189251 19430 209052 121737 -71925
5974 -71925 -139038 -69557 59463 2617 103633 -43662 -67588 23097 -50046 -45405 36709
5963 36709 -41863 -95552 -45103 168121 267130 244232 129680 6047 -131267 -268243 -373800
5952 -373800 -353373 -274009 -110455 -200152 -101303 15040 -104081 -131638 -194843 -53242 -86842
$$ packed form
6030D9006k09906M6067J24775J3077j196N2816k442J5882k8136j4640r6394r2395
6018a43486k4670J81129j9284L8221P0927J7969k4011k7189j25755m1835J93839
6007I5855P1784j5333l8765m3299o7013j19313j32212l2465k5299N3979l3006
5996b85087P1381J93565n7128J37466m3446p8745J4133O7573m1257L4518j7157
5985d184J26137q3570O1889O7106j98739j85740K7850K08681J89622q7315j93662
5974g1925o7113O9481J29020n6846J01016j47295k3926R0685p3143M641Q2114
5963C6709p8572n3689N0449K13224R9009k2898j14552j23633j37314j36976j05557
5952c73800K0427P9364J63554q9697R8849J16343j19121k7557o3205J41601l3600
$$ plain form
5941 -86842 -216354 1947 137949 7201 16228 -46072 -107946 -81912 -48803 -102807 -158068
5930 -158068 -110066 -26418 84628 52123 -275349 -353166 -293753 2459 271177 94142 40233
5919 40233 42800 -28976 67263 -154583 -40623 136892 -21640 -151848 31913 7898 -18545
5908 -18545 96548 217709 99873 36097 32418 112203 19026 -193077 -162931 -129048 -137760
5897 -137760 3778 -12139 -61414 31630 -39747 -52638 -109096 -72029 -19440 145240 254090
5886 254090 291326 152317 9207 30424 191444 178111 62358 -67927 -13152 -80348 -60178
5875 -60178 -16767 72490 -146200 -418558 -448805 -345207 -133958 -29684 -12355 -103675 -158883
5864 -158883 -236610 -68782 -108014 -239428 -336261 -294033 -272411 -91192 -53803 -164575 -218125
$$ packed form
5941h6842j29512K18301J36002j30748R027o2300o1874K6034L3109n4004n5261
5930a58068M8002Q3648J11046l2505l27472p7817N9413K96212K68718j77035n3909
5919D0233K567p1776R6239k21846J13960J77515j58532j30208J83761k4015k6443
5908a8545J15093J21161j17836o3776l679P9785r3177k12103L0146L3883q712
5897a37760J41538j5917m9275R3044p1377j2891n6458L7067N2589J64680J08850
5886B54090L7236j39009j43110K1217J61020j3333j15753j30285N4775o7196K0170
5875f0178M3411Q9257k18690k72358l0247J03598K11249J04274J7329r1320n5208
5864a58883p7727J67828l9232j31414r6833M2228K1622J81219L7389j10772n3550
$$ plain form
5853 -218125 -178318 12159 49170 34894 -86110 -109583 -89044 -89162 -34628 -16758 31604 90922
5841 90922 51159 120504 199995 56856 -92616 -288828 -322556 -318995 -270272 -5203 72734
5830 72734 209802 203729 279143 380420 274254 129235 -37885 -78791 -82994 -140425 -248204
5819 -248204 -239100 -76226 -51899 -138872 -273281 -253500 -259579 -115623 -45391 -160332 -140512
5808 -140512 -104883 -153552 -139078 -97485 -177473 -262629 -223019 -31950 107518 23658 -88877
5797 -88877 -149856 -25749 5133 39261 55812 248039 382556 229690 86921 -18083 -151966
5786 -151966 -113822 -66302 -122869 -98859 -133600 -148333 -157901 -168988 -316567 -360144 -287962 -248782
5774 -248782 -280681 -168755 -90491 -77001 -69796 17292 -44661 -8019 46423 -12258 -125216
$$ packed form
5853b18125L9807J90477L7011j4276j21004k3473K0539j18N4534J7870M8362N9318
5841I0922l9763O9345P9491j43139j49472j96212l3728L561M8723K65069P7937
5830G2734J37068o073P5414J01277j06166j45019j67120m0906m203n7431j07779
5819b48204R104J62874K4327q6973j34409J9781o079J43956P0232j14941J9820
5808a40512L5629m8669J4474M1593p9988q5156L9610J91069J39468q3860j12535
5797h8877o0979J24107L0882L4128J6551J92227J34517j52866j42769j05004j33883
5786a51966L8144M7520n6567K4010l4741j4733r568j1087j47579m3577P2182L9180
5774b48782l1899J11926P8264J3490P205Q7088o1953L6642N4442n8681j12958
$$ plain form
5763 -125216 -217719 -231853 -242955 -109845 -12293 -99997 -77827 90643 -71410 -104221 71664
5752 71664 191165 83386 -145203 47920 24261 -39366 -148182 -34147 82260 177987
5742 177987 245557 230577 40217 -8051 -10312 -84553 -92755 -76038 -106828 -86516 -51093 -96424
5730 -96424 -159374 -83651 -16240 36088 -50293 -119570 -75722 -66574 -40911 -103987 -261647 -321575
5718 -321575 -345696 -299045 -204726 -110878 -24017 -19218 -116265 -58784 41055 105394 101417 14204
5706 14204 -129777 -231562 -74578 -15954 117768 167490 32230 -174668 -386846 -426500
5696 -426500 -377308 -278814 -224039 -149991 -280781 -466324 -424839 -270170 -180810 -77360 -46197
5685 -46197 23689 -85617 -26071 110946 149946 166882 189543 102137 157067 313467 360918
$$ packed form
5763a25216r2503j4134j1102J33110R7552q7704K2170J68470j62053l2811J75885
5752G1664J19501j07779k28589J93123k3659o3627j08816J14035J16407R5727
5742A77987O7570j4980j90360m8268k261p4241q202J6717l0790K0312L5423m5331
5730i6424o2950P5723O7411N2328q6381o9277M3848R148K5663o3076j57660n9928
5718c21575k4121M6651R4319R3848Q6861M799r7047N7481R9839O4339l977q7213
5706A4204j43981j01785J56984N8624J33722M9722j35260k06898k12178l9654
5696d26500M9192R8494N4775P4048j30790j85543M1485J54669Q9360J03450L1163
5685d6197O9886j09306N9546J37017L9000J6936K2661q7406N4930J56400M7451
$$ plain form
5674 360918 161484 17759 -26344 17161 180338 130556 145502 243470 189890 127523 -91363
5663 -91363 -103751 87966 -34677 -219485 -174957 -39405 -8223 -60163 -24563 -54968 -52195
5652 -52195 122850 168463 330475 277136 -3581 -117362 -67132 -6535 35819 -47833 -80902
5641 -80902 -92132 -167300 -118077 -54316 -61999 -74504 -104334 -148242 -315507 -226196 -290084 -293024
5629 -293024 -136672 -166977 -171843 -17755 18444 30874 50154 68548 49301 6126 17720
5618 17720 192266 345398 332645 266700 218236 163539 103945 108850 182746 246671 203889 23927
5606 23927 -149248 -262158 -191554 -214058 -209517 -356096 -386230 -381940 -273949 -281243 -211632 -227955
5594 -227955 -123798 -48379 -71437 -104609 -98263 -178824 -104313 -38434 -60090 144505 241759
$$ packed form
5674C60918j99434j43725m4103M3505J63177m9782J4946R7968n3580o2367k18886
5663i1363j2388J91717j22643j84808M4528J35552L1182n1940L5600l0405K773
5652e2195J75045M5613J62012n3339k80717j13781N0230O0597M2354q3652l3069
5641h0902j1230p5168M9223O3761p683j2505k9830m3908j67265Q9311o3888k940
5629b93024J56352l0305m866J54088L6199J2430J9280J8394j9247m3175J1594
5618A7720J74546J53132j2753o5945m8464n4697n9594M905P3896O3925m2782j79962
5606B3927j73175j12910P0604k2504M541j46579l0134M290J07991p294O9611j6323
5594b27955J04157P5419k3058l3172O346q0561P4511O5879k1656K04595R7254
$$ plain form
5583 241759 206022 -50413 -210368 -284692 -185332 -13357 -15303 -102768 36047 261424 290087
5572 290087 11651 -207481 -51610 163881 -76694 -168622 -5728 123924 77441 -117888
5562 -117888 -120377 -152956 -156708 -180152 -126729 -181048 -248319 -164223 -143894 -181085 -185017 -158520
5550 -158520 -5999 93922 140356 61889 -6560 102624 233984 123270 83637 -96608 -72172
$$ packed form
5583B41759l5737k56435j59955p4324R9360J71975j946q7465J38815K25377K8663
5572B90087k78436k19132J55871K15491k40575r1928J62894J29652m6483j95329
5562a17888k489l2579l752k3444N3423n4319o7271Q4096K0329l7191l932K6497
5550a58520J52521R9921M6434p8467o8449J09184J31360j10714l9633j80245K4436
$$ [...]
##END NTUPLES=NMR SPECTRUM
##END=
