##TITLE=Analysis number 323562
Compound Code cc 57809
Book Reference 449/166
Project Code adrs
Chemist Name davee
##JCAMPDX= 6.0         $$ Bruker NMR JCAMP-DX V2.0
##DATA TYPE= NMR SPECTRUM
##DATA CLASS= NTUPLES
##ORIGIN= Bruker BioSpin GmbH
##OWNER= nmr
$$ XWIN-NMR		Version 3.5
$$ Fri Oct 27 12:59:23 2006 GMT Daylight Time (UT+1h)  MAYBRIDGE\nmr@NMR_250MHZ
##.OBSERVE FREQUENCY= 250.131544655141
##.OBSERVE NUCLEUS= ^1H
##.ACQUISITION MODE= SIMULTANEOUS (DQD)
##.ACQUISITION SCHEME= undefined
##.AVERAGES= 16
##.DIGITISER RES= 18
##SPECTROMETER/DATA SYSTEM= dpx250
##.PULSE SEQUENCE= zg30
##.SOLVENT NAME= CDCl3
##.SHIFT REFERENCE= (INTERNAL, CDCl3, 0, 16.522)
##AUDIT TRAIL= $$ (NUMBER, WHEN, WHO, WHERE, WHAT)
$$ ##TITLE= Audit trail, XWIN-NMR		Version 3.5
$$ ##JCAMPDX= 5.01
$$ ##ORIGIN= Bruker BioSpin GmbH
$$ ##OWNER= nmr
$$ C:\u/data/dgb/nmr/ADRS/1840/pdata/1/auditp.txt
$$ ##AUDIT TRAIL=  $$ (NUMBER, WHEN, WHO, WHERE, WHAT)
(   1,<2006-10-27 12:58:59.01 +100>,<MAYBRIDGE\nmr>,<NMR_250MHZ>,
      <created by zg, POWCHK disabled, PULCHK disabled
       configuration hash MD5:
       49 4B E0 1D 92 C2 6B 37 9F E6 65 BC 52 41 86 1D
       data hash MD5: 64K
       78 58 D5 A7 70 72 F9 CE B0 20 8D 9F 93 35 92 C9>)
(   2,<2006-10-27 12:59:12.58 +100>,<MAYBRIDGE\nmr>,<NMR_250MHZ>,
      <Start of raw data processing
       ef LB = 0.3 FT_mod = 6 PKNL = 1 SI = 32K 
       data hash MD5: 32K
       C6 B4 20 DB B8 B3 7B B1 84 E2 4C A1 52 7F 88 7D>)
(   3,<2006-10-27 12:59:14.14 +100>,<MAYBRIDGE\nmr>,<NMR_250MHZ>,
      <apk 
       data hash MD5: 32K
       B5 AA E2 9B BE 31 F7 D9 55 26 E6 D0 76 BA 47 51>)
(   4,<2006-10-27 12:59:14.87 +100>,<MAYBRIDGE\nmr>,<NMR_250MHZ>,
      <abs ABSG = 5 
       data hash MD5: 32K
       E2 AF 11 FC 35 85 C8 73 6D 75 73 6D AB 38 9F 24>)
$$ ##END=
$$ 
$$ hash MD5
$$ 5A 93 D1 4D 25 84 08 9C D6 63 4B 78 75 2A E5 CE
##$RELAX= 
##$RELAX= 
##$RELAX= 
##$RELAX= 
##$RELAX= 
##$RELAX= 
##$RELAX= 
$$ Bruker specific parameters
$$ --------------------------
##$DU= <C:\u>
##$EXPNO= 1840
##$NAME= <ADRS>
##$PROCNO= 1
##$TYPE= <nmr>
##$USER= <dgb>
##$AMP= (0..31)
100 100 100 100 100 100 100 100 100 100 100 100 100 100 100 100 100 100 
100 100 100 100 100 100 100 100 100 100 100 100 100 100 
##$AQSEQ= 0
##$AQ_mod= 3
##$AUNM= <au_zg>
##$AUTOPOS= <27 >
##$BF1= 250.13
##$BF2= 250.13
##$BF3= 250.13
##$BF4= 250.13
##$BF5= 500.13
##$BF6= 500.13
##$BF7= 500.13
##$BF8= 500.13
##$BYTORDA= 1
##$CFDGTYP= 0
##$CFRGTYP= 5
##$CHEMSTR= <none>
##$CNST= (0..31)
1 1 145 1 1 1 1 1 1 1 1 1 1 1 1 1 1 1 1 1 1 1 1 1 1 1 1 1 1 1 1 1 
##$CPDPRG= <>
##$CPDPRG1= <>
##$CPDPRG2= <>
##$CPDPRG3= <>
##$CPDPRG4= <mlev>
##$CPDPRG5= <mlev>
##$CPDPRG6= <mlev>
##$CPDPRG7= <mlev>
##$CPDPRG8= <mlev>
##$CPDPRGB= <>
##$CPDPRGT= <>
##$D= (0..31)
0 1 0 0 0 0 0 0 0 0.06 0 0 0 0 0 0 0.0002 0 0 0 0 0 0 0 0 0 0 0 0 0 0 
0 
##$DATE= 1161950337
##$DBL= (0..7)
120 120 120 120 120 120 120 120 
##$DBP= (0..7)
150 150 150 150 150 150 150 150 
##$DBP07= 0
##$DBPNAM0= <>
##$DBPNAM1= <>
$$ [...]
##$SUBNAM7= <"">
##$SUBNAM8= <"">
##$SUBNAM9= <"">
##$SW= 20.6930455092707
##$SWIBOX= (0..15)
0 0 3 0 0 0 0 0 0 0 0 0 0 0 0 0 
##$SW_h= 5175.983436853
##$TD= 65536
##$TD0= 1
##$TE= 683.16
##$TE2= 300
##$TE3= 300
##$TEG= 300
##$TL= (0..7)
0 120 120 120 120 120 120 120 
##$TP= (0..7)
150 150 150 150 150 150 150 150 
##$TP07= 0
##$TPNAME0= <>
##$TPNAME1= <>
##$TPNAME2= <>
##$TPNAME3= <>
##$TPNAME4= <>
##$TPNAME5= <>
##$TPNAME6= <>
##$TPNAME7= <>
##$TPOAL= (0..7)
0.5 0.5 0.5 0.5 0.5 0.5 0.5 0.5 
##$TPOFFS= (0..7)
0 0 0 0 0 0 0 0 
##$TUNHIN= 0
##$TUNHOUT= 0
##$TUNXOUT= 0
##$USERA1= <user>
##$USERA2= <user>
##$USERA3= <user>
##$USERA4= <user>
##$USERA5= <user>
##$V9= 5
##$VALIST= <valist>
##$VCLIST= <CCCCCCCCCCCCCCC>
##$VD= 0
##$VDLIST= <DDDDDDDDDDDDDDD>
##$VPLIST= <PPPPPPPPPPPPPPP>
##$VTLIST= <TTTTTTTTTTTTTTT>
##$WBST= 1024
##$WBSW= 4
##$XGAIN= (0..3)
0 0 0 0 
##$XL= 0
##$YL= 0
##$YMAX_a= 487699
##$YMIN_a= -432714
##$ZGOPTNS= <>
##$ZL1= 120
##$ZL2= 120
##$ZL3= 120
##$ZL4= 120
##$ABSF1= 16.522
##$ABSF2= -4.171173
##$ABSG= 5
##$ABSL= 3
##$ALPHA= 0
##$AQORDER= 0
##$ASSFAC= 0
##$ASSFACI= 0
##$ASSFACX= 0
##$ASSWID= 0
##$AUNMP= <proc_1d>
##$AZFE= 0.1
##$AZFW= 0.1
##$BCFW= 0
##$BC_mod= 0
##$BYTORDP= 0
##$COROFFS= 0
##$CY= 12.5
##$DATMOD= 1
##$DC= 0
##$DFILT= <>
##$DTYPP= 0
##$F1P= 14.0000005364418
##$F2P= -0.99999901652339
##$FCOR= 0.5
##$FTSIZE= 32768
##$FT_mod= 6
##$GAMMA= 0
##$GB= 0
##$INTBC= 1
##$INTSCL= 1
##$ISEN= 128
##$LB= 0.3
##$LEV0= 0
##$LPBIN= 0
##$MAXI= 10000
##$MC2= 0
##$MEAN= 0
##$ME_mod= 0
##$MI= 0
##$NCOEF= 0
##$NC_proc= -5
##$NLEV= 6
##$NOISF1= 0
##$NOISF2= 0
##$NSP= 0
##$NTH_PI= 0
##$NZP= 0
##$OFFSET= 16.522
##$PC= 1
##$PHC0= -40.30794
##$PHC1= 3.284689
##$PH_mod= 1
##$PKNL= yes
##$PPARMOD= 0
##$PSCAL= 4
##$PSIGN= 0
##$REVERSE= no
##$SF= 250.13
##$SI= 32768
##$SIGF1= 0
##$SIGF2= 0
##$SINO= 400
##$SIOLD= 32768
##$SREGLST= <1H.CDCl3>
##$SSB= 0
##$STSI= 32768
##$STSR= 0
##$SW_p= 5175.98343685301
##$SYMM= 0
##$S_DEV= 0
##$TDeff= 65536
##$TDoff= 0
##$TI= <Analysis number 999999
Compound Code 99
Book Reference 9
Project Code 9>
##$TILT= no
##$TM1= 0
##$TM2= 0
##$TOPLEV= 0
##$USERP1= <user>
##$USERP2= <user>
##$USERP3= <user>
##$USERP4= <user>
##$USERP5= <user>
##$WDW= 1
##$XDIM= 32768
##$YMAX_p= 573546051
##$YMIN_p= -1393393
$$ End of Bruker specific parameters
$$ ---------------------------------
##NTUPLES= NMR SPECTRUM
##VAR_NAME=  FREQUENCY,     SPECTRUM/REAL,   SPECTRUM/IMAG
##SYMBOL=    X,             R,               I
##VAR_TYPE=  INDEPENDENT,   DEPENDENT,       DEPENDENT
##VAR_FORM=  AFFN,          ASDF,            ASDF
##VAR_DIM=   32768,         32768,           32768
##UNITS=     HZ,            ARBITRARY UNITS, ARBITRARY UNITS
##FACTOR=    0.157963299565203, 1,           1
##FIRST=     4132.6476996994, 0,             0
##LAST=      -1043.33573715361, 0,           0
##MIN=       -1043.33573715361, -1393393,    0
##MAX=       4132.6476996994, 573546051,     0
$$ Real data points
##PAGE= N=1
##DATA TABLE= (X++(R..R)), XYDATA
$$ [...]
17946 1089598 993286 949831 1239170 1309356 1258160 1256255 1201708 1284111 1048076 767001 710405
17935 710405 487430 141162 116949 -6416 134893 117110 351385 401364 568387 382778
17925 382778 295824 323015 554183 982913 1283038 1087929 1294116 1145305 765908 754317
17915 754317 668549 659582 639233 547996 326052 363042 453356 37455 40019 232292 383173
17904 383173 612098 436996 356635 264119 293769 225541 242876 331043 120823 -73073 363781
17893 363781 313124 129918 244582 259203 265692 230085 62189 283365 557201 337875
17883 337875 568969 658666 650536 663230 647348 696775 771614 901549 839294 450153 277175
17872 277175 392953 611334 754423 780089 634843 456427 565226 648412 671794 466227
17862 466227 333520 572452 700431 479740 302645 356623 411794 551543 321303 167503
17852 167503 261660 618250 797837 564991 458983 474569 528595 516851 304734 33609
17842 33609 9046 370326 564141 445661 411808 115812 -320770 -259272 -111724 -243189
17832 -243189 -447831 -245978 -126486 -182349 -11240 54791 -39165 -217143 93362 34072
17822 34072 -97572 -105093 -298136 -159396 56479 178825 447442 378284 214774 279000
17812 279000 -51520 -39213 116058 175928 392345 476097 470663 452258 522669 470943 380882
17801 380882 459364 325283 168049 60244 23632 153305 166528 216338 233395 407323
17791 407323 467565 255118 66003 220202 319752 452114 348086 186405 -102346 -431757
17781 -431757 -399719 95139 128669 129276 321078 517671 412088 227594 63949 -4510 -29208
17770 -29208 -321449 -469649 -373353 -126695 108239 224988 -106156 2664 93717 -392691
17760 -392691 -226819 -30662 -254511 -109744 -78829 -7568 169675 52979 107267 123123
17750 123123 159107 204021 138019 151106 288287 444127 374323 507788 460370 109976 -123903
17739 -123903 -509414 -830869 -958575 -683199 -164463 110676 300073 558924 800043 624652
17729 624652 285817 -145230 -58007 13356 -162346 478580 998280 607589 161817 27786
17719 27786 329154 514236 188729 164158 42331 -206314 -142285 -163129 -5031 200971
17709 200971 472888 243911 430413 599441 569008 614863 337552 44400 53369 -114646
17699 -114646 -31881 119438 301129 294605 134244 -40023 -227737 -26851 61707 373667
17689 373667 231658 157526 24191 122181 179637 372294 250219 278793 4779 -188070
17679 -188070 254754 46147 -370794 -305549 -64227 254346 39090 -30908 20605 -25175
17669 -25175 -61657 137570 258334 -43073 -390794 -381877 -192313 -271847 -126864 -95017 15432
17658 15432 2467 86115 165502 209511 427973 496782 536212 605058 835522 725866 339714
17647 339714 -92725 3392 -59896 -350411 -516232 -327937 -256512 -168500 -85769 102672
17637 102672 73088 39675 114683 196086 250962 354407 94602 -199345 -3591 474219
17627 474219 411464 94392 154193 210189 116795 -144337 -433602 -207055 88740 -58701
17617 -58701 -131100 -160935 -423348 -332672 -354747 -271507 -234957 71773 202128 103238 341042
17606 341042 235448 -19756 -161224 94776 180936 755250 711509 520278 659772 294820
17596 294820 11407 -49512 28631 250047 412705 530234 224839 277894 141900 8092
17586 8092 -144396 -350276 -399974 -320781 -147470 -54172 185408 472732 682720 567946
17576 567946 480803 746289 693315 652324 743804 426980 438471 685077 784294 251840 243650
17565 243650 139903 80700 375720 778979 666469 195552 345721 609700 689931 505828
17555 505828 531264 423973 358929 -97999 -28610 -182694 -547447 -511413 -101291 116324
17545 116324 139486 41780 375382 287767 53930 213240 -60003 -298624 234613 436836
17535 436836 431332 454214 633186 723067 726509 971704 699572 517728 370097 350949 507064
17524 507064 542986 329766 361289 329800 476940 337627 323579 510772 147106 -373585
17514 -373585 -873878 -889957 -469371 -112831 255469 354307 361049 99133 -98237 46027
17504 46027 195676 245523 118922 -126794 -203643 -206574 -152737 -121334 33241 5310 106024
17493 106024 -122481 -248386 -170767 2084 46205 78737 357847 691374 907302 1032401
17483 1032401 864011 606532 324750 323669 289719 29554 122149 91498 -68170 -192826
17473 -192826 -152531 -13024 279338 42311 -301194 -236640 117718 434702 597209 375707
17463 375707 134650 105182 374477 420555 284343 650132 464686 128689 290690 444535
17453 444535 431045 377634 242312 7505 -55999 170853 502030 464257 765998 1429213
17443 1429213 2423227 2600399 1903814 1247225 621107 284933 205911 502506 675694 700561
17433 700561 372964 233592 213051 468173 102923 -285366 -389705 -596158 -666396 -482570
17423 -482570 174601 194243 195333 285380 746661 1195479 954507 516825 373837 491835
17413 491835 26386 -424184 -354269 -112797 18659 -177467 77101 279309 -48780 93035
17403 93035 549919 729656 290461 92079 122254 -141249 59555 78207 11284 144784
17393 144784 -132358 -262540 -468607 13880 366040 419460 148100 94682 140280 -46729
17383 -46729 -228761 -409597 -231496 -132388 259971 186853 -40168 -168231 -198533 -362082
17373 -362082 -689312 -497180 -573199 -823549 -433017 -274880 -395315 33209 322705 240648
17363 240648 228788 353263 290172 178520 -10745 -56200 -22634 -62934 120218 203333 317884
17352 317884 324897 340724 -121629 -86276 -38344 -5139 217795 503414 370387 461670 496787
17341 496787 280448 442619 638411 454714 -98486 -24569 31005 95803 175911 -65149
17331 -65149 -453916 -469441 -285591 -138738 -61751 -259424 -177521 289329 722171 673872
17321 673872 76592 -342690 -478922 -467778 -165968 -35521 -475654 -736339 -919394 -826815
17311 -826815 -651389 -211588 249301 329080 221401 -107702 -217570 -469039 -750314 -716147
17301 -716147 -564085 -312098 -67193 -9710 -258292 -523032 -15209 332979 -15819 49166
17291 49166 156064 -203162 -93517 79119 172070 321192 421470 270842 397371 500934
17281 500934 483899 186850 -108737 -452135 -372209 -125130 278763 311764 235499 15204
17271 15204 -408847 -486853 -912678 -1233962 -1213807 -1064080 -705482 -261181 166308 -57897
17261 -57897 -336213 -180383 -118939 -27672 -335617 -711651 -603633 -68273 150844 -32541
17251 -32541 140947 -98333 -327568 -28555 222531 246976 124383 -1632 -159063 -60050
17241 -60050 260354 -91364 -174871 116458 96591 122393 7306 285350 163011 124836
17231 124836 123377 7768 -539485 -643158 -655450 -421634 -277442 -188229 -201913 -522439
17221 -522439 -529603 -139274 -100532 -321097 -191313 306485 96697 181087 229393 40903
17211 40903 -19782 -154155 -196696 64951 -185266 -198644 17605 47827 -95080 -83493 -339117
17200 -339117 -677233 -389492 -108362 -144533 -78929 -14003 51587 102887 280263 316182 66145
17189 66145 21002 264091 87273 215327 167247 -225390 -96943 122780 197883 -65157
17179 -65157 -49678 -173590 32487 78314 -345101 -226329 -434106 -314380 -305192 -414502
17169 -414502 -100107 16213 -216708 -229126 -121104 -225895 -299354 -190493 36514 189092
17159 189092 377698 542216 403733 281018 102442 263173 245165 191331 47446 -294114
17149 -294114 -599919 -516622 -435272 -487806 -443457 -359880 -154632 -144002 12831 250439 190595
17138 190595 18320 -214248 -268050 -82066 396372 409179 -128382 -159669 144487 259158
17128 259158 146738 136073 408464 441535 120638 14664 -204363 -610225 -215035 -29285
17118 -29285 2974 -237222 -38609 -56744 -54703 115155 235313 349495 500190 582272 301129
17107 301129 169068 51687 -90225 -151227 64317 95538 -191104 -104806 44142 236953
17097 236953 187250 -27293 -366752 -801688 -357384 -108887 21441 230018 -117001 -516131
17087 -516131 -574794 -418221 190129 190601 62734 190996 94420 -243760 -363913 -382771 -724219
17076 -724219 -814275 -568098 -137131 -130138 -89717 -45787 66251 -67473 -236966 -220766 -144137
17065 -144137 25152 -7988 -160800 64558 46579 -241873 -380069 -608079 -781954 -803214
17055 -803214 -514826 -359681 -257889 -429131 -373956 46051 263109 236719 56828 -289550
17045 -289550 -494261 -475055 -332518 -538901 -303214 -34213 320190 539092 453242 485551
17035 485551 183285 57770 -4949 -84438 -128554 119622 -8303 -159858 -57738 -39335
17025 -39335 336195 217370 -116976 157143 14143 -65937 8645 112417 52348 -108082
17015 -108082 -169945 302241 395420 157211 229410 -112808 -263296 -321067 -295801 -292311 -289073
17004 -289073 -465656 -592908 -572412 -461134 -339585 -368255 -735768 -743392 -461828 -186414
16994 -186414 -341150 -484992 -520566 -679991 -738650 -755708 -1059068 -1042104 -679685 -303599
16984 -303599 -109324 -139015 -506587 -557251 -225644 223158 229565 101233 66578 348430
16974 348430 454704 212604 211652 10516 -356482 -498745 -593636 -560777 -118870 -324620
16964 -324620 -358763 -117883 -282527 -223011 -135846 -110560 101801 235446 88455 89194 65287
16953 65287 93060 -35612 -314660 -132308 77620 109722 265154 650875 1016103 538595
16943 538595 36601 -135932 -316359 -444729 -443793 -353103 -88543 -124953 -12926 188250
16933 188250 -30758 -285546 -542410 -744093 -774573 -377065 -262033 -255883 -477766 -271126
16923 -271126 73682 -47962 -103067 45446 -109826 -97258 -153078 2490 -54225 44672
16913 44672 184083 188363 105482 -20940 -182164 -76821 -76365 86770 -35274 80421 136589
16902 136589 -178955 -272763 -219265 -221351 93996 165803 74879 -299235 -238943 -403403 -27945
16891 -27945 78126 341877 412737 125110 -26047 -307041 -321680 -343069 -351936 -598775 -319732
16880 -319732 -172906 -250716 -298566 -525552 -841760 -810732 -454358 -338391 -386630 -499364
16870 -499364 -2520 10475 222993 543015 475316 346018 277500 153136 220832 282085
16860 282085 52364 -97353 34029 123232 -209920 -532118 -420586 -288336 -216616 -157907
16850 -157907 -199639 -181829 -228106 -307494 -443138 -329294 22712 200608 333034 278902
16840 278902 15160 -132295 -407449 -555453 -349764 -374649 -329386 266676 633286 747123
16830 747123 488830 300247 215135 149452 151284 -53111 -132587 -283745 51911 167507
16820 167507 -129629 72798 40217 58462 -72374 118590 249601 105758 240384 488039
16810 488039 634145 313591 11695 -334457 -291092 -246078 -480510 -403007 -416056 -612457
16800 -612457 -423320 -522905 -802584 -615123 -610832 -550591 -349985 -260613 30941 215690
16790 215690 63662 82203 295119 505819 173772 -107983 -61507 218981 270867 -313682
16780 -313682 -533267 -468146 -166022 -148656 -140857 -392710 -667734 -391251 125960 282289
16770 282289 -136141 -150685 52582 292457 371405 253256 -231056 -470407 -592499 -614678
16760 -614678 -372275 -504652 -490034 -221989 -198538 -479538 -442647 -86353 -76901 -121656 41280
16749 41280 -29604 -177407 -110692 -20522 42270 -91957 -186388 -477199 -621646 -214375 -174784
16738 -174784 -198536 43304 -236566 -350879 -360783 -392449 -602760 -518746 -224976 196918
16728 196918 -30034 -454349 -451575 -219222 21859 104869 207944 -59949 -43413 -7813
16718 -7813 -468226 -707867 -485806 -262642 41443 185501 479703 663706 262117 291804
16708 291804 -107426 -152849 -23887 -123453 -131859 -259890 -364112 -283232 -392739 -816819
16698 -816819 -810107 -427886 -274538 -215314 12168 -88922 -126619 -224105 -274658 -58266 73249
16687 73249 -188139 -464579 -669325 -242662 92114 -211180 -581485 -302600 -331455 -424799
16677 -424799 -214940 -69895 512229 728308 444622 239955 182128 -50442 -158397 273476
16667 273476 623391 370286 110838 113603 479610 440520 377278 336555 468912 164838
16657 164838 161900 390403 329320 441288 245359 159403 476058 686227 327871 179304
16647 179304 154653 -116835 -417565 -214410 -241574 -178428 33406 228600 229342 143388 26812
16636 26812 191429 140558 248163 517349 552987 588733 658473 159497 217062 271514 73217
16625 73217 -152784 -82301 -347686 -477310 -146092 328835 365478 -154509 -554244 -443409
16615 -443409 -664694 -212617 -223096 -404850 -570495 -523015 -554091 -527316 -512166 -760170
16605 -760170 -369095 -406193 -808147 -731804 -602554 -539621 -323297 -371643 -222210 8933
16595 8933 43629 104795 -318905 -510304 -458369 -302578 50917 -47436 -11566 184107 268080
16584 268080 -11170 -14600 274139 353417 329785 298228 -129517 -114047 -127411 -72110 27451
16573 27451 -24229 -85383 -324835 -446799 -505889 -515804 -223089 34464 121913 228474 -8212
16562 -8212 111458 -83742 -463991 -405971 -32175 11895 -146782 -310722 -416583 -231127
16552 -231127 55543 10087 -164103 -150039 -179402 64159 192447 2796 109664 365017
16542 365017 110780 -284534 -240542 -197135 174780 650171 155999 -64946 39582 -632900
16532 -632900 -769115 -499419 -299024 142293 191845 416601 595060 569350 692438 254340
16522 254340 54628 -168579 -49339 34072 -111290 -45363 226889 270824 -186775 -1093
16512 -1093 443077 396961 210908 282578 35520 -151319 -198471 -401131 -643503 -294104
16502 -294104 -17945 164288 234171 191272 339046 161687 -122900 -66710 118036 -65246
16492 -65246 -218698 31175 226356 253391 -144802 -94062 334653 438248 116137 232617
16482 232617 67296 -113333 -140490 243127 703271 91344 -165441 -413528 -408264 -365647
16472 -365647 -531367 -331069 -128826 -225179 -212574 -516304 -831555 -911684 -541688 -342870
16462 -342870 -218666 44337 146507 261864 546285 210095 36817 75644 98760 198934
16452 198934 22803 8035 188251 112347 314607 215254 -83451 -221926 -207187 -219738
16442 -219738 -178889 41579 -183747 -588212 -470684 -438621 -683575 -721478 -457422 -286589
16432 -286589 -745976 -411494 -368811 -328226 -202229 146407 401612 464992 68851 -218262
16422 -218262 -205526 596 379319 510656 317745 182797 -90974 -349714 -68007 -258260
16412 -258260 -729196 -809586 -336068 140755 -127414 -174473 246507 500263 479997 -73061
16402 -73061 -542882 -829529 -631176 -132662 373757 294314 118748 -170752 -299667 -319540
16392 -319540 -175988 -394394 -100294 25740 6627 88226 203053 136365 -87371 -237649
16382 -237649 -171414 115570 429305 618806 466458 461088 179431 -50744 -208195 -133792
16372 -133792 146071 222418 -213182 -538286 -231454 308965 522880 190372 539 -314709
16362 -314709 -339505 64402 73188 108642 125576 170430 198196 158138 -143359 -356943 -154740
16351 -154740 -107173 -64414 227974 140617 -188474 -497535 -605725 -371444 -284736 -205328
16341 -205328 101430 313306 253908 177910 -196203 -233925 -15452 252810 93967 38626
16331 38626 -11255 -2625 -162559 -71237 -93956 -362630 -562494 -497100 -466094 -291002 -350825
16320 -350825 -174758 -40368 217310 -68752 -83277 -136033 -256253 -358080 -301086 -720476
16310 -720476 -745515 -682872 -518721 -248587 -282786 -482200 -471575 -452327 -619373 -449188
16300 -449188 -593664 -568517 -524073 -459504 -152829 7354 -52562 -109332 55150 138890 270984
16289 270984 25463 -247224 -331068 -526080 -415924 -171291 -204699 -591499 -587557 -348296
16279 -348296 -428547 -222364 74812 306111 111351 81585 270405 20599 -198693 -189027
16269 -189027 -215851 -390152 -108993 -64342 25533 155766 -245643 -224825 57331 93421
16259 93421 18157 255054 179965 -169824 -290151 -153174 -414331 -315695 -54952 -480312
16249 -480312 -592781 -181578 343100 187302 -288800 -356020 -485239 -216600 237446 361181
16239 361181 320533 613373 436556 80717 31931 140827 100608 128602 248784 -76019
16229 -76019 -47218 115379 73041 93131 -30865 -18289 2474 -162727 165644 13726 257490
16218 257490 535298 362154 151529 -46035 -131585 -297996 -59454 52439 -99514 27431
16208 27431 -11890 -185621 -106839 -495900 -291433 -230255 250826 305728 376017 455416 650259
16197 650259 648107 606682 191957 -93100 -208653 -399145 -582017 -567057 -585270 -129865
16187 -129865 -260493 -618798 -883395 -884702 -752848 -219832 -247309 -307477 -244272 -390323
16177 -390323 -138702 120855 -184751 -453421 -456922 -548263 -413667 124269 476427 189244
16167 189244 -169456 -282370 12998 -81353 -206997 -389651 -484970 -407715 96121 371557
16157 371557 342646 -44564 -378112 -235019 71045 2305 13843 212372 108349 274196
16147 274196 181534 128102 219683 -1137 -217482 -30316 193007 89342 33794 -54818
16137 -54818 -215445 77859 -3151 -565989 -203484 287953 276895 289476 146351 -127544
16127 -127544 -412807 -616171 -263263 -303553 -260568 6852 -230690 -403225 -407438 -4253
16117 -4253 -110276 14713 101316 90983 -232151 -121774 -186124 54690 602984 738918
16107 738918 613142 372333 72775 -344605 -192522 -272273 -166425 -69298 90298 354753
16097 354753 336677 28558 -275105 -373710 -353062 -461496 -742188 -200185 -65490 -263255
16087 -263255 -206477 -287288 -381942 -293502 -645215 -720077 -441326 -218777 -212503 -226654 -388709
16076 -388709 -148937 136853 205079 314391 136897 24621 -88326 -140869 93759 56499
16066 56499 -194369 -110347 -40238 57433 120187 -110197 -180141 -383073 -563824 -115847 -83599
16055 -83599 -321251 45659 57121 -183425 -18423 79106 380072 336613 -234452 -45547
16045 -45547 -238586 -371011 122585 363239 163733 302378 197154 -38968 89147 567559
16035 567559 109366 -255479 -18712 339278 256159 38501 -289854 -421201 -462786 -402817
16025 -402817 -362032 183427 253585 150241 294107 294505 101187 -114153 -225179 11506
16015 11506 56700 190143 422868 634595 400458 216162 240676 -406064 -545267 -146952
16005 -146952 141373 231471 -57350 -234342 -385397 -545190 -503052 -406846 -68185 -234203
15995 -234203 -207156 16477 18123 290910 187960 -42839 69896 -179986 -340115 -16829
15985 -16829 15059 65098 -66706 -64767 114404 438493 431234 253670 29427 302214 518795
15974 518795 461006 108836 13343 390587 630467 488255 369556 482093 320265 431121
15964 431121 271885 182545 237393 386476 785752 926036 735148 379355 -7010 182436
15954 182436 386166 245079 -134666 -186034 -440386 -460438 -297109 -256397 -653681 -903951
15944 -903951 -895792 -379773 282868 634158 652535 498234 582361 382033 113613 35272
15934 35272 301126 317578 237725 300461 73549 339611 482609 382181 385404 540079 597532
15923 597532 232409 -128603 -464838 -827969 -442365 -8809 93535 141666 -321828 -521347
15913 -521347 -564748 -598744 -588364 -324871 -300062 -363815 -248284 101449 196886 -73054 -282123
15902 -282123 -620542 -556752 -621073 -680378 -477646 -138589 -41211 133861 197270 -29294
15892 -29294 74875 544672 784902 597501 273544 -145332 -304357 -539544 -466469 -108077
15882 -108077 15189 199076 29570 -340814 -273200 -382918 -473459 -652430 -424355 10379
15872 10379 390962 276619 180644 92596 -22602 -157219 -99575 -205798 -419915 -336286
15862 -336286 -308654 -348072 -338509 -38858 83814 87772 -79601 -126943 259114 98864 -123148
15851 -123148 296026 233844 96305 167082 -11937 -127208 -89107 -33268 93429 51518
15841 51518 83270 -202894 -72739 -518222 -610064 -425033 -302198 -260135 -139770 -38574
15831 -38574 255269 180721 244813 279104 286610 67217 -338339 -398007 -503982 -645329 -238776
15820 -238776 -109641 -177948 -44340 -12650 -347838 -590849 -344439 -135133 -323783 -518083
15810 -518083 -260688 -132662 -33315 194552 37450 -99771 -526329 -444317 -262984 -50236
15800 -50236 212408 -72240 -349928 -276224 -208526 -15868 -62779 67351 -146607 -115072
15790 -115072 -107441 190152 -18565 -205091 -351637 -579545 -905216 -903852 -705429 -879030
15780 -879030 -870662 -179641 -173122 -684011 -728716 -625443 -624748 -585978 -460115 -396772 -432689
15769 -432689 -64493 -77404 52901 395123 199769 43223 133522 129955 129359 13140 -220627
15758 -220627 -528908 -61750 404591 452344 480275 326528 210111 190798 60935 -353873
15748 -353873 -635183 -510232 -464106 -316905 -291059 -255958 -133679 -314756 -449088 -375582
15738 -375582 -262338 -334833 -298313 -328620 -364370 -284907 -451652 -338478 -286951 -367160 -342921
15727 -342921 -36122 111862 -35985 -43175 -186202 -215918 -125827 -204387 -97273 -19068 42949
15716 42949 -92307 65532 15131 -139877 -295253 -13889 52703 -313443 -368682 313611
15706 313611 583485 40146 -488358 -498664 -425433 -584374 -280686 -72640 -321890 -437856
15696 -437856 -349718 -63828 -10873 -182270 -280825 -231393 -8730 -229203 -450847 -706272
15686 -706272 -647514 -355532 -276939 -69572 400051 386328 53128 -96517 -53968 -38901
15676 -38901 -65338 -267916 -421326 -518471 -532088 -507754 -436303 -325440 -480122 -488049 -446137
15665 -446137 -286051 -9826 -297027 -298960 -478947 -499599 -542954 -467808 -287349 152673
15655 152673 142450 -156801 -337707 -336922 -548921 -417168 -242560 -99608 -148630 -254285
15645 -254285 -324453 -413269 -476605 -320064 46968 -209010 -600385 -440315 -56275 -340994
15635 -340994 -690631 -969811 -726191 -453909 -112393 244394 130483 254493 -189917 -705087
15625 -705087 -390884 -306371 -138829 60269 6672 -43636 -60715 16522 5903 -120523 297329
15614 297329 453506 153770 136049 120698 -39223 -240874 -39470 114660 277349 415024
15604 415024 323949 505379 259489 -100360 7897 168194 28712 100741 -29575 -330699
15594 -330699 -173702 -189333 -286615 -242408 -75463 252501 395311 415932 299099 131213
15584 131213 85654 230975 621052 732245 944503 379579 92194 181557 37164 441308
15574 441308 577124 547561 701404 667954 495184 487832 481304 673089 33822 -66053 129462
15563 129462 11812 -262585 -192378 81628 121336 190548 109933 172808 90632 2816 70381
15552 70381 33851 -13621 -400327 -389147 -142012 -463402 -722132 -1025408 -809187 -462753
15542 -462753 -358958 -434671 -485154 -312329 -294862 -191044 -50922 -157086 -137839 -67590
15532 -67590 -384347 -508869 -360880 -22722 -268068 -621737 -658676 -574287 -536366 -163723
15522 -163723 -105260 189995 481524 314887 323109 305793 215550 255809 76299 80569 -161034
15511 -161034 -53482 52815 -265692 -367930 206147 361422 293212 -102162 -314901 -129168
15501 -129168 -140323 -150677 -299883 -270738 132540 392399 262532 282883 97226 -60547
15491 -60547 -275652 -272807 -140978 -12059 222115 162514 -396728 -938695 -694783 -616788
15481 -616788 -460230 -339514 -356827 -44630 172300 63289 156053 -343965 -584325 -382518
15471 -382518 -264807 -140640 509165 512792 35212 -305281 -10549 191500 166887 60044
15461 60044 113264 328265 217898 278353 363649 405143 495372 253553 -50417 -149252 10153
15450 10153 -69214 226299 124176 122867 -37489 -159117 -450824 -512281 -275145 132621
15440 132621 448735 508416 448152 -46656 143744 488912 270975 64041 -19914 -33287
15430 -33287 -195964 -355320 -234874 -35557 -127105 -22734 125113 -48115 14999 -50484
15420 -50484 -130614 14781 21877 -68628 223900 265366 -67941 38422 -45510 -294603 -420846
15409 -420846 -447394 -484000 -308572 -267261 -407710 -397283 -504124 -509012 -334174 -178569 -226259
15398 -226259 40931 140530 186264 106881 282310 356365 163537 282210 245002 88748
15388 88748 76869 -282325 -11524 303276 262845 -385521 -695781 -636599 -441325 -389695
15378 -389695 -399248 -358949 51515 121566 115788 547009 834663 333387 -6620 -1096 42266
15367 42266 250869 98497 113229 -63938 -153379 -174651 -424258 -440907 -535884 -562407 -294545
15356 -294545 -92092 50543 -44203 -135899 -279274 -28486 135744 44234 53616 153413 -44424
15345 -44424 -240905 -22337 60514 142734 160915 117884 76944 63576 271137 395864 428044
15334 428044 471138 396158 477943 587505 348723 544025 457873 235136 2679 -117064
15324 -117064 -169400 5305 262960 24704 126761 396256 703760 858895 734037 294889
15314 294889 379891 482299 559247 404546 152994 156733 287046 469320 600553 387739
15304 387739 235818 74869 199729 454715 40044 -261824 -328690 -189723 -266154 -188054
15294 -188054 -180863 -102526 -119386 -256289 -135099 66922 284617 -40849 -318551 -568924
15284 -568924 -532411 -384061 -261897 -147771 -4450 194780 166783 177300 -138061 -292890
15274 -292890 -413122 -291933 -440693 -489523 -311322 178 -255465 -472243 -144988 149342
15264 149342 214681 65041 -95072 125391 341482 -12630 -554474 -570666 -493198 -299138
15254 -299138 44065 -227545 -43707 -114191 395845 788720 774522 481462 174670 141362
15244 141362 179867 474988 471127 194531 -121061 -231018 -149077 -20632 -188249 -184940 74910
15233 74910 211422 160170 -117193 -188431 195482 51638 824 -157607 -244056 -210227 -245913
15222 -245913 -150433 18701 161870 78290 107449 -225160 -259793 -160086 -203077 224705 918546
15211 918546 746023 366021 475956 524205 318546 230961 62712 -80756 174314 41308
15201 41308 -106910 -62836 25389 -58334 -304869 -423882 -21805 178598 -146195 -351695
15191 -351695 -366998 -543325 -574270 -498218 -367676 -577452 -497402 -587478 -780010 -425537
15181 -425537 -152824 -406135 -359836 14728 243518 247212 -79293 -165793 -95409 -131742 220779
15170 220779 379496 -122944 -401118 -236427 68640 153515 -43836 -41226 127414 128452
15160 128452 -71138 -129639 -200572 -167546 -96805 -140638 -271847 -288080 -216652 231747 387999
15149 387999 66985 48183 39052 50987 -50854 66665 -48865 -118216 146442 249523
15139 249523 288701 -241677 -324514 -199308 -571074 -439064 -425499 -189734 -151797 206980
15129 206980 352898 252683 13002 -350691 -478265 -207644 -229418 -241655 -276394 -103120
15119 -103120 85665 -138672 -422249 -266043 -307542 -3364 538953 483369 228886 177440
15109 177440 260830 450102 398754 73332 48709 258326 255574 468116 284527 -42293
15099 -42293 -526552 -370461 -130666 -2874 -62865 -107737 -315819 -21302 151588 -10653
15089 -10653 -65106 -71598 198838 455688 496433 129294 -138345 -224533 -395818 -121888 17463
15078 17463 50744 -132492 -592953 -751540 -579212 -705541 -461197 -291712 -337626 -125762
15068 -125762 -143443 4246 106366 -37743 -290514 -84480 -113928 499197 618338 45716
15058 45716 63825 -164838 -471353 -192406 -137134 -106701 -528177 -525514 -60108 462624 492433
15047 492433 333839 71611 82615 360890 313069 260911 289757 173282 102405 219543
15037 219543 189135 166282 -21444 102330 162179 263824 247096 -62119 -518929 -693022
15027 -693022 -314417 -262722 -324393 -290065 -598831 -695953 -977999 -761986 -237505 -242229 -419133
15016 -419133 -733577 -514619 -272902 -288621 -67353 65860 154577 291775 315911 -62271
15006 -62271 -135193 16362 138986 23349 283065 233177 28437 -213994 10668 84531
14996 84531 -113818 -210932 66392 154099 548624 319197 304106 322764 463053 -131312
14986 -131312 -317502 -822102 -839295 -960412 -1106853 -1007613 -644869 -688435 -534310 -409116
14976 -409116 -247354 -359650 -555202 -390843 -359066 -532147 -505629 -533191 -663806 -843998
14966 -843998 -912919 -670830 -362682 -456256 -488277 -493648 -524049 -270647 37078 -26700 -234236
14955 -234236 -154021 -316184 -339686 -29056 128214 125926 117059 104525 253444 347032 195532
14944 195532 87250 -19170 -459496 -633229 -589476 -441793 -455496 -211637 223901 42773
14934 42773 -96839 236154 223784 87476 -13416 71372 -139523 772 542531 417466
14924 417466 188861 215168 331522 439223 152634 71111 1961 -209491 -281898 -312463
14914 -312463 -314335 -599833 -734542 -704613 -632863 -529160 -263337 -127274 -10365 -87055
14904 -87055 -49192 -62839 -43230 -104474 -247695 -421866 -434336 -376297 -276979 108934 509622
14893 509622 388618 431036 55619 -81220 -288282 -223742 -69142 -302527 -280085 -203068
14883 -203068 94122 69461 -229264 -326173 -86740 -202712 -471545 -468835 -574469 -382396
14873 -382396 -373457 -177030 -381216 -592496 -428731 -435773 -648331 -390163 -185372 -182102 -77271
14862 -77271 -32886 -179644 -112174 -584673 -495861 -393017 -404023 -384868 -484329 -137669 56518
14851 56518 -295882 -118069 -128737 -126633 22829 -42452 -262284 -162867 -132080 -114744 -99342
14840 -99342 -358256 -518780 -489371 -344994 -548408 -811903 -417084 -343597 -217084 243346
14830 243346 197573 -26442 -330251 -301873 -342938 -358291 -226722 43486 30850 -56604 -98789
14819 -98789 -94248 236471 227167 187461 499378 269528 46407 92660 313160 540504 706090
14808 706090 639577 293186 -325384 -395006 -236648 -262497 -166831 -212000 -540344 -455563 -598575
14797 -598575 -528984 -60488 312680 95332 -6539 39057 11644 -100479 -300046 -276182
14787 -276182 -216556 -353890 -274825 -219256 -299880 -352914 -326444 -128155 29126 122281 -193546
14776 -193546 -134093 1035 -61403 -260152 -209870 -178814 -193913 -213138 -116750 -180451 -100903
14765 -100903 52440 89173 194206 504546 157109 -314810 -411341 -509474 -374026 -915
14755 -915 -230520 -535540 -280489 174825 324010 259487 -193413 -651161 -791687 -454325
14745 -454325 6746 323214 445670 418743 174879 -61084 -22510 27215 27442 273927 214077
14734 214077 155140 -53285 -100773 43169 249063 440604 270747 187591 721279 1155703
14724 1155703 1509234 1544966 1291201 1254782 1410428 1145503 966651 989381 1218573 1050470
14714 1050470 631254 603918 452234 248623 104700 41443 66500 7132 -89936 217571
14704 217571 353154 343542 269622 318986 319174 -139072 -192631 -271338 -395723 -292778 59859
14693 59859 141107 417683 803540 668269 1084611 1623894 1268503 957710 967315 1006427
14683 1006427 1125081 1214864 1180310 728783 756819 1079155 675681 458807 451892 412802
14673 412802 195717 389584 604136 566079 111842 -227647 -242564 11482 -37836 -124037
14663 -124037 -236731 -4839 646735 665883 566099 225318 126689 -32578 -314821 -567788
14653 -567788 -509500 -465724 -513250 -594402 -525179 -677037 -775641 -170287 52640 -28266 -66871
14642 -66871 13920 -77821 -124124 127571 147408 27903 -29480 177469 101007 -28388 -509375
14631 -509375 -425014 -171431 -265637 -92685 117099 175616 194505 263913 181711 -272036 2471
14620 2471 16590 -257439 -151315 -172034 96589 384645 86676 -68906 -101514 -698935
14610 -698935 -650829 -262641 -128666 -160779 212772 -18201 56891 -120564 -262543 -639687
14600 -639687 -557256 -67353 215914 251013 320346 692007 833633 605129 296526 -49364
14590 -49364 -249658 -7298 70198 78697 38108 -88933 -85596 96221 106027 -81979 -171118
14579 -171118 -112394 44135 295827 491044 391318 497620 761930 688595 453739 397046
14569 397046 353220 139260 -85534 -191538 -33908 -71915 175 -81003 -253224 -161869
14559 -161869 114345 353406 251259 411469 408766 212138 275511 474741 -5365 -402503
14549 -402503 -193751 -65921 -45250 27788 1249 15016 -137331 -362694 -419006 -465042 -576035
14538 -576035 -566343 -510383 -147418 -114274 -218192 -188691 160971 -69737 -123521 -329431 -499146
14527 -499146 -277580 -255050 -412574 -321763 -41562 172177 124977 -153206 75710 200999
14517 200999 149523 266241 350208 268020 -43493 -290806 75508 321661 112995 -22509
14507 -22509 223149 446483 325983 18180 -245222 -308532 -555041 -275813 -56789 -74091
14497 -74091 -381373 -136180 4819 306361 361455 -156935 -257252 -389727 -130519 91076
14487 91076 -178281 -122956 75134 12311 -339839 -205728 -28324 110493 160031 28009
14477 28009 13998 -105737 255494 396113 270599 -32457 -443489 -219167 180856 364619
14467 364619 249712 422681 654715 735403 288944 99522 156804 247582 107073 -313462
14457 -313462 -252030 228984 230936 230439 464978 352309 262929 330601 679277 360759 155366
14446 155366 42714 -220192 -246101 300140 474417 829014 820484 715024 784090 931329
14436 931329 311425 -25612 85194 -104540 -279032 168710 353584 318854 395400 564997
14426 564997 420325 560404 852489 895886 932501 361658 386426 786841 766807 585515
14416 585515 565144 433950 17449 -104551 -444292 -179851 112430 114466 157460 695153
14406 695153 605020 470174 648129 545669 346496 264259 320125 108717 166365 284660
14396 284660 216423 41008 339414 408414 238334 51034 351282 469915 593315 554709
14386 554709 487734 565694 689020 922244 681565 549145 679422 1051351 878913 530853
14376 530853 343602 457706 273169 221990 484681 336429 307018 396363 501883 580267
14366 580267 483413 98845 226195 505878 814565 734731 634828 768076 1068105 1110486
14356 1110486 1247971 925634 742679 838758 878594 770429 734070 677845 525476 781126
14346 781126 1091425 1173786 1175936 775496 484534 717172 732101 559577 726907 1041067
14336 1041067 1063747 708236 762111 944647 897453 866152 669451 1173285 1064581 1119861
14326 1119861 999242 1125330 1133833 1089467 1578440 1902083 1872033 2187418 2320474 2100939
14316 2100939 2072241 2304614 2523369 2496019 2405630 2552560 2874332 2740165 3022254 2965446
14306 2965446 2981292 3328408 3822066 4006464 4140822 4414443 4716051 5017917 5317694 5337222
14296 5337222 5997981 6797410 7357323 7661645 8141552 8930451 9832832 10893760 12071160
14287 12071160 14211094 16534494 18838995 22083591 26045829 30185202 35602929 42859950
14279 42859950 52618128 65475403 82278037 103411326 128822914 157846603 187483182
14272 187483182 215433351 239089105 255451205 262858778 260232796 248140666 228379724
14265 228379724 203740054 176531852 149619561 125245357 105237152 89511714 77719084
14258 77719084 69053182 62316450 57039735 53369773 51144720 49257560 47886440 47049562
14250 47049562 46665927 47216057 48850564 50935973 53677305 57703821 63639450 71781191
14242 71781191 82517453 95765672 113153172 136002628 162458693 191143238 219967672
14235 219967672 245695594 265761925 277434008 279040488 270575501 252549738 227294853
14228 227294853 197961315 167133866 137627054 111684976 90090061 73508514 61324774
14221 61324774 52337926 45746699 40458558 35945503 32130505 29270396 27046580 24679145
14213 24679145 22492799 20609714 18892467 17649612 16090079 14909702 14123914 13283115
14205 13283115 12377385 11479517 11109351 10771640 10324406 9558196 9133642 8706876 8009881
14196 8009881 7670777 7686798 7648867 7210398 6642684 6406765 6043678 5733656 5776986 5545742
14186 5545742 5362443 5027388 4540220 4537428 4320258 4244105 4311530 4293845 3873084 3849945
14176 3849945 3601173 3372512 2928962 2698737 2781272 2992090 2826527 2445420 2557829 2583014
14166 2583014 2704719 2698741 2631960 2413352 2171143 2187635 1951012 2181074 2251847 1736435
14156 1736435 1462751 1760971 1591552 1588184 1842905 1921957 2130092 2024297 1850733 1798944
14146 1798944 1824585 1825921 1854372 1856996 1923734 1803009 1774834 1745619 1576780 1467879 1106793
14135 1106793 668611 813286 990020 874901 695262 1103498 1373732 1500068 1367103
14126 1367103 1078800 1247163 1271321 916790 740804 541798 764340 897092 956158 1105878
14116 1105878 834055 694341 986971 750992 537417 737396 667395 933871 1080416 1269568
14106 1269568 1225071 1000950 802178 1129298 959733 362715 -134547 -171525 88650 405625
14096 405625 221591 333141 417741 137985 -135768 -89643 -253164 -438935 -356665 -290252
14086 -290252 -40730 236806 308181 634742 1051027 765059 562969 458728 -86397 -128444
14076 -128444 43420 -198035 -352853 -335351 -154877 31835 -161573 -423562 -476676 144876
14066 144876 385400 249494 112162 -9207 58546 -197623 -482505 -553248 -776868 -428731
14056 -428731 -126188 179802 384215 421535 -48877 -396516 -716177 -595238 -451802 48085
14046 48085 88008 51277 13985 46043 41158 31159 271744 196807 281858 437755 351915 355108
14034 355108 214290 115214 180346 95999 116891 83211 191257 301243 392648 549929 457836
14023 457836 13437 67607 125778 101319 97475 18774 -105305 -279924 -555201 -679024 -512496
14012 -512496 -376918 -1860 231394 265487 200669 295865 371562 66195 -49949 189199
14002 189199 -3342 -132461 -74392 287434 242266 -146534 -254712 -114198 350516 584053
13992 584053 296576 38767 22490 -67023 56969 44662 100169 -182080 -503406 -169192
13982 -169192 398979 183901 -336105 -14376 102311 212933 318998 64435 118180 239585
13972 239585 301621 452592 562725 526080 435587 130434 -191116 -6234 91295 4711
13962 4711 -413156 -484867 -112657 105452 -72642 195721 475936 255489 -11021 -82109
13952 -82109 50732 -91210 -258050 -366057 -235547 -201613 -558111 -706447 -531711 -245563
13942 -245563 -2536 105548 237173 114771 334345 542580 127207 -19038 205223 835722
13932 835722 823580 347299 141620 404074 151618 70026 271573 630368 728964 444048
13922 444048 92765 165616 302819 -10996 -469148 -194286 -105030 -108224 -190579 78158
13912 78158 -111885 30401 141773 -243658 -27885 -158594 -5529 64386 -36363 9341
13902 9341 -450330 -391293 -33992 34127 10773 -78552 -236816 -106913 -315906 -146666 142223
13891 142223 185785 -28319 21703 140878 -49980 -258310 54689 241392 -84669 -281673
13881 -281673 -435360 -265485 -388504 -640914 -497073 -581764 -235006 -162473 -181609 -273423
13871 -273423 96475 15937 132561 101960 70108 108815 -22545 127568 123443 295086 210031
13860 210031 -10722 -326504 -129077 -425881 -554059 -305086 -241048 -278805 27563 403640
13850 403640 505247 310925 224583 133432 190358 97335 45829 573759 674628 367969
13840 367969 198138 332206 163459 324982 221283 137063 -111244 65260 147079 12777
13830 12777 83470 -48483 -82914 -249102 -149684 -313077 -765471 -525301 -320703 -145174
13820 -145174 -4206 -124555 48930 309547 314697 716492 1348347 1523448 1614130 1643101
13810 1643101 1524784 1486869 1481354 1575916 1532357 1225064 966503 607766 329354 357395
13800 357395 106120 9660 223474 -7665 -397061 -273233 -386798 -334372 72742 137627
13790 137627 68545 -228168 -203342 -115800 -339783 19069 129284 257043 423222 658449
13780 658449 599071 756656 905008 1043639 1213192 1556052 1763362 2034708 2206732 1999769
13770 1999769 1551890 1395114 1748766 1571152 1181602 973174 515482 353380 335566 224405
13760 224405 348501 404009 163911 409735 615654 766796 431791 226336 415012 266840
13750 266840 132896 -4756 -158782 -102867 -71703 11622 360110 514763 421118 503846
13740 503846 439205 127600 -56276 114499 -130925 -67665 -81356 -12173 54152 -4388 113135
13729 113135 10538 -332357 -399497 -249511 -253180 -298081 -177955 63341 350717 272013
13719 272013 27397 250369 273954 -50848 203845 496507 422629 137528 156091 228615
13709 228615 497673 465540 440143 261528 -215565 -229418 321056 460916 435665 402665
13699 402665 326424 154913 -35248 -262151 -269000 -27783 357779 181036 48338 -246452
13689 -246452 -384022 -371558 -186318 -433831 -204946 -55526 234206 374138 -56292 -214653
13679 -214653 -407677 -239300 37565 263814 69146 -148100 -197316 256677 599019 550559
13669 550559 152120 -215292 -286346 -383007 -400180 -600621 -397316 -123019 16248 321357
13659 321357 332543 42578 -105383 -81236 89874 9879 -420466 -466389 -414775 -299342
13649 -299342 -307567 47428 -53884 -179792 93075 30692 -130764 -41927 235667 384282
13639 384282 158609 -93441 -320793 -64425 -354282 -445879 -425682 -223502 232706 595766
13629 595766 386252 273291 354322 349047 164076 282082 172175 -36495 -331817 -270366
13619 -270366 22036 53805 -61755 -36688 197722 101460 15354 321962 684170 279323
13609 279323 -224748 -329454 47987 283512 178489 -61978 -240701 -436186 -217517 -45634
13599 -45634 -103481 -415795 -679069 -679821 -605127 -265687 -63582 -116090 -60860 -167894 -216081
13588 -216081 -94135 -28378 128054 178806 -218673 -458414 -59888 -49594 -331858 -173523
13578 -173523 -314728 -193860 11300 101894 -85307 -305547 -291618 -226226 -321789 -423888
13568 -423888 -203845 -2087 -36894 -115737 -228856 -362286 -429389 -150250 -63648 31183
13558 31183 217696 84108 327801 695505 576495 65449 -461210 -398131 9570 105958
13548 105958 -41583 -126976 68359 59706 8213 -39692 -269563 -224311 71218 -119740 -155509
13537 -155509 233342 324820 -76370 -659607 -600632 -334690 -308694 12708 -106853 -5035
13527 -5035 445126 290586 -212879 -104469 -146782 59578 329207 492697 202664 -19636
13517 -19636 -54468 298433 109577 -496369 -447797 -360501 -376278 -360874 95630 247523 271773
13506 271773 -128900 -18778 160129 293706 415776 269586 321379 222472 184269 312494
13496 312494 272562 35511 45216 64330 -7570 -199154 -82916 81812 -216852 -155729 230854
13485 230854 176897 122492 351087 124500 140505 -997 193443 273047 459623 692938
13475 692938 513418 30346 -210729 -438193 -513968 -111084 8586 36267 493760 559683
13465 559683 414924 270069 364429 763434 688765 612570 610639 74081 -518904 -268465
13455 -268465 171512 651610 852876 716016 280656 -29814 37585 34620 -536057 -970321
13445 -970321 -737563 -250428 158711 129487 21484 -262729 -540619 -499249 -498730 -633648
13435 -633648 -563039 -241614 407247 297237 -50090 -406701 -124730 230586 -90782 -241782
13425 -241782 -323393 -288020 -435424 -665665 -500040 -344679 -531678 -618081 -145166 -275812
13415 -275812 -496374 -636666 -330753 -6395 -212282 -291349 -343375 -298047 70424 136321
13405 136321 162603 -49918 -309480 -714281 -810538 -800978 -923944 -661249 -412913 -183026
13395 -183026 124556 265710 -699 99848 497460 255569 161315 112039 731 -217169
13385 -217169 73575 222101 147937 244183 143747 165194 341782 454087 341724 525589
13375 525589 -10558 -407613 -362369 -167190 65331 41246 283062 420762 322987 437183
13365 437183 339034 124224 -112391 -221264 -405577 -106782 324924 240354 340853 672787
13355 672787 628705 439131 -76115 -181862 -76190 -246783 -501500 -486490 -393323 -339541
13345 -339541 -265387 -76309 398643 178487 101222 -20645 58577 304268 160003 -129449
13335 -129449 -120278 33299 -105998 47261 138224 -6549 -306182 -164023 -167440 -151192 199318
13324 199318 257243 -86739 -490622 -56925 324402 280818 -141304 -263203 -293940 26428
13314 26428 204848 16688 -198737 -455595 -224257 -24073 139835 135977 7229 -180803
13304 -180803 72010 335120 195737 -53853 -116096 413918 689056 743343 728622 328039
13294 328039 195591 676825 781902 167733 43866 103766 81553 174633 3508 160250
13284 160250 547691 380227 261611 269467 406169 316276 30079 54519 -126219 -147531
13274 -147531 -79781 -260998 -551682 -494323 -145589 -289224 -292677 -403954 -398629 77720 576013
13263 576013 617458 606116 398623 427955 647137 541152 524923 359021 26083 -202651
13253 -202651 8749 294374 393024 512576 424008 342782 318935 594362 513623 963377
13243 963377 1442587 1457980 1518626 1350326 986561 886059 1003692 695462 382141 316652
13233 316652 591140 929544 1049613 1092976 1359753 928228 852551 863397 803275 526242
13223 526242 794597 899321 769172 1140839 1155475 1085653 1303907 1458779 1759227 1897455
13213 1897455 1946548 2172835 1980326 2186733 1975857 1673207 1675352 1623778 1456017 1179461
13203 1179461 1012284 917801 931631 904036 1277166 1308794 1171336 1151321 1398302 1412815
13193 1412815 1256617 859174 1039254 829128 586718 692283 959253 1390793 1484566 1656575
13183 1656575 1619446 1799134 2020033 2107922 1904819 1522837 1157069 420058 348121 731427
13173 731427 677790 604739 731855 636020 776477 740385 595427 311133 108432 246061
13163 246061 322687 109958 65885 244876 360127 579754 456758 223874 142363 172345
13153 172345 364256 129356 -113658 -159618 100554 255605 244218 -222914 -162103 176095
13143 176095 100109 132150 202477 176527 219211 119152 170585 303790 468008 389803 492210
13132 492210 656681 964873 816892 355527 438481 479832 297776 469628 217193 370552
13122 370552 601221 736939 559343 139789 124024 150269 -10039 284379 237199 25122
13112 25122 35527 9434 -346922 -543229 -498073 -160920 78111 -103574 -60587 -6165 343587
13101 343587 382967 499548 616333 364663 298247 544865 721068 431878 64057 -38375
13091 -38375 53310 -16249 239896 257428 325182 233876 251072 173147 315282 352557 179467
13080 179467 -4840 -206645 -192927 74884 269208 211520 854 -150833 -99010 -132934
13070 -132934 -80813 409974 443034 290939 282823 271302 329771 37383 -174643 5355 183361
13059 183361 -75255 -135174 -39750 -39838 -7462 375359 396657 377294 108436 204439 214657
13048 214657 19147 169590 332318 364528 612595 825092 677109 242361 -125202 25910
13038 25910 318989 351113 370498 151117 50892 321600 426043 458386 599979 608600 352734
13027 352734 -40996 -288577 -5850 87494 -5071 151563 222281 647389 1112979 1188404
13017 1188404 1095336 1125920 1234360 926542 734520 681383 884141 955789 1081415 1139884
13007 1139884 832626 539255 635725 599678 483340 356326 79658 229746 385135 632511
12997 632511 531936 477895 397249 544927 847409 706465 267764 510731 848979 753674
12987 753674 651102 937210 1118050 1024154 1134927 1161226 893052 560445 421209 563895
12977 563895 742450 778665 791501 876838 869418 1184214 849685 456279 491461 411062 183260
12966 183260 166403 283372 471292 591637 848638 512403 425167 721949 788592 789247 1092128
12955 1092128 720779 609909 1116753 1127275 962196 981744 1104087 972151 821663 594277
12945 594277 408259 393951 88114 -79333 498301 799488 730955 851156 715551 458608
12935 458608 412079 362765 383992 588028 1191477 1197479 911284 592267 687403 896308 966858
12924 966858 894264 935310 1336745 1356827 1280814 1478365 1376720 1227758 1643411 2001529
12914 2001529 1847381 1868415 1847693 1958887 2104076 2099937 2312598 2225735 2121314 2115046 1868607
12903 1868607 1543763 1315957 1283266 1241108 1562986 1531060 1570017 1630944 1614168 1450280
12893 1450280 1163755 1327218 1913206 2211377 1883471 1629672 1642778 1828521 1910007 1802788
12883 1802788 1696155 1529637 1543052 1324545 1146699 1557060 1652729 1601240 2175465 2050655
12873 2050655 1883518 1720504 1950065 2307008 2481172 2466849 2004789 2207900 2552695 2913394
12863 2913394 3187956 2870090 2901408 2896544 2712056 2637648 2512096 2732177 3086300 3028856
12853 3028856 3220477 3136321 2776158 2953705 3287204 3723258 3899146 3880684 3955076 4166464
12843 4166464 4550431 4857723 5413494 5504688 5271516 5559422 5974253 6166052 6339269 6485498
12833 6485498 7304844 7403212 7799559 8309132 8683823 9463592 10382500 11180506 11949969 13385447
12823 13385447 15107819 17107957 19451241 22579409 26168523 31330757 38043311 46757402
12815 46757402 57676204 70482877 83429162 93906736 98233931 94986649 86162784
12808 86162784 75531878 66098168 59053172 54590403 52497483 51692142 52664765 55492199
12800 55492199 60121007 66661090 75671556 88365457 106360105 130605049 161750100
12793 161750100 200284638 245399858 292125009 330149568 347719484 338041487 307075815
12786 307075815 267927897 231189246 202049625 182449483 172525375 172167094 181809716
12779 181809716 201835022 231838827 270315727 312835913 349855223 369970088 368408534
12772 368408534 350977143 327433842 304748204 287504657 276550607 273018321 276771837
12765 276771837 288602871 306683307 328412378 348601058 361899174 363800667 352452430
12758 352452430 330759662 304179262 278598406 256988781 241580254 232572619 228906973
12751 228906973 229520784 232871219 236956838 239686776 239027579 233317846 223173307 211072396
12743 211072396 200158603 193981169 193924688 200145322 212220595 228432599 246798659 266997712
12735 266997712 290868915 319484083 351133759 377903469 388546117 374758630 336245675
12728 336245675 284277817 232072662 187595760 152319570 124735072 103648982 88122297
12721 88122297 76782927 67535110 60555071 54930901 50493184 46979624 43354444 39719853
12713 39719853 37004980 34017515 30994755 29223554 27855820 26274861 24672386 23430670
12705 23430670 22167755 21311041 20154273 19010681 18440251 17854542 17030250 16182244 15140539
12696 15140539 14647385 14010977 13368328 13032298 12545038 12019681 11347541 10977451 10898287
12687 10898287 10839608 10368875 9898620 9490369 9358908 8877996 8524307 8182925 7598467
12678 7598467 7234807 7294335 7070533 6773140 6638352 6550548 6550053 6245069 6004953 6043212
12668 6043212 5882087 5553512 5608339 5603400 5341814 5166760 5362183 5290356 5006268 4899142
12658 4899142 4707082 4496511 4185500 3745214 3641166 4197222 4497784 4066863 3902943
12649 3902943 3837134 3857533 3723850 3233950 3392921 3789379 3792487 3781478 3758438 3759629 3306744
12638 3306744 3074183 2823305 2886455 2973022 3223758 3202180 2834194 2699868 2941454 2803213
12628 2803213 3023740 3169756 2602750 2302155 2344602 2255134 2175187 2212976 2296911 2139746
12618 2139746 2348065 2414664 2443898 2694018 2789661 2710002 2647656 2666490 2482158 2282085
12608 2282085 2457876 2481027 2315384 2141871 1993926 1326689 1231954 1398103 946571 583193
12598 583193 267364 437373 516280 652552 588305 673772 1012195 925389 798113 618260
12588 618260 856038 602693 490028 785730 741659 906858 694148 488027 313126 344568
12578 344568 468535 640862 496386 615967 755094 693431 356297 237710 365891 614124
12568 614124 871314 878817 775825 569782 408845 367861 336591 125630 199365 668298
12558 668298 737824 687883 572388 530239 398327 671486 868721 771530 386437 32581
12548 32581 -155241 -255184 -112396 -113856 62672 -39042 -143389 146274 224026 301545 589316
12537 589316 583188 865499 801394 539773 432720 200438 -115701 359116 619911 100988
12527 100988 376984 746429 930152 924112 607565 452142 406999 37151 -132799 -87281
12517 -87281 351785 629029 571982 420984 549178 709158 630099 483319 421567 443397
12507 443397 38096 -413427 -269356 -98995 -210632 46970 300571 196597 369526 130503
12497 130503 -7304 232078 190298 109870 139509 450883 673497 687286 517078 534508
12487 534508 460968 458159 531875 478284 574359 808031 824360 1015978 1090793 782202 421871
12476 421871 237390 266512 152766 350670 435360 422605 725757 887980 639084 108157
12466 108157 -112564 254293 328027 255395 180385 215065 187534 47371 103965 155335 -21035
12455 -21035 -333317 -276374 -64795 167891 302910 129487 -4176 311977 888148 1045704
12445 1045704 984232 918781 928654 586825 265392 251931 61361 175995 408786 399910 203819
12434 203819 -37445 125147 736661 862654 603910 668005 671765 158441 51996 353900
12424 353900 609357 728521 799943 606629 257743 -104748 -241518 -190196 -541010 -515954
12414 -515954 -395027 -432508 -161162 254106 -74350 321141 775147 602595 414643 290204
12404 290204 197104 269552 422901 583658 661138 575459 462162 211744 444653 381327
12394 381327 402351 198350 370416 499585 78818 -153892 -114100 -63192 108747 -126884
12384 -126884 5244 196683 217131 178993 247493 156908 208125 205395 178865 192446 198604
12373 198604 284386 639610 711841 475378 272620 -68114 -182520 2783 159486 423954
12363 423954 449631 481381 320203 -20105 68818 -9265 -188476 -279562 -12523 18113 -153642
12352 -153642 454359 329948 271531 491994 166110 263316 -694 190641 282516 123202
12342 123202 326300 707435 585471 197558 368172 880185 1140577 1305729 1508010 1762130
12332 1762130 1915960 1730852 1461691 1409129 1587462 1555256 1031044 770558 702558 618943
12322 618943 684463 848254 773975 1018731 1333159 952444 615030 875102 989708 1008003
12312 1008003 1206947 920360 1073831 1367790 1523041 1420326 1502725 1345326 1200863 1264551
12302 1264551 1634483 1955587 1750164 1409361 1214106 849533 900550 1329759 1642086 1465884
12292 1465884 1568033 1612374 1581125 1492702 1441815 1410650 1155448 809416 491700 602719
12282 602719 1176588 1330287 1482074 1300081 1107659 803860 865442 1583712 1878194 1756872
12272 1756872 1788824 1830577 1784260 1369699 1262645 895864 524100 385223 349318 268659
12262 268659 -23620 11968 72873 332394 134241 87666 414574 385542 217326 154490
12252 154490 193378 739639 1056800 1262097 1127617 853466 284878 -205008 -382542 -340027
12242 -340027 -37716 -50198 -7977 463351 654776 653713 313659 -58719 -22987 -100613 -173708
12231 -173708 -124931 -97981 -13628 -225129 56071 277157 92237 -246107 -40307 125246
12221 125246 405895 706059 508008 388155 31339 99529 33768 -169675 -602860 -538693
12211 -538693 -308538 -360078 -176535 -1639 -66801 -247939 -312874 -320009 -488368 -534184 -659009
12200 -659009 -385161 -431491 -682759 -646917 -258272 297755 403185 198382 -134925 -23238
12190 -23238 -58363 -43641 -9429 -177839 -638599 -737968 -212454 -123098 -158956 -21687 -147299
12179 -147299 -112408 7139 73167 115689 -71961 -81069 81297 -115690 -49065 102035 280870
12168 280870 208014 300978 667302 860130 1006518 1124286 1954369 2286460 2461911 3411489
12158 3411489 4442010 5641127 6278926 5316878 3774563 2618571 2050865 1722463 1379654
12149 1379654 1279612 1082324 844156 751064 794695 825376 474333 532599 824709 557526
12139 557526 240767 105631 11565 -37323 151361 535899 592332 473942 557995 681889
12129 681889 668482 817891 1368100 1951105 2634325 3752096 4826951 6019312 6778117
12120 6778117 5983254 4290885 2707101 1807612 1315666 920280 720673 558649 623837
12111 623837 482360 260816 263052 317540 629884 595142 255754 -274742 -154114 -164429
12101 -164429 -192848 -99193 198691 115916 119085 87328 138357 355724 384607 422690 576241
12090 576241 390919 48005 -185357 4599 140878 455620 584335 543599 610508 541763
12080 541763 -120243 -198905 -44509 29164 -153121 56781 -280 215960 20027 201762
12070 201762 220677 -55435 -102108 122259 10656 167359 339834 353670 -120404 -429728
12060 -429728 -583427 -413419 -131089 39259 17224 1857 230887 505909 440049 715205
12050 715205 703873 354743 14817 -136408 -85252 -53161 -209396 -108373 90435 70404
12040 70404 256739 341399 685569 581914 695156 845683 517348 161010 75949 -29243
12030 -29243 -284593 3941 221169 211267 179527 -222101 -183277 -53108 -237738 -403526
12020 -403526 -248131 -257618 -75585 -147199 155931 201569 278320 245709 338552 328075 639161
12009 639161 790827 395730 49159 -50494 377327 591292 636274 494580 357019 88628
11999 88628 158774 119531 131551 -95060 -193708 -152628 -140805 -132442 -261952 -421823 -218413
11988 -218413 116727 197503 278516 65790 294317 543155 660096 396847 175579 -14307
11978 -14307 -62889 151821 277366 -7752 -114750 1539 331112 556723 -54994 -208667
11968 -208667 -137257 -231194 7480 2356 -162648 224395 396262 343092 124719 40702 449427
11957 449427 182124 -248573 -198897 -176538 -128415 -310468 -630121 -643464 -303081 -219124
11947 -219124 -191986 9905 -71795 16962 -35894 -287488 -280417 15846 -100115 -155826 205686
11936 205686 111076 -12615 -204286 -162391 -259553 -171222 135414 161868 123935 28813 -207079
11925 -207079 97022 516227 718170 818722 684896 569269 342818 31613 -85841 238849
11915 238849 344348 153509 276617 294245 116700 323919 181322 333046 542214 760122
11905 760122 448218 204761 -149032 -22054 436524 657344 728421 581272 575570 354426
11895 354426 351636 385471 180794 313599 668342 733343 562608 877170 438250 165038
11885 165038 211935 339098 198211 -242969 -274270 -321588 -252219 -324331 -65354 -28198 -125659
11874 -125659 74537 281884 123105 57764 213836 435833 317288 218488 75485 264604
11864 264604 563783 301039 127019 -38153 -24672 415054 335754 58747 -22167 150647
11854 150647 492250 366801 -116330 -143397 132050 200328 279698 379396 445391 658773
11844 658773 848253 739114 278734 -234909 -325794 -236224 -32659 164118 296013 316086
11834 316086 254641 123149 -103873 250160 558777 466490 611894 486295 324722 645958
11824 645958 1430425 1820693 1793445 2143475 2324782 2231316 1861076 1506455 1464764 1105846
11814 1105846 751185 625854 520890 612557 812508 891951 779762 1076250 1011665 560403
11804 560403 615947 722930 717718 945814 1132863 845668 1301327 1779856 1889291 1660151
11794 1660151 1657141 1948555 2467133 2628401 2086240 1544467 1320189 1344417 1420427 1334508
11784 1334508 1460154 1248717 1173934 1252592 1180882 1078810 1285285 1165795 907369 1025407
11774 1025407 722772 844537 976180 1286708 1593649 1744065 1447882 1429960 1265580 1245776
11764 1245776 1197291 1074641 1562981 1676121 1942485 1766561 1323322 980611 645209 571875
11754 571875 485094 753210 853517 996108 822119 661516 280683 63215 304622 323139
11744 323139 254715 290553 295140 182695 18754 124205 328671 416556 252022 -11795
11734 -11795 -115990 45595 -20903 42997 322772 -129557 -104482 341956 428489 986468
11724 986468 886677 626934 353041 257410 239920 366177 341539 -19200 -102829 159641
11714 159641 156259 41885 323175 278319 183682 70605 158592 74697 47588 54611 144683
11703 144683 -101521 -620876 -310523 -229671 73203 136460 450696 591237 327473 -164230
11693 -164230 52549 -173058 -82066 127531 219417 238091 256793 284930 150317 450184
11683 450184 544386 812743 927617 961904 386234 -99875 -132614 -4016 243973 475044
11673 475044 361812 612152 573287 107109 362430 177420 450694 741328 628281 690669
11663 690669 1036696 791655 869764 813711 637208 438810 158153 245605 385832 509522
11653 509522 695863 654777 66784 -61433 152936 270334 365012 72310 -252934 -223818
11643 -223818 -247973 -38964 -67370 -49837 284636 469830 60920 -36192 -12692 -47650 -37303
11632 -37303 155234 324736 911837 672808 39245 -48371 339171 221430 413837 561464
11622 561464 478680 731248 720533 674912 269473 88909 463419 614285 799617 1225076
11612 1225076 1296045 907526 801856 488602 239083 16382 376597 459401 543837 520509
11602 520509 664080 673355 499529 165071 252145 535046 615266 630062 840088 758160 908521
11591 908521 1136017 912836 716166 553905 490115 470863 650697 634332 658244 695715
11581 695715 989955 980959 618041 552217 594004 712842 653396 897866 1068086 1076872 1006247
11570 1006247 699133 577618 594493 522660 561535 603228 887023 809021 343761 329620
11560 329620 510027 650019 466888 127218 335384 687405 334383 20410 206781 320349
11550 320349 150857 330561 434761 504041 450265 187502 562626 726086 625411 790518
11540 790518 715699 521076 597233 724366 795045 886845 840341 1029170 1180535 1025369
11530 1025369 810297 906059 745239 1190521 1663609 1625957 1549469 1582521 1475901 1355661
11520 1355661 1484474 1489721 1406737 1319018 1039369 914469 1148631 1266716 1111318 1223441
11510 1223441 1339135 1287956 1205535 929201 746756 877441 1256875 1777846 1688315 1433947
11500 1433947 1332531 1262523 1213181 1187010 1090952 1267025 1265892 1602297 1700659 1616388 1547513
11489 1547513 1471076 1375340 1235104 1324094 1442273 1638013 1519298 1435564 962430 1083641
11479 1083641 1458122 1578376 1247340 1323749 1731402 1664356 1651328 1442328 1847849 2178092
11469 2178092 1992063 1897288 1820255 1775280 1881478 2271472 2253176 2316915 2277875 2180636 2078080
11458 2078080 1987038 2337236 2813756 2647371 2388267 2554695 2568014 2651826 2457277 2259316
11448 2259316 2687454 2884858 2982264 3190399 2923797 3116067 3506244 3483214 3563069 3667626
11438 3667626 4032329 4051981 4083876 4485815 4593770 5082794 5415137 5645811 5814478 6245415
11428 6245415 6441095 6571420 6690476 6914270 7367283 7655049 7668100 7595695 8534525 9460500
11418 9460500 10334744 11001250 11680065 12411578 13573959 14874404 16212191 18116069 20595574
11409 20595574 22915132 25920847 29685179 33786732 39325010 46449779 55680319 68414769
11401 68414769 85639329 108060238 137733456 175804280 221844208 272377585 319604540
11394 319604540 351278823 356981593 334929146 296469521 253518183 213203507 179570195
11387 179570195 154204312 137432698 128564251 126892659 131781422 141997158 156605163
11380 156605163 174083399 191657812 205825990 214566351 217229742 215167539 211102700
11373 211102700 207413582 206203561 210118475 221090348 240625131 268196008 300797690
11366 300797690 333417383 358665836 369240114 362675497 341286339 311623303 281179330
11359 281179330 255294807 236113036 225154973 220803154 220569369 221555781 220746065 216702669
11351 216702669 207951858 194182153 176958400 159028658 143349066 132180729 125895342
11344 125895342 125320672 131132188 143074905 162047143 188292454 221265110 258780536
11337 258780536 296463223 326649152 340652787 329947968 295154480 247012491 198625750
11330 198625750 157275443 125215180 101157334 83249113 70148932 60430323 53537731
11323 53537731 48267839 44082128 39864551 36312972 33599869 31245918 28703122 26475296
11315 26475296 24526346 22571591 20943453 19327629 18527721 17903178 17112200 16024105
11307 16024105 15087761 14300952 13863806 13505695 13011380 12518501 11989057 11098407 10328639
11298 10328639 9793013 9683526 9727341 9450389 8888747 8547313 8104290 7666486 7286687
11289 7286687 6920647 6631254 6694718 6511355 6180982 6093374 5775662 5518786 5098454 5130332
11279 5130332 5383922 5655237 5778138 5431931 5303318 5006959 4698078 4612299 4387594 4207956
11269 4207956 3990306 3531939 3458375 3519740 3712082 3882647 3914615 3599154 3557751 3218889
11259 3218889 2904782 2932959 2730217 2472169 2433909 2321409 2285498 1969584 1892657 2216235
11249 2216235 2576632 2524040 2302017 2253935 2371811 2470194 2637808 2593987 2419702 2433575
11239 2433575 2192429 2018225 2183184 1940273 2122584 2057872 1889338 2294022 2330790 2451896
11229 2451896 2340260 2038695 1555926 1377731 1461498 1869219 1977099 1930508 2002863 2167554
11219 2167554 1875635 1768208 1643553 1638044 1646056 1489531 1283543 1643797 1643543 1182945 835684
11208 835684 623521 934644 1264552 1222430 1269714 1212129 891106 591115 881600 877199
11198 877199 710024 650644 578215 550865 333638 352657 726687 663070 137184 -20007
11188 -20007 72266 231447 324201 406817 295150 307224 316849 372314 278180 268717 585130
11177 585130 874975 826091 457765 372765 277369 -58109 -359670 -209704 452787 742108
11167 742108 387228 138077 230955 210937 198828 555045 970421 1003670 624519 471932
11157 471932 427573 569163 214192 -80581 165751 380046 48418 -445832 -182515 6010
11147 6010 -10489 213947 551884 818570 530499 409643 411441 434836 710625 564368 748570
11136 748570 723415 741352 327841 315715 421832 455259 182141 380442 151989 -52465
11126 -52465 -275076 -100686 316152 661794 619326 504496 360660 866524 804841 435533
11116 435533 193397 38008 290985 672036 388336 -54983 -209216 -273681 -182261 178168
11106 178168 -21451 56396 288487 252007 -168957 -235376 -58854 206138 321140 495578
11096 495578 773318 683297 363264 6857 -310682 -240597 -304623 -113178 147967 167842
11086 167842 433042 430292 211615 -1236 -193214 -248988 -13508 -44267 433174 612392
11076 612392 667539 655460 675281 635011 561241 550111 559315 875312 921029 533705 46494
11065 46494 -443581 -441200 -243324 -158776 97236 165326 258846 102525 -409428 -367678 -345932
11054 -345932 -201577 -244226 -234093 -233505 -224054 -478682 -443781 -313932 -299442 124070 30143
11043 30143 -71398 -69769 85920 32178 65368 315957 324680 476922 242127 185745 160328
11032 160328 99875 -3195 161699 134146 -1215 168568 333895 379223 427885 218002
11022 218002 207659 301086 151031 -50633 -380946 -235418 169708 37018 -173120 89278
11012 89278 420851 211519 115816 343167 157689 -5739 -16754 -99446 -36903 -241066
11002 -241066 -367263 -207322 -85954 -71666 -278865 -367137 -271976 49938 -40437 -259125
10992 -259125 -133801 297205 869609 1682972 2155413 2188956 1981829 1322918 1202332 837795
10982 837795 595585 341374 559314 679471 425453 442590 376442 383156 260261 350897
10972 350897 657449 588639 478784 416913 760680 790050 1053149 999123 922733 1080565
10962 1080565 1488916 1792174 1922172 2110674 1940915 1559290 1111013 933677 1183017
10953 1183017 1096484 913240 817426 985956 894268 778886 703197 646115 839158 1015717
10943 1015717 903315 928123 923507 1001913 1066315 965863 1189911 1505248 1614894 1639163
10933 1639163 1938590 2333869 2209865 2261651 2140017 2163156 1582136 1022437 941834 1172313
10923 1172313 1161159 989794 1246391 1550772 1539514 1451219 1033823 782001 752760 764220
10913 764220 697761 469776 642337 890671 666029 634807 875603 932747 1271635 1415616
10903 1415616 1291799 1120618 978355 1188481 904899 870632 1025761 1008431 677892 421430
10893 421430 416920 160804 34947 134387 238343 232347 345927 621499 475247 289494
10883 289494 116835 183696 157452 127332 170877 -119199 -312155 -290388 -324022 -81660 26022
10872 26022 8161 -279199 -436087 -330279 65540 430587 460277 295885 129874 167787
10862 167787 406074 316982 -359161 -862506 -416604 171653 106732 -302307 -423169 -370375
10852 -370375 -336091 -88931 6200 -38129 -220648 -157245 120706 -74432 -275265 -224081
10842 -224081 -220271 -180471 -368801 -619545 -492218 -337698 -362155 -263125 13920 102062 -54224
10831 -54224 25297 438274 643819 134970 -54812 105807 157074 163684 20852 27344 323290
10820 323290 382404 226655 -9993 -151069 19987 218352 400738 375665 201739 115096
10810 115096 184332 34043 -356952 -375748 -294038 -343686 -354384 -391522 -604096 -559420 -77678
10799 -77678 288616 152035 316636 360092 237302 341543 254834 164793 9079 166139
10789 166139 73155 -105984 65004 239785 379073 781644 721372 750080 412925 438930
10779 438930 489586 112730 68145 280515 302746 389838 403523 588791 492052 231179 369118
10768 369118 664766 589682 612884 448708 -135761 -93721 150127 -251631 -597644 -441499
10758 -441499 -247214 -229410 -191512 -285339 -181734 -61554 135167 333362 369808 267157
10748 267157 431225 280309 349552 459385 632761 517642 -74186 -538685 -795572 -932575
10738 -932575 -925797 -218699 -385158 -818994 -473153 -41237 64447 -242527 -169220 179539
10728 179539 311349 153002 -84006 -197465 -304254 -337761 -539844 -565276 -324634 22993
10718 22993 -54841 -5191 -66737 -593258 -713697 -506569 -395973 12542 -20425 -317932
10708 -317932 -183082 -59158 -86014 -163476 -252113 -297838 59541 273348 25682 -384019
10698 -384019 -282191 -1339 192005 6134 -137759 -291353 -345525 -173318 104507 175637
10688 175637 109150 176957 -174508 -319457 -63101 352778 314829 397635 603231 242688
10678 242688 -202499 -60704 -54465 -319191 -424051 -373954 196466 359986 341459 321543
10668 321543 8751 -302583 -514377 -659018 -703737 -620390 -515414 -539505 -373520 -355681
10658 -355681 -47883 252994 276097 -5870 -244581 -367237 -460772 -426244 -206807 21717
10648 21717 97783 -149198 -277009 -143916 -4160 317686 63035 -145907 -234718 -36537
10638 -36537 123825 125498 285656 375455 187550 -65386 71657 93479 69704 -42250 125544
10627 125544 299176 488172 499756 250173 431304 514619 446408 379562 551602 363921
10617 363921 328644 2989 136613 398865 329923 -232879 -522011 -186284 -369669 -316612
10607 -316612 -313526 -281189 -35848 101904 -27555 -273663 -157511 -181261 80490 -42762
10597 -42762 -314060 -231402 -466217 -357924 -512297 -458245 62504 -102165 -426040 -641665
10587 -641665 -443048 -290148 -563067 -583563 38940 340341 103860 -224536 -379334 125038
10577 125038 134658 93816 4036 310789 196461 355810 411101 294320 406206 748986
10567 748986 940682 1169657 914376 442265 189874 367384 224000 -80334 -70138 -128610
10557 -128610 -199939 2263 40601 -285820 -287299 -607852 -475952 -380133 -372275 -215442 -45386
10546 -45386 139177 145994 129505 388518 337512 252884 62019 91005 23659 -103153 -182602
10535 -182602 -112981 27936 -68834 -447690 -301842 -47855 111274 480562 465254 134346
10525 134346 441818 678870 363462 265430 33673 -126786 -424262 -430480 -364921 -438665
10515 -438665 -11331 42817 -309485 -352597 -209630 -135139 155893 348653 603558 550495
10505 550495 558872 524987 179016 -77589 -193042 -233364 -76503 -52129 136126 195462 473474
10494 473474 678561 483676 455840 473455 465937 383864 158018 -73478 -251229 -229372 -61359
10483 -61359 204404 -38472 -261333 -369367 -362343 -174440 -214262 -307625 -516144 -459315 -111697
10472 -111697 114102 75400 264925 325752 141263 -149359 -186906 -256081 -233188 -234488 -502706
10461 -502706 -489263 -15223 286811 320543 123045 -96808 -201831 -281552 -273960 -104657
10451 -104657 65263 65553 22764 -39670 -408362 -325202 -252622 -154369 175753 126043 -121311
10440 -121311 -101368 -281005 -529577 -739846 -611422 -784086 -788958 -373218 62247 94169
10430 94169 -49703 -189945 -294050 -255213 -549373 -478365 -158718 -104909 -58844 -165177
10420 -165177 -43097 -43164 213986 247220 133657 142671 47918 228215 300016 62190 100264
10409 100264 237350 197506 177674 185885 240698 301274 110594 230632 122786 -388366 -562462
10398 -562462 -428077 55795 265556 237050 87655 -103544 -259405 -89508 -74577 -248017
10388 -248017 -304526 -616894 -687963 -617166 -539564 -377212 108002 77631 -175825 -108762 40813
10377 40813 200910 -37354 -19367 79698 -14639 -199800 -29158 -28453 97262 201838 -123523
10366 -123523 -381520 -258297 -168897 -242790 -96858 56317 279027 288365 421376 534521
10356 534521 402334 379809 242383 -139282 -200854 -215892 -327383 -480858 -260816 -261832
10346 -261832 231413 246184 351693 344057 -2091 -250547 -505022 -181758 10372 91030
10336 91030 -52266 61874 481585 513951 300939 323149 348678 565616 492620 313425
10326 313425 162403 -251827 -472788 -460135 -685424 -428696 -307793 -120557 37666 -257375
10316 -257375 -417469 -291976 314446 475088 365215 288758 235772 196410 327498 274505
10306 274505 -193910 -346545 -268671 -128647 -14988 -156828 -363542 -188241 -19983 -61817
10296 -61817 -89312 -505558 -281131 -356964 -627167 -569241 -563419 -305262 -418923 -290890 -67184
10285 -67184 95511 365054 337141 156585 -229459 -363468 6175 295202 212186 248212
10275 248212 106425 -62173 -137715 -255338 -124592 -120052 -134338 -148980 -151365 -44246 -3950
10264 -3950 -197535 67415 250773 76016 -140346 -283353 -90955 -62144 -54074 38895 122543
10253 122543 281302 182099 168295 140184 -322896 -306949 -205669 26587 -84754 -374477
10243 -374477 -320587 -418100 -368550 -214957 135093 162793 -73500 -421008 -456967 -491505 -590326
10232 -590326 -255718 135934 314618 132348 -126953 -73142 132775 255314 -91279 -462617
10222 -462617 -338558 -354659 -362399 -412470 -498000 -552655 -499645 -258249 -292195 -169979 -175717
10211 -175717 -68309 -98254 -208834 -1596 80686 -120953 -237347 -86343 166476 561302
10201 561302 803737 908464 581722 124145 -175947 -308123 -583555 -565628 -476740 -548940
10191 -548940 -318717 -161406 -300837 -629565 -613882 -313212 -122809 -93989 -664418 -488899
10181 -488899 -393575 -362654 -323544 -175630 389251 363002 153024 -77671 -50446 -246078
10171 -246078 -213124 -362829 -581474 -479718 22206 237971 214323 313849 672327 569159
10161 569159 517897 178045 -163421 -213651 2933 209616 236833 132192 163255 294167
10151 294167 170893 263119 308265 195628 -71012 -77629 -72580 -96419 -211013 -202981 -55503
10140 -55503 -135289 -148367 117898 -88535 -523818 -449634 -323467 -411121 -433000 55091 -5099
10129 -5099 -17404 -52174 -210675 -313795 25502 332993 -105591 -230342 -26619 121329
10119 121329 -239970 4226 -45455 -370701 -336693 -30914 158265 67755 -345989 -354972
10109 -354972 -376986 -91801 -7406 -202396 -437939 -174493 -49877 -75583 -267333 -209173
10099 -209173 -75250 -152274 -197360 152395 272756 -123712 -322348 -464756 -214329 -57732
10089 -57732 -387540 -426696 -599967 -759600 -812671 -722380 -667014 -518031 -339334 -411298 -145866
10078 -145866 -147326 89856 41974 -91825 -91810 -293445 -323295 -390334 -541686 -318918 -337160
10067 -337160 -174540 -300620 -110724 -184674 -512024 -649916 -297574 -381163 -336936 -75768
10057 -75768 -147147 -41795 208493 755767 1416850 1677318 1255236 743734 495349 619260
10047 619260 906042 696899 -13705 -255241 -217113 76763 -53824 -406102 -226647 -2209
10037 -2209 -24723 -107955 -103111 -38384 -309177 -453693 -361154 -8210 -161719 -424376 -427725
10026 -427725 -423431 -155106 -111970 -155101 -29343 92950 178116 151467 6693 371184 598565
10015 598565 615761 689647 -5138 -526727 -485512 -386424 -232898 150980 515900 417804
10005 417804 -20605 -169672 79785 35361 -462667 -732207 -1096410 -1064062 -704707 -386814
9995 -386814 -531977 -463346 -231241 -415529 -298282 -139953 -143182 -268468 -318108 -368048 -369120
9984 -369120 -50897 -69761 -3890 -27111 -306350 -178026 141826 -185428 -472883 -612320
9974 -612320 -514589 -381066 -288195 -241109 -289759 -403243 -506100 -686551 -537844 -328010
9964 -328010 -425570 -493190 -279274 -203611 -87110 -121096 -152310 50191 -144977 -300339 -352671
9953 -352671 -484750 -761665 -763890 -508976 -109437 -38723 -251050 -356624 -526389 -418814
9943 -418814 -306734 -701089 -641850 -351118 111995 133981 104553 409635 414290 267750 -6206
9932 -6206 -200854 57773 224660 422272 19641 -481803 -526982 -291211 -125739 -80690
9922 -80690 -36632 -99498 -289299 195288 182422 3216 52284 -287792 -683344 -384218 7217
9911 7217 58309 -42720 -154151 -229391 70290 -201040 -641919 -464246 -11854 -51674 -169937
9900 -169937 323780 403761 220242 147157 -107358 -70277 -37654 21978 179787 131541 -251190
9889 -251190 -143086 66690 -5672 87621 -11839 -67884 -250847 -268784 -334621 -392401 25285
9878 25285 93233 -159041 89727 56003 -40543 -13192 105872 -186804 -206162 -20137 203941
9867 203941 236119 -390301 -645128 -589242 -304383 -194535 -233161 98951 110573 175050 92375
9856 92375 -18955 -47539 100728 469357 146352 -140383 -560717 -97700 272449 489969
9846 489969 763134 806698 397310 45331 -63617 -102602 -24060 134144 86941 3340 -143491
9835 -143491 -305883 -53411 -59858 -309192 -125846 -460477 -688053 -717841 -595457 -68293
9825 -68293 -354092 -556524 -307441 -32471 237370 216224 199990 260420 283884 -15641 -228489
9814 -228489 147405 357539 523944 289615 37939 -12990 -290133 -301776 -275030 -247664
9804 -247664 -196194 -93267 17229 234099 388979 234171 269059 379039 156929 238204
9794 238204 363996 506835 641340 11880 -279564 -210106 -404797 -514095 99313 340941
9784 340941 176015 -113811 -131994 -61599 201512 140017 232698 33145 -171855 -227996 107630
9773 107630 91155 -81304 -296851 -103037 307060 376425 -144258 -663282 -454941 -373737
9763 -373737 -542997 -259387 -32899 50722 -102059 -142670 -365280 -595874 -456818 -22162
9753 -22162 -80143 -370422 -551659 -445663 -230876 -76619 -377546 -442858 -715965 -797371
9743 -797371 -652971 -548662 -444583 -377266 -331030 -490742 -555846 -206450 27303 483077
9733 483077 301933 -3666 -205236 -335796 -244529 -125990 34472 162854 451301 11961
9723 11961 -503728 -353065 -113312 127278 162991 82727 42996 265891 510243 87339
9713 87339 -306459 -82493 -83718 -128075 -133876 -7687 -68457 -188735 -159568 -199078 -342810
9702 -342810 -435043 -452172 -409253 -553443 -691751 -830256 -670612 -224268 109016 -29899
9692 -29899 139934 332403 533987 508699 200377 -1125 -95681 -383861 -309134 -446673
9682 -446673 -431180 -332152 39026 159510 -34591 -314075 -413111 -353600 -40210 -1082 -37823
9671 -37823 168765 34886 146549 588900 502349 110557 340631 471056 445072 399467
9661 399467 171989 -30661 -308408 -613056 -749629 -421144 -308859 -462813 -181826 107460
9651 107460 158265 -2175 -174786 -182688 -96149 156194 251523 277550 62096 -150115 -244490
9640 -244490 -221191 -157918 -23968 119517 -41713 241162 118908 15269 -78046 -294727
9630 -294727 -232495 -269283 -563710 -746646 -739305 -409761 -157224 208165 417889 328996 105962
9619 105962 -21883 325405 525100 503894 380450 107578 -33263 -245427 -355007 21093
9609 21093 87798 219714 181508 -55553 120708 288554 104078 -183567 -354720 -52105
9599 -52105 39563 89932 389165 746968 682975 387719 123137 -40859 -39854 205505 150015
9588 150015 -134867 -270182 -423172 -470847 -351556 221579 562937 421978 293172 126158
9578 126158 41676 141147 59924 109031 260144 449298 369087 527630 515189 67471 -317656
9567 -317656 -333156 -15719 298119 242155 -226722 -636648 -372496 65811 113836 -66407
9557 -66407 -13629 -331095 -765297 -629372 -121731 71548 13005 120717 104802 65251 -157709
9546 -157709 -64931 280645 379197 120601 -63737 188354 281975 150634 320760 202663
9536 202663 196023 361154 363040 85241 -144217 -303552 -273532 -107015 -104139 -178759 -276189
9525 -276189 -244724 -272221 -305109 -202662 -450310 -472444 -60404 -121132 -250395 -8163 -1016
9514 -1016 1666 -178532 -77013 -73521 -157611 170098 53640 -242928 -370409 -572445 -617224
9503 -617224 -582896 -278276 211952 118393 351919 246758 -216307 -845960 -932241 -597315
9493 -597315 -167099 224995 428213 496090 379517 276060 317506 130876 231509 399961
9483 399961 407756 349104 251207 270454 79467 588523 798480 636706 451933 352060 2285
9472 2285 -77725 -279918 -196438 -64634 -59016 -233009 -109857 -80734 -173904 -148810 -185977
9461 -185977 -256957 -320442 -211931 -192115 -143906 -61769 297186 201944 -94337 -168687 -92710
9450 -92710 102309 -36671 150378 259796 291389 316775 474651 481506 378919 319954 142260
9439 142260 191534 -20620 -225967 -481123 -479030 -198232 -228312 -163225 -27230 -88510 -190451
9428 -190451 8660 225718 257237 174341 318414 161406 224959 143549 147577 -344682 -697349
9417 -697349 -436757 -264447 -369838 -148043 -148004 -453504 -217381 22612 132323 -248237
9407 -248237 -424646 -254248 -175950 56911 282014 245454 31549 -118679 42538 406996
9397 406996 726250 847355 749837 694312 774960 645675 398161 -67621 -486585 -591213
9387 -591213 -742516 -611990 -241396 -201622 10759 193834 336880 304840 309226 234341 316253
9376 316253 368825 201519 117627 48853 134300 686521 1049908 751957 463943 419902 578561
9365 578561 561909 614032 624457 616453 757985 800665 588248 331607 159650 235002 297122
9354 297122 446187 869561 619563 490307 570139 354315 162359 -114357 274107 713102
9344 713102 408888 51079 -163720 -134708 77111 291983 168694 259044 371602 15598
9334 15598 41646 409683 428040 284590 241360 -213113 -505353 -237392 -19565 -145287
9324 -145287 -43659 -52064 -382230 -507247 -656982 -670067 -628650 -461206 -191249 -47765
9314 -47765 362290 435547 -28789 -147497 102233 262901 563317 681969 254576 192334
9304 192334 245619 221854 214896 339803 466017 609339 426805 437796 189438 -186165 39018
9293 39018 397559 376902 189363 315204 502345 401195 356189 243745 81333 -89939
9283 -89939 -234785 -347595 -7641 150932 227868 171336 228565 240288 222693 237563 267435
9272 267435 716536 687469 176658 -76371 23057 -261917 -661851 -490263 -275508 -426650
9262 -426650 -241298 -4935 227419 399497 180866 -154613 -375530 -190440 104724 482
9252 482 216443 363752 139503 -233038 -22896 341303 382976 262349 319172 182314 140677
9241 140677 231263 384850 435274 370207 161349 160952 309416 148413 213995 471709 2331
9230 2331 -51732 584970 584170 591112 298248 366415 408473 316448 126379 132815 148027 60821
9218 60821 94012 169550 256427 389868 157349 162523 421869 641958 649610 618359 651962
9207 651962 363369 2453 -51360 91070 59788 -28653 226875 473351 167342 24676
9197 24676 535844 350345 312459 424474 654566 1036371 837700 619098 530891 890791
9187 890791 957765 566027 387412 674339 720648 608013 614185 791885 940659 841922 773134
9176 773134 1147024 1227000 1251530 1050575 642082 553046 879788 669270 544838 668406
9166 668406 606454 706478 1200478 1612801 1584412 1283840 1424574 1548308 1459918 1220040
9156 1220040 1190288 1028105 1110020 1360326 1570726 1431223 1353085 1223761 1326753 1653791
9146 1653791 1704647 1584792 1638330 1755392 2333518 2279067 1969565 1819567 2035146 2765063
9136 2765063 2974580 2993243 3086989 3135062 3198658 3263484 3199474 3661315 3889405 4054369 4574376
9125 4574376 4928160 5415224 5848504 5973759 5989482 6516824 7276011 7843913 8598755 9779797
9115 9779797 11294754 12850075 14978165 17860852 21680389 26969433 33947748 43283237
9107 43283237 56861336 78377000 112192650 165008411 245747342 354131324 460225562
9100 460225562 497171872 392772707 254938774 163977368 110263577 78222175 58534278
9093 58534278 46162256 37996117 32501610 28074409 24784104 22363913 19948940 18207877
9085 18207877 16669346 15403079 14256194 13397466 12608256 11601049 10457391 9463336 8845581
9076 8845581 8550205 8553278 8103787 7613413 7330008 6806103 6469681 6305478 6328408 5893751
9066 5893751 5525407 5118951 4634365 4369466 4379353 4428954 4161292 3853610 3999412 3817608
9056 3817608 3654464 3765759 3856299 3624146 3249737 3207259 3389962 3405835 3573317 3533259
9046 3533259 3341601 3075629 2918632 2869467 2790442 2483790 2149939 1854074 1622132 1571870
9036 1571870 1644341 1690344 1749987 1995060 1968603 1599345 1485359 1315066 1155120 892454
9026 892454 1055729 999245 663072 582633 761578 750889 1002918 1299804 1241299 1189532 888514
9015 888514 573782 503731 512906 566037 886559 1257263 1575757 1460024 1165313 963866
9005 963866 1054247 1192133 861528 763461 595516 633101 883348 1052432 1164734 1010145
8995 1010145 636451 868688 1111660 1200216 923785 697273 489292 512865 480283 620892
8985 620892 536175 526106 613693 738116 710940 508937 -35258 -70296 79406 508882 1003370
8974 1003370 790264 675101 910983 852427 646575 299944 214099 323261 250327 -173857
8964 -173857 -102782 390092 579067 641186 507072 446853 268271 424583 600277 434164
8954 434164 420305 352545 487111 746880 1048869 949102 601240 695776 459111 434294 522461
8943 522461 186214 1384 -208011 -65277 -34088 -267514 -22999 -122271 -275946 -179151
8933 -179151 112108 -73072 -47554 -90035 -192049 -387886 -285481 5577 20167 -48968
8923 -48968 229485 462698 426151 331845 -111680 -254224 -34322 246618 -78116 -224780
8913 -224780 -107220 -6920 251985 15986 -154752 398968 660735 528322 701991 674450
8903 674450 418423 290842 152880 188837 -186907 -77493 11249 -83567 88390 182025
8893 182025 117686 442685 380281 327351 245061 194394 338956 309805 48378 215840 256840
8882 256840 332980 292801 281783 209863 279132 542526 227702 288802 193034 43413 258689
8871 258689 595884 518834 496423 713368 877670 775179 435495 441612 617847 260038
8861 260038 -65783 -2661 240400 419074 408622 278853 211102 34112 -111642 -211283
8851 -211283 -151533 -279006 -456895 -364733 -205776 -182292 -322654 -494383 -373904 7753
8841 7753 48186 115939 2695 19936 6435 -189604 -126998 -105382 -289115 -456595 -139506
8830 -139506 128891 131806 -137555 -205663 -24899 56322 204659 -71283 -230423 -131255 74235
8819 74235 153161 321775 448638 93946 -13835 -68668 160218 578642 383166 364396
8809 364396 255257 186400 -31707 -119336 64197 93617 35692 -51527 -187464 -520710 -236434
8798 -236434 123157 201361 262322 448077 379753 276048 343926 386219 106722 -149550 -240353
8787 -240353 -47431 115711 -202567 -71823 210456 181307 -184497 -436186 -256414 -200161
8777 -200161 -310652 -680280 -655205 -538246 -201983 -293789 -82695 225329 591160 789934
8767 789934 645788 376951 519075 496531 155192 232555 395994 487849 394622 280433
8757 280433 377439 577393 593988 401308 63125 -46045 82967 -164121 -320534 -523654
8747 -523654 -325930 -9589 14838 -223357 -175827 -70245 167327 61603 132067 295469
8737 295469 538273 381343 271147 379286 215525 309603 78416 -86446 5283 138670
8727 138670 -102913 8210 211884 487477 407006 512311 689468 869632 987780 895091
8717 895091 857825 977708 1019142 694158 388508 302606 688365 947678 822575 682764
8707 682764 522225 537449 570771 602207 585400 453162 396884 448102 242401 -95456 105632
8696 105632 302921 414348 361484 457263 311187 110854 74874 -9170 195910 227222 282574
8685 282574 198026 454746 349804 210148 142959 241800 38764 48963 157457 155909 -122260
8674 -122260 126947 140324 186601 330427 408958 466091 183650 632693 925334 676734
8664 676734 407685 321578 445428 601371 602140 578456 1007090 1065460 857773 665272 875871
8653 875871 1117154 905202 693577 818918 858552 816500 1093711 1422391 1667549 1993665
8643 1993665 2048540 1873692 1889821 1991788 1874652 1482690 1108083 609911 536434 742692
8633 742692 931169 613480 682577 873384 941789 970157 981290 1178929 1084658 909888 1063893
8622 1063893 1263013 1665572 1861891 2171795 2658471 2716214 2470212 2235640 2063794 1798392
8612 1798392 1575751 1922196 2265200 2550821 2862295 2840920 3099157 3792886 3898074 4474802
8602 4474802 5276183 5910579 6628763 7129829 7465253 8306757 8986648 9238485 8952463 8531916
8592 8531916 7872110 6965040 6321723 5524137 4889634 4386480 4144804 3840045 3294185 2913040
8582 2913040 2581115 2512323 2491935 2181083 1601534 1433454 1343116 1648611 1726487 1736260 1690630
8571 1690630 1307605 1460970 1465229 1636929 1876985 1848938 2033234 2128372 2037178 1959463 2174490
8560 2174490 1753374 1174387 1204567 1386920 1269435 1371070 1638596 1337690 1400528 922333
8550 922333 1067989 1215581 1064410 1255827 1329992 1631972 1950729 1859126 1751885 1705926
8540 1705926 1197397 1278919 1757859 1949891 1768683 1721611 1461535 1398134 1671909 1755983
8530 1755983 1675883 1688423 1420817 1147235 1058832 1133343 1051469 982238 690413 521513 764970
8519 764970 697677 827213 794405 768847 531911 585237 527102 764713 1141977 1112741 1223308
8508 1223308 1550289 1233499 519697 441795 651895 694663 582837 374459 366050 534230
8498 534230 272636 217193 312333 532626 717981 594777 448262 673374 629973 437151
8488 437151 -79754 19675 504782 418206 541025 552335 158530 172114 322951 287072 -116585
8477 -116585 -37146 -12399 89632 62611 -86547 -157677 -120395 51278 167036 507573 539056
8466 539056 563344 301343 351984 573070 565823 87899 115267 561751 325319 73932 131256
8455 131256 247699 474607 608565 694317 806815 715892 520572 730700 785328 634644
8445 634644 450390 603575 459482 274246 375933 530302 819644 940373 997620 902209
8435 902209 549186 58450 -16534 185267 137142 328052 694800 788534 982811 631774
8425 631774 140487 222608 600345 697344 426842 510188 802897 892786 793347 540298 305386
8414 305386 438496 249949 278816 234100 298945 366618 746353 579151 520858 515559 328394
8403 328394 64968 292985 456344 -16947 -181001 271832 663546 568702 441435 458267
8393 458267 173338 -171180 20214 217424 304411 466362 416992 460237 130608 126536 132717
8382 132717 284690 483128 425765 296188 -23817 162814 418658 182761 292106 126327
8372 126327 231714 459509 770501 661733 737756 877290 1069619 988902 802052 855313
8362 855313 975631 628411 136010 -120197 -58374 301435 264052 401771 358242 515308
8352 515308 471399 198142 424544 439250 601761 501396 166806 243927 338112 153984
8342 153984 -68259 -151194 60786 315350 226869 267276 13130 -61499 -153434 -77010 -296019
8331 -296019 -237297 188362 245637 335729 332437 376467 107096 147845 -119631 -214569 112647
8320 112647 368170 232168 69977 509882 595184 631989 620500 582625 536353 520522 279501
8309 279501 445470 544464 482107 464754 270857 -141526 195778 679003 849444 670777
8299 670777 543928 320188 -123985 -439989 -327011 -173600 -183337 22138 273130 80289
8289 80289 -20922 112278 -126559 -491866 -322852 292368 289683 49943 36321 -200485
8279 -200485 -146005 27320 258645 623065 685953 583347 401064 258854 322386 548051
8269 548051 267205 111299 217603 -68968 -75564 -365583 -699248 -518831 -118519 347582
8259 347582 284036 204398 -3623 147764 232890 -17436 -218023 -370620 -667792 -357066
8249 -357066 -66424 -121196 -55719 -140304 -63019 239835 237943 168205 -19248 69992 79267
8238 79267 134313 193721 73698 -314004 -338616 -18293 470601 772072 469757 -43137
8228 -43137 -229229 -421382 -74184 198281 467955 462205 309292 229747 -74781 -29402 -77270
8217 -77270 -226346 -221876 -43123 159341 157930 302767 522320 436261 585311 387623 160069
8206 160069 264322 471666 366277 278338 367265 4844 -20214 35638 66327 308930 405993
8195 405993 366941 219633 119760 276447 175480 253685 -243192 -288841 3354 -92034 -208250
8184 -208250 -92411 -25867 167207 78069 891 45409 157437 76474 -25386 213703 542142
8173 542142 493250 -3398 -365077 -468640 -371628 -667 250377 366819 425084 227957
8163 227957 218889 539643 708315 517804 529535 722975 657378 352477 227118 47562
8153 47562 112129 656970 640723 540101 323909 -154232 -245409 -53725 116466 408223
8143 408223 406952 254852 376631 150594 -57183 -486120 -352299 109417 343259 392628
8133 392628 338859 351148 584637 791003 943489 1192126 1673436 1756094 1964594 1977991
8123 1977991 1654101 1003402 372709 153786 390257 614739 460142 911257 799948 429704
8113 429704 -213022 -344912 -368601 3239 544245 250915 35432 97760 -261322 -391754
8103 -391754 -308147 -68543 11255 -225790 60037 507869 751950 744796 842508 1082751 1232180
8092 1232180 1054329 1351631 1601641 1524503 1254976 914473 688602 484003 152632 91969
8082 91969 -76373 27658 51419 -11607 153601 104600 160293 -1143 35156 56617 249644
8071 249644 467475 49075 111470 217076 248189 328920 242682 178031 -98288 -189685 70813
8060 70813 230974 624025 979354 1066038 880874 828480 788771 1070048 860909 1055953
8050 1055953 850812 565359 605136 476932 524258 646142 569700 557443 795787 502821
8040 502821 427343 696684 610427 692180 541023 727452 855000 871268 1035859 1298536
8030 1298536 1466733 1204076 883301 725869 807220 819652 1126194 1108391 674649 698190
8020 698190 826348 571400 534390 578219 839906 1026801 794252 571323 628517 908123
8010 908123 912257 964612 1211956 1232577 983432 864977 1009620 1099567 1334653 1343211 1425477
7999 1425477 1395378 1463624 1394750 1048684 1067590 731364 707615 841358 1169533 714196
7989 714196 314324 556531 1084943 1064314 873875 900981 824805 630512 835804 1068568
7979 1068568 1003827 950221 1240650 1237953 1156362 1195720 1380175 1495415 1315813 1281723 1402849
7968 1402849 1249914 1458690 1477368 1242566 1146273 1012993 861287 1059419 907733 1177011
7958 1177011 1355400 1291810 1726000 1908182 1702706 1553684 1546205 1585581 1554304 1232475
7948 1232475 1102337 1027840 1051447 727757 652860 959841 1063025 801644 951902 830870
7938 830870 721805 839568 1120543 1428597 1874096 2124605 2187061 2213588 2067184 1999240
7928 1999240 1702408 1596952 1421409 1457768 1551104 1562114 1837872 2106851 2051015 1849369
7918 1849369 1750391 1595469 1624069 1627845 1778340 1615656 1542019 1689834 1350138 1524317
7908 1524317 1656838 1443410 1059962 1052830 1341959 1128649 889976 1048857 825734 714714
7898 714714 933536 1444437 1547626 1271272 1108038 932862 788115 407643 642006 718412
7888 718412 721045 817865 945480 923181 650128 1105383 1003239 849985 1260743 1672856
7878 1672856 1068262 504632 510332 438227 171921 -104154 119386 169377 510953 598994
7868 598994 577060 616875 553282 585984 872195 834244 522447 303395 272298 423318 680422
7857 680422 1024094 1124133 992049 1169120 1263491 1289727 803178 328779 -180920 -53254
7847 -53254 56666 302931 521745 715051 945921 797825 610988 451728 271194 117639
7837 117639 145888 281693 266604 -52322 -158086 42108 -22189 -212748 -471216 -330646
7827 -330646 -91796 313467 495365 541325 623573 562207 764686 786004 893569 929793 522064
7816 522064 471243 633876 357395 -104034 137930 116547 182165 236626 210160 390195 489278
7805 489278 643449 1080737 1035435 265014 -267193 -377460 -116009 146509 112162 54052
7795 54052 357215 717551 360416 158730 323076 619741 668804 511384 184311 197350
7785 197350 377269 226074 -300275 -452690 -66998 129323 177521 201795 329080 474179
7775 474179 130969 -397779 -651162 -582130 -383709 -627096 -562095 -49946 215869 -149042
7765 -149042 -273368 -134887 -165786 -1072 102738 198664 457414 302731 283360 301303
7755 301303 248074 -134378 -406603 -208151 -196637 -242215 -578117 -424711 -81185 110869
7745 110869 130464 232028 325517 290708 -50617 -315819 -142956 177395 -208215 -634207
7735 -634207 -741487 -271947 -373412 -424462 -541155 -526123 -70026 215496 26475 -77645
7725 -77645 -258300 -336679 89070 366130 467782 302721 -33913 -303205 -215771 -174153
7715 -174153 -243085 118753 398408 421307 280078 563862 717144 387137 -3992 -272887
7705 -272887 -601834 -716987 -477341 -141515 412691 506083 176446 -59173 -344331 -401521
7695 -401521 86412 23904 50498 -18995 -95548 -92056 -193857 -47765 -58560 -111376 184276
7684 184276 343878 491368 364976 347299 122269 146429 302296 126156 4870 -64458
7674 -64458 148766 140824 111004 -281641 -217184 83594 32254 55967 217211 -38738 -192391
7663 -192391 -33553 -75673 8760 114259 83323 47027 -77210 -217281 -121769 198505 481039
7652 481039 559892 336881 78309 43911 54450 177447 181737 -57017 -292332 -326129 -303866
7641 -303866 -331427 -383574 -261549 -560854 -398311 -289972 -248584 -338440 -171812 -70274
7631 -70274 78635 337004 544800 466829 237804 -45633 -2570 -13981 63921 -33635 -167275
7620 -167275 -325947 -222768 -387926 -373182 -232608 160134 295013 159851 -198966 -399818
7610 -399818 -317586 -95758 -214841 -657243 -870466 -343423 -137686 -198983 -329312 -305360
7600 -305360 64909 309525 453893 424044 1333 -308246 -52282 63136 -284412 -219649
7590 -219649 -251553 -564369 -662175 -450520 -402439 -460795 -343527 -183025 -195009 -334011 -327857
7579 -327857 -149337 -237214 -385265 -423205 -392422 -104187 -138882 -373719 -480152 -529100 -460055
7568 -460055 -244971 -470470 -371542 -126237 26341 490436 546696 446880 328110 115113
7558 115113 2214 145367 352453 569092 719077 615370 476085 376053 175152 -118578
7548 -118578 -318976 -290257 -218257 51536 23970 -425627 -431025 -500044 -563102 -352268 -78853
7537 -78853 -291350 -98383 178893 -219885 -715713 -244772 -321142 -500774 -631945 -261217
7527 -261217 44500 21136 -167005 -265588 6926 134198 276130 54550 -210381 -349671
7517 -349671 -360504 -352652 -165721 54546 74103 316485 135820 222714 127082 -7000 10932
7506 10932 -162779 -642314 -602478 -542929 -313527 -371151 -480724 -230954 -222654 -354140 -579044
7495 -579044 -722475 -656455 -34585 415003 464162 200756 21460 35081 118475 -8391
7485 -8391 211218 304444 107902 35332 409817 391547 25819 106788 231236 -39228 -364331
7474 -364331 -479755 -579975 -552281 -449928 -522877 -506333 -510645 -720977 -345291 22227 196666
7463 196666 320067 265418 151665 -35767 272923 63953 -338240 -130545 -125521 -81837
7453 -81837 113324 -115748 -194410 -196347 16387 159911 146780 -103625 -197057 -188133 -35529
7442 -35529 -13986 -135339 -94612 -100528 -95322 180101 530187 577690 485677 392356 139382
7431 139382 27588 -71750 -57174 227078 146750 233332 264125 -45551 -271767 -53409 -31162
7420 -31162 -140622 -153706 -174233 51387 151791 165244 113517 159864 43810 189258 161731
7409 161731 71143 -96721 -178064 -316753 -27238 300149 339766 287423 199857 366203 441351
7398 441351 233269 -21893 8977 -163473 -82611 278182 391735 322492 96608 -156314
7388 -156314 -245217 -440332 -180904 -13184 -21777 -109684 -515234 -469817 -257646 112968 280376
7377 280376 -6187 -137108 174533 203866 -62088 -348609 -661629 -230443 200151 123906
7367 123906 -50240 8780 342717 136905 -128582 -42872 -167018 -21702 -55439 128047
7357 128047 328522 -98266 -384400 -401348 -269940 -544597 -477811 -144706 -219433 -93201
7347 -93201 109991 73627 -113199 -299541 -286247 -325794 -208674 12537 158077 148586 -163257
7336 -163257 192409 213858 -182175 -168528 -383815 -496497 -476148 -71302 -6639 -316100
7326 -316100 -293905 -373960 -464932 -261520 97278 192293 14668 -249530 -83094 50623
7316 50623 185196 161750 -324861 -641858 -554468 -436586 -472923 -590535 -162108 -166919 37660
7305 37660 -278700 -483903 -537744 -352644 -209310 -178150 66220 -278768 -284286 -162264 85041
7294 85041 -77998 -233945 -266412 44555 -8531 -369927 -561443 -634930 -798968 -741172 -426672
7283 -426672 137595 -93377 -512948 -605527 -645708 -700281 -641481 -894034 -1073307 -826440
7273 -826440 -482331 -141058 -110251 -265087 -7526 174670 -5182 5868 -209797 -369029
7263 -369029 -315436 -341566 -338232 -59700 6961 -109386 -249077 -107120 307034 412896 420679
7252 420679 -13351 -438743 -475581 -204267 -60546 -533 270992 225142 295685 165018
7242 165018 23056 5148 -124018 -32486 -30077 -74040 -69223 106736 364292 179745 -63329
7231 -63329 -9431 279920 346673 222752 273078 305432 81434 360731 254800 -153179 -93618
7220 -93618 75625 81246 86972 156112 -273701 -577715 -368313 -278091 -400142 -219253 -209511
7209 -209511 -146853 257572 423785 208290 74282 -32036 -119820 -391176 -366641 -302255
7199 -302255 -235988 -474675 -331416 -118719 -8853 17260 -70634 -338094 -364201 -702589
7189 -702589 -744689 -586716 -193759 81158 182392 -79070 -236265 -234911 -145912 -204046 -230503
7178 -230503 -402425 -183325 -98102 -263812 -315761 -326774 -459926 -369779 -351356 -16864 -40401
7167 -40401 -231852 -308521 2262 341838 437367 608438 223794 33132 73772 -165979
7157 -165979 -553431 -452928 -211696 126795 101951 -180360 -349348 -288953 -319113 -258573
7147 -258573 15316 202758 365319 220295 -175459 -622739 -801572 -498859 -153957 -40483
7137 -40483 -52061 -47884 75911 248800 -32321 -254515 -258041 -149015 -31312 -75061 -203558
7126 -203558 -147076 86100 301967 237710 412335 355465 333246 367503 313057 557889 1012189
7115 1012189 908133 448382 24988 -89214 168620 194229 180618 356603 145320 -67183
7105 -67183 -195351 -202803 -17274 82530 125807 -57529 -301282 -343355 -402286 -371795 -45041
7094 -45041 -31012 -70531 -180648 -218202 -339662 -156135 160315 -22678 -138476 -176601 -200707
7083 -200707 -320187 -294496 -199277 -280408 -198578 21685 -32927 26225 -297661 -301953 -245106
7072 -245106 -400393 -226710 -224468 -384126 -135832 -337804 -429724 -206418 -283666 -196999 -289272
7061 -289272 -352334 -200475 -66077 29257 -510596 -386849 170877 364225 498652 91039
7051 91039 -58635 30513 23564 68352 379798 454401 343131 -57079 -259584 -46520 137681
7040 137681 454179 1053107 750390 136867 -50240 41943 276411 256917 -123155 -213612
7030 -213612 -176598 -200709 -248088 -66316 35695 -26682 368237 374127 171551 126679 -36967
7019 -36967 -125121 -59886 -31156 -183781 -379726 -190952 -119979 243243 917608 902345 971185
7008 971185 1023009 713864 122482 -319692 -204463 -58414 187063 23578 -92108 -133206
6998 -133206 -110304 -60283 40244 -28525 -39715 -57820 -244287 -408064 -416942 -227610 -197045
6987 -197045 111427 -27755 -199539 -84564 -88300 82129 -40094 -15546 174100 553688
6977 553688 709334 621597 339606 181031 330270 222664 102402 -35990 -116977 -163135
6967 -163135 106807 392978 48180 -158370 75298 172637 391116 -2410 -459069 -237025
6957 -237025 -395611 -274702 -222815 -61601 136057 316055 58333 -11392 -189255 -340890
6947 -340890 -329193 -419988 -25359 231063 65543 -144756 265994 645240 614031 218812
6937 218812 -38197 -145204 -362299 -589567 -715711 -823443 -516062 -241811 -186980 -269576
6927 -269576 -220518 -463404 -483895 -219552 -319296 -654552 -628150 -409469 -417325 -403824 -525748
6916 -525748 -238392 -416585 -324975 44855 -130971 -304583 -472622 -446058 -235629 -361108
6906 -361108 -514073 -220258 45092 -151293 12609 197395 232700 466864 437279 261012
6896 261012 99607 -5277 -221109 112345 444335 72759 -194118 38532 21065 -195657
6886 -195657 -120374 125082 395225 324611 379678 316451 -79206 -5114 327673 204378 -49850
6875 -49850 34828 -113580 196171 -46043 181718 -123921 -279315 -118094 -257456 -627384
6865 -627384 -394652 58003 193680 138476 33686 154452 54420 -203700 -217868 -94623
6855 -94623 -287399 -801590 -572493 -153821 -131445 -162376 -119602 47182 -142930 -636910
6845 -636910 -748348 -877989 -877380 -503120 -340754 -436293 -469117 -707534 -896557 -950996 -681181
6834 -681181 -330180 -397902 -650436 -728330 -603652 -599440 -348789 -228984 40383 311332
6824 311332 60432 -377338 -609444 -448711 46818 188525 2580 -105194 -29500 -449343
6814 -449343 -366597 -502225 -152975 112017 207890 356924 227235 380777 535214 470024
6804 470024 267477 135657 -12110 -347000 -620978 -555519 -759267 -613253 -453317 -501798
6794 -501798 -407039 130205 488416 389985 114575 -63312 -1593 -245645 -281706 -365327 -404968
6783 -404968 -443618 -414504 -52371 344657 170455 -38000 -45816 154705 108895 -234503 -647654
6772 -647654 -651226 -656692 -589345 -279103 32203 178970 258227 266884 469516 224616 -88355
6761 -88355 -46491 15143 -3598 5738 -32118 58477 46591 92187 179951 339717 480041 743198
6749 743198 647681 391827 598286 525936 308362 105033 346219 527597 276085 6124
6739 6124 -60755 -573854 -571227 -322492 -274023 -7454 -103633 -469764 -724923 -240594 -223365
6728 -223365 -120095 116876 245513 244846 146582 -242292 -248468 -52042 127107 137412 60443
6717 60443 52137 -31912 -309343 -400812 -87740 255484 195373 -98663 -338644 -297226 -370370
6706 -370370 -293795 -77044 114927 -87410 -102728 -15981 183226 539015 416004 143351
6696 143351 450858 74538 20214 203912 -163042 -29220 66026 153689 459478 249189
6686 249189 197888 59745 138399 260677 29971 -408294 -262788 -36207 -262600 -209183
6676 -209183 78377 160903 -261305 -237298 369605 465430 412945 472228 289910 185480 -132894
6665 -132894 -76887 18035 -41258 -282258 -262909 65688 349389 230856 278249 269673 77076
6654 77076 -52759 -380110 -663637 -597315 -298759 -124002 107443 146247 189921 225723 396537
6643 396537 17773 -233374 -166359 130026 310662 206956 -43811 -196225 -537323 -470974
6633 -470974 -424248 -774901 -542874 -289014 -154800 -51498 -66356 -18012 89423 -75918
6623 -75918 -369958 -212687 -61051 -156061 -83180 -117716 -300026 -490809 -473032 -555923 -293730
6612 -293730 -46554 -69432 -306785 -210259 103494 5563 -294094 -512615 -138665 150528
6602 150528 4569 -235442 -617708 -471231 -58673 -200658 -118521 -130373 -233559 -363572
6592 -363572 -322128 -226772 -262626 -159259 -175915 -219775 -354306 -339103 -522125 -468527 -495717
6581 -495717 -427391 -288527 -256399 27738 -46523 104170 -65521 9715 442933 486651 517783
6570 517783 566937 205366 279900 -26720 -284688 -237698 59407 545657 427753 110610
6560 110610 8806 82382 23464 141226 57267 217315 181292 -58007 -525809 -518420 -393722
6549 -393722 66028 380974 154012 -133127 -234861 -162313 151252 63553 73806 -58783
6539 -58783 -170963 -263943 -146442 1562 131054 172815 -366212 -687808 -510252 -472538
6529 -472538 -289295 46914 293608 2589 112230 52817 -1444 100437 45059 92335
6519 92335 261083 6865 -406402 -485308 -353536 -107707 -289777 -251995 -164780 -72799 -259256
6508 -259256 -265372 -101518 84740 57545 -39600 -110694 144344 261428 -100052 -492832 -434013
6497 -434013 -332903 -238431 -422145 -346871 -483396 -785956 -422312 -137011 -238304 -318233
6487 -318233 -437640 -154683 -202695 -12916 147684 -70744 -207956 32761 98110 52823
6477 52823 411895 250573 306113 489590 536748 60582 10799 317814 354080 307012 115748
6466 115748 -247706 -539481 -212107 226498 187590 -576883 -1126597 -1282346 -1277056 -640213
6456 -640213 -145095 35641 1208 60406 313751 418714 415367 288213 115801 205123 9368
6445 9368 -398811 -342711 17636 359577 363512 372728 346714 129375 337948 139944 48042
6434 48042 392648 445952 324122 53628 210185 265374 57787 -169153 -447172 -272322
6424 -272322 -56677 -97482 -190886 -140890 -120040 -142925 -135906 -73313 -260036 -369773 -376239
6413 -376239 -259116 -106125 -276517 -472050 -177948 -159672 -77446 469741 440932 69120
6403 69120 81215 337928 45555 98062 -20636 -299908 -451719 -286720 104548 142611
6393 142611 -152563 -216380 212683 -101741 -312492 -199012 -194132 -377564 -507804 -486331
6383 -486331 -368265 -15554 378002 568655 163515 -418561 -366758 -46851 14681 80371
6373 80371 -253493 -478466 -628354 -353408 -197761 -251045 -399744 -650293 -594237 84707
6363 84707 278776 396956 327965 94497 97591 -104115 -278300 -95352 413573 419604 81385
6352 81385 -163445 -5749 81551 204098 -264954 -271323 4521 -107969 -182067 -139360 -317723
6341 -317723 -439433 -511763 -544221 -654979 -122142 -47734 -109396 -6786 14126 -12601 -27184
6330 -27184 55644 -223242 -225263 -5225 -58956 -38821 -69768 -133163 -460894 -722050 -738931
6319 -738931 -663334 -580205 -157830 -76735 -235370 -238031 -134064 -205126 80188 64573 -421623
6308 -421623 -524867 -390494 -389285 -116816 25933 -189297 -14395 -137963 -163841 -258220
6298 -258220 -592003 -680213 -669209 -356615 -480290 -666593 -871575 -741623 -330679 -296292
6288 -296292 -628032 -670223 -622901 -647718 -719456 -265641 -7805 34444 -142785 -606617 -745776
6277 -745776 -247355 175329 117632 -40537 104455 481454 211765 -257581 -714277 -575020
6267 -575020 -94023 -276592 -367881 209786 203992 -61295 -85427 433067 969486 1048475 987591
6256 987591 806069 341286 323277 438777 436185 213954 153318 126327 -124592 -170982 -204806
6245 -204806 -179489 -4702 -285799 65623 377643 363361 575287 299223 -251658 -342980
6235 -342980 22767 189546 423299 196749 -276734 -148726 21334 88830 -128861 -230382
6225 -230382 -41865 -351264 -871198 -987573 -599609 -519985 -701500 -532743 -71951 17606
6215 17606 -320280 -368114 -229072 133302 191189 -117708 -772248 -840767 -549349 -285155
6205 -285155 15390 -106864 -255805 -301399 -328304 -313881 -317581 38635 478757 398358 306137
6194 306137 -67435 -85838 37400 357512 324676 103562 -42655 -138589 -143192 -28148 -76943
6183 -76943 101862 178678 3496 -302699 -288716 -255112 -507851 -759922 -690410 -333229 -121060
6172 -121060 24645 -139074 -225387 -311531 -328320 -212111 45492 126642 -128447 -200388 -140300
6161 -140300 -44826 261151 191672 4882 -286775 84309 -25365 -209249 -119487 91222
6151 91222 93673 146604 186711 248276 299897 402483 373717 307092 33978 251488 278465
6140 278465 164139 32939 66626 116653 241808 191239 91655 250353 -96233 -277726
6130 -277726 -79779 91096 -94739 -83845 -107652 -9310 79703 -183033 -212667 -336410 -210276
6119 -210276 60140 173344 7658 -98352 -152815 -83223 265134 402015 505079 878
6109 878 -230640 -282464 -393106 -312880 -61234 -335760 -471697 -367055 -348890 -83433 -292227
6098 -292227 -198013 -294702 -236362 -182619 -142543 212081 555794 205763 -96733 -222492 -259607
6087 -259607 209637 250666 39463 -163876 -223992 13077 -403579 -565324 -179082 -22932
6077 -22932 190214 290493 49384 -354088 -150160 -280851 -354039 -408251 -287888 -326495
6067 -326495 -635532 -835955 -783418 -730219 -497115 -254313 -180523 -46900 1744 25939 -39979
6056 -39979 -508137 -396202 66018 -83133 -33659 -248710 -73398 40328 32405 178090
6046 178090 390708 106222 -185739 -353038 -150830 -194547 -193157 -337496 -520802 -556917
6036 -556917 -278515 19160 284389 54707 -237604 -311969 -269474 118872 297278 231165
6026 231165 117780 3918 -235537 -109268 -51798 -154083 -223536 118357 221660 223875
6016 223875 -355179 -429177 -194032 -214784 -222278 -378051 -250896 -416837 -750741 -292347
6006 -292347 -130900 216794 672509 331629 -67942 -11073 -10774 63331 -175640 -5672 293724
5995 293724 681519 426922 155466 156600 52367 -116429 -160558 -107264 -61174 214787 321674
5984 321674 382460 483986 178922 84884 -37922 -346671 -80057 428095 661245 562434
5974 562434 143985 -128228 -441298 -5689 -95554 -624350 -765022 -434204 -504312 -455666
5964 -455666 -210454 92561 163099 182341 384268 168348 332172 650812 625516 593575
5954 593575 367426 319595 223250 278123 57754 128500 351129 93678 -302945 -195734
5944 -195734 -113431 -188443 -64571 -104455 -167438 -263968 -209509 56727 -168928 -498574 -349813
5933 -349813 -89007 -20191 -156979 -175757 -4700 -20230 -187391 -233655 49329 115206 281682
5922 281682 448833 548737 536956 49337 -309479 -640946 -677753 -627533 -255803 -131624
5912 -131624 -305906 -523614 -757014 -884376 -829714 -388479 93320 174099 329564 229189
5902 229189 124297 130022 54343 -226289 -277401 192624 363534 94247 -50341 15931 -112078
5891 -112078 -112844 17636 84075 280258 177641 356399 771669 479613 344099 325014 74926
5880 74926 111344 -62633 -300080 -422783 -261245 -137443 -374959 -413004 -718087 -687782
5870 -687782 -766306 -292216 -33971 -69593 -225436 90025 349126 401919 281848 96288
5860 96288 96378 77951 133788 -7706 -271707 -70273 -133731 -51584 138414 -24960 -487033
5849 -487033 125350 898265 957548 526383 534921 583664 407845 337880 182419 167358 274091
5838 274091 232884 157023 185630 278990 403543 -136909 -541110 -485678 -294224 -514593 -197241
5827 -197241 70288 -161971 -552615 -441870 -177219 31992 231597 165439 366833 342276
5817 342276 212561 -19207 -201537 -166885 -90572 -321051 -361515 -38559 -71361 -169430 7188
5806 7188 280720 308366 -152377 -360609 -200976 30217 -35393 -34569 -209748 -341225 -356251
5795 -356251 101561 -18674 -213954 -77984 222675 67924 39600 -118585 -66480 47677
5785 47677 412203 387491 -31372 -36807 -9621 -40186 -144240 -247248 -473581 -564201 -620518
5774 -620518 -455927 -517179 -592079 -317079 158264 538494 574022 169591 -200926 -214167
5764 -214167 38260 70354 166297 376557 -180839 -204908 2516 226689 -393056 -699168
5754 -699168 -563748 -208193 -38729 24898 -253009 -721810 -864068 -631480 -447272 -276661
5744 -276661 -41228 161657 127502 -302308 -501807 -628687 -602038 -194650 65838 77866
5734 77866 352 -375359 -292318 -335808 -462721 -393697 -343547 -385484 -150154 71510 -56494
5723 -56494 -38195 17396 204683 76377 -53134 -49049 92444 -156412 -354304 -337855 -167532
5712 -167532 -14269 -56290 365361 387322 493507 556657 227739 104963 170180 156565 231502
5701 231502 300296 467246 343254 176719 264400 18238 -35750 65358 29532 119371 109525
5690 109525 120879 205502 7267 -153385 -80428 280039 256530 86416 -4798 217610 239962
5679 239962 192095 36258 97922 145857 425234 704104 714147 442071 669272 853337
5669 853337 387269 62852 65069 -54377 -225050 -16488 143208 103526 -19012 -229447
5659 -229447 -198936 -238757 63102 -79190 -106677 -222175 -339047 -193662 121948 200497
5649 200497 280486 314245 258300 303336 203336 55070 122486 300579 310296 -156665 -311610
5638 -311610 -48995 242815 69940 68561 -5819 175311 357331 235381 228342 100975 316155
5627 316155 123194 -205746 -74031 137627 147634 127575 216130 178337 376551 136230
5617 136230 238575 323134 289890 378386 391293 225834 13352 -12113 275128 425488 502937
5606 502937 544305 475831 248728 249282 -39422 -21676 266938 418064 312655 -20598 -95096
5595 -95096 -314352 -514372 -310462 359126 166489 -82380 107533 249518 334516 414780
5585 414780 447224 197276 -209684 -327795 -416705 -277650 -242985 -251079 -41366 63616 27293
5574 27293 191465 133196 -195263 -423793 -183862 -65865 -235796 -319277 -471783 -462671 -442802
5563 -442802 -447143 -376814 -50746 -378583 -484511 -95927 232473 92094 230999 187232
5553 187232 -294668 -554328 -643757 -179981 -201959 -101360 76978 188809 221754 379802
5543 379802 -32585 -183073 -270766 -233760 43977 -24362 -203128 -155155 214844 331710
5533 331710 -29966 -70666 -5075 -370032 -523123 -588548 -547783 -152430 -159322 -55196 -93093
5522 -93093 -256462 -94888 -47525 -2147 87685 189637 358774 226619 -126774 -265616
5512 -265616 -293893 -253784 -362864 -221696 100556 56150 -71463 -28632 -201524 -506868
5502 -506868 -343243 -128116 443480 256191 15203 51341 -191883 59622 291788 332928
5492 332928 244945 42696 302410 445001 241872 184327 43632 -263990 -314032 -86816
5482 -86816 -261187 -233860 -359233 -429038 -60050 406333 312422 317851 352776 165147 -175060
5471 -175060 -238409 -636412 -629735 -364146 -480432 -506935 -320400 -43455 -199905 -120546 282599
5460 282599 208025 -224481 -475407 -385090 -209871 -355597 -594066 -374818 86628 299047
5450 299047 288228 276863 530484 377213 108182 249571 -54937 -216696 -477148 -785305
5440 -785305 -844386 -1010987 -738421 -586151 -558673 -430789 -533957 -614322 -521874 -199056
5430 -199056 124121 -113275 -70821 309138 605748 122253 -194065 90317 420822 364584
5420 364584 53079 -471648 -462885 -105704 19751 19811 -106794 -292050 -545501 -565293 -685809
5409 -685809 -829869 -663392 -130635 -49861 -326733 -237275 10559 510073 517787 178916
5399 178916 -124634 -112118 -205752 -277630 -330171 -10547 429888 615551 469810 534927 653485
5388 653485 515423 247577 433277 375247 616517 703380 260660 -60970 -203917 -63015
5378 -63015 38429 140125 152549 -31074 17313 234215 -114147 -314523 -527715 -529897 -365596
5367 -365596 -36032 231290 326458 63804 -221940 -275077 -158731 -81260 -148918 118944
5357 118944 136952 334662 361510 119180 115793 -202734 -77519 253747 257427 247186 194953
5346 194953 -120720 -715457 -865136 -847664 -830840 -839748 -923550 -936854 -411739 -256517 -320739
5335 -320739 -382030 35842 -116351 -178130 -79786 49099 59317 17385 -180786 -450584 -911590
5324 -911590 -880395 -761128 -180986 90974 149581 211127 218605 126574 78561 93569 114596
5313 114596 -4421 54844 92782 50672 39416 162708 173511 112742 293536 425708 511333
5302 511333 388057 387696 649099 692631 304022 -297744 -230705 -218838 -581956 -295146 -384259
5291 -384259 -238942 -310222 -358167 -405076 -353662 -290218 -363188 -442171 -494636 -822493 -910330
5280 -910330 -836631 -577497 -235578 -363874 -657757 -899962 -772137 -519152 -543152 -533429
5270 -533429 -486876 87267 186744 14109 -197737 41468 193759 70956 -30302 193916
5260 193916 77151 44288 348481 387693 87493 -233777 -138608 -33086 -87403 -272383
5250 -272383 -101533 76682 -96696 -281533 -645862 -730992 -470602 -265798 -521239 -252608
5240 -252608 -95086 -177225 33556 169915 -376381 -446669 -135821 108096 201894 397433
5230 397433 288862 229878 374771 395808 450200 197473 -151181 -365834 -78832 371915
5220 371915 -88950 -415065 -512603 -645805 -437125 -13357 -208138 -183602 -600511 -738308
5210 -738308 -416187 -279982 -75317 146578 32826 -71265 281886 189583 -12380 -78054
5200 -78054 -33852 -56712 -100671 -117826 -421650 -709463 -773792 -563506 -457773 -404720 -823177
5189 -823177 -724350 -767020 -866596 -525258 -269575 -280547 -415847 -276528 -101406 -248848
5179 -248848 -188745 -445175 -424703 3641 153981 125126 -75329 20534 -91651 -216352
5169 -216352 -70735 169089 208237 448248 508716 248552 -3347 -135540 -132316 -31546
5159 -31546 -88882 -422775 -826887 -571573 -436635 -222048 68811 302660 602409 680474
5149 680474 515968 21889 -51736 -199792 -98143 48833 70041 -137959 -403774 -337406
5139 -337406 -168202 286927 313658 496488 376637 -47271 -250932 -103335 215056 414724
5129 414724 168575 245313 377844 409405 670431 775573 872117 512786 254445 79943
5119 79943 296645 141295 349026 481314 590414 369617 566039 916943 691112 386537
5109 386537 225342 8387 -88047 38733 274891 199741 119285 366375 286418 -26529
5099 -26529 -335555 -118879 -537934 -786593 -555695 -249065 2033 379079 290424 189016
5089 189016 119854 82156 -107346 -294157 -486461 -157260 -161067 -374572 -433939 -236774 342102
5078 342102 354963 174032 25055 -171064 -278744 71214 173995 110418 163306 340793
5068 340793 678345 359420 -51546 247757 131651 -255425 -245026 -230939 -159137 201013
5058 201013 487747 401088 147949 44311 287137 587289 298823 82334 175012 291237
5048 291237 295496 142083 1918 -41421 -175627 63967 590348 717274 406220 44738
5038 44738 178688 292757 369029 312930 182649 -26045 66375 -139449 -552695 -581173 -448422
5027 -448422 -183659 27234 170654 123007 312589 111059 218642 494636 619109 233094
5017 233094 -149523 -210987 114656 315014 173671 -193190 -323726 -409289 -80205 362468
5007 362468 561272 489184 377032 192852 -178904 12345 299992 399975 100065 -24667
4997 -24667 235427 649854 392015 406505 395909 475108 629591 549153 355213 120601 -129832
4986 -129832 -238564 -137703 -11755 179078 54378 -261282 -163623 -233682 -423823 -567723
4976 -567723 -638138 -507427 -313008 -133284 82657 160129 193906 -57641 -178943 -258881
4966 -258881 -555032 -441478 -509345 -535202 -476407 -358259 -125852 -145234 -256425 -374156
4956 -374156 -244548 -367896 -153966 111995 -119837 -133526 336859 618677 402565 396288
4946 396288 432965 397221 292671 373130 411809 135652 261631 41657 -377528 -189774
4936 -189774 117239 71636 -25045 -51602 -107037 11688 -197015 -109895 65555 106486 44692
4925 44692 -38204 -113732 -201409 89176 225675 -12919 62196 142697 152586 -148431 74620
4914 74620 66879 -16299 252091 464399 496506 494908 434563 202013 30515 -365030 -41853
4903 -41853 56582 -124180 -541951 -535116 -392324 36091 270647 500029 447396 87427 174110
4892 174110 176025 -3117 -16812 -343805 -405388 -260315 20743 36705 -309969 -262393 -104435
4881 -104435 -33673 -18275 -133431 -112731 16893 -123420 -337006 -345011 -412112 -265240 -342232
4870 -342232 -635057 -687444 -461234 -214981 -179664 -271595 -189744 -172247 -99705 -21431 248881
4859 248881 295804 236917 184186 -141431 -308409 -306561 -66619 197520 -397827 -935293 -684469
4848 -684469 -634545 -652572 -587904 -742200 -564707 -506194 -387305 -181781 -169317 -199132 174574
4837 174574 176280 100868 208849 -440946 -795339 -590408 -649910 -618229 -630539 -366506 -410146
4826 -410146 -717610 -644225 -606892 -503251 -488735 -808112 -683330 -613152 -371665 -253364
4816 -253364 -680460 -516611 -199881 -181045 42449 17810 -155447 -554289 -458402 -56950
4806 -56950 -195858 -409885 -493189 -616467 -516403 -292873 -319191 -69729 40860 179845
4796 179845 157773 33917 249159 283833 39135 76781 -48450 -46960 29979 619654 730684
4785 730684 211656 24861 196340 338853 273075 295669 160740 88934 205107 179447
4775 179447 174385 59742 -518880 -494599 -151190 -11792 6930 18770 174868 54835 935
4764 935 -54723 -189101 -202621 -160448 -181529 -53426 -99656 -41973 259649 389727 299280
4753 299280 342107 375525 617030 469944 115090 216728 204977 301417 607463 692623 533880
4742 533880 470802 585775 466484 305369 -119104 -411898 -761969 -827693 -815583 -510330
4732 -510330 -205675 -285750 -360752 51198 338055 318752 203419 79730 -105045 -318154
4722 -318154 -261525 -42236 75821 38442 167643 330434 494246 660552 329131 30517
4712 30517 226259 137850 47184 266506 345490 356495 377011 -6143 -110475 231 -50161
4701 -50161 -273778 -195688 -138105 62804 8242 -70155 120271 167297 137076 227365 231824
4690 231824 417462 301756 -49604 -234925 -88235 -400942 -611853 -532885 -427988 -180798
4680 -180798 -314167 -338703 -72152 6841 10759 -1030 -294583 -284760 -30789 58330 -13261
4669 -13261 -220186 67402 441528 345000 -193047 -307543 -710701 -703290 -415203 85954
4659 85954 85318 -142182 -459591 -324735 -224401 -90865 235634 382118 458349 430499 -70714
4648 -70714 -257493 -337979 -583498 -802953 -1071304 -841099 -837091 -704754 -489365 -473085 -331850
4637 -331850 -292379 -130551 -325012 -445178 -469309 -306320 -36817 -100674 -124623 243795
4627 243795 290783 324953 333108 204249 49342 276831 299876 -105628 -110975 -227979 -135732
4616 -135732 321 -199407 -123232 -53494 28803 -44656 -359287 -336188 -139441 -374078 -380437
4605 -380437 -443345 -710376 -609605 -510121 -371961 -564149 -518782 -324015 -122458 27061
4595 27061 133995 -46712 -228706 -90686 155970 167135 -217472 -296347 -395829 -255829
4585 -255829 -146343 -337613 -323482 -213975 -201224 -386778 -595320 -739981 -729247 -224656
4575 -224656 232683 295035 439021 383795 35229 -45238 26826 175424 83428 60551 175373
4564 175373 344685 227311 -258891 -211137 -43557 144152 301572 -1187 1317 168709
4554 168709 -168345 -83468 -253460 -376306 -183846 -254425 -450181 -151538 75131 285306
4544 285306 512258 515310 484963 322374 410901 541301 642053 181120 13465 -87668
4534 -87668 -116153 69052 -73346 187403 297138 209913 276151 381056 544177 433574
4524 433574 94540 -139721 241563 465910 432289 334662 80379 -79265 -295836 -150607
4514 -150607 -204893 -283037 -315870 71503 169445 278628 195464 201566 -102717 -567918 -619267
4503 -619267 -204133 -22870 150222 80420 -31518 15577 -67534 -26742 160190 414622
4493 414622 559379 300196 60077 152926 237612 26191 71782 2728 -357171 -558182
4483 -558182 -608182 -493802 -570296 -480778 -196403 63753 -255868 -475252 -277507 -231439
4473 -231439 -266266 -170650 -314409 -304467 -170600 69653 -211853 -598066 -428094 23365
4463 23365 121248 40976 101242 -54553 -351895 -602350 -498506 11629 314724 192371
4453 192371 35221 32381 83230 -87122 -141308 -183437 24356 110736 -84855 208830 407445
4442 407445 144305 -56837 -226891 -659638 -255058 40161 98114 -159052 -136147 306105
4432 306105 198879 -42168 -330727 -432203 -279478 -427587 -472634 -89258 45416 -68772
4422 -68772 -445264 -284293 336199 691480 227481 -225935 -325596 -122350 -16064 -45568
4412 -45568 -217549 -264164 -532986 -441889 211912 394705 269012 370458 486928 295961
4402 295961 51425 -225490 -94378 -74632 -125811 -250647 -220638 -268595 -422953 -187218
4392 -187218 -22997 -39076 -61673 -254208 -69895 -74299 -21951 278316 476539 370748 228896
4381 228896 191159 466688 220374 109860 225960 -179049 -583632 -699583 -570610 -505807
4371 -505807 -310375 -253676 -74423 -62271 82047 182430 -35358 -163526 -279367 -210928
4361 -210928 53106 -22233 -44258 -208671 1417 -442718 -570185 -412960 -551199 -734596
4351 -734596 -549973 -378880 -701169 -793883 -575323 -813080 -783270 -602219 -556663 -544297
4341 -544297 -81967 36882 366713 373874 322007 147295 79490 -144555 -79310 -202492 -85345
4330 -85345 -301594 -663192 -494912 -402796 -94103 -163398 -228150 -349822 -379058 -417722 -471653
4319 -471653 -212503 -222537 -454925 -549516 -487521 -700720 -776827 -467836 -534890 -518327 -369540
4308 -369540 -415883 -100444 48849 209111 118876 -57284 -589522 -719472 -802414 -697716
4298 -697716 -544856 -603966 -652092 -298158 -425601 -557315 -207338 273560 144669 -406833
4288 -406833 -510140 -380384 -238718 -15274 128574 -18360 82757 237710 459545 519210
4278 519210 405491 284349 284931 625846 666564 319524 -15003 -147873 11205 272518
4268 272518 -207466 -39163 -199636 -326647 -264788 -469622 -501101 -286754 -91982 -91104 -281026
4257 -281026 -216009 58134 47940 -303770 -589079 -546037 -264402 110748 137300 108793 63610
4246 63610 -200681 -269709 -400311 -265555 -124308 -10530 170962 -107320 -332358 -588970
4236 -588970 -498274 -439246 -450850 -166520 -295897 -79428 -167146 -38757 96852 -9340
4226 -9340 -285886 -140051 -184853 -356151 -360203 -251380 192797 85000 97352 -149858 143641
4215 143641 459558 347870 202423 264895 321635 -213633 -208480 -205034 -172548 60049 371957
4204 371957 266035 94964 -259637 -288574 -162688 -38707 61952 -146795 3183 309200
4194 309200 -33984 -281622 -347328 -377660 -262832 -431776 -231878 147079 211167 -17840
4184 -17840 -36427 89125 65357 265420 397236 179650 -362905 -116505 49972 73053
4174 73053 196141 -102937 -354176 -542641 -584614 -396855 -232807 -520261 -508659 -174502
4164 -174502 -49503 -50962 -188174 -200885 27286 194832 356365 389430 65476 -57996
4154 -57996 -14177 -26410 341599 330816 175201 -174047 -484870 -56334 -138800 -253734 -393078
4143 -393078 -293783 -42301 -173799 -243494 -378014 -184342 -306914 -235451 -244285 -133935 -117371
4132 -117371 -113032 -74186 -294504 -339770 -205457 -249269 -410153 -481097 -385633 -319254 -595053
4121 -595053 -632689 -120069 275029 -43168 -193561 141059 23374 -87985 -139598 -347505
4111 -347505 -225103 4404 -291169 -512126 -912695 -641032 10722 214986 198737 474346
4101 474346 647181 420444 169284 -43713 -71974 -36212 -21154 259606 130086 -155475
4091 -155475 -223774 -549177 -757171 -413777 99800 190791 -108272 -356548 -239107 -84725
4081 -84725 -19889 16766 67653 332179 506484 407429 365565 200150 55311 -23893 288277
4070 288277 304981 -139443 -37123 -141605 -103168 65225 -2830 82407 80693 64636 -268018
4059 -268018 -525698 -451687 -325007 153073 255304 160546 -325250 -569768 -594935 -112786
4049 -112786 -54550 -250072 -387396 -272329 -82473 40937 132353 85949 81922 54784 -203805
4038 -203805 -171228 -178622 -157651 -155150 -24938 135903 -222997 -763059 -1042021 -1231196 -1150488
4027 -1150488 -601276 128354 272978 13753 -234395 -527590 -557259 -262131 63702 165899
4017 165899 175316 193138 -24239 -46889 -199225 -493259 -422436 -348386 -134367 271112 159328
4006 159328 -178005 -234793 -496230 -429332 -170096 -301715 -96821 -132717 59757 38553
3996 38553 -76331 -423011 -409479 -129465 -83593 -302325 -142841 477117 336839 277272
3986 277272 114757 115852 491735 550355 101756 -137913 222355 -9638 -454932 -746519
3976 -746519 -839531 -843765 -850545 -361285 -390976 -358024 -31932 6504 -489236 -622220 -419159
3965 -419159 -89653 354143 483768 276729 248501 -22725 -292699 120077 379372 456420
3955 456420 636972 186982 -352168 -459184 -262305 25461 65806 32948 -92627 -152736
3945 -152736 -506719 -157782 -361078 -214639 76581 294264 232181 709 -70441 137044
3935 137044 95093 -143915 -389551 -100981 217321 769285 1120375 978006 1051310 1037286
3925 1037286 521125 13979 2018 244375 461412 48733 -219620 -328932 -121513 65723
3915 65723 222140 210839 288309 634672 654805 346461 381255 434020 319281 160250 196488
3904 196488 173587 254969 453627 40072 167756 275915 309732 -151872 -375715 -173114
3894 -173114 -28683 165681 27411 217486 414470 564431 88492 -77675 -96818 73907
3884 73907 262540 412550 99922 -71111 64090 108453 143701 159446 -52528 -283606
3874 -283606 35913 256261 231578 59613 -104293 140937 197574 -255685 -630362 -630794 -494200
3863 -494200 -383094 -158830 -20213 -33269 129268 405770 118216 191873 93032 210931
3853 210931 132649 24187 57473 215033 -130894 -437049 -462794 -695337 -608864 -697174 -667894
3842 -667894 -819907 -851721 -689299 -335038 87762 228527 125267 -273110 -111323 191141
3832 191141 214089 135939 40279 162870 188655 109136 88579 364577 308060 218700 18399
3821 18399 -198840 180090 465416 491674 429421 588053 444946 282124 550503 512076
3811 512076 514887 547779 456209 374972 285353 320233 403885 241328 -112621 -64634 -242091
3800 -242091 -597480 -636755 -295524 -88159 58603 8488 -461547 -589678 -160468 213071
3790 213071 -95170 -57852 146387 207787 181767 -3785 -274313 -620857 -299675 81662
3780 81662 -108879 -82289 100019 -255234 -324769 -123120 -25178 -44679 -133457 -315494 -241546
3769 -241546 -88901 53520 168634 573214 729076 387030 118320 -379888 -688995 -750517
3759 -750517 -772408 -664230 -472041 -213081 -100996 -240701 -384108 -657558 -357330 -50758
3749 -50758 -120311 133578 519719 418398 -79080 -128969 15236 -4692 -199871 -167991 -46172
3738 -46172 -101221 -371905 -745754 -325189 -67804 -105786 98528 300030 211575 -108763
3728 -108763 -11801 26973 -210201 -164210 419759 679529 768735 825261 828089 492063 -10869
3717 -10869 17563 228996 34300 -89781 -14066 175928 -119088 -195950 186621 137280 109478
3706 109478 400720 508827 516875 673718 382826 73269 48435 260979 163835 283568
3696 283568 303134 -36640 -363731 -306860 -201226 -169980 -80288 -245471 -265317 -330498 -274204
3685 -274204 -90490 103101 245830 394949 -13491 -266997 -151990 88046 258404 118715
3675 118715 6839 -39230 300221 465369 829843 1135056 843764 549648 91551 -145799
3665 -145799 -27313 9000 6176 -108381 16695 196857 548246 590403 247941 173025 202041
3654 202041 579953 243412 102079 45994 -191863 110026 385513 118807 17771 44606
3644 44606 249086 277931 127621 424088 732683 644606 126927 -205151 -206229 -351181 -345548
3633 -345548 -383480 -323799 -169573 -326909 -176391 -284007 3220 52420 -101912 -311650
3623 -311650 -642848 -739531 -753110 -560123 26953 107300 -377606 -314640 35116 306426
3613 306426 366265 113083 -282655 -154929 -302380 -177659 276523 706685 629311 168719
3603 168719 273875 164932 -95094 -86691 -137598 -279096 -393256 -591324 -603262 -564768 -217912
3592 -217912 127478 143341 434288 820114 577793 23259 -4033 -11403 -108997 -301308 -563875
3581 -563875 -463598 -237446 -255861 -503690 -240711 242302 450351 430112 309116 207479
3571 207479 248497 -216552 -584014 -577383 -867012 -924097 -529404 -465753 -351629 -493921 -470238
3560 -470238 -136530 -309233 -195446 -257576 -365507 -313368 -620329 -295108 -3196 -261545
3550 -261545 -339985 -374364 -379624 -133457 346363 376441 369064 179062 60783 129019 -17395
3539 -17395 36965 108970 395891 443321 267155 108879 -78017 43645 250958 59870
3529 59870 170770 226496 199957 208975 210889 170387 -84617 -277644 -130520 -96491 -25096
3518 -25096 -129949 -162890 85616 -49755 -6521 -6021 -15979 54730 -52792 -125804 102606
3507 102606 128655 113013 338111 481999 133415 113896 405371 428340 179342 -97472
3497 -97472 28586 -57241 -227103 -412035 -460496 -363944 -352143 -470443 -846883 -539508 -253881
3486 -253881 -433608 -705700 -348750 16510 341175 187943 311174 162508 -113950 -488339
3476 -488339 -213343 -209458 -413939 -430079 -395833 -276089 66291 185120 62302 -323906
3466 -323906 -500196 -345581 -397020 -275410 -284457 -314613 89023 570030 203422 36410
3456 36410 272597 14747 49028 25309 -287442 -313867 -203507 85975 254366 135256
3446 135256 415300 328999 208626 41421 188562 -223780 -608339 -691006 -388631 -512969
3436 -512969 -275779 -154996 324356 101330 -410230 -266829 179870 225537 140757 149650
3426 149650 226555 265535 425590 668273 601071 500296 311966 285102 119825 -190367
3416 -190367 -174596 -531081 -708899 -180300 218571 252010 408778 353201 6094 35970
3406 35970 92104 93253 -65134 -259337 -294750 -127476 -43002 -67956 225119 447095 318324
3395 318324 384180 541615 366953 239518 431957 167166 53627 269775 380343 482315
3385 482315 524929 472950 229920 138255 46858 -32157 -238821 -245018 -445150 -570608 -630195
3374 -630195 -378070 -208076 -377831 -361652 -382047 -464967 -573329 -433827 -432775 -341364 -299189
3363 -299189 9484 191474 232192 331053 180171 -549631 -605963 -269601 -325930 -227143 -128990
3352 -128990 -169135 -84968 263601 230598 178403 167621 -35542 169451 466413 279233 211040
3341 211040 88329 -138467 -315882 76434 123532 -95362 -419224 -400877 -448394 -287799
3331 -287799 -29812 287878 608232 361592 -2211 -10428 -334950 -270983 22606 152585
3321 152585 298299 311000 471377 522245 522185 588166 450881 102063 150354 304638 99370
3310 99370 211930 198657 12331 275076 644659 276959 -50731 -410498 -839626 -744390
3300 -744390 -515073 -445683 -394335 -190275 -47483 183080 -278768 -427426 -278659 -133933
3290 -133933 -314795 -273051 -354416 -435675 -260226 -258567 -63606 -133217 134341 145792 -286859
3279 -286859 -198130 22006 10229 -29586 -114581 -45185 -133702 -47155 20102 -125572 -204881
3268 -204881 -228792 -292406 173304 459358 591760 187783 -153872 10089 116630 -90139
3258 -90139 -111083 88848 170946 450715 531844 453319 235356 123506 67720 -221798 -368978
3247 -368978 -195783 -77666 -171744 -361526 -97890 -1867 -91571 -466347 -529446 -408214
3237 -408214 27607 367136 263814 227876 530201 474788 348706 237324 69006 -74428
3227 -74428 -184340 -4649 92963 51140 -53671 -500919 -415550 -410740 -291896 45643 -227901
3216 -227901 -425335 -57977 422551 510622 18331 -51741 173417 63491 -246926 -83483
3206 -83483 12565 397479 403365 171830 302023 8387 -340907 -152634 -35377 83828
3196 83828 179566 119740 173456 18612 -176364 137448 557548 605068 581571 765228 923559
3185 923559 738410 342365 -210574 -377525 -267055 -442586 -746015 -592248 -332605 -274796
3175 -274796 -342420 -209178 -292878 -61296 362292 402923 9306 -433606 -212975 228605
3165 228605 474776 265788 -24358 255387 265004 156803 -28095 -26492 51624 -102097 -289396
3154 -289396 216906 212166 309784 403367 7019 -425236 -274091 -48191 -921 37482 344343
3143 344343 373354 104910 -254955 -114815 -34134 15557 86396 37315 116397 -53337 -328329
3132 -328329 -106575 19267 303800 299887 101674 146622 350844 468566 598244 538396
3122 538396 378875 298736 438982 535756 541503 606491 587510 320633 262418 140820 16313
3111 16313 64029 -171230 -445847 -640051 -438268 -110124 -16285 104631 402929 -40010
3101 -40010 -451598 -386966 -370636 103274 358497 149215 66697 125639 194065 499598 627079
3090 627079 799203 654559 498562 403344 206029 -28571 122518 161251 -59733 94588
3080 94588 389039 244495 169359 429262 773666 748442 449435 165473 363761 283953
3070 283953 259724 -35382 -47317 86438 180470 378166 125614 245663 66435 -151253
3060 -151253 -203670 -168000 -447185 -478064 -571450 -345655 -299740 -64991 -35281 -65626 21547
3049 21547 -120361 204718 234792 -171127 -460416 -325263 -180506 -179288 86877 278621
3039 278621 181205 -211572 -318237 -259203 -21740 63861 -72407 -394869 -184737 216669
3029 216669 291836 265330 -31604 -358679 -300678 -335151 -392376 -319582 -130256 114088 542671
3018 542671 475553 84925 -48550 165099 312645 273542 5069 60214 115987 16406 -143598
3007 -143598 -122531 -378749 -310179 -349743 -576559 -587712 -388154 -309781 -178146 -326965 -574147
2996 -574147 -545358 -220939 12491 285286 -11912 -27276 -398800 -635557 -819564 -746078
2986 -746078 -506562 -49718 72625 -16301 -142253 184256 196998 385551 310932 -40065
2976 -40065 -108672 -422095 -149718 375347 286575 -4296 22566 75840 289216 42155 -7544
2965 -7544 -108861 -157670 -384181 -322632 -142811 206873 467253 104294 -355366 -436975 -338266
2954 -338266 -100003 -82670 -334390 -346428 -176666 -229089 155424 338221 389637 348860 216220
2943 216220 236076 388566 504126 346656 629040 706904 996710 446071 -233427 -454118
2933 -454118 -193642 -65871 -283505 -537633 -833860 -504734 -82517 -276657 -450019 -436238
2923 -436238 -435712 -403091 -377715 -25445 -102344 -423874 -136220 165811 326671 329457 445209
2912 445209 369686 240544 127414 496636 685107 730344 638194 486094 352978 511074
2902 511074 146030 -144872 -284625 -374794 -662431 -374242 -92007 -66260 -79663 -100019
2892 -100019 -361867 -216374 -198880 -172896 -351746 -281559 -136736 -304617 -579644 -490491
2882 -490491 -37660 58762 -61354 -303256 -127174 162260 385582 389349 320060 322575 87421
2871 87421 -171513 -216335 -10957 459219 785028 372332 114120 61287 -489458 -689138
2861 -689138 -351660 -421985 -386484 77020 351303 632192 351565 350388 234613 -84983
2851 -84983 -342793 -443658 -389134 -156512 412956 399853 -127164 -170432 121250 202148 156384
2840 156384 142752 -1239 21229 265629 390886 98456 -12918 28652 185711 121597
2830 121597 -81013 -96124 -323770 -522697 -497330 -449710 -607709 -512165 -342699 107160
2820 107160 158679 258264 150088 240328 332565 361673 192991 192956 397851 168001 257149
2809 257149 477994 430681 61369 -100797 -263055 -141485 31192 83268 225287 326717
2799 326717 369300 121897 -252343 -413304 -557221 -345362 -113820 -57921 -90184 -179295
2789 -179295 -174514 -11181 20963 -91842 -162701 -184214 -416785 -410439 -234444 -72543 -131788
2778 -131788 -11218 -108429 -344171 -159684 211857 202584 -48210 -13471 224545 140392 60649
2767 60649 -318819 -503968 -146736 292095 238346 234247 514066 587189 441153 248691 240454
2756 240454 204468 -57023 -482632 -249101 -272402 -550937 -463472 -48755 98330 350257
2746 350257 559748 318538 50896 -91537 -341292 -431298 -543461 -760093 -476520 -213569
2736 -213569 333083 734435 575579 510942 220460 539034 977878 745317 494379 -33855
2726 -33855 -164650 -90504 162649 186059 -20026 -74745 -65199 140625 -132425 -638194 -746499
2715 -746499 -567336 -205716 385044 311007 66193 232255 323739 143757 44899 -49222
2705 -49222 -24569 193843 288204 381546 457676 249099 249458 458203 358224 269004 430252
2694 430252 162456 306059 426987 545750 260318 350968 402945 129429 -210799 -257112
2684 -257112 -191694 86803 161252 321762 556435 420625 156135 209863 -159371 -238741
2674 -238741 -350038 -283487 -197380 130078 -20721 -179375 -222906 -77929 1918 -2684 -164844
2663 -164844 -287735 -265005 121199 333596 295578 40623 -124444 -219113 1609 172923
2653 172923 -191421 -409020 -211631 46315 215546 74912 120497 -103744 11738 291909
2643 291909 405937 201352 109889 208554 -26655 -318316 -377920 -195978 -44946 -198243
2633 -198243 -421214 -294062 141604 -42921 -240565 138134 64720 3429 -71885 -227704
2623 -227704 -330147 -295594 -280469 196126 342496 404196 20526 -262428 -133897 -191867
2613 -191867 -428088 -166352 -57125 -90900 -377860 -325257 -128955 -176217 -117522 218029
2603 218029 337345 305330 224421 318109 451285 436869 406961 245405 302187 154772 64943
2592 64943 -29599 -165461 -213015 -408002 -550392 -334704 -229801 -408307 -244903 24504
2582 24504 -52607 63269 -14039 -265788 -276169 -39596 201191 55537 41976 258742 98172
2571 98172 109633 73538 345967 97386 65026 -161074 -51384 -154599 -533544 -475106 -218721
2560 -218721 47429 -61115 -168699 151407 343132 34224 -182359 -189832 21547 -165331
2550 -165331 -110574 25551 -104291 -165368 -10149 -159780 -181225 -228220 -394291 -301927 124995
2539 124995 275003 313079 291377 45444 282162 128098 -71381 -76919 -93957 -342518 -292436
2528 -292436 -188765 -231331 -98656 -259136 -376916 -203552 117492 391 252902 35842
2518 35842 278242 480175 309834 150113 312556 501111 324544 107384 2319 -45274
2508 -45274 -240866 -576045 -173467 -60416 -39006 37457 420908 149685 106390 -213322
2498 -213322 -644180 -388690 -284650 -179400 -40110 -46347 284345 655937 476430 259791
2488 259791 -164625 -341736 48294 303236 645428 575942 529749 338650 164981 -97719
2478 -97719 -199439 -398909 -372239 -518309 -211045 25979 232278 360693 246946 138268
2468 138268 40737 -226090 -38182 -20142 -108804 103822 255340 325336 565697 522132 274939
2457 274939 -80556 -57063 67724 406587 345557 72229 -226030 -364659 98297 90236
2447 90236 -113165 -25533 -232515 -104714 -40901 -301110 -394561 -332916 -130123 -52361 -270985
2436 -270985 -219115 -219949 -301 -101565 -9371 -21828 259699 686423 303929 -214312 -320487
2425 -320487 -1608 370125 372361 450871 -29345 -89519 -88268 82559 -44209 -227915 -241903
2414 -241903 -249190 -354304 -92085 -19290 338964 -25840 -66191 241394 460740 168448
2404 168448 -29263 -86443 4114 -190896 -153824 223615 501266 153833 -97263 -38112
2394 -38112 14131 279431 184166 225067 160376 -27134 -11900 118161 -101108 -44764 209159
2383 209159 112779 6991 52838 180551 -56689 -528117 -467675 -275317 44643 363628
2373 363628 327298 149701 184951 330493 296753 305272 542944 844487 618757 445881 476907
2362 476907 563614 488116 318024 359335 -32741 -307037 -165606 236306 205101 11791
2352 11791 136271 204636 -24503 -318877 -796051 -421504 -229497 61394 267254 156448
2342 156448 291812 196040 237745 515264 577372 564969 301221 147697 249034 -101263
2332 -101263 -298346 -22916 257715 204216 317611 360046 239219 183840 250324 339650 158582
2321 158582 61911 -252815 -277538 137487 37798 31807 -88126 -324216 -434351 -314086 -145376
2310 -145376 -114744 -457205 -389224 -396010 -204611 -215281 -517033 -589530 -554795 -485039 -305080
2299 -305080 308458 438390 341699 70899 37646 359380 533726 495250 514060 761097
2289 761097 543917 65401 -46474 -165658 -370332 -292901 19539 -39717 -218239 -200267
2279 -200267 13919 -34841 -371226 -559907 -340804 -200456 -677182 -740151 -21650 407823
2269 407823 581983 442237 -427 -172049 -230778 -81404 148622 228604 20738 -109662
2259 -109662 -347979 -282711 140907 314175 159092 -88552 56309 76251 313640 379519
2249 379519 -41437 -193762 -137897 -132154 -185288 -329252 -328946 -317626 -323940 -350416 -423831 -177511
2237 -177511 31087 95829 -83444 -250579 -229989 -310520 -200110 132711 371824 283078
2227 283078 298400 316498 452931 241312 55699 -162182 -543521 -339412 -243365 -106839
2217 -106839 227129 202046 69717 226195 -101943 -111571 -152505 -360210 -406989 -362183 -239624
2206 -239624 398436 553857 233897 113687 -19248 68619 -23859 -130057 -131451 -103102 -36174
2195 -36174 170370 130545 174062 373491 59497 -31391 -231162 -189203 59055 457720 464289
2184 464289 281032 245653 144480 -212136 -454774 -497167 -486021 -394550 -317707 -252173 -182894
2173 -182894 -108459 226144 258110 267106 341112 377355 558871 254964 9015 99752 223634
2162 223634 41014 30867 124676 -606564 -249396 7636 85549 324615 150299 -104919
2152 -104919 -7625 -268219 -541720 -530582 -813391 -760757 -562332 -609725 -448939 -115775
2142 -115775 -147704 92330 -113995 -59545 117840 -20245 -327996 -259953 147006 270138
2132 270138 128676 250206 303150 45292 -238591 -272081 -264495 -494801 -426824 -162609 -207776
2121 -207776 -419342 -578006 -524769 -204763 -314182 -348557 -184196 -71993 -41484 186527
2111 186527 364915 -18892 -127667 165040 113365 204495 19874 15304 200763 283563 80121
2100 80121 85356 -182335 -226497 -34798 53137 -88664 42803 311118 128599 266694 383685
2089 383685 430802 279462 27621 -38524 -275729 -441973 -438489 -466706 -611312 -553656 54599
2078 54599 147136 372000 690164 512358 160661 -105333 -154418 -22575 -6097 -63441 -191910
2067 -191910 -242508 -141230 30671 -10902 183227 130819 -110377 -10136 -178143 -351031
2057 -351031 -135217 27290 -211517 167842 88930 8095 207478 509374 395583 115972
2047 115972 259560 316457 206198 413661 465348 350774 384567 419162 221702 463741
2037 463741 376530 47022 -33292 -229313 54621 -65308 -89602 171343 177193 282443 108080
2026 108080 31390 52657 -414224 -256212 -240157 -513081 -787980 -614331 -530371 -625075 -303461
2015 -303461 -104334 27363 286331 72188 -108677 -100230 -68667 100027 207597 395137
2005 395137 422877 240908 152685 66643 88130 -14438 -22504 82241 227833 234495 126618
1994 126618 -120175 -155893 201902 307704 264043 37393 22847 122099 387699 740151
1984 740151 974385 757308 592284 267500 132553 311368 340325 417194 238839 411083
1974 411083 432612 522659 206132 -65516 -32391 -114521 -69801 -215368 -421245 -447240 -401559
1963 -401559 -308413 -215624 44830 102604 123976 79661 108803 -108380 -90737 -41863 48557
1952 48557 245244 404038 176834 59851 -137949 -400220 -520668 -317157 117416 439628
1942 439628 506352 581112 -19755 -63308 -17080 44845 -276285 -505941 -352371 -257029 -312760
1931 -312760 -284165 -275008 -358651 -331654 -269159 -618805 -473343 -113850 43524 -98007 -280063
1920 -280063 -122113 15289 -61328 3755 31734 14891 366645 294241 78779 261576 290850
1909 290850 -93347 -385717 -149086 152292 183809 290366 451557 482069 147839 95123
1899 95123 -58330 -191014 -261049 -268682 -146762 -78330 -62712 43074 235876 16091 -8929
1888 -8929 120475 201856 180810 24291 -82276 -285692 -148250 89008 -193232 -24293
1878 -24293 -237921 -206377 -48066 230306 268338 309019 114021 236348 197786 61859 -40784
1867 -40784 94845 -20450 37545 168453 -50827 -8452 290920 349171 250737 202480 71380
1856 71380 215178 528666 520007 188733 -29831 -257288 -290259 -242025 -330078 -404463 -431700
1845 -431700 -258079 -94270 9482 406871 178737 122922 195662 83057 -97481 8956
1835 8956 344466 423100 205920 246880 490628 753851 1045279 1056598 840041 677660 628203
1824 628203 771579 552399 340096 324796 440650 372407 -109264 -242712 -169145 -255609
1814 -255609 -200572 -290733 -347489 -519230 -156148 389661 190286 -82933 -46061 10061 -178448
1803 -178448 -142196 -168886 85368 289997 84534 -36541 -36729 -117906 58118 244076 352474
1792 352474 316783 253427 210205 188905 177336 -394864 -358896 -119739 -258872 -295575 -173398
1781 -173398 -62603 166115 -25021 215626 150516 -88556 -92673 -246339 65598 120254
1771 120254 41167 106307 244308 585132 709184 260083 -274724 -245825 152479 353358
1761 353358 314399 382959 186984 45169 185215 564166 391997 81715 195167 490518
1751 490518 165083 -147396 -84287 512792 561261 374727 190628 -169842 -178385 176790
1741 176790 198794 563098 594501 526020 617894 304277 66665 24860 197602 223070 -18449
1730 -18449 -247041 -106445 -74313 -503108 -569489 -609472 -305885 -13130 260532 285610 245041
1719 245041 -46772 9103 45402 47103 186703 7740 85499 70384 192221 90612 -425215
1708 -425215 -494786 -278877 -204126 -98981 -117172 103029 153443 81339 251434 256575 393053
1697 393053 434708 262340 -216433 -378815 -298540 -333803 -267223 -139472 -333924 -734257
1687 -734257 -642147 -186927 48054 59711 89275 -55363 -387644 -622289 -559564 -660079
1677 -660079 -913083 -864595 -633902 -839301 -799653 -531124 -467498 -235845 -246145 -570190
1667 -570190 -619583 -426906 15807 373501 342922 563049 598098 430817 328057 89396
1657 89396 15748 -97032 65009 -394406 -474879 -261059 -364200 -452066 -242756 -55068
1647 -55068 -148484 -221821 -245194 -645809 -615648 -41714 258855 -7721 -1630 350652 85207
1636 85207 -149317 -270892 -508882 -160549 107107 -48045 -321985 -433492 -465445 -346561
1626 -346561 -346193 -34983 72570 90017 176452 30506 -198383 71151 11337 -32776 -329943
1615 -329943 -128921 147909 374046 852770 857516 564070 257942 80240 -120681 -200548
1605 -200548 49015 -125486 -33693 63825 179691 -47388 -229589 -13719 -354452 -506951
1595 -506951 -88726 179942 -74986 -105864 -515916 -562661 -337970 -581708 -631200 -365245
1585 -365245 -184607 -217826 -394544 -306930 -124226 -92615 -110301 -237917 -205073 -173142 -184361
1574 -184361 -227651 -105229 -160415 -44433 150971 -15164 188502 420332 -26241 60472
1564 60472 -33930 124469 406340 396079 266459 419873 103033 32155 -242031 -236404 51774
1553 51774 71415 239727 196517 118207 218730 8211 -30841 136679 154745 503129 541483
1542 541483 387069 340452 116174 243128 353915 137112 -275746 -303438 -550300 -392353
1532 -392353 -539572 -726223 -682444 -732657 -419672 -342418 -404111 -409005 17898 -222976 -523192
1521 -523192 -262012 91385 314751 132738 -85412 146231 228915 17032 -20541 -37667
1511 -37667 -331895 -522259 -396695 253281 383517 142327 -299270 -334727 -463764 -485698
1501 -485698 -296378 -248190 -113293 179798 -215883 -199537 -273711 -484422 -317691 67552
1491 67552 292329 19283 254652 254942 95536 -26546 15188 -213386 -266922 -315576 -144825
1480 -144825 83978 485072 245212 21139 152691 -110288 49581 506817 356054 48519
1470 48519 -517244 -476275 -337453 -263839 -454515 -337007 243709 384050 214233 173584
1460 173584 -75227 -177154 -132378 259551 335325 147706 -46473 54004 111025 137855
1450 137855 2685 56193 43329 -145574 -193092 -387069 -261586 -559329 -785006 -421539
1440 -421539 -313081 -246215 44243 11576 -275657 -219350 44593 339214 362380 55173
1430 55173 30832 408132 542454 443612 620686 249910 -128986 -110343 42937 92664 214245
1419 214245 500073 797175 630602 581236 849775 1007084 923660 831607 898123 844816 350411
1408 350411 176183 436234 338266 170363 196937 242711 337266 560010 625150 281871 197092
1397 197092 504425 510354 -71179 -95075 -25883 -144433 2762 274322 446850 387327 337289
1386 337289 621771 275753 -137900 -93489 363235 176479 200573 494655 707546 632662
1376 632662 215199 -55006 -470762 -326122 -171951 -87623 -23947 37905 -58127 163588
1366 163588 419309 379153 685165 314439 -205615 -363610 -542117 -381439 126547 166644
1356 166644 -309793 -316504 -248760 -370109 -430436 -432141 -437631 -555531 -379553 -535011 -744530
1345 -744530 -447672 -4871 280080 273551 147359 18628 -39620 -6898 77383 58102 -55954
1334 -55954 10190 -124256 -2080 38493 48681 13165 289528 346257 239467 40623 -40724
1323 -40724 197640 182332 39612 205183 339256 315871 181973 -102525 -35566 -82880 -158419
1312 -158419 -313776 -278610 -194333 289929 319980 319557 344610 104181 13042 -32675 11221
1301 11221 92798 -193392 53873 214845 227465 147129 188450 301588 164053 89401 234425
1290 234425 281118 268734 132241 226700 461789 564993 446599 315374 132941 99720
1280 99720 510705 254076 76536 46394 -77692 234035 583081 396634 320822 317199 97375
1269 97375 154903 300678 508181 -10740 -174039 115981 61253 130917 304027 218045 212336
1258 212336 314536 -19878 -76482 351173 364060 518464 405099 187465 375381 473145
1248 473145 -11319 -412723 -474665 -204798 226271 337597 360229 -104103 -68020 -21457
1238 -21457 285267 269307 23176 -222192 -150378 37266 26688 -70275 -66986 -431108 -552912
1227 -552912 -493853 -76724 140273 -60065 60673 674406 731284 530599 565786 659681
1217 659681 643627 530305 560182 560652 360974 151362 296080 720312 720171 497645 723909
1206 723909 419298 -108666 -443224 -320388 -286302 -428103 -335727 236624 342839 171899
1196 171899 410098 557654 731042 201226 235362 447586 279719 198712 242370 462460
1186 462460 136955 -65886 -202942 -164222 -126721 -149508 106786 105199 345901 377669 305639
1175 305639 677007 663513 225461 106795 -49314 287456 480220 169867 28947 -240946
1165 -240946 35541 92115 200057 108405 -43613 -24769 41839 -162661 -268496 -175692 46150
1154 46150 303107 152517 -392995 -599693 -443614 -276825 425079 536287 190835 -62632
1144 -62632 185218 28215 -311647 -282266 -462232 -598465 -409000 -241098 -200847 -207558 -205122
1133 -205122 -163122 135399 64637 109343 233320 364609 181744 298037 122452 -174845
1123 -174845 -116864 -50928 -118731 -249236 -443640 -130807 73141 -42833 -417694 -379820
1113 -379820 -430057 -183912 -121601 -243779 -271362 178277 274964 378231 582119 527652 144466
1102 144466 -285780 -43107 149866 -8871 67398 258522 -88320 69931 385197 501917
1092 501917 588578 -29450 -188911 -258283 -409110 -275230 -128386 244616 255623 -124445
1082 -124445 -304254 -91918 464189 597448 612984 665049 448962 458505 341101 293164 294954
1071 294954 585454 418482 378736 344742 656006 921277 904087 684755 528593 442371
1061 442371 328601 408282 449651 644950 548413 267379 91225 113142 48597 227420 208038
1050 208038 414604 589937 757789 473441 -68198 50834 -49750 -246074 -488941 -633139
1040 -633139 -455545 -264213 61047 30485 208202 285847 116451 34936 -358812 -730236
1030 -730236 -510182 -297517 -279334 -286794 -317488 -249203 -5840 230847 225936 519692 725010
1019 725010 931476 759753 859625 1105458 782445 899244 715774 139249 35070 133900
1009 133900 338655 219620 131878 98339 529949 951953 914821 817082 922171 605979
999 605979 467594 713099 683162 592261 241950 -158174 -382432 -240813 -423178 -451996
989 -451996 -459594 -608889 -896487 -979319 -661103 -119703 251627 -174465 35279 414252
979 414252 685006 734487 335559 279801 211978 115590 149369 63705 29424 109266 -111611
968 -111611 185348 268843 467647 616931 645799 174003 -14389 -103714 -366081 -132798
958 -132798 448367 562154 358529 -122809 -236532 -331904 -75235 -101188 -216816 -404822
948 -404822 -643469 -554337 -409163 -487770 -625117 -674000 -238661 -80050 64209 385180
938 385180 64417 -309634 16548 28483 23939 -363085 -430162 -348150 -143209 -70618 -137310
927 -137310 -384763 -362979 -404393 -671034 -783376 -710750 -78248 378630 297954 82558 292654
916 292654 713251 535080 379251 410284 346471 332285 245671 306204 417328 566816 209509
905 209509 220676 8156 -71376 -148706 -252951 -191025 -234675 -332070 -230279 207379 388469
894 388469 401485 567846 527997 43424 53180 325401 257845 230258 235850 375631 270390
883 270390 -17728 129064 524034 628311 525574 421870 82029 -241250 -132944 37905
873 37905 253025 126090 5866 -231334 -326194 -432703 -433441 -354580 -378864 -189455 186580
862 186580 87758 -355615 -526983 -280769 102738 28494 -7389 3266 74391 129231 -197283
851 -197283 -385760 -312555 226010 271400 -24955 207715 117190 -108487 60866 234739
841 234739 11347 -242531 -74726 129790 346766 489694 318522 26900 26662 245257
831 245257 369996 89854 327363 625331 788348 382406 53988 -12348 190496 -56466
821 -56466 -130951 135066 193491 143261 98841 14647 -76894 -145785 -316677 -52602 -153270
810 -153270 -7840 -57234 311298 528551 7883 -194240 -227691 -151964 -265937 -263199 155082
799 155082 -127782 -63865 -133847 -380590 -343640 78869 407883 441880 677944 631315 475018
788 475018 406160 574150 368525 331612 142493 -270720 -609906 -465974 -60822 84973
778 84973 124224 155972 99431 -173436 81709 110336 234157 164825 -55263 68680 343881
767 343881 54540 -22859 -142071 -273495 -173099 -14687 -73802 -94633 -96893 -199530 -584988
756 -584988 -359527 -101480 22721 -28755 131178 239470 251161 133057 39345 103759 89558
745 89558 339342 624992 524573 117576 -352614 -397558 -127249 176582 137581 159258 293719
734 293719 117462 35069 308430 290841 373805 458357 361225 28778 38311 260598 219164
723 219164 434315 617100 328184 -48649 -185725 -83757 -218349 -283524 -218712 -120375
713 -120375 -148898 150236 105460 115706 -210602 -287277 -29880 333815 62423 -421597 -666627
702 -666627 -88568 247887 638646 689873 438852 82209 -209595 -465943 -369395 13526
692 13526 -22754 -40160 83568 24737 214846 382527 627414 915506 981239 452992 196109
681 196109 281530 24584 -91882 161800 202945 482020 325872 314856 419474 226123
671 226123 78701 320554 292287 292836 128488 -248444 -223432 121090 81233 192508 225487
660 225487 196478 149130 323713 454772 331170 163501 -169469 -282813 -291152 -237367 -312054
649 -312054 -62737 -151273 -169910 -102862 281750 486121 158135 -56624 72813 101381 156550
638 156550 445273 338364 202387 -125272 -149736 321456 25273 -565059 -902957 -845766
628 -845766 -395028 243169 519376 561691 280170 111470 89514 174491 -35476 -78044 -239431
617 -239431 -289274 -78172 -48982 -278923 -115673 219845 298876 233225 -8225 -232972 -5174
606 -5174 253549 -96414 -185489 -232708 29729 -62756 -151174 55174 -88595 -188024 -270148
595 -270148 -246752 -428281 -256316 -218943 -70126 -186 110041 301712 485710 705314
585 705314 1172279 829674 116363 126697 77408 125753 -195667 -277264 -13376 90221 -7873
574 -7873 -479776 -520779 -429863 -611664 -885554 -934123 -401773 1715 67885 230955 289693
563 289693 388449 446021 81785 148211 222746 160136 100082 270366 166855 154805 468802
552 468802 524369 382851 716136 951100 688360 377921 214082 -208133 -445733 -644295
542 -644295 -265255 5558 -48686 -125661 -139978 -129257 -41242 525282 883744 947350 736637
531 736637 578712 167803 2697 78813 -103265 -357914 -395600 -228425 -297768 -344127 -182762
520 -182762 64558 359230 600559 380879 84811 -171157 -112967 155006 270776 -110820
510 -110820 3001 -269049 -68468 277836 121645 -58441 -98160 -68910 -169386 196039
500 196039 423508 292847 136031 148187 290579 311646 473684 122122 -61839 69340
490 69340 -155148 -408308 -198462 -249841 -193287 -153948 11442 -134049 -262119 -336686 13336
479 13336 91667 133911 -58901 -206331 -98370 139965 403184 466247 191946 1628 126747
468 126747 239538 99966 378709 134816 -237107 -262461 -295673 -488483 -697609 -954431
458 -954431 -440042 -145254 -269136 -200733 -78104 -36887 247822 473805 359852 140010
448 140010 250797 133462 154489 386688 218018 107878 193913 212432 314994 391302 696185
437 696185 544806 728358 852960 676775 425414 165763 388807 70602 187240 126488
427 126488 -258179 -47812 -21946 -124674 -125114 -95411 5794 -141958 -202770 -280799 -187670
416 -187670 -79797 -166510 -152042 -100558 44180 119141 90095 11167 -9716 150828 244078
405 244078 175997 513299 595413 770539 475446 404 281458 178462 -306226 -64393
395 -64393 350662 382248 390992 483242 285179 269823 -113659 -185619 22276 -62694 -213071
384 -213071 -272483 93204 393184 111333 -17506 180664 254513 93089 -21263 -250418
374 -250418 -130789 -184931 -251082 -86486 -10014 -123933 -156267 -351163 -74950 179650 748544
363 748544 897225 530112 455916 126729 223987 -66927 -247335 -117446 97100 173845
353 173845 15419 261586 753682 902407 574245 362078 287040 217726 118316 -3455
343 -3455 259732 111237 130413 536959 722259 607147 20499 -229537 -147082 -181233 -101193
332 -101193 -174999 -108591 -303481 -671069 -430895 125877 552145 292147 12490 85792
322 85792 91305 82317 -46760 62310 75046 -280809 -337305 -235295 -98582 96791 150160
311 150160 390325 509451 810733 737829 610799 565648 416195 387957 66323 -355565
301 -355565 -216502 27327 118874 392619 416876 404552 498742 245588 28603 -222728 -187739
290 -187739 -303997 -344441 -220660 171486 287979 114089 22269 72844 248089 291878 288522
279 288522 456356 649310 344547 156240 239405 290988 128010 58328 71196 120804 -20882
268 -20882 -271519 -480968 -197698 243097 174445 35426 -94485 -256410 79605 639608
258 639608 706074 517726 395050 284215 435182 304082 384140 121825 -162112 -270250
248 -270250 -133871 202583 307157 435763 459131 366756 257980 172560 134170 -193072 -365958
237 -365958 149969 418233 231305 320390 542449 699715 679455 352012 -89051 -78362
227 -78362 -172343 -294034 -307723 -509917 -591208 -303867 -144901 -339916 -420550 -179346 -338538
216 -338538 -296485 -431361 -487378 -296587 -158268 -44480 383556 583165 382091 -50290
206 -50290 -282993 -419743 -151570 89006 210306 30109 105803 15251 -4563 -19254 100319
195 100319 136564 4041 -44262 -23108 14384 -156859 -69573 51602 14962 -236886 -349970
184 -349970 -324225 -141379 113712 222310 424657 416253 91425 -17376 -110532 -166287 -377279
173 -377279 -172440 -3145 -275295 -135074 99161 26530 136891 116128 177361 81922 304646
162 304646 434956 343563 426769 403546 286330 243105 233078 323475 129340 65032 67555
151 67555 378218 464146 427282 414204 472197 373852 400094 336900 81167 -94557 -69829
140 -69829 205831 367871 282944 167980 364619 472254 285498 -21202 -57131 67859
130 67859 319777 444810 244897 54620 189286 53513 -31450 45120 134283 332379 434302
119 434302 372283 316294 110291 1099 -73887 -411218 -335845 -137599 94657 182775 31040
108 31040 -51705 -252498 -199582 -166463 23390 15506 87058 50751 -244062 -313247 -269936 -127088
96 -127088 -57091 4538 171668 210641 8243 -116141 71594 347170 116379 48365 19078
85 19078 18806 45250 -259965 -363859 -19819 450252 453677 398783 349701 162396 -25179 -74107
73 -74107 -185336 -92160 129825 20991 275333 408122 609486 452371 177577 399348
63 399348 576655 454236 508288 563441 507773 510751 422498 275160 26161 -70075 -111668
52 -111668 -53781 67760 -130338 65174 362838 334205 234358 169754 181216 274425 282624
41 282624 228728 252757 8739 -205250 -184930 -109057 -3735 214732 295325 34405 107526
30 107526 161904 38335 -28799 -152684 40971 32565 12009 195620 431738 318015 66788
19 66788 119724 213257 66592 -15854 -105495 2783 283089 661989 373697 19462 47505
8 47505 -13625 34424 74678 117388 64842 -45976 -131443 -161044
0 -161044
$$ Imaginary data points
##PAGE= N=2
##DATA TABLE= (X++(I..I)), XYDATA
32767 550674 820987 673573 553200 467321 397840 407906 285097 280797 377093 615565 628552
32756 628552 610455 521299 486174 488494 423738 467948 476281 244606 62908 167938 250015
$$ [...]
##END NTUPLES=NMR SPECTRUM
##END=
